##TITLE=1H_BAU-J-17AF
 DMSO-d6, 8 sc, 
 17.12.2019
##JCAMPDX= 6.0         $$ Bruker NMR JCAMP-DX V2.0
##DATA TYPE= NMR FID
##DATA CLASS= NTUPLES
##ORIGIN= UXNMR, Bruker Analytische Messtechnik GmbH
##OWNER= root
$$ XWIN-NMR		Version 3.5
$$ Tue Dec 17 16:35:05 2019 Russian Standard Time (UT+4h)  she@DPX200
##.OBSERVE FREQUENCY= 200.1315
##.OBSERVE NUCLEUS= ^1H
##.DELAY= (6, 6)
##.ACQUISITION MODE= SIMULTANEOUS
##.ACQUISITION SCHEME= undefined
##.AVERAGES= 8
##.DIGITISER RES= 18
##SPECTROMETER/DATA SYSTEM= spect
##.PULSE SEQUENCE= zg30
##.SOLVENT NAME= DMSO
##.SHIFT REFERENCE= (INTERNAL, DMSO, 0, 15.7039)
##AUDIT TRAIL= $$ (NUMBER, WHEN, WHO, WHERE, WHAT)
$$ ##TITLE= Audit trail, XWIN-NMR		Version 3.5
$$ ##JCAMPDX= 5.01
$$ ##ORIGIN= Bruker BioSpin GmbH
$$ ##OWNER= she
$$ F:/spectra/data/she/nmr/H-F/1/audita.txt
$$ ##AUDIT TRAIL=  $$ (NUMBER, WHEN, WHO, WHERE, WHAT)
(   1,<2019-12-17 16:33:54.35 +0400>,<she>,<DPX200>,
      <created by zg, POWCHK disabled, PULCHK disabled
       configuration hash MD5:
       00 E9 B6 7A A2 85 ED C7 34 08 36 98 17 FE 4E 26
       data hash MD5: 16K
       72 34 5A 46 E2 93 F5 FF EC B8 CA A4 39 A5 A6 70>)
$$ ##END=
$$ 
$$ hash MD5
$$ 54 AA 52 A3 6E F6 F1 13 16 1A FC 34 67 68 36 E8
##$RELAX= 
##$RELAX= 
##$RELAX= 
##$RELAX= 
##$RELAX= 
##$RELAX= 
$$ Bruker specific parameters
$$ --------------------------
##$DU= <F:/spectra>
##$EXPNO= 1
##$NAME= <H-F>
##$PROCNO= 1
##$TYPE= <nmr>
##$USER= <she>
##$AMP= (0..31)
100 100 100 100 100 100 100 100 100 100 100 100 100 100 100 100 100 100 
100 100 100 100 100 100 100 100 100 100 100 100 100 100 
##$AQSEQ= 0
##$AQ_mod= 1
##$AUNM= <au_zg>
##$AUTOPOS= <>
##$BF1= 200.13
##$BF2= 200.13
##$BF3= 200.13
##$BF4= 200.13
##$BF5= 200.13
##$BF6= 200.13
##$BF7= 200.13
##$BF8= 200.13
##$BYTORDA= 1
##$CFDGTYP= 0
##$CFRGTYP= 5
##$CHEMSTR= <none>
##$CNST= (0..31)
1 1 145 1 1 1 1 1 1 1 1 1 1 1 1 1 1 1 1 1 1 1 1 1 1 1 1 1 1 1 1 1 
##$CPDPRG= <>
##$CPDPRG1= <>
##$CPDPRG2= <>
##$CPDPRG3= <>
##$CPDPRG4= <mlev>
##$CPDPRG5= <mlev>
##$CPDPRG6= <mlev>
##$CPDPRG7= <mlev>
##$CPDPRG8= <mlev>
##$CPDPRGB= <>
##$CPDPRGT= <>
##$D= (0..31)
0 1.2 0 0 0 0 0 0 0 0.06 0 0.03 0 0 0 0 0.0002 0 0 0 0 0 0 0 0 0 0 0 0 
0 0 0 
##$DATE= 1576586033
##$DBL= (0..7)
120 120 120 120 120 120 120 120 
##$DBP= (0..7)
150 150 150 150 150 150 150 150 
##$DBP07= 0
##$DBPNAM0= <>
##$DBPNAM1= <>
##$DBPNAM2= <>
##$DBPNAM3= <>
##$DBPNAM4= <>
##$DBPNAM5= <>
##$DBPNAM6= <>
##$DBPNAM7= <>
##$DBPOAL= (0..7)
0.5 0.5 0.5 0.5 0.5 0.5 0.5 0.5 
##$DBPOFFS= (0..7)
0 0 0 0 0 0 0 0 
##$DE= 6
##$DECBNUC= <off>
##$DECIM= 24
##$DECNUC= <off>
##$DECSTAT= 4
##$DIGMOD= 1
##$DIGTYP= 9
##$DL= (0..7)
0 120 120 120 120 120 120 120 
##$DP= (0..7)
150 150 150 150 150 150 150 150 
##$DP07= 0
##$DPNAME0= <>
##$DPNAME1= <>
##$DPNAME2= <>
##$DPNAME3= <>
##$DPNAME4= <>
##$DPNAME5= <>
##$DPNAME6= <>
##$DPNAME7= <>
##$DPOAL= (0..7)
0.5 0.5 0.5 0.5 0.5 0.5 0.5 0.5 
##$DPOFFS= (0..7)
0 0 0 0 0 0 0 0 
##$DQDMODE= 0
##$DR= 18
##$DS= 0
##$DSLIST= <SSSSSSSSSSSSSSS>
$$ [...]
##$SUBNAM2= <"">
##$SUBNAM3= <"">
##$SUBNAM4= <"">
##$SUBNAM5= <"">
##$SUBNAM6= <"">
##$SUBNAM7= <"">
##$SUBNAM8= <"">
##$SUBNAM9= <"">
##$SW= 24.9337058887773
##$SWIBOX= (0..15)
0 0 2 0 0 0 0 0 0 0 0 0 0 0 0 0 
##$SW_h= 4990.01996007984
##$TD= 16384
##$TD0= 1
##$TE= 0
##$TE2= 300
##$TE3= 300
##$TEG= 300
##$TL= (0..7)
0 120 120 120 120 120 120 120 
##$TP= (0..7)
150 150 150 150 150 150 150 150 
##$TP07= 0
##$TPNAME0= <>
##$TPNAME1= <>
##$TPNAME2= <>
##$TPNAME3= <>
##$TPNAME4= <>
##$TPNAME5= <>
##$TPNAME6= <>
##$TPNAME7= <>
##$TPOAL= (0..7)
0.5 0.5 0.5 0.5 0.5 0.5 0.5 0.5 
##$TPOFFS= (0..7)
0 0 0 0 0 0 0 0 
##$TUNHIN= 0
##$TUNHOUT= 0
##$TUNXOUT= 0
##$USERA1= <user>
##$USERA2= <user>
##$USERA3= <user>
##$USERA4= <user>
##$USERA5= <user>
##$V9= 5
##$VALIST= <valist>
##$VCLIST= <CCCCCCCCCCCCCCC>
##$VD= 0
##$VDLIST= <DDDDDDDDDDDDDDD>
##$VPLIST= <PPPPPPPPPPPPPPP>
##$VTLIST= <TTTTTTTTTTTTTTT>
##$WBST= 1024
##$WBSW= 4
##$XGAIN= (0..3)
0 0 0 0 
##$XL= 0
##$YL= 0
##$YMAX_a= 213064
##$YMIN_a= -170677
##$ZGOPTNS= <>
##$ZL1= 120
##$ZL2= 120
##$ZL3= 120
##$ZL4= 120
##$ABSF1= 10
##$ABSF2= 0
##$ABSG= 5
##$ABSL= 3
##$ALPHA= 0
##$AQORDER= 0
##$ASSFAC= 0
##$ASSFACI= 0
##$ASSFACX= 0
##$ASSWID= 0
##$AUNMP= <proc_1d>
##$AZFE= 0.1
##$AZFW= 0.1
##$BCFW= 1
##$BC_mod= 2
##$BYTORDP= 1
##$COROFFS= 0
##$CY= 11.3945322036743
##$DATMOD= 1
##$DC= 2
##$DFILT= <>
##$DTYPP= 0
##$F1P= 16.9975609425685
##$F2P= -3.02152046262296
##$FCOR= 0.5
##$FTSIZE= 0
##$FT_mod= 4
##$GAMMA= 1
##$GB= 0.15
##$INTBC= 1
##$INTSCL= 1
##$ISEN= 128
##$LB= 0.24
##$LEV0= 0
##$LPBIN= 0
##$MAXI= 10000
##$MC2= 0
##$MEAN= 0
##$ME_mod= 0
##$MI= 1.114404
##$NCOEF= 0
##$NC_proc= 0
##$NLEV= 6
##$NOISF1= 3.799351
##$NOISF2= 2.8
##$NSP= 1
##$NTH_PI= 0
##$NZP= 0
##$OFFSET= 15.70392
##$PC= 1
##$PHC0= -9805.751
##$PHC1= 38.40081
##$PH_mod= 1
##$PKNL= yes
##$PPARMOD= 0
##$PSCAL= 0
##$PSIGN= 0
##$REVERSE= no
##$SF= 200.130013532006
##$SI= 16384
##$SIGF1= 3
##$SIGF2= 2
##$SINO= 400
##$SIOLD= 16384
##$SREGLST= <1H.CDCl3>
##$SSB= 0
##$STSI= 0
##$STSR= 0
##$SW_p= 3612.71676300578
##$SYMM= 0
##$S_DEV= 0
##$TDeff= 0
##$TDoff= 0
##$TI= <>
##$TILT= no
##$TM1= 0
##$TM2= 0
##$TOPLEV= 0
##$USERP1= <user>
##$USERP2= <user>
##$USERP3= <user>
##$USERP4= <user>
##$USERP5= <user>
##$WDW= 1
##$XDIM= 8192
##$YMAX_p= 0
##$YMIN_p= 0
$$ End of Bruker specific parameters
$$ ---------------------------------
##NTUPLES= NMR FID
##VAR_NAME=  TIME,          FID/REAL,        FID/IMAG
##SYMBOL=    X,             R,               I
##VAR_TYPE=  INDEPENDENT,   DEPENDENT,       DEPENDENT
##VAR_FORM=  AFFN,          ASDF,            ASDF
##VAR_DIM=   8192,          8192,            8192
##UNITS=     SECONDS,       ARBITRARY UNITS, ARBITRARY UNITS
##FACTOR=    0.0002004,     1,               1
##FIRST=     0,             0,               0
##LAST=      1.6414764,     0,               0
##MIN=       0,             -170677,         0
##MAX=       1.6414764,     213064,          0
$$ Real data points
##PAGE= N=1
##DATA TABLE= (X++(R..R)), XYDATA
$$ [...]
1933c2j35N20j94k81O3K82p4l54j97M92j57j01K06l6j05k4K84K40m08l39O03L4
1955B87L0m40K21K26l50j21K27K31m25J75R5J25l06j92M70O3o15P1K37K8m35k08
1977f06O95k57J94n1M31k36k75o4O83m24m80O38J18k80m60K93N8p0l81K70O45
1998D41o43p8L7M63j2l96J85J70l09k03N68K90o84j87N73P4j66l25J37L47l54
2019g2j89J84K53p34J23M63J53m41J93N02j4m88q2L86k8o87N16R5Q0l58L96j6
2041B35k12j35M44m5n63l28N75P7j70j24K86J84l3j81j05M19m52L16J47J16n47
2062i6q3P37j80p24J27K44M03n13j74M32N9l57j17J38K19m32N17O9l22o08Q72
2083B11M72p96K0l28P74j44m27l6M43j88o1J41k9j92n70R63J7n12J21K0L29o05
$$ y = [-32, -167, 353, 159, -122, -59, 223, 149, -205, -402, 90, -67, -168, 38, 2, -103, -127, 157, 397, -11, -350, 253, 287, 317, -123, 98, 324, -26, -147, 80, 311, -114, 61, 156, 281, -25, -217, 253, 316, -299, -228, 9, 37, -398, -606, 89, -168, 26, -25, 406, 170, -105, -169, 514, 90, -390, 248, 366, 86, -374, -81, -23, -93, -474, -204, 441, -202, -280, -243, 220, 208, -188, -3, 167, -142, -345, 223, 513, -171, -358, 215, 289, 123, -202, -65, 282, -72, -261, -77, 176, -558, -435, 28, 181, -260, -67, 435, 421, -67, -149, 237, 209, -478, 38, 133, 213, -145, 251, 235, 23, -112, 332, 287, -276, -604, -29, 48, -122, -246, 40, 224, 191, 10, -95, 324, -128, 188, 335, 451, -96, -179, 558, 378, -346, -219, 25, 428, -85, -259, 173, 232, -125, -242, -104, 115, -317, 200, 269, -53, -661, 211, 683, -113, -93, -421, 353, 209, -218, -254, 189, 1, -60, 81, 52, -140, -710, 253, 270, -242, -121, -101, 228, -377]
2105c77R3L98J51l72k26L33k01N0J42K42l4k78P0J56j51j02r8L75K45n54k14M58
2127A06J81n27O5r4N55p05N10J18l98p0J30M63m03l79L88K89Q7j99M3k67J83n04
2149d28N18O5k73q2O50j27l88k80N71K77p21J93j64M69m01P2K52j68j06J20J05
2170A54o2l41K11L15k19m62K23L45L00q46J76L52K52m81J95N8k49P2K31k08j55
2191a39k04L73P5J72n82K16K41K5j87J12j24m7J50k52J66q1J43k56L77l49Q8N4
2213b9K4l63L96o8j03K81l62L45j2l31K85L42l05m82L36K87K2m35n1M11K4j56
2235E6j12J25o9KJ78Q3l97k7J20M71m45k92M32M53o19M0j63K91k8n2j03J60l8
2258F6P9K24m37j52L68J2J45o58J34L02J92k75J3l02O70j79n3k09l8O7Q0J60j97
$$ y = [-377, -284, 114, 265, -107, -333, 0, -201, -151, -9, 233, 199, -79, -9, 147, -4, -106, -204, 171, 416, -138, -352, 106, 287, -240, -175, -269, 286, -419, 91, 209, -189, -259, -129, 334, -69, -448, -60, 229, 316, 117, 160, -107, 76, -428, 90, 155, -118, -200, 450, 323, -65, -345, 226, 503, -218, -25, -189, 280, -121, -49, 203, 35, -71, 49, 154, 92, -249, -38, 277, 58, -404, -181, 164, 464, -382, -206, 146, 398, -83, 112, 170, -79, -7, 224, 16, -139, -343, 30, 105, 277, -305, -89, 152, 177, -10, 102, -22, -69, 81, -171, -5, -86, 57, -199, 178, -171, -83, -29, -5, -368, 28, -40, -143, 138, -224, 121, 109, -222, 63, 405, 100, -382, -46, 241, 263, -172, -223, 188, 212, 56, -56, 69, 0, 2, 180, 263, -134, -161, -41, 430, -15, -307, 125, 578, -41, -1, -164, 127, 99, 47, -56, 104, 66, 145, 369, -68, -220, 148, 160, 305, -353, -219, 83, 275, 0, 13, -289, 381, 202, 149, -60, -98, -31, 49, 209, 12]
2281A2k07J92M03m30R5l44M19l37K77j64j98L34j01L0N5l05J65O4P8j34q6K42
2303F0J15j1j09l1q8Q7k64PJ69J78j82K90m08k06K41K62J30l96Q9j11K45K79l04
2326D2k5j65J3L43k85jK73k8k39J66m19L76J69l3l42K3M7N45l19k63j93J80J91
2349E6K61m13J06P9P3J10k46m31L70J41k1M9k89NK26K39j92n2j84J77J03K2m58
2372b69J82M52R6o02j86M97O7j86K42p08N06J26J90k25o50L20P3K93p4k90K8L62
2394B44k23J38m56K18K6M64n36kl02M72R2j59l93K05P70l24l38L3J51J63m76P
2416b26K73k20L86J83k39l93K32m6M39q1m70M1J30K44m6j63l81M61J03j62m48
2437c83N6O09j19j44k32L02n0J23l81j04N3L62j7r7K1k89K25M6j20j28J7K23L68
$$ y = [12, -195, -3, 400, -30, 65, -279, 140, -197, 80, -84, -282, 52, -49, -19, 36, -269, -104, -40, 38, -96, -182, 60, 175, 164, 55, 24, -64, 23, -241, -234, -65, 113, -69, 221, -187, -393, -152, 110, 240, -156, -67, -178, 67, 346, 42, 17, -148, -135, 208, -77, -78, 195, 167, -72, 94, -325, 51, 220, 187, -155, -132, -85, 460, 141, -122, -315, -135, 56, 317, -96, 10, 89, 162, 272, 26, -405, -35, 106, 85, 134, -155, -150, 76, 315, 123, 71, -113, 64, 167, 189, -269, -87, 365, 461, -141, -327, 170, 237, 51, 293, -415, 91, 217, 407, 182, -468, -148, -75, 218, 144, -146, -118, 244, 21, 159, -297, -79, -53, 411, -125, -127, -429, 43, 135, -24, -417, -212, 558, 234, -104, -71, 80, 243, -233, -226, 47, -173, 213, 396, 157, -236, -4, -50, 389, 308, -162, -121, 9, 253, 207, 44, -337, 124, 227, 65, -383, -327, 282, 163, 19, -213, 89, 39, 162, -219, -323, -270, 92, 75, -22, -1, -290, -65, -19, -139, -267, -250, -27, 341]
2460C41j90m34K99K11Rl32j62J12N10j08m00j2P5l22P65l34l29K90j32K37J03
2481A97k63M0N13k78k39j97J87r8L82m01R2j81J28P18o14j99J45J36R0J92m16
2502f6k09L86J26m92M46m44J52M21j34m62L6R8O74l09n66J69NK72q6k43J53L80
2524C07j20k65q1m7N8M07P8o64k76N62N18q45L19j12L6J03Q7k52K13k50L57K89
2546D22m43j65K74K95j49n24J08K81M26m32k88Q0K8R7J60j19k00J04L35r6j37
2567E7o11M37L42o5o52L15L46l8r9l65L09j81Q5Q2J96k06J82n3j33j88K2J05Q19
2590G06p53l6n3K27o8j53J39m41K25K55J27k34l00m4M37K28k28l65L99K35l32
2611b9Qr7J91o1L38m27r3j10M86J83n07m47N71N13n06ml02N54k62L6j98p1M48
$$ y = [341, 151, -283, 16, 227, 236, -96, -258, -146, 364, 256, -144, -156, -81, -403, 362, 28, -301, -11, -143, 94, 197, -66, -26, 487, 209, -30, -227, -40, -138, 244, -157, -65, -246, -118, 600, -14, -213, -68, 68, 158, 350, -66, -275, 111, 237, -255, 191, -253, -101, 320, 186, -276, -240, -142, 532, 223, -343, -174, -169, 103, 17, -226, -73, 307, 187, -78, -159, -206, -148, 259, 337, -327, -603, -41, 477, -368, -49, -161, -125, -22, 65, -187, 26, -224, 133, 422, -21, -186, 88, 383, 234, -290, -182, 99, 525, 93, -195, -115, -87, 10, 170, 51, -149, -45, 290, 194, 57, -554, -117, 225, 160, -492, -177, 169, 131, 32, -333, -24, -205, -120, -38, 158, -48, 134, 81, -52, -240, -218, -113, 706, -47, -83, -136, 91, 23, -130, 9, -432, -207, 48, 175, -59, -359, -403, 34, 262, 34, -331, 68, 303, -29, -21, -118, 73, 12, 350, -77, -170, -280, 206, 389, -118, -565, 6, 519, 13, 9, -293, 261, -1, 35, -163, -234, 214]
2634B14k13J96o1n11J36N23J59p51l8M98J31j00m01M61l24L30j06r6J1k58M85
2655B85k41J30l15j27R04l71o57Q0L92l6J80j89j69k1J96L55k83k75j90L53K51
2676B52j95j33K3J79k45q9N7Q1J03j22M8o9k15N24J85k06o62M74O02o35P5n36
2698e04M26L18l43k18K94O2k34K14J14j32k31K00N51m49l75K0O44j43o9o88L73
2719a70K71qj13k76K22j85M28j37m10L3N15L97n53n35N40J65k21k46K21j36J42
2740e6L51l64l18K10J26M46j90n06J08L51j1k40k65J84L59j06l67K78k21L02K25
2761B96o4j89j83K55J90m39k5RJ56k7q6l28P71k25J93J81l79m27L73K16k05l02
2783b39k96N20J81k33j43K5N32n4l36k22J83K03kJ68m61J78o0P8J75n01M01J21
$$ y = [214, 1, 197, 136, -375, -239, 284, 443, -308, -346, 152, 283, 183, -218, 243, -81, 249, 143, 47, 58, -200, 285, 44, 174, -141, -268, 636, 265, -392, -312, 80, 44, 224, 35, -134, -155, 41, 396, 113, -162, -352, 1, 252, 57, -76, -53, 126, -119, -208, -151, -70, 33, -89, -41, -110, -325, 199, 384, 178, -484, -10, 592, -43, 32, -504, -78, 240, -103, -321, -27, 35, -199, 15, 129, -3, -234, -34, 517, 68, -307, -287, 357, 214, 145, -543, -170, 101, 93, -20, -296, -74, -259, 169, 32, -378, -345, 170, 567, 14, -521, 19, 184, -37, -283, -62, -198, -56, 295, -69, -387, -177, -51, 395, 205, -301, -193, 158, 147, -93, -358, -174, 185, 79, -288, -10, -231, 71, 296, 232, 43, -140, 115, 305, -134, -159, -150, 6, -21, -107, -435, 336, 111, 304, 485, 106, -321, 52, 268, 63, -239, -535, -15, 166, -67, -210, -185, 347, 293, -43, -265, -82, 121, 119, 287, -174, 4, -56, 22, 197, -304, 97, 218]
2805B18j48O1l83J34K18j73J65pk52J96L5m4j61O3Q9J1l9k02J61K29J03k24j93
2828a43Q4J58o4K98l73j39K51J59j94k97k05N26L57k98k10J85J15J00m11K03r8
2849DK64l03O2r3k59L70M40l47j62l17N12j23O5j57l94N50J05m00K73k41K06K71
2871C26j81k90k3L74k72K43k68J43n0L68j03j85k26J02M24l28l79K5M01Q9k5l26
2893a61j97N73on44j52K40L47K34l18J6j67j7L19q6j82k15L96K49m37k54J73J84
2915eQ8K7k08j62J59J53L05n85j39K58L14k56m5j8j42K65j39O4k8K20J55j98P9
2938A62j71L08K9k72j34r4K56J06K29n54j53N7L37l51K51j51j61N23o9pk37J96
2960A00R2k8l23J06l1L33j1k64k3R6J81o2j94k35J80J22K29l12k22J82K36j96
$$ y = [218, 70, 131, -252, -118, 100, -73, 92, 85, -167, 29, 64, 20, -141, -78, 11, 22, -17, -219, -58, 171, 274, 50, -143, -59, 99, 35, 333, -40, -179, 72, 231, 37, -260, -465, 61, 418, 120, -90, 95, 210, 310, -101, 102, 4, 268, -35, 27, -66, -325, 45, 485, 138, -24, -341, 171, 48, 113, -44, -438, 112, 217, -183, 90, -151, 55, 326, 145, -145, -168, 206, -66, 177, -91, 52, 2, 370, 267, 82, -144, -42, 382, 54, -325, -300, 101, 190, 165, -161, -358, 215, 209, -335, -487, -247, 100, 334, 16, 32, -135, -152, 167, 81, -101, -316, 80, 329, -108, -362, -189, -5, 83, 110, -98, -260, -101, 52, 357, -228, -367, -109, 205, -51, -96, -114, -256, 9, -130, -66, -94, 126, 281, 83, 162, -9, 299, 328, 56, -78, -172, 84, 190, 419, -135, -288, -231, 106, -245, 6, -145, -306, 217, 148, 141, -96, 100, 192, 164, -159, -53, -84, 249, 238, -26, -49, 47, 228, 166, -28, -263, -83, 39, 268, -44, -266, -84, 152, -44]
2982d4K12l82M93j31k8Q8m55K24O82l42m92J45L57q1K23l13m04P4M06k19j21p4
3004a82k7L79j29K19k95q8L80j89q0o7n2J74J70j61n4L9J00K4j52n79M58k95O52
3027B45n56QM0M61q8j92Po4K83k00p6m4K78l3J78j92j90J32p4J10O3k84J39J43
3051I4J32m76r0R5M69o3k74K13n3q1K05k17q7l50P28Jr9k55m8M58j93mm04J99
3075a00N7P6k16J59j85J71J53Q6j84j85J18j96N33q92O56J72q4k10n20P30q9M3
3097I3j35K04j6k00J31rj13j64L50p6j11l49R7J7L91k03J0L3J15J9j63m4K96k88
3121a15M10j85j94j2L65j89k06r6J57M8k1j21J3K68Q2K4j39j01J12j8l6K22l38
3144g0J57k15K43j67j36J86J18K2k93P9j06L82l56J25j68m3Q2N09m40o5P9K44
$$ y = [-44, 168, -214, 279, 148, 120, 208, -247, -23, 659, 317, -175, -30, 327, 246, 469, 156, -248, -174, 232, 13, -108, -182, -209, 170, 41, 260, -35, -123, 257, 68, -12, -79, -131, 43, 213, 52, -2, 37, 137, 161, 9, -570, -112, -407, 245, -311, -303, -263, 198, 110, -82, -75, -139, 144, -56, -132, -176, 102, 69, 247, 55, -135, -3, -77, 33, 96, -188, -49, 94, 226, -250, -340, -245, 224, 161, -113, 100, 47, -34, 171, -46, -133, -483, 245, 246, 147, -108, -156, 302, 109, 105, -299, -100, -43, 33, -183, -24, -209, -38, 115, 201, 17, -168, -50, -246, 287, -605, 51, 223, 139, -71, -591, 139, 50, 93, -42, 162, 146, -54, 77, 68, -45, -209, 141, 65, -46, -395, -298, -281, 110, -93, -83, -50, 65, 84, -79, -123, 173, -115, 295, 110, -84, -96, 269, 80, -126, -222, -65, -17, -38, -159, -146, 122, 204, 228, 89, -12, 100, 82, 46, 268, -70, 87, -128, 115, -52, -188, -2, 116, 138, -155, -76, -182, 200, -156, -31, -199, -242, -160, 349, -91, -156, -77, 167]
3166A67k57J2n5j27K51k29K53j41m7N8K96l71J97j03R6j47K42j18L15k56M0k9
3188D7J63j72r5p4K88k43j59L55O8K0l45M64j54n7l61J70M9j97L91k30N4rL6J73
3212A82R9m80k09M08L47j60j94J31p6K45l81K41j18j40J44m3K14j26J5r4j7j78
3234a90%Q0p0o2J77J01j5j87J7k5j99M25M3m9m26K60N3J91m8k14R8K81n2k43j
3259e5P2j86J23j24K08P0k03R3N5L8K1l62M17l04R8o3%M9K0O7m50M94j67L86j38
3284A59m72L38K73j94o1K9J95l72M15k79j85J59K7k26K59J9m63M46J80k18l87
3305c58K83J90p8p5j19K06o5q0K3K03l66J88O2J8m4k06N37l74j23lJ25L32j55
3328A21j42j38J83J20k02M9n1r1j16J76K40m58K99K87m48J6J18k23J07j62K20
$$ y = [167, -90, -78, -133, -260, -9, -238, 15, -126, -173, -115, 181, -190, 7, -96, 0, -147, 95, -23, 292, 36, 76, 47, 210, 38, -57, -131, 157, -86, -245, 110, 178, 198, -147, 317, 163, 106, -255, -85, -36, -233, 158, -72, -18, -27, 9, 182, 281, -199, -408, 0, 347, 187, -7, 124, 48, 293, -88, 153, 35, -105, 39, -4, 210, 84, 99, 5, -12, -190, -190, -110, -180, -242, -65, 36, 21, -166, -149, -174, -373, 52, 95, 46, -380, -120, -67, 124, 76, -138, -40, 241, 189, -54, -55, 17, -169, -46, -170, 38, 108, -95, -2, 53, 91, 112, -250, 167, -137, -39, -102, -102, -53, -33, 34, -416, 78, -89, 297, 159, -313, 25, 298, 104, 43, 72, 267, -105, 310, 31, -154, 5, 32, -194, 65, 84, -379, 67, 247, 29, -358, -75, 115, 37, -38, -157, 49, -16, -96, -73, 130, -236, -48, 14, 32, -12, -218, 319, -55, -178, -181, -56, 276, 121, -21, -159, 24, 144, -58, -9, -60, -151, -267, -91, 149, -309, -10, 277, -171, -155, -37, -260, -153, -315, -95]
3349i5Oj75j67M61m7j45J12J0L78l02q9K44j82j45K01k31J82k91M11j63k6l54
3371d07M05r0J60n9j52N0M34o7n50O5JK3j39L00j07k57O35m29j87M64j82P8Q1
3394G0rj70Q4p9n8O5K23o6l39O73l05k00K29J29k49J94k66K15P6l46K7K01nO6
3418A60k76K41k20M9j11M64k91n0j28J52K5k55L5L88j58l20K23J05P8j35J54n4
3440G6o3J4r5L4J33m31L89J58m08r1J89P3K54k94j11P9n8k6J10j64J13N88l45
3463A24R1n53L48O8j26J66m2K69n26Q6n5J14Rj5j06K15k17Q8j66K47k6P5k81K57
3487D4k73J48n4J88q3RJ24nj67J64J85j36R5k55J4q8r3K42K45q5l58q9K07K33
3511B12o26M72Q3k90L7Q6J23j88J94q1l5j63J39P4J77k79L29r6lp5q7k23R5J26
$$ y = [-95, -89, -264, -431, 30, -17, -162, -50, -40, 338, 36, -53, 191, 9, -136, 65, -166, 16, -275, 136, -27, -53, -407, -2, -92, 68, 9, -143, -93, 341, 274, -276, -211, -210, -187, -326, -26, -133, -390, 245, -184, -371, 93, -89, -11, 70, 61, -109, -25, -104, -162, -97, 126, 60, -279, 394, 89, -111, 118, 247, -2, 192, -74, 141, 217, -129, -102, 99, 94, 160, -116, 125, -95, -46, -157, 307, 16, -34, -162, -10, 15, -240, -205, 183, 25, -295, -72, 33, 111, -24, 130, 76, 13, 27, -68, -34, 99, -332, 57, 215, -193, -284, -95, -22, 232, -62, -173, -94, -152, -178, -68, -232, -119, 469, 124, 215, -338, 10, 78, -48, 118, 76, 345, -181, -95, -150, -36, -27, -42, -148, 67, -150, -62, -228, 19, -7, 68, -213, 44, -229, -81, -135, 53, -30, -21, 103, 98, -69, 95, 280, 144, 239, -16, -2, -90, -183, 59, 304, 219, -139, -228, -21, 212, -414, 58, 141, -149, -112, -26, 97, -91, 103, 22, -13, -176, -37, 37, 214, -65, 264, 168, 165, 90, 3, -220, -125, 1]
3535Ap8J75j24j85M64k45j50j5J27O7O1k14K23j58K49m69L04Q6k24P6j13L6r1
3558a97M00j41j3L34m78O1J57k19M1j2O3J01j29J81J3J62m39P8o9j88J72j0K89
3581A57J8o4k68M1L32n35L13j50J89j4J40k21n9J28K63m53k62N09l79J45k06J87
3603a89J55m7J82q3J52k80K45l46R8J27J13j38j26Q5k1j51K94l26M2J76j67K96
3625I1J58n60L94j33n7L24k83m2M2j81O05k31o4q7k3J07m7K06p8N3j80J5k43M36
3649B22j52k64J16j3k14M57Q2j63O0l54K25J95j19k51J42l01L70M2l1k17J18K2
3671b8rn8o3J32J34k07RK23j4k46J84R5l02R3l8L12k17N7j25P7J14l11J81j77
3695a84J64o0M8J51K1J03rl73lK09N2k42J37r4N6k0L2j24L16j37l00N40l39K73
$$ y = [1, -77, 98, -26, -211, 253, 8, -142, -157, -30, 37, 98, -116, 107, -51, 198, -271, 33, 119, -105, -29, -142, -106, -197, 203, 62, 49, 383, -95, -34, 123, -96, -55, -67, -4, 97, -32, 149, 162, 324, -115, -37, -106, -294, -122, -132, 157, 175, 111, -157, -116, 216, -319, -6, -156, 33, 19, 159, -62, -121, 7, 270, -183, -445, 64, -315, -170, -376, -189, -34, -81, 101, 18, 170, -110, 135, -211, -113, 14, 127, -11, -137, -52, -73, -224, 70, -256, -214, -38, -205, 91, 249, -311, 83, -50, -107, 217, -66, -108, -66, -247, 358, 127, 63, -24, -47, 60, 13, 219, 141, 194, 14, 29, -214, 222, 70, -194, -78, -91, -305, 152, 234, 71, 131, -223, 2, 197, 78, -173, -31, -332, 38, 80, 49, -168, -50, -28, -37, -95, -158, -26, 108, -99, -90, 133, 119, -127, 57, 152, -150, -57, -95, 217, 0, 57, -68, 9, 123, -188, -7, -184, -20, -80, -32, 119, 140, 243, 234, -139, -142, 67, 119, -123, 14, -80, -24, -44, -12, -136, 180, 43, -257, 283, -56, 217]
3719B17k12J58k09J81rJ5k83Q8J29o8ll4M5N2k23J69L4O6O4j39K18l80k8K13o0
3744AP8j31J02Q4j23j44k9J6K90R2l63J33J31j58j15J14J64j42l8k4k18M53j77
3767dm5J65k28L97k63m7Kj06P1J34j78j61N39m19K8l5K03J35k02J33M2j66j83
3790a88L29k56K81j17J57L4m84P13n27j53L96J9R6k43j78K52M2j45r9j91j21R9
3812b84L76m75K76J69r8o9K05r7k58J01M62m54J25r9j91L84o8K01k39K37k89R2
3834Gr5L79n7k39%p1qj02O1J17O9r3pJ5J09j82M4j41P5J62J46k9k04M5j07L97
3860B91m39L63m28K37K2j21J10j48L3k5j33J91J86k31j15J3M13j09q2j04j11N73
3882C86l61k14mJ37K07j39Q1j79L18k10n8R6K12q1l62K73j28j67N9N3O3Nj39K78
$$ y = [217, 5, 163, -46, 135, 126, 141, -142, -54, 75, 7, 4, -30, 15, 67, -156, 13, 47, 113, 177, 38, 256, -124, -152, 61, 1, 79, -52, 50, 134, 11, -133, -162, -146, 144, 236, -127, 6, 137, -21, -136, -22, 142, 0, -38, -62, -280, 173, -4, -49, 116, -112, 285, 22, -25, -23, -129, -58, 76, -102, -263, 276, -143, -115, -150, 53, 188, -14, 119, 161, -5, -188, 141, -115, 166, 49, 206, 240, -244, 469, -58, -211, 185, 204, 300, 57, -121, 131, 173, 28, -71, -262, -383, -284, 92, -383, -107, 62, -36, -105, 100, 3, -255, -154, 308, -146, -21, -120, -311, 73, 5, 206, -33, 204, -85, 7, -88, 291, 234, -5, -5, -76, -84, -186, -125, -8, 61, -32, -39, -24, 85, -97, -53, -194, -119, 43, 189, 160, -44, 1, -106, 291, -148, 215, -213, 24, 46, -75, 35, -113, -80, -105, -238, -47, 139, -92, -207, -194, 219, 110, 28, -76, -187, 386, 25, -189, -193, -56, 151, 12, 93, -86, 232, 22, -36, 60, 272, 191, -171, 102, -26, -193, -134, -81, -18, -13, -152, 126]
3906A26j46L8j05J04L4k22L33p8l16j34M58k82K71r4R6j30K52k82j27M45l64j07
3928b30M44O3m40R7L4q0J5J97j79M24n34K85K6j56J2nj5L8L2J21j09l6l11K72
3952c5J27m9o4K44j87j48J52j70J04K67k56J78J20l03P5J16k66Q1L90j77j31K76
3974C44k52j87O0j30QJ77j27j89K13L68j14j12k02J92k04p7J17qq8O1J79J16R3
3997B38j84m4J90j21k86K92j25Q8k26N0L29j27k10p1L06j60R5k1j6M4M5O5k13
4020f2J1o8K78J78j44j44R3k38q4K22M4J74l22Oq7j6J34K7M70n50o4L29j59K21
4044B49l69K46l25K38j03m94M68K02k79n3L38j79nm2Q6q5q4m7L35j74q0K59J17
4067B19pl03r7L83p1R3K6l9k57o0J98p6r9N6K17j26m2j59RJ42k39J91J11j70J01
$$ y = [126, -20, 18, -87, 17, 51, -171, 162, 84, -232, -366, 92, -190, 81, -13, 83, -47, 205, -77, -204, 241, -123, -230, 214, 277, -163, -66, -32, -112, -97, 100, -79, 345, -189, 96, 122, -34, -22, -27, -42, -4, 28, 149, 40, 4, -307, -35, 92, 43, -21, 223, 36, -112, 40, -130, -26, 241, -15, 163, 283, -20, 55, 171, -95, -14, 376, 199, 68, 344, 92, -95, -35, -165, -157, 20, -107, -296, -83, 285, 171, 59, -143, 49, -155, -232, -115, -123, -211, -150, 29, 145, 238, 54, 10, 200, 79, -207, 85, -40, 48, -178, -128, 201, 74, -136, -207, 99, -61, 34, 13, -3, 41, 86, 151, -62, -51, -119, 159, 337, 193, 49, 142, -96, -180, 42, 86, 260, -62, -56, -143, -159, -25, 2, 472, -78, -142, 187, 28, 249, -120, 126, -199, 39, -64, -558, -90, 112, -167, -220, 118, -61, -66, -108, -22, -107, -191, -238, 97, -77, -157, 102, 219, 212, -91, -188, 195, 124, 217, 243, 204, -53, -113, 85, 9, -90, -34, 183, 57, 15, -144, -135, 7, -232, -41, 70, -100, 1]
4092AJ40l49L87m18R5M45k15K09l63O2j68p1M44m1p8L6K41m01RJ15k47L93j00
4115A26o3k55L36M0k09j50M25j75k29J67l5Rj08J23q2J4L14Q3m56J75j94j22L11
4138D5l07K21r9J23j7J3J4j69J58J47J16M5n27M35k53J60j29J52k08N8l54J38
4160b38J67P3k0K58N6m26K00k75L46k06J36j19q9K47P7j58K9j79J02k09K46J46
4182A64O4o9l65M24k02m6l79K39J23N5l4j09l1K32j0J7l72K50K04k88o7J30K98
4205B28j43k41J45j04K10R8m5p0L9M2j21m64L22J29j9N2J65k55P5J58l44K37m03
4228c09M31k39m9r4K99k41N25l53n6J14j61J19J22o8m15N6K30Rj22L33k1J00N0
4251B60l56r7j02K30Q2j36J28j66K68o5l15L47l30L42j67l8K21r9j85M05j77j16
$$ y = [1, 141, -208, 179, -239, -144, 301, 86, 295, -68, -6, -174, -245, 199, 158, 80, 116, 357, -44, -35, 80, -167, 226, 126, 63, -192, 144, 184, -25, -175, 250, 75, -154, 13, -22, -13, -121, 2, -80, -66, 248, 331, -125, 50, -144, -266, 45, -262, -41, -140, -17, -34, -21, -7, -176, -18, 129, 245, 290, -237, 198, -55, 105, -24, 128, -80, -22, -376, -238, -71, 2, -18, 240, 296, -130, 70, -205, 141, -65, 71, -48, -137, 110, 187, 29, 58, -121, -19, -228, 18, 164, 228, 159, -206, 218, 16, -30, -409, -170, -47, 8, -26, -135, -166, 66, 56, 73, -299, -49, 155, -133, -200, -70, 228, 85, -156, -11, -115, 95, 193, 148, 78, 117, 159, 38, -426, -104, 25, 6, 58, 223, -32, 43, 201, -143, 94, -309, 122, -117, -166, -260, 39, -202, 323, -30, -86, 28, -133, -14, 108, 40, -375, -319, -89, -80, -202, 131, 110, 210, 260, -96, -193, -295, -65, 17, -119, 9, -157, 111, 46, -269, 78, -252, 90, -77, -115, 106, 7, -178, 227, 50, -66]
4273f6jL2q3O6RM8K28n47K16l5J50k8J05j26o0K46r0o6P1j06m5n8M12l21k21J57
4299a13N5R0Po0n7J90j81J2k32L17j00j57K41nP8k81J09RM9j69J33k08J72J85
4323H4J11J97l83m7l8K06j40j7oJ16j1j19K4j11J39L08l92K41l02n6M64j88J64
4346B44k24m2O7j9n4P3j85L71o0l86J97K42p7j96j1p4K68n5j59J03p3k4k21M44
4370A49r9J2jJ2j47m7L00j61J52k26M5R2R6j80K6k10J63P9k56J30r8J72nJ48J
4395A47p2l09J81J36K44j90j79j15k97L27J67M8j44j99K97n1Q1J15P5j5j22K10
4417C35l11L7j55J96j66rq6k0l2M34l58J78k10J07J21Q7n42L27J15n6M54l86k5
4440C5l01M64k5l69J63lr0J85Q4l50K57J04p8l8K68m42K37j63J23k75L80k14J19
$$ y = [-66, -67, -35, -118, -52, -43, 5, 233, -314, -98, -133, 17, -11, 94, -32, -92, 154, 64, -2, 69, -37, -82, -140, 272, -49, -270, -113, -58, 32, 39, -21, -78, 112, -69, -57, -289, 28, -72, -229, 12, 7, 85, -196, -87, -78, -29, -198, -65, -273, -101, 84, 195, 392, 9, -38, -76, 130, -10, -27, -33, 83, 72, -47, -23, -134, 5, 313, -79, 162, -140, -196, 268, 80, 244, 20, -22, 45, 26, -28, 45, -140, 231, 171, -215, -18, 224, 147, -49, -60, -134, 134, 79, -80, 23, -50, -74, -295, 149, 50, 62, 61, 73, -74, -121, 179, 18, 170, -56, -11, 81, 177, -3, 23, -187, -24, 55, -201, -71, -169, 3, -2, 146, 147, 75, -234, -53, 83, 327, 137, -42, -157, -454, -127, 40, 88, -56, -255, 42, -9, 72, 187, 262, 247, 125, 335, 24, 61, -94, 102, -64, -73, -159, -179, -211, 223, -135, 43, -167, -60, 61, 148, -394, -67, 48, -8, 446, 60, 35, -266, 198, 173, -196, -33, -36, -126, 59, 143, -207, 50, 154, 76, 38, 306, -136, 101, -62, 61, -214, 166, -48, 71]
4463G1L44o24M84l67N8k1M74m51O8r3K5k28L48K19l19j79K60K11j69k06K22j67
4485d0Q9J8k74L16k04J24M3n1j45o4K4O3K21l26J97K21k41k47K72p9J41K13k78
4508gk72L15l12L47j70j45K15m4J92k8j6l7J36m90K25L84m85K09J38j18K28k23
4530D2P8j59L32k70k12J93j6L4l76N28j28J42q6o0o7J34k9j09l4m1K16p4O2L4
4554A34k35O5L8j19J50k87M92j25j44j98P20m17l34L06P6j66q8K89P5l28k38N62
4576B28k66mq6J31n5Q3m14K89j91L40J20p8O7m3k80K35l55L27J76l40m0R4N9j20
4600a23J45j05K54j06r7j32J46J65j85J06pJ17j12r3j87K89o5jj69J76j62L60
4622B14l01L32n36K03P2k05L45P6j29k72R7K23k02K3Jj72M62l10J6J72k20J39
$$ y = [71, 415, -209, 275, -92, -34, -55, 419, -32, 36, -57, -32, -260, 88, 307, -12, -191, 69, 280, 111, -95, 127, -40, 49, 67, -207, 109, -95, 29, 72, 21, -124, -188, -164, -101, 120, -206, -9, 212, -29, -276, -4, -83, 58, 271, -7, -279, 36, -276, 71, -99, -244, -29, -73, 119, 91, 75, 38, 174, -316, -91, 293, -192, 17, 155, 37, 265, 42, 120, -39, 293, 23, -189, 4, -12, 22, -354, 174, 46, 188, 102, 42, -25, 109, 80, -29, -63, -104, 112, 38, 100, 134, -101, -36, 2, -117, 33, -254, 238, 113, -31, -229, 491, 74, -260, 46, 122, -44, -132, 157, 232, -96, -334, 228, -38, -42, -128, 3, -52, 31, -383, -94, -285, 55, 175, 97, 164, 121, -159, 76, -279, 48, 224, -116, -156, -62, -3, -123, 22, -83, 171, 65, -32, -164, -18, 147, -38, 68, 61, 178, 66, -27, -214, 75, 10, 9, -160, 16, -146, 214, -87, 245, -291, -88, -16, -221, 124, 200, 71, -201, -104, 119, -83, -60, -59, -231, 231, -79, -63, 109, -111, 28]
4644B8r6Q0Kj88K37l04L34j67J51k9N7k3k36j27M00J48k30J18j75K3l24K36J41
4667E6J12j40k20K72n9J4N0Jm2j97j81O49m94J93k9O2j09j29M41j73k14K16P4
4690A53J1k70j92M53l5j00n3m6J20j57J53J26k2n3q7q7J07N5k56M9J04K12n81
4713c96O59j58l58J13K16k3m8J57j02j92K1M07l67j13K84L2j05j89K17R5M9N1
4735B50k55m9K40k30O6m9k94M31r2J77l82K43K88l14l12K49J33O8k00j06L79j36
4757A05n5l07K15J91l85K68N6j59k32K34Q9j53qL45l68J08K65j02p7j64mk06N67
4780B23j21o1M3J5L2l80J45L96l90n4J13J04J20m18RJ19J22M%j68J50J33q8%J90
4805B38j24k16M6K64n18P1K50P1j78r7M77j94k51K65o5j73l7L38m22K61N2l2k35
$$ y = [28, -68, 12, 14, -174, 63, -241, 93, -74, 77, 48, 105, 82, -154, -281, 119, 267, 37, 155, -20, 3, -321, -85, 56, 168, 28, -192, 80, 21, 35, 85, 86, 44, -153, -334, 315, -179, 14, -15, 47, -62, -191, 250, 77, -137, 79, 153, 164, -106, -298, 155, 120, 20, -33, -79, 41, -116, 37, 163, 141, 88, 1, -86, 21, 76, -180, -131, -27, 185, -396, 263, 105, -253, -140, 76, 53, 5, 162, 60, -132, -111, 296, -71, -184, 100, 132, 27, -162, 55, 150, 199, 250, -5, -54, 186, -44, 22, -27, -321, 110, 18, 195, -187, 56, 344, 30, -282, -33, 100, 168, -32, -138, 241, 105, 50, -257, -42, 149, -236, 32, 88, -71, -303, -69, 20, -133, -141, 204, -164, -56, 209, 107, 30, -134, -138, -344, 223, 102, 41, 84, 99, 131, -249, -104, 292, -98, -152, -39, 65, 185, -233, -224, -105, 17, 21, 21, -147, 3, 136, 48, 48, 238, 114, -102, -56, 208, -310, -239, 11, 82, -96, -193, 284, 90, -161, 104, 39, -134, -171, 167, -255, 6, 58, 26, -209]
4828b09k14K79L11l65j9M38K4q9j46k45Q5K00n16L37K1J51j97N9M8k80L53K69
4850B95k31q7N1j82N8J80L6p0k29L86l06K98L3k54Qp2L80m35K52n5m9k56K57L9
4874D7r8J72j74ojq6K55k05J09K38k94k39L28k90L23o1j44J65k17K20P8k07J70
4897H3M8mj54l45L73j0j31K62j29L9l20R4J4P6J30PJ16J9l20K34K36n08J29jJ35
4922G3j02K5P1j14l22J11K56J03j44M01l21K48j10l02L51j73J18j07K00j45M6
4943A63j62p8j9k02M64l04J47j99Q2K24j08J36J2k26K02j36r4K33k16Q3K44m36
4965a90K58P7j51K25l36l4l8K02l22M96k3j77L05m49NrM25l45K47k60PJ76j02
4988a3j29J3J89l25L01l09O2J73P7j65J94J5k78K21K20j27J5m2R1m65K86K00K5
$$ y = [-209, -423, -144, 167, -198, -217, 221, 245, 156, 10, -235, -150, 50, -466, -129, -108, 43, -154, -95, -47, -327, 26, 295, 64, -23, 28, -154, -96, 84, 120, 50, -179, 207, -99, 199, 232, -22, -14, -86, 294, -141, 111, 56, 7, -249, 8, 47, -51, 121, -53, -59, -60, -146, 109, -96, 13, 251, -43, -282, 46, -244, 79, 18, -126, 39, -178, 42, 120, -87, 83, 131, 127, -27, -372, 1, -9, -140, 122, -7, 32, -288, -194, -180, -104, 26, 33, 149, 168, -152, 82, 318, -190, -61, -62, 73, -29, -4, 67, -47, -369, -258, -2, 101, -43, 358, 37, 285, 175, -127, 224, 51, 169, 62, 262, 117, 163, 1, -77, -96, -298, 166, -138, 9, -190, -108, 116, 8, 144, 156, -70, 132, -4, -98, 135, -81, 2, 246, -190, 68, 145, -6, 219, -117, -151, -189, 13, -309, 187, 164, -13, 292, -157, -152, -161, 264, -81, 166, -94, -87, 89, -13, -142, -129, 60, -265, 36, -273, -211, -38, 39, -126, 68, 83, -195, 26, 246, 119, 134, 92, 183, -282, 4, 204, 229]
5011B29l89r1J10J77j49K85n2j74j2m6o6KL56m75L31k29O0j2J59l4j4N0j03JK77
5036A91n6o4j28K44m20M11m4j62Q4J72n86K32K03N5l04J03j6L80l21k19L09k92
5058b28K79l56K44rJ25l0q9M52k61j82k66K33J20k79J1J85j65L1l2J07l53N45
5080H2l11J72L2J21J10l74o3J34J84k76L7L22k84K22j64k8K07m4j6N9l2N1k23
5103h2J69j15j17J01L42l30n4L52j86K74o32K27J68j48K14k07l25L02j96O12j51
5124B18j88O4l1K16k57L2m16J92J07J14j03k08L23K0k24K19kj44J72l6K15j84
5146I9p7j11J16j97J33M9K12k34N3q1j25J85M0j8K8o7k35N87k9k62l4K47m68J31
5170e8J22J01j24q1p4J60l3q6j18M05l59nK46j28J29J0j40N5P6l7L4K7j58N3k84
$$ y = [229, -160, -251, -141, 36, -113, 172, 120, -54, -66, -112, -178, -176, 180, -295, 36, -193, -133, -145, 14, -20, -34, 16, -87, -86, 191, 135, 71, -57, 187, -233, 178, 134, -28, 56, 228, -358, -126, 77, 132, -172, -69, -85, 295, -26, -245, 64, -228, 51, -305, -61, -70, 55, 25, -64, 388, 127, -55, -321, -88, 32, -247, -236, -51, -216, -185, -217, -110, -463, 82, -229, -57, -25, 96, 206, -168, -231, -97, 87, -189, -152, 170, -114, 108, -56, -84, 123, 79, 63, 122, 90, 141, -82, 87, -28, -145, -44, 298, -32, -86, 266, 80, 354, -278, -51, 117, -31, 183, -24, -349, -47, -243, 369, 218, 30, 94, 63, 279, 22, 54, -362, -170, -63, 51, -52, -260, 63, 83, -141, 78, 76, -68, 104, 68, 283, 99, 22, -89, 27, -170, -37, 12, 224, -10, 43, -38, -163, 22, 62, 44, 72, 5, -230, 357, 328, 66, 32, 279, -189, -58, 64, 165, 41, -40, -114, 46, 13, -73, -191, 214, -145, -150, 96, -32, 97, 107, -33, 22, 98, 61, 95, 122, -36, 17, -267]
5195b67K47J11qk38J70k40L16J50Nj54k21J42n1Q6n2j80K95r7j75L09k71J87o7
5218clk27L51J64j46k37L05k83L34l32m5P5n6P1O3J07j25Lk42L11j46K68k63o
5242f2J19O4l04J77j23n9J33m4L19k70O1j0J11p2q5j84J70J80m29K23L14O6k25
5265G0j69o8L17k01r7K74l38J98P2j00J57j42K34J36m07K15m30Q8L91O8j92p0
5287FK94n86J68q1k8M41j59J88o0k23J69j46R2Q7J50l15k24M29l4J61n14J29J34
5310G8J3J01l15n6R0n4J99j50J6J36p5k76O26m61J96K9j98j92M08R4k04P9k43
5333a59K20K92l95o5L0o1K73j33K68k2l63L16l85J65J52J29m3k97J60j32pq9L72
5356B26l99Q1J14k30K62n1j09K78m39J0L31k5j11L40l59K17k37J42L0j21r1J95
$$ y = [-267, -20, 91, 83, -155, 15, -225, 91, 241, 246, 92, -129, 13, -38, 48, -4, -184, 111, 14, -161, 148, -123, 64, -3, -6, -233, 118, 282, 136, -101, 204, -79, 255, -77, -122, -47, -103, -32, 31, 138, 13, 16, -226, 85, -61, 207, -56, -62, 57, 121, -183, -6, -129, -188, -55, -99, 220, -50, 11, 1, 112, 40, -45, -229, -59, 121, -308, -85, 229, 295, 70, -99, -167, 150, -51, -148, 126, -212, -14, 58, -42, 115, -27, 207, 343, -64, 151, -279, -191, 200, 268, 76, 6, 300, -286, -118, -199, -227, 214, 55, 243, 183, -40, 129, -17, 75, 162, 312, -3, -227, 202, 168, 329, -185, -56, 78, 91, 192, -123, -179, -89, -143, 56, -94, -78, 58, -17, -293, 333, -128, 68, 97, -101, -293, 115, 209, 5, 84, -159, 61, 353, -42, -107, -77, -138, 135, 2, 270, 248, -115, 201, -184, -19, 133, 262, 219, -78, 82, -50, -57, -146, 226, -173, -92, 22, -208, 54, 3, -106, 172, -267, -257, 74, 49, -62, 278, -81, 136, -101, 41, 71, -50, -141, 54]
5378E4J97l36r4p7J68J41k20L10j78L28k78j35J0N0p8K26q7J81k77M7J71m7j81
5401a05j80L34J18k78K41j14J34k67M43k85p4K16j51LJj23j21M55k74l01M56j36
5423hr5K22p0j06J17k49N3K1L42k89l37K69R2K40L3m17K61l45K61J93l69K05k0
5446DK41l76K51k01L71j05q6l62J99J36k23M33j01r4j95N3j47N12k01P5k32j13
5468a61K34K1k22K04j55M90l36J36k20OO8j00Jj23L88l06N5m3K33l25L88m07K51
5491G7r5q9n2j16K61l35M00l9L67l45l09N61j06l39L31j83p4ml3k49L11J10KM2
5515I4q7J27K1Jl53L62k21J45K68l27K12j50ok10J78j19J50k16K35k41K10K17
5537B90m49K32J17j21j45K6K12k67p8L16o2J04j96k9R1N0k68J42q7J22r5j57N09
$$ y = [54, 251, -85, -179, -256, -88, 53, -167, 143, -35, 293, 15, -120, -110, -60, -138, 88, 1, 182, -95, -48, 123, 76, -105, -285, 49, 167, -111, 130, 16, 150, -117, 326, 41, -33, 183, 32, 35, 36, -87, -208, 247, -27, -328, 128, -8, -103, 119, 49, -57, 60, -189, -136, -115, 227, -62, -399, -130, -38, 202, 235, -182, 79, -266, -5, 188, -181, 24, 4, 245, -131, 120, -81, 290, 185, 99, -263, -64, 72, -151, 282, 181, 87, -108, -55, -202, 310, 109, 184, -48, -161, 73, 94, -128, 76, -79, 411, 75, 211, -9, -3, 65, -35, -34, -157, 231, -75, -20, -63, 170, -155, 233, -174, 77, -18, -107, -159, -275, -14, -349, 51, 12, 379, 34, -275, 286, 180, -159, 172, -11, -85, -89, -122, -371, -60, 50, 52, 94, 7, 134, 155, 156, -197, 165, -56, 89, 357, 30, 242, 92, 86, -124, 54, -65, 85, -131, 104, -137, 73, 290, -159, 73, 190, 69, -76, -50, 162, -105, -183, 133, 71, 175, -21, -50, 41, 91, -177, -35, -122, 0, -95, -252, 257]
5560B57k74J9j2J40K47m63p5J03O4k25J54l9j31N21l17P5k83L17j34k67J76J7
5582a30Q8K73n61L25K11k20q0K78j77J57k29m1K54k77J14k36J73J20j46K08J50
5603B54k95k5P7LJ25l40q7K46j02P0J52j14K38k10P9k22J11k35K61J62j63K71
5625B56m39K12J50J16o3k71L6J22k79J35p3J39pJ9l6r1J23m56M03n5K71m49K71
5648C4Q9j9J4P1P1k5m54J26K14l90K58j1K59O5j81j67MK79k34J75j90j25K35l39
5672b41L74j00J6j21r8L05m14M35j76j04K09j76r1MJ49K88m82J50P2M7l54K91
5694a7L51k07j25O5J6j35J32J29j80J53j30J77k67j10J58O8m8j59K90k31j59L40
5716A11j99R5j6J95k11j9J26l02K88k92J34L0l22M96J90m15J36J24j46j16L31
$$ y = [257, -17, 2, -10, 130, 377, -86, -161, -58, 6, -219, -65, -104, -235, 286, -31, 44, -239, 78, -56, -323, -147, -130, -42, 231, -330, -5, 206, -14, -94, 184, 7, 164, -65, -106, 148, -129, -15, -251, -78, 42, -104, 104, 254, -41, -66, 11, 14, 139, -201, -288, -42, -144, -74, 78, -36, 202, -8, 71, -151, -40, -275, -14, 148, -15, 256, -183, 29, 179, 295, 232, -39, -3, 119, -160, -25, -98, 41, 34, 53, 17, -74, 49, -407, -4, -59, 212, -237, 34, 123, 104, 118, 189, 260, 235, -219, -93, 121, -269, -11, -22, 237, 302, 121, -46, -42, 237, 3, 178, -12, -137, 98, -241, 133, 33, 49, -72, -170, 135, -279, 156, -20, -124, 85, -91, -182, -178, -29, 259, -223, -73, -1, 46, -308, -17, 334, 127, 2, 67, 83, -52, 80, 209, 29, 182, 52, 229, -38, -148, 10, 78, 30, -129, 161, -70, -229, 111, -88, 7, -9, 186, -25, -44, 82, -220, 68, -224, -90, -60, -382, 114, 304, -111, 25, 149, 3, -113, 218]
5737B18j43k77K96Q0j70j74K31O6q6j24K01j91j0L6L73m01L28l93K75j66k2P3
5759B0K6k97L7L83m64K40J52J32j06q9m01M99Q2m92N49M4l07Q9k38J38K03k27
5781b7N2L3L7j94l2K86k05R6k50J30j19P5m4j21L43j42rK32l12k9K91m1j53J1
5805i2K33o8J06k11j52M46k42J67J2N6n7l98k86O19l3j62L48j94j41P4r3K12q3
5828F1J09R3Jk5l79J4J75O5j40J1K28k21J86Q0j49J93n04k6K28q2n7K04j41k37
5852c13K76j38J75K36j82L9J00j83M4j66J22K14l7q1K1j1k33R6j38R9K63l81P8
5875a00J19L02l01J5j36j1J27L0k0Q4J89j59l21J23J21p4p1J9J22j0k41M3L14
5898A64q4k27p7K00j03M0J75Mm6J60k01j60L39J4n22O09l65M4J84l72K43Q2r7
$$ y = [218, 75, -202, 94, 174, 4, -170, 61, 127, 41, -83, 118, -73, -83, -47, 326, -75, 253, -140, 135, -31, -53, 20, 46, -251, -214, 169, -295, -55, 97, 229, 123, 34, -367, 132, 214, -278, 271, 315, 8, 97, -141, -3, 200, -27, 25, 58, 95, -99, -131, 155, -50, 46, -204, -74, -193, -118, -162, -283, 60, -82, -91, 141, -171, -200, 91, 50, -103, -92, 141, 73, 179, -32, -184, 262, 20, 187, 199, 255, 198, -200, -486, 133, 100, -62, 286, 92, -49, 25, -68, 144, 61, 170, 263, 264, 239, -140, -126, 49, 114, -26, -15, 213, -8, 178, 258, 109, 302, -202, -228, 0, -82, -139, 65, -76, -313, -37, -175, 0, 236, 54, 93, 193, 10, 54, -112, 10, 224, 187, 106, 127, 116, -117, -21, -159, -60, 203, -178, -100, 19, 321, 20, 35, -101, -112, 15, 45, 25, 109, 298, 139, -182, -59, 62, -12, -83, -64, 58, 48, -193, -150, 164, 80, -147, -224, -24, -127, -87, 88, 92, 46, 206, 5, -155, 184, 198, -324, 285, -80, -36, 148, -224, 19, 101, 4]
5921DO2l97J16M02q5j51J16N1J14m99L7K44J32j23j54M9n5j7J02P3r1L0r1J63
5945C2J23k18Q2r0K59r4q7p3j51L49om40M70o7j23O8k71J36j53KO4O32k25p6j40
5970CK70k02j41J89j78K9n5p4L12r7l9j49L00l2j36R6J10k37Q0Q5K7k6l12J73
5994dm6j20L29l41L05r5J58Qj62J34k03j62M23j37j99K65k76Q7k10J68K65j08
6016G9N4k18l6J14K02k11o7r7K34N8k41J62N2k17o1L05n2L3l72K95J21j81o1L98
6040B93l35Q2j56o1M44l83J57Q6K0j94R7j34j41K53l15L28l12j54J81M42j72k26
6062b00Q6J48J64l11K08m94N90j09j96K05K0k43L42k17J83j5k20J69l15K48o5
6083b2j09K07K21p3m4J58l45j22J52J03q6j30J88k27l3j09L73k73J04K81j53o0
$$ y = [4, 66, -331, -215, 187, 102, -49, 67, 118, 232, -267, -230, 14, 146, 23, -131, -82, -137, -154, -52, 21, -70, -40, -131, 32, 155, -63, 19, -71, 188, 94, 7, -66, -217, 132, 126, -314, 156, 89, -34, 34, -237, -101, -254, -252, -188, 444, 219, 143, 3, 273, 71, -70, 119, -59, -30, -85, -159, 153, 56, 17, -132, 168, 136, 0, 96, 206, -31, 49, 134, 161, 135, -177, -4, -50, -170, 159, -182, 123, 28, 186, 194, 32, 166, -37, -199, 224, 87, -112, 153, -123, -36, -246, -78, 187, 79, 133, -85, -121, -7, 195, -16, -83, -180, 54, 112, -129, 33, 85, -132, -193, 112, 60, 93, -279, 16, 137, -44, -105, 293, -42, 40, -116, -177, 267, -116, 41, 127, 147, -47, 50, -84, -225, 28, -287, 41, -271, -425, -244, 198, 26, -200, -114, 34, 198, -113, 95, -399, 191, 82, -114, 91, 111, -132, 210, -7, 176, 161, -59, 110, -205, 43, -22, -131, 76, 297, 224, 180, 338, -7, -129, 23, 126, 40, -90, 98, -129, -162, -271, 102, -171, -67, 214, 61, 1]
6105ARK33j14p1j09J22R0r4n5j71N4J55k19K62Jk18MJ09j6o8K34k68k5J89J82
6130B17p8k86K16J64l28oJ35q6J34m6J13k49J25k83l4M18j14K32n5k78J03m6l9
6153g1J42k93L46P1J32m61k20N90j77k94J96J52j08J49j15J10j08j80j3M1J63
6174E2n9j10JL15j64jj83K60mq8K95k97l4L86l97j39J25Q2n6m5L68l51J1j73J14
6199i2K65j64J0O9l74K81L73k72j75m6k83N14O6P4m29O2K29K3m05Q3R8K46q0j16
6223d3Lj6Q9K07j03k27J76k20M72l80Q5N3l13L17K27k22p7j61O7J27l48K85l46
6246c48J35l9M78jj08j86J78j31J5j47k09M36qP3j02m6j76L01k15O8L6l88O7J08
6270b09j01M42K10m15L01j53k78J57m8nq9J10k0j05j45O12m61K01p2Ok28K84M3
$$ y = [1, 10, 243, 129, 58, -51, 71, 161, 67, 12, -159, -105, 50, -169, 93, 94, -124, -120, -11, -27, -95, 139, -129, -154, 35, 217, 139, -147, 69, 233, -95, -101, 34, -52, 82, 36, 149, -100, 25, -258, -292, 126, 12, 244, 189, -89, 14, -32, -71, 71, -222, 124, 195, 327, -134, -354, 236, 59, -235, -39, 113, 5, 154, 39, 149, 41, -139, -152, -111, 52, -7, -117, -116, 199, 35, 34, -149, 111, 107, 19, 314, 17, -17, 369, -28, -167, -42, 40, -16, -61, 307, -44, -33, -206, -92, 173, 9, 19, 88, -286, -5, 368, 96, -79, -125, -408, 106, 172, 246, -183, -121, 108, 131, -274, -191, -93, 153, 73, -43, -40, -56, 33, 240, 137, -90, 86, -134, 338, -42, 43, 96, -217, 100, 327, 105, 28, -133, -66, 61, -287, -2, -348, -213, -252, 226, 225, 117, -69, 109, -22, -7, -154, -363, 73, 65, 138, 36, -10, -186, 115, -100, -32, 4, -384, -317, -209, -310, 132, 342, -73, 228, 75, -203, -46, -94, -99, -188, -78, -98, -203, -348, 264, -197, 4, -68, -62, -290, -6, 37]
6293C7j28j82O95m81j5K12p1j90J99j33J53O8j68J88k28N8j28J81j19K59j56k56
6315b05K34J54l72N2P0k6j0N5j2o4k6R4J68K10l73J12o7k04J10J29L00j64N1k88
6339g2P7J1l29N07O6k06J11k42M1J38k13K01K5Q9k68J30j35P6j98J02J94k69K01
6362C7j05j39L88l27K19k32L28r1j11n9J44n9j99L69j03N4J54k09o6L18l09j67
6384a65J41n0J19l18M78l14R3K35l83j6l4J9M66j91o3n5J73n6k24P4J88m7k44
6407a74L33l02L33l02j66K33J49j40j81K44J39j02j36J64m10J75J61P7j98K22
6427A19k09j7Q0J81n64Q2J74K76jk97K99k10pJ6L4l9L39j05K4k28q2l6J87l04
6451b88k6O78n92k46O59j53Q6k65M3K08l14K00J54r4m04M36j97J92O0j3L20l11
$$ y = [37, -91, -273, 422, -59, -74, 138, 67, -123, 76, -57, 96, 164, -4, 184, -44, 14, -114, 67, -52, 207, 51, -205, 29, 183, -189, -137, -67, -93, -103, -48, -60, -124, -150, -56, 112, 322, -51, 61, -6, -210, -100, 29, 329, 165, 216, -72, 5, 16, -313, 194, 260, 54, 165, -77, -36, 102, -111, 90, 115, 204, -64, 66, -69, 7, -191, -89, 105, -164, 37, -68, -207, 181, -146, 73, -159, 169, 78, -33, -92, 52, -7, -206, 163, 60, 114, 268, 59, -7, 311, 2, -165, -24, -74, 45, -273, 205, -109, -16, 219, -164, -180, -214, -195, 271, 80, 17, -38, 135, 79, -145, -71, 117, 70, -174, 159, -143, 190, -112, -278, -45, 104, -36, -217, 27, 166, 64, -72, 92, -318, -143, 18, 95, -103, 119, -90, -107, -27, 154, -410, -328, -154, 122, 121, -176, 123, -87, -94, -78, -44, -83, 256, 151, 175, -53, -135, -171, 16, -288, -314, 364, -228, -474, 185, 32, 118, -147, -104, 104, -210, -10, 144, 50, -354, 82, -115, 77, 137, 124, 444, 133]
6473A33nK61n43L0K0m1N8J29J26l04K25k08O9m9L63k37k9R1l39M23j80K84p03
6496d26N78j57k06K82j64K29j92Q1j50J48k85K40k43J07O3J33J49l8k27J17m4
6517el84M81m11K13K75j42L04k92J1j05o3L03l30J03J74k63N06l65L7N9k47p5
6539b16M19j5m74M68r1r1j70K51n3P0j42K5J05j84J14J08n5j13K10j4j81J55l27
6562b01K12m3j74L21Lm36J44J49M5j71K00K92m35k7R8j4M3ok30M2J71L3J44k55
6586i5R2m2J67j96l6K15k03K41Nl4k33J57q7N1J18l19M76k30j36J62M9M5l76K36
6610B7l82K79O8p9k99K81J88n3qj57j36K39n0j66L98j95R1J55n31N25J17q1j59
6633G2k83L76j95k03J56J45p8j05M5j2J01J34P8k08l1qj6P0j99P6K55k37J50l91
$$ y = [133, 128, 389, -154, -124, -104, -145, -87, 42, 168, -136, 89, -119, -50, -99, 264, 27, -2, 89, -250, 173, -7, 277, -426, 152, -5, -211, 71, -93, 136, -56, 25, -125, 23, -262, -22, -265, -158, -95, 38, 187, 149, -78, 39, -5, -389, 92, -319, -106, 169, 27, 331, 39, 50, -55, -118, 185, -145, -42, 132, -131, 375, 10, 47, 106, -141, -216, 203, 188, -286, 182, 91, 0, -170, 81, 28, 98, -44, -19, 86, -98, 16, 124, 69, -44, 166, 152, -29, 126, -201, 11, -32, -206, 115, 118, -318, -174, -25, 20, -151, 49, 341, -94, -121, -23, -37, 6, 0, -230, -188, -17, 16, 160, -95, -3, -45, 122, -74, -110, 105, -98, 143, 148, 114, -119, 38, -49, 2, 120, -199, 277, 47, -89, 73, 122, 167, -209, 27, -355, -76, -8, -87, -386, -105, 83, 30, 22, -135, -271, -32, -82, -248, 150, -45, 46, 201, -330, 195, 312, 231, 72, -211, 165, -30, -233, -77, 68, -10, -115, -70, -82, 19, 153, 231, 23, -8, -16, -32, 38, -161, -85, 170, -67, 83, -308]
6657c08K08L1J37n2j09o0J40J89n8j70K62k3j79M7K23k38k3J45M2k49N0J74K90
6680D69k37n3p8J30j86j50J80Rk48J51J9l9j20L00j73k44N39k88k7k3J37o2J82
6703A88l06K26j19q1K14l60n9M25j20J68k5l96L73Q1n03L46O9r1j85K01q1k27
6725b62M35j03J1j03L6j81M78k72L6o4J09L8K0P7l97O5QK71j35l3m1O8p2QJ97
6750A94R1l04k40K5K54k96K09M9K9k29K7O9K07j11K77k09j67L68j90O8n04L13
6772g0M42m03j14L78k57k46K93Q2PJ10k61l10L44K91k48k35K55j32M9j25J36K33
6794B19J25k27K10l50j9r7L3o1J09J27k36K04j14J43j12j22J56k3K68k69r7M2
6816i1k29L94m4l2P9j66K27o1J65l98J66k03P5j22J55L12j62j37j7K50r6J83k23
$$ y = [-308, -100, -69, 68, 16, -93, -153, -13, 176, 118, -52, 210, 187, 8, 55, 278, 40, 17, 162, 204, -45, 5, 179, 469, 232, 179, 101, 231, 45, -105, 75, 84, -164, -13, 6, -33, -153, 147, -26, -270, 269, -19, -46, -69, 68, 6, 188, -118, 108, -11, -92, 122, -238, -297, 128, 8, 176, 151, -245, 128, 209, -294, 52, 121, 30, -155, 46, -35, -262, 173, 70, 81, -22, 14, -167, 311, 39, 75, 11, 120, 158, 178, 255, -142, -77, -69, 202, 67, 34, -7, 61, -11, -3, 194, 285, -19, -259, -234, 20, -276, -67, -18, 11, -218, -191, -122, 85, -26, 251, 42, -125, 243, 53, 121, -383, -70, 372, -31, -145, 233, -24, -270, 23, 105, 112, 222, -39, -349, -5, 286, 38, -197, 58, -74, -25, -150, -14, 219, 344, 117, 327, -23, -42, -139, -106, -167, -58, 69, -167, 37, -77, 66, -46, -168, -12, -35, 233, -36, -133, -91, -320, 74, 30, -2, 77, -89, 138, 77, 242, -156, 10, -193, -118, -240, -85, 227, 65, -72, -89, 161, 65, 248, 25]
6839B5j41k93K61K32J31L0l6j11j48j14J79r6J25k02K43j40L4N4J29p0l22K28
6861bn4O2k16N25m28j98J00L2L17q9k12p5K95k39J9J8l0J28J4j2O6k7J47l99K27
6886c1J43J33m28K29q6j27l8L99Kj2k9j07K16M8m78p8L89j92P5j21J00N9K34k32
6910F8r7K8j48L70k94J32j3j91J52O7J82m87K84l9O7j15J40j82q0R0L1M1P4l2
6934D8N0K00k27j11j06O9K93l09q3M65k97k71M44l65L0J79Mk1l03L92j37o8R5
6957b9j58K0K78J48k89j22L12l07%Q1j95M23k8j67L6j51M6L81k55m1L35l18J27
6980A27K1m43L59J52j56J76j00j04k7j29p3j49j5N32k74K33k29K68r2J15j87p6
7002g1J68J37k33J10J5j82J00j33M02k97j70K28q0j2j60L61Rm39j5L81m86J10
$$ y = [25, -116, -409, -148, 84, 215, 245, 209, 98, -50, -164, 15, -81, 44, -158, 85, -55, -21, 33, 162, 92, -230, -2, -56, 6, -210, 315, -113, -311, -211, -179, 138, 49, -163, -238, 57, -182, -163, -145, -175, -47, -33, -45, 21, -6, 141, -258, -31, 112, 245, -183, 46, -40, -167, -205, 194, 196, 184, 155, 48, 264, 312, -166, -244, 145, -47, 28, -93, 7, 66, 300, 68, -29, -1, -149, 221, -73, 59, 46, -145, 7, 74, 256, -231, 53, 14, 81, -34, 106, -76, -156, -66, -35, 6, 80, 48, 98, 298, 71, -40, -146, -77, 216, -93, -176, 289, -8, -279, 165, -200, -170, 9, 13, -8, -311, 81, -56, -124, -29, -187, -167, 111, 259, -30, -152, 160, -147, -147, -66, -261, 162, 134, -33, 3, -148, -102, 279, 24, -17, 318, 0, 127, 148, -295, 64, 216, 60, 236, 136, 32, 5, -124, -197, -346, -361, 171, -103, 130, -99, 169, 77, 192, 5, -71, 97, 234, 1, 111, 126, -56, 44, -89, 313, 16, -154, 74, -6, -18, -178, 183, 192, -247, -262, 119, -367, -257]
7024b57L99Q2k32j5j1K6K17j03K4j50L19k92j15K63l51K55R1m45K72l26L80P6
7046A07j14J07k76J8J68J4j66M05m31J22R2L5j03j77N40n45K4L68m50j29L22J63
7068I4Nj01J87K0k61p8l2O0K20l53O7L14k62L29j97j51K25J94k20j89J40j94L52
7091A69n0J39j52j1k10J79M4j80K93k10n6OJ69Kj84j31K17j77l5K00j06oL29j41
7115I8j81K98q7j2L8k51L20k68J98l7j83K39o7K9l10K62o4l04K22O0K3p9J95k32
7139i3j47k5J42M7n4J31M9J53k34o4K35j22j51K03m0k33p6K66k11K54J64q0k81
7162a67P9n0L1Q3l80L35p9M01j88J8m06L57J84n37K72M2K1o1J96l06J89O7j74
7185g3p7o7M42m48N07l08J15m56K98K56j5L1j89p6J12k31K72O4k65lK42l38J13
$$ y = [-257, 142, 224, -8, -23, -34, -8, 209, 106, 130, -20, 299, 7, -108, 155, -196, 59, 150, -295, -23, -349, 31, 107, -7, 100, -176, -158, 10, 24, -142, 263, -168, -46, 46, 81, -22, -199, 341, -204, -180, 188, -262, -391, -69, 94, 99, -2, 185, 205, -56, -134, -166, -106, 114, -239, -172, 142, -120, 209, 12, -139, 86, 280, 60, -129, 11, -183, 169, 119, 258, 106, 95, -115, 64, 108, -72, 221, 11, -45, -39, 130, 132, -52, -183, 34, -143, -178, 22, -84, -90, 239, 98, -83, 215, 128, 116, 154, -97, 223, -45, 153, 116, -67, 172, 105, 134, -176, 86, 22, -282, -60, 0, 23, -56, 139, -93, -240, -265, -123, -76, -130, 1, 50, 203, -31, -95, 140, 18, -133, 70, 30, -203, -279, -13, -224, 30, 194, 114, -167, -88, -138, -107, -24, -404, -69, -148, 253, 65, 83, -323, 34, 218, -319, -47, -5, 16, -45, 151, -155, 34, 101, -73, -150, -217, 225, -223, 284, -24, 91, -365, -67, 189, 174, 205, 16, -60, 52, -179, 93, 157, -108, -111, 131, -207, -94]
7208i4J81l46L9L49Mn1q6j80K87K5j39m6J02j15j37LL10l1k30K27j87l9J76J39
7232A61j58N1l96O0O16n66K60j56L8K98l14k15J26K58K6k48L77l2j93q8o8p2l9
7255b74L39O3k48M20k12l12K25K20L28m08o9j0P4k60J74J06l25M78n06K74j44
7276f7J68j06K69l01l81K20K68J96m19Q3k01K28o8J32L9r2P7L3Q7j48J26l95r6
7299c48K74O4k51K23R9m5k08K80p8k8J19j22j38L60p5k76K78Q1r6r3j24O0R7J95
7323B48lk59J7J49n9j29J97k17J35l00K23j60J31J74q7O1N7l14O6J68k14o1M90
7346C13k69j51ok30K5O04j41j42k13M01M5j50l3k88L78r7L21o71L44j03N4k1M8
7369A8j9M0L8J85j94j1l7k5K28m33J28K80m43j0K26k3R3N3l66M02l10m6L9L74
$$ y = [-94, 87, -259, -220, 129, 133, 82, -4, -184, 103, 128, -11, -57, 45, -70, -207, -204, 106, 75, -155, 72, -115, -154, 22, 161, 3, 54, -342, -282, 334, -232, 28, -128, -90, 208, -106, -321, -195, 63, 89, -159, 218, 186, -7, -95, -163, -235, -274, 65, 128, -120, 300, 88, -224, 1, 221, 549, 141, 72, 62, 136, -124, 50, 156, -169, 309, -197, 77, -67, 101, -5, 264, -37, -418, -198, 70, 266, -153, -70, -271, -43, -111, 21, 60, -32, 45, 78, 165, 17, 143, -252, -348, -74, -10, -261, -38, 61, 16, -192, 88, 10, -18, 101, -21, -159, 201, 126, -150, 128, 209, 113, 20, -104, -44, 53, 248, 245, -14, 3, 152, 93, -36, 161, -56, 79, -221, 2, -158, -27, 147, 60, 121, 178, -136, -70, 98, -116, -177, 313, 44, -107, -113, -343, -318, 286, 145, 3, -210, 191, 236, 86, 53, -235, 143, 46, 367, -304, 40, -63, -9, -30, 18, -1, 39, 77, 262, 68, 57, 20, -5, 223, -210, -82, 198, -245, -255, -29, -52, 41, 94, -272, 130, -180, -226, -187, 187]
7393A87k86P0L9m8N5K85n04L4L50k95J81k3j42j2L47p7j90J3p1j13K22M5q3K95
7417B79k09L0l74J00J83Q0%M8k10K37j67l12J86j34J32J62j36K67k13Pj38p7L14
7440E5j96o4M91l78p5j88O49p69M85lJ66J7j12J1Kj88n8L28j59J09l15L71j41
7463C8l8l31M38k44J78J84j91N0l9J59k44J5k50K72nJ53r5p0P9o5N6j85J63j05
7487g7l12K44m4J38L97n15L65j87j72J48K18m7j35J36o4o8k34J31K09n7j51K42
7509A65q6n3L2m1p5Ok76J35j7M03j28No1p9J06k20Q1qj9L78j62q5L23j76o5j9
7535F4m22M40j69M1J94P7k41J82j04m8K1j29j33P9L5K83j87J14l62K70k5P0K31
7558B81k49M6nr2J33R5k17p6J8K3R7j32M9J08j12j69L92j84j9j11KN5k08M49n11
$$ y = [187, -99, -29, 10, -38, 17, 302, -202, -168, 182, -113, 68, 45, -97, -109, 238, 161, -29, -16, -87, -200, 22, 67, -16, 279, 70, 100, -274, -174, 9, 89, 89, 137, -73, 164, -3, -315, -129, -263, -131, 31, -105, 162, -51, -44, -182, -259, 55, -141, -205, 286, -92, -167, -355, 294, -475, 10, 7, 173, 190, 78, 89, 91, -97, -155, 173, 14, 123, -192, 179, 38, 0, -331, 107, -137, 41, 225, 34, 84, 45, 204, -40, -25, -275, -3, -8, 145, 50, -20, 59, -6, 50, -135, 28, -77, -389, -145, -189, -51, 346, -169, 196, 9, -163, -15, 203, 156, 21, 157, 93, 25, -209, -78, 131, 74, -77, 165, 79, 26, 58, 17, -58, -52, -328, -193, -210, 193, 65, 70, 9, -70, 36, -184, -103, -111, -130, 248, 86, 1, 324, 148, 83, 64, -358, 82, -87, -46, 148, 225, -16, 166, 62, 14, 35, -94, -227, -148, -113, 170, -17, 97, -265, 5, -20, 50, 281, 32, 78, 73, -19, 114, 209, -8, -84, -66, -43, 54, -78, -29, 79, -33, -202, 190, 6, -13, -124, -122, -67, -275, 174, -337]
7583c37K93p3K55k17j3Q8JL5j19J60k25L30n2j38L33l48j95Q8K13j64J18K0r6
7606d3J42m0O0j4j84M2J45KJ05J51m22j7R0K5k59J77M45q1n39L09j56k22K36J83
7630A35K65n56J64p9n9P7K33l73J40q1J67j3J26l49mJ28j21K58J05j85P0j02k10
7653b64J62r0J20J89l85K09J43l17J43K25j00n7O2k04J29k15J48L26m74L34k63
7674a79M01l45J30l5j62Q7L1K31k54P5J60l10K36j4J73j06j72j05pR9O2L7J24
7697A57k22n9k3J24M30j14j66q3k28L90o2p7M5J98m76q3J57J59j28K8P8j10k59
7720c24K52J01J86Q1j56k37K51m0Qj02p4k14L45k45J75K5PJ33k73L54N3l87J98
7743A17j95Q0J53pq2j94N5M0K78k99P6Rj15J6K06j8j9J62k97j00K55p3N6j94N48
$$ y = [-337, -44, -117, 138, -79, -92, -4, -3, 32, -87, 73, -152, 178, 126, -12, 321, -27, -222, -134, 79, -85, 33, 53, -43, 99, 59, 119, 105, -79, -37, 108, 110, 215, 366, -56, -73, 17, 42, -217, -40, 405, 324, -215, 94, -62, -284, -48, 135, 400, -156, 8, -71, -130, -53, 180, -193, -53, -134, 33, 20, 146, -203, -207, -79, -200, 58, 163, -22, 48, -54, -264, -102, -192, -72, 117, -268, -59, 84, -233, -90, 135, 35, -22, 40, -164, -35, -250, -102, 224, -250, 84, -179, 222, -123, 7, -28, -190, -103, -72, 159, -95, -20, 140, -170, 66, 52, 225, 119, -53, -158, -165, -66, -4, 33, 157, -65, -124, -147, -23, 407, 293, 127, 44, -184, 206, 144, 67, 112, 310, -166, -249, -92, 67, -61, -33, 45, -65, -324, -72, 29, 215, 296, 140, -97, 154, 114, 122, 20, -54, -268, 77, -168, 7, 32, 39, 172, -101, 253, 306, -81, 117, -78, 2, 155, 148, 66, -128, -73, -33, 245, -54, 22, 31, -84, -68, 138, 120, 101, 263, -34, -134, 121, 48, 104, -90, 458]
7768D58o41k45O48k43J49M7j85l2o1J16N5J6k05J43M1p0k64N8P2L14l0l53J96
7791a6j41L43l04m3J44k4J90k66j39L17NN7j76J70j21L9j51M5N5J63l31%J89L66
7815C71j60K7l79k9J68L47l29j57j5L34l48J24J41J22j78M4j8k74L29k41J13n9
7837f7Q8k94L34K43j04j82k98J55J5l35J71L63j07J36q5l60K95o6j16N1pK3J47
7860@K27k43L06j19j94J35j63J14j52j58J27o1J27L38o57M65J33j45j38n5J95
7881H2nj43P6Qk13J27L50qm83K60j2l8j36j41K86p2O6l36K90L4Q5R4j59n8M6Q1
7907H1m8k8Q8j36K07j39r7l03L19L3r5K07k37J58j29L18k92J16P0j07Q3J60m61
7930b32K50rj25O0JJ00J68l69l8L08JJ45j13lk07j38J23l7n2K19l23J34P7K60
$$ y = [458, -183, -428, 220, -23, 126, 173, -12, -44, -105, 11, 66, 82, -123, 20, 61, -9, -273, -215, -143, 171, 141, -212, -16, -157, 186, -118, -161, -17, -41, 149, -117, -256, 61, 66, 123, -53, 117, -4, 35, -116, -71, -16, 147, -184, -184, 5, 371, 211, 238, -141, -170, -2, 345, 16, -141, -156, 178, -170, -46, 95, 217, 39, 83, 65, -209, 120, -121, -8, -67, 21, -273, 61, 304, 200, 18, -280, -125, -110, -445, -274, 89, -18, 118, 33, -327, -32, -98, -214, -163, -170, -147, 0, 227, -16, 290, 171, -23, 112, -51, 63, -89, -247, -120, -181, -54, 284, -373, 92, 225, 80, -58, -113, 82, 77, -66, 10, 18, -195, -68, 282, 274, -209, 51, 39, 1, -135, -276, 10, -62, 4, -332, -42, -8, 77, 171, 12, -46, 0, 81, 33, 5, 93, -43, 164, 25, -72, -375, -56, -23, -118, 89, -148, 10, -119, 199, -93, 23, 93, -14, 69, 229, -232, 18, 9, -116, -56, -55, 45, 213, -156, -194, 114, 115, 260, 147, 144, -63, -201, -78, -115, -167, 52, -271, -137, -60, 200]
7954B00p7j36J0j81RJ93j80jL46j99k5J7j7l10K21L1R9J12j43O8jj29MK93q7O3
7980A80k86j48J42L37j64L2J0j44m5J6J39k87P7K54R5P6q4p7O5k44J68o2j56J36
8004C0K57l22O7o3l53M12m5j43k34M34q7n4J17j94j42M40Q5l41J46j27q2L3J40
8027b6n0Q1j83K91m08N02l38L52j45J37j17j9k5J18l7n0m8j3L20l84k04K90l62
8050c18M9K36PO0j68l3O2K54J54K2n45J81j76M4Q3l6K71j38K2j94J13J3j28P3
8074i2R5k22K71R9k33N9j14K97j88k66L02K15k04lPP1M5j14k03J79j3J2K8o0p4
8099a06J0J83j19K03k53q5o7N04l42K5J94j38J78k94K51m19k7K53K60j70O6l22
8121b15J86r9L23k45j18K39j50J30j10L80m48o4O5J23m7Kl60J81M19k66J61r8
$$ y = [200, 123, -13, -3, -184, -175, 18, -162, -163, 183, -16, -41, -24, -41, -351, -130, -99, 0, 112, -31, 37, 36, -93, -89, 204, 117, 180, -106, -254, -112, 225, 61, 93, 103, -41, -86, -70, 69, -218, -141, 113, 208, 284, 200, 123, 188, -56, 112, 50, -106, 30, 287, -35, 32, -31, -384, 28, -17, -160, -394, 40, -47, -101, 16, -178, -320, 120, 205, -136, 10, -117, -199, -166, -26, -76, 5, -178, 113, -295, 207, -131, 221, 76, 213, 96, 77, 52, 170, 133, 83, 35, 22, 342, -42, -246, 44, -318, -269, -33, -26, 34, -134, -167, -105, 149, 303, 325, -220, -39, -215, -171, -88, -124, 147, 9, 31, -163, -50, -37, -165, -92, 3, -219, 52, 151, -82, -23, -137, 160, -28, -294, 8, 223, 19, 16, 23, 94, 139, 25, -178, 1, -12, 0, 28, -32, -106, -96, 87, -32, 171, -82, -167, -234, 270, -72, -47, 147, 9, 187, -107, 144, -275, -302, -49, 211, 41, 107, -215, -29, -128, 195, -50, -168, 71, -79, 51, -59, 321, -127, -191, -126, -3, -50, -48, -408, -227, 192, -74, 87, -11]
8143a1L03o13J07J75p8J15N7K19N1m56L5K33k64o5r7K99j7K17Kj26j27j80k3J4
8167b30L47l11O5L09p0J67l88L55m08J12L86m37M8k36L10o2j74J07K69k14L33
8188B78k47k64J14
$$ y = [-11, 292, -321, -214, -39, -117, -2, 55, 274, 325, -131, -96, 137, -127, -192, -289, 10, -7, 210, 212, 86, -41, -221, -244, -230, 117, -194, -129, 180, 110, 277, -111, 244, -164, -52, 334, -103, -55, -291, 19, -43, -217, -110, 159, -55, 278, 31, -233, -119]
8191a19
$$ Imaginary data points
##PAGE= N=2
##DATA TABLE= (X++(I..I)), XYDATA
0@%%%%%%%qJ6j6J6j6K4l2L7m5N6o6P6r1J07j28J50j71J97k27K59k94L33l77M27
31B27m80N36o00O73p52Q36r27J028j140J263j401J552j717J902k111K344k607
48a374K909l260L673m167M766n515O485p793R672j2617J7933l0565J16027J16890
62B13064j94630j56222l2636J39221J47106N1701j01343j46498p2968P7441J36614
73F0850P8818m8820j16207r6744Q696J09167J23707J1546j16850j32905j2412
84a31154J11098J23244K0306q9812j17807l6219P6806J15267L8918o6284r7398
95e3035l9845L7085P5538N7276o126p2955p9454o732P7055Q4602J2142o7592q3896
108f5937k4190O0122R1640L2308o1427q9169k3880N5607O9544K1195l2584n3460
$$ y = [0, 0, 0, 0, 0, 0, 0, 0, -8, 8, -8, 8, -8, 16, -16, 21, -24, 32, -34, 42, -49, 58, -70, 80, -91, 106, -121, 138, -156, 177, -200, 227, -253, 283, -317, 356, -396, 440, -487, 541, -599, 664, -737, 815, -902, 1000, -1111, 1233, -1374, 1535, -1725, 1948, -2219, 2547, -2968, 3517, -4276, 5396, -7221, 10712, -19853, 96174, 213064, 18434, -137788, -170424, -31203, 115903, 167604, 66261, -80237, -153205, -75764, 60850, 139668, 90848, -25359, -122103, -113407, -4240, 119467, 131013, 14163, -118742, -131154, -20056, 103188, 123494, 33682, -84125, -120344, -43538, 71729, 110647, 44363, -53035, -92880, -55795, 19743, 77019, 70893, -2062, -81516, -88248, -11193, 73409, 85551, 17959, -65937, -90127, -30005, 61635, 93943, 32516, -56653, -80533, -24926, 44618, 65813, 33229, -20231]
120b0231l6320J1284N1284M5567l632m6873m7681r975L6004N5943K6045l6279
132B5136o8528k7356M5237O6943J8672m0293n1610j7840K6063M4852K4896j8013
144B8159m1771k3498J1789K8796K2884N151j7783l4848k1232K2161M6582K0984
156D7374k7350m4391j6516K2853M0065K1064j8435m0698k0656K1065L5320J1748
168C1443j5768k0387j1397q94J1787J9933J0384j4713k6263j2095J2446K4637
180I113J6462q406k8998k2495J1841L5136J8201j7737k8871q721J3967J8313Q260
193A6065l803j3751j1537Q7J1601R876L182l686j1047j2786o44J9085J9199m797
207A7044k4774j5556J0037K1691J1003p884j6775j1200O252J6773Q687p274j1618
$$ y = [-20231, -56551, -45267, 6017, 51584, 47952, 1079, -46602, -56577, -20573, 35370, 61415, 25136, -43392, -70748, -25511, 41432, 60104, 19811, -31799, -49639, -23576, 21276, 46172, 28159, -13612, -37110, -25321, 3475, 26359, 31510, 13727, -21121, -42353, -20192, 26390, 47374, 20024, -24367, -40883, -18030, 22035, 43099, 24664, -16034, -36690, -15625, 19695, 31443, 15675, -4712, -16109, -17003, -5216, 14717, 25101, 10388, -15875, -27970, -15524, 9113, 25575, 17169, -11829, -34324, -22483, 12653, 30854, 13117, -15754, -24475, -10508, 7805, 16065, 12262, -1489, -13026, -12939, -1338, 8538, 11720, 8034, -3013, -15799, -16443, 2642, 21841, 17044, -7730, -23286, -13249, 8442, 19445, 11561, -5214, -16414, -10162, 6611, 15298, 8024, -3594]
220c594k868K792J480L030O556K004r920j2421L86J3212J0991j722j2402j2312
234a4788K57J5127J4416m233j6938q474Q619J2085K221n394l753j278m99R23L284
249A575L435K86l392o104m005M905J0970M547j0559j3812J048J3658R120m597
263G075j0651n037M375P924K726l271n338j163L547Q10k405J121M626J04p278
278b835n967M564J0029K937p716r187n05P953Q968r35r564n962M079Q675J671
293F205n736l583K701L003j717k939J992L950P52m392n237J576O397N231m595
308C608q561l041P411Q046j768q464m031M380N739N55m404k639K010K327j64l044
324b040p01L779K525k736o017m38O705M949l376p637k415O219N940o31o411l729
$$ y = [-3594, -6462, -3670, -2190, 840, 7396, 9400, -520, -12941, -12555, 657, 11648, 9926, -2476, -14788, -14531, 596, 15012, 10779, -6159, -14633, -6014, 6071, 8292, 2898, -855, -2133, -2632, -1709, 1575, 5010, 5296, 1904, -4200, -8205, -3300, 7670, 12217, 1658, -12154, -11106, 2552, 11672, 7075, -3576, -8613, -4238, 3686, 6412, 3141, -2197, -3360, 187, 997, -1408, -287, 4339, 4443, -2835, -8802, -4238, 5791, 8728, 1012, -8175, -8680, -727, 8241, 7306, -2258, -8220, -4141, 4534, 6205, 469, -3114, -413, 2590, 873, -2066, -74, 3876, 4628, 236, -5001, -3425, 2972, 8203, 3608, -4953, -7994, -583, 7463, 5695, -2769, -6800, -2420, 3319, 3874, -530, -3169, -1159, 1168, 1004, -2040, -2741, 1038, 3563, 827, -5190, -5628, 1077, 6026, 2650, -4987, -7402, -1183, 4757, 4126, -2285, -6014]
340f014K908N749O36m083l008K558L665p57l811j203M117L240k485n099r34N108
356E87M727j679o411k982M583O133k83n496l844K810M956N94m163k367K538L111
372B814l59l312j563L056L530j585m240j947M168M611j241n054l206L685N070
387D427K33m904l366K434M035M63l402k460J353L622j59l819j867K795L420n94
403B211m464k046L194M129J7m750k836K157N114M74m287l007J690L967R31l346
419h52k886J813L511K95l142k102K111L348k5l539k394K166M168O25m409k892
435d204K521M094N58l468k964K057L114R73k996k106R77K852N81k360k454J342
451a483L782J06l196k283J927L916L17l556k110J626K782J111k338k015N21K822
$$ y = [-6014, -3106, 2643, 3279, -804, -3812, -1254, 2411, 1654, -2157, -3360, 757, 3997, 1512, -3587, -4521, 587, 5314, 3635, -2776, -5758, -1175, 4958, 4675, -821, -4665, -1855, 3101, 3695, -468, -2835, -297, 2814, 2455, -857, -2420, 636, 4166, 2581, -1659, -3606, 562, 5173, 3932, -1122, -4328, -643, 4427, 4660, -244, -3610, -1176, 2859, 3322, -80, -2540, -1187, 2435, 2276, -1543, -3410, -615, 2805, 2211, -2253, -4299, -1105, 3024, 3041, -1709, -4545, -2388, 2726, 3200, -1087, -4094, -2404, 1563, 2494, -852, -3738, -1925, 1586, 1881, -1261, -3363, -1252, 2096, 2071, -1468, -3862, -1696, 2472, 3097, -1312, -4204, -1683, 2411, 2969, -499, -3463, -1406, 1708, 2681, -315, -2421, -1444, 1408, 1989, -371, -2825, -1483, 2299, 2405, -791, -3074, -1147, 2769, 3086, -470, -2580, -954, 1828, 2939, 601, -1414, -893, 1929]
467A929J341k420k357P27L391N78k628k677J829L079m9k900j659J437K374K88
483B283j731k627L10K925J855k332l574Q49L648N83k734k285J458K378J11j781
499f64j588O51J616J364j814k467J53L111J726k281l220J808K860L32k711p33
515a857J032J315O99q04j130o83J675K024j261k891J85L206P39k339j837J399
531e28K020j46j419o38k55Q94J147J05j999j267J790K431j302k881M76K405Q66
548A699k511j063J347J085j71J89q67p29M84J856M41k473j196K563J999j958j939
565a244Q27J863k47q02o2L9m85O84J160q07k663J040K503j13k917n46K805J236
583B271k309j510J328K91j89J11J57j146q56J799J408j857k310J645K702r25k733
$$ y = [1929, 3270, 850, -1507, -780, 2611, 3189, 561, -2116, -287, 2792, 2743, -157, -1816, -379, 1995, 2283, 552, -2075, -1765, 1160, 3015, 683, -2891, -2042, 1606, 2189, -545, -2830, -1372, 1006, 1117, -664, -2252, -1601, 15, 1379, -435, -2902, -2749, 362, 2088, -193, -3413, -1605, 1255, 1587, -1124, -1857, -825, 490, 1189, 385, -745, -1428, 247, 2271, 1010, -1881, -1696, 1510, 2249, -90, -1927, -528, 1492, 1346, -73, -711, -966, -72, 1075, 1180, -819, -2086, -296, 2135, 833, -2048, -1572, 833, 1699, -812, -1875, -528, 557, 386, 575, -292, -1021, -537, 1319, 1760, -713, -1909, 654, 2653, 695, -1244, -417, 1446, 1199, 397, 335, 374, -111, 573, 1733, 926, -1737, -697, 1806, 1693, -1224, -1770, 1035, 2271, -38, -1548, -220, 71, -118, -7, 150, -996, -1852, -53, 1355, -502, -2812, -1167, 1535, 610, -2123]
600b123M09K176K43j303M6P28l86j18J870o84k156k0K632J659l484j867K515K126
618B263j416j954J095P98m76k57P71p27j660J683J953j212l018P74L332J58l543
635a436p11K608R39j681m78N32j96l08J316K76k348j417K806K230k887k489K176
652a068L263j253k416L31K023j07j235J028P9j402N04K511l58l569j10L898Q00
669B919l312k208K859K209j986j704J077O46q09Q71N55j287j942K553K371j532
685A280m053J323L584M4l902k66K598M78j317k54L49m48j40J600M49k999q17L287
703G96K275l224k720K179L307j468k366R21J559j81r61Q62m48j675J033K363r52
720A300l631Q3L632Q96l858j251K694J672k148j203J133L55k96K64J313j845j134
$$ y = [-2123, -1714, 462, 705, -598, -552, 176, -210, -328, 1542, 858, -1298, -1318, 1314, 2973, -511, -2378, 137, 2263, 847, -1107, -12, 786, 310, 53, 824, 97, -1563, 120, 2073, 861, -2157, -1383, 1949, 2107, -1436, -2147, 461, 1400, -281, -759, -227, -423, -731, 585, 861, -1487, -2904, -98, 2132, -755, -3244, -1068, 2195, 942, -1474, -1143, 880, 773, -462, 566, 645, -757, -253, 2258, 1900, -1669, -1779, 2119, 2919, -393, -2601, 258, 2467, 481, -1223, -146, 500, -309, 562, 1117, -170, -2112, 441, 2812, 1280, -2773, -1450, 2134, 2178, -1724, -1990, 608, 1086, -231, -485, -136, -584, -724, 876, 1325, -1674, -2491, 796, 3071, -153, -2873, -694, 2613, 1145, -1221, -300, 1259, 1078, 117, 979, 531, -1144, -111, 2252, 1300, -2331, -2248, 1384, 2280, -1578, -2829, -135, 1537, -611, -1814, -681, -326, -622, -358, 955, -890, -2024]
737b024K025K123k054k916J818K954q58k758o0K567j16j572K43L18n74j27J758
754G47P2k193j11K712J159k919j875K772K378j726k334J333J553o61p12N49j44
771F00j665J384J370j117k495J049K728l60k862n62K485P34j844m74J101mm72
788d04P57P16j443q94K031J121k553j078J564K170j450k002Q91J279p6j116q7
805e74O02m88r0J075J22j583oJ824N46k261r23K459J015j896n57Q53J066j077
823A07o49O17j16r04L42J357j163j393Q75J862o61k063N69J989k56j509K13J229
841D46o8n09K34M64p58m58J108O38j069q59R66J218j335j163P13J428r11o57O57
860H5P40q97m68J158k26n78j80J363l00j342J62J301Q4j121k77P29J31n36k31
$$ y = [-2024, 1, 2124, 70, -2846, -1028, 1926, 1068, -1690, -1750, 817, 701, -871, -628, -310, -884, -1011, 747, 819, -1374, -1485, 1227, 2386, -533, -2408, 364, 2742, 1016, -1318, 15, 1568, 907, 195, 744, 600, -1065, 319, 1689, 572, -1923, -874, 1854, 1494, -1368, -1930, 555, 1289, -555, -1029, 72, 68, -404, 353, 1069, -374, -1268, 763, 1884, -669, -1747, -183, 1987, 537, -1465, -574, 705, 629, -487, -574, 28, -460, -550, 525, 647, -936, -942, 882, 1428, -833, -1756, 703, 1718, -178, -735, 118, 1184, 107, -542, 75, -41, -945, -603, 754, -409, -1802, -927, 935, 274, -1789, -1220, 769, 513, -996, -783, 446, 378, -131, 103, 567, -191, -649, 459, 1097, 28, -831, 135, 1353, 18, -1145, -432, 996, 85, -572, 85, 825, -72, -540, 618, 392, -186, -366, 997, 697, -645, -483, 818, 902, -219, -496, 233, 364, -172, -403]
879d03N92j14q49L96R05o36q11P31N87k91r16J99J202m78p06N32N44n8q08K94
899h8N63n08o94R01L19q71m49J063J45p67k72N63N30p41j44M75K29n02l33P52
919A71K2o67K44N41m1m63K36R4J44m68K1M55J28r02L13N52n06r6J37L95n81n0
941c21J0N86q3o20N03L15l76k14K16J28j48n48K89Q57n29k41N17j27l33j14J94
962c9K83l03l40K15J32j97j5J76K29r4j37L7J54k87J37L69k72k85L72N1m36M54
984B04j85J00j03j12N0M47k30m03M22r3pk40J33j4j40k6J73P7l87m8R1K90P4k88
1008b15L19m62N64j96J86J5Pm67K45J66j55k23J28J29k08j13J9J52p8K75p1p6
1030e9p3J48M3j9K0K21k10J88k28q1L92k77J46k58J10k3j57r2K39l07lK40j58
$$ y = [-403, 189, 75, -774, -378, 527, -109, -920, -189, 398, 107, -809, -610, 592, 114, -592, -60, 484, 426, -382, -88, 475, -33, -727, 174, 493, -378, -827, 236, 381, -386, -658, -95, 435, -306, -450, 25, 254, -248, -581, 171, 193, -474, -230, 311, 270, -193, 43, 137, 281, -187, -166, 289, 417, -485, -172, 380, -126, -222, -85, 310, -271, -321, -311, 275, 192, -428, 75, 390, 14, -200, 16, 144, -4, -552, -263, 594, 65, -176, 341, 214, -119, -233, -39, 244, -59, -399, -184, -52, -249, -264, -88, 141, 47, -90, -53, 101, -186, -49, 320, 48, -237, 135, 186, -250, 204, 19, 119, 16, -96, -46, 401, 171, -232, 190, 97, 90, -150, -17, -31, -171, -197, -24, 53, -334, -382, -291, -1, 73, -215, 104, -358, 206, 10, 196, 211, 218, -249, -4, 162, 7, -216, -88, 41, -167, -280, -261, -109, -187, 88, 17, -59, -132, 16, 59, 40, 60, 281, 71, 259, 31, -50, 342, 65, 211, -47, 63, 40, -117, -209, 30, -277, -280, -40, -198]
1053a98j68R8J39L3q9oK42j49O7R4Q0L5J17j06Q9j45N9l9j52q2K7P5p9j35K86
1078I3r6J67n92K45R3Nk2j74L16M3n5N2jK42j80n1K63K30l21l36J16Q3k75n5m7
1103b57J4j77J87j08K02m1K32j24J21p4J39J26j28j56O9M12m03K56n7k0N1r9m52
1126b87L08j7p3j2l2j16j18K03J89o9k13M62Qm5k0L26Lj85m47L19M65l11k32K87
1150C93l12j88l19M51j61l23J4M76l22k39K29K75J71j65q6O11l22k68L00J33r8
1171B50k55j17M37l17m07L35M28m76j85O5K04M8l18l6P06k72n29N05L81p52m5
1192c50N82L97m39m93Q67k30l78l30Q26op94p1N32l23J48p1K15n52J36J42Q34
1213F42n53p93L62O80J21o37P1O92k25n98K44M09k45m21N91J98n58n09P75Q1p05
$$ y = [-198, -366, -268, -129, -96, -185, -191, 51, -98, -31, 63, 143, 178, 295, 189, 278, 133, 192, 153, 1, -81, -54, 21, -58, -193, 93, -3, 164, -428, -183, -90, -85, -107, -281, 35, 78, 23, 75, 74, 316, 136, 85, 348, 578, 257, -79, 37, 120, -155, -210, -257, -243, -420, -233, -341, -139, -180, 52, -72, 49, -25, 114, 240, 112, -44, 25, 437, 34, 290, 233, 213, 264, 165, -287, 21, 4, -69, -81, -113, -229, -347, -144, 45, -24, -237, 225, 233, 188, 168, 494, 497, 312, -135, 184, 649, 338, 106, 393, 81, -107, -426, 25, -136, -459, -445, 31, -291, -530, -301, -26, 145, -20, -106, 505, 183, -85, 215, 348, 250, -5, -122, 315, -2, -409, -74, 354, -122, -307, -242, -38, 10, -308, -344, 362, 90, -439, 66, 447, -305, -350, 232, 629, 190, -303, 564, 334, -44, -374, 452, 446, -348, -419, 113, -210, -62, -133, 82, -470, -334, -192, 642, 89, -704, -342, 338, 459, -178, -107, 585, 360, -238, 6, 415, 170, -251, 340, 538, -20, -529, 246, 327, -378]
1234c78l09P73J79n20n02J128j08n16j19N61L02n39k31O55J38n18k29Q83J33j180
1254c97lP54j80o83k19P29J44n69J76L94j87l15K46N06l03o21O23P82q29n23O57
1275A82O68o11q35M21O98l25m73N9M64m92j85O65K03q98k87J201K36j090j96P31
1295A36O18q17l46P49J82m53j44N79m27l76L94P28q39o24j5J063L6j235K31R58
1315C98j54q84J33O51j69m08M81M71q01l42Q94P58j072r25J138O87r33n98J31
1334e44R90m77m92M72O16j027J29O10J17j154J43J401m1j206P9R71J96j048m59
1353g24J042L87q20j74P60n58m39K97O18n89p70Q13J061o68j135M54J063l56o68
1372d06J31N51l15J65L6M73p04j96O88K87p91p30J167N06j088o22Q54P78p79p36
$$ y = [-378, -687, 86, 265, -255, -757, 371, 263, -253, -372, 189, 491, -48, -279, 376, 514, -4, -233, 650, 783, -397, -400, 354, 174, -509, -728, 1, 145, -424, -248, 146, -41, -356, -110, 396, 93, -528, 95, 877, 48, -475, 182, 850, 239, -596, -175, 523, 198, -275, -216, 248, -244, -429, 236, 439, -459, -746, 455, 691, -399, -595, 136, 754, -63, -409, 340, 522, 69, -75, 504, 77, -299, 95, 823, -16, -640, -655, 408, 444, -791, -560, 398, 244, -640, -507, 144, -25, -433, 48, 519, -282, -624, 270, 1028, -44, -969, 169, 856, -77, -675, -544, 446, -31, -523, -51, 565, -462, -333, 277, 394, -760, -617, 784, 743, -463, -384, 587, 783, -265, -724, 318, 705, -115, -289, 471, -87, -526, -229, 389, -200, -970, -157, 904, 236, -899, -445, 618, 262, -406, -275, 276, -39, 126, 162, 635, -69, -265, 423, 710, -81, -811, 356, 862, -226, -848, 6, 784, 5, -731]
1392g31O32J85m35M20N39n86o53P40P66m64j414N42R50N7j201L5Q53J36n50M5
1412a34N34q41K69K48L54o94o49Q89Q74j065p98N26J247m24o94J36P71k29p61
1431d41Q94k11m06R0Q03q1r86l02J372K08j320j91N28P82q14l30L69L44o34L89
1451F3p0n1n24N84L76j25r60L15P73l33m63J13Q61l90n00K1N69m43j31N27K77
1472D89m59m81O35N28q15n17Q48L70o47n49Q28n7k60RK81J64n47K1O60k19r84
1493g02M02N84pq47N5R92k47l29j89N20J18m52K48n0o8k01K98L68l93m44L06N39
1515E01k30o98L05N69M7p60L06K81l27j21J04K26m22k47Q57K8n13j35M10K48k65
1536A64l24Q6K48m85L78R2O0j45J98Jm0n33O4N33p6m25K54K1M58o30R5J25M3k20
$$ y = [-731, -99, 86, -349, 71, 610, 24, -629, 111, 877, 413, -1001, -459, 491, 548, -653, -618, 235, 371, -179, -134, 400, -441, -172, 76, 430, -264, -913, -24, 850, -215, -1013, -487, 760, 336, -358, -222, 549, 320, -441, 453, 242, -164, -74, 729, 648, -338, -640, 732, 940, -380, -571, -43, 739, -75, -405, -36, 308, -326, 63, -7, -58, -582, 2, 378, 253, -707, -392, 381, 48, -415, -302, 559, 169, -331, -310, 259, -184, -315, 212, 489, 30, -451, 184, 712, -103, -620, 228, 598, -49, -598, 230, 173, -87, -78, 203, 367, -180, -159, 501, 282, -702, -300, 284, 277, -570, -515, 477, 230, -99, -288, 232, 350, -102, 146, 96, 28, -173, 125, 493, 100, -344, -38, 501, 271, -427, -122, 447, 494, -266, 40, 321, -6, -127, -23, 203, -219, -466, 391, 419, -94, -229, 181, 429, 164, -160, -74, 174, -311, 67, 159, 219, 74, 272, 273, 233, -300, -236, 297, 221, -204, 50, 71, 529, -101, -6, 119, 162, -58]
1560e8j66N39n09N6K47L13m75k40L51J32l91J8O17k23k37KJ56j77ok00N3K30l68
1583c36J05L98j44l55P5M55j26j26j03L50M5j56%P5j28j75K04J68j13o90L68P42
1605E33l22m45L47L8j13o0K9L5j34L2l4J93k03O9J42l1j71qL08K9l61J55M3k88
1629b17K63L1k42K90o6L38k03k60M9j68L73j35N0l1p9K05k68k24L36P9Lj78l2
1652h6K59k52J08m6j77N02J1k09j11K69l49n9K84k57J79K43k55k26Q1P5J23j12
1674el21j8L57n3N4J77m07Q5J60k22N09m69j2J33Rn8K56O7P1j41%o3Nk21M82l53
1700B2l87M23M4k10j58N74j23m11K97k38K92n1J29k27K20l57J53J97j54O0k58
1721a63J99J10p5j78K27P0k89J33j24M6J81l34L96j9j15l2k1L0J58k57M05k73
$$ y = [-58, -224, 315, -194, -138, 109, 422, -53, -293, 58, 190, -201, -183, 434, 211, -26, -24, 132, -45, -51, -251, -198, 32, -336, -231, 167, 23, -332, -257, 198, 72, -54, -157, 193, 238, 82, 82, 157, 29, -146, 58, 226, 113, -577, -209, 533, 211, -234, 113, 151, 38, -22, 7, 42, -92, -60, -94, 99, -104, -35, 107, 76, -95, -103, 205, 234, -127, 28, 71, -217, 46, 77, -165, 125, 59, 397, 194, -66, -17, -185, 188, 53, 103, 72, -7, 198, -70, -294, 42, 121, 124, -54, -86, 173, -79, 29, -17, -194, 308, 319, 110, -1, 268, -81, -140, 144, -113, 66, 309, 54, -172, -91, -16, 107, -5, -326, -344, 13, -40, 14, 191, -216, -131, 29, -193, 316, -153, -165, -32, -23, -81, 175, 242, 313, 172, 172, 109, 114, -107, 375, 22, -365, 58, 102, -108, -266, 308, 185, -226, 71, -167, 125, 74, 203, -24, 196, -161, -8, 189, 35, 95, -163, 36, 146, 71, -107, 120, 190, -99, 34, -90, -44, 137, -197, 199, 180, 65, 33, 12, 42, 200, -57, 348, 75]
1743G5j71M07k21k7p6K56l8j28k37j73L43J03j38J11K26k73J05k21K62j17l9N5
1765H4K94m38N7O6p4J82m34N65j41l80J37l2QP7k35J73R2j63l6K28k32o3J89k22
1789b98O61k20k46K70k7j98P7L50m76L35n4j69j77j11L55k09N6j21R2L91m42J01
1811f0k88M14k99J86p3O9k27R2L69m9N5q3M9Q5k52k29J30L47n53k34O00J95m61
1834b17k05O15q1l88Q0L88k15j2j35M87r4q6k35K66L48o13K61K56j92k62q0J68
1856E4O0n02J83L66j72l10N00P7n71J60M37k02k16M50m23J89k56k30Q28m3m31
1877e2M02k00j06l56N1L74K3j48k34J99k11k62K20L80l81M1N35K33m80o22O04
1898A0J61j07k47L84K33o82K59r4M04j93j39P0j06k03j64N84Ll84P3M31r3q5j76
$$ y = [75, -96, 311, 90, 63, -13, 243, 205, 77, -160, -333, 10, 113, -25, 86, 312, 39, 144, -77, 185, 68, 29, 84, 378, -60, -3, 63, -11, 171, -263, 302, 161, -219, -82, -114, -106, -29, -264, -91, 1, -162, -198, 30, -202, -265, -76, -298, 363, 143, -103, 167, 140, -58, 19, 369, -107, 228, 174, 5, -172, -283, 72, -137, -81, -202, -110, 281, -161, -60, -348, 66, -233, -47, -120, -51, -278, -186, 183, 134, 189, 106, 155, 240, -12, -241, -111, 236, -317, -551, 49, 244, -217, -422, 193, 112, -276, -196, 192, -23, -35, -170, 317, 223, 137, -98, 168, 516, -97, 164, 420, 228, -34, -114, 54, 114, -388, -205, 161, -11, -321, 179, 256, -315, -155, 282, 80, -136, 314, -109, 80, -176, -406, 422, 379, -52, 350, 150, 44, -312, -261, 113, 136, -12, -246, -47, -258, -520, -300, 80, -301, -260, 275, 508, 28, -594, 10, 171, 64, -183, 201, 434, -248, 11, -83, 321, 128, -11, 59, -47, -250, -414, 170, 173, -211, -138, 293, 200, 115, -61]
1921f1K42J75n40j38Q70q8l00j85K11K7m26L17J22K30n08j49N88l95m11K51N32
1942C64m51lK11Q1l65j5L79K56o28l8K49N52l67m87M21R7l37n41Q78k58k32O8
1964a66M2K5k60o2L61J21k80N4K27k46O3M0L48l02k14L71j36L01n27K29J41j72
1986d2k01M52J46m67j94K79K16l02p0J61K05m27q1N53P1m20qK41J15mn42M28L09
2009D18l42k43L31N3l31K37l81O66m29j43L38j12k25M4pJ91k63J47K17K0o71O95
2031B10L63m47k59L24j3m84J52J51K63j4p06J16N70k81m02L28O04k47n39L88L17
2052C94l82l40M74o7j47J4J37L48q01K30K34J57n53q1L57M05m36n21O42K2k54
2073a68k18L33P6l74j06P11k77J7J77K04n05J80l47R03p61J39q6K15j04l13L04
$$ y = [-61, 181, 356, -184, -322, 548, 460, 160, -25, 186, 213, -213, 104, 226, 456, -52, -201, 387, -8, -419, -168, 364, -87, -90, 121, 202, -163, -178, 201, 457, -171, -209, 40, 592, 225, -262, 159, 256, -81, -622, 256, -2, -234, -166, -124, -99, -359, -421, -60, 61, -219, -165, 62, -184, -121, -81, 267, -35, -249, 122, -14, 287, -240, -11, 130, -42, -243, 209, 355, -112, -306, -27, 189, -113, -183, -22, 183, -244, -325, 228, 299, -121, -129, 112, 227, 223, -319, 109, 418, 76, -167, 164, 217, -114, 123, -258, 408, -21, -164, 174, 62, -163, -119, -126, 65, -198, -51, 166, 186, -485, 210, 573, 126, -133, 191, 178, -306, -154, -3, 260, 246, -460, -344, 226, -55, -457, -129, 475, 228, -311, 77, 394, 12, -328, 146, 79, -68, -54, 83, 431, -370, -140, 94, 251, -302, -383, -26, 379, -57, -578, 64, 86, -168, -386, -53, 23, -351, -457, 254, -23, -6, 171, 375, -130, 50, -297, 606, -155, -16, -102, 113, 9, -304, 0]
2094@K83n93M1K13K01k62k28L71L02k92m00L34L79k53j12m3M17k59k98M63l04
2115d0o7l34R53n38l54K00J36L48k89k65Q8K78k13n0L07l06J41J83K9n62J13N20
2137B78K6l58j63J12L99p2n47M28J01L4k66K26j4m26J40N4J99n21j84M73M58o82
2159c05k19M98K18l14J16j10L57l10o4K84R7n35K50K17R0n07J47N39j55n25L42
2180A11j10P8J94l01o1Q8l0M6Q6k97K55j14N10m33j47K03J57j80k08M2Q1j01R7
2203c4r9J75k5k97K43J45j76n08Q24p2o18J55K95o1l4M0K72j54k04L98k25ml42
2226c06L16M70k71l28J74Q4J73q2l10J37J95k47j29k3j4j70O42k68m01K92J86
2247A20J85o08J70p6M63l9q4o2j09J33j84L17m1m82K74J39j51m5k88N08L57o07
$$ y = [0, 283, -310, -269, -56, 145, -117, -345, 26, 328, 36, -364, -30, 349, 96, -16, -59, 358, 99, -199, 264, -40, -107, -441, 512, -26, -380, -180, -44, 304, 15, -250, -162, 116, -97, -147, 160, -146, -5, 178, 207, -355, -242, 278, 304, -54, -217, -105, 294, 222, -325, 103, 204, 238, -28, 198, 184, -242, -102, -48, 151, -370, -554, -81, 377, -305, -524, -26, 192, -122, -6, -116, 241, -69, -133, 151, 248, -287, -37, 180, 270, -237, -90, 449, 294, -231, 111, 1, 79, 273, -28, -89, -1, -31, 15, 101, -196, 59, -55, 455, 22, -125, 78, 235, 55, -153, -111, -30, -131, -34, -133, 42, 17, -280, -37, 108, -68, -576, 248, 176, -442, -287, 8, -53, -87, -47, 225, 71, -133, 265, 40, 36, -306, 10, 480, 209, -119, 55, 139, 312, 230, -80, 57, 252, 5, -124, -147, -161, -331, 311, 43, -358, -66, 120, 305, -303, -133, -209, 254, 215, 131, 69, -40, 93, -91, 226, 185, -297, -23, 116, -35, -80, -368, 140, 497, -110]
2269a10J6j04M1J12o2J23p6LJ6j62K21j50M13K09k81n74JL59Q0k59J2l0K06L1
2293C5J17j44j21m8J59J3J23l85L12J7K03k71l59L16Q9O9k15K81k97L90j47k19
2315h2j58J48J98K61o12L70Q6n1j88q7p8P8K03QK52m50J84j9J38K7o21N88k47
2338e2J89k58K34m49M31Qk82M39j90j59N74m09k31M5K98J52k38k45j4K59m4q7
2360b9o5l4L20j23j41m6J76K76l45J5o43N94K6J92l32k43J60L56k91M2k00J87
2382a48M57j88j00j62J11J42P8j64j88J11m5K72n75L50l03Q17j38m07J40p6K47
2403B31K25m55k58L29q8K93k45oQ9J02o06M78l78J61j31M56K0l42k2M39k46q0
2425c4m72P20n1l57l6p8L63q5M9l33L22j66K80P7j55j20j92N30k38k70j89L11
$$ y = [-110, -94, -198, -157, -45, -107, 16, -60, -57, -41, -203, 18, -132, 281, 490, 209, -365, -364, -5, 75, -184, -172, -202, 4, 35, 152, 8, -113, -161, -2, 11, 134, -251, 61, 78, 281, 10, -349, -33, 56, 125, -90, 191, -106, 284, 137, -82, -240, -92, 106, 367, -245, 125, 211, 160, -28, -115, -193, -115, 88, 96, 348, -102, 82, 63, 201, 228, -393, 195, -52, 137, -121, 113, -336, 95, 103, -179, 260, 70, -89, 485, 76, -155, -110, 188, 340, 102, -143, -157, 102, 58, -29, -94, -128, 192, 69, -72, -118, 58, 334, -11, 4, -639, -45, -19, 173, -159, -402, -242, 114, -177, -135, -335, -148, 309, 121, 21, -141, -30, 112, 190, 26, -162, -51, -96, 176, -399, -49, -352, 465, 327, -80, 60, -16, 231, 456, 1, -257, 72, -16, 277, 32, 26, 115, 217, -389, 89, -289, -128, -259, 197, 217, -125, -147, 292, 46, -34, -506, 214, 163, -194, -230, -308, 55, -30, 19, -314, 8, -158, 122, 199, 44, -76, -268, 262, 24, -246, -435, -124]
2447a24L34k86P1l89N03J3k17J45l53K16M34j44k03n64M53J23K52j98n75N75J85
2468B51j05l9l06J45j65M34k14j53p7N30k28j3k02k36M49J31k49j05J03K41k53
2489f1p4j47kL02L65n4m66j55J44L98j38k82J55J57M3l79q7K68J43Q7j49m59K19
2512a72K59K01k88j77k81P19Lj17k21m7J85L20m79O0K34j63K0K23m84p8O61om12
2535d0j01j67K04J86Mj97j84L33J0J18j78N8j37O05k32m23k00O51O7l87j92K15
2557A3m8K76J29k52k70J22K7M2j78l31O53j57P3j31j45L49J72l58J6j48L6L19
2579B09P0k52N4l42K85k81K70j21M9M02l39j03N0p3L24l45K64r5k03M85o8l71
2601a31j51J34O03m86j91l1K58L07m47k4p4L49J67k87k1l49K54N13k80l19k82
$$ y = [-124, 210, -76, -5, -394, 109, 122, -95, 50, -303, -87, 347, 203, 0, -564, -111, 12, 264, 66, -509, 66, 251, 146, 107, -199, -54, -219, 215, 1, -152, -229, 301, 73, 60, -142, -378, 71, 202, -47, -152, -49, 192, -61, -135, -282, -284, 18, 383, 329, -137, -292, -148, 250, 112, -170, -15, 142, 185, -194, -281, -13, 130, 217, 68, -391, -172, 87, 288, 0, -177, -458, 261, 264, 147, -74, -121, 64, 384, -95, -35, 199, 36, 56, 279, -205, -283, 378, 372, -40, -141, -308, -104, 82, 86, -111, -295, 38, 48, 166, -12, 46, -91, 514, 282, -141, -341, 310, 377, -10, -202, 13, -35, 241, 370, 118, -152, -30, -3, 39, -139, -470, 183, 26, 99, -32, -177, 172, 344, -14, 2, -146, -110, 209, 279, 27, 81, -261, 24, -257, 13, -108, -59, 343, 4, -99, -49, -122, 202, -143, 121, 26, -177, 308, 240, -131, -282, -148, 455, -31, -222, -253, 5, 312, -135, -159, -233, 116, 283, -4, -25, -374, -120, 393, 113, -206, -488]
2622d88Q02J11l29k12k18M82n9j58J91k47J17J08J95k80n1k8N24Oo04n55N43N30
2644C80l76k51Nj5L68Q7l63j42L21K60o9j58k59J05L22L4l89m21P09J85m56J58
2666C5J8N6k59K55Q0n65J69L80J03k11p17O90K90j99n06J80J91K81k31n5j62K51
2688G4K14k9k08m29J96N79k10k56k04M45J59k73k58M5J47R1K0J16o66J99M52J55
2710C59k79m64K83L00J60o05m7K02K68n67K73l0MJ08M00k68l54o1Q00J60p39O2
2732c5P0L07l5l64j16L4M11p1km49K20k13O84n71j32j84M58q3p8j8L51L20k45
2755B59j39l13J43N6M59n44k17K47J32L04m32l34L75J85L51m84l53J62M03k65
2775eK1j25K64j36J63J5p37J44N49J99o41m6K24P42n74j51J12J2N8n5k19J55j99
$$ y = [-488, 314, 425, 96, -116, -334, 148, 89, -69, 122, -125, -8, 100, 295, 15, -36, -64, 460, 466, -138, -693, -150, 380, 4, -247, -242, -257, 111, 198, -165, -307, 14, 274, 205, 47, -212, -107, 215, 249, -140, -561, 148, 333, -123, 35, 53, 109, -150, 105, 185, -380, -211, 169, 272, 61, -656, 34, 324, 125, -381, -201, -10, 271, 40, -15, -177, 74, 288, 259, 51, -378, -182, 397, 187, -69, -273, 172, 331, 58, -200, -155, -8, 83, 103, 219, -447, -248, 204, 359, 80, -384, -101, 199, 359, -246, -293, -91, 177, -390, -117, -147, -143, -35, 365, 97, -257, -318, 482, 642, -97, -35, 35, 342, 307, -57, -173, -139, 272, 201, 199, -250, -30, -243, 441, -130, -262, -446, 12, -71, -149, -167, 184, 504, 259, 120, -193, -50, 6, 465, -79, -296, -49, 83, 387, -45, -379, -4, 181, 532, 48, -305, -143, 260, -5, 16, -109, 155, 19, 182, 197, -540, -396, 153, 352, -289, -335, -111, 631, 57, -94, 18, 30, 88, 33, -186, -31, -230]
2798b30M67r3k65k51K01M40j04k94O0J10p0P6j76O7k0Q1J15N5l75j72O55j89m
2821H4m66K77K83l12Q2k0L73m38J31Pj37j19N0O10l52l55J17L31M7J80n47J03
2843g1K43j11R9n83M51JM2J98n05j43P87K3k47o03K10N58k35l78k5K66j6j6R2
2866C7Jk80jL50L01o25K94K69k3m15n6J02K29J15m43J41j69M76m52K14m39O8p7
2889c83L35K87p19P7K61J83Nj18p2L13K44n23o3r9Q1N31k35J43k02J00J92l14
2911B4j52j65M37k4k16j20J56K9L66l92j14j3M39jk13m15K15O32l17p9l8l85N58
2934B12L7l68J27m15K91M26k55r1k36R2L64m2m18J59k1J80m3m0l6M8m2O6j8j70
2958a93K65j79N46n00O1m4L8J35l48J58j29L20j45R3J45j71n3K45k24j85K74q8
$$ y = [-230, 237, 144, -121, -372, -171, 269, 165, -129, -69, 41, -29, 47, -129, -62, -82, -1, 114, 169, -206, -378, 277, 88, 84, -382, -105, 178, -134, -52, -72, 301, -137, -6, 1, -136, -255, -205, 405, 53, -302, -185, 146, 193, 373, -174, -71, 172, 61, 160, -423, 28, 29, 71, 269, -236, -379, 408, 431, 184, -419, -209, 349, 114, -264, -289, -23, -39, -55, 37, 38, -242, -243, 107, 408, -217, 77, 346, 323, -92, -148, -46, 183, 298, -145, -4, -173, 303, -149, 65, -374, -306, -383, -48, 239, -480, -403, -142, 41, 46, -72, -144, 169, 413, -110, -173, -272, -191, 340, 105, 248, 46, 146, 338, 24, -128, -293, 144, 120, -96, -216, -60, -31, 335, -57, -171, -184, 255, 254, 41, -374, -159, 473, 156, 77, 39, -346, 212, 249, -119, 8, -407, -116, 310, 55, -36, -272, -180, 184, 142, -276, -117, -138, 42, -1, -41, -77, -29, -71, -5, -23, -193, 72, -107, 439, -61, 0, -44, -6, 129, -219, -61, -190, 130, -15, 78, 223, 52, -1, 244, 20, -165, 109, 21]
2980B1L14n96K03l77P68k02l17K09J30K3q9l1k43J24K43j68l98K18L86m1o2j47
3002c2j26j0L82l88j7Q0j03J77p4J62ll19K56Q2l05J11n7K91k77M45l54L7j06
3025a48L40j28n4mjL17m96L8n0N02k67j73k43K69M22l21n7J61o0k17K04k06k05
3048c77P3L51oj24J11K14k19L38m05p8K34N4j24m4K53k70j74J44j29K21J52l18
3070a23J35n1J12j89K24L43m16l5q5J43J66K28o39m0J60j84J49j1J37J71q1l00
3092a86K51J38o8j78J81j82Q6j1K11l56R7J36k14J46K33l38K40k88Q3J52l77L06
3114F2o1K03l29L9R7q4L94l96K33k33J08M8k66m4Q9P1j39K72k25n4j57L22j19
3137a69K88k2N9R8r4m37J61N68m96r9Q2L0O0N7o1l59K4N54n0k24k12M7L37M16
$$ y = [21, 335, -261, -58, -435, 333, 131, -186, 23, 153, 176, 87, 56, -187, -63, 180, 12, -386, -168, 218, 177, 115, -32, -158, -168, 214, -174, -191, -111, -214, -37, -111, 51, 48, -271, -15, 67, -238, -127, -184, 107, -170, 275, -79, -42, -148, 192, 64, 10, 6, 5, 322, -174, -136, -186, 316, 49, -124, -367, -98, 324, 3, -54, 107, 47, -170, 34, -172, -377, -304, 47, 41, -83, 28, 242, 23, 361, -44, -122, 112, 166, 42, -2, 251, -19, -193, -49, -178, 43, 195, -123, 12, -39, 73, -116, 108, 451, 35, 0, -85, 58, 224, 452, -187, -227, -67, -251, -102, -113, 24, 195, 114, -186, 65, 203, 135, -43, 138, -44, 42, 31, 242, -114, -17, 119, -95, 51, 284, -54, 186, -102, -19, 133, -244, 62, 1, 204, -125, -86, 11, -73, 321, -75, 158, -75, 33, 81, -185, -229, -140, -69, -208, 64, -161, -215, -372, -50, -169, 119, 97, 156, 254, 160, -277, -116, 452, -44, -143, -61, -31, 29, 86, 25, -334, -310, 244, 194, -30, -242, -195, 142, 558]
3161E58m73l08J66K42J28m00r7J19J44Q0ol01R3j48J0J79l28K33Q1P6q9K7j91
3184b05n9K00j26J44L2j26L88p6k31O0K34j07k61J35k66M65j36j99K68k5Q8j69
3206B8l15J87R9r5nL2k7J82q8k45jK30Q1r0R9j43j65m8L27j62J30m8j61J43L02
3231B47j48k06k21N23Rl69l0J38K94j70Q6j43J70K05l96L2j99K06J52j07j62L73
3253B84n07N18m03K23j40j59K31j4j62J94mNJ00j79q7j40M08j5m11J60L26m57
3275b29N20k38J80j52l09J98N28n61k44K29J72k0q8R7l54N96m98K14K43k30k36
3296a82O17m47p8j61J85J93k96L4k03L70O5j93J27l2J17l62PL50m18K80L3K14
3318B20o95M64K8k25K8J65J05k23K9k8L26n36K89L42n7l84O5j6M9P9q4J09k61
$$ y = [558, 85, -223, -57, 185, 313, -87, -184, -65, 79, 159, 153, -148, -55, -203, -193, -14, -342, -109, -28, 48, -41, -14, -205, -264, -64, -190, -46, -14, -140, 248, 172, -59, 1, 235, 128, -133, 2, -264, 201, 65, -134, 134, 109, 197, 28, -287, -100, -1, -96, -101, -69, -96, 86, -2, -247, -248, -18, 63, -27, 72, -71, -236, -284, 43, -119, 11, -37, -198, -55, 247, 99, -107, -328, 195, 204, -165, -195, -57, 237, 67, 153, 10, 180, 385, -11, 21, -178, 28, 180, 73, -89, 284, -223, 295, -108, 115, -25, -184, 47, 33, -129, 65, 61, 66, 166, -13, -100, -240, 168, 153, -258, -98, 228, -229, 291, 53, 233, 81, -228, -30, 498, -63, -307, -78, 94, 74, -14, 83, -271, 325, -173, 41, 284, 54, -182, 435, -12, -90, -251, -66, 127, -169, -135, -338, 32, 97, -96, 31, -1, 116, -246, -239, 111, -307, -27, 6, 220, -475, -11, 17, -208, -180, -15, 90, -133, -104, -132, 194, -342, -53, 289, 232, -152, -87, -103, -54, 25, -59, 50, -211]
3341b11J8J20k00N62Jk99r5J64j40k16O64l19L7j95J7K01j17k9J37j18J03J19
3363B04l19M79m45K17k79K29j87r4K03j84O4j59L25N9l52L15j23J99k12j62L51
3384A29k13M7N6J01J58rm10K47j79k57M18J86q4l53J3K27K71o28K20K18j14k28
3406a84K13j02J50j98K50rj00r2N1J54l43M68j73l08QK07O3j26j86M70J1l27J71
3429F8j98J42j06o2K53pJ67k41j40K52o8j71L36k36NQ5J00J57l03m1Q9r5j28J3
3453a29J88j00L0m8M4k6j70L84l23M20k98J3J76m9j94q3M25k86Q4K2K94j62j00
3476A12K2lJ20l26K22J63l3k20k20J34J22j75J58L2l40K08R5J15j33r0J4Ro2l2
3500a08J31K16l94K27Q5j67J48l41L45j12O5PL54p64M16l71J16K03l9L9k76K53
$$ y = [-211, -193, -73, -273, 289, 290, -9, -104, 60, -80, -296, 368, 49, 86, -109, -92, 109, -8, -37, 100, -18, 85, 204, -115, 364, -81, 136, -143, 86, -101, -195, 8, -176, -112, -271, 54, 113, -239, 76, -47, 152, -60, -222, 129, -84, -37, 19, 120, 278, 269, -141, 106, -73, -330, 88, 274, 190, -163, -150, 77, 348, -280, -60, 158, 44, -184, 29, -73, 77, -121, 129, 120, 20, -72, -21, 133, -210, 258, 85, -223, -215, -8, 55, -71, -257, 213, 224, -103, 68, -130, 12, -94, -156, 97, 90, 257, 16, -124, 128, 60, -111, 225, -11, -6, 79, 179, 336, 33, -8, 81, -14, -142, -129, 59, -41, -11, -59, -15, -41, -211, 173, -150, 270, -28, -15, 161, 112, -82, -165, 260, -26, 58, 80, 374, 212, 112, 134, 131, 251, -75, 147, 310, 277, 57, -163, -29, 93, -82, 76, 108, -232, -24, 71, 186, 53, -37, -23, -14, -76, -108, 23, 239, -155, 72, 157, -10, 138, -203, 142, 30, 95, 102, 456, -308, 108, -263, -147, 56, 17, 56, -220, 33]
3522C3kk17L66O0l23O8J41km52J06K68j04p0K12n0j62o6L03j82l19K09N9j54L80
3546A02jo7k16J77l9J07J21l26L83j99l39O52k00p2k53K83k50L43j91o7O3N8k1
3569D8l3L7j22L29l92RK12J2K8j92K57K7l33R3L02k30l8k62K45j35J17L45j50
3592A74n4l46J02J97j38j18L86o01L96K47j1q0q3N8k61k7R2K11K09l46l6k11K89
3615D9k38L31k1k00N9M8Q3q7j24Q9l9l5j0O6K34mk14J34O5k61j04k8K91k93J45
3640f4k08L10LK6k03n1l9K81o3J68l92K62k21L63l26K72J8j12K11k08k14J46J03
3663F2j44J03K89n03K47l7J8R3k37N01m68L34l31N3j28J82P8L42m09j22K6J54
3685A03J14j38l78L31r1P3L4j28ko0K06j69J14J93l53Q4K40m77O44o95M08r4j59
$$ y = [33, 31, -186, 180, 240, -83, -15, 126, 124, -328, -222, 46, -58, -128, 84, 34, -128, -194, 109, -73, -392, -183, -124, -278, 102, 101, 34, -182, -5, -44, 63, 184, -142, 241, 42, -297, 355, 155, 83, -170, 113, -137, 206, 15, -52, 11, 69, 48, 15, 52, -70, 259, -133, -124, 88, 100, 128, -64, 193, 220, -113, -20, 282, 52, 14, -248, -3, -138, -21, 324, 174, 120, -226, -124, 73, -65, -183, 203, -398, -2, 245, 234, 154, 71, 129, -132, -159, -67, 144, 353, 7, -29, -240, 49, -189, 142, 121, -79, -20, 28, 111, 24, -100, -11, -50, -85, -95, -29, 205, 201, -13, 121, 186, -75, -179, -207, 84, -209, -64, -272, 38, 41, 67, -136, -187, -226, 55, -8, 160, -232, 30, -191, 172, -154, 118, 136, 24, 235, 27, -187, -41, 62, -82, 21, 310, -193, 54, 17, 35, 128, -109, 392, -76, 258, -73, -20, -148, 34, 112, 454, 45, -77, -51, 103, 217, 79, -299, 32, -59, 14, 48, -80, -82, -142, 64, -105, 9, 202, -151, -67, 173, -304, 340, -355, 53, -41, -200]
3708b00K40j94K15k06j72L63L6l8k53K04j82L35K4m94K26N59m89j22J24J17r7
3729dR6k82O5K01K8p5N7J23l33P8K0L57l11j88L7M27k40j46L20j20j26K63j57
3752I0k8l15J98l43M75O2n7p2L6k55J35R9L0L8k32Q0K85l29J96L1k99K04J37k86
3776a20J70n9M6K5j43M2N6k57N68k30O3j44j29K58j91O0Nm8o0J75J02l70M00j71
3800D8k61O26l64o1K58l97p2L76l00O0j4K08k02mO5q0P3j22L3j91K08j19M34l02
3824a00r7J65l5j9R2j02L3J30j21K7K12n03K35Q3J08m01K16n4K14k9r0j66K50
3847D8R5m89N63j62j34K82k18Q3o7j19J06L18l45r5J76l7O8K73j92k50r5K99j33
3870b5J41l35K88J26k68K12k12J30o7l60N31j21K3n7j39J33p6m0M59l80k72M94
$$ y = [-200, 40, -154, 61, -145, -317, 46, 82, 44, -209, -5, -187, 148, 172, -322, -96, 463, -26, -148, -24, 93, -4, 92, -190, -125, 76, 104, 29, 86, 209, -124, -46, -26, 331, 20, -168, -131, 296, 56, -90, 230, 110, -16, 247, 90, 62, -253, -55, -398, 77, 139, 82, 10, 46, -209, -74, 25, 55, 93, -139, -59, 226, -103, 93, 124, -175, 29, 166, -120, 50, -9, 37, 62, -81, -39, 17, -240, 328, 98, 161, 17, -112, 146, -45, 15, 20, -28, -88, 87, 189, -181, 219, 48, -213, 413, 49, -12, 246, -151, -223, 153, -147, -87, -101, 107, -95, -99, -34, -114, -41, -163, -130, -321, -113, -232, 202, -100, -197, -32, -67, -86, 6, -96, -63, 67, -54, -27, 185, -318, -83, 0, 108, -293, -77, -131, 83, 54, -36, -202, 48, 143, -346, 217, 55, -79, 203, -15, 68, 1, -118, -12, 306, -39, -134, 42, 5, 73, 346, 154, -96, -191, 108, -25, 116, -219, 69, 195, -73, 139, -73, 57, -10, -370, 161, 40, 63, 6, -133, 0, -76, -116, 343, -37, -309, 185]
3892A85j09j6n4J38k08N0j60K15l6oJ45j70K85l85L08k28J77k15k2M31k64L2j16
3915b3K05k81P2j61J54K28j95M57k72J35n88L64j19Q8k6m6m9N2P8m27O73K7j99
3938A47m33N10j35M9l7Q7j6r3j55M22j65j73k30M83k05l73L70j35L7K52r9k37
3960a29J74JM1M8L0J03m34mK04J51k37L10N8k59j00j11p4L1L26mk01P5j42M00
3984B57k19k81N33m4l11j21K53P1l7l21L56o0l40L92j86K39k44K29R9k25m5n6
4006f1R3j66K65j03J40r7l44L71k55L76Po64P74j03m28L54k15j5l70L06J93j11
4028e3K24j46N9p3n8k5M3j41J21P8q3J07K4J46k00OP7m5j23o3M27l80L43j19r7
4053D9L06k45M7k04K35j43p0J27j96J50L0J17l97L46j83J70K24n86L41j19kR4
$$ y = [185, 76, 60, 6, 144, -64, -14, -174, 41, 5, -1, 144, -26, 259, -126, 182, -46, 131, -84, -106, 325, 61, 93, -23, 182, -99, -27, -188, -34, 194, -1, 456, 184, 319, -269, 95, -24, 64, 38, -8, -57, -5, 73, -354, 319, 346, 147, -286, 224, 89, 138, 101, 188, 172, 79, -76, 346, 181, 8, -222, 261, 56, -317, 53, -82, -45, 207, 108, -129, 45, 46, 87, 135, 165, 268, -166, -170, 34, 185, -52, 258, 316, 57, -43, -154, -228, -197, 129, 125, -76, -1, -143, 257, 38, -243, 290, 246, -65, -186, 67, 138, 101, -220, 136, 76, -264, 128, -58, 181, -63, 166, 265, 40, -5, -61, 32, -134, 131, 28, 168, 71, -273, 98, -157, 219, 226, -438, 336, 233, -195, 159, -56, -71, -441, -135, 58, -53, 171, 25, 84, 11, -47, -72, -29, -170, -49, 29, -54, 53, 77, 223, 23, 29, 106, 61, -62, -125, 302, -78, 265, 146, 49, 355, 110, 157, -47, 188, 45, -25, 102, -94, 56, 86, 203, -194, 152, -31, 139, 363, -223, 118, -1, -3, 91]
4075I1j68q0L08pj38m3l9K8q6r4J73J04l13K51K46m99J54K86J10k78j78K35j40
4098g7L55k37M4k52J01J11O4k72J47j25K86j35m2m9K32J4j26L4j07j82M12l72
4120a76K55K94k86L7j03n9R2j61L3P7O9R9l76R7J32mL4J02q2j2k9J06j48P4J55
4145B20k39l60M79L10n00kQ9M1k96K08Jj0J31j21J16k44L25l20P1L79l9j35j06
4168bp5j73K68j61L08o0R7j33J48k77J69J2p1K3Q7j82j36k34K73l7K99k07M81
4191D17j73k40l40N74k43k91K12L9M6P2j00J44j48K11j95p3j03L59m1j50O4L5
4213G6k77L80k14N4j87j77J71k4Q1J02N1k2N7J3J8k82J67p0K82m56K25J41r3l4
4237a8r9Q7k2L72j21j81N2m3K85m25J32O6J7J64l20J44k17jJ42k7j52k28K79J81
$$ y = [91, -77, -157, 151, 144, 6, -37, -76, -48, -134, -228, -55, 49, -264, -13, 233, -266, -112, 174, 284, 6, -172, 63, -77, 278, 41, 85, -167, -66, 45, 109, -163, -16, -141, 145, 10, -32, -81, 151, 165, 39, 73, -34, -216, 196, -176, 79, 373, 87, 124, 21, -38, 54, -107, -74, 3, 72, 171, -205, -108, 24, 20, 54, 156, 74, 62, 33, 139, -9, 65, 220, -19, -379, 100, 410, -90, -92, -3, 38, -258, -50, -49, -59, 72, -49, 67, -177, 148, -172, -101, 278, 239, 104, -2, -77, -250, 18, -143, 165, 105, 202, 69, 217, -60, 109, 121, 50, 73, 160, -22, -158, -392, -119, -156, 143, -64, 417, 244, 4, -336, 238, -5, -296, -84, -45, 1, 73, -27, 117, -31, 180, -15, -88, -191, 168, 127, -23, 41, 76, -201, 179, -35, 19, -168, -345, -174, -198, -117, -15, 36, 14, 71, 84, 102, -180, -13, -83, 199, -257, -32, 109, 16, -18, -117, -30, -52, 320, 199, 18, 70, 27, 312, -113, 19, 85, 102, 266, -54, 90, -127, -128, 14, -13, -165, -393, -114, 67]
4261F7k83L99j72p9J28k98K82k2r5K64l97K66p9M2pj92K30J41p4j12L1k67J04
4284a23J76R5rlJ41m29K48j70R6k37J66L42k78r9J26M0J36l7k69K58l61J66K9
4307Dk32J84m5j24K28K25j00j69O5J70m05K67j44J82J14N2m34J33k47L8k1J95
4329f4K13J38m51K3m1J91m0p3M8j97M83l40K67o9L4l19L76j63j42L9J75k86J74
4352b4J80K08m11j64P8K04k21J89k19Qj89K93K85j57J48k61K01k29J84j15j47
4373a59J30j0l4j21j7O8L04m39K65J89j95j7R6r7J51k09MJ0n1j69K74J47Nj91
4397f6K04J11J08o10J63K73n96L10j02J55PJ86K3pl23J32K34j19k87L61k02n3
4419i8K08l72L09N7k99J72M8P0l2J28j7m08M18J4r0j55Q5l18L43k06r0R9K10j94
$$ y = [67, -216, 183, 11, -68, 60, -238, 44, 22, -73, 191, -206, 60, -19, 23, 16, -176, 54, 195, 121, 9, 40, -227, -123, 53, 148, 139, 136, 277, -152, 96, -74, 22, -215, -49, 293, 15, -84, 42, 82, 218, 181, -88, 170, -191, -25, 4, -228, -44, -89, -213, 15, 240, 140, -29, 36, 206, -199, 68, -76, 106, 220, 272, -162, -29, -276, -238, -259, -64, 149, 287, -164, -141, -182, 9, -31, -104, -56, -253, 230, -110, 157, 88, 122, -197, 179, 16, -126, -87, 88, -198, -24, 156, 364, -47, -211, -133, 71, -150, 39, -180, -172, -361, -68, 217, 60, 208, -53, 148, -81, 103, -12, -159, -29, -39, -73, -194, -211, -143, 161, -278, -13, 176, -19, -36, 60, -37, 114, -95, -91, -81, -132, -301, -27, 120, 125, -66, 138, 249, 357, -253, -90, 183, -413, -103, -205, -50, -43, 143, 166, 159, -164, -32, 202, 83, -204, 157, -45, -98, 110, -262, 47, 104, -195, -23, 25, 95, 63, 191, 174, -234, 184, 198, 108, -47, 38, -280, 63, -143, -233, -134, 76, -118]
4443a18J05K66j76j31q7j25L32j01K60k67J53J1k5j29j29j21K24P4n7LL5J99l13
4466a17J83K39k41J48j87j20K34k34K27k13L60k60J55K9k73N0j29K28J2k6m7j69
4488a51M62k64J09j4m14j9J91K3k44M27K09j00l01P8K02J49n43M56l58K51k99
4509a50k52K91Q7k30L01J71k87Q9j77J28j5N1l1nL9j02L8r7M5J76j52L95l27n0
4533f4k16K16J27m97N44l88L39l28K82l6K43l39N8K00l53J9M82l86K03J65P3m14
4555g0p9J11k1J38L7j97K19j37k73J85j26L24k46K44m45N18J20k68q9O2J35j51
4577iN7M5j24R0P8n9r6o0q4J04J31J12j1l31J37Q1k35L4J10J65j16j54R0l3K17
4602A39q5m67K04M7J6Q7K3O8M2k57J90L1j15L19l12K3J74k15L64m55K38nl3L15
$$ y = [-118, -13, 253, 77, -54, -141, -266, 66, -35, 225, -42, 111, 122, 97, -32, -161, -282, -58, 16, -41, -38, -3, 196, -117, 66, 305, 64, 212, 25, -95, 139, -95, 132, -81, 279, 19, 174, 203, -70, -20, -149, 79, 91, 65, 18, -151, 311, 47, 156, 142, -272, -291, -100, -77, -321, 106, 315, 215, -86, -8, 194, 343, -200, 256, -102, 149, -150, -402, -111, -24, -254, 47, 218, -69, 20, -157, -29, -44, 7, -24, -29, 10, -92, -54, -151, -106, 70, -82, 313, -14, -64, -280, -64, 63, -434, 110, -278, 61, -267, 15, -21, 222, -117, -59, 141, -212, -193, 289, -97, 106, 271, 344, -70, -149, -38, -59, 79, 116, -81, 138, 1, -272, -87, -213, 111, -135, 109, -336, 182, 302, 34, -55, 7, 142, -9, 48, 93, -31, 59, 137, 78, -18, -78, -162, -58, 73, 185, 174, -157, -20, 61, -174, -140, -30, 135, 19, -135, -45, -78, 139, 54, -413, -209, -162, -146, -59, -36, 32, 74, -183, 7, 38, -77, 242, -70, -47, 127, -88, 276, -179, 59, 54, 21, 336]
4626C36m86L12m94K23r1J23j42L01Q2m33J95K44j18m22L34J69k43J36j5j16L11
4647B06j83k06K78K8k56R9M50l06j30q5L30k22j84J88R3k02O1J42P5k70n2P7J59
4670I0K8l16K12k1n0J97k21R6k79N7L52k57m22O55L9m17K46K1j14J2J49j45J01
4693A3j83J71q0j00L96k66l05L33p1Q6j75L32k23k72M65j08l0J06K76l17O0j99
4715i1RJ92j87j31J17Q5o5K69j93J59j3m17K46L1k38K54r5J71p3N3j55O7j10K3
4739i2R5R5j14k39L89j72J56l85L13J97k33J55l34R0K04r4m6kj52K55m3p1N8j49
4763a19K0K91k12K51r6l15N10k99N4l39K29K61m61L64Lj28M6j86R4J41J84n49
4785b56K84K0L57p10N61q2k57J56j10K04K8o9l43J1K61k3L44k74k90J47P6Q1k44
$$ y = [336, -150, 162, -332, -109, -200, -77, -219, 82, 164, -269, -74, 170, 52, -370, -36, 133, -110, 26, 11, -105, 206, 23, -183, 95, 123, -133, -34, 416, 110, -20, -105, 225, 3, -181, 7, 100, -102, -41, 101, 176, -94, -146, -69, 90, 118, -198, 14, -7, -57, 140, -81, 15, -264, -207, 145, -112, -534, 121, 160, -257, -11, 10, -104, -92, 57, -88, 13, -170, 1, -79, -179, 217, -49, -354, -21, -92, -6, -181, 151, -72, -344, 121, 13, -17, 89, 365, 48, 108, -91, -82, 110, -77, -208, -91, -6, -71, 198, 5, 164, 151, -266, -20, 11, -227, 27, -68, 103, 30, 83, -72, -5, -115, -92, 3, 98, -16, -255, 134, -38, 118, -267, 46, 243, 10, 165, -169, -79, 125, 31, -15, -17, -169, 86, 43, -28, 30, -119, -99, 192, -20, 231, 135, -180, 330, 31, 85, -254, -25, 236, -225, 139, 142, 14, 60, -126, -32, 109, 293, -256, 28, 48, 405, -305, 256, 174, -83, 73, -37, 167, 195, 126, -217, -206, 55, 32, 376, 102, -188, -41, 35, 116, -128]
4808a28N2M8k15N7k5P6J44J58j75l55O0K68j81J33J3j00L33l23M84l83p0m2R2
4831g9m8K9J73J08j03m9J9R8J9m65K79oJ39j22J12q9k12J51J19J11j38n3q3Q4
4855fj67M60m34K7J44k48L31j88J33m0j33p3o8K17q2k7J92n7J17J5n03L52M3n0
4879d5n9J18M10m35J81k2O7o8l7l26K95Q0j33j11J07l28J18J66J17Q9k42K0K71
4902B33j64j53Q3p9M2O1J45l72J3J85k0J2q5K61j8k6k24PJ33q9O1K27j42m53M89
4927A27l0k6l89L40j26L26k61O3Q3Q5l78P1J35M5j23KP7J28j72J83r5J55l91L86
4951B15m09K82l88L03K15j90l75L34J51m2o3m33M85j57J42m69M07o9j34nK36k
4973C4m6K04p9J8O1l35m7L22j2m21L61Q4J2k74J08j85N8j07K02J20j50J40pL1
$$ y = [-128, -76, -28, -243, -186, -211, -135, 9, 167, -8, -363, -303, -35, -216, -83, -70, -170, 163, -160, 324, -59, -129, -171, -79, -127, -98, 75, 183, 80, 31, 50, 148, 167, -298, -19, -25, 114, -8, 104, 15, -197, -46, 73, 184, 46, -7, -90, -6, -173, 287, -147, -120, 24, -224, 107, -81, 52, 12, -121, -194, -262, -45, -127, -154, 38, -19, 98, 113, -390, -38, 5, -45, -104, 14, 424, -11, 170, 148, 215, 147, 110, -216, 79, 159, 26, -85, 22, -306, -188, -22, 95, 184, -58, -38, 233, 69, -84, -1, -80, -38, 23, 168, -204, -191, -6, -26, -14, -99, 162, 144, 118, -106, -99, 34, -55, 6, 233, 91, -362, 127, 97, 71, -318, 22, -104, 222, -39, 24, 107, 192, -186, -115, 20, 65, -58, -56, 21, 149, -23, 160, 65, 220, -171, 215, -194, 88, -300, 3, 218, 28, -347, -13, 138, 96, 33, -400, 85, -72, 70, -399, 8, -61, -195, -200, 36, 34, -12, 192, 113, 131, 192, -143, -190, 132, 120, -301, 60, 144, 156, -118, -10, -195, -137, -244, -42, 78, -72, 68, 61, 92]
4997I2j79L32l50K59p7o3l64L03r6K03j86K32k14J65J46O2j44j16j75K47J15j04
5019H8k20N9L24n10J27K52r9r6J93j05j12l29J38n4K11j0J95p8K94k15Q2k59K50
5042A26k15J50k3j78L0O8K60j82j35K18j54J58Lm7l33M20l69K42M6k95K40p8J49
5065A01K11o4k86q2J25l9k13J53K11q6j16K10j65o5RK35L6j97J48p2j85m0K50
5088G9J08j84k34K95l80M23K1l12J7K46l29K16L3j39j05K37R5j40j26k9J87J44
5110A23k25j07J16j56L41j07J72l68K47m4r1O2J06j65K36k18k08L21j59J71%p
5132D0Jj71J58J53k10J03N9l72k42M78j13N2j27J54J67K5k11J70Ko9K20n34K70
5155CK37k14j34N9L69l78O8L34k07j99R6K4J12l89K96K04p6k81j88L88j75ll2
$$ y = [92, -87, 245, -105, 154, 77, 14, -350, -47, -143, 60, -126, 106, -108, 57, 203, 265, 121, 5, -170, 77, 192, 88, -132, -73, 251, -259, -132, 120, 21, -75, 118, 13, -99, -428, -290, -344, -133, -143, 52, -26, 268, 53, 135, -124, 126, -89, 61, 38, -140, -110, -42, 218, 36, -99, 119, -35, 123, 126, 79, -254, 166, -203, 39, 85, -210, 30, -48, 101, 312, 248, -38, -120, 5, -34, -247, -94, 117, 31, -85, 125, -40, -105, -96, 139, 175, -22, 126, 54, -131, -171, 79, 187, 3, -231, 64, -316, 107, 128, -184, -167, 79, -250, -34, -1, -140, -245, -8, 87, -53, -179, -208, -21, 123, -102, -209, -93, -249, 92, -15, 157, -211, 36, -8, -99, -37, 69, -96, 140, -78, -286, 35, -124, 47, 47, 40, 41, -130, 28, 181, -29, 74, 133, -239, -481, -3, -116, -64, -191, -37, 130, 155, -56, 114, 116, 47, 267, -267, 3, 240, 26, -108, -49, 320, -58, 10, 344, 137, -62, 34, 58, 170, -219, 77, 281, 205, -76, -264, 124, -51, -54, -86]
5178h6N14m12J43J19j98J78j95J04j00j08J41k48P5K66n9j47K6q2L31j81m0M1
5200H2j7k17L35n63N72j92J94j75j8J02n9m6l12L47J65l7l5mk26O9k90N38p6l04
5224a67K27j57m0n3Q6K81k37L00m93L00P0p7P9J32Pl08Mj50K56j17Q9n7L4Jl0
5249b0j28M3L07m79M69m2o1J97n58j97P41k82l40L52j07L39kl55L97k10j22R7
5271C9q3m0O8j30o9K98j57K26l07jJ23j19j20J4O4J24J37p8n7m1O4J22N3k98M1
5296a27J20K47k30Q7j95K08p4k31J58O7q6M14l84j93J51j00L13k57J58j7l26J35
5318a62J49N9L5m40O15j53k06J33r9J99j33J45%r4J52J4k12j25J30j18KM9k5k12
5342b97K82R5R4j74K8OP2N6l58K85k5q5l5k82L65K78k61j37j38M63j34k81L43
$$ y = [-86, 428, 16, 159, 278, 80, 258, 63, 167, 67, -41, 100, -148, -73, 193, 134, -13, 13, -69, 262, 81, 41, 82, 65, -152, 183, -380, 192, 0, 194, 19, 1, 103, 44, -2, -314, 33, 198, 161, 126, 122, -104, -35, -325, 213, 137, -167, 60, -97, -137, -190, -104, 177, -60, 240, -253, 47, 117, 40, 119, 251, 258, -50, -46, -196, 60, -57, 32, -25, 9, 10, -20, -148, -105, 202, -277, 192, 150, 89, 286, -272, -469, 272, -10, -350, 2, -105, 234, 232, -123, 274, 64, -58, 39, -44, -84, -16, -146, -215, 83, -74, 152, -155, -156, -33, -152, -272, -258, -194, -70, 67, -11, -68, -109, -45, 77, 130, -168, -127, -7, 240, 10, 97, -98, 110, 36, -195, -37, 30, -56, 358, -26, -219, -68, -168, 145, -112, 46, 29, -297, -162, -13, 46, 81, -359, 256, 103, -103, 30, -69, 130, -3, 142, 142, 48, 200, 214, 2, -123, 7, -111, -109, -60, -85, -297, -15, 80, 174, 0, 28, 34, 106, 162, -196, 89, 64, -21, -56, -338, 27, 305, 44, -93, -231, 232, 98, -183, 160]
5365A60j42L75o85M37j21p7J73p8n5J2M5j03K7K31j03kL21k32J53k90K76n4j49
5388A19j27j17K91k51k8R8m09N01O2l35o0L17M2K79n44J8o5JL93k32J57k90J83
5411Ck67K12j70J31R6qL50l60K03Q9k67Mk18J50j99M44p6J00l46OK3M5K8J25r7
5436AMj6k0l9p2K69j44j31j09L54j83m6K11J02j71l1J06o8M3J0l51K73k75J86
5460i7K21J03l50L05k73j13K95L29n85J66j79J12K30k78J34L5k79j39K11l3L52
5481A67O7k14j14m9J52J89J51o26K79N0l00M59Nk52j05j04K93j04m8J51o6m3J37
5504G5j15O6q7J67J81k18j11O1K24m61L87k15M1J81l65j33M03j30K77k19j27L41
5526B23j44k90J03M7oO6q6rJ45j2k39k8J27R6r7K55k25O8j62K75J61j82l22P9
$$ y = [160, 18, 393, -292, 145, 24, -53, 120, 42, -13, -1, 44, -59, -32, 199, 96, 94, 415, 183, 336, 46, 322, 268, 119, -8, -125, 166, -85, -113, -15, -424, 77, 139, -196, -256, 61, 103, 382, -162, -144, -209, -208, 185, -47, 110, -180, 3, -264, -52, -222, -91, 5, -3, 347, -13, 190, 279, 12, 16, -202, -52, -251, 193, 117, 217, -129, -123, -100, -55, -27, 98, 1, 5, -11, -31, -70, -142, 127, -17, -148, -257, 97, -86, -132, 79, 181, 10, -21, 85, 17, 60, 70, -281, -8, -283, -97, 124, 227, -123, 182, -91, -204, 91, 420, -165, 1, -178, -66, 164, -114, 20, 55, -224, -363, -152, -185, 167, 234, 20, -94, -143, 9, 198, 349, -277, 2, 52, -248, 211, 216, -36, -141, -245, 48, -56, -104, 47, -19, -62, 75, -40, 26, -61, 106, 287, 69, -42, 19, 243, -218, 169, -46, -5, 176, -189, -322, 81, -49, 228, 9, -118, 223, 79, -211, -108, -61, -67, -1, -87, -96, 49, 37, -202, -230, -103, -7, -104, 151, -74, -6, -168, 107, 268, 86, -236, -157]
5550a57K07r3L17k76K59k95L60j86l21N2L13k7j48o8J0j22K41j79J81k40K75j24
5572b1P8p4J25k44J30L1P7J74j54j47M7k18kK01K7O0J38k58l27N02l69L77m5l05
5596a97J11K84m3n7m90M03J07k25J47p7K25m2l67K98J38j05k18J6K48j29l54O2
5618b65L77j09J18j33J11Mj43J14j17J95j57N4K69k98o17K24P9j8M13n7R3j77
5640d0j55J98Q0m1N3j26JJ14j73J15j67j72O20k31K2q0p1K52l77RK68m29L49K8
5664D7r1Km9J61m7Q8k45o7o0P3j0K33r5k5L9J09k0l28L12J23L6j37l20L05j01
5689f7o3J49j74J89j32oJ83q7p3O8m0K73j51j48j8Q4J4j81J08n8l6K08k5K38j37
5714A18j24l7R9k97M16q9P1k85J28J9O5j39P8L9j52J67j53N2j15Pj72J53k6J74
$$ y = [-157, 50, -43, 274, -2, 257, -38, 322, 136, -185, -133, 180, 153, 5, -63, -53, -175, 66, -113, 68, -172, 103, -21, 57, -17, 108, -136, -6, 25, 102, 276, 122, -25, 22, -196, -198, 3, 30, 90, 228, -30, -357, 145, -224, 153, 108, -197, -86, 198, 155, 98, -392, 11, 118, -107, 40, -37, 188, 146, -221, 77, 215, 110, -108, -92, 156, 27, -327, -265, 112, 3, 121, -12, 99, 103, -40, 74, -43, 152, -5, 49, 318, 20, -597, -373, -294, -312, 101, 44, 137, -40, -195, 3, 83, 42, 95, -31, -30, 84, -89, 26, -141, -313, 307, 76, 98, 18, -53, 199, -178, -169, 99, -330, 19, 47, -44, -42, -91, 70, 23, 111, -134, -201, -261, -188, -198, 35, -60, -85, -46, 63, 43, -285, 27, 150, 186, 49, -271, 34, -67, -130, 19, -155, 34, -98, -104, 79, -8, -81, -13, -53, 220, 69, -79, -97, -13, 1, -180, -72, -130, -166, 42, 17, 255, 118, -6, -43, 56, -241, 175, 86, 157, -128, 0, 19, 84, -55, 23, 62, -90, 77, -76, -24, -139, -132, -304, -151, -177, -3]
5738cN0k68L74j73p5J50q6q1J50j68j09K97mj25R7J27k01P7m8K7k10J35p5L38
5762A96l37M57n05N1j04K36p4j62L50k86K19O1l3Q8l42M1J70J51j84j71J90j0
5784Bk3Q2J70l2R8n38O4J82J27N5J73k34k83J28q3K74j06K57k64q0m4K57k08M8
5808B2k05O4J44J62j4k26J36J79n33M87k60K35m60L97J23j59J92j63j37N8k32
5829a90P4r7J65J35k61L25l13K11J90l55K67l82K04Q7r4o8p5K32o0N2k27j06L32
5852D6Q2j3j88j08L07P5l47K30m40L45J95k07J85k27j15k38L21j20K45j54L30
5873B04k97P0m6J8O5L35n68m4M33j3j81J05j89J52Qm1l37O16m66M4m5J96nl3O7
5898D8J02k05L72k43k9j47K20k26K8Q9q9K78j36l57K53j71L2L3R0K30k69n6J95
$$ y = [-3, 47, -221, 153, -20, -95, 55, -31, -112, 38, -130, -239, 58, 54, -71, 26, 153, -48, 29, -19, 8, -202, -67, -142, 196, -141, 316, -189, -138, -242, -6, -80, -242, 108, -178, 41, 102, 69, 157, -185, -144, 26, 177, -7, -178, 12, 2, -21, 61, 231, 199, 297, -241, -177, 5, 132, 187, 360, 126, -157, -29, -112, 162, 56, 313, 49, -31, -75, 182, -26, 22, -183, -119, 25, 187, 173, -53, 83, 262, -271, 216, -44, 191, -269, 128, 251, 92, 284, 121, -16, 42, -190, -116, -213, -48, 87, -174, 151, -162, 49, 239, -116, 151, -231, -27, 60, -34, -102, -177, 55, -5, 47, -180, -286, 46, 128, 115, -73, -181, 126, 201, -146, 84, -356, -11, 184, -23, 162, -65, -180, -418, -97, -217, 28, -126, 204, -93, -23, -69, -51, 14, 349, -219, -263, 170, 157, -24, 81, -108, 44, 52, 11, -326, 290, -176, -132, -177, 19, 14, -19, 48, 150, -55, 317, 74, 45, -102, 118, -108, -80, 9, -80, 198, 62, -295, -42, -213, -181, -148, -58, 172, -97, -153, 42]
5921D2J41L7o9m56K11J59K27k58j39o8k1l7R8R0J2r7K47j7k7k35M1L41m96K41
5945c3R6j70o0K79p9O8om02M22j3o9j85L87l41O4l08L40l0J39m3j19k70M01k1
5969D7k30K46l53J36L28l25K24K5R5k03K5J6k49K94J86o6J80m38j23J28L51n29
5991b35M11l14m7L82J75j0k95K17l38J03J1q1R1J66l2k52k44K29k45L7J42j48
6013b77M07j0Q5j53j5l11L31O3j91k35M44o9k45K79lj6J65k52K4J78n3k12q8L58
6037B04M7l82rQ9Nq5l1L24k26K85k05k4K86k83n8L20j51k04K53k21K15j15jl6
6061cl15M64k1K4j76m0k2J30k23L32k2l81K74j04Q4j47O6J43j73j45O7K05j47
$$ y = [42, 183, 220, 151, -305, -94, 65, 292, 34, -105, -173, -194, -231, -133, -43, -31, -128, 119, 102, 75, -160, -119, 222, -274, -33, 63, -107, -167, 112, 33, 101, 95, -307, 115, 102, 33, -152, 235, -106, -42, -350, -10, -40, 99, 56, -63, -333, 68, 47, -183, 63, -290, -154, 174, -151, 73, 98, 193, -10, 15, 31, -218, 76, 262, 196, 376, -62, -185, -57, 294, -235, 176, -138, -185, 197, 372, 362, 67, 284, -54, 49, 60, -21, 70, 236, 204, -48, -292, -63, -308, -271, -129, -277, 130, 120, 205, 52, 37, -274, 57, 120, -71, -306, 138, 69, -176, 103, 100, 84, 249, -3, 21, 199, 146, -66, -154, 204, 251, -131, -140, -51, -46, -131, -162, 162, -64, 221, 16, -8, 278, -5, -63, 257, 106, -98, 155, -66, 149, 34, 33, -3, -318, 146, 125, 149, -27, -67, -89, 41, -182, 150, 128, -253, 21, -83, 1, -146, -80, 63, -110, -255, -188, 17, -130]
$$ [...]
8191I5
##END NTUPLES=NMR FID
##END=
