##TITLE=1H_BAU-Typ-2023
 CDCl3
 8 sc, 
 7.7.2023
##JCAMPDX= 6.0         $$ Bruker NMR JCAMP-DX V2.0
##DATA TYPE= NMR FID
##DATA CLASS= NTUPLES
##ORIGIN= UXNMR, Bruker Analytische Messtechnik GmbH
##OWNER= root
$$ XWIN-NMR		Version 3.5
$$ Fri Jul  7 13:50:16 2023 Russian Standard Time (UT+4h)  she@DPX200
##.OBSERVE FREQUENCY= 200.13135
##.OBSERVE NUCLEUS= ^1H
##.DELAY= (6, 6)
##.ACQUISITION MODE= SIMULTANEOUS
##.ACQUISITION SCHEME= undefined
##.AVERAGES= 8
##.DIGITISER RES= 18
##SPECTROMETER/DATA SYSTEM= spect
##.PULSE SEQUENCE= zg30
##.SOLVENT NAME= CDCl3
##.SHIFT REFERENCE= (INTERNAL, CDCl3, 0, 15.7039)
##AUDIT TRAIL= $$ (NUMBER, WHEN, WHO, WHERE, WHAT)
$$ ##TITLE= Audit trail, XWIN-NMR		Version 3.5
$$ ##JCAMPDX= 5.01
$$ ##ORIGIN= Bruker BioSpin GmbH
$$ ##OWNER= she
$$ F:/spectra/data/she/nmr/H-F/1/audita.txt
$$ ##AUDIT TRAIL=  $$ (NUMBER, WHEN, WHO, WHERE, WHAT)
(   1,<2023-07-07 13:49:02.07 +0400>,<she>,<DPX200>,
      <created by zg, POWCHK disabled, PULCHK disabled
       configuration hash MD5:
       00 E9 B6 7A A2 85 ED C7 34 08 36 98 17 FE 4E 26
       data hash MD5: 16K
       32 9F 55 F2 6A 49 CE 4B 3D F2 29 DC 4C 88 2C F2>)
$$ ##END=
$$ 
$$ hash MD5
$$ 00 F8 06 B1 1C EA 29 A2 7B EE 27 12 92 0C 22 95
##$RELAX= 
##$RELAX= 
##$RELAX= 
##$RELAX= 
##$RELAX= 
##$RELAX= 
$$ Bruker specific parameters
$$ --------------------------
##$DU= <F:/spectra>
##$EXPNO= 1
##$NAME= <H-F>
##$PROCNO= 1
##$TYPE= <nmr>
##$USER= <she>
##$AMP= (0..31)
100 100 100 100 100 100 100 100 100 100 100 100 100 100 100 100 100 100 
100 100 100 100 100 100 100 100 100 100 100 100 100 100 
##$AQSEQ= 0
##$AQ_mod= 1
##$AUNM= <au_zg>
##$AUTOPOS= <>
##$BF1= 200.13
##$BF2= 200.13
##$BF3= 200.13
##$BF4= 200.13
##$BF5= 200.13
##$BF6= 200.13
##$BF7= 200.13
##$BF8= 200.13
##$BYTORDA= 1
##$CFDGTYP= 0
##$CFRGTYP= 5
##$CHEMSTR= <none>
##$CNST= (0..31)
1 1 145 1 1 1 1 1 1 1 1 1 1 1 1 1 1 1 1 1 1 1 1 1 1 1 1 1 1 1 1 1 
##$CPDPRG= <>
##$CPDPRG1= <>
##$CPDPRG2= <>
##$CPDPRG3= <>
##$CPDPRG4= <mlev>
##$CPDPRG5= <mlev>
##$CPDPRG6= <mlev>
##$CPDPRG7= <mlev>
##$CPDPRG8= <mlev>
##$CPDPRGB= <>
##$CPDPRGT= <>
##$D= (0..31)
0 1.2 0 0 0 0 0 0 0 0.06 0 0.03 0 0 0 0 0.0002 0 0 0 0 0 0 0 0 0 0 0 0 
0 0 0 
##$DATE= 1688723341
##$DBL= (0..7)
120 120 120 120 120 120 120 120 
##$DBP= (0..7)
150 150 150 150 150 150 150 150 
##$DBP07= 0
##$DBPNAM0= <>
##$DBPNAM1= <>
##$DBPNAM2= <>
##$DBPNAM3= <>
##$DBPNAM4= <>
##$DBPNAM5= <>
##$DBPNAM6= <>
##$DBPNAM7= <>
##$DBPOAL= (0..7)
0.5 0.5 0.5 0.5 0.5 0.5 0.5 0.5 
##$DBPOFFS= (0..7)
0 0 0 0 0 0 0 0 
##$DE= 6
##$DECBNUC= <off>
##$DECIM= 32
##$DECNUC= <off>
##$DECSTAT= 4
##$DIGMOD= 1
##$DIGTYP= 9
##$DL= (0..7)
0 120 120 120 120 120 120 120 
##$DP= (0..7)
150 150 150 150 150 150 150 150 
##$DP07= 0
##$DPNAME0= <>
##$DPNAME1= <>
##$DPNAME2= <>
##$DPNAME3= <>
##$DPNAME4= <>
##$DPNAME5= <>
##$DPNAME6= <>
##$DPNAME7= <>
##$DPOAL= (0..7)
0.5 0.5 0.5 0.5 0.5 0.5 0.5 0.5 
##$DPOFFS= (0..7)
0 0 0 0 0 0 0 0 
##$DQDMODE= 0
##$DR= 18
##$DS= 0
##$DSLIST= <SSSSSSSSSSSSSSS>
$$ [...]
##$SUBNAM2= <"">
##$SUBNAM3= <"">
##$SUBNAM4= <"">
##$SUBNAM5= <"">
##$SUBNAM6= <"">
##$SUBNAM7= <"">
##$SUBNAM8= <"">
##$SUBNAM9= <"">
##$SW= 18.05172834244
##$SWIBOX= (0..15)
0 0 2 0 0 0 0 0 0 0 0 0 0 0 0 0 
##$SW_h= 3612.71676300578
##$TD= 16384
##$TD0= 1
##$TE= 0
##$TE2= 300
##$TE3= 300
##$TEG= 300
##$TL= (0..7)
0 120 120 120 120 120 120 120 
##$TP= (0..7)
150 150 150 150 150 150 150 150 
##$TP07= 0
##$TPNAME0= <>
##$TPNAME1= <>
##$TPNAME2= <>
##$TPNAME3= <>
##$TPNAME4= <>
##$TPNAME5= <>
##$TPNAME6= <>
##$TPNAME7= <>
##$TPOAL= (0..7)
0.5 0.5 0.5 0.5 0.5 0.5 0.5 0.5 
##$TPOFFS= (0..7)
0 0 0 0 0 0 0 0 
##$TUNHIN= 0
##$TUNHOUT= 0
##$TUNXOUT= 0
##$USERA1= <user>
##$USERA2= <user>
##$USERA3= <user>
##$USERA4= <user>
##$USERA5= <user>
##$V9= 5
##$VALIST= <valist>
##$VCLIST= <CCCCCCCCCCCCCCC>
##$VD= 0
##$VDLIST= <DDDDDDDDDDDDDDD>
##$VPLIST= <PPPPPPPPPPPPPPP>
##$VTLIST= <TTTTTTTTTTTTTTT>
##$WBST= 1024
##$WBSW= 4
##$XGAIN= (0..3)
0 0 0 0 
##$XL= 0
##$YL= 0
##$YMAX_a= 125049
##$YMIN_a= -179659
##$ZGOPTNS= <>
##$ZL1= 120
##$ZL2= 120
##$ZL3= 120
##$ZL4= 120
##$ABSF1= 10
##$ABSF2= 0
##$ABSG= 5
##$ABSL= 3
##$ALPHA= 0
##$AQORDER= 0
##$ASSFAC= 0
##$ASSFACI= 0
##$ASSFACX= 0
##$ASSWID= 0
##$AUNMP= <proc_1d>
##$AZFE= 0.1
##$AZFW= 0.1
##$BCFW= 1
##$BC_mod= 2
##$BYTORDP= 1
##$COROFFS= 0
##$CY= 11.3945322036743
##$DATMOD= 1
##$DC= 2
##$DFILT= <>
##$DTYPP= 0
##$F1P= 15.7292609196834
##$F2P= 12.9074282941183
##$FCOR= 0.5
##$FTSIZE= 0
##$FT_mod= 4
##$GAMMA= 1
##$GB= 0.15
##$INTBC= 1
##$INTSCL= 1
##$ISEN= 128
##$LB= 0.24
##$LEV0= 0
##$LPBIN= 0
##$MAXI= 10000
##$MC2= 0
##$MEAN= 0
##$ME_mod= 0
##$MI= 1.114404
##$NCOEF= 0
##$NC_proc= 0
##$NLEV= 6
##$NOISF1= 3.799351
##$NOISF2= 2.8
##$NSP= 1
##$NTH_PI= 0
##$NZP= 0
##$OFFSET= 15.70392
##$PC= 1
##$PHC0= -20996.92
##$PHC1= 22.85272
##$PH_mod= 1
##$PKNL= yes
##$PPARMOD= 0
##$PSCAL= 0
##$PSIGN= 0
##$REVERSE= no
##$SF= 200.130013532006
##$SI= 16384
##$SIGF1= 3
##$SIGF2= 2
##$SINO= 400
##$SIOLD= 16384
##$SREGLST= <1H.CDCl3>
##$SSB= 0
##$STSI= 0
##$STSR= 0
##$SW_p= 3612.71676300578
##$SYMM= 0
##$S_DEV= 0
##$TDeff= 0
##$TDoff= 0
##$TI= <>
##$TILT= no
##$TM1= 0
##$TM2= 0
##$TOPLEV= 0
##$USERP1= <user>
##$USERP2= <user>
##$USERP3= <user>
##$USERP4= <user>
##$USERP5= <user>
##$WDW= 1
##$XDIM= 8192
##$YMAX_p= 0
##$YMIN_p= 0
$$ End of Bruker specific parameters
$$ ---------------------------------
##NTUPLES= NMR FID
##VAR_NAME=  TIME,          FID/REAL,        FID/IMAG
##SYMBOL=    X,             R,               I
##VAR_TYPE=  INDEPENDENT,   DEPENDENT,       DEPENDENT
##VAR_FORM=  AFFN,          ASDF,            ASDF
##VAR_DIM=   8192,          8192,            8192
##UNITS=     SECONDS,       ARBITRARY UNITS, ARBITRARY UNITS
##FACTOR=    0.0002768,     1,               1
##FIRST=     0,             0,               0
##LAST=      2.2672688,     0,               0
##MIN=       0,             -179659,         0
##MAX=       2.2672688,     125049,          0
$$ Real data points
##PAGE= N=1
##DATA TABLE= (X++(R..R)), XYDATA
0 0 0 0 0 0 0 0 0 0 0 0 0 0 0 0 0 0 0 0 0 0 7 -8 8 -8 8 -8 8 -13 16 -16 16 -23 24 -27 32 -34 40 -43 48 -55 61 -67
42 -67 75 -83 91 -102 112 -122 136 -150 166 -182 200 -221 243 -270 300 -336 376 -421 479 -548 637
63 637 -754 910 -1142 1511 -2208 3934 -16897 -5238 75044 108877 104717 109265 125049 112611
77 112611 105298 108442 86200 34685 -4682 -33268 -56889 -62720 -52102 -49278 -53116 -53122 -48855 -45179
91 -45179 -34276 -16100 -2722 -1508 -7398 -13573 -18600 -20722 -11576 5821 18824 24562 32526 39587
105 39587 42617 51969 65247 66492 57489 46354 25595 -4275 -22653 -32084 -48260 -61635 -62572
118 -62572 -67564 -75234 -65798 -44373 -25988 -6569 16406 30183 35179 41427 47140 47725 45000 38855
132 38855 28413 15777 2477 -8977 -14853 -16947 -16904 -13836 -10616 -11591 -11134 -5479 -816 1389 4985
147 4985 4943 -2826 -9068 -9939 -12482 -14957 -11946 -8537 -8742 -5920 828 4743 9355 17662 22731 21856
163 21856 20883 18878 12166 6518 3982 97 -6213 -9995 -12601 -15992 -16872 -13955 -9462 -5876 -3371
178 -3371 -706 1487 1918 2122 4221 4989 3105 1528 854 -1140 -2384 -983 941 1631 3111 4644
194 4644 4791 4756 5442 5556 4599 3914 2400 -515 -3097 -4864 -6333 -6941 -5859 -5633 -6321 -5507 -4460 -3444
212 -3444 -1948 550 1743 1866 2478 3357 3918 4353 4612 5469 5619 5053 4260 3800 2554 827 -92 -912
230 -912 -3161 -5266 -6287 -7246 -8238 -7543 -5581 -4586 -3314 -1365 1083 2682 4786 6616 7721 7247 6791
247 6791 5984 4268 2386 850 -689 -2139 -3084 -3803 -4128 -3992 -3351 -2683 -1628 -538 -300 -398 -161 72
265 72 -260 -477 -539 -831 -1775 -1550 -283 43 974 2227 3505 3791 4324 5056 4764 3679 2872 1665 341
284 341 -1501 -3248 -4496 -5275 -6091 -5820 -5190 -4445 -3543 -2327 -363 974 2178 3236 3938 4035 3867 3781
302 3781 3471 2650 1780 1104 524 -358 -689 -846 -1156 -1502 -1537 -900 -1001 -1201 -1016 -535 -767 -452 -268 -114
322 -114 -446 -839 -565 -729 -629 -659 -753 -795 -793 -641 122 882 852 1462 2674 3267 3328 3288 3560 2534 1653 1163
344 1163 232 -1559 -2662 -3444 -4209 -4754 -4473 -3712 -3295 -2392 -1000 658 1946 3125 3395 3778 3384 2662
362 2662 2035 994 -156 -1487 -2340 -2090 -2227 -2034 -968 32 1012 2383 3976 4346 3905 3617 2989 1156
380 1156 -393 -2197 -4079 -5729 -6880 -6900 -6315 -5351 -4045 -1924 813 3075 4905 6833 7708 7465 6826
397 6826 5752 3760 1421 -714 -2832 -4529 -5530 -5805 -5538 -4469 -3205 -1542 556 2399 3355 4070
413 4070 4272 3540 2328 1200 -442 -2426 -3796 -4426 -4832 -4591 -3413 -1731 -604 1399 3516 5000
429 5000 5951 6088 5232 4446 3315 1200 -698 -2265 -4379 -5543 -5402 -5021 -4727 -3636 -1942 -402 1172
446 1172 2944 3764 3703 3495 2981 2253 977 -117 -1731 -2555 -2974 -3273 -2779 -1668 -1050 -354 1473 2701
464 2701 3087 3339 3656 3285 1933 1402 379 -1227 -2154 -3102 -3642 -3801 -3548 -3249 -2257 -946 -616 397
482 397 1788 2201 2295 3037 3145 2439 2081 2311 1461 569 427 -59 -881 -932 -908 -1830 -2093 -2084 -2350 -2137 -1975 -2174
504 -2174 -1994 -731 -177 365 1548 2144 2129 2913 3777 3435 2685 2483 1432 179 -260 -977 -2018 -2726 -2892
523 -2892 -2862 -2243 -1498 -1479 -1149 -182 343 236 674 750 -252 -397 105 -171 -280 186 924 1181 2207 3394
543 3394 3704 3724 3882 3476 2505 1295 -711 -2487 -4014 -5665 -7082 -7454 -7428 -6933 -5325 -2851 -744 1559
561 1559 4517 6689 8001 8893 8917 7767 6519 4554 1640 -805 -3390 -5459 -6653 -6648 -6710 -6701 -4813 -2685
579 -2685 -1187 838 2879 3287 3433 3866 3688 2201 773 -692 -1748 -2493 -2555 -2340 -1669 -663 575
596 575 2240 4031 4555 4552 4490 4012 2272 650 -1252 -3708 -5938 -6504 -6877 -6822 -5791 -4002 -2091 426
614 426 3190 5050 6813 7858 7513 6700 5237 3106 140 -2013 -4101 -6132 -7107 -7082 -6623 -5429 -3185
631 -3185 -1048 1265 3534 5230 6155 6676 6384 5156 3582 1848 -530 -2093 -3482 -4955 -5461 -4946
647 -4946 -3989 -3399 -1913 21 1063 2065 3120 3141 2465 1802 1292 117 -834 -1801 -2248 -2205 -1545 -837 113
666 113 1303 2034 2913 3999 4334 3560 2821 1755 138 -1501 -2469 -3897 -5246 -5979 -5512 -4928 -4032 -2604
684 -2604 -1210 554 2362 3511 4650 5380 5230 4755 4183 3437 1930 672 -378 -1440 -2306 -2684 -2518
701 -2518 -2707 -2608 -1920 -1308 -945 -550 -219 -24 -134 -248 -217 -240 -510 -745 -242 176 177 583 1337 1449 1636 2137
723 2137 2435 1997 1819 1520 762 80 -403 -1045 -1414 -1987 -2436 -2145 -1922 -1787 -1270 -860 -399 -118 568 1010
743 1010 954 960 1144 1113 737 552 793 247 -20 -65 61 97 31 -172 103 308 308 76 225 142 -205 -101 -116 -123
767 -123 -504 -371 -339 -268 -399 -224 -54 -323 -307 -377 -13 -171 -232 -119 -54 92 0 348 374 214 441 732 705
790 705 544 574 622 468 229 201 226 -173 -239 -167 -471 -682 -715 -641 -616 -785 -854 -782 -393 -356 -297 -83 83 126 552
815 552 774 588 462 733 802 714 521 426 555 294 112 317 415 58 40 -43 100 -160 -379 -333 -735 -957 -946
838 -946 -891 -1013 -984 -885 -459 -337 -337 310 797 791 964 1372 1465 1304 1199 995 672 219 7 -180 -596 -1090 -952
861 -952 -792 -656 -757 -393 -191 -258 0 81 185 -168 -309 -224 -459 -599 -650 -567 -301 -369 85 654 894 1205
883 1205 1381 1634 1546 1290 1104 703 -33 -629 -1080 -1264 -1760 -1906 -1839 -1632 -1498 -760 -101 482 834 1385 1950
904 1950 1800 1761 1445 993 374 -197 -393 -929 -1348 -1385 -1353 -1150 -977 -553 82 509 734 771 1121 1063 837 552
926 552 369 66 -285 -401 -398 -470 -608 -363 207 304 757 823 888 687 555 299 -384 -728 -1290 -1542 -1694 -2098
948 -2098 -1903 -1522 -950 -521 432 1491 1739 2296 2738 3013 2754 2425 2144 960 256 -500 -1104 -1661 -2403
967 -2403 -2758 -2836 -2135 -2180 -1757 -1051 -826 -326 125 732 794 881 998 919 634 1062 723 839 894 934 1091 1259
989 1259 1223 1145 1067 928 520 -124 -464 -1212 -1796 -2163 -2340 -2781 -2878 -2300 -2041 -1665 -1060 -317 528 1257 1771
1010 1771 2166 2425 2527 2615 2391 2176 1506 925 744 216 -391 -570 -827 -1563 -1140 -1320 -1321 -1508 -1488 -1428 -1285
1031 -1285 -1206 -916 -895 -1038 -610 -420 247 691 744 1018 1525 1821 1771 1901 2017 1541 1487 1306 913 239 -182
1052 -182 -617 -1036 -1186 -1591 -1778 -1887 -1832 -1895 -1384 -1062 -1238 -809 -113 57 182 558 1093 834 1164 1800 1557
1073 1557 1380 1359 1249 1172 814 395 86 -111 -397 -848 -993 -988 -1455 -1328 -987 -1194 -1134 -974 -435 -398 -168 78
1095 78 293 225 701 958 891 715 980 941 1145 871 668 610 139 -102 -181 -175 -443 -1033 -1003 -708 -1050 -1004 -642
1118 -642 -750 -554 -363 57 285 549 572 537 928 952 730 584 601 208 30 -20 -155 -401 -567 -408 -531 -625
1140 -625 -374 -439 -526 -86 -228 -147 -54 194 158 360 367 399 579 473 536 449 576 229 130 180 204 -275 -408 -450 -748
1165 -748 -980 -763 -829 -882 -391 -443 -289 125 216 425 772 997 783 827 993 739 554 705 619 42 -203 -9
1187 -9 -181 -440 -317 -438 -572 -497 -436 -477 -470 -569 -666 -494 -371 -365 -115 -102 272 84 640 892 718 743 985 903 662
1212 662 711 508 259 -107 -103 -189 -432 -594 -696 -853 -633 -603 -455 -355 -191 -191 210 234 -6 12 248 26 70
1235 70 151 357 221 136 83 348 373 388 259 451 371 214 281 306 78 -206 -155 -332 -391 -465 -341 -468 -571 -464
1259 -464 -189 -78 -100 94 99 196 94 244 117 286 116 82 190 14 68 5 143 94 264 316 367 278 365 300
1283 300 242 146 263 10 -115 -496 -439 -522 -748 -766 -786 -552 -449 -298 -299 -117 -97 159 273 614 278 551 683
1306 683 690 697 675 584 388 383 592 305 102 90 -13 -226 -441 -450 -573 -723 -1074 -1014 -814 -760 -728 -619 -435 -298 -214
1331 -214 152 721 690 626 918 1159 1029 1134 1049 808 635 406 524 124 -294 -518 -471 -888 -985 -1098 -980 -1007
1353 -1007 -1155 -914 -753 -529 -435 -227 6 112 212 618 792 895 1054 994 955 862 913 760 364 138 32
1374 32 -38 -238 -680 -692 -721 -813 -983 -817 -721 -600 -569 -330 -142 -33 -86 170 301 265 398 527 567 496 541 531
1398 531 364 471 494 533 366 123 111 114 -21 -501 -510 -557 -488 -555 -539 -629 -590 -453 -14 72 116 168 422 485 508 523
1424 523 426 297 201 155 87 5 -209 -137 -60 -64 -74 120 352 170 235 326 286 53 75 -310 -499 -437 -318 -543 -444
1449 -444 -492 -578 -247 -60 172 371 524 509 673 730 610 325 -32 49 -68 -393 -479 -387 -603 -564 -289 52 17
1472 17 236 248 394 537 577 539 428 230 -105 -287 -215 -455 -580 -589 -644 -698 -310 54 88 103 171 240 399 406 323
1497 323 260 2 46 -234 10 -335 -512 -160 -89 -54 189 397 573 599 474 551 240 119 -53 -569 -784 -954
1519 -954 -1148 -1218 -1047 -982 -635 -341 200 274 640 1006 1076 1163 1424 1149 743 567 517 -80 -135 -422 -527 -959
1541 -959 -879 -751 -547 -393 -421 -263 30 -109 7 106 1 -220 -239 -102 -167 -213 -11 77 134 405 802 687 703
1564 703 689 743 777 594 235 -180 -241 -500 -714 -821 -939 -1042 -1105 -654 -300 -122 -15 155 296 476 845 782
1586 782 445 737 643 333 231 -11 -257 -230 -461 -260 -169 -270 -249 -25 327 238 281 270 329 97 45 313 -12
1609 -12 -243 -173 -256 -375 -501 -201 -287 -54 -137 -314 -20 92 -40 -27 214 237 -78 80 224 197 381 358 207
1632 207 203 395 368 244 -12 67 36 31 -228 -258 -370 -226 -472 -529 -143 -561 -340 -435 -99 -74 -112 156 42 133
1656 133 262 434 464 310 534 419 488 584 367 361 316 111 57 -64 -248 -596 -507 -502 -603 -890 -777 -659 -585 -156
1680 -156 -25 -37 315 405 272 716 692 437 581 428 75 -2 -89 -43 -123 -229 -26 -240 -76 33 174 187 105
1703 105 186 153 81 -88 -195 -550 -488 -600 -645 -671 -712 -582 -325 -6 325 479 790 734 693 934 856 825 254 43
1727 43 -405 -442 -446 -474 -544 -683 -366 -219 93 53 426 611 450 426 421 218 -291 -640 -681 -819 -1051 -989 -909 -531
1751 -531 -205 117 506 962 1377 1306 1446 1276 1242 944 449 64 -577 -934 -965 -1153 -1145 -1139 -913 -852 -416 68 240
1774 240 434 457 582 740 510 194 -32 -306 -485 -317 -329 -312 -267 83 510 751 930 1289 1318 1161 714 544
1796 544 91 -266 -882 -1164 -1556 -1842 -1618 -1356 -1417 -967 -385 63 821 1031 1534 1540 1690 1342 1278 882 396
1817 396 34 -306 -656 -862 -789 -858 -750 -393 -154 92 244 265 337 435 286 118 -73 -387 -582 -610 -716 -500
1839 -500 -250 -227 112 389 511 928 977 1316 1026 1064 662 566 137 -477 -688 -1008 -1232 -1400 -1041 -1081 -817 -596
1861 -596 -79 387 510 757 960 752 844 790 551 22 -112 -269 -545 -514 -395 -490 -399 -127 44 163 207 201 363
1884 363 429 158 60 5 -90 -290 -321 -264 -294 -223 -37 32 309 324 526 596 474 469 197 179 -117 -62 -254 -487 -643
1909 -643 -501 -743 -298 -292 -372 109 33 34 271 212 155 409 385 566 538 413 435 279 336 119 183 53 -97 -214
1933 -214 -326 -243 -516 -423 -643 -513 -447 -476 -215 -234 -76 56 328 493 412 495 688 591 527 603 464 278 28
1956 28 -121 4 -223 -259 -277 -555 -488 -352 -448 -262 -300 -490 -365 -215 -414 -96 -148 95 119 228 352 484 697
1979 697 665 680 664 625 531 384 39 17 -104 -306 -355 -702 -578 -841 -772 -545 -396 -368 -137 122 216 438 444 508
2003 508 303 367 280 57 123 -94 -280 -217 -203 -123 -244 195 -6 23 128 267 376 261 208 124 -64 -286 -134
2026 -134 -415 -446 -320 -534 -325 -156 -150 -210 47 204 123 512 417 495 534 383 243 49 471 210 -223 11 -97
2049 -97 -56 -103 -77 -163 -59 -63 -140 2 -35 -169 -327 -77 -191 -235 -61 -15 -379 -41 186 55 274 457 543 625
2073 625 594 671 340 375 237 175 -121 -125 -426 -789 -841 -951 -897 -941 -706 -640 -348 -21 378 572 863 910 1064 1194
2097 1194 998 888 630 360 -19 -65 -428 -571 -934 -764 -736 -884 -575 -493 -308 -198 105 157 141 346 258 290
2119 290 293 362 298 283 293 408 439 485 304 286 501 398 181 141 -148 -479 -620 -697 -880 -1204 -1171 -962 -821 -838
2143 -838 -407 -24 360 657 955 1234 1346 1244 1222 973 668 479 265 -128 -414 -623 -829 -769 -1007 -977 -404
2164 -404 -528 -296 -220 -90 91 128 113 49 331 134 77 232 312 142 155 470 397 379 340 291 244 304 267 205 -222
2189 -222 -285 -417 -673 -577 -689 -510 -540 -512 -425 -142 -128 64 164 438 340 393 459 405 283 339 202 29 94 49
2213 49 -92 -242 -167 -175 -198 -151 -126 -228 35 -86 -28 -59 -8 32 -61 58 -61 -101 67 72 -119 -76 -193 -50 -342
2238 -342 -173 -199 -55 96 25 94 408 307 346 603 488 551 277 192 -11 50 -167 -412 -458 -509 -647 -734 -371
2261 -371 -409 -356 -212 -36 -127 149 170 251 197 158 262 211 303 116 306 215 130 284 532 573 462 516 644 265
2285 265 152 -36 -419 -628 -828 -1018 -1085 -970 -1225 -744 -641 -171 203 325 611 954 1284 1206 1265 1081 953
2306 953 594 253 154 -48 -455 -711 -728 -660 -550 -469 -225 -178 -122 -45 172 219 -4 23 -234 -312 -341 -333 -364 -385 -40
2331 -40 198 343 590 797 1034 960 931 748 605 313 31 -332 -793 -884 -803 -1025 -1137 -942 -843 -615 -32 87
2353 87 264 503 589 707 603 616 418 71 85 -57 -323 -366 -289 -300 -130 -145 -48 158 115 365 327 510 345 -22
2377 -22 -188 -335 -520 -512 -500 -545 -442 -311 14 49 99 435 547 477 507 342 336 315 191 88 -85 -499 -462 -679
2401 -679 -522 -221 -255 -78 168 204 499 293 344 427 186 229 171 -66 -199 -236 -421 -461 -428 -234 -339 -295 -34
2424 -34 -48 30 89 379 94 367 -8 164 183 140 138 48 19 10 74 14 144 159 353 121 -35 -100 -62 20 -181 -373
2450 -373 -245 -235 -520 -330 -261 -203 -81 -13 199 195 387 317 456 386 290 362 274 176 89 46 -8 -79 -192 -238 -215 -225
2476 -225 -376 -351 -215 -201 -194 -126 -132 -44 43 4 66 25 198 151 259 198 93 239 186 63 -198 29 -97 -154 -174 -116
2502 -116 -160 -166 96 -75 115 102 225 181 122 140 321 370 178 -17 6 -177 -224 -399 -129 -112 -102 -303 -315 -12
2526 -12 -23 -58 42 86 203 178 195 38 387 433 253 290 50 22 63 9 67 -160 -181 -443 -166 -240 -408 -400 -287
2551 -287 -98 -179 -184 -16 103 99 90 215 349 315 184 401 290 316 400 147 282 20 83 -157 -91 -161 -304 -576
2575 -576 -447 -655 -601 -314 -501 -319 -264 -157 71 420 229 623 478 573 505 466 235 266 111 -25 -416 -280
2597 -280 -435 -391 -606 -367 -280 -314 -123 116 143 54 161 199 197 189 80 209 -166 -210 -249 -209 -80 -145 -133 67 76 182
2623 182 252 166 264 113 165 -63 -78 -263 -227 -141 -280 -129 -274 -30 284 327 354 386 373 398 255 224 35 -271
2647 -271 -260 -414 -348 -512 -550 -660 -336 -152 -19 -2 247 432 441 562 495 663 206 159 48 -108 -352 -469 -346
2670 -346 -400 -466 -265 -241 18 113 249 272 318 196 129 92 -14 -158 -114 -225 -359 -76 -22 14 50 255 452 403
2694 403 376 491 401 265 225 -99 -228 -312 -551 -518 -457 -490 -525 -368 -11 -10 194 326 424 433 384 285 387 239 95
2719 95 -22 -157 -261 -142 -262 -58 -149 -131 80 49 203 103 283 69 145 51 -52 -53 -111 -199 -159 -174 -331 -203
2743 -203 -99 -134 40 134 208 277 309 371 255 319 126 0 -242 -252 -220 -90 -295 94 -215 58 76 92 156 146
2767 146 214 104 115 97 141 81 -215 -210 -74 -184 -244 -302 -180 -191 15 14 -63 190 87 78 4 140 340 31 141
2792 141 150 220 274 186 26 24 -30 109 -37 -90 -69 -117 -120 -211 -178 -172 -137 -20 -194 98 107 237 33 140 15 43 10
2819 10 21 339 75 120 -97 -50 37 24 154 43 6 -60 -156 -127 -220 -282 -116 -304 -277 -175 -30 -176 34 -46 204
2844 204 114 233 309 195 282 21 190 268 54 -112 -109 76 -162 -189 -236 -110 -157 -21 140 6 -57 69 111 -95
2868 -95 52 -33 -90 -177 -299 -247 -1 -58 -49 35 8 117 273 188 139 331 244 101 140 -22 8 49 -88 -152 -51 -63
2894 -63 -167 -36 -21 -165 -29 119 61 -33 135 186 59 53 76 -100 -70 -121 -99 91 -16 -20 -13 49 144 94 294 104
2920 104 82 217 138 186 -5 13 -57 -91 -52 119 -144 50 207 27 -9 0 98 -126 229 -21 24 -149 -97 30
2944 30 -75 46 -76 -178 -60 -61 32 196 165 149 121 105 -25 93 108 135 101 58 71 32 -96 -16 -90 -146 -221 -197
2970 -197 -118 -118 -9 -51 -75 -86 -125 -27 266 256 21 102 206 248 -13 141 84 39 -46 -186 -124 70 -206 -112 -101 -29
2996 -29 -139 15 -205 -1 -125 153 17 41 -73 -2 -86 46 7 55 -6 68 -68 112 131 19 128 161 154 48
3020 48 8 -176 -144 -57 -19 -127 -132 -267 -36 122 143 98 172 64 70 111 168 39 -2 -186 11 -142 0 -164 -69
3045 -69 1 -98 120 31 72 26 -33 171 147 6 100 131 17 -81 105 135 -250 -31 -11 -44 -105 -195 38 -66 -97 -206
3071 -206 -7 -39 -23 -56 -58 -193 93 172 29 49 91 95 274 -27 64 208 -84 150 96 104 33 5 -186 -20 -51 -10
3097 -10 -148 -95 -231 -244 -76 -55 -111 16 5 -74 63 156 29 127 81 190 256 152 145 307 36 -78 66 -83
3121 -83 0 -219 12 -269 -232 -144 -203 -133 -152 -212 -281 -10 -49 17 -22 29 -59 -9 22 -86 -38 273 257 118 142 204 136
3148 136 181 338 98 159 97 -42 -322 -167 1 -399 -230 -277 -397 -263 -191 -32 -56 117 -19 219 213 157 212
3171 212 208 211 222 238 -92 0 -6 68 42 -163 -34 -23 71 132 -84 -232 36 -214 -259 -267 -129 -252 -248 -76 15 -23 62
3198 62 68 223 317 303 390 417 220 261 283 -105 37 -135 -217 -122 -214 -102 -337 -200 -46 -60 4 -7 86 220 103
3223 103 64 98 24 139 20 126 185 -24 5 34 92 170 -18 58 14 -108 60 -1 63 -66 -70 -87 -63 25 -193 -99
3249 -99 -87 43 48 93 108 232 209 277 204 254 -84 17 63 -83 -96 -111 -193 -119 -29 -307 -145 75 -104 -57 48 -34
3275 -34 46 61 62 26 116 159 121 153 18 142 -47 46 -171 -19 -97 9 -166 -65 -156 -186 -273 -122 -24 -109 -78 -233
3301 -233 -9 -10 -265 -119 101 294 207 235 183 120 238 291 198 93 85 93 61 -141 -66 -125 -92 -222 -61 -285 -190 -147
3327 -147 -151 -118 -82 -24 -66 50 70 240 41 71 277 413 94 134 135 2 129 100 -3 84 -21 31 -97 -221 -122
3352 -122 -144 -343 -173 -200 -178 -33 -155 -132 55 3 148 200 94 -4 152 226 198 138 228 18 176 -40 12 40
3376 40 -12 -64 -116 -135 -163 -244 -101 -201 -92 -250 -120 -193 46 -66 107 47 -31 204 90 -75 144 89 271 55
3400 55 316 122 110 -28 8 117 -129 178 103 -159 -54 -138 -76 8 -154 20 -19 24 19 -63 58 68 -121 17
3424 17 196 2 151 -37 105 32 -83 12 -54 -142 136 -16 112 52 -55 95 -67 -55 55 -193 49 -92
3446 -92 -41 -31 -59 94 28 122 -137 -226 -23 134 -175 -93 -26 30 -54 79 60 -54 -6 14 110 62 -76 72 118 63
3472 63 6 126 191 7 -33 131 39 18 125 -43 -122 4 -243 -32 -80 16 -5 -53 -131 9 46 61 77 188 130
3497 130 -43 34 97 66 70 -42 132 75 78 143 101 66 22 -99 -135 9 1 -64 -198 12 -151 -85 -38 -164 187 -81
3523 -81 128 -39 2 13 172 152 247 35 -22 85 -9 7 -136 32 -33 39 -54 -85 20 -195 -36 -103 55 -113
3547 -113 2 -137 -136 8 -13 -100 90 -42 56 162 41 107 55 -59 26 59 137 -19 25 75 44 79 -69 79 -45
3572 -45 -25 56 -120 -7 119 -33 -5 -6 52 23 -57 19 -78 -1 161 -3 -61 95 120 -56 -48 108 -99 48 162
3597 162 52 120 57 66 17 77 100 142 -68 21 80 45 26 -12 31 -78 89 7 17 -30 66 -16 -34 -25 -21 15 62 294 18
3626 18 106 129 61 61 -50 101 117 -11 72 0 -26 -102 15 -13 -80 15 -82 -64 -190 35 -10 -159 -87 -2 -118 -137 -40
3653 -40 55 -65 44 92 150 140 -197 21 87 -29 25 25 -38 73 -140 52 56 7 64 -4 51 -195 -34 -35 -294 70
3679 70 -156 40 -68 -12 48 36 193 167 16 6 223 63 137 153 -12 -1 139 78 -84 -87 -8 35 -248 -132 -37
3704 -37 -50 41 89 -149 -117 62 -3 24 54 -303 31 65 -141 -77 -32 -36 -83 148 30 169 29 41 74 65 -7 110
3730 110 -84 -69 -210 111 -160 -71 115 -57 25 181 -13 9 52 9 116 60 40 -145 15 -35 -143 -47 -99 -50
3754 -50 -27 -11 66 40 2 178 103 32 77 96 77 34 -183 -172 -184 -128 -53 25 -29 38 190 -96 62 104 74 32 55 29
3782 29 -54 -63 -142 -128 20 -187 -75 28 111 -51 123 145 127 203 86 49 75 42 -164 62 -11 -23 -129 -156 -103 -27
3808 -27 -38 -109 101 67 -5 100 117 80 117 -69 117 -4 -121 -30 5 -37 -109 -70 106 -10 114 176 -46 135 202
3833 202 154 106 68 120 76 -9 -1 -96 -197 -4 -60 29 -11 150 -48 -80 -41 73 93 47 -16 -6 83 114 -15 -84 -141
3860 -141 -34 215 -29 31 -17 -102 58 -58 -43 26 -115 111 25 -81 -56 -100 -74 -68 -129 -53 -96 161 33 17 179
3885 179 34 170 87 202 54 128 153 53 20 -34 -22 1 -25 11 -155 -117 -48 100 23 -39 -82 -114 -27 -153 -2
3910 -2 -114 -2 -22 -101 17 -50 118 60 153 175 60 88 106 -10 229 51 65 119 -242 -20 -89 59 -95 -131 10
3935 10 -98 -108 -138 -73 -75 -75 -46 139 -44 35 205 101 222 -39 94 -48 103 78 199 87 68 -160 19 -59
3959 -59 -173 19 -49 -13 2 92 -58 34 97 77 102 -89 18 106 -68 26 168 49 -82 254 49 35 15 -47 67
3984 67 -131 -54 215 47 -23 -130 52 10 -149 -50 163 69 6 -63 -189 4 61 -163 95 -48 78 81 3 126
4008 126 173 211 -50 -17 0 -23 37 -18 98 -67 78 68 179 142 80 53 74 46 -30 -128 21 -18 -109 49 -113 22
4034 22 -245 -150 -142 -223 3 -78 4 -6 -1 59 -42 54 47 -130 140 -26 71 -112 -32 47 -155 105 10 34 -95 65
4060 65 167 -24 -63 -15 -116 -174 -63 97 -185 34 -93 47 108 -70 109 304 -46 86 -42 -120 145 196
4082 196 143 -33 -35 -67 -21 -107 5 -62 79 34 89 43 120 -113 -107 -177 8 115 151 -63 -154 31 -146 -62 -126 100
4108 100 -27 -24 -1 39 52 184 153 65 136 41 47 44 -33 -175 -58 68 -100 -241 -3 -108 -64 -88 -85 1 -9 -144 30
4135 30 93 38 59 103 -30 28 -3 3 139 123 189 82 134 152 150 93 88 -38 119 -69 -163 -226 6 -20 -78 -41 -18 -21 -82
4164 -82 -5 10 186 74 39 -9 53 79 141 124 89 2 33 32 -77 34 124 163 -168 -211 -205 -66 64 -38 54 27 91
4191 91 -118 -16 53 -166 63 -83 22 179 57 180 90 204 207 -3 -7 116 24 155 -68 -117 -96 85 -3 -27
4215 -27 -93 63 24 -101 30 25 119 -56 -102 5 143 143 40 -4 76 116 66 30 -14 -24 -51 42 -44 -178 -107 1 -191
4242 -191 -26 1 53 20 78 74 82 -175 26 -66 102 34 37 169 86 -129 167 2 34 -71 -198 -49 12 -147 -129
4267 -129 52 74 89 215 -31 -40 31 -41 75 100 87 14 -38 -52 18 59 -49 -105 30 -84 -12 43 -116 29 -61 -183
4293 -183 16 -44 9 -156 -309 -13 18 -50 -70 22 211 4 191 85 222 162 -33 -30 -95 45 -74 24 95 -44
4317 -44 -106 -101 -31 -155 -123 160 22 -56 -77 28 176 3 -43 79 41 20 -114 -67 -87 46 5 65 11 -71 14 41
4343 41 -8 -101 20 88 -123 -73 -67 -18 148 -35 27 -10 -89 43 -67 81 77 -96 -41 -3 13 -94 -163 -45 -211 -87
4369 -87 -144 50 -9 -146 -158 91 -60 128 118 140 63 55 144 124 121 60 -137 -19 -79 -43 -4 -79 87 134 -29 58 -29
4396 -29 -22 59 -32 46 23 -128 -95 187 -60 105 -59 93 198 -38 92 107 29 64 177 131 139 7 -25 -51 69
4421 69 -63 -229 -210 -181 -141 -154 -77 31 53 86 -7 42 89 133 192 224 349 -37 -18 -90 -62 55 -191 -175 67 127
4447 127 38 -98 -47 154 83 -80 207 -62 -127 27 -104 -57 -37 -8 -122 115 15 69 78 -77 11 -54 231 -12
4471 -12 71 37 -157 -27 66 -46 -148 -4 52 -127 -37 -11 110 -24 7 91 13 96 -2 10 62 -39 -48 16 -157 -73
4497 -73 -100 -75 -63 111 146 123 -11 32 -12 -44 111 122 -18 2 -15 100 148 173 105 -49 41 -95 135 72 -88 -96
4523 -96 -73 -40 28 46 -12 31 -61 38 -46 -108 -77 66 -52 -35 -64 2 65 21 -37 30 -5 -12 -55 169 4 -50 128 -22
4551 -22 138 -47 -49 -23 -55 -34 1 -111 -129 -99 -42 67 31 -171 66 87 238 17 81 78 124 113 55 -72 -114 15
4577 15 -143 -11 -58 14 -54 -32 30 56 -73 222 58 11 134 32 80 -124 -30 -103 -126 -74 18 42 -73 44 140
4602 140 22 111 -36 -91 -3 -1 2 -111 16 -63 97 -174 7 -97 -20 -161 55 12 -222 -88 41 -23 43 -35
4626 -35 -55 18 -77 -55 -94 79 40 31 117 79 108 167 160 27 43 59 157 201 34 -37 28 -8 5 -96 -132 45 2 -38 100
4655 100 -23 101 200 186 -30 -136 -67 3 -36 85 18 -95 55 25 115 28 -232 -9 -57 -15 -166 -40 -102 -132
4679 -132 -6 -220 -158 -335 42 75 119 -77 14 120 -44 24 95 20 5 24 81 45 17 48 165 104 -63 -54 46
4704 46 -123 -33 -81 -89 51 91 109 17 116 -46 242 -51 -121 15 -92 135 11 19 30 -50 -8 14 126 -37 -42 -58
4730 -58 -96 -47 -22 -109 23 -122 -64 -110 -3 -145 40 16 -102 -20 -133 -76 71 -29 -147 -83 88 -108 -38 82
4754 82 51 115 -193 173 -86 -36 22 131 -1 77 -20 177 46 18 -133 -53 -33 22 -42 -57 28 -28 216 -184 -100
4779 -100 -79 -158 148 -41 -126 77 34 5 16 6 176 118 -19 -14 210 265 54 -56 70 70 29 51 -55 -105 -65 -197
4805 -197 -106 -36 74 -183 -156 17 79 113 124 112 -73 28 -9 3 131 71 31 18 110 76 53 -98 121 -120 -150
4830 -150 52 27 92 189 79 -86 -79 -14 -97 -10 -58 0 -109 -131 -3 -60 53 -10 74 33 101 101 120 -1 186 67
4856 67 143 48 -140 -156 -125 38 -11 -62 86 -115 -87 -51 -39 -71 -74 109 -38 -80 -6 35 99 -32 31 93 -237 -3
4882 -3 -55 -3 7 12 94 18 47 168 11 135 -30 34 -32 18 -144 -106 65 -45 -108 -126 -141 129 31 -46 3 -132 24
4909 24 -83 -56 -72 -176 -128 28 52 -8 93 -93 3 15 109 156 20 99 164 147 223 -1 -13 -41 -34 -259 -127 -95
4935 -95 -52 -35 -121 -79 100 -29 18 198 168 -54 -78 90 -12 83 -183 -168 -65 46 77 133 116 34 149 -25 6
4960 6 12 9 173 23 233 34 -71 -275 -202 -43 27 -97 -27 -7 -138 32 17 214 93 287 5 -110 -5 -26
4984 -26 -199 -104 -139 -21 34 -146 -26 246 96 27 -32 48 111 80 -20 39 139 -18 -35 69 -17 170 -155 -144
5008 -144 -16 -7 60 50 -15 -82 4 -24 128 -88 208 112 5 9 7 121 -192 -79 129 16 -124 -88 76 147 -115
5033 -115 111 -158 -146 -184 -23 12 -77 104 17 140 -33 13 -105 70 151 -21 7 18 -80 112 -110 -47 4 108
5057 108 -52 -257 52 -128 -98 -121 -40 40 -151 -216 -119 -109 -159 -197 -79 -10 -125 66 59 168 52 78 89 -160 63
5082 63 4 30 80 -6 72 146 70 -113 -25 -89 49 38 -200 -13 8 30 -181 -64 63 -114 4 80 -31 -115 -60
5107 -60 47 25 -81 106 -28 132 51 192 4 -82 -55 66 -117 -22 -167 -228 -80 40 35 -1 99 148 95 96 117
5132 117 31 -17 -89 -83 -77 61 72 45 -103 79 -18 46 -58 177 -3 119 104 -111 124 41 -164 46 159 182 164
5157 164 -61 -50 -70 22 100 -146 85 -173 -213 -55 127 62 8 14 -7 -17 77 98 -24 72 31 88 65 -15 -19 44 16
5184 16 38 142 11 97 -1 175 5 18 89 -59 10 -3 29 -44 -86 -128 132 70 -7 164 -71 -247 69 19 5
5209 5 -44 -25 -3 -256 -61 -2 143 103 53 -122 58 177 -145 -58 -5 25 114 -60 -195 -74 47 -72 -15 53 -149
5234 -149 152 -111 -35 -3 115 6 130 107 -104 180 45 67 -33 12 15 -2 154 37 148 52 -124 -139 -118 -90
5258 -90 131 -73 -102 -7 89 -77 -77 8 2 37 84 78 -11 -211 101 157 51 -57 -56 3 -116 -22 -118 59 140 -34 61
5285 61 -57 -131 -21 -10 -25 41 65 -19 -129 -207 16 -110 -107 -37 -81 -93 93 128 153 54 19 -77 -72 85 -21 47 136
5312 136 -39 89 -93 -84 176 1 -155 -64 159 0 -94 -2 -32 13 -164 59 -259 132 2 -114 -45 -85 -7
5335 -7 -67 111 -60 162 20 66 96 -113 114 -52 79 -5 103 85 -109 -65 -50 -34 39 -85 -31 88 -18 -37
5359 -37 95 7 24 -2 133 43 -42 -30 -64 -135 -67 197 102 52 -14 37 -97 -42 -56 38 -134 162 -47 55 -81 -69
5385 -69 -63 59 -177 36 -62 2 -64 -8 137 117 -89 -19 12 100 29 -42 -95 -21 -125 48 -152 30 -14 12 6 -72 105
5412 105 -45 -54 35 -150 7 -95 -81 8 -122 69 8 -92 54 79 -15 19 19 -82 3 23 78 -41 27 72 63 66 -14
5439 -14 48 -28 -18 107 -37 -33 6 -295 141 -11 -18 27 -121 5 103 -29 -132 -40 -25 170 -54 -39 108 -127 154
5464 154 -32 81 -38 -2 12 39 -34 -186 -52 -69 -19 -161 87 -112 -175 -20 -160 -29 61 -6 32 -138 -128 13
5488 13 -73 57 52 16 26 -97 64 -90 -157 -130 -73 -155 13 7 -176 55 -92 -74 171 12 -53 -25 5 180 113 45
5514 45 -66 163 70 14 268 163 145 85 194 79 95 -18 -189 -142 -82 8 132 63 8 125 30 41 -10 143 -94
5539 -94 76 121 116 7 -134 -26 244 39 -74 -32 124 -55 36 -49 -5 -64 16 -2 -25 157 160 109 -48 56 24
5564 24 -60 70 -112 47 -27 97 49 16 47 68 -35 63 62 -18 -79 -43 48 -17 -94 -33 -10 -169 -45 70 -77 -26
5590 -26 -14 -75 48 118 106 90 141 -29 161 -83 91 12 -12 -33 21 176 19 57 -27 -60 -81 -117 -54 -10 -86 -63 65
5617 65 -97 -46 53 -86 3 115 5 25 -16 -43 -56 -7 4 -239 104 16 112 59 -36 95 -109 -196 -66 -112 161
5642 161 -21 34 54 -76 -16 -148 -99 -79 -31 -225 140 -44 -66 -97 -82 41 -89 179 167 58 -60 -48 91 55
5666 55 -112 -41 105 132 -90 44 176 48 98 -36 72 -50 -10 121 -32 61 -148 0 -15 51 92 -33 36
5689 36 -33 -106 36 15 30 60 -29 -18 -36 -65 -139 -46 -17 -72 80 -212 -56 -95 2 -68 72 222 -43 -53 -23 -25 55
5716 55 -83 -130 -49 -74 128 -48 73 -10 -23 -28 104 0 -124 135 62 -56 -204 -66 7 -50 104 129 -19 207
5740 207 145 10 25 -30 -82 198 -78 -114 25 13 -83 39 -198 65 15 -180 -51 67 -55 -99 -13 134 53 -13
5764 -13 -47 -48 -52 -103 6 126 -85 77 -45 -9 -20 78 10 -8 17 29 -15 -27 -18 60 -270 -29 11 58 142 -69 -28 94
5792 94 -38 -130 -8 98 141 -38 7 -18 -31 7 -162 -233 -81 -157 225 87 0 -89 59 77 -9 -11 -139 13 -30
5817 -30 179 -88 -29 -96 -41 90 -175 -26 74 -2 -35 53 39 -110 -23 -63 82 -111 51 -70 -24 -165 -24 -73
5841 -73 -111 -116 -39 1 -62 83 -35 -35 18 137 77 39 19 10 18 -66 115 60 -28 -36 -113 -11 -5 -31 123 126 -186 94 89 124
5871 124 12 78 -68 -98 -46 -166 -84 -87 55 -139 134 -159 9 186 90 159 -111 123 101 9 137 98 -101 -42
5895 -42 -184 -4 -47 1 -50 123 0 50 -9 -100 -56 -181 132 12 69 -43 143 89 131 52 89 -5 124 -73 -113
5920 -113 119 -11 -57 -69 -188 30 98 -38 -50 -52 89 -63 66 34 97 -82 7 -193 -125 -38 -20 35 15 -25 3
5945 3 80 60 27 2 -103 -55 -37 67 149 -102 5 -69 -82 220 -36 -30 -38 2 50 -251 -70 79 -4 44 -42 12 56
5972 56 -199 -82 -48 16 -18 -64 -57 56 49 -88 -87 -128 23 95 -43 -27 174 -78 -17 14 125 116 -31 92 -99 18
5998 18 40 -24 203 40 -6 25 -72 81 -30 60 -9 66 -147 79 -80 -86 -6 -83 -10 -9 154 158 -20 19 92 -4 227
6025 227 -77 -169 40 -17 75 -338 -100 32 -14 -47 58 95 -114 -109 -70 116 134 70 -110 -37 -37 -58 26 65 -44 20
6051 20 58 -117 11 -96 6 -167 130 46 -20 -62 -45 -75 -26 81 -106 36 19 -162 -151 67 -113 -7 -42 -184
6075 -184 -11 15 61 124 -86 -51 167 113 98 -10 89 -24 -149 -15 -38 -71 -55 49 -45 -110 -149 -50 47 -123 -128 96
6101 96 -23 -22 -75 -74 93 30 52 229 64 108 18 204 94 96 -3 85 100 30 -100 -3 31 43 6 -7 147 -52 -1
6128 -1 32 3 96 -24 -52 269 -60 77 55 77 -8 110 -65 38 123 130 50 188 65 22 99 74 28 -155 -74 -66 22
6155 22 102 -51 -119 -150 -99 27 -15 115 -12 -43 42 58 28 48 -31 42 97 0 -18 -53 -12 -103 -219 66 64 39 38 -98
6183 -98 114 35 26 -67 21 -22 49 40 -21 -61 -115 -45 -21 13 -40 -25 46 22 -31 -42 124 19 -1 7 -81 -3 -58 115 -45
6212 -45 -12 -71 70 79 126 -105 52 -37 98 -80 13 176 73 157 -31 -141 39 135 -86 -41 26 -84 121 -73
6236 -73 33 44 62 -75 -103 -193 -7 147 -23 5 -45 -53 106 4 46 44 87 -85 -23 -64 -85 -120 95 -90 -146 102
6262 102 -15 -10 -20 -106 -86 -79 -67 -112 41 120 17 78 50 -19 -1 19 -84 41 125 128 150 -31 57 -79 -53 -22 -83 51
6290 51 62 -92 -119 169 -159 -73 -28 -40 -105 -13 -75 -214 185 12 -157 -80 295 289 -104 74 134 18 -97 -23 20
6315 20 11 196 12 -99 123 79 27 -65 -73 11 -112 23 -79 15 82 68 48 -56 -117 184 -45 -46 -158 -16 27 -20
6341 -20 61 80 118 -10 73 165 -96 -30 -49 93 74 149 -38 -129 -6 2 57 -122 49 33 89 62 84 32 168 33
6367 33 -84 -22 -138 -90 -35 33 -153 -81 91 -47 61 -3 53 -89 -18 -18 -23 -51 -24 -121 -76 -124 -111 6 -23 117 -11
6394 -11 -59 -26 75 -59 64 28 138 140 37 -115 -72 -29 -69 236 -59 70 43 -61 -4 18 48 -63 -169 -259 96
6419 96 -222 160 -78 -245 -53 -116 61 -83 -48 105 -43 36 -102 1 -9 142 111 57 151 -53 4 6 210 25
6443 25 -1 104 33 20 -49 27 170 111 29 189 21 -82 -54 6 38 -58 -32 82 137 159 -33 23 -111 -192 -61 83
6469 83 -122 -9 -40 -43 -124 -58 14 57 -177 14 -111 -34 -224 120 -84 -79 -37 -51 -18 -130 104 60 -3 -32 -70 111
6495 111 169 116 -176 -71 -57 48 93 144 189 76 68 36 88 8 -95 108 22 25 -27 -56 -15 43 11 -94 -104 88 117
6522 117 182 104 86 55 -49 -90 16 17 10 -87 239 95 -67 13 139 -5 5 -56 -188 -63 35 37 -48 -165 17 -17
6548 -17 -6 145 -122 -150 -4 17 203 45 -180 -66 -106 -159 38 47 -42 -44 -47 48 -90 -40 -90 3 165 -191 -47 102
6574 102 8 -34 9 -5 -27 134 52 -116 -93 178 -56 115 -11 -14 -108 57 -83 -41 27 134 113 -23 -29 -79 -100 -42
6600 -42 41 29 -54 102 -18 42 134 148 -121 50 133 -118 155 -176 11 21 26 -109 -168 -25 -25 -88 123 -107 -60
6625 -60 -28 91 44 63 -127 -36 146 64 259 -18 -97 149 -11 70 140 -68 -25 24 -3 -35 -36 106 -47 -27 -31 -60
6651 -60 -20 18 53 47 -42 -186 -111 11 88 112 -193 69 -49 122 25 33 82 -134 -63 18 1 -126 26 -103 19 -77
6677 -77 13 125 -71 -149 -180 58 40 244 -12 -53 -26 -62 66 35 22 -139 126 93 -158 -93 125 149 -1 -128
6701 -128 24 59 122 65 -182 -2 126 1 70 180 -140 -167 -94 -57 60 23 -122 -92 28 83 27 29 -63 18 130
6726 130 0 10 114 103 123 12 -6 26 -66 147 -18 38 108 -15 -148 -2 89 -8 -48 -23 30 4 109 31 -55
6751 -55 107 64 102 -16 90 46 -57 -12 15 78 -76 -85 13 17 155 -141 137 69 97 20 -60 19 94 149 -76 -158 22
6778 22 28 83 89 99 117 -27 65 242 199 57 38 159 -90 -38 75 98 131 80 45 17 -20 76 119 159 -130 -69 100
6805 100 26 -90 -56 -29 9 -7 -111 -17 92 -95 10 -113 -51 13 -72 -203 -45 -104 -98 -66 92 -15 -11 -15 73 53
6831 53 -117 -110 102 -3 -174 -50 13 -22 10 -14 24 -117 -94 -128 111 37 -130 -51 -113 62 -42 6 -1 -94 -132 -74
6857 -74 47 -76 102 -60 7 41 -1 51 -10 69 -56 59 -145 152 80 -217 -87 -122 27 -7 -76 -52 -196 71
6881 71 -81 143 -43 34 -123 154 -60 -5 49 -21 -8 -71 157 53 15 79 -53 -83 93 -82 199 16 -14 -91
6905 -91 -68 -10 72 24 -20 9 72 71 43 -29 33 162 223 93 57 130 7 20 171 -123 123 89 -22 -11 -68 30 -7
6932 -7 6 -114 -88 -108 -51 1 -141 24 12 -80 -62 -76 81 96 127 -18 -38 -73 -116 -160 138 -44 60 -3 83 -121
6958 -121 -25 -32 0 -155 156 1 -75 62 75 -47 65 109 -134 -94 -58 61 -36 -121 -124 48 27 -89 44 141 -145
6983 -145 128 48 -61 -65 104 -26 -21 147 31 -88 123 24 40 144 145 -112 -24 -57 -16 17 -38 -50 -40 189 15
7008 15 194 -104 -15 110 -53 -78 -18 -45 -117 27 19 49 -54 -38 82 69 133 123 87 -178 -134 -62 78 -133 -40 -28
7034 -28 -51 83 60 -12 48 -13 -89 96 -40 -75 -72 -114 -79 -67 52 -24 -80 32 63 -52 102 94 -53 40 25 -6 108
7061 108 -63 18 -33 47 -37 88 17 -103 116 17 10 -21 -98 145 -16 97 -3 67 -37 69 16 -156 18 50
7085 50 36 -26 -30 12 36 -76 43 4 -60 25 -120 -166 -105 43 145 -119 -6 -33 -52 -147 101 -131 -129 -19 -232 99
7111 99 -11 -172 -53 -7 -108 157 17 -99 2 -1 124 -113 -20 -34 72 -174 33 -67 84 166 62 -187
7133 -187 -7 35 -103 -64 -121 -12 -70 -101 -45 19 -148 48 126 13 -139 -68 17 -129 -76 73 -2 -59 105 -86
7157 -86 25 -76 -20 -38 -156 -11 -63 -10 20 12 88 74 -9 64 -45 -74 31 100 -26 62 -88 -41 -146 -10 121
7182 121 -20 -48 74 147 -50 -4 265 57 -66 -6 -6 -48 38 160 76 -125 45 -185 -145 33 14 84 60 74 -140
7207 -140 26 62 101 84 -148 99 -166 56 0 -145 10 169 68 13 -46 15 154 -242 10 56 78 50 60 -98
7231 -98 -69 -97 57 -42 22 44 37 -58 -23 134 -33 59 32 11 55 -26 -67 59 138 25 12 -55 -35 -173 -124 -64 94
7258 94 -3 32 133 -22 -110 5 39 7 -152 40 37 -59 -53 37 -5 73 28 132 215 -64 113 48 80 104 -195 26
7284 26 -18 -109 -11 133 -153 46 -4 -62 -101 20 -30 66 -42 206 103 -17 36 53 70 31 -61 -183 -16 -49 93
7309 93 -32 98 22 -12 -24 25 33 -137 4 -52 -55 25 25 -90 110 -144 -102 57 35 14 23 27 -105 -4 -88 33 88
7336 88 -29 155 -45 24 89 8 -147 33 -1 197 -66 -6 -161 185 11 54 -84 83 36 59 -160 -99 103
7359 103 -27 -123 -65 23 44 89 23 -96 -19 93 -54 7 -46 -82 50 28 49 0 15 226 98 22 10 90 0 -105
7385 -105 58 71 -67 -9 66 -59 -90 89 -87 39 12 150 94 55 160 12 133 50 52 -227 12 67 -68 119
7409 119 133 54 81 -3 62 -75 -60 -25 -88 27 80 66 0 97 195 -48 63 -31 162 -31 193 -118 -142 152 82
7434 82 -55 -113 -54 -190 -142 -32 120 -30 14 -90 98 9 -1 11 -38 -12 -53 -5 21 -120 106 -19 50 -108 143
7459 143 35 131 15 52 141 -123 -34 -32 215 30 -110 -122 -34 -15 20 39 -21 67 28 -31 -5 -45 147 -4 100 13
7485 13 40 -68 155 -112 110 -58 149 96 -230 -62 -16 -80 35 102 -56 -19 37 -94 81 30 -47 15 -1 119
7509 119 0 -115 265 49 63 -5 73 103 118 25 31 34 -71 11 27 190 -47 -86 73 -77 25 -37 172 -6 36
7534 36 257 -60 27 -21 -19 22 19 -100 -56 -66 -6 89 37 -88 -195 -72 -34 66 -8 -149 -152 -27 -4 115 -101 77
7560 77 -154 24 -102 -41 -88 -28 -45 10 63 52 60 -45 49 -52 80 87 4 -134 40 70 96 -103 21 -101 111
7585 111 -47 -72 36 -196 -30 39 -133 -4 -94 111 121 112 131 -62 14 218 -57 131 19 86 110 184 140 -40
7609 -40 -147 11 34 2 -99 -69 -97 -18 -59 -66 -70 -4 91 -125 19 -53 1 9 -13 82 -28 91 131 -33 -11 -68 94
7636 94 -51 -39 -2 -82 33 -1 12 -80 -35 167 -94 -111 58 -166 -47 -46 -164 2 -70 -12 211 -44 28 46 -81
7661 -81 -7 -154 123 -23 -48 19 -100 -168 -145 -84 -43 -37 52 -86 108 4 -16 63 -213 -4 -14 60 68 -96 -71 102
7687 102 8 104 -1 107 20 -111 249 37 -3 -9 140 67 -94 -93 -76 12 250 -13 -99 -108 -35 6 -79 56 70 123
7713 123 -72 82 103 64 60 -103 158 57 116 53 4 -20 -47 90 86 -33 -208 -43 29 80 58 109 -15 68 16 24
7739 24 -52 -102 -2 49 63 -54 -31 -169 -121 -72 107 100 62 -69 -32 -140 54 -2 -69 62 79 94 -94 150 68 -44
7765 -44 -39 92 189 -35 -52 -22 117 -59 10 105 23 89 -22 -77 -31 -93 -77 -98 5 -31 -52 -132 21 46 130 121 -18
7792 -18 89 -7 14 -4 -65 34 33 -172 5 -93 -132 -77 164 -93 -130 54 -233 89 50 -61 94 49 37 29 5 33
7818 33 174 -13 32 -44 -1 111 35 157 68 7 -56 92 -9 -24 -74 -67 240 33 -96 -8 98 61 -43 300 -6
7843 -6 -10 263 140 11 -24 49 -99 -142 -76 8 0 28 138 1 -179 167 96 117 -35 -74 201 -89 53 -71 37
7868 37 -42 188 164 67 67 81 38 -51 56 30 -113 -119 -36 -24 -39 150 -80 150 -133 39 -112 27 -94 -118 163
7893 163 -102 127 -245 -20 57 -50 -96 37 -16 73 9 -98 17 -7 37 -85 28 -2 -37 -31 -35 6 -122 6 -105
7918 -105 47 166 -69 50 -30 48 -10 70 32 21 168 41 -12 80 -68 20 -260 92 110 -87 -16 3 68 3 -29
7943 -29 34 32 -48 -148 -57 -78 -22 -38 -47 -114 -10 -9 -36 -50 101 -92 126 83 25 -133 -31 -81 47 87 -51 -56 -92 46
7971 46 7 66 84 5 -217 57 -224 147 -44 -57 0 -22 22 -57 76 -92 23 -176 16 103 -35 -64 -106 -7 52
7996 52 -94 -154 -176 -89 -6 114 139 -21 -7 -13 -1 -17 -73 147 29 -56 13 -55 -113 25 77 -50 -148 -43 155 74
8022 74 66 96 3 -103 -148 -165 -45 -24 -91 87 -130 -170 -109 130 66 33 -44 -149 112 218 -139 106 64 -168 12
8047 12 -120 -51 -10 -8 -148 51 117 9 1 68 93 36 -15 -179 1 -58 -13 -111 -31 77 -51 -101 -44 105 -24 -70
8073 -70 103 0 8 -68 7 -94 -110 -74 -108 74 -43 27 -12 9 44 -44 37 81 3 2 -159 -7 -54 -102 -18 -46 -35 71
8101 71 -121 51 18 -88 -86 25 -184 -118 -62 -187 29 -45 103 54 -141 173 -148 60 -61 -83 91 45 1 10
8125 10 -67 -5 -80 29 3 74 -23 -142 72 69 56 69 -51 86 65 -55 -109 201 -24 -29 14 69 35 97 -155 31
8151 31 -60 55 -5 97 -32 62 101 -105 -35 -17 -127 0 -67 -73 -118 -48 -13 41 122 53 -101 -44 157 -68 143 10
8177 10 -112 198 -16 18 -99 28 9 102 47 98 -89 -6 -86 9
8191I
$$ Imaginary data points
##PAGE= N=2
##DATA TABLE= (X++(I..I)), XYDATA
0 0 0 0 0 0 0 0 0 0 0 0 0 0 0 -8 8 -8 8 -8 9 -16 16 -24 24 -32 32 -40 48 -56 64 -72 81 -95 105 -120 135
35 135 -153 173 -192 216 -240 268 -296 329 -365 405 -446 493 -544 598 -661 726 -801 882 -974
54 -974 1076 -1192 1324 -1474 1651 -1858 2108 -2415 2803 -3311 4007 -5027 6681 -9808 17902
69 17902 -89180 -179659 -114478 -117468 -71122 -34740 -13246 -6272 41992 75507 95248 109141
81 109141 120946 96973 68927 45856 28703 11401 9580 5073 -7846 -26588 -33941 -35035 -29263
94 -29263 -20155 -8235 -8402 -19745 -33891 -40367 -44542 -44698 -36901 -27524 -26711 -23728 -12083 1359 17823
109 17823 44156 65632 71077 72873 73087 59573 43082 37300 25223 176 -19820 -34843 -55038
122 -55038 -69657 -67193 -59007 -51785 -38907 -24420 -14513 -4524 8796 22141 33217 38279 36195
135 36195 29815 21653 12966 7975 5810 1217 -3176 -4134 -5266 -7613 -4271 2031 4449 6356 9993
150 9993 6999 -754 -4885 -6569 -11484 -14324 -13964 -17036 -21180 -18591 -13422 -9277 -1275 7855 11951
165 11951 13668 17229 18554 16706 16209 15566 10987 4685 -123 -4204 -7804 -9661 -9348 -7225 -6615 -6366
181 -6366 -4551 -2542 -2001 -540 1976 2236 18 -1078 -2191 -4116 -4379 -2714 -1560 -976 345 1265
197 1265 2255 4157 6674 7466 7611 7529 5601 3637 2602 1139 -986 -2090 -2879 -4245 -5629 -5824 -5690
214 -5690 -5816 -4561 -3358 -2886 -2832 -2517 -1812 -299 1012 2394 4055 4523 4760 5662 6510 6420 5852 5272 4262
233 4262 1555 -689 -2023 -4266 -6331 -6901 -7280 -7384 -7208 -6022 -4316 -2546 -148 2493 3896 4755
249 4755 5356 5778 5516 4942 4190 2698 1188 64 -1181 -1667 -1744 -1815 -1935 -1273 -597 -499 -567 -127 -281 -1094
269 -1094 -1513 -1657 -2419 -3471 -3338 -3153 -2702 -1759 -293 993 2069 3235 4778 5559 6186 5502 4869 3940
287 3940 2255 745 -455 -2006 -3566 -4553 -4995 -5124 -5159 -4473 -3412 -2722 -1409 -172 945 1535 1927
304 1927 2455 2855 2623 2341 2362 1774 1056 719 811 607 -91 -65 7 -446 -431 -49 132 -358 -490 -148 -1 -281
326 -281 -274 -510 -785 -1147 -1325 -1701 -1766 -2299 -2409 -1648 -1291 -1029 -257 1081 1717 2329 3608 4588 4144 3966 3928
347 3928 2880 1521 459 -556 -2035 -3623 -4035 -4192 -4328 -3927 -3015 -1724 -514 747 1945 2664 2883
364 2883 2454 2340 1736 789 -864 -1806 -2436 -3416 -3099 -2172 -1398 -316 1160 2879 4529 4979 5607 5610 4758
383 4758 3244 1344 -401 -2754 -5247 -6536 -7197 -7496 -7190 -5630 -3976 -2084 388 3216 5058 5870
399 5870 6946 6655 5832 4712 2821 895 -1339 -3081 -4178 -4817 -4492 -3960 -2902 -1174 440 1865
415 1865 3468 4469 4046 3395 2774 1342 -564 -2181 -3687 -5050 -5833 -5057 -4513 -3299 -1595 139 2347
432 2347 4024 5309 5997 6335 5349 3915 2808 1336 -1105 -2992 -3868 -4536 -5008 -4120 -3112 -2293 -1154
449 -1154 559 2145 2747 3223 3149 2558 2157 951 -212 -1137 -2213 -3219 -3202 -2633 -2632 -1722 -258 810 1671
468 1671 2825 3868 3620 3469 3217 2475 1310 219 -1213 -2153 -2713 -3496 -3652 -3092 -3123 -2646 -1463 -482
486 -482 -273 299 1745 1842 1494 2188 2562 2273 2019 2180 1601 999 818 731 117 -298 -1326 -2026 -1988 -2247 -2919
507 -2919 -2824 -2755 -2790 -2077 -645 316 390 1638 2566 2810 3294 3506 2751 2058 1560 782 85 -603 -1527 -2145 -1640
528 -1640 -1343 -1514 -1283 -587 -806 -799 114 -346 -1245 -1465 -1444 -2046 -1970 -1478 -990 -524 769 2210 3435 4662
548 4662 5330 5837 6269 5223 3538 2055 311 -2399 -4557 -6025 -7882 -8974 -8488 -7331 -6239 -4134
564 -4134 -1289 1341 3954 6393 7729 8196 8446 7412 5973 4152 1993 -1101 -2789 -3922 -5214 -5910
580 -5910 -5062 -4425 -3445 -1409 505 1548 2103 2787 2617 2064 1243 -88 -1739 -2802 -3512 -3650 -2737 -2433
598 -2433 -1548 617 2672 4021 5380 6351 6236 5216 4185 2681 -44 -2572 -4358 -6370 -7506 -7509 -6972
615 -6972 -5768 -3765 -1426 1202 3872 5879 6751 7368 7432 6015 4180 2163 -362 -3124 -4600 -6150
631 -6150 -7083 -6993 -5876 -4313 -2487 -412 1814 3729 5472 5862 5862 5661 4361 2531 1188 -465 -2595
648 -2595 -3624 -3770 -4009 -3840 -2676 -1743 -853 520 1668 2227 2134 1943 1075 144 -445 -1674 -2564 -2926 -3033
667 -3033 -2559 -1438 -65 886 2145 3678 4632 5033 5245 4642 3242 2052 538 -929 -2883 -4276 -5383
684 -5383 -5780 -5720 -5212 -4362 -3120 -1678 -450 1571 2906 3205 3770 4433 4014 3385 2946 2100 905 77
702 77 -400 -859 -1230 -1408 -1165 -1127 -625 -880 -472 -298 -571 -823 -757 -897 -1278 -1571 -1304 -1462 -1350 -730 -148
723 -148 399 829 1614 1860 2103 2508 2399 2117 1719 1111 482 139 -471 -1147 -1387 -1668 -1999 -1684 -1124 -1095 -1212
744 -1212 -596 -20 43 373 598 554 332 329 445 357 49 95 -84 78 209 47 274 317 -14 283 662 461
766 461 167 73 285 125 -13 0 51 -256 -327 -247 -100 -448 -299 -389 -288 -501 -480 -287 -254 -666 -538 -154 0
789 0 -158 228 322 218 422 701 811 662 772 654 432 588 420 642 224 -118 -293 -301 -275 -632 -752 -880
811 -880 -871 -806 -637 -470 -365 -580 -257 55 -36 -28 263 187 435 251 754 443 366 202 672 808 699 480 616
834 616 583 346 330 271 147 -405 -684 -571 -1155 -1208 -1258 -1458 -1155 -1303 -748 -300 -39 250 559 953 1088 1312
856 1312 1327 1326 861 646 745 187 -38 -308 -308 -495 -259 -5 -106 -14 -22 212 161 140 -131 -482 -595 -1150 -1013 -847
880 -847 -893 -983 -787 -220 -3 481 1062 1425 1532 1523 1823 1774 1325 798 167 -292 -963 -1351 -1705 -1857 -1859 -1789 -1329
903 -1329 -504 79 495 1078 1260 1587 1692 1613 999 927 316 -337 -660 -999 -1202 -1293 -1139 -894 -495 -63 118
924 118 281 650 897 773 574 634 44 -539 -287 -280 -746 -590 -228 -189 179 608 961 1271 1300 1334 1028 697
946 697 175 -469 -895 -1680 -2196 -2343 -2444 -2557 -2099 -1345 -591 104 844 1653 2174 2569 2864 2855 2872 2291 1415
967 1415 752 132 -539 -1065 -1248 -1779 -2083 -1895 -1625 -1474 -1477 -986 -654 -596 -323 -159 -265 -146 -59 -10 215 229
989 229 546 976 1315 1669 1712 2179 2340 1896 1629 1576 728 40 -473 -1088 -2065 -2470 -2448 -2771 -2680 -2421 -2302 -1705
1011 -1705 -1006 -401 509 952 1299 1632 2002 2280 2086 1962 1636 1408 1101 1289 713 321 147 -24 -269 -422
1031 -422 -681 -1028 -1181 -1208 -1428 -1442 -1415 -1813 -1910 -1255 -759 -889 -387 45 303 878 1520 1673 1781 1723 2009 1900
1053 1900 1862 1581 1022 508 387 -62 -610 -696 -1322 -1505 -1418 -1575 -1769 -1544 -1240 -1260 -1138 -648 -359 -246 265
1074 265 461 828 1164 1281 1294 1225 1417 1341 1117 1006 528 302 276 35 -587 -610 -625 -948 -1089 -891 -775 -1161
1096 -1161 -888 -571 -659 -554 -254 111 306 568 493 778 1031 860 1066 1217 920 564 660 577 179 93 -158
1117 -158 -596 -778 -735 -781 -1020 -907 -854 -565 -312 122 -60 103 434 400 613 857 663 317 613 662 157 -10
1139 -10 -30 -272 -524 -257 -251 -578 -539 -423 -443 -409 -99 -408 -312 -122 -161 96 434 392 329 506 829 606 762 795
1163 795 612 312 308 68 -264 -389 -468 -706 -836 -783 -881 -1021 -592 -447 -487 -73 173 277 718 691 468 550 748
1186 748 722 498 456 459 297 115 140 80 91 -20 -387 -96 -312 -548 -750 -599 -669 -862 -547 -429 -798 -630 -147
1209 -147 -29 259 523 740 660 755 885 957 774 559 385 245 255 -234 -316 -336 -472 -582 -350 -317 -433 -393 -209
1232 -209 -114 -164 -143 100 -171 -102 -172 25 -60 -203 -68 75 269 289 406 623 471 379 454 557 276 191 296
1255 296 -3 -389 -415 -345 -490 -547 -355 -349 -294 -434 -99 -167 -75 -75 -54 183 90 117 -214 -36 -20 -245 31 98 -49
1280 -49 11 328 319 447 539 604 397 547 604 598 471 59 -6 -116 -333 -545 -557 -513 -676 -861 -531 -396 -434 -361 -376
1305 -376 -124 -122 51 117 239 254 360 633 512 777 785 865 593 830 545 760 282 41 25 -87 -453 -695 -845
1328 -845 -788 -1012 -1107 -1073 -964 -958 -625 -556 -293 11 232 395 654 683 966 1323 960 886 1055 775 711 512 399
1351 399 30 -225 -367 -466 -497 -912 -882 -992 -973 -1115 -841 -637 -706 -509 -321 187 213 391 643 634 845 892 1195
1374 1195 1064 747 755 709 291 77 174 -98 -290 -402 -499 -574 -614 -570 -643 -504 -773 -542 -465 -291 -218 -230 -95 148
1398 148 -57 313 431 395 373 750 667 500 511 649 640 413 214 13 -140 -197 -543 -537 -400 -724 -584 -638 -445
1421 -445 -368 -135 -120 117 92 353 436 373 80 78 236 24 -128 10 -81 -119 10 118 209 78 388 495 476 524
1445 524 379 524 -14 -58 -352 -517 -405 -681 -647 -614 -542 -211 52 125 319 476 573 590 464 460 355 109 -247
1468 -247 -233 -233 -637 -791 -553 -413 -253 -30 104 359 446 503 642 682 393 185 103 90 -243 -360 -558 -460 -538
1491 -538 -464 -457 -90 -139 2 193 289 485 361 302 314 -195 -198 -144 -339 -527 -292 -287 -177 284 365 570 667 789 848
1516 848 875 712 520 147 -128 -612 -1005 -875 -1331 -1362 -1228 -1062 -866 -588 -243 125 491 770 994 1153 1156
1537 1156 1099 750 502 398 174 76 -29 -392 -535 -418 -325 -330 26 23 -116 -129 -54 -170 -514 -391 -402 -527 -631
1560 -631 -457 -356 -335 -147 188 360 878 866 766 939 1020 732 667 680 85 -91 -171 -431 -834 -737 -732 -1018 -706
1583 -706 -369 -367 -140 118 210 324 485 396 354 397 272 91 84 -87 -164 -233 -258 -196 -187 -110 117 104 163 405 197 341
1609 341 446 236 156 203 -20 -13 -244 -110 -400 -274 -200 -192 -347 -67 -58 -353 -22 -22 -77 -165 -196 -58 -108 70 128
1634 128 -36 25 351 156 525 388 287 163 392 406 100 237 -65 -191 -328 -99 -274 -500 -361 -432 -571
1655 -571 -277 -138 -249 -228 -215 -91 135 247 315 279 384 583 430 620 591 563 533 653 276 60 270 -298
1677 -298 -416 -493 -550 -903 -732 -560 -503 -337 -192 -58 -3 469 377 267 463 473 410 217 135 -118 -224 -114 -225
1700 -225 -298 -191 157 180 444 444 519 406 526 405 152 -7 -263 -566 -693 -847 -787 -733 -807 -873 -369 48 214
1723 214 493 659 714 686 885 728 485 182 -189 -432 -534 -268 -525 -433 -351 37 80 580 646 657 668 822 401
1746 401 31 -6 -428 -696 -1016 -1096 -1282 -1112 -989 -772 -440 90 384 787 1166 1246 1334 1417 1193 812 508 129
1768 129 -347 -655 -808 -940 -881 -910 -738 -438 -391 172 359 275 462 310 75 -9 -161 -645 -795 -598 -674 -610
1790 -610 -448 -172 244 729 1161 1407 1422 1612 1393 1238 885 269 -164 -850 -1179 -1549 -1776 -1678 -1591 -1384 -1102
1811 -1102 -367 92 369 753 977 1274 1342 1269 883 633 322 -87 -422 -650 -461 -400 -291 -151 -15 140 318
1832 318 542 514 470 377 66 -76 -472 -822 -735 -898 -990 -773 -693 -419 140 305 823 1018 1303 1293 1119 996
1854 996 614 492 82 -449 -673 -962 -852 -1023 -1017 -722 -608 -455 72 243 402 541 638 798 618 340 338 281
1876 281 -209 -461 -322 -224 -367 -337 6 129 155 265 348 368 82 178 48 -88 -288 -382 -304 -438 -438 -251 -233 -84
1900 -84 136 260 636 405 573 586 526 223 265 88 -3 -167 -432 -365 -375 -566 -465 -402 -157 -363 -110 75 -18
1923 -18 104 234 116 349 171 334 486 482 596 644 616 281 239 197 96 -261 -247 -432 -403 -679 -665 -602 -660 -703
1947 -703 -335 -379 -245 -61 145 411 315 518 540 525 495 393 393 436 130 259 2 67 35 -87 -67 -76 -437 -492 -373
1972 -373 -556 -629 -571 -469 -545 -532 -188 -55 202 245 446 363 511 648 748 723 657 448 199 22 -214 -203 -277
1995 -277 -517 -908 -570 -661 -609 -312 -148 -229 -90 193 363 434 512 72 318 239 172 -333 -224 -96 -8 -72 -163
2018 -163 -75 -32 257 368 432 305 420 194 43 72 -68 -95 -71 -427 -431 -561 -471 -450 -331 -203 -229 -12 150 224
2042 224 160 359 259 238 315 355 248 191 100 290 146 -122 135 119 70 -34 -130 99 -57 -135 -143 -30 -238 -264
2066 -264 -285 -416 -503 -550 -211 -178 -267 83 269 373 525 608 925 873 827 691 491 438 -179 -153 -424 -761 -843 -1032
2090 -1032 -1123 -991 -1019 -819 -506 -189 238 386 553 818 1022 1046 1097 844 741 476 319 -159 -156 -333 -616 -541
2112 -541 -425 -485 -476 -699 -394 -168 -171 -131 -169 -217 -250 -165 99 56 -78 190 333 422 530 744 811 822 767 712 599
2137 599 210 8 -162 -591 -864 -1053 -1069 -1065 -1144 -1080 -988 -591 -166 17 462 834 901 963 1292 1264 911 669 451
2160 451 381 176 -114 -571 -507 -388 -554 -366 -577 -485 -285 -271 -202 -154 -64 80 -107 -232 -236 -220 -256 -162 48 95
2184 95 391 623 539 451 515 646 332 252 124 25 -189 -230 -418 -590 -654 -719 -666 -464 -439 -427 -94 -3 200 205 162
2209 162 435 289 330 263 241 57 128 76 32 160 -112 80 -31 -43 -57 139 -91 -103 -108 -31 -87 -42 -105 95 -89
2234 -89 134 91 -156 -218 -164 -237 -273 -490 -331 -289 -321 -219 -119 3 34 220 334 570 599 586 464 578 289 403
2258 403 70 5 -251 -262 -261 -567 -462 -368 -215 -280 -370 -139 -185 -144 -42 -34 -129 -151 -130 -123 29 -211 62 309 471
2283 471 634 570 824 860 829 774 538 469 138 -314 -582 -906 -1266 -1198 -1231 -1277 -1122 -845 -549 -259 31 375 829
2306 829 877 1076 1054 930 727 636 426 270 -90 -255 -323 -486 -234 -319 -42 -100 -182 220 57 121 -19 -398 -330
2329 -330 -638 -691 -690 -607 -591 -338 -178 -18 498 570 693 924 1183 1081 903 650 478 47 -237 -400 -606 -729
2351 -729 -883 -866 -740 -859 -359 -86 110 120 500 518 647 478 289 39 -104 -143 -142 -273 -337 -353 -291 -71 189
2374 189 175 402 358 337 486 335 197 59 -165 -345 -326 -534 -580 -574 -448 -289 -342 111 145 279 297 419 389 315
2398 315 295 25 143 -168 -360 -298 -452 -431 -353 -221 -221 73 -55 183 401 422 398 192 336 92 12 -40 -190
2421 -190 -343 -408 -260 -411 -128 -189 -202 -21 13 -1 147 59 7 77 122 -156 15 -14 -136 127 109 157 -3 273
2445 273 292 267 253 293 308 108 -62 -231 -167 -335 -500 -502 -308 -380 -410 -172 -146 -106 1 -67 189 215 390 262 363
2470 363 219 190 177 214 139 -118 111 -59 -149 -310 -59 -213 -195 -109 -113 -276 -96 -331 -118 -88 -201 13 105 43
2494 43 167 272 68 180 119 234 213 5 129 30 -147 -19 -170 63 21 -196 -158 -196 39 57 56 97 68 33
2518 33 177 66 132 4 21 63 -249 -214 -201 -208 -183 -248 -124 -100 -155 -98 -79 -44 3 162 208 235 377 442 343 363 229
2545 229 75 70 -59 64 -190 -120 -243 -222 -296 -437 -554 -284 -365 -243 -117 -139 -25 -116 -115 27 327 221 323
2568 323 372 401 554 351 490 244 227 133 80 -235 -387 -508 -452 -633 -516 -531 -524 -343 -280 -29 40 163 298 240
2592 240 619 583 580 556 525 276 164 115 -141 -146 -186 -215 -235 -145 -7 30 -16 245 36 117 366 129 98 44 -134 -192
2618 -192 -53 -106 -101 -58 -29 -79 109 299 275 256 175 429 72 84 51 -214 -302 -337 -433 -299 -309 -117 -229 82 241
2643 241 407 365 414 480 413 254 268 -17 -189 -475 -425 -486 -629 -569 -556 -330 -136 121 196 452 385 549 567 458
2667 458 284 287 -66 39 -115 -244 -272 -267 -200 -310 -121 75 172 169 196 168 334 59 5 -204 -162 -453 -490 -429 -188
2692 -188 -205 -126 108 205 498 574 408 469 606 307 328 181 40 -382 -231 -344 -589 -605 -483 -548 -419 -47 21
2715 21 201 280 371 367 434 256 117 29 -54 -135 -229 -240 -300 -134 -174 -14 61 40 294 266 179 123 272 -52 71 -34
2741 -34 -132 -79 -185 -351 -79 -78 -186 32 47 175 135 293 162 127 162 159 -12 30 -134 0 -117 -218 -45 -340
2765 -340 -191 3 138 -27 85 185 368 168 224 212 16 103 -42 -56 -94 -123 -231 -117 -94 -129 -66 -105 -46 26
2789 26 -10 61 52 106 88 167 88 146 63 91 73 71 118 271 183 -217 64 37 79 -85 -150 -242 -101 -308 -175 -32 21
2816 21 -98 -82 -107 -76 -35 36 60 88 44 234 91 57 267 248 225 132 135 21 34 136 -44 -46 -11 -224 -152 -232 -241 -187
2844 -187 -211 17 -99 -130 66 172 188 144 138 70 14 274 136 59 -68 -8 -183 -255 -56 34 238 34 -31 35 83
2869 83 189 -11 30 38 32 -261 123 -123 -333 -384 -73 -163 -118 -56 19 159 -22 328 291 283 105 200 116 113 -111 -41
2895 -41 -152 41 -100 -160 -186 -37 26 35 61 46 89 -7 226 -63 -20 -79 85 -109 21 -127 -277 -183 -74 -109 18
2920 18 130 141 -1 177 7 200 51 -39 214 53 13 -84 -31 51 -162 -19 76 -58 75 129 61 69 83 -84
2944 -84 20 -82 -22 -28 -71 -130 -56 17 -129 -232 -85 103 52 5 88 126 180 160 298 247 154 140 90 193 165 -81
2970 -81 57 -112 -212 -28 -69 -125 -246 -94 55 -165 -106 -14 12 4 -28 91 111 27 207 -6 -81 129 -29 41
2994 41 -31 126 101 -9 -57 -230 -117 -140 109 18 -24 58 124 -82 -121 -248 -92 -36 -34 -167 -106 -10 146 -52 87
3019 87 83 45 157 45 39 97 -46 -97 0 -159 90 124 -31 -84 162 5 50 129 47 -121 46 3 20 115 -112 -115
3045 -115 3 -12 7 -91 26 -94 -101 -64 21 20 52 131 30 213 18 146 125 106 130 -62 132 -5 39 -166 -139
3070 -139 -153 -120 35 34 -175 37 -208 -174 49 -106 -134 68 -13 10 -13 -159 -23 -66 166 94 183 43 97 214
3094 214 -11 150 211 -110 -7 103 64 120 -114 -102 -145 -247 -120 -127 -250 -199 -317 -13 -183 57 29 88 68 65
3118 65 256 129 112 204 117 241 335 19 52 27 66 -101 -124 -91 -12 -91 -12 5 -311 -25 -176 -122 -171 -148 -263 -36
3144 -36 -44 -41 -94 -111 202 39 243 293 191 272 148 130 81 28 23 -83 -172 -60 -214 -401 -361 -408 -114 -179 -123 -196 112
3171 112 34 72 54 24 -16 300 147 75 107 113 89 122 305 76 72 200 118 -105 84 -130 -151 -210 -111 -142 -352 -78
3197 -78 -227 -197 -127 -256 28 46 8 204 147 129 347 321 330 238 36 183 -26 -160 -114 -125 -45 -168 -241 -179 -129 -32
3223 -32 -86 -183 51 25 26 2 54 -15 -5 -24 43 21 -32 -56 -69 257 105 299 44 188 80 -114 117 -177 -223 -227
3249 -227 -163 -142 -154 -133 -107 -101 122 154 158 80 241 129 205 142 107 127 110 -7 -19 68 -74 -130 -188 -113 -94 -236 -61
3276 -61 -114 112 33 -56 -81 22 29 95 33 86 97 143 86 204 438 45 143 112 200 -30 16 -69 -76 -9 -157 -163 -77 -306
3304 -306 -252 -65 -63 -257 -93 19 -129 75 24 107 77 169 333 208 97 83 22 161 -112 24 62 -251 -43
3327 -43 -134 -174 -392 -273 -57 -77 -194 -319 8 -110 -197 -43 -7 -28 156 210 161 65 182 196 185 226 129 206 105
3352 105 7 72 -15 -122 -143 -63 -198 -229 -126 -163 -152 -424 -53 -143 49 25 -57 53 188 337 -23 36 197 216
3376 216 107 203 12 157 255 -72 -47 -85 -88 -23 -164 -30 -131 -47 -51 -7 -108 -146 -45 -112 42 133 117 83 3 151
3402 151 190 -45 217 150 68 314 60 92 101 -89 113 -110 -214 -83 -58 -114 -110 -109 -3 -77 -221 -8 30 -101 -27
3427 -27 -49 3 126 60 -70 -10 191 35 -63 -121 4 59 5 50 -37 48 144 89 -3 -60 43 -164 17 41 -49 23
3453 23 81 -132 -111 32 -14 15 -10 -170 -153 -131 23 11 -15 -91 38 53 -73 -1 11 -41 73 160 122 125 15 88 -21
3480 -21 34 -4 36 58 -139 -164 40 -106 -72 -154 -215 -46 -25 -34 -15 -36 -64 52 -75 115 -16 -47 75 74 271 4
3506 4 156 175 205 110 94 66 1 75 73 104 -82 -111 11 -116 -181 -132 14 -171 -37 82 86 -9 70 -81 9 99 28
3533 28 67 69 173 189 52 -44 -7 14 162 108 -14 102 0 -53 -14 -38 -59 -44 -139 24 -41 76 -4 109 -1 -27
3559 -27 11 31 -52 -63 11 68 -51 57 -38 118 -80 12 10 -5 -28 56 -12 -25 -13 112 24 -286 -129 -36 4 -39 120
3586 120 19 -10 -11 16 -242 156 -54 77 1 -35 -20 -102 -105 -173 -66 -56 139 74 53 -2 19 60 -14 -24 82 59 148
3613 148 7 -5 10 -94 -45 -58 -108 -101 127 -152 61 -65 -152 -24 -98 -53 160 120 -1 -12 142 94 146 47 69
3638 69 -34 -21 29 107 -116 187 -19 27 19 -99 45 -61 -9 -138 -80 -123 -190 -101 -10 -32 -183 -46 94 -89 -210
3663 -210 68 20 -60 21 -8 120 8 -137 -36 121 48 14 152 -39 38 -84 -77 -113 -205 -171 38 -136 -163 -108 -59
3688 -59 -60 38 181 27 -66 -146 86 37 133 118 58 -85 122 11 218 135 212 57 84 191 32 107 -25 -102 -49
3713 -49 -31 -245 -30 -56 -157 -47 -165 -100 106 93 -124 89 113 266 197 111 290 162 216 57 103 -45 -16 -80
3737 -80 34 -99 -232 -76 -67 -73 28 4 4 124 23 72 121 -257 -65 72 -159 -205 -153 152 154 -56 -98 -22 43 83
3763 83 155 63 210 69 82 -65 -64 -109 52 -18 -98 -42 -144 66 -51 -75 79 150 -46 9 50 132 -68 -98 -147 -142
3789 -142 -223 -102 68 14 -32 156 95 72 45 132 103 158 23 171 59 -50 25 15 9 -207 -76 -159 38 36 -62 145
3815 145 50 104 21 113 5 137 -96 -17 -20 -106 -63 -47 -59 -64 -77 7 -167 175 81 13 -9 137 9 171 -89 118
3841 118 46 51 -151 -150 26 -144 -194 10 20 10 137 -90 39 -38 -25 42 -191 -218 -2 68 -60 4 -98 -131 -22
3866 -22 4 64 7 180 -111 77 149 89 108 -71 -224 -25 -25 -85 193 -216 -202 -59 -168 -137 -87 -124 -53 73 33
3891 33 100 86 -50 104 125 105 -55 24 58 52 12 -57 150 -16 -127 -17 80 -50 -107 -86 15 -179 -153 -138 -132 -136 -190
3918 -190 74 3 18 -127 -21 92 117 79 244 53 197 192 21 49 112 -8 -65 159 -106 49 -228 -145 -176 -182
3942 -182 -219 -190 -192 -174 -95 -151 -6 10 -61 92 54 11 -20 -165 196 -71 49 -139 -19 0 9 24 -2 6 103 -24 -118
3969 -118 -124 106 -27 84 -56 -64 5 -72 58 126 72 41 164 -164 -81 101 -64 89 -124 118 -56 51 -66
3992 -66 151 46 58 -61 15 -83 -216 2 7 17 133 -106 64 60 -109 -24 66 -8 -59 -38 16 41 62 -38 -107 -108 -172
4019 -172 11 6 -43 10 34 19 155 65 -16 146 -85 16 89 54 139 -42 -164 -73 -167 -47 22 -74 -72 -189 -12 56
4045 56 -6 -73 53 123 152 136 -40 -179 6 118 -17 26 -37 -54 -108 184 178 -77 134 -76 145 -14 -80 -53 -159
4070 -159 -24 -69 22 -100 -298 -160 -156 -18 45 223 -10 158 248 142 126 20 160 -138 35 0 -34 3 -70 91
4094 91 37 41 -96 107 -64 36 -45 38 128 -167 -212 -5 -121 -22 -39 -16 27 50 -15 99 7 -82 86 99 178 36
4120 36 123 64 87 47 79 58 102 -85 -54 160 -99 -65 -13 -42 108 -174 -131 66 68 -27 -83 -111 20 29 -167 -21 -27
4147 -27 -3 69 35 82 44 127 143 145 106 147 64 164 -154 10 -80 -159 -149 -237 -233 -167 -88 10 -17 30 -37 5 36 8 82 -28
4177 -28 97 13 11 210 -88 137 -54 41 94 73 96 -67 56 113 81 -49 -28 -23 -108 42 -59 -6 -79 -61 213 -240
4203 -240 65 170 249 27 97 186 89 141 -75 25 -76 49 58 132 69 -94 -28 -167 -72 98 29 -99 9 123
4227 123 43 -98 188 94 46 62 -24 -5 -18 -7 92 55 -87 -96 -112 -20 -49 73 76 -81 49 54 -219 113 118 2 -33
4254 -33 192 27 66 42 -115 82 -107 -162 77 -165 0 77 -2 -128 -75 -15 -41 -37 -114 52 -85 41 19 -79 49
4279 49 37 47 -1 5 -96 34 69 40 147 267 94 131 37 158 27 -42 -233 48 -95 -62 50 -245 -165 -179 -185
4304 -185 108 16 2 140 -13 -55 37 47 77 140 48 141 11 -86 -44 -125 91 -197 82 -18 -17 -4 18 69 145 136 50
4331 50 168 -19 -22 -151 40 -145 47 -165 -175 -23 43 167 -32 27 37 4 77 -23 12 -21 100 -120 -39 -107
4355 -107 -189 138 -93 -205 22 -5 35 146 203 163 119 100 -23 -131 133 112 -131 -270 -91 -179 46 -45 36 46
4379 46 -175 142 -5 157 -49 86 186 -138 227 27 195 171 78 66 81 -170 148 4 58 -57 36 29 -14
4402 -14 -93 155 -171 -34 54 -53 -168 -88 47 -44 -27 16 30 58 29 262 78 306 233 158 27 76 8 -7 -207
4427 -207 -210 -201 -106 -150 -171 -77 22 -13 16 269 -19 116 88 132 -51 -102 54 -15 -26 -20 -23 -87 -34 -106 77 161 110 -89
4455 -89 32 85 -35 35 100 -154 -47 -4 -153 -2 -107 127 68 17 59 140 17 158 40 210 -61 199 85
4478 85 201 51 -158 -264 217 41 -214 89 0 -98 -47 144 29 104 -37 255 -114 -18 200 189 74 -6 -97
4501 -97 -217 -9 149 -129 -46 -57 111 -113 61 44 130 -186 109 158 56 -88 27 59 97 47 41 36 -113 44
4525 44 -160 -31 -171 -101 -122 -103 11 -1 -5 -172 61 33 103 41 140 58 50 91 108 33 -17 155 -171 -16 45 -26 64
4552 64 82 -29 -157 164 -192 53 15 -165 61 -38 48 -12 31 17 -7 -1 -15 -46 24 74 83 75 9 197 35 170 15
4579 15 61 -64 -129 -128 29 -51 16 -33 -52 -51 -21 37 -8 43 -27 25 10 -24 -317 -97 -40 -61 15 -18 -56 -79 9 -87 106
4608 106 44 8 254 153 -38 -47 -68 -136 -43 26 -143 -71 -79 -22 -80 -50 42 148 -39 -46 -142 -161 -148 -71 -41 -1 -136 62
4636 62 74 -103 28 30 112 -54 154 -31 180 139 121 73 184 18 -112 -74 68 -254 -144 41 12 -10 -136 -70
4660 -70 6 -45 146 86 23 0 35 76 37 -63 -4 20 -80 9 44 -82 -16 44 114 157 -110 -182 -205 -64 17 -57 -89
4687 -89 -43 4 -117 -101 -49 -75 128 84 -64 36 5 76 168 96 131 93 -116 -154 -14 -120 -77 -133 -77 75 -108 -115
4713 -115 8 48 42 101 159 -95 9 81 -17 -53 -7 22 10 -92 31 149 170 136 49 47 146 23 -157 26 63 25
4739 25 63 -114 53 -18 195 94 79 68 -16 -48 135 -89 -37 -30 -15 49 159 -28 21 -5 -59 50 12 -7 -4 -170
4765 -170 -179 105 -107 117 89 63 -51 182 -21 17 -193 -19 -274 42 -24 -16 171 -3 -67 -14 -95 -135 -96 -175 126
4790 126 160 -47 5 19 -66 63 87 -11 168 -31 293 178 324 -23 -79 199 -190 -7 1 -108 55 -138 -37
4813 -37 -55 -115 88 -90 -51 -116 -100 220 -1 24 -45 4 36 14 150 59 -11 -38 43 74 93 184 -112 58 -99 116
4839 116 38 -207 52 105 94 -43 -13 -72 25 -56 66 -98 104 29 -37 158 25 112 -97 174 83 -80 -44 -233
4863 -233 120 -41 21 116 8 73 120 37 30 -94 -18 23 36 -69 1 -73 -68 -83 129 0 -63 -24 -10 24 -28 129 224
4890 224 -67 53 160 52 92 106 39 150 -38 -22 15 -78 134 -100 -29 1 14 101 21 38 -88 19 -31 73
4914 73 -20 -113 173 -39 -72 -47 -97 -158 -23 -6 140 -35 -109 213 177 20 95 111 -67 75 3 -128 -105 -289 42
4939 42 -127 -23 22 49 -81 -15 -63 82 84 13 13 -59 -48 46 114 -99 83 43 -63 68 -23 -49 285 40 100 -17
4965 -17 -5 18 27 33 45 2 -6 -146 -98 -7 21 -7 43 -60 72 -35 147 -30 62 300 115 99 5 -58 -1 -24 -90 -31
4993 -31 -15 101 -96 -22 -1 72 85 24 16 51 48 46 16 -56 7 -151 6 -22 35 -21 -153 97 -7 23 40 -80 -11 -4
5021 -4 135 -52 96 -91 85 96 93 72 109 47 11 7 29 -36 47 99 22 -38 -58 -79 3 -72 -99 75 -70 104 3
5048 3 -33 64 116 193 95 -6 43 157 97 -10 59 22 -36 61 95 27 109 2 -68 -67 -78 -144 82 14 -60 11 -4 -36 -32
5077 -32 -149 -75 -83 -97 6 17 88 120 -37 25 8 -21 102 141 -113 7 7 2 -82 63 -26 266 -33 -37 1 -195 8
5104 8 -98 57 168 -10 -43 22 -117 -79 -14 47 47 106 -7 79 -3 -30 38 -254 -80 -98 106 21 -65 62 -8 -131
5130 -131 -25 -45 -56 -97 -36 159 -75 -72 72 -15 -96 110 37 47 29 53 73 -154 -73 6 -1 83 145 214 -8 -69 41
5157 41 -10 89 -175 19 83 -53 -95 -112 109 -12 28 -138 -54 128 -73 -36 141 -41 -35 25 -109 43 95 40 8
5182 8 51 -29 90 -11 12 -5 -120 182 94 -123 -8 54 -99 38 77 29 95 -51 -54 14 70 -14 -5 -39 -98 -97 99
5209 99 -39 -194 -74 -57 -1 -46 -83 -10 60 -90 33 134 36 76 -31 -116 27 -62 -5 -41 -151 -131 70 -118 -76
5234 -76 -66 -58 -13 -11 -26 -29 -86 34 -101 -25 92 -127 43 -76 58 -41 75 146 80 -22 98 57 90 34 113 180 184
5261 184 -55 67 56 -127 51 -165 -74 -176 -141 -15 -105 51 -78 15 42 45 4 44 63 -59 107 -7 69 -14
5285 -14 81 -112 -43 5 69 23 45 -105 -191 -2 71 -103 -35 86 15 35 -23 -3 -10 56 48 62 31 -216 170 13 -25
5312 -25 43 -32 22 80 81 4 110 -109 3 13 134 85 245 87 -61 34 12 154 -79 58 -131 -79 -48 -7 -39
5337 -39 -134 99 10 -61 138 28 136 61 -88 -36 -70 16 84 135 -90 -11 -184 117 -81 -49 -381 99 -55 -130
5361 -130 26 -45 -24 113 -66 -240 -75 -87 62 -26 -36 193 95 45 67 63 112 -38 -52 32 99 45 -83 36 74
5386 74 47 -50 -67 -91 -160 -72 -188 -7 -137 -67 19 62 -28 69 18 224 -63 150 51 24 -87 -85 100 -40 -16 81
5412 81 214 128 -29 -72 177 -117 29 -2 -45 -97 -79 63 99 61 -96 -158 15 -127 91 138 -52 -35 52 38 -22
5437 -22 -49 -72 -68 126 -96 36 38 27 144 -110 101 179 -109 -11 81 -99 20 70 -68 16 123 -29 55 113 37
5462 37 -8 -147 -46 -139 -136 93 112 -99 75 -8 -111 -133 -88 43 -59 -74 -47 104 -37 -21 -137 -150 150 144 103
5487 103 -35 100 201 -69 -84 27 -73 251 -77 88 -14 87 -74 94 -129 43 23 -13 26 206 69
5508 69 58 113 -45 -9 -154 -76 85 36 -55 134 -99 5 20 124 59 -7 -119 -50 -44 -96 -94 -99 -1 -59 64 15 -17
5535 -17 59 40 -84 -24 62 36 -147 99 46 24 105 186 -81 -4 145 -94 72 22 -52 -25 73 -76 -186 -132 121
5560 121 141 -179 23 -79 1 -42 102 -49 134 -129 33 197 65 12 90 44 -16 138 130 -52 -83 -28 73 28
5584 28 67 -39 104 -97 -29 92 -97 -18 -111 124 196 113 -139 -56 -23 38 73 -42 -89 -140 32 99 18 124 -185
5609 -185 27 -136 96 -110 95 -146 84 11 141 -17 73 6 -35 113 -34 -47 -2 -219 24 31 -91 91 -76
5632 -76 72 48 -82 -51 -19 -29 -32 36 -120 -88 6 -4 -29 11 -149 33 139 -145 86 -47 17 12 16 -243 52 3
5658 3 -205 -76 -160 -87 165 16 -118 -50 19 -128 -38 3 217 90 86 -85 -16 -22 25 84 62 109 36 -108 64 -188
5684 -188 65 -226 76 41 54 27 -90 71 40 23 -38 95 13 3 82 192 -96 -125 128 -33 -12 165 26 14
5708 14 -83 62 9 190 -44 -1 -1 -20 84 36 33 141 -123 107 85 -24 -66 9 -72 30 106 -53 -157 37 93
5733 93 18 -47 37 -40 -103 84 66 108 -54 -180 -19 -67 -108 -10 104 -92 47 176 39 16 -216 -80 58 93
5757 93 35 12 -70 -97 -79 -100 18 -109 -31 -4 -19 -1 -191 -156 27 26 -61 118 33 -182 131 8 80 -59 54 -102
5783 -102 -142 -50 47 -125 8 -235 -233 1 -79 4 38 10 0 15 -34 50 -134 94 8 55 36 -61 70 78 13 -9 -168
5810 -168 -44 -106 -18 -34 -35 -123 -173 93 21 89 -4 -136 76 -108 -15 77 56 139 -138 -71 72 -149 -32 -151 75
5835 75 109 -28 -35 -182 -14 -87 48 -67 -15 -42 -52 -54 -66 24 -88 -86 -142 -32 90 -111 -112 -170 83 -4 -102 113 58
5862 58 85 167 -110 80 -4 -103 11 -15 95 80 -10 194 -32 -86 -17 -29 21 17 -224 2 103 -121 51 -27 19
5887 19 40 -60 -108 0 94 -130 6 -63 54 -74 156 -27 158 -18 59 -36 45 -56 38 -49 52 42 -180 -89
5911 -89 -87 -96 86 -65 -21 -94 -26 -22 -70 -37 -116 61 68 -87 -23 58 91 34 113 2 1 71 93 118 129 118 -18 -50 107
5940 107 -5 111 -94 -114 -83 -98 247 -116 -37 -46 54 19 150 78 205 6 -19 -79 -23 -101 81 -42 83 -109
5964 -109 78 93 -23 -41 -69 103 36 -6 60 -5 -48 26 0 -188 -66 164 88 -161 -29 -1 37 -1 -214 -146 49
5989 49 -2 71 123 14 43 66 91 -137 17 65 -79 -79 -8 -27 72 -15 108 85 -72 21 48 47 39 -100 150 -4 -92
6016 -92 -29 71 134 56 -110 -58 11 58 106 61 -35 60 56 104 104 -8 72 -181 -105 56 105 -22 27 30 -162 -33 -10 56
6044 56 7 85 -8 -5 194 -62 -30 -36 105 162 148 16 -66 130 43 68 -81 15 156 137 -104 66 -38 -42 -21 -141
6070 -141 49 -66 -105 -95 -107 -23 -25 93 31 -11 147 -113 37 -114 -48 141 84 76 -135 40 -116 127 76 230
6094 230 -19 -114 34 25 -104 178 -92 198 112 96 36 -62 -92 -65 -62 -204 -78 -59 -158 -70 -69 -74 -63 -59 -129 92 -32
6121 -32 14 141 47 14 84 -59 -62 18 -5 -87 45 30 45 -71 -5 -240 -11 28 -163 -207 64 -34 -19 54 35 165
6147 165 -200 -100 -50 -22 61 -18 -60 119 188 -3 257 159 -85 -112 127 -64 86 -66 32 4 -24 -168 150 -14
6171 -14 10 157 86 33 132 -111 -74 -53 93 32 -36 201 8 -1 62 160 -68 -63 115 -118 128 111 24 -78 15 -28
6197 -28 -81 115 -57 85 17 20 78 -48 -5 34 49 205 -176 -112 -82 8 41 174 96 -31 20 166 89 37 130 -98
6223 -98 -27 114 -116 18 -59 -97 3 61 -101 -68 -93 -85 -41 8 -52 72 44 -55 9 -182 67 -28 92 -65 90
6248 90 5 -48 19 39 -135 85 -62 275 87 45 -16 -56 -68 20 77 -91 52 95 -57 -70 -27 11 -105 -41 25 10
6274 10 51 -83 -20 69 -7 -160 114 -33 95 73 175 -80 129 8 31 88 65 42 92 37 56 85 -2 165 47
6299 47 -4 -25 18 -167 -96 -46 -117 -13 1 -105 86 14 -58 26 55 -25 -27 -22 93 62 -10 -15 -23 91 -136 -139 52 117 11
6328 11 -59 -9 6 -50 69 -64 39 -71 158 48 -142 96 -195 -109 -92 110 93 30 19 129 46 -11 -97 179
6352 179 -69 -14 -69 59 47 21 15 -130 8 -27 -129 89 56 -161 7 -134 -6 108 -22 19 -1 150 -56
6375 -56 -12 75 80 55 202 237 34 -83 6 -154 -43 35 179 56 26 -114 33 20 127 -120 144 139 -83 -85 -39
6400 -39 138 -54 10 20 154 -14 6 -98 62 -70 -143 42 72 17 -26 165 105 34 1 18 -120 29 -140 -129
6424 -129 -1 12 -60 -60 -63 -178 -12 -133 -82 -69 31 -137 -8 164 101 149 -7 -34 54 38 2 63 -209 99 -164
6449 -164 -95 -26 64 -66 -48 -98 79 -165 7 5 1 -87 -91 61 104 73 150 151 -137 60 121 -86 -120 -13 45 -109 9
6476 9 81 -100 106 -88 52 4 -20 19 104 -169 -145 -5 154 39 25 127 -71 -49 48 84 -142 88 84 -56 142
6501 142 173 -1 -52 -40 -9 -57 24 18 12 -51 30 -56 5 10 -29 63 -17 240 -50 -51 -34 10 -124 -148 -137 55 26 71 -119
6530 -119 -12 119 68 -7 -84 -82 53 254 -94 43 92 -83 118 170 33 76 -85 -13 177 -165 -95 -175 -65 20
6554 20 -18 -47 -75 -43 70 -68 -66 -221 -125 79 -20 -166 135 -91 111 114 103 17 81 51 -58 146 11 -150 90
6579 90 60 -111 -29 16 -93 63 130 101 6 -58 49 -112 -103 -68 60 -184 75 136 -107 -137 58 34 75 16 -147
6604 -147 58 114 57 20 -37 146 95 254 3 -35 126 145 7 1 17 53 50 -151 34 50 94 -5 4 -72 -85 84 34
6631 34 31 -28 -203 104 9 30 191 66 81 -120 130 121 -21 215 20 -67 -88 63 71 6 -236 -344 -122 -151 -6
6656 -6 -9 65 26 115 25 0 -76 136 123 -6 47 -33 18 140 35 244 54 8 -43 4 143 32 -78 60 -88 -45
6682 -45 26 -102 41 60 13 -80 62 20 204 40 -41 -25 -238 205 128 38 -24 -115 23 193 -12 -12 113 43 -52
6707 -52 29 143 -128 -36 -142 48 40 -122 -58 -20 12 204 133 -80 -10 -23 -23 29 -62 111 -36 -30 -25 -56 15 28 -88
6734 -88 -80 15 53 23 -27 23 126 -120 -42 49 -8 -2 -59 67 -133 -47 119 -7 -42 -55 45 -20 -22 199 -40 -81 -72 -129
6762 -129 -91 -125 56 -44 -83 -102 131 113 185 -15 -65 -73 26 74 -10 -12 -75 -138 -89 -45 33 -266 23 -9 83 16 170
6789 170 7 62 42 -69 -49 40 152 -134 -75 -9 13 -25 -9 -61 -33 25 -58 87 32 -104 152 53 -103 -63 -93 -226
6815 -226 -212 -100 -49 -29 -123 -41 228 -261 -18 -80 -52 28 -22 -35 -16 38 -21 87 138 44 32 145 4 134 109 47
6841 47 25 117 -64 81 36 211 -61 25 91 51 -76 -32 16 60 -37 -65 146 -11 -118 -157 -35 64 -155 -28 -71
6866 -71 28 31 -66 11 -73 38 -27 -8 48 17 11 -60 -41 -114 73 30 27 90 -58 26 44 -103 -58 13 -20 9 -59 -108 15
6895 15 117 103 2 -74 71 58 64 -68 -67 -33 42 -47 -114 148 -115 15 73 -108 16 53 -151 7 -59 1 112
6920 112 19 32 13 6 11 133 -15 -126 -40 251 -77 66 33 15 -161 -111 -131 -213 -108 -88 -58 103 -138 -4 63
6945 63 -52 73 -57 -125 -205 124 39 -21 19 48 -24 -5 35 -126 47 101 152 -74 35 5 104 -3 -42 134 -25
6970 -25 17 -49 99 -61 -1 -14 -18 -3 155 76 -101 -51 116 13 117 -21 64 -2 0 302 -9 147 -83 -55 55
6995 55 -201 34 -37 -42 135 3 38 113 -174 26 67 75 127 32 97 -27 -11 42 -113 -48 65 -124 71 15 -131
7020 -131 59 -15 -21 -71 32 15 -48 149 34 101 -103 9 57 58 48 -173 -72 -218 -142 -64 61 -76 62 35 -98
7045 -98 -13 29 -76 -64 127 34 56 -65 121 -14 60 199 54 -49 -19 28 91 -67 -120 -155 -149 -75 -156 -101 57 158
7071 158 38 -184 77 -3 50 159 52 2 29 -174 109 32 63 0 119 -82 -194 164 62 70 2 -74 -9 58
7095 58 -24 -17 14 -68 83 3 156 32 77 82 105 -13 -50 36 -135 13 146 -70 -121 25 46 -126 -27 43 -14 -47
7121 -47 108 -74 25 -18 -56 -52 -77 20 13 -54 240 -195 -32 -158 74 28 52 -16 -54 101 -48 188 -17 76 -60
7146 -60 -151 -65 0 17 117 -67 -88 47 1 -103 -114 64 58 65 -97 16 -120 8 -149 83 169 -86 -14 91 23
7171 23 69 61 103 -20 33 -25 -117 33 -102 96 19 68 178 37 -21 43 0 -81 61 70 139 -5 -148 33 70 17
7197 17 33 -94 17 -143 -45 149 -90 -244 -40 -175 221 -2 -102 -49 181 -65 31 96 192 19 21 -33 -86 129
7221 129 12 -20 55 127 89 16 -17 -102 27 93 78 -17 -151 20 -62 -10 -49 71 -45 -36 -204 -18 39 -23 42 -32
7247 -32 -84 11 -62 18 112 94 -24 16 -9 -6 -66 13 34 10 -100 13 -13 67 71 -53 16 -102 -139 144 -74 -29 -136
7274 -136 -11 136 29 -76 -101 -36 -85 -62 -13 29 29 29 38 111 19 -58 -58 -19 -135 -83 -92 -24 134 54 -92 84 106 -13
7302 -13 84 -104 25 148 -61 -135 39 18 107 178 65 114 87 107 23 -6 -10 -26 -24 43 -19 -109 -34 -162 -1 -32 79
7329 79 -70 -103 50 -16 144 60 -154 -75 46 -48 8 63 -67 164 -88 129 -5 -19 86 29 35 -89 113 33
7353 33 12 110 130 4 23 -44 15 60 -29 -24 8 140 -70 92 -107 -155 22 23 29 55 100 33 80 82 14 15 -7 71 54 -94
7383 -94 3 -13 190 -104 -3 -73 163 -57 161 54 -46 92 240 31 56 52 88 15 30 -43 29 -2 6 -64 87
7408 87 -67 -109 -130 -134 107 -120 -39 136 187 -165 -3 -25 -13 -56 25 26 105 64 163 -41 4 63 116 -55 69 -10 151
7435 151 17 112 -75 -78 -108 -120 186 15 -7 132 -163 78 22 -39 -253 -45 101 145 12 -64 -138 29 -5 46
7459 46 -28 -5 213 -25 -35 -32 107 7 -162 -138 87 161 -24 -135 76 40 52 92 85 52 17 15 79 65 -16 -37 3
7486 3 44 106 -5 125 243 108 -83 -37 -40 87 -80 80 176 -9 -12 -5 -95 -39 -45 30 -89 -94 127 63 158 144 117 168
7514 168 -15 60 0 50 16 78 -46 154 19 -91 -145 -8 -35 -39 -75 -91 9 74 25 28 24 111 -18 195 87 -111
7540 -111 -27 -183 49 50 24 130 -50 4 -133 -121 19 55 179 -85 48 43 -118 -76 -74 83 10 -28 -35 122 79 130
7566 130 22 -209 23 27 6 -17 54 111 218 -52 -78 -251 75 89 -115 74 -47 59 165 -104 -15 -171 -38
7589 -38 -3 -27 -77 137 -1 47 -44 42 74 -54 11 67 -65 20 106 28 94 106 87 20 -8 -76 203 55 158 -71
7615 -71 -39 26 -120 -61 -41 20 14 -96 166 -68 134 -8 -16 184 -96 17 73 -16 17 -17 30 59 137 -23 -41 49
7641 49 91 -57 -25 30 16 -48 45 108 17 32 -3 4 -35 144 33 33 -67 -24 60 76 60 -33 -38 12 45 95 33 45 97 -46
7671 -46 -5 134 40 7 -65 -21 -67 -88 7 100 69 -44 50 124 -80 22 43 65 -44 -10 60 58 34 40 16 112 52 -21 69
7700 69 0 -23 115 204 112 -17 -64 99 36 34 -126 -49 154 16 41 195 -96 -33 63 -62 61 -114 1 35 -95
7725 -95 25 53 125 -8 56 -77 -58 14 103 -139 96 8 1 -6 -88 14 98 -61 40 119 -82 128 32 41 22 33 -97
7752 -97 -159 141 -152 -13 -54 88 16 -177 87 44 73 -6 -52 118 18 -100 -118 26 -14 -83 -19 88 -14 -23 46
7777 46 -69 -117 -103 40 -2 -132 67 54 73 -67 51 114 3 -6 73 -49 8 -37 -34 115 17 143 -37 56 22 -63
7803 -63 -170 -4 49 -128 59 -19 -40 38 -46 -52 43 -55 47 7 -80 -23 -12 -7 -24 -128 -42 55 -10 59 77 57 90 -5
7831 -5 -41 -51 139 -39 16 -36 109 61 -128 53 -133 23 101 -94 76 92 10 65 -2 -25 4 -175 -41 -49 43 32
7857 32 -131 -17 55 12 -99 -7 57 -55 42 54 91 20 -61 21 -75 65 -44 186 59 -57 35 10 -140 -166 -45
7882 -45 5 99 -78 45 165 -188 -8 -142 -17 -125 95 87 40 -141 32 11 63 -3 104 -41 -112 42 25 46
7906 46 -138 -27 107 -60 -75 -62 23 98 -71 1 13 142 -6 40 -64 -59 -60 38 3 -98 117 8 61 -19 118
7931 118 50 1 102 -11 1 -85 77 37 -174 -266 -211 40 -38 -132 -73 -92 -53 -2 34 7 71 -103 -11 129 48 32
7957 32 -40 141 -48 63 -4 61 -166 46 21 188 124 99 72 -106 2 -15 -61 -30 192 -61 -13 24 -66 -19 6
7982 6 39 22 -9 25 139 -13 -69 -129 42 -87 0 72 14 -109 21 85 -97 -5 96 -4 89 -34 151 -26 36
8007 36 -77 109 -102 -96 -9 127 -6 79 -21 -38 -58 125 -36 -85 -60 86 6 -34 -20 -73 -69 -50 52 -106 -130 -39
8033 -39 58 56 23 68 -88 -55 -116 -137 -11 24 -29 -32 -116 74 -130 -24 -54 247 40 -27 -129 -12 5 10 50 -12 58
8060 58 -3 -148 11 -7 -46 57 -172 25 46 33 -16 28 17 -44 -19 36 41 247 21 8 -61 -64 105 156 -35 37 82
8087 82 9 -134 104 -56 6 28 71 -46 141 -95 -130 107 113 -139 95 46 -124 106 31 -26 32 -94 8 6 -21
8112 -21 139 94 -34 -5 87 56 8 -167 20 211 -166 -26 50 8 -1 -156 38 58 12 26 -84 75 -13 53 38
8137 38 -49 -169 -114 -74 30 -53 27 49 -106 -22 -34 0 54 -72 -128 10 102 -44 -27 6 94 -10 -49 -134 11 -15
8163 -15 5 -67 40 47 -76 -29 100 -100 89 4 -7 126 0 105 -104 -189 -6 67 45 126 -63 0 49 142 115
8188 115 75 -83 222
8191B22
##END NTUPLES=NMR FID
##END=
