##TITLE=1H_BAU-P2
 CDCl3, 8 sc, 
 7.6.2019
##JCAMPDX= 6.0         $$ Bruker NMR JCAMP-DX V2.0
##DATA TYPE= NMR FID
##DATA CLASS= NTUPLES
##ORIGIN= UXNMR, Bruker Analytische Messtechnik GmbH
##OWNER= root
$$ XWIN-NMR		Version 3.5
$$ Fri Jun  7 14:33:31 2019 Russian Standard Time (UT+4h)  she@DPX200
##.OBSERVE FREQUENCY= 200.13155
##.OBSERVE NUCLEUS= ^1H
##.DELAY= (6, 6)
##.ACQUISITION MODE= SIMULTANEOUS
##.ACQUISITION SCHEME= undefined
##.AVERAGES= 8
##.DIGITISER RES= 18
##SPECTROMETER/DATA SYSTEM= spect
##.PULSE SEQUENCE= zg30
##.SOLVENT NAME= D2O
##.SHIFT REFERENCE= (INTERNAL, D2O, 0, 15.7039)
##AUDIT TRAIL= $$ (NUMBER, WHEN, WHO, WHERE, WHAT)
$$ ##TITLE= Audit trail, XWIN-NMR		Version 3.5
$$ ##JCAMPDX= 5.01
$$ ##ORIGIN= Bruker BioSpin GmbH
$$ ##OWNER= she
$$ F:/spectra/data/she/nmr/H-F/1/audita.txt
$$ ##AUDIT TRAIL=  $$ (NUMBER, WHEN, WHO, WHERE, WHAT)
(   1,<2019-06-07 14:31:36.68 +0400>,<she>,<DPX200>,
      <created by zg, POWCHK disabled, PULCHK disabled
       configuration hash MD5:
       00 E9 B6 7A A2 85 ED C7 34 08 36 98 17 FE 4E 26
       data hash MD5: 16K
       B2 79 D9 3D 5C 30 EE 3C 64 74 10 6B 88 1C 1D D5>)
$$ ##END=
$$ 
$$ hash MD5
$$ 87 F9 C5 97 B7 BA A3 8B 74 92 90 53 D9 0F 97 31
##$RELAX= 
##$RELAX= 
##$RELAX= 
##$RELAX= 
##$RELAX= 
##$RELAX= 
$$ Bruker specific parameters
$$ --------------------------
##$DU= <F:/spectra>
##$EXPNO= 1
##$NAME= <H-F>
##$PROCNO= 1
##$TYPE= <nmr>
##$USER= <she>
##$AMP= (0..31)
100 100 100 100 100 100 100 100 100 100 100 100 100 100 100 100 100 100 
100 100 100 100 100 100 100 100 100 100 100 100 100 100 
##$AQSEQ= 0
##$AQ_mod= 1
##$AUNM= <au_zg>
##$AUTOPOS= <>
##$BF1= 200.13
##$BF2= 200.13
##$BF3= 200.13
##$BF4= 200.13
##$BF5= 200.13
##$BF6= 200.13
##$BF7= 200.13
##$BF8= 200.13
##$BYTORDA= 1
##$CFDGTYP= 0
##$CFRGTYP= 5
##$CHEMSTR= <none>
##$CNST= (0..31)
1 1 145 1 1 1 1 1 1 1 1 1 1 1 1 1 1 1 1 1 1 1 1 1 1 1 1 1 1 1 1 1 
##$CPDPRG= <>
##$CPDPRG1= <>
##$CPDPRG2= <>
##$CPDPRG3= <>
##$CPDPRG4= <mlev>
##$CPDPRG5= <mlev>
##$CPDPRG6= <mlev>
##$CPDPRG7= <mlev>
##$CPDPRG8= <mlev>
##$CPDPRGB= <>
##$CPDPRGT= <>
##$D= (0..31)
0 1.2 0 0 0 0 0 0 0 0 0 0.03 0 0 0 0 0 0 0 0 0 0 0 0 0 0 0 0 0 0 0 0 
##$DATE= 1559903495
##$DBL= (0..7)
120 120 120 120 120 120 120 120 
##$DBP= (0..7)
150 150 150 150 150 150 150 150 
##$DBP07= 0
##$DBPNAM0= <>
##$DBPNAM1= <>
##$DBPNAM2= <>
##$DBPNAM3= <>
##$DBPNAM4= <>
##$DBPNAM5= <>
##$DBPNAM6= <>
##$DBPNAM7= <>
##$DBPOAL= (0..7)
0.5 0.5 0.5 0.5 0.5 0.5 0.5 0.5 
##$DBPOFFS= (0..7)
0 0 0 0 0 0 0 0 
##$DE= 6
##$DECBNUC= <off>
##$DECIM= 24
##$DECNUC= <off>
##$DECSTAT= 4
##$DIGMOD= 1
##$DIGTYP= 9
##$DL= (0..7)
0 120 120 120 120 120 120 120 
##$DP= (0..7)
150 150 150 150 150 150 150 150 
##$DP07= 0
##$DPNAME0= <>
##$DPNAME1= <>
##$DPNAME2= <>
##$DPNAME3= <>
##$DPNAME4= <>
##$DPNAME5= <>
##$DPNAME6= <>
##$DPNAME7= <>
##$DPOAL= (0..7)
0.5 0.5 0.5 0.5 0.5 0.5 0.5 0.5 
##$DPOFFS= (0..7)
0 0 0 0 0 0 0 0 
##$DQDMODE= 0
##$DR= 18
##$DS= 0
##$DSLIST= <SSSSSSSSSSSSSSS>
##$DSPFIRM= 0
$$ [...]
##$SUBNAM2= <"">
##$SUBNAM3= <"">
##$SUBNAM4= <"">
##$SUBNAM5= <"">
##$SUBNAM6= <"">
##$SUBNAM7= <"">
##$SUBNAM8= <"">
##$SUBNAM9= <"">
##$SW= 24.9336996594482
##$SWIBOX= (0..15)
0 0 2 0 0 0 0 0 0 0 0 0 0 0 0 0 
##$SW_h= 4990.01996007984
##$TD= 16384
##$TD0= 1
##$TE= 0
##$TE2= 300
##$TE3= 300
##$TEG= 300
##$TL= (0..7)
0 120 120 120 120 120 120 120 
##$TP= (0..7)
150 150 150 150 150 150 150 150 
##$TP07= 0
##$TPNAME0= <>
##$TPNAME1= <>
##$TPNAME2= <>
##$TPNAME3= <>
##$TPNAME4= <>
##$TPNAME5= <>
##$TPNAME6= <>
##$TPNAME7= <>
##$TPOAL= (0..7)
0.5 0.5 0.5 0.5 0.5 0.5 0.5 0.5 
##$TPOFFS= (0..7)
0 0 0 0 0 0 0 0 
##$TUNHIN= 0
##$TUNHOUT= 0
##$TUNXOUT= 0
##$USERA1= <user>
##$USERA2= <user>
##$USERA3= <user>
##$USERA4= <user>
##$USERA5= <user>
##$V9= 5
##$VALIST= <valist>
##$VCLIST= <CCCCCCCCCCCCCCC>
##$VD= 0
##$VDLIST= <DDDDDDDDDDDDDDD>
##$VPLIST= <PPPPPPPPPPPPPPP>
##$VTLIST= <TTTTTTTTTTTTTTT>
##$WBST= 1024
##$WBSW= 4
##$XGAIN= (0..3)
0 0 0 0 
##$XL= 0
##$YL= 0
##$YMAX_a= 91770
##$YMIN_a= -89488
##$ZGOPTNS= <>
##$ZL1= 120
##$ZL2= 120
##$ZL3= 120
##$ZL4= 120
##$ABSF1= 10
##$ABSF2= 0
##$ABSG= 5
##$ABSL= 3
##$ALPHA= 0
##$AQORDER= 0
##$ASSFAC= 0
##$ASSFACI= 0
##$ASSFACX= 0
##$ASSWID= 0
##$AUNMP= <proc_1d>
##$AZFE= 0.1
##$AZFW= 0.1
##$BCFW= 1
##$BC_mod= 2
##$BYTORDP= 1
##$COROFFS= 0
##$CY= 11.3945322036743
##$DATMOD= 1
##$DC= 2
##$DFILT= <>
##$DTYPP= 0
##$F1P= 18.9103706918063
##$F2P= -1.10871071338519
##$FCOR= 0.5
##$FTSIZE= 0
##$FT_mod= 4
##$GAMMA= 1
##$GB= 0.15
##$INTBC= 1
##$INTSCL= 1
##$ISEN= 128
##$LB= 0.24
##$LEV0= 0
##$LPBIN= 0
##$MAXI= 10000
##$MC2= 0
##$MEAN= 0
##$ME_mod= 0
##$MI= 1.114404
##$NCOEF= 0
##$NC_proc= 0
##$NLEV= 6
##$NOISF1= 3.799351
##$NOISF2= 2.8
##$NSP= 1
##$NTH_PI= 0
##$NZP= 0
##$OFFSET= 15.70392
##$PC= 1
##$PHC0= -8576.442
##$PHC1= 12.20019
##$PH_mod= 1
##$PKNL= yes
##$PPARMOD= 0
##$PSCAL= 0
##$PSIGN= 0
##$REVERSE= no
##$SF= 200.130013532006
##$SI= 16384
##$SIGF1= 3
##$SIGF2= 2
##$SINO= 400
##$SIOLD= 16384
##$SREGLST= <1H.CDCl3>
##$SSB= 0
##$STSI= 0
##$STSR= 0
##$SW_p= 3612.71676300578
##$SYMM= 0
##$S_DEV= 0
##$TDeff= 0
##$TDoff= 0
##$TI= <>
##$TILT= no
##$TM1= 0
##$TM2= 0
##$TOPLEV= 0
##$USERP1= <user>
##$USERP2= <user>
##$USERP3= <user>
##$USERP4= <user>
##$USERP5= <user>
##$WDW= 1
##$XDIM= 8192
##$YMAX_p= 0
##$YMIN_p= 0
$$ End of Bruker specific parameters
$$ ---------------------------------
##NTUPLES= NMR FID
##VAR_NAME=  TIME,          FID/REAL,        FID/IMAG
##SYMBOL=    X,             R,               I
##VAR_TYPE=  INDEPENDENT,   DEPENDENT,       DEPENDENT
##VAR_FORM=  AFFN,          ASDF,            ASDF
##VAR_DIM=   8192,          8192,            8192
##UNITS=     SECONDS,       ARBITRARY UNITS, ARBITRARY UNITS
##FACTOR=    0.0002004,     1,               1
##FIRST=     0,             0,               0
##LAST=      1.6414764,     0,               0
##MIN=       0,             -89488,          0
##MAX=       1.6414764,     91770,           0
$$ Real data points
##PAGE= N=1
##DATA TABLE= (X++(R..R)), XYDATA
$$ [...]
305d824p239J7658O565j7276l988J5266r52j4414N797J5013p965j4589P855J1565
$$ -4824 -12063 5595 12160 -5116 -9104 6162 5210 -9204 -3407 11606 3641 -10948 -3093 8472
319H472q027p263R810M444j1665l779J1384L445r099j614P026j103o620K492O895
$$ 8472 445 -6818 2992 7436 -4229 -8008 3376 6821 -2278 -3892 3134 2031 -4589 -2097 4798
334D798j747o099L62M031j39k527R12K876j067m342j22N057J386m595j186M223
$$ 4798 3051 -3048 -2686 1345 1206 -1321 -409 2467 1400 -2942 -3064 1993 3379 -1216 -2402 1821
350A821m11n146J755O728j852p385J648O599k655n429M863N188o801n589P407
$$ 1821 1410 -3736 -1981 4747 2895 -4490 -2842 3757 1102 -4327 536 5724 -1077 -6666 741
365G41N189p134l225P356P62q386P71R196j217q599J697P017l072n696M820N328
$$ 741 5930 -1204 -4429 2927 3689 -4697 -3926 5270 4053 -4546 -2849 4168 1096 -4600 220 5548
381E548n760n245N612M354n190k696N384J120n871n35N902M63n096j57M063o10
$$ 5548 -212 -5457 155 4509 -681 -3377 2007 3127 -2744 -3279 2623 3086 -2010 -2167 1896 1286
397A286l639J178L804j121l865O78L482o64l004J165K975j671l346J687L562j481
$$ 1286 -2353 -1175 2629 1508 -2357 -1679 1803 1139 -1865 -700 2275 604 -2742 -1055 2507 1026
413A026l284J626K891k300k882L080L214l500l245L658K659l994j670M706Q67
$$ 1026 -2258 -632 2259 -41 -2923 157 3371 -129 -3374 284 2943 -1051 -2721 1985 2852
428B852n327l88N443o3n053R06M578j937m388K800M283l257l879L514L043l875
$$ 2852 -2475 -2863 2580 2517 -2536 -1630 2948 1011 -3377 -577 3706 449 -3430 84 3127 -748
444g48k031M262J214m491n84M238M0l725N23L159r98k765J221K411j189k092J071
$$ -748 -2779 1483 2697 -1794 -2378 1860 1900 -1825 -1302 1857 859 -1906 -685 1726 537 -1555 -484
461d84J774j003j556R24J461p60j477N74J548m78j696N06K003o51k394R45K720
$$ -484 1290 287 -1269 -345 1116 356 -1121 -547 1001 523 -1173 -667 1336 685 -1709 -764 1956
478A956j377k805J999K715k771k418L511K004m074j382M434N98m650L56M716j301
$$ 1956 579 -2226 -227 2488 -283 -2701 810 2814 -1260 -2642 1792 2390 -2260 -1904 2812 1511
494A511m621K212M294l041l713L803K839m409j827M800O82m851M09M527j394l908
$$ 1511 -3110 -898 3396 355 -3358 445 3284 -1125 -2952 1848 2530 -2321 -1912 2615 1221 -2687
510b687K208L036k781k105L040J196l021l65K694l95k159J041J482j450p42J538
$$ -2687 -479 2557 -224 -2329 711 1907 -1114 -1479 1215 820 -1339 -298 1184 -266 -1008 530
526E30l9j332Q37Q16j485o8J884q24j880J806J486k684p52L375k05l738J324L758
$$ 530 491 -841 -4 812 -673 -741 1143 319 -1561 245 1731 -953 -1705 1670 1465 -2273 -949 2809
544B809k472l397L588K671m513j681N251M55n680R20N688k364n275L819M397n081
$$ 2809 337 -3060 528 3199 -1314 -2995 2256 2711 -2969 -2049 3639 1275 -4000 -181 4216 -865
560h65l185N977J699o399n4O320j640n813L148M880m312l642N050K143n410n73
$$ -865 -4050 1927 3626 -2773 -2827 3493 1853 -3960 -812 4068 -244 -3886 1164 3307 -2103 -2676
576b676N391r38m933K243M010l311k683M050J209m367K82M102j678l240K926K002
$$ -2676 2715 1777 -3156 -913 3097 -214 -2897 1153 2362 -2005 -1723 2379 701 -2539 387 2389
592B389l842n70M194q73l900K381L074l756j942M788O34n241R07N148k673m583
$$ 2389 -1453 -2023 2171 1298 -2602 -221 2853 -903 -2845 1943 2577 -2664 -1757 3391 718 -3865
608c865M365L687n713k366O496N65o788J553O638l561o014N186M682o377k752
$$ -3865 500 4187 -1526 -3892 2604 3169 -3619 -2066 4572 1011 -5003 183 4865 -1512 -4264
623d264P160O08p522J370P202l113o117M676M478o044k702O921R16o970R35O283
$$ -4264 2896 3504 -4018 -2648 4554 1441 -4676 0 4478 -1566 -4268 2653 3569 -3401 -2466 3817
639C817k944n116M774L725n920k054O174K1n799K222N103m129m020N237K437n648
$$ 3817 873 -4243 531 4256 -1664 -3718 2456 2477 -3322 -1100 4003 -126 -4146 1091 3528 -2120
655b120l25N734j894n487L657M711m826l157N686J051o353J062O525k794n865
$$ -2120 -2445 3289 1395 -4092 -435 4276 -550 -3707 1979 3030 -3323 -2261 4264 1470 -4395
670d395M294M265n717k255O854L16p209J487O518l387n114N284L493o677j873
$$ -4395 -101 4164 -1553 -3808 3046 3362 -3847 -2360 4158 771 -4343 941 4434 -2243 -4116
685d116P123l2o733K333N908m590m908O165L476o872j304P034j317o943L680O388
$$ -4116 3007 2975 -3758 -1425 4483 -107 -5015 1150 4626 -2246 -3550 3484 2167 -4776 -1096 5292
701E292n269m971O307K660p069j53P597j906p316L440N961m825l942O257J944
$$ 5292 23 -4948 1359 4019 -3050 -3203 4394 2488 -4828 -1388 4573 -252 -4194 2063 4007
716D007p209k86P110j317o008L222M510n115l033O167J558o131L51N347k639m375
$$ 4007 -3202 -3488 3622 2305 -3703 -481 4029 -1086 -4119 2048 3606 -2525 -2174 3173 534 -3841
732c841M555L294n477j769N510m23n245K758M860m450m028N323K344n869k2O329
$$ -3841 714 4008 -1469 -3238 2272 1849 -3396 -638 4222 -228 -4256 1067 3411 -2458 -2480 3849
748C849k137o431L708N603m929l772O192J603p305K50P594j786o693L492N066
$$ 3849 1712 -4719 -1011 4592 -337 -4109 2083 3686 -3619 -3369 4225 2439 -4254 -762 4304
763D304n366l444O795K057p098m83O428j645n446L865M609n311l594N701J850
$$ 4304 -1062 -4506 2289 4346 -2752 -3235 3193 1548 -3898 -33 4576 -735 -4329 1372 3222
778C222n543N59N338k719n030L944M015m436k070M791k04n165J917N006k898l833
$$ 3222 -2321 -1762 3576 857 -4173 -229 3786 -650 -2720 2071 1867 -3298 -1381 3625 727 -3106
794c106L618J966m538j69N198j079m950K079L753l387k201M788R13n499J81N125
$$ -3106 512 2478 -2060 -2229 2969 1890 -3060 -981 2772 -615 -2816 1972 2885 -2614 -2433 2692
810B692j633m095L511L079n031k226N595R92n280R25M808k976m455M304L888m759
$$ 2692 1059 -3036 475 3554 -1477 -3703 1892 2884 -2396 -1471 3337 361 -4094 210 4098 -661
826f61k503M915M47n252J399N516k448n011L061L515l871j682M871L11n317N25
$$ -661 -3164 1751 2198 -3054 -1655 3861 1413 -3598 -537 2978 -893 -2575 2296 2607 -2710 -2185
842b185M650j433l258K730J935l879j146M116L88l390Q37K425k338j802L282J330
$$ -2185 2465 1032 -2226 504 2439 -1440 -2586 1530 1918 -1472 -635 1790 -548 -2350 932 2262
858B262l314l27K792j227k419K688K192l345j531L318J17l218J547L336k689l154
$$ 2262 -1052 -1379 1413 186 -2233 455 2647 -698 -2229 1089 1206 -2012 -465 2871 182 -2972
874b972L107K174l325o01L840p66m313J500M077j969k978K762J701l853q50M462
$$ -2972 135 2309 -1016 -1617 2223 1457 -2856 -1356 2721 752 -2226 536 2237 -1616 -2466 1996
890A996L70m131M31L179j761k436L019K093l422j638K983N35k468R23K322j873
$$ 1996 2366 -1765 -1334 1845 84 -2352 667 2760 -662 -2300 683 1218 -1250 -327 1995 122
906A22k276J918J689j648m42J669p59j969J253J898j229j039J368j91j852J010
$$ 122 -2154 -236 1453 -195 -637 1032 273 -1696 -443 1455 226 -813 555 364 -1488 -478
922d78K167j243j735J455O58j993K99K604o94k627R02J940j483j046K332O16k873
$$ -478 1689 446 -1289 166 824 -1169 -870 1734 1040 -1587 -685 1255 -228 -1274 1058 1674 -1199
939a199m58K681k4k047J032J672k028j669K347J446k051n71J793o51j935J389
$$ -1199 -1657 1024 1000 -1047 -15 1657 -371 -2040 307 1753 -298 -869 924 273 -1662 -273
955b73K094j421j649J247N79j453L58J932o31k034N13J387o68n22J307O2j838
$$ -273 1821 400 -1249 -2 577 -876 -518 1414 783 -1251 -738 649 -19 -541 766 828 -1010
972a010r4J702K5j020N35M81j271l93J495M31j072m2N39o88l71J169M99j047l08
$$ -1010 -1104 598 623 -397 138 619 -652 -1045 450 881 -191 -233 306 -382 -753 416 915 -132 -440
991d40O20l34m55J011O25j158o47Q88J53p56O03J013j057j267J009R82r11k21
$$ -440 180 -154 -609 402 1027 -131 -778 110 263 -493 110 1123 66 -1201 -192 790 -121 -342
1009c42J172m33j612N56J659m47j117O08M44j179j77J602L09j465k85R05k16n98
$$ -342 830 397 -1215 -659 1000 553 -564 44 488 -691 -868 734 1043 -422 -707 198 -18 -616
1027f16Q94P23j152q40Q41N68n41J42N71o31q18N87P75k71k57K03k62m54L76O24
$$ -616 278 1001 -151 -991 -150 418 -123 19 590 -41 -859 -272 503 232 -25 178 -84 -538 -162 462
1047D62j43l44J5j42k43L94N20k61m25J29ol18L52O97l98p66K88M18m35K4Q59
$$ 462 319 -25 -10 -152 -395 -1 519 258 -167 -38 -44 -362 -10 687 289 -477 -189 229 -206 -182 677
1068F77k02j148J19R51j71n29N65L09j041m34J142N26q79k65O90l05q18P08J032
$$ 677 475 -673 -554 397 226 -303 262 571 -470 -904 238 764 -115 -380 310 5 -813 -105 927
1087I27o64r88N09N05n65lQ90j51j042L2Q04k0l36K87J16n90j97N82K88k77j12
$$ 927 263 -725 -216 289 -276 -279 611 460 -582 -550 254 234 -102 185 301 -289 -486 96 384 107 -5
1108eL9k21o5L90J69k36p2nk57O5N31K3n05N5K70l84j59P39J94q05k24O45o1n23
$$ -5 34 -187 -252 138 307 71 -1 -6 -263 -198 333 356 -149 -94 176 -208 -367 372 566 -239 -463 182 121 -402
1132d02M65O25p12p68P03O39o51k56P96j29j077K69J204k92r69M23O03p85l68
$$ -402 63 688 -24 -792 -89 550 -101 -357 439 310 -767 -498 706 414 -555 -132 471 -314 -682
1151f82J124K99j117k15Q87p8o59M63O47o87o70O50N21n36j43N51j84o42K89O08
$$ -682 442 741 -376 -591 296 218 -441 22 669 -18 -688 -38 483 -53 -196 355 171 -471 -182 426
1171D26k71l42L17k1m10K04M62k57k82K97o0m09K78N29l84m40M43J69o14P9Q27
$$ 426 155 -187 130 109 -301 -97 365 108 -174 123 63 -346 -68 461 77 -363 80 249 -365 -286 541
1192E41k25r29L42P87n70n46R10L99j213k63J264M4j156L46J038p94r50J060Q52
$$ 541 316 -613 -271 516 -54 -600 310 709 -504 -767 497 541 -615 -269 769 -25 -975 85 937
1211I37j106n75J108J50j148K25J224m39j150N80Q78p41n18R54K23j067k1R95
$$ 937 -169 -744 364 514 -634 -409 815 376 -774 -194 684 -57 -575 379 602 -465 -486 509
1229E09k16p52M86M87p18k50P57N0o65K30M67n02l14O66J37o96J13O30m42n59
$$ 509 293 -459 27 514 -204 -454 303 353 -312 -82 385 -117 -431 235 372 -324 -211 419 -23 -582
1249e82P27M48q85k57R84j32r92N07J004q38q63J050N41j172j50J308k40j346
$$ -582 145 593 -292 -549 435 303 -689 -182 822 -16 -879 171 712 -460 -610 698 458 -888
1267h88N43J243p95r54J060O08j306k78J440j9j399L64J223p34r91J059P17j258
$$ -888 -345 898 103 -851 209 817 -489 -767 673 654 -745 -381 842 108 -883 176 893 -365
1285c65l87J296Jj211L97J050p16q36R15N34r94j98R97j55r33M41P83o63n28Q31
$$ -365 -752 544 545 -666 -269 781 65 -771 144 678 -316 -514 483 328 -605 -164 619 -44 -572 259
1305B59J99r29J13R18m39p43P18M82r57j48J053j70j048N27Q83q65o11J129L31
$$ 259 458 -471 -358 560 121 -622 96 578 -379 -527 526 356 -692 -165 718 -147 -758 371 702
1324G02j288PJ320l94j205P84J027j103p97J360M71j496n2J519l93j422P82J244
$$ 702 -586 -579 741 347 -858 -74 953 -150 -947 413 884 -612 -664 855 462 -960 -178 1066
1342A066j108r44J308N70j439j26J412k50j311N83J088q50p91J023M44j097r4
$$ 1066 -42 -986 322 892 -547 -673 739 489 -822 -239 849 -1 -792 231 675 -422 -516
1359e16J075k57r47N57P01p63m05Q89M7q83K78Q09o15n91Q58K77r70O0J012m21
$$ -516 559 302 -645 -88 613 -150 -555 334 381 -502 -224 585 -30 -621 237 514 -456 -396 616 195
1379A95r34P32P70r97n01J184J80j287J93J298n70j181R04R74j180o51J374K74
$$ 195 -739 -7 763 -234 -735 449 629 -658 -465 833 263 -918 -14 960 -220 -871 503 777
1397G77j456J07J417m87j272Q26J013j076o70J206L13j250K7J201l70j042O65
$$ 777 -679 -572 845 358 -914 -88 925 -151 -821 385 698 -552 -525 676 306 -736 -71
1414g1P67q68m73R99J38j011K01R03n18o86P39M08q84j06R47k34q46N30O80p74
$$ -71 696 -172 -645 354 492 -519 -318 585 67 -619 120 528 -356 -462 485 251 -595 -65 615 -159
1434a59m40R47J62j028J52J000m52q72P10P00r45m22J066J23j111K07J039n00
$$ -159 -599 348 510 -518 -366 634 182 -690 20 720 -225 -647 419 542 -569 -362 677 177
1452A77q69P52O46r54l64J051N2j034K52R22n37p40P56N00q85k34R50q0r13L61
$$ 177 -692 60 706 -248 -612 439 491 -543 -291 631 94 -646 110 610 -275 -509 441 361 -552 -191
1472a91Q00o32o10Q14L80r34r2R69k16q96M84P56p18n27Q49K89r20k3Q95k24q09
$$ -191 609 -23 -633 181 561 -373 -465 504 288 -608 -124 632 -86 -613 236 525 -395 -418 477 253 -556
1493e56M62O56o28m61P40K30p61L1P04k66n98M65M26n70k23O30m8o15K98N11m69
$$ -556 -94 562 -66 -527 213 443 -318 -287 417 151 -447 18 444 -126 -349 281 233 -382 -84 427 -42
1514d2l63O00J51o80R5O79l15o33N00N12o62l30P91J04q64J24Q57l38p66N28O26
$$ -42 -405 195 346 -334 -239 440 125 -508 -8 504 -158 -488 303 407 -457 -333 524 186 -580 -52 574
1535E74p25m34Q48K32q77qQ34k17p42M11O21n35m62N99K58n98n0N79j31n10K44
$$ 574 -151 -585 263 495 -382 -390 444 227 -515 -104 517 -18 -480 119 377 -221 -271 308 177 -333 -89
1556h9L98l24k11L75L2l95J19L40k32k00L19J2l76J23L99k56l29L65J91m89k5
$$ -89 309 -15 -226 149 181 -214 -95 245 13 -187 132 144 -232 -109 290 34 -295 70 261 -228 -253
1577b53N59p6n95K21N11l72m16N39L10o57j91O80L3o77J98N99l58n34M71M31n24
$$ -253 306 230 -365 -144 367 -5 -421 118 428 -229 -420 260 293 -384 -186 413 55 -479 -8 423 -101
1598a01k52N43P0n66R5N37j62m71K49L13l06j94L88J09m09j0L19r4j99K01J16
$$ -101 -353 190 260 -306 -211 326 164 -307 -58 255 -51 -245 143 252 -157 -167 152 58 -141 60 176
1619A76k68l3K36o2j43J56P1k53k4K74m0k34J40J85k72j46L62Q1l68J0L35j46
$$ 176 -92 -125 111 49 -94 62 133 -120 -144 130 90 -144 -4 181 -91 -237 125 206 -162 -152 183 37
1641C7l28K83L10l51k61L84J20m01M2M33j52m31J98L65k57k27L41J20m05n6M13
$$ 37 -291 -8 302 -49 -310 74 194 -207 -165 268 116 -315 -117 248 -9 -236 105 225 -180 -236 177
1662A77ll21Q1K52k07k09K86J72k68j09K35k1j97J29J91j76j32J48L2j15O2J14
$$ 177 174 -147 -66 186 -21 -230 56 228 -40 -149 86 65 -132 -3 188 12 -120 28 60 -55 7 121
1684A21j34j08J27M6j01M1J16j28j41J53J26j64l0J85q0k43J39K53j49k00J88
$$ 121 -13 -121 6 52 -49 -8 108 -20 -161 -8 118 -46 -76 109 29 -214 -75 178 29 -171 17
1705A7R5k70LL19j7l17O3K40j46j59K42J42k86j38K73P1k25N4K25j60k31J86K05
$$ 17 112 -158 -155 164 147 -170 -107 133 -13 -172 70 212 -74 -212 61 132 -93 -39 186 26 -205 -19 186
1728A86j61j14J61Mj99O0K14n9j70P9M6j10J6J52l4j41K8O0o5J6J11l2j43L8Q2
$$ 186 25 -89 72 76 -123 -63 151 92 -78 1 47 -63 -47 105 71 -70 -42 18 -47 -31 80 48 -95 -57 25
1753B5m7l9J33nj89J2J82m3j16J11Q8k08p5K42N3k04nJ77j06j75J97J89j84j73
$$ 25 -22 -61 72 67 -122 -110 72 29 -87 24 112 -96 -171 71 124 -80 -85 92 -14 -189 8 197 13 -160
1777a60J97N4j87K8K49p7k65R9J87j11q8J61L6k21k3K27J1j59M5R4j28p7J70O7
$$ -160 37 91 -96 -68 181 104 -161 -62 125 14 -74 87 123 -98 -121 106 117 -42 3 97 -31 -108 62 129
1801A29j37m1Q9n7p7J15Q0j08p0Q8j8p6R9P7j22r2J29J7r5P0J11j20j36J08J15
$$ 129 -8 -49 40 -17 -94 21 101 -7 -77 11 -7 -83 16 93 -29 -121 8 25 -70 0 111 -9 -145 -37 78
1826G8j13k0J66p0j98Q1K18r2j48J35O6k13k3K83ok34K4J80j08j38J99J20k39
$$ 78 -35 -55 111 41 -157 -76 142 50 -98 37 103 -110 -133 150 144 -90 -66 114 6 -132 67 187 -52
1849e2j05K13N5j86M3J88j31j87J45J62j40q7J40Oj72K8J92o9j44Q7O0j24lJ52
$$ -52 -157 56 111 -75 -32 156 25 -162 -17 145 5 -82 58 64 -108 -80 112 43 -101 -14 46 -78 -81 71
1873G1k4j22N1M7p9qJ32k2j43O1P9q5m6J74J3k15OJ99k7j76J38J42k27j29K70
$$ 71 47 -75 -24 23 -56 -64 68 46 -97 -36 43 -42 -88 86 99 -116 -110 89 62 -114 24 166 -61 -190 80
1898H0R0k33j9K24r9k20J81K06j76j80J74J08k12j3K39l6k76Q9K01j00j39J64
$$ 80 170 -63 -82 142 43 -177 4 210 34 -146 28 136 -76 -89 150 114 -162 -73 128 28 -111 53
1920E3O7k15k9K01rj69P6J14j32p4J48L4j49N1J01r6r4J40P7j50j6J44o6j51J26
$$ 53 120 -95 -124 77 68 -101 -25 89 -43 -117 31 65 -84 -33 68 -28 -122 18 95 -55 -71 73 7 -144 -18
1945a8J65j46j43J73N7j90M1K32j09k21J27J87j64r5K18J1k45K0K60p7j98J23
$$ -18 147 1 -142 31 88 -102 -61 171 62 -159 -32 155 -9 -104 114 125 -120 -100 160 83 -115 8
1967HJ31j85j04K54N0k58KK27q0j83J51J47k09j05K26J4k00M6J99j16j68J64R2
$$ 8 139 -46 -150 104 154 -104 -102 125 45 -138 13 160 -49 -154 72 86 -114 -68 131 15 -153 11 103
1990A03j92k3K03k7j98P4J74j19j10J72M2k00MK10m9j73J13J16j73p5K30J6k09
$$ 103 -89 -112 91 64 -134 -60 114 -5 -115 57 99 -101 -97 113 64 -109 4 120 -53 -128 102 118 -91
2013i1K4J71j00j29J70R3j94o1K02Qj98Q4J68j54j48J91J25k24m1K17n1k20J20
$$ -91 -67 104 4 -125 45 138 -56 -117 85 93 -105 -21 147 -7 -155 36 161 -63 -104 113 62 -158 -38
2036c8K13j80j64K20P6k28j9K36o3k12J19J72j56j26J93O4k00oK08n4j87J27J48
$$ -38 175 -5 -169 51 127 -101 -120 116 53 -159 -40 132 -24 -150 43 107 -93 -99 109 55 -132 -5 143
2059A43j73r7J93K3j80O3J55j15j52J46J08j64j5J58m7j89J22J62j43j18J65M6
$$ 143 -30 -127 66 89 -91 -28 127 12 -140 6 114 -50 -65 93 46 -143 -21 141 -2 -120 45 91
2081I1k00L2K04q4j93J32J64j80j03K14K5k32L9K40j05k10J53J45j71q7K05J7
$$ 91 -109 -77 127 43 -150 -18 146 -34 -137 77 102 -130 -91 149 44 -166 -13 132 -39 -126 79 96
2103I6k19K3K36r3j79J31J30j72p0J90J6k00M6J81r1j43J37Q4j74j7J94l3j79
$$ 96 -123 -100 136 43 -136 -5 125 -47 -117 73 89 -111 -65 116 25 -118 19 103 -71 -88 106 73 -106
2126a06P3J33j21o1J55J7j87J2J86p0j31J09J04j62n2J83J8k12M1J73j01j43J63
$$ -106 -33 100 -21 -82 73 90 -97 -85 101 31 -100 9 113 -49 -101 82 100 -112 -71 102 1 -142 21
2149B1R8k03m5K06pj79O0J57j28j10J62Q3j79m8K08k3j74O7J45j28j05J72O1j90
$$ 21 119 -84 -129 77 70 -109 -49 108 -20 -130 32 115 -64 -112 96 73 -101 -34 111 -17 -122 50 111 -79
2173g9pJ78n8j31R7J14j45q6J64L0j54K4J48q7j33J35R4j42o4J56Lj33M4J42j10
$$ -79 -86 92 34 -97 0 114 -31 -117 47 77 -77 -53 95 8 -125 10 104 -38 -102 54 57 -76 -32 110 0
2198@j22J43Q3j48l7J53l7j36Q6J29j38q8J41N0j42LJ31m1j37R9J20j28q5J47
$$ 0 -122 21 104 -44 -81 72 35 -101 -15 114 -24 -112 29 79 -63 -60 71 30 -107 -8 112 -16 -101 46
2222D6K9j60N5J34p1j46J18J07j35o1J47rj38N5J26p4j20J09P5j30j6J27j7j47
$$ 46 75 -85 -30 104 33 -113 5 112 -23 -84 63 54 -84 -29 97 23 -97 12 87 -43 -59 68 51 -96
2246i6O9J20p9j02J13L9j29j2J56l3j39O3Q8q1n5J13J3j16J1J31n7j00P2O3r4
$$ -96 -27 93 14 -88 25 64 -65 -77 79 46 -93 -30 58 -23 -78 35 48 -68 -57 74 17 -83 -11 52 -42
2271d2l0J18Mj26L5J19o1r7R9N0j22kJ32k2j33N6J04r3n3J14L5j44QJ28l4j08
$$ -42 -72 46 50 -76 -41 78 17 -80 19 69 -53 -55 77 55 -78 -22 82 -11 -64 50 85 -59 -51 77 43 -65
2297f5N7Q6j10l1J09K9j28j1J12j5r8O9P3j14n5J35J6j20J2J00o2o9Q8O1j18k7
$$ -65 -8 78 -32 -63 46 75 -53 -64 48 33 -65 4 77 -37 -92 43 59 -61 -49 51 -11 -80 8 69 -49 -76
2323g6J09lq5K1P2n5n4Q0M7q1l6R4j0p4N6P5r8m5R5K0q5RQ6m3q5Q8M8q8m2J10
$$ -76 33 30 -55 -34 38 -17 -71 9 56 -25 -61 33 23 -51 5 80 -18 -63 32 52 -33 -24 62 19 -66 22 70 -18 -60 50
2353E0Mr7J9R5p0q4Q9O5q8l1Q5Jj00L4R5o2q9Q2M9q6j6Q4mj03M9R6q1o0Q5K7p9
$$ 50 54 -43 -24 71 1 -83 6 71 -17 -48 37 38 -62 -28 67 5 -84 -2 47 -39 -55 29 25 -78 -29 67 -14 -74 11 38 -41
2384d1KP8k8q1N7N7n0l9O8Qq6L5Q1m4o6O9L4p0k2R3k0q6M4P7n7n9O0K7o4oQ8j1
$$ -41 -39 39 11 -70 -13 44 -6 -45 23 31 -55 -20 61 17 -49 20 54 -16 -38 55 35 -51 -7 70 13 -46 14 41 -23 -29 59 48
2416D8j00L6Q1o4o9R7J7q7j4J02l8p4N5O1o4m7R1J4j09J1R3l2o4N4L4p2l2Q8J7
$$ 48 -52 -16 65 1 -68 29 46 -41 -55 47 9 -65 -10 51 -13 -60 31 45 -64 -53 40 8 -56 -2 32 -40 -72 16 33
2445C3p7J0P5m6m0N4K9p7nJ01l4o6L7O4n9l1P8J7q5NO5j6o3M2L3n8k4Q9jq3J2
$$ 33 -44 -34 41 -5 -45 9 38 -39 -44 57 23 -43 -6 58 -1 -32 46 63 -22 -17 48 32 -31 11 44 -14 -38 51 50 -33 -21
2476b1O9l2p5P7L7r4k8R0J7r9L2P2n7n9P7M4q5j8R0j1r7L9R5n9p9R1M3r9k1R3
$$ -21 48 16 -59 18 55 -39 -67 23 40 -59 -27 45 -12 -71 6 50 -35 -53 37 26 -71 -32 63 4 -75 16 59 -40 -61 32
2506C2j4q2M5P1n1m5O1K7q0PQ2k8n8M9M2n5l3O2Lo1K8O1o4m0O4M3q1k3Q4j7p8
$$ 32 18 -64 -19 52 1 -44 17 44 -36 -29 53 25 -33 16 58 3 -30 32 35 -26 2 63 -1 -41 23 66 -15 -38 46 29 -49
2537d9M4P5p5o7Q4L4j10K0J12n3r6O3O4o8m3P7L6j06mJ11j8j10N9P9p2m7J00J5
$$ -49 -5 70 -5 -72 12 46 -64 -44 68 15 -81 -18 46 -22 -65 12 48 -58 -62 49 31 -79 -20 59 -13 -60 40 55
2565E5r5qJ12m5q8P6N2p2k7Q6Jq3K0R0o9m0N3L6p3j8R6j5j06M1Q5o4n2Q6K8j09
$$ 55 -40 -48 64 19 -69 7 59 -13 -40 46 47 -36 -16 74 5 -35 18 54 -19 -37 59 44 -62 -21 64 0 -52 34 62 -47
2595d7QJ15m1j08O4O5r0k7R2J9j05KR2k1r6Q0N4r2l8R5K1j01L2Q7m9q5Q8N2r9
$$ -47 -39 76 35 -73 -9 56 -34 -61 31 50 -55 -53 39 18 -78 2 56 -36 -74 21 42 -59 -27 60 11 -74 14 66 -33
2624c3k5J13m1q5N9R8p9p8J11J9r5j1J18j2j10L8J00q3p0J04L4j20oJ19l0j03
$$ -33 -58 55 14 -71 -12 86 7 -71 40 59 -36 -47 71 59 -51 -13 87 4 -66 38 72 -48 -54 65 35 -68
2650f8N7Q5r8m2J04oq1J5Q5m8p3Q8M9r4l0Q1Nj05M5R1p1o5Q3N9j23QJ24m9j13
$$ -68 -11 74 -24 -66 38 32 -49 -34 51 3 -70 18 67 -27 -57 24 29 -76 -31 60 -11 -76 7 66 -57 -49 75 26 -87
2679h7O1J02q9o7J20K1j30J9J26l2j12O6P6r5n5J00O4j27j9J21l5r5O6R0j10n0
$$ -87 -26 76 -13 -80 40 61 -69 -50 76 44 -68 -2 74 -21 -76 24 88 -39 -58 63 28 -67 -1 89 -21 -71
2705g1J06J9q8J4R1o4p9P9M7q4j3R0j7r4N2P4p5l3O5L1j02oJ17l2j12P5Q4j01
$$ -71 35 54 -34 -20 71 7 -72 7 54 -30 -43 47 30 -64 -12 62 -13 -46 19 50 -52 -58 59 27 -85 -10 74 -27
2733b7n7J38Nj22K4J06m1j09P7Q7j12l2J05K5j20J2J19o1j07R4P5q7n8J14Pj22
$$ -27 -84 54 59 -63 -39 67 26 -83 -6 81 -31 -63 42 67 -53 -41 78 17 -90 4 79 -8 -66 48 55 -67
2759f7M2J01o1q9Q5M1j03j1J12j1j03L3Q9n2o2Q2K4r3j1R1%j12O4P4p9n7J11J3
$$ -67 -25 76 15 -74 11 52 -51 -62 50 39 -64 -31 58 6 -56 26 50 -43 -54 37 37 -75 -11 63 -16 -73 38 51
2787E1j11J9J07n5r1Q7O1q3n2J23rj04K5R8m1r1O7O4r0l3J10Rj27J8J24o5p9J00
$$ 51 -60 -41 66 11 -80 7 68 -15 -67 56 47 -57 -32 66 25 -66 1 65 -25 -58 52 61 -66 -48 76 11 -68 32
2815C2L5j03m4J48k1j07K9R6p3o2R3L6r3j6Q9j2r1O8O6q6m9J01K3j02PQ7l9q3
$$ 32 67 -36 -80 68 47 -60 -31 65 -8 -70 23 59 -34 -50 39 27 -64 4 70 -16 -65 36 59 -43 -36 51 12 -71
2843g1P4O6r1k7R3j1q9L1Q3o4n2P6K9p9k4J08j8q0L0Q5q0n9Q7M9j05j3R6k5q2
$$ -71 3 69 -22 -49 44 33 -56 -25 58 -6 -58 18 47 -32 -56 52 34 -46 -16 69 -11 -70 17 66 -39 -52 44 19 -63
2872f3O1O8q0n6R1L2r8LR0l9q8O4O9o3n4Q4K2r1J2J05k8j03N9O0p4l0R0J1j03
$$ -63 -2 66 -14 -70 21 53 -45 -42 48 9 -79 -15 54 -9 -63 21 43 -48 -36 69 41 -62 -3 57 -17 -47 43 54 -49
2901d9J9Q7m7n6N6M0p5lP5j9p5L2O5n7l6N6K9p8kQ3k7q8M7Q9p5m9Q6Nr3K0J01
$$ -49 -30 57 10 -46 10 50 -25 -28 47 28 -47 -15 50 -7 -43 13 42 -36 -38 45 18 -70 -23 66 -9 -58 28 33 -60 -40 61
2932F1n5p3N3O6p8k3R5oj01RR7k7o2M5M8q4k5R5Oq1OP2k8o1P0L7p3k4P8j2n1P
$$ 61 6 -67 -14 52 -26 -49 46 40 -61 -52 45 18 -44 1 49 -35 -60 35 41 -40 -34 38 10 -51 19 56 -17 -41 37 25 -26 -19
2964a9O4n7l5N7K2n8pP6l2n0M7L9p5k9Q0K2r4J7O3l2n8O0L7o6l0Q0J1q1K9N8n4
$$ -19 45 -12 -47 10 32 -26 -33 43 11 -39 8 47 -28 -57 23 45 -49 -32 31 -1 -59 1 38 -28 -58 22 33 -48 -19 39 -15
2995a5l8P0K4o6j9P1j0n1K1N5m5o7P5L7o5j4P9l6n1M5N1n5l2O0J4o8K0N5k4o1
$$ -15 -53 17 41 -25 -44 27 17 -34 -13 42 -3 -70 5 42 -23 -37 42 6 -45 0 51 -4 -36 24 38 -30 -10 45 21 -40
3025d0M4N1m9m2N8K0p0QP3m5n8N1M4o6j0O4k5m6J8N3m0m7N0J0l4ON2l5n4K1O7
$$ -40 4 55 6 -36 22 42 -28 -20 53 8 -50 1 45 -21 -31 33 8 -38 -20 33 -7 -54 -4 6 -28 -22 30 -5 -59 -38 29
3056B9l1l7N2km5NQ0k4p8M4M3n5k1O9nq0L7P2m5l9L9K7m6j0N3Mo6OO2k9m0L9L3
$$ 29 -2 -39 13 11 -34 -29 51 27 -51 -7 36 -19 -40 29 24 -56 -19 53 8 -31 8 35 -11 -21 32 36 -30 -24 38 9 -31 8 41
3089D1n8j6P6j5o0J3N5l7l2N0J3p2J0N9j9m6K2K9l5j8M7J7o0mO1j2n5N2L4p5j4
$$ 41 -17 -33 43 28 -32 -19 36 -1 -33 17 30 -42 -32 27 8 -38 -16 13 -22 -40 7 24 -36 -40 21 9 -46 6 40 -35 -49
3120d9O6J8q6J8O4m0l3O1K2o4JN8rn5L2M3l6n0O6K0o0j1N5Jp3L2O1n7m6N7L0o2
$$ -49 17 35 -51 -33 31 -9 -42 19 41 -23 -22 36 27 -28 4 47 11 -39 27 47 -13 -24 31 32 -41 -9 52 -5 -51 6 36 -26
3152b6KM9l3l5M3K5m6j9M7kk6LK6k2m6N2K1l6j7N5ko8M6N6o6l5N9J8m6mO5l2o6
$$ -26 -24 25 -8 -43 0 25 -21 -40 7 5 -21 -18 8 -14 -60 -8 13 -23 -40 15 13 -55 -9 47 -19 -54 5 23 -23 -27 38 6 -60
3185f0N8M8m7l0N0J2n8K7M9l1o1N2N5p2k9P2%o7J0P3l1n9L1M5o1oN2nm7J5M9k5
$$ -60 -2 46 -1 -31 19 31 -27 0 49 18 -43 9 64 -8 -37 35 35 -32 -22 51 20 -39 -8 37 -24 -30 22 17 -30 -15 34 9
3217Il9K4K6n1PN7j5o3K0M3l0k6N3J0o5LP1k8m9M3L7n8j8O0ko8K0O1k7l9N3K4
$$ 9 -30 -6 20 -31 -24 33 18 -45 -25 18 -12 -38 15 25 -40 -37 34 6 -43 0 37 -21 -39 21 19 -49 -29 32 5 -34 19 43
3249D3o7j5P2No3KO8k8n6M5M9o6k2P4Pq4K7N0m1m5N2L7q5J0O3j6n2L7K8n4l0O5
$$ 43 -24 -39 33 38 -25 -23 45 17 -39 6 55 -11 -33 41 48 -36 -9 41 0 -45 7 44 -41 -31 32 16 -36 1 29 -25 -55 10
3281A0J8p2OM7j5n4O0L3o0k1O8Rp1K3N4m0n5O4M4o1k2N3om7J8O0l9n5O0L3o7n
$$ 10 28 -44 -38 9 -6 -60 0 33 -27 -48 20 29 -42 -19 35 -5 -60 4 48 -13 -35 18 12 -35 -17 43 4 -51 9 42 -25 -30
3313c0P7l1n7K5O5n8l8P0J8p0JR0n5o2M4O2o2m2O4J4n7J7N8l5o7M0O5o0m2P2P
$$ -30 47 16 -41 -16 49 -9 -47 23 41 -29 -28 62 7 -55 -11 51 -11 -53 11 25 -32 -15 43 8 -59 -19 46 -14 -56 16 23
3344B3p3K8O2m6m5N1L0o6oO1j1m8J8N8l2m4N1K8o4j5P2j1n5K3M5m1l3P6Pq6JJ04
$$ 23 -50 -22 40 -6 -51 0 30 -36 -42 19 8 -40 -22 36 4 -40 11 39 -25 -40 32 21 -34 -11 34 -7 -40 36 43 -43 -42 62
3376F2m1o3M3M4n8l5P4J0r0J5P5k6m9K0O8p2l7Q5J4r3J7P2m5n4O2M2p3j8Q8j1
$$ 62 21 -42 1 45 -13 -48 26 36 -54 -39 36 10 -39 -19 49 -23 -60 25 39 -54 -37 35 -10 -64 -2 40 -33 -51 37 26
3406B6o9K5N4o2j9O2J6p1K0N4k6n2M0M0o2k6N9L8q1KP5k9o5O2N4q2k9P8Rp4K0
$$ 26 -43 -18 36 -26 -45 17 33 -38 -18 36 10 -42 -2 38 -24 -50 9 47 -34 -32 43 14 -51 11 65 -17 -46 32 41 -33 -13
3437a3O6n8m7N7L5n9k7O4J0p6J6P6l6o0N0M2p0oP3j2q5N4N6o3m4O6K1p5J3O3j8
$$ -13 53 -5 -52 5 40 -19 -46 18 28 -48 -32 44 8 -52 -2 40 -30 -36 37 25 -60 -6 50 -13 -57 9 30 -45 -32 31 13
3468A3p4M1O6n0n0P0J9o8rP5k9n2K9P7p1k7O9%q5J6Q7m1n4N1L8o2j1O4j6n6J5
$$ 13 -61 -20 46 -4 -54 16 35 -33 -42 33 4 -48 -19 58 -13 -40 29 29 -56 -40 47 6 -48 3 41 -21 -32 32 16 -40 -25
3499b5O5m1o2O4L0n6k0P0Lp4K8O2m7n8Q6Pq2J1Q0k6o3M9K9m5m3P2K1p3qR6m0m7
$$ -25 40 -1 -63 1 31 -25 -45 25 28 -46 -18 44 -3 -61 25 32 -50 -39 41 15 -48 1 30 -15 -58 14 35 -38 -46 50 10 -37
3531c7K7M2o4j2Q8%p9JQ1m2o5O9K8p6j6P2om9OP0m7m3O0L8o5k6O5ko1K0P6m7o3
$$ -37 -10 32 -32 -44 44 44 -35 -34 47 5 -60 9 37 -39 -55 17 11 -38 -32 38 -9 -52 8 46 -19 -45 20 18 -43 -23 53 6 -57
3564e7P0K7p6RP0l7n7N0M8o6j6N1Qo5K2O7l6n9M1N1o3l3O9J3p5J6O7l0n6N2K7
$$ -57 13 40 -36 -27 43 6 -51 -1 47 -19 -35 16 24 -41 -19 48 12 -47 -6 45 -18 -51 18 31 -44 -28 39 9 -47 5 32
3595C2m8k1O6j1o9L4O1m7n1N9K7o4JN9k0n9K9N7l6l7M7J6n8j0P2j1p3O0L4o3k0
$$ 32 -16 -37 29 18 -51 -17 44 -3 -54 5 32 -32 -31 28 8 -51 -22 35 -1 -38 9 25 -33 -43 29 18 -55 5 39 -24 -44
3626d4O4Kn9J8N3k3n3M8K8m9j7N2Ln5J2M6k9l8M8J9o4j2P5j3o8M4N3l8n8O9K7
$$ -44 20 22 -37 -19 34 11 -42 6 34 -15 -32 20 23 -32 -20 26 -3 -41 7 26 -38 -50 25 12 -56 -12 41 3 -55 14 41
3657D1q0LO7j8m7J3M0l5k1M2J5m6kN0rn2K4M7l6m3M8K2n9J1N2m9j2L8L3o2rN6
$$ 41 -39 -36 31 13 -34 -21 19 -16 -37 5 20 -26 -28 22 13 -39 -15 32 -4 -47 1 23 -36 -25 27 -22 -34 4 37 -25 -34 22
3689B2qm9K5M4l5m2N2J3n6MN7mn6QO3n5k2M8J5p5K0N4k8l9L7K8m2k0O3%n9MN8
$$ 22 14 -35 -10 34 -1 -43 9 22 -34 -30 27 23 -33 -25 38 -17 -39 9 24 -51 -31 23 -5 -44 -7 21 -21 -41 22 22 -37 -33 25
3722B5l6m5M7K8m1l0M0L4o2K1M2k3m4N3J7m8qN4qn1K9L3m4qL7Kk7pL3Kl6J9L4
$$ 25 -11 -56 -9 19 -22 -52 -12 22 -40 -19 23 0 -44 9 26 -22 -30 24 16 -35 -6 27 -17 -25 12 14 -13 -20 13 15 -21 -2 32
3755C2m1k2M5J9n9J5L3j7l9L1K8l7k3M7J4o1J3N0l5m2M2K6l6k0M4jn0J0N4k6m4
$$ 32 -9 -31 14 33 -26 -11 22 5 -34 -3 25 -12 -35 12 26 -35 -22 28 -7 -49 -7 19 -17 -37 7 6 -44 -34 20 -6 -50
3786e0M6J9m8kM7Ko0K9N1m3l4M2J8l9LM3k3k7J8L7l6j9L8Ol7nM6j4m3L4L1l3k8
$$ -50 -4 15 -33 -35 12 14 -46 -17 34 -9 -43 -1 17 -22 -19 24 1 -26 -8 29 -7 -26 12 18 -19 -24 22 8 -35 -1 30 -3 -31
3819c1N1jo1K7M4l3l0N1K1m8j4M2jm2QL3k5k5M4K0n8j1N1lo2K2N2l0l6M9K3o5
$$ -31 20 19 -42 -15 29 -4 -34 17 38 -10 -24 18 17 -25 -17 16 -9 -34 10 30 -28 -39 12 9 -53 -31 21 -9 -45 4 27 -38
3851c8RN3j6m3L0L0l4k3N4jm7JL5jl5K1M1m2j5M6Jo0L0M0k9l9M7J9o0lN9k3l5
$$ -38 -29 24 8 -35 -5 25 -9 -32 22 21 -26 -25 10 9 -26 -5 36 -6 -21 25 26 -34 -4 36 7 -32 15 34 -26 -29 30 7 -28
3884b8K5K6l5j4L2J2m8MN5k3m4J5N0l9k2M2Qo1PN8k3l5L4K5m8j4N1J3m1jL8k1
$$ -28 -3 23 -12 -26 6 18 -30 -26 29 6 -38 -23 27 -12 -34 8 16 -45 -38 20 -3 -38 -4 21 -27 -41 10 23 -18 -19 19 -2
3916bl6M1J8l1k4M9J4n6J6M5k8l7M8L3o9KM5ko8N2K6l6j8K7J5m6J8L5j7m9L0L2
$$ -2 -38 3 21 -10 -34 15 29 -27 -11 34 6 -31 17 50 -19 -17 28 26 -42 10 36 0 -18 9 24 -22 -4 31 14 -35 -5 27
3948B7l9l1N3J4m4k1M4Pn5M4M3o4j2N0oo4L0N5m2m2M5L1m3nN5k2m2J4M4k6l8N7
$$ 27 -12 -43 10 24 -20 -41 3 10 -45 -1 42 -22 -34 16 10 -54 -24 31 -11 -53 -8 23 -20 -25 30 8 -34 -20 24 -2 -40 17
3980A7J3o1JO1rp2K8O6m2l4M4J8n1lM6j6k9J2M1l0k7M2Pm4rN0k2l3K3L8l7k5O0
$$ 17 30 -31 -30 31 22 -50 -22 44 2 -32 12 30 -21 -24 22 6 -23 -11 30 0 -27 15 22 -22 -31 19 -3 -36 -13 25 -12 -37 23
4013B3j1m6K5L6l5l7N1Qn9NN8qn2K1M5l5m1N8L0n8j0N8op1L7N9m6m8M9L5o0nO0
$$ 23 12 -34 -9 27 -8 -45 6 14 -45 -40 18 10 -42 -21 24 -11 -52 6 36 -22 -32 26 20 -51 -14 45 -1 -49 0 35 -25 -30 30
4046C0k0n2L8M5m5k1L3J6m0OL7j3n0M6K2m1j9M2J3m6J1L6k7n2N1K9m4j1O9l5n2
$$ 30 10 -42 -4 41 -4 -25 8 24 -16 -10 27 14 -36 10 32 -9 -28 14 27 -19 -8 28 1 -51 0 29 -15 -26 43 8 -44
4077d4L0L9m3k3N2J6o6jO2j3m8K1N1m0k5L5L4n7j4O0j5o3L7L6k4l9N7J7n8J1L2
$$ -44 -14 25 -18 -41 11 27 -39 -40 22 9 -39 -18 33 -7 -32 3 37 -20 -34 26 11 -52 -15 21 -3 -42 15 32 -26 -15 17
4108A7om3L3K4k9k8N0Ml4j8O0k2m5M0K9n8j2O6j2n9J8N4l8k9N1J6o7J3M8qn0K3
$$ 17 11 -32 1 25 -4 -32 18 22 -12 -30 30 8 -37 3 32 -26 -38 28 16 -43 -25 29 -9 -38 13 29 -38 -25 23 15 -35 -12
4140a2M1k8l3L4L0n8j5P4j1n7K7M7n0k9O5po3K2M8k0k9K9J6l7j6L3K4m7J2M0k5
$$ -12 29 1 -32 2 32 -26 -41 33 22 -35 -8 39 -11 -40 25 18 -45 -23 25 5 -24 5 21 -16 -32 1 25 -22 -10 30 5
4171El6L4L9m7k4L6J0o1L1N4l4m4L6K6n0rM8km3K9K0k7k9L6K6m2rM4nn0L2J8j5
$$ 5 -31 3 42 -5 -29 7 17 -44 -13 41 7 -37 -1 25 -25 -34 14 12 -31 -2 18 -9 -38 -2 24 -18 -27 17 12 -38 -6 12 -3
4204cl5M5Qm7LO4l3n3N6Rk7k2M8om7K6L3j9l7L3K9m3j3M5Qm4JN2l1l5M6K1m9j9
$$ -3 -38 7 15 -32 -29 35 2 -51 5 14 -13 -35 13 7 -40 -14 19 0 -37 -4 25 -18 -31 14 22 -22 -21 31 0 -35 11 32 -17 -36
4238c6O8j1n4J8M5l1k5L5Ql5KL7ql0OL2k8k9M2K7n4RM0j6m9M2J4m1j1O3j9l8J5
$$ -36 32 21 -33 -15 30 -1 -26 9 17 -18 -16 21 13 -17 -11 21 -7 -36 6 33 -21 -12 28 12 -37 5 19 -22 -33 30 11 -27 -12
4271a2M1l3l1M2J3m4jL3Jm0LM0l3j4M6K0n5nN0jn8K2N3m1k6M9J4n2rN4j6l6K5
$$ -12 29 -4 -35 7 20 -24 -25 8 9 -31 -28 12 -21 -35 11 31 -24 -29 21 20 -38 -16 37 -4 -30 19 33 -19 -28 26 10 -26 -1
4304aJ3j3k9L8J3n0RM6j3l4J5M0m6k0M3J3n0J1M7m1k1M5Km9J1K9J1l9QJ9pl1K9
$$ -1 12 -1 -30 8 21 -29 -20 26 13 -21 -6 34 -12 -32 11 24 -26 -15 32 -9 -30 15 17 -32 -21 8 19 -20 -12 7 0 -31 -2
4337bJ8l1rM4ln6L1M0l5k7M3J3m6j0N1mm6K7J8k3j0L0%m2RM7k7l4K7K2j7l2M7
$$ -2 16 -15 -24 20 17 -39 -8 32 -3 -30 13 26 -20 -30 21 17 -29 -2 16 -7 -17 13 13 -29 -20 27 0 -34 -7 15 -2 -34 13
4370A3K0n6NM3j7l8L5J4l2j1L4j0k5J2J8qj7K9Ok6j1L6j0l4J3M4l1k9M3jl6LM1
$$ 13 33 -23 -18 25 8 -30 5 19 -13 -24 10 0 -25 -13 5 -3 -20 9 15 -11 -22 14 4 -30 -17 27 -4 -33 10 9 -27 -24 17
4403A7j1m1L7J9l5j3M2Pl2NK3ql6J8L6m1k5M1K2k7j1L6j2k9K3J7k0j7M0nm1J5
$$ 17 6 -35 2 21 -14 -27 15 22 -10 -5 18 10 -26 -8 28 -13 -38 3 25 -2 -13 23 11 -18 5 22 2 -15 25 20 -21 -6
4435fL2l6j0J9J0l2J8J2Ol8J9J1j9j0K6Qk0j0K6pk8K8K2m6JL7j6k1J1K7l3rK4
$$ -6 26 -10 -20 -1 9 -23 -5 7 13 -25 -6 5 -14 -24 2 10 -10 -20 6 -1 -29 -1 21 -25 -24 13 -3 -24 -13 14 -19 -28 -4
4468dJ8k0pL3j2j8nK1mk1J4K8l7JK2J7n0J2M1k4k9L4Lk1oL3nk5J1J1k3pJ6L1l3
$$ -4 14 -6 -13 20 8 -10 -15 6 2 -19 -5 23 -14 -13 9 26 -24 -12 29 5 -24 10 13 -8 -14 19 14 -11 0 11 -12 -19 -3 28 -5
4503ej0J9kk9J9J6j4k3L5kk4pM5j3l3K8J1l1lL2pm6K7K0j3j2L4J5l3rK9Ol4J7
$$ -5 -15 4 2 -27 -8 8 -6 -29 6 4 -20 -27 18 5 -28 0 11 -20 -23 9 2 -44 -17 3 -10 -22 12 27 -6 -15 14 20 -14 3
4537CL0l4j2K4Nk6PL2j2k4J7J8k6j3L9ql7J1K8j0k4J6kOk3K8Mk4qJ6Kk2K1J2l0
$$ 3 33 -1 -13 11 16 -10 -3 29 17 -7 10 28 2 -11 28 20 -17 -6 22 12 -12 4 2 8 -15 13 17 -7 -15 1 3 -19 2 14 -16
4572a6rK8mk4J6J1pj5K4J4l3oRJ2k7L2J1pl5L0J8m3NL5j9j9K1J9l6MK7Ml1RK9
$$ -16 -25 3 -1 -25 -9 2 -5 -20 4 18 -15 -21 -12 0 -27 5 16 9 -26 4 22 -21 -16 19 0 -19 2 21 -15 -11 16 20 -11 -2 27
4607B7j3k6J2L0l2rK6J5l5mL2j4l9K8J8k9nJ7K0l5%L4k9j2L2Nl9J0K8jk9J8Rj6
$$ 27 14 -12 0 30 -2 -11 15 30 -5 -9 23 9 -30 -2 16 -13 -18 -1 19 -16 -16 18 -11 -23 9 14 -25 -15 13 12 -17 1 10 -6
4641fj6K4kj4nK8j2k3J2L6k9nK3J4l9QK5j6j3K6j4j4kK7nj3J9J5j1k5J3J7k7r
$$ -6 -22 2 0 -14 -19 9 -3 -26 -14 22 -7 -12 11 25 -14 -6 19 3 -10 16 2 -12 -14 13 8 -5 14 29 18 -7 6 23 -4 -13
4675a3L4qm0J7K5k0l0L9Jk8LK7kk2ML4k7j9K4krROJk3LK9j9k2L6rk0MK8ol3K2
$$ -13 21 13 -27 -10 15 -5 -35 4 5 -23 -20 7 5 -17 -13 21 -6 -25 -1 -3 -12 -3 3 4 -19 -16 13 -6 -28 8 -1 -21 -17 11 5 -28 -6
4712fK0l1KK7lj7KJ9j2j8J8Rk5J5P%j4lL5k7mJ9Lk4%K2Lm6K8K6l4j3L2Mk8NK1
$$ -6 14 -17 -15 12 9 -8 -6 13 1 -17 1 10 -15 0 7 7 -7 -10 25 -2 -6 13 16 -8 -8 14 17 -29 -1 25 -9 -22 10 14 -14 -9 12
4749A2k2rJ2J9j5k3L2Rl7JK8j0k3J9J7j5k0K6jj8PK6pj8J4Nk0NK4nk1OJ9kk1n
$$ 12 -10 -19 -7 12 -3 -26 6 15 -22 -21 7 -3 -26 -7 10 -5 -25 1 0 -18 -11 15 8 -10 4 9 -11 -6 18 13 -8 -2 17 15 -6 -11
4785a1K6k7J1J6nk2QK3j5j8L2lk6J5Oj4j9K8J1j8k8L1Pl6PL4rk5J9K6l4j3K0J6
$$ -11 15 -12 -1 15 10 -12 -4 19 4 -14 18 15 -11 4 10 -4 -23 5 16 -2 -30 1 8 -28 -21 13 4 -21 -2 24 -10 -23 -3 13
4819A3m5J7K3pj8J8J8l1qK5%lpJ2qmmJ9k0%K8j8jkJ6j0j9K6Rl4J0J6j4j5J8J9
$$ 13 -32 -15 8 1 -17 1 19 -12 -20 5 5 2 -5 7 -1 -5 -9 10 -10 -10 18 0 -1 -3 13 3 -16 10 19 -15 -5 11 -3 -18 0 19
4855A9j7j7K5Mk9JK4oj8K2Mk5lJ9Ml2PL2k2k6K7J8k8JK1kk7RJ4j3kOK1l1OK0k
$$ 19 2 -15 10 14 -15 -14 10 4 -14 8 12 -13 -16 3 7 -25 -18 14 -8 -34 -7 11 -17 -16 5 3 -24 -15 -1 -14 -16 -10 11 -20 -14 6 4
4892Dk4J3LolJ3jj1j8L6lj5PJ3j8rK8nj0JJ7j3j5J6J7k3oPK0j6j1L0j0k2J3J7
$$ 4 -20 -7 -4 -10 -13 0 -1 -12 -30 6 3 -12 -5 8 -10 -19 9 4 -6 -5 12 -1 -16 0 17 -6 -12 -5 15 -1 -12 18 8 -14 -1 16
4928A6k6JJ1Kk4J9J9m4MK1%j9PK1j7j5K2Jj0PMPj8j8M2j4j3RK2k6lK6jk5OJ4m
$$ 16 -10 -9 2 4 -20 -1 18 -26 -22 -1 -1 -20 -13 8 -9 -24 -2 -1 -11 -4 0 7 -11 -29 13 -1 -14 -5 17 -9 -12 14 13 -12 -6 8 4
4965DnpK0k2nK8j2j0lJ9Jj9J7Nk4NK2j4k6J8K1j0k1K2J5l3J3J2j3nQJj7PNqMq
$$ 4 -1 -8 12 -10 -15 13 1 -9 -12 7 8 -11 6 11 -13 -8 14 0 -26 -8 13 3 -18 4 19 -14 -1 11 -2 -7 1 2 -15 -8 -3 -11 -7 -15
5003a5K0ml1K0J9k0j3J7Mpj2K5j7j4J9J1j8qK7lj7J0J5pl1K6J2poONoqJ2mk6L1
$$ -15 5 1 -30 -10 9 -11 -24 -7 -3 -10 -22 3 -14 -28 -9 2 -16 -24 3 0 -17 -7 8 1 -30 -4 8 1 -5 1 6 0 -8 4 0 -26 5
5040EJ0k7MJ9kk3J8Qj0j8K2kj7JK4j9qJ4Rj9lQLqj4K6nj6RJ4j6j1K5kpQJj3qK2
$$ 5 15 -12 -8 11 9 -14 4 12 2 -16 6 4 -13 -12 12 -7 -15 -1 8 -11 -14 -6 -3 -11 -25 1 -4 -20 -11 3 -13 -24 1 -1 -8 0 1 -12 -20 2
5080BLj1k2K3jnRKNj7J0J7j8lPkqRRj6%RLj5J4Nj6j3K0J3k5NMmLjJ5j6j3RRk0
$$ 2 5 -6 -28 -5 -6 -11 -2 0 5 -12 -2 15 -3 -6 1 -1 -9 0 9 -7 -7 2 5 -10 4 9 -7 -20 0 13 -12 -7 -3 -7 -4 -5 10 -6 -19 -10 -1 -21
5122b1OK2j0j1%J6j4lROrj4J8LqJJ4nj1K0j6LqJ1Rj2P%j0rK2mj8K7j1q%RLplJ0
$$ -21 -15 7 -3 -14 -14 2 -12 -15 -6 0 -9 -23 -5 -2 -10 -9 5 0 -11 9 -7 -4 -12 -1 8 -4 3 3 -7 -16 6 2 -16 11 0 -8 -8 1 4 -3 -6 4
5164Djj3jJ4Jq%K2k2j1RJ6k9J0J9j6j0J1J0k2j0K8j7j0J8J4j1j5K2Lj7kPMppK2
$$ 4 3 -10 -11 3 4 -4 -4 18 -4 -15 -6 10 -19 -9 10 -6 -16 -5 5 -17 -27 1 -16 -26 -8 6 -5 -20 2 5 -12 -14 -7 -3 -10 -17 5
5201EJj9J3jqLQmrPRmM%KrjJ2rKKLkjnN%KlMpONj7JJkj4J5Qlj2J5j4kPJ1jj6R
$$ 5 6 -13 0 -1 -9 -6 2 -2 -11 -4 5 1 5 5 7 -2 -3 9 0 2 4 7 5 4 -1 4 4 6 3 7 0 6 11 -6 -5 -4 -6 -20 -5 3 0 -12 3 -11 -13 -6 5 4 -12 -3
5251cjjnJ7jj2NJ3j1k3J0PJ1j6kQoPJ7j6pJ2Qj9J1%mnkJ4%rj1K6j6nJ8lk0K2j
$$ -3 -4 -5 -10 7 6 -6 -1 12 1 -22 -12 -5 6 -10 -12 -4 -10 -3 14 -2 -9 3 11 -8 3 3 -1 -6 -8 6 6 -3 -14 12 -4 -9 9 6 -14 8 7
5292Gk0NQkmNJ2nj9QQkj0M%j1MMJ4j5J0Rj4JJ2j1j7J4J1lp%J1mrJ4Kj8RNkK%%
$$ 7 -13 -8 0 -2 -6 -1 11 6 -13 -5 3 1 -9 -5 -5 -16 -12 -8 6 -9 1 10 -4 -3 9 -2 -19 -5 6 3 -4 -4 7 3 -6 8 10 -8 1 6 4 6 6 6
5336FJpNLr%K2k9lJ6%qJJ0oj0J6kmJRpmoLj0NoJ7j0lQJmJ4pprJ4mj2J3%qp%J3
$$ 6 7 0 5 8 -1 -1 21 -8 -11 5 5 -3 -2 8 2 -8 8 6 2 3 12 5 1 -5 -2 -12 -7 -13 4 -6 -9 -1 0 -4 10 3 -4 -13 1 -3 -15 -2 -2 -10 -17 -17 -4
5383dLrK7j6oJJ7polMJ2km%kjmNj2RNk4KK2q%RmpnJ2mj0QPno%J2pj6J7J4k6J1
$$ -4 -1 -10 17 1 -5 -4 13 6 0 -3 1 13 11 7 7 5 4 0 5 -7 2 7 -17 -15 7 -1 -1 8 4 -3 -8 4 0 -10 -2 5 0 -6 -6 6 -1 -17 0 14 -12 -1
5429a%Jj7PK5k3kKRj5PkLnNQpj0J0Lj0OJ6j7jJ1Oj5mJ8lj3kJ8j6J0KLnJ0Lrj0
$$ -1 -1 0 -17 -10 15 -8 -10 -8 1 -14 -7 -9 -6 -11 -6 2 -5 -15 -5 -2 -12 -6 10 -7 -8 3 9 -6 -10 8 5 -8 -10 8 -8 2 4 7 2 12 15 6 -4
5472dJ%jKjPKj4J1mj4JJ9poRqJ3j3OpnOPPj0J0j3pJ3Mj8QoRj4NK6j3kJ1pj2Pk
$$ -4 -3 -3 -4 -2 -3 4 6 -8 3 -1 -15 -14 5 -2 -8 1 -7 6 -7 -1 -8 -13 -7 0 7 -3 7 -6 -13 0 4 -14 -6 -12 -3 -17 -12 14 1 -1 10 3 -9 -2 -4
5517dJKj0K0Jj5PNjj0NPloJ2oplLopJ1pqMQkqJ1Ppj3J6mlmQ%JJJ1j1qJ0pj3J3
$$ -4 -3 -1 -11 9 10 -5 2 7 6 -4 1 8 5 -1 11 5 -2 -5 -2 -8 -15 -4 -11 -19 -15 -7 -9 -17 -6 1 -6 -19 -3 -7 -10 -14 -6 -6 -5 -4 7 -4 -12 -2 -9 -22 -9
5564iJ8rqOLljJ%MmOj3JJ1LljklOj0J5Kj4MJKMLnqKRnmJ0j4mJJ4j2rJ2Mj7OJ0
$$ -9 9 0 -8 -2 1 -2 -3 -2 -2 2 -2 4 -9 -8 3 6 3 2 0 -3 3 -7 8 10 -4 0 1 3 7 10 5 -3 -1 8 3 -1 9 -5 -9 -8 6 -6 -15 -3 1 -16 -10 0
5612@JomNLj5ORpkJ1Nj5PJ2j2ONqlj3J5Qj1lJ3j4QPkj3J0nJ4j5Op%kOPj0kJ5j
$$ 0 1 -5 -9 -4 -1 -16 -10 -1 -8 -10 1 6 -9 -2 10 -2 4 9 1 -2 -15 0 8 -3 -6 7 -7 1 8 6 -7 3 -2 12 -3 3 -4 -4 -6 0 7 -3 -5 10 9
5657Ij1JOJlRJk0J0PqMoLnNr%klJ0j2%RLp%J7omlNj7J6PqMj3JPnL%Q%MKj8J5j1
$$ 9 -2 -1 5 6 3 12 13 -7 3 10 2 6 0 3 -2 3 -6 -6 -8 -11 -1 -13 -13 -4 -1 -8 -8 9 3 -1 -4 1 -16 0 7 -1 3 -10 -9 -2 -7 -4 -4 4 4 8 10 -8 7 -4
5707dKRnLkJP%rjOmkpK3p%PrKj1%%K%OokQknoPomJ0lrJ2jjj2J8rkKpORLPlj6M
$$ -4 -2 7 2 5 3 4 11 11 2 1 7 3 1 -6 17 10 10 17 8 10 -1 -1 -1 1 1 7 1 -1 7 5 0 -6 1 -5 -9 1 -2 -11 1 0 -1 -13 5 -4 -6 -4 -11 -5 4 7 14 11 -5 -1
5761ajPoMnojJ9oMkMj8J0J1pkoPj0%J8rRpJ%k0K1kjJLj3PloQoKJ0oj0J1lrQll
$$ -1 -2 5 -1 3 -2 -8 -9 10 4 8 6 10 -8 2 13 6 4 -2 5 -5 -5 13 4 13 6 7 7 -13 8 6 5 6 9 -4 3 0 -6 2 -4 -2 8 2 -8 3 0 -9 -1 -4 -7
5810gMLPqkJ1lj6J1MnkJ7j1oRLppRQpJ3j5J3j5J0Lj1q%PJ2rmNpjRkpPj9J9nOJ
$$ -7 -3 0 7 -1 -3 8 5 -11 0 4 -1 -3 14 3 -3 6 9 2 -5 4 12 5 18 3 16 1 11 14 3 -5 -5 2 14 5 1 6 -1 -2 7 5 -2 5 -14 5 0 6 7
5857Gj5LKj1J0jJKo%JJlMlnJ9j0M%Oj5nJ1mQlM%Pj7MJ2qJNnMmKOj9K6j3q%JRj4
$$ 7 -8 -5 -3 -14 -4 -5 -4 -2 -8 -8 -7 -6 -9 -5 -8 -13 6 -4 0 0 6 -9 -14 -3 -7 1 -2 2 2 9 -8 -4 8 0 1 6 1 5 1 3 9 -10 16 3 -5 -5 -4 5 -9
5906iKJ4j0lOjjKmkjJ2prNJ0Kpo%pPJ2j0lJJ6j6%%OmPj3PmmjJ0KJ0pKj3K3lj0
$$ -9 -7 7 -3 -6 0 -1 -2 0 -4 -6 -7 5 -2 -11 -6 4 6 -1 -7 -7 -14 -7 5 -5 -8 -7 9 -7 -7 -7 -1 -5 2 -11 -4 -8 -12 -13 -3 -1 9 2 4 -9 14 11 1
5953AoJ4JKjJj2%MpJRKj2MnJ2j7%LkMQKrp%J0j2J1JmpJ0nMKrOKkrOkKPpnQQmn
$$ 1 -5 9 10 12 11 12 0 0 4 -3 -2 7 9 -3 1 -4 8 -9 -9 -6 -8 -4 4 6 -3 -10 -10 0 -12 -1 0 -4 -11 -1 -6 -2 0 -9 -3 -1 -3 -12 -6 -8 -6 1 -6 -11 -3 5 1 -4
6005dqLJ4k%LJrnKK1j2ojJ0oMjpllJ9j1Mjj1%J4nKlojJMJPj4L%j1J7rJ4rlkRq
$$ -4 -12 -9 5 3 3 6 7 -2 -7 -5 16 4 -2 -3 7 1 5 4 -3 -6 -9 10 -1 3 2 -9 -9 5 0 2 -1 -7 -8 -7 -3 -2 5 -9 -6 -6 -17 0 -9 5 -4 -7 -9 0 -8
6054hrK0plJ0j1J5k4J2KM%J0k1kK2Nk5QoJ2KpMrOpJ2j1J2npKJRJj4J8j0j1Qj1
$$ -8 -17 3 -4 -7 3 -8 7 -17 -5 -3 1 1 11 -10 -12 10 15 -10 -2 -8 4 6 -1 3 -6 0 -7 5 -6 6 1 -6 -4 -3 6 7 -7 11 1 -10 -2 -13
6096a3J7pKjpOnJ0qJlLNonJ2nkjLjOjjmJ3j4%K4k0MlLLpJ2kLj4MRnj5J3Qpo%P
$$ -13 4 -3 -1 -2 -9 -3 -8 2 -6 -5 -8 -5 0 -6 -11 1 -4 -6 -7 -4 -5 1 0 -1 -5 8 -6 -6 18 -2 2 -1 2 5 -2 10 8 11 -3 1 10 5 -10 3 11 4 -2 -2 5
6145EQj0qRKMoqK0k2JMKQkj5J2j2J0rOk%JjqLNrJ4mkmKR%pKJ1j0MmJ1j9OkQjj
$$ 5 13 3 -5 4 6 10 4 -4 16 -6 -5 -1 1 9 7 -8 4 -8 2 -7 -1 -3 -3 -2 -3 -11 -8 -3 -12 2 -2 -4 -8 -6 3 3 -4 -2 9 -1 3 -1 10 -9 -3 -5 3 2 1
6194AkO%lmmPPqmkKMlKLlLMj5NPpPj1RlkJoP%Nj1JRlmMrQj1J2oJPj3ORllnLjJ2
$$ 1 -1 5 5 2 -2 -6 1 8 0 -4 -6 -4 0 -3 -1 2 -1 2 6 -9 -4 3 -4 3 -8 1 -2 -4 -3 -9 -2 -2 3 -8 -7 2 -1 -5 -1 -10 -2 -13 -1 -7 -6 1 -12 -6 3 0 -3 -8 -5 -6 6
6249FLj6PRj1J5%Ok1R%q%J1mmNkP%klj4J5kk%kJ0qmNj3PKjKlOkrkJ7j8OkJ1Nj0
$$ 6 9 -7 0 9 -2 13 13 19 -2 7 7 -1 -1 10 6 2 7 5 12 12 10 7 -7 8 6 4 4 2 12 4 0 5 -8 -1 1 0 2 -1 5 3 -6 -8 9 -9 -3 -5 6 11 1
6298AmMj9K5Lj2j1MP%RqMKnLkkPLrj2J3J0pj0J4rQJokJ5j3rJJ3j0mJ0j2J5oMj4
$$ 1 -3 1 -18 7 10 -2 -13 -9 -2 -2 7 -1 3 5 0 3 1 -1 6 9 0 -12 1 11 4 -6 8 -1 7 8 2 0 15 2 -7 -6 7 -3 -7 3 -9 6 0 4 -10
6343a0QkpJ2p%LMrJ3llrPpMQnnRl%nJ5j6K6k0JJ6j4jnJ2mj2mJ0OL%oO%JqRmJ1
$$ -10 -2 -4 -11 1 -6 -6 -3 1 -8 5 2 -1 -10 -3 -10 -6 2 -3 -8 1 -2 -2 -7 8 -8 18 -2 -1 15 1 0 -5 7 3 -9 -13 -3 3 6 6 0 6 6 7 -1 8 4 15
6391A5j8RJrm%J1KqPmknjPk5K2nKPLlj3PLj1oJ2KQmj1MlQ%%kjJ8k2OMj8J2Pjj6
$$ 15 -3 6 7 -2 -6 -6 5 7 -1 6 2 0 -5 -6 1 -24 -2 -7 -5 2 5 2 -11 -4 -1 -12 -18 -6 -4 4 0 -11 -7 -10 -2 -2 -2 -4 -5 13 -9 -3 1 -17 -5 2 1 -15
6439a5J6lNj2J9j1MnMJJOnkoOlPp%Jj0Q%pNmPRk4RLjJ3j2Rmj5KM%jmJOLloOkN
$$ -15 1 -2 3 -9 10 -1 3 -2 2 3 4 10 5 3 -3 3 0 7 0 0 1 -9 -1 -1 -8 -3 -7 0 9 -15 -6 -3 -4 9 -3 6 2 -13 -11 -7 -7 -8 -12 -11 -5 -2 -5 -11 -5 -7 -2
6490bj2PnPJ4qplJJ2j0mPMMJokJ3j8J1rJJ4j2KJ3j2j0J3jjjrNkLkjMLqLomJ1j
$$ -2 -14 -7 -12 -5 9 1 -6 -9 -8 4 -6 -10 -3 1 5 6 0 -2 11 -7 4 -5 -4 10 -2 0 13 1 -9 4 3 2 1 -8 -3 -5 -2 -4 -5 -1 2 -6 -3 -9 -13 -2 -3
6537coqRnOlnJMP%KmjRljOo%rJ9j2mRkJ0jJpl%%jrJ1JomQMqkJJKlJRqkkNpKl%
$$ -3 -9 -17 -8 -13 -7 -10 -15 -14 -10 -3 -3 -1 -5 -6 3 0 -1 5 -1 -1 -10 9 -3 -7 2 0 10 9 10 3 0 0 0 -1 -10 1 2 -4 -8 0 4 -4 -6 -5 -4 -2 -5 -4 5 -3 -5 -7 -2 -9 -7 -10 -10
6594a0J1j1oJ1%j4QkOlK%lQmJ2j2PJ4k0kLo%JK1rj0RlqkJ2PJmJ3j7OJlqlJ2Mj1
$$ -10 1 -10 -16 -5 -5 -19 -11 -13 -7 -10 -8 -8 -11 -3 -7 5 -7 0 14 -6 -8 -5 -11 -11 -10 11 2 -8 1 -2 -10 -12 0 7 8 4 17 0 6 7 4 -4 -7 5 9 -2
6640bj1Q%J2mojmJRj5J2LlM%olmLnmJ1rNkm%OrRpPOMj2qJ3J2j0nmJJ2kkKlRm%
$$ -2 -13 -5 -5 7 3 -3 -4 -8 -7 2 -13 -1 2 -1 3 3 -3 -6 -10 -7 -12 -16 -5 -14 -9 -11 -15 -15 -9 -18 -9 -16 -9 -3 1 -11 -19 -6 6 -4 -9 -13 -12 0 -2 -4 -2 -5 4 0 0
6691@NqnPlKQj0Kj%pO%lj2K8j5%QLoj3J4KppRoMJ1j0pj3J0J4j2NPj4OJ0pj%Pj4
$$ 0 5 -3 -8 -1 -4 -2 6 -4 -2 -3 -3 -10 -4 -4 -7 -19 9 -6 -6 2 5 -1 -14 0 2 -5 -12 -3 -9 -5 6 -4 -11 -24 -14 0 -12 -7 0 -14 -8 2 -5 -6 -6 1 -13
6738a3NJ1Jj3LJ0noJNjJ0kkpJLoj6L8j5rJ0Qj1%%Oj4j0J6pLJ1pq%mKj3RJ0KqO
$$ -13 -8 3 4 -9 -6 4 -1 -7 -6 -1 -2 8 6 4 -3 -2 1 -5 -21 17 2 -7 3 11 0 0 0 6 -8 -18 -2 -9 -6 5 -2 -10 -10 -14 -12 -25 -16 -6 -4 -12 -6
6783fJoOoRj6J3Rj1PqRlj9J2J5j8NJ2onjQKj1Qk0K1QMj2JqQqPOj8J4qRnn%PoP
$$ -6 -5 -11 -5 -11 -2 -18 -5 4 -7 0 -8 1 -2 -21 -9 6 -12 -7 5 -1 -6 -7 1 3 -8 0 -20 1 9 13 1 2 -6 2 -6 1 7 -11 3 -5 4 -1 -6 -6 1 -5 2
6830Bj0LMJjj5J5Ok0J4j8OQjPlomJ8pj5J0mMJJRj7mK4k1lK2%JJMj3oJ1j9J4pM
$$ 2 -8 -5 -1 0 -1 -16 -1 5 -15 -1 -19 -13 -5 -6 1 -2 -8 -12 6 -1 -16 -6 -10 -6 -5 -4 5 -12 -16 8 -13 -16 6 6 7 8 12 -1 -7 4 -15 -1 -8 -4
6874dJjK%joO%Nmj4J4nOnLKPqLj8J4Lklj4K5j3qNMoRKojRLmj0njQQoLqJ3mnoN
$$ -4 -3 -4 -2 -2 -3 -9 -3 -3 2 -2 -16 -2 -7 -1 -6 -3 -1 6 -2 1 -17 -3 0 -2 -5 -19 6 -7 -15 -10 -6 -12 -3 -1 -7 -8 1 4 0 -10 -15 -16 -8 0 -6 -3 -11 2 -2 -7 -13 -8
6926hJ5olNMpLNqmO%oNmJjrJ5JmNkOk2OML%qn%OLKmLrJ0jMj0jmkjJ8j1J2mkKj5
$$ -8 7 1 -2 3 7 0 3 8 0 -4 2 2 -4 1 -3 -2 -3 -12 3 4 0 5 3 9 -13 -7 -3 0 0 -8 -13 -13 -7 -4 -2 -6 -3 -12 -2 -3 1 -9 -10 -14 -16 -17 1 -10 2 -2 -4 -2 -17
6979a7Qm%RJ1oj6J5l%rJ0%rKJ1ojJ5j4JJ0Lk6J8j0J1KmjOj4J6rj8LMOPpJ6j6p
$$ -17 -9 -13 -13 -4 7 1 -15 0 -3 -3 -12 -2 -2 -11 -9 2 -4 -5 10 -4 -3 7 10 -16 2 -8 3 5 1 0 6 -8 8 -1 -19 -16 -12 -6 1 -6 10 -6 -13
7022a3OkMrJ2rRmp%OJj1Pj2NJ4pklK3j5KkQj3J5j3L%J4jkklKrPm%kJ2ooNnKOj
$$ -13 -7 -9 -5 -14 -2 -11 -2 -6 -13 -13 -7 -6 -17 -10 -22 -17 -3 -10 -12 -15 8 -7 -5 -7 1 -12 3 -10 -7 -7 7 6 4 2 -1 1 -8 -1 -5 -5 -7 5 -1 -7 -2 -7 -5 1 0
7071@%j2QjQj5JOrJ7j4J6j0mpJ7mqpPOj5MJ1j7K6pj9QJ8j2pJ3jjR%rqRKlrJ8j6
$$ 0 0 -12 -4 -5 3 -12 -11 -5 -14 3 -11 5 -5 -9 -16 1 -3 -11 -18 -11 -5 -20 -16 -5 -22 4 -3 -22 -14 4 -8 -15 -2 -3 -4 5 5 -4 -12 -3 -1 -4 -13 5 -11
7116a1J4ojJ0j5ROrOjmj1J5qKK%kKMjmmRLokjmJ2j2PjllLnnJ4j4NmJkJ2Nj5Mk
$$ -11 3 -3 -4 6 -9 0 6 -3 3 2 -2 -13 2 -6 -4 -2 -2 -4 -2 2 1 -3 -7 2 5 -1 -3 -4 -8 4 -8 -1 -2 -5 -8 -5 -10 -15 -1 -15 -10 -14 -13 -15 -3 2 -13 -9 -11
7165a1J5lj2K1j1pkOMmJLKMj0j2K4Kj3R%%pk%J2npJ1j8PoNNrj3K1j1RrJ8pknj
$$ -11 4 1 -11 10 -1 -8 -10 -4 0 -4 -3 0 2 6 -4 -16 8 10 -3 6 6 6 -1 -3 -3 9 4 -3 8 -10 -3 -9 -4 1 -8 -21 0 -11 -2 -11 7 0 -2 -7 -8
7210hKQknj9J0PJPrMkj1QRmLqJOjmOoNnlKRmOmjpJ5j0kMNjj1RjRqNQj7o%MRml
$$ -8 -6 2 0 -5 -24 -14 -7 -6 1 -8 -4 -6 -17 -9 0 -4 -1 -9 -8 -2 -3 -7 -1 -7 -2 -7 -10 -8 1 -3 3 -1 -2 -9 6 -4 -6 -2 3 2 -9 0 -1 8 0 5 13 -4 -10 -10 -6 3 -1 -4
7264dnOQnj4%lJ9j3Q%k3K2qmJ2Pr%J0knqL%PqONOmKLqNJMj2PnJ6j1lKpQmkJ0j3
$$ -4 -9 -3 5 0 -14 -14 -17 2 -11 -3 -3 -26 -4 -12 -16 -4 3 -6 -6 4 2 -3 -11 -8 -8 -1 -9 -3 2 8 4 6 9 1 6 7 11 -1 6 1 17 6 3 5 -2 6 2 0 10 -3
7314cJJ0lj6RKLLpKkoQ%OkomJnkLMKnkONlLmJ4j4lJQlqJ5Mj2jLmRoPlmkRk1J2
$$ -3 -2 8 5 -11 -2 0 3 6 -1 1 -1 -7 1 1 7 5 -1 -5 -4 -9 -11 -8 -4 -2 -7 -9 -3 2 -1 2 -2 12 -2 -5 -4 4 1 -7 8 12 0 -1 2 -2 7 1 8 5 1 -1 8 -13 -1
7367aMjQonPklpN%lRKj4N%J1j8KOQkj1nMOoLjl%nOjnkPMPjmjrkNlJ1Kj8K3qNk
$$ -1 3 2 10 4 -1 6 4 1 -6 -1 -1 -4 5 7 -7 -2 -2 9 -9 -7 -1 7 5 -6 -11 -7 -1 -7 -4 -5 -8 -8 -13 -7 -8 -13 -15 -8 -4 3 2 -2 -3 -12 -14 -9 -12 -1 1 -17 6 -2 3 1
7421AnoJ0mJ4j0nJ5qOp%j1OnlJ2pMRj4J1roJ0%j0J7j4NJ0j2OrRj0LmjPJrKJ2q
$$ 1 -4 -10 0 -4 10 0 -5 10 2 8 1 1 -10 -4 -9 -12 0 -7 -3 6 -8 3 -6 -12 -2 -2 -12 5 -9 -4 6 -6 0 -9 0 -10 -7 -11 -12 -5 -4 -13 -11 1 -7
7466gNmRj0NJmL%kmkOj0J8jJNj1kRlMPj9kMQkrmJ7j3j1J8mj5J9j4QOmj9K0lkk
$$ -7 -2 -6 3 -7 -2 -1 -5 -2 -2 -4 -8 -10 -4 -14 4 3 4 9 -2 -4 5 2 6 13 -6 -8 -4 4 2 -7 -11 6 -7 -18 0 -4 -19 0 -14 -6 0 -4 -23 -3 -6 -8 -10
7513a0lJknJ1QJj2J6lj1J1nkPj1J0j3oJ4nmO%LMj0J1%%j%NpJ1plNkj3J2PJj1Q
$$ -10 -13 -12 -14 -19 -8 0 1 -11 5 2 -9 2 -3 -5 2 -9 1 -12 -18 -4 -9 -13 -7 -7 -4 0 -10 1 1 1 0 0 5 -2 9 2 -1 4 2 -11 1 8 9 -2 6
7558Fj3J5k2K0oj5J9m%j1OMoNqQj3KmJ7j2lLPpNMOj2OkojQoLJ1q%MkmOj0jjJ7
$$ 6 -7 8 -14 6 0 -15 4 0 0 -11 -5 -1 -7 -2 -10 -2 -15 -13 -17 0 -12 -15 -12 -5 -12 -7 -3 3 -9 -3 -5 -11 -12 -4 -10 -7 4 -4 -4 0 -2 -6 0 -10 -11 -12 5
7605EolKj8J9NmJJmj2J6LMqqjjmKROMoOrj2J4j0J2qjkLj4J8jpMkJRqj3LJ6pJ4
$$ 5 -1 -4 -2 -20 -1 4 0 1 2 -2 -14 2 5 9 1 -7 -8 -9 -13 -11 -2 4 8 2 8 -1 -13 1 -9 3 -5 -6 -8 -5 -19 -1 -2 -9 -5 -7 -6 3 -5 -18 -15 1 -6 8
7653Hj9%OmOoLk%KPm%KMk0J3J1j6J1nKk0KJ0NoJ4pj0J7k3K9j4NqJJ4ommKllqQ
$$ 8 -11 -11 -5 -9 -3 -9 -6 -8 -8 -6 1 -3 -3 -1 3 -17 -4 7 -9 2 -3 -1 -21 -19 -9 -4 -10 4 -3 -13 4 -19 10 -4 1 -7 -6 8 2 -2 -6 -4 -7 -10 -18 -10
7699a0J0oj1PqJ3%jLJjlj4J4JnJ0j0QLoj0J6Oj8J1mJ6j5j3K9j3Mj5KJKnJNOKl
$$ -10 0 -6 -17 -10 -18 -5 -5 -6 -3 -2 -3 -6 -20 -6 -5 -10 0 -10 -2 1 -5 -15 1 7 -11 0 -4 12 -3 -16 13 0 4 -11 -9 -8 -6 -11 -10 -5 1 3 0
7742@o%KOnMqJJ0kopLloJ0pQpPRpJrJ3Lj3JOnLj4NjJ1lrjJ0qJ5Jj4KOJ3k3J0P
$$ 0 -6 -6 -4 2 -3 1 -7 -6 4 2 -4 -11 -8 -11 -17 -7 -14 -6 -13 -6 3 -4 -3 -12 1 4 -9 -8 -2 -7 -4 -18 -13 -14 -3 -6 -15 -16 -6 -14 1 2 -12 -10 -4 9 -14 -4 3
7791CmnJMljOj1RokJ8j8J3j3J2klKpM%LqOnjPmRoj1knOMlKNJlKjJ0j5NOooJ2K
$$ 3 -1 -6 -5 -1 -4 -5 1 -10 -1 -7 -9 9 -9 4 -9 3 1 -2 0 -7 -3 -3 0 -8 -2 -7 -8 -1 -5 4 -2 -13 -15 -20 -14 -10 -13 -11 -6 -5 -8 -6 -7 3 -12 -7 -1 -7 -13 -1 1
7842Ajj1LNMpjJ3j2J0J0j1jomJ5lk3K1nRpj0J6jj5LM%lJoRrPKj6J1RLqNj5J6j2
$$ 1 0 -11 -8 -3 1 -6 -7 6 -6 4 14 3 2 -4 -8 7 4 -19 2 -3 6 -1 -11 5 4 -11 -8 -4 -4 -7 -6 -12 -3 -12 -5 -3 -19 -8 1 4 -4 1 -14 2 -10
7887a0JpOLkJmOj6OnJ3Oj1JQj3MJ1JmJ0jlj0PmOplJ1lMMj5jQJQpRj0%Mj1%Jjj
$$ -10 -9 -16 -10 -7 -9 -8 -12 -6 -22 -16 -21 -8 -2 -13 -12 -4 -17 -13 -2 -1 -5 5 4 1 -9 -2 -6 0 -7 -10 1 -2 2 6 -9 -10 -2 -1 7 0 9 -1 -1 3 -8 -8 -7 -8 -9
7936ijJ4j4%kJ1j0oJ4lnMj6RPoKOpPrO%j0J3j1JKJ2LpjLJoqJ2LPj7J4jj8PJ3j1
$$ -9 -10 4 -10 -10 -12 -1 -11 -17 -3 -6 -11 -7 -23 -14 -7 -13 -11 -5 -12 -5 -14 -8 -8 -18 -5 -16 -15 -13 -1 2 -5 -6 -3 -2 -8 -16 -4 -1 6 -11 3 2 -16 -9 4 -7
7982gM%J1j0KJ1j5Nl%ljj1J7Nj7Pk%qPJ0k%lqkoK3j7J9k9J1L%qQlRjpRMkpOKq
$$ -7 -3 -3 8 -2 0 11 -4 1 -2 -2 -5 -6 -17 0 5 -12 -5 -7 -7 -15 -8 2 0 0 -3 -11 -13 -19 4 -13 6 -23 -12 -9 -9 -17 -9 -12 -3 -4 -11 -2 2 0 -7 -1 1 -7
8030gpK1j1oNJ0Kj5J9j7OknJ2lonK0j5oRmmQJj0NmKk%J2pj0J2l%Jj4POQj8J7j0
$$ -7 -14 7 -4 -10 -5 5 7 -8 11 -6 0 -2 -7 5 2 -4 -9 11 -4 -10 -1 -5 -9 -1 0 -10 -5 -9 -7 -9 -9 3 -4 -14 -2 -5 -5 -4 -18 -11 -5 3 -15 2 -8
8075hMonMJjRlM%pqoJ6JJ%J0j5LNoLNlj3MQmjLJ0ljjpLlqpJ3mNJ2j6OJj2J6qJ
$$ -8 -4 -10 -15 -11 -10 -11 -2 -5 -1 -1 -8 -16 -22 -6 -5 -4 -4 6 -9 -6 -1 -7 -4 1 -2 -15 -11 -3 -7 -8 -5 5 2 1 0 -7 -4 -7 -15 -22 -9 -13 -8 4 -12 -6 -5 -17 -1 -9 -8
8126hQKrkkkmLMOj4J4j5MNj1K1MqoMQpPLQj4KKqjML%rLPJoOqMmLRmmnlJ1j0Oj
$$ -8 0 2 -7 -9 -11 -13 -17 -14 -10 -4 -18 -4 -19 -15 -10 -21 0 4 -4 -10 -6 2 -5 2 5 13 -1 1 3 -5 -6 -2 1 1 -8 -5 2 3 -3 3 -5 -1 -5 -2 7 3 -1 -6 -9 2 -8 -2 -3
8179cJLNj3NjMlj%Pk3
$$ -3 -2 1 6 -7 -2 -3 1 -2 -3 -3 4 -19
8191a9
$$ Imaginary data points
##PAGE= N=2
##DATA TABLE= (X++(I..I)), XYDATA
0@%%%%%%%%%Qj6J6j6J6j6K4l2M0m8N6o4P2q8J00j12J32j52J68j92K16k40K72l06
$$ 0 0 0 0 0 0 0 0 0 0 8 -8 8 -8 8 -8 16 -16 24 -24 32 -32 40 -48 52 -60 72 -80 88 -104 112 -128 144 -162
33a62L46l88M31m79N32n90O55p25Q01q89R84j088J208j343J493j665J864k096
$$ -162 184 -204 227 -252 280 -310 345 -380 421 -468 516 -572 636 -707 786 -879 985 -1111
51a111K371k705L121l651M355n345O851r434J5027m6251M4147Q4395j18212l4220
$$ -1111 1260 -1445 1676 -1975 2380 -2965 3886 -5548 9479 -36772 7375 91770 -26442 -60662
65f0662R8692J2028j13111J9138J10316k1712j04199L0759P6502l9287n8028N6204
$$ -60662 38030 50058 -63053 -43915 66401 44689 -59510 -28751 47751 8464 -49564 6640
77F640M5794n6282m2617M4800K8183k6579r632K0657m502k0281J13J6731J2624
$$ 6640 52434 -3848 -46465 -1665 26518 -61 -9693 10964 6462 -13819 -13706 3025 15649
90A5649j611k2257j2444K2444J4466k4805l391L6626p175n3463J0474O0617j2615
$$ 15649 14038 -8219 -20663 1781 16247 -8558 -11949 24677 17502 -35961 -25487 35130 22515
103B2515n4052K5380M3015m7925l8731O7298L8452p3224l0084P0420Q166p0802
$$ 22515 -31537 -6157 36858 -11067 -49798 17500 55952 -17272 -47356 23064 31230 -39572
115c9572J7799P6998l4737p8582M1579O5985m8862m3500O3360K4510p8021j5055
$$ -39572 -21773 55225 20488 -58094 -16515 49470 608 -42892 20468 44978 -33043 -48098
127d8098Q0684P623o9545P580N5644k8411m8740M2815M5861m3611l6641L7120
$$ -48098 32586 40209 -29336 -21756 33888 5477 -43263 -448 45413 1802 -34839 2281
139B281J8375l4110o21L6125o438l4199M060K2116k275n531N947m321q927M238
$$ 2281 20656 -13454 -14075 22050 15612 -18587 -14527 7589 5314 -217 5730 1409 -7518 -3280
153c280K732j957J1448M729k3564r716K6893P624k5769M468K8563j8993l5764
$$ -3280 -548 -2505 8943 13672 -9892 -19608 7285 14909 -10860 -6392 22171 3178 -32586
166c2586K7069L8713k9274l0910L3670J6469m4070n018N4023k20n4589N648M5643
$$ -32586 -5517 33196 3922 -26988 6682 23151 -20919 -25937 28086 27866 -26723 -21075 24568
179B4568j7708l5741L3486L1185m3496k8294M3453J9220l9099k935L8329j2448
$$ 24568 6860 -28881 4605 35790 -7706 -36000 7453 26673 -12426 -15361 22968 10520
191A0520m0818J9661L8928k0602k8218K2995J3810k9581m230L4562J225l1379
$$ 10520 -30298 -10637 28291 7689 -20529 2466 16276 -13305 -17535 17027 18252 -13127
203a3127J286K1573q223j3112J6405J0367j8692r599J3344M816o360L454L560
$$ -13127 -11841 9732 1509 -11603 4802 15169 -3523 -13122 222 5038 -1322 2132 5692
216E692q633l749O519R20m68O734l220j4092L470J5244n388j0775J2625O754k2246
$$ 5692 -2941 -6690 -171 749 281 7015 3795 -10297 -6827 8417 3029 -7746 4879 11633 -10613
231a0613o109K7549N440k6592L75K4010j0710k4455J9678K6479k3069k4499K3348
$$ -10613 -16722 10827 16267 -10325 -9950 14060 3350 -21105 -1427 25052 1983 -22516 832
244H32J6542k5779o823L1165P89l4632J581L1989m871k5121J1793J9532j9215
$$ 832 17374 -8405 -15228 15937 16726 -17906 -16325 15664 10793 -14328 -2535 16997 -2218
257b218j7464K2020J5660j9619j0331J6341K598j5924K834J6803l527j4956K081
$$ -2218 -19682 2338 17998 -1621 -11952 4389 6987 -8937 -6103 10700 7173 -7783 -5702
270e702R473k515m105M894K343n662l332K484L527K235j472m641j28M004j896
$$ -5702 3771 1256 -2849 2045 4388 -1274 -4606 -2122 1405 3640 2168 -2473 -2601 1403 -493
285d93l147O578M439j0223o340J0914N496j0467j306J1908l360j4913N655J6441
$$ -493 -3640 2938 7377 -2846 -9186 1728 7224 -3243 -4549 7359 3999 -10914 -5259 11182
299A1182o243j4394Q112J0466j2308p755J6548O962j7835n636J6258J722j4601
$$ 11182 4939 -9455 -1343 9123 -3185 -10940 5608 12570 -5265 -10901 5357 7079 -7522
312g522L606J4681p314j5103Q048J3407p760r397Q754N533j0887l927J1869L709
$$ -7522 -3916 10765 3451 -11652 -3604 9803 2043 -7354 1400 6933 -3954 -7881 3988 7697
326G697j0390k732P906K06o633K082O794k343o710R87N141m7l102M94K463j166
$$ 7697 -2693 -5425 2481 2687 -3946 -1864 4930 2587 -4123 -3136 2005 1958 -1144 -650 1813 647
342F47l588O13M873Q72m918j510M287M86m539J234N964j931p268J700P144j966
$$ 647 -2941 -2328 2545 3417 -1501 -3011 1276 1762 -2777 -1543 4421 2490 -4778 -3078 4066 2100
358B100n927L666N163n948n394P276N592p296m373P143J957p823J81Q898j075
$$ 2100 -3827 -161 5002 -946 -6340 936 6528 -768 -5141 2002 3959 -3864 -3683 5215 4140
373D140r093J383P849k281o256L981N406n456n325N790M898n359l559N187J825
$$ 4140 -4953 -3570 4279 1998 -4258 -277 5129 -327 -5652 138 5036 -323 -3882 1305 3130
388C130n651p19O002M65n579l75M550k20l752R79L673j216l883Q89L727n82l220
$$ 3130 -2521 -3240 2762 3227 -2352 -2727 1823 1603 -2149 -1170 2503 1287 -2596 -1707 2020 1438 -1782
405a782Q76K926j450l136J740L517j580l451J472L074j899k842K721L039l342
$$ -1782 -906 2020 570 -2566 -826 2691 1111 -2340 -868 2206 307 -2535 186 3225 -117
420a17l298L599L034l795k179M327J228n073n88N459J78n277M31M794j438m442
$$ -117 -3415 184 3218 -577 -2756 1571 2799 -2274 -2862 2597 2775 -2502 -2071 2723 1285 -3157
436c157K405M355l090m141L386L495l658k541M048J613m426q77M403L23m018K56
$$ -3157 -752 3603 513 -3628 -242 3253 -405 -2946 1102 2715 -1711 -2588 1815 2138 -1880 -1624
452a624L420p82k940J133K603j229k253J141J907j025j628R70J491q36j469O78
$$ -1624 1796 1014 -1926 -793 1810 581 -1672 -531 1376 351 -1277 -307 1184 348 -1121 -443
468d43J511n34j582M74J837n55k207Q02K571j138k791J669K789k387k580L144
$$ -443 1068 534 -1048 -574 1263 708 -1499 -697 1874 736 -2055 -386 2403 16 -2564 580
484E80K246l819j730M274J009m563j29M683q33m703J763M491k638m051L440L302
$$ 580 2826 -993 -2723 1551 2560 -2003 -2132 2551 1718 -2985 -1222 3269 631 -3420 20 3322
500C322m143k331M630J254m866j35M733r23m248J831L475k520k574K953J642l063
$$ 3322 -821 -3152 1478 2732 -2134 -2269 2464 1541 -2707 -876 2599 79 -2495 458 2100 -963
516i63p73K877j4k446P37J858j267j131J529L76j478M44J114j192m38J715l81
$$ -963 -1736 1141 1127 -1319 -582 1276 9 -1122 407 783 -695 -251 863 -329 -767 948 567
533E67j906J305J737k265j158L064L00l577P41L777j899l623L041L072m077k205
$$ 567 -1339 -34 1703 -562 -1720 1344 1644 -1933 -1192 2585 686 -2937 104 3176 -901 -3106
549c106M908J095n527K18N720j637n532L102M873m488l830N582K474o259q93O421
$$ -3106 1802 2897 -2630 -2412 3308 1671 -3861 -759 4114 -374 -4204 1378 3852 -2407 -3300 3121
565C121p96o113K430N384l760m315M713K945n275j360N459k25n208J634M525k789
$$ 3121 2325 -3788 -1358 4026 266 -4049 664 3609 -1666 -3026 2433 2208 -3000 -1366 3159 370
581C70l380L713J967m270m68M322r90l728K335K648l444j301M101j46m131J633
$$ 370 -3010 703 2670 -1600 -2068 2254 1264 -2464 -129 2519 -925 -2226 1875 1729 -2402 -769
597g69L552l117k534M343J338n119Q6N261j765m916L545M173n103l087O150J519
$$ -769 2783 -334 -2868 1475 2813 -2306 -2220 3041 1276 -3640 -95 4078 -1025 -4112 2038 3557
613C557o688M66O783k594o430M439N455n830l794O817J690p420M18P471k268o755
$$ 3557 -3131 -2665 4118 1524 -4906 -467 4988 -842 -4636 2181 3871 -3549 -3131 4340 2072 -4683
629d683L905N344n391l590O566J818p058LO713j936n742L934M439n444k932O148
$$ -4683 -778 4566 -825 -4415 2151 3969 -3089 -3086 3627 1691 -4051 -117 4322 -1122 -4054 2094
645B094J095o062J127N476l259m617M775L314n505j439N719q02n669K863N193
$$ 2094 3189 -2873 -1746 3730 471 -4146 629 3943 -1562 -3001 2718 1916 -3753 -890 4303
660D303m298m058N287K150o061L5O519j975o318L546N156n014l280O355J245p146
$$ 4303 5 -4053 1234 3384 -2677 -2642 3877 1902 -4416 -870 4286 -728 -4008 2347 3592 -3554
676c554N90O977k410n870M342M314o079k694P038R65o998J151O344l508n432N484
$$ -3554 -2964 4013 1603 -4267 75 4389 -1690 -4384 2654 3619 -3379 -2228 4116 608 -4824 660
692F60M268o605k501P003L2p021K575O745m560n804N829L914o715j379P397r60
$$ 660 4928 -1677 -4178 2825 2857 -4164 -1589 5156 596 -5208 621 4535 -2180 -3559 3838 2878
708B878p591K723O783m153m995N559K900o822j096P300m98o664K248N266m222
$$ 2878 -4713 -1990 4793 640 -4355 1204 4104 -2718 -3814 3486 2988 -3676 -1428 3838 -384
723c84l748N770K337o295o68N790j496m861L694L866n151k608N571P33n400J632
$$ -384 -4132 1638 3975 -2320 -2988 2802 1306 -3555 139 4005 -1146 -3754 1817 2550 -2850 -1218
739a218N084l711m506M947L286n595j215O121j135o456K979O176m314m795N549
$$ -1218 3866 155 -4351 596 3882 -1713 -2928 3193 2058 -4398 -1419 4757 443 -4352 1197
754A197K678o796o34P607j024p278K588N925m440m207O189K720p087j326O850
$$ 1197 3875 -2921 -3555 4052 3028 -4250 -1662 4263 -177 -4384 1805 4525 -2562 -3888 2962
769B962n30n948K806N027m743m152N606K818n635o85N437j733n250L457M640m233
$$ 2962 2432 -3516 -710 4317 -426 -4578 1028 3846 -1789 -2474 2963 1230 -4020 -563 4077 -156
785a56l149M617R09n005J153N197k464m554L244K935m068r81M939n27n212J567
$$ -156 -3305 1312 2221 -2784 -1631 3566 1102 -3452 -208 2727 -1341 -2322 2617 2090 -3122 -1555
801a555M457k692k966M110J533n258l89N435q34m643K557L554m364k650N450J675
$$ -1555 2902 210 -2756 1354 2887 -2371 -2760 2675 1841 -2802 -245 3309 -1055 -3705 1745 3420
817C420n494j13N024j982m626L778M228m632l288M823J510n061N55N444k031n408
$$ 3420 -2074 -2187 2837 855 -3771 7 4235 -397 -3685 1138 2648 -2413 -1858 3586 1555 -3853
833c853K764M370l426k581M376R05n206J45N118r20m003K058K530l374j498M148
$$ -3853 -1089 3281 -145 -2726 1650 2555 -2651 -2506 2612 1692 -2311 -253 2277 -1097 -2595 1553
849A553Q09l854J37K903j587k072K943J574l413r19L080l95k575K044K318l136
$$ 1553 2362 -1492 -1355 1548 -39 -2111 832 2406 -1007 -1926 1154 759 -1816 228 2546 -590
865e90j956L395R23l247P28L259k193l337K949K796l192j436L558j75m115J214
$$ -590 -2546 849 1772 -1475 -747 2512 319 -3018 -69 2727 -465 -1901 1657 1482 -2633 -1419
881a419M311j718l627K306K307l320j195M262O04m426l5L661j042k756K458K235
$$ -1419 2892 1174 -2453 -147 2160 -1160 -2355 1907 2511 -1915 -1950 1711 669 -2087 371 2606
897B606l358j926L271J176k693K08K335j491k335J985K085j769j119J588j92j835
$$ 2606 -752 -2678 593 1769 -924 -716 1619 128 -2207 -222 1863 94 -1025 563 371 -1464
913a464J126K022j292j535J256M12j575O79K073j180k030J308J225j675j35K342
$$ -1464 -338 1684 392 -1143 113 525 -1050 -371 1702 522 -1508 -200 1025 -650 -785 1557
929A557n57k708P81K340j138j462J919P68k703n49K863K93k373M82J808j576j680
$$ 1557 1000 -1708 -927 1413 275 -1187 732 1500 -1203 -1752 1111 1404 -969 -487 1321 -255 -1935
946a935K308J616k248j085J866n1j823J104K066j471j967J300J154j277m6J702
$$ -1935 373 1989 -259 -1344 522 471 -1352 -248 1818 347 -1620 -320 834 -443 -489 1213
962A213n86k067N80J808n42r45R79K01j628l8J861J14j398K05P00r27l67J464
$$ 1213 627 -1440 -860 948 406 -539 440 641 -987 -1025 836 950 -448 -243 457 -470 -837 627
980F27M38j347l00P83l07m09J002M37j180m69Q22K7m66O94N07j140p09J043M82
$$ 627 1065 -282 -582 201 -106 -515 487 924 -256 -725 97 124 -342 352 859 -281 -990 53 535
999E35p86K33Q46r03j168J058J193r07o31R81j67j395N44J712m78j468M75P47
$$ 535 -251 -18 828 -75 -1243 -185 1008 101 -530 451 284 -1111 -567 1145 667 -801 -326 421
1017D21q69k34J460K08j597l45J198Q5p09N99O09j084q26J057P77o81k11N07m48
$$ 421 -448 -682 778 986 -611 -956 242 327 -382 217 826 -258 -1084 -27 750 69 -142 365 -83
1036h3o97O68Q46m09n57K00m0l29M07N90k89n48N3J01r6L02L94l45n47J57K38
$$ -83 -780 -112 734 325 -232 -32 -72 -401 6 596 307 -241 -188 -87 -183 119 513 168 -379 -222 16
1057A6j65K00N17m24p87L21O35l15j52O21j71j053J66J108q5p51L17L75q23l48
$$ 16 -149 51 568 144 -643 -322 313 -2 -154 467 296 -757 -591 517 432 -319 -2 373 -450 -798
1077g98J157N29j049m46P59k6o90N48R44p19j072N65P81m89k33P30j18j012J02
$$ -798 359 888 -161 -607 152 126 -564 -16 928 209 -863 -298 483 -6 -239 491 373 -639 -537
1096e37R74J4n65J17J96m66j33O32K65m32k59J27m9l3L50J33l63j56J00q4N8M36
$$ -537 437 451 -114 3 199 -267 -400 232 497 65 -194 -67 -116 -149 201 334 -29 -185 -85 -169 -111 325
1118C25k3n71qL74j84j79N63J58q17k14P34J02n59K68N43o25o97P45P45o66m64
$$ 325 302 -269 -277 97 -87 -266 297 455 -362 -576 158 260 -299 -31 512 -113 -810 -65 680 14 -450
1139d50O90N8r35K30J186k81j109L24P73n70m57R73L19j163k64J003R0p32K62
$$ -450 240 298 -637 -407 779 498 -611 -287 486 -84 -541 432 751 -412 -676 327 417 -315 -53
1158e3O29o08o65P00O11n86l41N23k7o16K58O57k96m92K82J53l74J24M81k58l95
$$ -53 576 -32 -697 3 614 28 -313 210 183 -433 -175 482 186 -306 -24 129 -245 -121 360 102 -293
1179b93K68J22l48J81M76l40n16M05L17n17l0P28j70r04K76Q87m22o83P38M72
$$ -293 -25 97 -251 -70 406 66 -450 -45 272 -245 -275 453 283 -621 -345 542 120 -563 175 647
1199F47j093l21J285J64j220J50J089n93r65R29R27j103p32J101L55j111N5J180
$$ 647 -446 -767 518 682 -538 -388 701 108 -857 72 999 -104 -836 265 620 -491 -436 744
1217G44l44j209N28J026o56o99Q27L88j050j06J051q5r02L48O01o03l67P58J51
$$ 744 400 -809 -281 745 89 -610 217 605 -445 -551 500 415 -487 -139 462 -141 -508 250 401
1236D01p14Q0N61l71l75N97K31p00k3O69k76o01N90N19q22l61R32Q4r96L37J011
$$ 401 -313 -233 328 -43 -418 179 410 -290 -313 356 80 -521 69 588 -234 -595 337 421 -575 -238 773
1257G73o91r43R37P37j110l62J252n5j338M07J320o77j118R37P85j185m48J390
$$ 773 82 -861 76 813 -297 -659 593 538 -800 -393 927 250 -868 69 854 -331 -779 611
1275F11J36j446J82J307n28j112R09Q46j193n61J299K08j274K07J125n73r41Q18
$$ 611 747 -699 -517 790 262 -850 59 905 -288 -849 450 658 -616 -409 716 143 -798 20
1293B0P01r77l80J036jr71L05Q73n71o50P59L55q86l0R37k84q31N62O34q47l13
$$ 20 721 -256 -636 400 399 -572 -267 606 35 -615 144 499 -387 -417 520 236 -595 -33 601 -246 -559
1314e59J032l2j062L62R60o93p39J000M70j221j52J314j98j271N80J135r60r32
$$ -559 473 441 -621 -259 701 8 -731 269 739 -482 -634 680 482 -789 -209 926 -34 -966
1332i66J263O29j433k74J504j50j485N98J345r55j107J211P56j389l27J421p5
$$ -966 297 926 -507 -781 723 573 -912 -314 1031 76 -1031 180 936 -453 -780 641 566
1349E66j364M35J203p47r38R46O17j080k48J091q6j022M16Q41o65n71Q61K20r01
$$ 566 -798 -363 840 93 -845 101 718 -362 -610 481 395 -627 -211 630 -35 -606 255 475 -426
1368d26J26Q55m69p01P55M35r07j28R92k31r78N73Q62q72o22J085L50j253NJ307
$$ -426 -300 555 86 -615 140 575 -332 -460 532 301 -677 -104 758 -114 -736 349 699 -554 -549 758
1388G58l78j264P40J084j033q35J277M80j434p4J447l11j357O66J147r73q34J164
$$ 758 380 -884 -144 940 -93 -928 349 829 -605 -679 768 457 -900 -234 913 -60 -894 270
1406B70M80j247j24J241k21j128N22R05p71o17R38L10j013M1R53l44q01O24N48
$$ 270 750 -497 -621 620 399 -729 -207 698 -73 -690 248 558 -455 -414 539 195 -606 18 566
1425E66q25k38R17o2r20L98P78o78n48Q62L09r95lJ015k87r38N69P88q33n58J007
$$ 566 -259 -497 420 358 -562 -164 614 -64 -612 250 559 -436 -439 576 289 -649 -80 708 -125 -683 324
1446C24K73j097K7J099l55r83O42P73q66n22J017K10j049R4R94m00q28O45O18
$$ 324 597 -500 -473 626 271 -712 -70 703 -163 -685 332 542 -507 -413 581 181 -647 -2 616
1465F16q21l76R29P8r28K04Q79n08p14P38N07r01k25R53m8r47L48Q51o11o51P95
$$ 616 -205 -581 348 426 -502 -298 581 73 -641 97 604 -297 -522 431 383 -564 -216 635 24 -627 168
1486A68M25r12j60R25j11q60L57P26n53n50O93L42p58r5P38j54o64L77N23n35
$$ 168 593 -319 -479 446 335 -525 -168 558 5 -545 148 490 -268 -363 375 221 -443 -66 457 -78
1506g8l39O21P7o23J73N73m15m40N56K68o43n2P02k01o89M26N85n84m18P08K33
$$ -78 -417 204 281 -342 -169 404 -11 -451 105 373 -270 -322 380 179 -510 -84 501 -83 -501 207 440
1527D40q37%Q86k19q43M41P21o48n37Q09L42q69j26Q64j22p72L21O85m91n42N78
$$ 440 -397 -397 489 270 -573 -132 589 -59 -596 213 555 -314 -440 424 302 -470 -149 536 45 -497 81
1548H1L45o04j54O12m3n68J94M66k94l03L59J11l99N2L80j78k90K84J14l55N8
$$ 81 426 -178 -332 280 237 -331 -137 329 35 -268 91 202 -197 -145 235 57 -233 51 165 -190 -132
1569a32M00j95l94L24K67m45q6N14l7n77J62N54k91m71M64L58o05k57O89J09o80
$$ -132 268 73 -321 3 270 -175 -261 253 216 -361 -199 355 64 -407 57 415 -190 -447 242 351 -329
1590c29Q7O38k88n69M40M85n11l32N19J71n57K7N62j37n06J97M01k87k61L82J12
$$ -329 -242 396 108 -461 -21 464 -47 -379 140 311 -246 -219 343 206 -300 -103 298 11 -250 132 244
1611B44l96m7L62o1k64J68J46k46q2K76pj98R3J25k22m9K70Kk71R5J97k18j42
$$ 244 -152 -199 163 102 -162 6 152 -94 -176 100 93 -105 -12 113 -109 -158 112 114 -157 -62 135 -83 -225
1634b25L26J08l58n1L46o4l30K21L48l44k93L57K03l78m3M33j12m38J70M21k14
$$ -225 101 209 -149 -200 146 82 -248 -27 321 -23 -316 41 244 -134 -177 256 144 -294 -124 297 83
1655H3l21L15J57l77q8M22L8l87M6K93j48k18K41J96k87j54K44M0j95Q0J75j56
$$ 83 -238 77 234 -143 -231 191 229 -158 -112 181 33 -185 56 252 -35 -189 55 95 -100 -20 155 -1
1677aj72J57R9j24K9R8j14j29J43Q8j15PR5j07j27J54J38j52p4J59j0k14J07K61
$$ -1 -173 -16 83 -41 -12 86 -28 -157 -14 74 -41 -34 61 -46 -173 -19 119 -33 -107 52 42 -172 -65 196
1701A96j38k40J74J38k20m5L25k5l39M5K74q6k05J97J52k80j40K99J08k47k0K21
$$ 196 58 -182 -8 130 -90 -135 190 165 -174 -129 145 59 -146 51 203 -77 -217 82 190 -57 -77 144
1723A44j12k37J75K41j85j71J67M5j77L5K17q0j99P3J05q5k6J39j6j53J5J06k7
$$ 144 32 -205 -30 211 26 -145 22 67 -110 -75 142 62 -137 -64 41 -44 -70 69 53 -100 -85 21 -6
1746fl0P6k8j26K6J25k4o0Q1J9j59jK05k2j60P6R7j63o5K36O9k27l2J74m0j71
$$ -6 -36 40 12 -114 -88 37 13 -47 34 53 -106 -107 98 76 -84 -8 89 -74 -139 97 166 -61 -93 81 41 -130
1772a30J58J81j80j96J72J35j85j4K10n5k54P5K32q4j57J16O0j90l4K36K0k10
$$ -130 28 209 29 -167 5 140 -45 -59 151 96 -158 -83 149 65 -92 24 84 -106 -140 96 116 -94
1794i4K5J13r4o7J49P7j42o6J14j1q3Q1R1j25o9R6J8p4N9J03j30j00J38O4j17
$$ -94 -69 44 -50 -117 32 109 -33 -99 15 4 -79 2 93 -32 -101 -5 13 -61 -2 101 -29 -129 9 73 -44
1819d4L0J20j06j40J26J34j11p3J39l3j71P9K20r6j89J15J02j52n3K53lk67J1
$$ -44 -14 106 0 -140 -14 120 9 -64 75 42 -129 -50 170 74 -115 0 102 -50 -103 150 147 -120 -109
1842a09K21o2j65J70J09k47j14K42P8j94OJ63r3j79J38J85j50j35J51L2j55L6
$$ -109 112 50 -115 55 164 -83 -197 45 123 -71 -65 98 5 -174 -36 149 -1 -136 15 47 -108 -72
1864g2J71m5j56M6J02q1m1J39Kj45K5J01n9k9J08Qj61K7J28o5n1J12M0j90k9K10
$$ -72 99 54 -102 -56 46 -35 -76 63 65 -80 -55 46 -13 -42 66 74 -87 -60 68 3 -48 64 104 -86 -115 95
1890I5Kj88Q0J43j69j46K52J32k67n6K19k8k41J40K36j86k12J87J48k07m6K18
$$ 95 97 -91 -11 132 -37 -183 69 201 -66 -122 97 69 -172 -32 204 18 -194 -7 141 -66 -112 106
1912A06j3k72O7K36p9j86J35J01j75o9K17K9k01M4J42j07r6J56M6j46LJ37p3j09
$$ 106 93 -179 -112 124 45 -141 -6 95 -80 -149 68 97 -104 -60 82 -25 -121 35 81 -65 -62 75 2 -107
1936a07J33Q5j44n3J33jj53J06J58j46j42J53R3j87J6J97q7k30J33K06j48j44
$$ -107 26 111 -33 -86 47 46 -107 -1 157 11 -131 22 115 -72 -56 141 54 -176 -43 163 15 -129
1958a29J96M5k36OK61m5k44Q4K03j70j22K21O7k40m2K38k8k06J21J58j79j29K22
$$ -129 67 112 -124 -118 143 98 -146 -62 141 -29 -151 70 137 -103 -145 93 65 -141 -20 138 -41 -170 52
1981E2M8k08J8K01q0j83J41J35j77o7J90kj87M7J78q3j41J47Q1j83k7K10l0j88
$$ 52 100 -108 -90 111 31 -152 -11 124 -53 -120 70 68 -119 -72 106 23 -118 29 110 -73 -100 110 80 -108
2005a08P6J44j43r3K18K9k19nJ92o4j42J34J09j98p8K15L5k02L8J80j22j69J80
$$ -108 -32 112 -31 -124 94 123 -96 -101 91 27 -115 19 128 -70 -148 67 102 -100 -62 118 -4 -173 7
2028GJ38k22q2K25Pk28R7K05j55j72J86J22k05n7K43k6k26P7K03j32j57J83J08
$$ 7 145 -77 -159 66 73 -155 -58 147 -8 -180 6 128 -77 -134 109 83 -143 -66 137 5 -152 31 139
2051A39k11l8K06l8j85J05J71j53j32J80O9j79J3J68q3j62J37J37j69o8J62j5
$$ 139 -72 -110 96 58 -127 -22 149 -4 -136 44 113 -66 -53 115 32 -130 7 144 -25 -93 69 54
2073E4j70Q1J65j22j40J45R9j75j6J90m7k20J09J83j56j39J95P4k25%K43o4k18
$$ 54 -116 -35 130 8 -132 13 112 -63 -79 111 64 -156 -47 136 -20 -159 36 110 -115 -115 128 64 -154
2096a54J33J59j57j19J97O3k40K6K16p0j84R2J75j49j12J82M4k08J7J96n3j73
$$ -154 -21 138 -19 -138 59 122 -118 -92 124 54 -130 -38 137 -12 -124 58 102 -106 -89 107 54 -119
2118a19J16J08j60m5K03j8j94O3J51j02r9J43M1j74lJ84m9j48Q3J20j38p6J89
$$ -119 -3 105 -55 -100 103 85 -109 -46 105 3 -96 47 88 -86 -89 95 46 -102 -19 101 -37 -113 76
2141G6K4j96KK07p4j59J29J17j87p8K16K0j97L4J81r9j36J37J04j75n3J89J3j85
$$ 76 100 -96 -94 113 39 -120 9 126 -61 -139 77 97 -100 -66 115 16 -120 17 121 -54 -107 82 95 -90
2165i0L4J60j01j15J40R7j74m8J81j4j67P8J31j32j04J74M0j48rJ44o6j22J06
$$ -90 -56 104 3 -112 28 125 -49 -97 84 70 -97 -19 112 -20 -124 50 90 -58 -67 77 11 -111 -5
2188eJ14j53p7J54L4j54K3J52p8j34J30J17j61o0J53Pj48N4J53j12j22J45N4j58
$$ -5 109 -44 -121 33 67 -87 -64 88 10 -124 6 123 -38 -98 55 62 -86 -32 121 9 -113 32 86 -72
2212g2jJ48m3j38P6J45j17j10J51M7j43jJ57o4j40R7J16j35p2J39K3j52L4J52
$$ -72 -73 75 32 -106 -30 115 -2 -112 39 86 -57 -58 99 35 -105 -8 108 -27 -99 40 63 -89 -55 97
2236I7q1j31J05J02j23m4J32nj42L9J45p3j23Q9P1j16j8J36j7j42M6J37p8q0R5
$$ 97 16 -115 -10 92 -31 -75 57 52 -90 -51 94 21 -102 -13 58 -58 -76 60 43 -99 -53 84 6 -74 21
2261B1K9j04JJ45n1j17O2Q4p0n9J13Pj24J3J35n4j04Q8N9j01k8J11J8j39J4J31
$$ 21 50 -54 -53 92 41 -76 -14 70 0 -59 54 61 -63 -50 85 31 -73 15 74 -27 -55 56 74 -65 -51 80
2287H0p4q6J06M3j43qJ55m2j19O7R2q8o1R5M2j17j9J23j3j07M9J02r6p5J35J9
$$ 80 6 -80 26 69 -74 -82 73 31 -88 -21 71 -17 -78 17 59 -58 -77 46 33 -74 -25 77 -19 -94 41 60
2313F0j23%J16m2p9N6Q2r7m7J11J7j06K3Q8l5q5O7P2j07k7J02lj01M1Q7p3o6J06
$$ 60 -63 -63 53 11 -68 -12 70 -27 -74 37 54 -52 -29 59 24 -61 6 78 -29 -56 46 43 -58 -17 70 -3 -69 37
2341C7L3j11mR0k2j00P7P2j05n8J18J6j02J7J01n2q0O0Q2r6o1J01K5r9RJ02m9
$$ 37 70 -41 -45 45 23 -77 0 72 -33 -91 27 43 -59 -42 59 7 -73 -13 69 -27 -88 13 38 -61 -52 50 1
2368Ar2Q1O9q4l2Q6Pr5L6P7m2p7O8L0n9%P6k0p0K8O9n0m0N1L0p6pR9l8q4O0N6
$$ 1 -91 -10 59 -25 -57 29 36 -59 -23 54 12 -65 3 33 -26 -26 50 30 -40 -12 57 7 -33 18 48 -28 -35 64 26 -58 2 58
2400E8o1l5Q1pr4L3R1n4p5N5M5p8j9Q4j2q5K0J02m6p4O2L4p5j2J02k2j07N7O7
$$ 58 -3 -38 43 36 -58 -25 66 12 -63 -8 37 -41 -60 24 12 -73 -53 49 3 -71 -9 25 -50 -62 40 18 -89 -32 35
2429C5n3m9Q8K1r0MR5l6n8K9N7n1l0O8L1r2oQ2l0n2M4M9o1m1P9K6j08L6N3k9n4
$$ 35 -18 -67 21 42 -48 -44 51 15 -43 -14 43 -8 -38 30 61 -31 -37 45 15 -37 7 56 -5 -46 33 59 -49 -13 40 11 -43
2460d3P0K6p8kO6Kq4L5N2n0m4O4K3p5j9P8j9p8O9M7p7m2J03J5r1J1P5n0n9O7N2
$$ -43 27 53 -25 -27 39 41 -43 -8 44 -6 -50 14 37 -38 -57 21 2 -76 -7 40 -37 -79 24 39 -52 -41 34 -16 -75 -8 44
2491D4p3m2R3J5q0J5Q7n2o3O9N8p8l6Q9Jq9K0R4m8p7O4M0p6j7R0j5q7M7N8n6m2
$$ 44 -29 -71 22 37 -43 -28 59 7 -56 13 71 -7 -43 46 47 -42 -22 72 24 -53 11 51 -25 -42 48 33 -54 -7 51 -5 -47
2522d7O6Lo1J2N8k4p9O8L5o2k6Q4j6p8M1Q8p5o5P9M1r0j5J14l9q7N8Q3o7p4P4
$$ -47 19 22 -39 -27 31 7 -72 -4 31 -31 -57 27 11 -67 -26 62 -13 -78 1 42 -48 -63 51 12 -75 -17 66 -1 -75 -1
2552aN0j04j3J07Rj10K9R6n8p1R0M3r4j1Q7rq5M2P8q5l9P3K3q5K5O2l9o1O4M0
$$ -1 49 -55 -68 39 48 -62 -33 63 5 -66 24 67 -27 -38 49 40 -45 -3 75 -10 -49 24 47 -38 -13 49 10 -51 13 53
2582E3p9j5P7kr5K0J03o5p7Q7L3r5nJ13l0j00N3P5o8m9R3J9j01j2J04j1r5O3P4
$$ 53 -26 -41 36 34 -61 -41 62 -3 -80 7 40 -55 -60 53 23 -77 -24 51 -17 -66 27 46 -55 -67 37 26 -69 -6 68
2611F8q4o1J03K7j00PR2m0q5Q5O8j07l1J08Jj21N2J06q3p6O6P0j07k0J10Jj12
$$ 68 -16 -77 26 53 -47 -40 52 12 -73 12 80 -27 -58 50 51 -70 -18 88 5 -71 -5 65 -42 -62 48 49 -63
2638f3K9J06o5q0Q7M7j07j7J09j6j09N0Q2p8n9J00K7j00J5O3j8p4P7O2r4k3Q8
$$ -63 -34 72 7 -73 14 61 -46 -63 46 30 -79 -29 53 -25 -84 16 43 -57 -42 21 3 -71 6 68 -26 -49 39
2665C9Nj00K9Q4n4q8J02N3j07j9J28k3j33N4J27r0o5Q3N0j22j1J37l6j21M9R2
$$ 39 44 -56 -27 57 3 -85 17 70 -37 -56 72 49 -84 -30 97 7 -58 25 75 -47 -58 79 43 -78 -29 63
2691F3p3p5J09N8j38j9J37k1j09N2R3p6q7J16K3r1j0J03n4q8Q3O2r2k9Q5J5j05
$$ 63 -10 -85 24 82 -56 -75 62 41 -68 -16 77 1 -86 30 53 -38 -48 55 1 -87 -4 58 -34 -63 22 37 -68
2718f8L7R0n2p9P3N0r5k0J16pj32P5Q0q4o1J12M3j34JJ34m9j11R1P7j01o4J11
$$ -68 -31 59 7 -72 1 51 -44 -64 52 45 -87 -12 68 -16 -77 35 78 -56 -55 79 30 -81 10 87 -14 -78 33
2745C3M0j19rJ17l4j06N8J04r5n6R6L6j18NJ25n1j09P8P8q7m0J00Lj14L6Q3m6
$$ 33 73 -46 -55 62 28 -78 -20 84 -11 -67 29 65 -53 -48 77 26 -83 -5 73 -14 -54 46 49 -65 -29 54 8
2772Ho1O7L2q4k1J15j5j06L1J12r2o0J04L4j14LJ00l9r5P0Q6r1n7J08K2j13K4
$$ 8 -53 14 46 -38 -59 56 41 -65 -34 78 -14 -74 30 64 -50 -47 53 14 -81 -11 75 -16 -73 35 57 -56 -32
2799c2J04n1q0N7O1p4n1J07K0j26NJ23m0r9P0P4j18j5J07J4j11J6R8o9o6Q6N1
$$ -32 72 21 -59 -2 59 -15 -66 41 61 -65 -60 63 23 -76 -6 68 -50 -65 42 56 -55 -39 59 -10 -76 10 61
2826F1j03l1J14jr4L6Q0p4n8P5N4r5qJ11m3q7N6P9q9n0R5J6j06K8R1m9p4O9N4
$$ 61 -42 -73 41 40 -54 -18 62 -12 -70 5 59 -36 -44 67 24 -63 -7 72 -17 -67 28 44 -62 -34 57 8 -66 3 57
2855E7q7k9J00lr5L1P9m2q0P8N9r9l1R1J2j10O0P8p7p2R7M4r6%Q3j8j01O7P7o6
$$ 57 -30 -59 41 38 -57 -26 53 11 -69 9 68 -31 -62 29 41 -69 -9 69 -8 -80 17 61 -35 -35 48 30 -71 -4 73 7
2885Gp5Q2K3q0mJ03k9q1L0Q1o6l7P6J3r6K2R7m4p1N0M8p3j9O6Mp5K7P3n6n6O2
$$ 7 -68 14 37 -43 -47 56 27 -54 -24 57 -9 -46 30 43 -53 -31 66 22 -49 1 49 -24 -43 23 27 -48 -21 52 -4 -60 2
2916BL4p0%Q2k4r3N1P4n4p4R1J6q9LJ07m3q0N0O1n5k7P3J6j01J4Q2k0n7L0N4o4
$$ 2 36 -34 -34 48 24 -69 -18 56 2 -72 19 35 -54 -51 56 13 -67 -17 44 -11 -38 35 51 -50 -36 46 26 -31 -1 53 -11
2947a1l5Q2K5j09MR1k8o1N0M9p9k1P4J1p1K0N3l9n2N2J5m8j2P7k4n1K0O6n7m7
$$ -11 -46 36 61 -48 -44 47 19 -42 8 57 -22 -43 31 42 -29 -9 44 5 -47 5 20 -28 -40 37 13 -38 -18 48 -9 -56
2977e6P9Pp1lQ4k4n7M4M2p8k2Q1J0p5NN6l7l2M9N3n6m5O7K0o1JO6l8p1O3N8p3
$$ -56 23 30 -41 -44 40 16 -41 3 45 -33 -55 26 36 -39 -34 22 -15 -47 2 55 -1 -46 21 41 -20 -19 47 9 -62 1 59 -14
3009a4l5P0Ko7L2N8m9m6N6L1p3RN8k9n1L8L7m0l6N1K2n9MO1l4n5M2M8m4l7N7R
$$ -14 -49 21 23 -44 -12 46 -3 -49 7 38 -35 -26 32 3 -48 -10 27 -13 -49 2 24 -35 -31 30 -4 -59 -17 31 -13 -50 7 16
3041A6n7J5O7n1l9L7L5n2jN6k6m6J4O6k3m7L8J8m1rP9j1q4M3O2m4m3N1J5p0J3
$$ 16 -41 -26 41 -10 -49 -12 23 -29 -30 26 0 -46 -32 34 11 -36 2 20 -21 -30 49 38 -46 -3 59 15 -28 23 38 -32 -19
3072a9Q2k7o7L0M2n7j4N2J7p7NN7k1n0K8M7o3j5O3No9RO0j3n6N3K5p2RO0rn1K6
$$ -19 63 36 -31 -1 41 -16 -30 22 39 -38 -33 24 3 -47 -19 28 -35 -50 13 18 -51 -42 18 5 -51 2 27 -45 -36 24 15 -36 -10
3105a0M1n5lM6jm9LN8l1k7K6L7m5k5P4Kp4J5O1m2k5M8K2o7j3O4On1KM8k7m4N2
$$ -10 31 -24 -27 19 18 -31 -28 30 -1 -28 -2 35 -10 -35 39 41 -33 -18 43 1 -24 24 46 -21 -34 30 36 -15 -13 35 8 -36 16
3138A6K6n0k4L8J4o5K7N8m5n4N6L7m9j6N3l2m2M6M1o6j6N6J0m4RL9l1l3L0M6m5
$$ 16 42 -8 -32 6 20 -45 -18 40 -5 -59 -3 34 -15 -31 22 -10 -52 -6 35 -31 -47 9 19 -25 -16 23 -8 -41 -11 35 -10
3169a0l3N6%n0L3N3m1l6M5L7p1kO5l3n7N1N2n8l1L9K6m8j4O3j7p1L6N4m4l5M7
$$ -10 -43 13 13 -37 -4 49 8 -28 17 54 -17 -19 46 13 -44 7 59 1 -30 9 35 -13 -27 36 19 -52 -16 38 -6 -41 6
3200FK6o4J5N5j4p6L3O3n5m1N9jm9K0M7k6m4K3L7l9j6M9Nn0RO1l6k7L3K8o0kP8
$$ 6 32 -32 -17 38 24 -52 -19 44 -11 -52 7 6 -43 -23 24 -2 -46 -23 14 -25 -41 8 13 -37 -28 33 -3 -30 3 31 -29 -31 47
3233D7j3p5M5M6n4j6O1np0K4O3l5n0L2L6l8k7N2J4o7kP0k2o1M4M1o3k4P0J8p4
$$ 47 34 -41 4 50 -4 -20 41 36 -34 -10 53 18 -32 0 36 -2 -29 23 37 -30 -32 38 16 -45 -1 40 -23 -47 23 41 -33
3264c3jP3l3n1N5K5o5oN0Rn7K1M1k7l5M7K6o9j1N9Lo8M6M7n6m2P8J7p0PN7k4n1
$$ -33 -34 39 6 -45 10 35 -30 -36 14 23 -34 -13 28 1 -34 13 39 -30 -41 18 21 -47 -1 46 -10 -52 26 43 -27 -20 37 13 -38
3297c8N1M2o0k9O1jm5K0N5l9n8M9M2o6k8O8Kp1K4P3o5m0N8M3q3kO7k3o2M3N3n6
$$ -38 13 55 -5 -34 27 26 -19 1 56 17 -41 8 50 -16 -44 24 26 -45 -21 52 -13 -53 5 48 -35 -37 30 7 -55 -12 41 -15
3329a5l5N2K4n5j0O8j1q5N8P1o1n9Q2Nq4K9Q0l3p9N1N5o7rN4mo1K8N3l2m4M1M0
$$ -15 -50 2 26 -29 -39 29 18 -67 -9 62 1 -58 24 29 -55 -26 54 21 -58 -7 48 -19 -28 26 22 -39 -11 42 10 -34 7 47
3361D7n7j3O1no8K2O2m6m0O8J9r3RQ8j9q9N3N5p6k3P1ln9qP5j8o7M2M8n9m3Q2
$$ 47 -10 -23 38 33 -35 -13 49 3 -37 31 50 -43 -34 54 35 -54 -1 54 -22 -45 26 23 -36 -44 31 13 -54 -12 36 -23 -66 16
3393A6J8p1%P7j7p8N9M2o8l0Q7Op9J8O9n3n1O7K2o7j8R2j4p2L8M7n6k2N8K8p4
$$ 16 34 -37 -37 40 23 -55 4 46 -22 -52 35 41 -38 -20 49 -4 -55 12 34 -33 -51 41 27 -45 -7 40 -16 -38 20 48 -26
3424b6j2Q5j8q3N3O1p6m1R3J1o8OP2n1m9N1N1o4l7O3J4o7ON8k5o3N8M8o6l1P6
$$ -26 -38 47 29 -54 -1 60 -16 -57 36 47 -21 -15 57 6 -43 8 59 -5 -42 21 35 -32 -26 32 7 -56 2 50 -16 -47 29
3455B9J2r2K5O6m1o0Q0K1p0jP9k0p4L1N6l1o6O1K8n9j1P7j3p8L7N8m1m9P1J2q1
$$ 29 41 -51 -26 40 -1 -61 19 40 -30 -31 48 28 -46 -15 41 10 -56 5 33 -26 -37 40 27 -51 -14 44 3 -46 25 37 -44
3486d4OQ3m1n1M7L7m9k2Q1oo8RO5m0l7L0M6o0k6P7j0o9K5P5n5o4P6M1q5j4P6r
$$ -44 -38 45 4 -47 0 37 -12 -34 47 41 -27 -18 47 7 -30 0 46 -14 -40 37 27 -42 -17 58 3 -61 15 56 -29 -43 33 24
3518B4p2L2M9o0j8O4K0p6J2O0mp1K5O4n5n5P7J6o5oP6k9n1M6N2p6j8P5Pq1J7N7
$$ 24 -48 -16 33 -27 -45 19 39 -37 -25 35 31 -40 -15 49 -6 -61 16 32 -33 -39 37 8 -43 3 55 -21 -39 36 43 -38 -21 36
3550C6j9o3N6K8n5k5P2J1p3J9O3m4n1O5K6o9k2P6pp0L9P0q2k0O2No3J0N8k3o1
$$ 36 17 -46 10 38 -17 -42 30 41 -32 -13 50 6 -45 20 46 -23 -45 31 24 -46 -7 63 -19 -39 23 28 -35 -25 33 10 -51
3581e1M8M1n2l3O0J7o7%O6k0o3N1N5o6l0P6j1o8K8P4n4l8N0K2m7j8N4om5J0N3
$$ -51 -3 38 -14 -47 13 30 -37 -37 29 9 -54 -3 52 -14 -44 32 21 -47 -19 55 1 -37 13 35 -12 -30 24 18 -27 -17 36
3612C6l1m9N1L3n4k0O1Po5K5M0k9m1N8Pn3J1M8j6m3K5L8m3k4N5J8o6ON3j8n2L1
$$ 36 5 -44 7 40 -14 -34 27 34 -31 -6 34 5 -36 22 29 -24 -13 35 19 -24 1 39 -4 -28 27 45 -21 -15 38 20 -32 -1
3644aL7n9j6N7Mo3J1P1m5m0M9M2o2j3N0Lo0J1N5k7k9K7M9o0j2M9J1n7J1N1m9k4
$$ -1 36 -23 -39 18 22 -41 -30 41 -4 -44 5 47 -15 -28 22 25 -35 -24 31 4 -25 2 51 -9 -21 28 39 -18 -7 44 -5 -29
3676b9M9K1n6j7O9k9m7L5L5m5j8M8ll7J9M2l0k9K8L0m1j9M3J5p0J5N2l0m6N2J8
$$ -29 20 41 -15 -32 37 8 -39 -4 31 -14 -32 16 13 -24 -5 37 7 -22 6 36 -5 -24 19 34 -36 -21 31 1 -45 7 25
3707B5n1j0N9kp6L6M8m5k6N6Lm4rO3k1m4K0M9l2l4M4K0m4j6N9om1K4K8m6oM5p
$$ 25 -26 -36 23 21 -55 -19 29 -16 -42 14 17 -27 -36 27 6 -38 -18 31 -1 -35 9 29 -15 -31 28 22 -19 5 33 -13 -19 26 19
3740A9m7J8M9l6j6K3K6l6k9M9j1m6J8M3k3l8M9K5n4pN2j5m8K1N2l8l6N1J4o1K6
$$ 19 -28 -10 39 3 -13 10 36 0 -29 20 9 -37 -19 24 1 -37 12 37 -17 -24 28 13 -35 -14 38 0 -36 15 29 -32 -6
3771fM0l0m5K6L9l6k2M4Pm7OM6ko0L1M3m1k7N4J2o6K4N4l8l3L5L6m6j4N5k1l8
$$ -6 34 4 -41 -15 24 -12 -34 10 17 -30 -24 22 20 -40 -9 34 -7 -34 20 32 -34 -10 44 6 -27 8 44 -2 -16 39 18 -20
3803b0K6J9j9k5K6K5m0j6M3jm7J4M0l6k4N5jn1J2N0l2m2M0K8n0nL2J4n0K1L8k3
$$ -20 6 25 6 -19 7 32 -8 -24 19 18 -29 -15 25 -11 -35 20 19 -32 -20 30 -2 -44 -4 24 -26 -31 1 15 -35 -14 24 1
3835Ak7L3J8m7k4O3Mn8K0N5k7m2M1J7m7jN2k0l6K7K9m7oM4lk6j1M3om3J4N2m0
$$ 1 -26 7 25 -22 -46 17 21 -37 -17 38 11 -31 10 27 -20 -21 31 11 -25 2 31 -16 -22 22 19 -7 -18 25 19 -24 -10 42 2
3868Bk8M7J1n4jO3k0m1J9K8n6lN3pn3K6L8m0k7M9J1n2JM3Mo7L6M8l6k8M4K1n8
$$ 2 -26 21 32 -22 -23 40 20 -21 -2 26 -30 -33 20 13 -40 -14 24 -16 -43 6 17 -35 -34 9 13 -54 -18 30 -6 -34 10 31 -27
3901b7jO1j7o6M9L5m5j6M3ok9KM0j1n0L7M2l9j7L8Mm5lN8l5m5L3N2n8j4P0k1n6
$$ -27 -28 33 16 -50 -1 34 -11 -27 16 10 -19 -17 23 12 -38 -1 41 2 -15 23 27 -18 -21 37 2 -43 -10 42 -16 -30 40 19 -37
3934c7K7N2m1k4L7jk7JK7qm1J2L3j3l8L8K2m6rO1k0n6M8L9m8k3O2Mo9J8N7j9n0
$$ -37 -10 42 1 -23 14 13 -14 -13 14 6 -35 -23 10 -3 -41 -3 19 -27 -36 25 5 -51 -3 36 -12 -35 27 31 -38 -20 37 18 -32
3967c2L5L1m6j6M8J2m6OM8k2m9L6K7m5j2M8Rn7J5N1l3l8L4K3m7kN4j9m4K0M0l5
$$ -32 3 34 -12 -28 20 32 -14 -8 40 18 -31 5 32 -13 -25 23 32 -25 -10 41 8 -30 4 27 -20 -22 32 13 -31 -11 29 -6
3999fj9K2L8n3j6O0ko3L1L4m8j1L7J9n6J1N6k7m5M6L2o5pO0j9n3L4L8l3l3M9J8
$$ -6 -25 -3 35 -18 -34 26 24 -39 -8 26 -22 -33 4 23 -33 -22 34 7 -38 8 40 -25 -32 28 9 -44 -10 28 -5 -38 11 29
4031B9l7j3N7jo7OQ1m4n7N3M6p0k5Q7k4m8J6N9m4l4L6L0n8MM2j7m1J6N3l7k9L4
$$ 29 -8 -21 36 35 -32 -26 55 11 -46 7 53 -17 -42 45 21 -27 -11 48 4 -30 6 36 -22 -18 24 7 -34 -18 35 -2 -31 3
4063CK8o0KN3j7m7N2K8o4j5P0j7m8J1N6l4l3K5J7k4l1O6ko1J3O6m1l8L9N1o4j8
$$ 3 31 -29 -27 26 9 -38 14 42 -22 -37 33 16 -32 -21 35 1 -32 -7 10 -14 -45 21 19 -42 -29 37 -4 -42 -3 48 -16 -34
4095c4N5Np0L6M4l6k4L5J2m6OM4j5m8J8L8k8l0N3mm0jN1j0m8K7M1m6l9O7Qn5J0
$$ -34 21 26 -44 -8 36 0 -24 11 23 -23 -17 27 12 -36 -18 20 -8 -38 15 11 -29 -30 21 11 -37 -10 31 -15 -54 13 21 -34 -24
4128b4M8k3l8L7L3n9pN1kl8OM0k9l3M0K3m8k0N8Rm9J6L6k3m1N3K0o5OM3j5l5L0
$$ -24 24 1 -37 0 33 -26 -33 18 16 -22 -16 24 -5 -38 2 25 -23 -43 15 24 -25 -9 27 4 -37 16 36 -29 -23 20 5 -30 0
4161@K9m6pM3J3m8oN3rn8L4L3m0k5N1J7n9kO2k4o4N2L3n7mL9J7n4J5M1l0l3K7
$$ 0 29 -17 -24 19 32 -16 -22 31 22 -36 -2 31 -9 -34 17 34 -25 -27 35 11 -53 -1 32 -25 -29 10 27 -27 -12 29 -1 -34 -7
4194gL3l3rL7Ko0K6L8k7k8M1J8m9j4N3k2m7M1L0m1pM1Om6OM7k0l6J5L4l7j8N0
$$ -7 26 -7 -16 21 23 -37 -11 27 0 -28 13 31 -18 -32 21 -1 -48 -7 23 -18 -25 16 22 -24 -18 29 9 -27 -12 22 -15 -33 17
4227A7J2m6lO0k2n4L1M5m1k7M2J0o3K6L9j8l3K2M1n3j9O1k4l4J0M4k3m4M0K8m5
$$ 17 29 -17 -20 40 18 -36 -5 40 -1 -28 14 24 -39 -13 26 8 -25 -3 38 -15 -34 27 3 -31 -21 23 0 -44 -4 24 -21
4258b1JM4nm8K1M6n0k2L8J5m2OM4j8l0L4Ll1oL7Om4lL5Nm2J5M3m9j2M6Pm2kO0
$$ -21 -20 24 19 -29 -8 38 -12 -34 4 19 -23 -17 27 9 -21 13 16 -15 -21 16 22 -22 -25 10 15 -27 -12 31 -18 -30 16 23 -19 -21 39
4293C9j8n2M4K2n1kM2j0l7J9L6k7j9J6K2l8kK1J3m9K3M1m4k7M2J4m5J6K6j4l5
$$ 39 21 -31 13 35 -16 -18 24 14 -23 -4 32 5 -14 2 24 -14 -16 5 18 -31 -8 33 -11 -38 4 18 -27 -11 15 1 -34
4324c4L8J8m2qK9J2m1J6K1mm8N3K1l7qL8lm1PL8k4l2L7Rl6PM1rn8M0K7l5%K5J2
$$ -34 4 22 -20 -28 1 13 -28 -12 9 5 -43 10 31 -6 -14 24 21 -20 -13 25 1 -31 6 15 -21 -14 27 18 -40 0 27 -8 -8 17 29
4359B9l9lM3k1l8K7L1l2j7L0J2k7k0M2nl2J7K2l7j8M9Pm8%L8k1j0RK5k8oL9j4
$$ 29 -10 -13 30 9 -29 -2 29 -3 -20 10 22 -5 -25 17 12 -20 -3 19 -18 -36 13 20 -28 -28 10 -11 -21 -12 13 -15 -21 18 4
4392Dk1PJ9j2k2L3J7l0k3O2j3m6J2N0l8k5M6Om9J0M3j9k6K1K0j3j7J9Kk8jL5j0
$$ 4 -17 -10 9 -3 -25 8 25 -5 -28 34 21 -25 -13 37 -1 -26 20 26 -23 -13 30 11 -15 6 26 13 -4 15 17 -11 -12 23 13
4425A3m1K5L1l4k7M1%k3jM6k9k2K2J6l1lK2Nk3oK8j0k3K6Qk2k1N0Nl9LL8k1k9
$$ 13 -28 -3 28 -6 -33 8 8 -15 -16 30 1 -21 1 17 -14 -17 5 10 -13 -19 9 -1 -24 2 10 -12 -33 17 22 -17 -14 24 3 -26
4459b6M4J6m7K2J8k6k3K2J9k7POK1l2PK6k7j4QL5l5j7M4nl8NL3j8k7K9J3l4jL0
$$ -26 18 34 -13 9 27 1 -22 0 19 -8 -1 5 26 -6 1 27 0 -14 -6 29 -6 -23 21 16 -22 -17 16 -2 -29 0 13 -21 -22 8
4493Hkk5QK3j1k7L7J0l4j6K3J4m4J0L7l1j8L9J6l9nM2j7l1K9J7k9JJ4J1l8J3K6
$$ 8 6 -19 -11 12 1 -26 11 21 -13 -29 -6 8 -36 -26 11 -20 -38 1 17 -22 -27 15 -2 -33 -4 13 -16 -15 -1 10 -28 -15 11
4526A1j4j7J3J8j9mK2Kj9pL4j7k3M2Ol5j2M0j9k6J9K6l1j5J3K0k9KJ8Jj3KL6k2
$$ 11 -3 -20 -7 11 -8 -12 10 12 -7 -14 20 3 -20 22 28 -7 -19 21 2 -24 -5 21 -10 -25 -12 8 -21 -19 -1 0 -13 -11 25 3
4560Cj9J3J2l0KL4j0m4K7K8l0j4L2Ql3RK3mj2J6Jj8nJ0J4k9JK2rj4K8J1k6j3L7
$$ 3 -16 -3 9 -21 -19 15 5 -39 -12 16 -14 -28 4 12 -21 -12 11 7 -5 11 12 -6 -11 -1 13 -16 -15 7 -2 -16 12 23 -3 -16 21
4595B1qk8K5J6j8k1J8J0k4NL0k3j5J5Oj7j0RJ9l2QK5pk9J8Klj8L7ml3MK9k1j0
$$ 21 13 -15 10 26 8 -13 5 15 -9 -4 26 3 -12 3 9 -8 -18 -9 10 -22 -14 11 4 -25 -7 -5 -8 -26 11 7 -26 -22 7 -14 -24
4630b4K0J7l2qK6Mj5NK9j4k5mJ9j5OJ8Ll0RL0k0j9L7Ml8NM4k3k0J7J4k9rL0oj2
$$ -24 -4 13 -19 -27 -1 3 -12 -7 22 8 -17 -21 -2 -17 -11 7 10 -20 -11 19 -1 -20 17 21 -17 -12 32 9 -11 6 20 -9 -18 12 6 -6
4666fj2K7j3k3K0L1l5lJ8Ql3NL6j8k9K3J3l7KL6Ml7LL5l2j6K4J8j8j5L6nk3PK7
$$ -6 -18 9 -4 -27 -7 24 -11 -14 4 12 -21 -16 20 2 -27 -4 9 -28 -26 10 14 -23 -20 15 -17 -33 -9 9 -9 -24 12 7 -16 -9 18
4701A8j3l0J3J3j4nL4nk8J6J4k7NK5%l7J4J6ll2K0J1j4pJ9oj0OK8j3k7K3J7l5
$$ 18 5 -25 -12 1 -13 -18 16 11 -17 -1 13 -14 -9 16 16 -21 -7 9 6 -26 -6 5 -9 -16 3 -3 -13 -7 21 8 -19 4 21 -14
4735a4mL9j0k7J4J6k3k7L9Ql3J1J1loNRoj5K2oj1nK2Qk5KK2k3jJ4Mj5JK3j5k2
$$ -14 -18 21 11 -16 -2 14 -9 -36 3 11 -22 -11 0 -3 -9 -4 5 -1 -16 6 0 -11 -16 6 14 -11 -9 13 -10 -11 3 7 -8 -7 16 1 -21
4772b1L5Jj5j5K3Pk0KJ9rk0J4Nk1KL1j5j8RK5j8k1L1Kk9J0K2ml0J9J6j7k5M5j2
$$ -21 14 15 0 -15 8 15 -5 -3 16 7 -13 1 6 -15 -13 18 3 -15 -6 19 1 -20 11 13 -16 -6 16 12 -18 1 17 0 -25 20 8
4807Hj6j1J5Rl1KK7j0j7K8lk8NM1j5k7J3K9j8k0K4Pk3J0J2mj0NKp%J5Ql2J4J4
$$ 8 -8 -19 -4 5 -26 -24 3 -7 -24 4 1 -27 -22 19 4 -23 -10 19 1 -19 5 12 -11 -1 11 7 -3 2 4 -3 -3 12 20 -12 2 16
4843A6j8nNJ6k4rL1qk0J1K7l2oK6Jl1J4J9j4qPJ0j2j5K4Rj2j4K8kl3J6J9k1j7
$$ 16 -2 -7 -2 14 -10 -19 12 4 -16 -5 22 -10 -16 10 11 -20 -6 13 -1 -9 -2 8 -4 -19 5 14 2 -12 16 14 -19 -3 16 -5 -22
4878b2M8j3j9%J7j4j3J3J6l3J2J6Pk3PJ0KqNjj0pK8j1l1L1K6l6j7K2J0k5OJ2K
$$ -22 26 13 -6 -6 11 -3 -16 -3 13 -20 -8 8 15 -8 -1 9 11 3 8 7 -3 -10 18 7 -24 7 33 -3 -20 2 12 -13 -7 5 7
4913Gk8L1JqpJ2Lj0j7J7j3mMK2k6j3K3J8k3NK7k6j4K5J9j9j8J5Ml2K5K%j1PJ8
$$ 7 -21 10 11 3 -4 8 11 1 -16 1 -12 -16 -12 10 -16 -29 -6 12 -11 -6 21 -5 -19 6 25 6 -12 3 7 -25 0 2 2 -9 -2 16
4949A6j2j7J5Jj5PK4j6j0J7%j1j0L2j5k3J9J5rj4J8Pj7nJ3kj8J2Rj1j4K2Jj1j
$$ 16 4 -13 2 3 -12 -5 19 3 -7 10 10 -1 -11 21 6 -17 2 17 8 -6 12 19 2 -3 10 8 -10 2 11 0 -14 8 9 -2 -3
4984cRj2j2K0Kk0PK2k1j7J6K1j9k%J2j5lRRj7MK2k7mNJ8j5pK5oj5KK3j3j0K2l
$$ -3 6 -6 -18 2 4 -16 -9 13 -8 -25 -9 12 -7 -9 -9 3 -12 -15 -6 3 -14 -10 12 -15 -19 -14 4 -11 -18 7 1 -14 -12 11 -2 -12 10 7
5022Gj4jOPpKJ0j3lJ3Rk0jK1j1j3K3Jk0lK4pl1MJ3j3kK5Kl2K3Mlj8K5Pk2LJ4k
$$ 7 -7 -8 -2 5 -2 0 10 -3 -6 7 16 -4 -5 16 5 -8 15 16 -4 -7 17 10 -21 -17 -4 -17 -19 6 8 -24 -1 3 0 -18 7 14 -8 -5 9 7
5062Gk3QJ8pj4LK4k1j7L7mppJ2Pk6J4J5k9J4JoqRJ6j1k2J1J3ooJ6J2k2KJ9j2j5
$$ 7 -16 -8 10 3 -11 -8 16 -5 -22 15 11 4 -3 9 16 -10 4 19 -10 4 5 -1 -9 0 16 5 -17 -6 7 1 -5 11 23 1 3 22 10 -5
5100eJ6onj3K2j5pKJ2j0mJ2JjjJ4j5KjqmR%Pj4kK1loQpnJ1O%qJ7j0Lj4J4Pk1Q
$$ -5 11 5 0 -13 9 -6 -13 -11 1 -9 -13 -1 0 -1 -2 12 -3 -1 -2 -10 -14 -5 -5 2 -12 -14 7 4 -2 6 -1 -6 5 11 11 3 20 10 13 -1 13 20 -1 7
5144GNMk6J0J8k2qJ7J3k6QK0qk1J9Pj2MJqj6J1PJqRmlj8K2Kj3mPKk1L2j4knJ3
$$ 7 12 16 -10 0 18 -4 -12 5 18 -8 0 20 12 -9 10 17 5 9 10 2 -14 -3 4 5 -3 6 2 -1 -19 3 5 -8 -12 -5 -3 -24 8 -6 -8 -13 0
5185@jj6J1Rjj2PjjMOn%j0K1poJ2K0k8oRnj4J1J4k2MJ1J0j4kJ6mnMMj9J%KoPP
$$ 0 -1 -17 -6 3 2 -10 -3 -4 -5 -1 5 0 0 -10 11 4 -2 10 30 2 -4 5 0 -14 -3 11 -11 -7 4 14 0 -2 14 10 5 9 13 -6 -5 -5 -3 -9 -2 5
5229EnqJ9okj4ROj6J1Pj3rK1npnK5k3OlLkjM%ONNqj3J6J1j5oJ2Jk0J5J2j2pJ6
$$ 5 0 -8 11 5 3 -11 -2 4 -12 -1 6 -7 -16 5 0 -7 -12 13 -10 -4 -7 -4 -6 -7 -3 -3 3 8 13 5 -8 8 19 4 -2 10 11 -9 6 18 6 -1 15
5272A5Rj6jLqNmJ7qj5MOljKknMmJ4j4lLj4J7JopPJ0k8J3QmojJ1Nj2N%Qj8K2Jk2
$$ 15 24 8 7 10 2 7 3 20 12 -3 1 7 4 3 5 3 -2 2 -2 12 -2 -5 -2 -16 1 2 -4 -11 -4 6 -22 -9 -1 -5 -11 -12 -1 4 -8 -3 -3 5 -13 9 10 -12
5318a2J3J5lj1j1J7okJ3okQRj9NNJ1l0K2%%j3jJ7j5rNNmj2Q%nNNj8RkLkjJ7j9
$$ -12 1 16 13 2 -9 8 2 0 13 7 5 13 22 3 8 13 24 -6 16 16 16 3 2 19 4 -5 0 5 1 -11 -3 -3 -8 -3 2 -16 -7 -9 -6 -8 -9 8 -11
5361a1kMJ0poJ9Jj4JJ1prPK2k2mJ3Mj8NJ0%k1J9J8j9j%J1qmJ0rj0K3nj5lJ8qj4
$$ -11 -13 -9 1 -6 -12 7 8 -6 -5 6 -1 -10 -3 19 -3 -7 6 10 -8 -3 7 7 -14 5 23 4 3 3 14 6 2 12 3 -7 16 11 -4 -7 11 3 -11
5402a1K0kKk7K6qj1nK5kqjJnJOnoNNqj2K1KonK4pmj2QPj2NJ7j6MJkj6J0QlrLQ
$$ -11 9 7 9 -18 8 0 -11 -16 9 7 -1 -2 -1 -6 -5 1 -4 -10 -5 0 -8 -20 1 3 -3 -8 16 9 5 -7 1 8 -4 1 18 2 6 7 5 -11 -1 7 4 -5 -2 6
5448FkpJ2Mj5NJ3j3lJ1Rj1rJ0j1oJ7pQj7KJ0jmRplJ2j5RrQLj4JpOoJ4j0MkK0r
$$ 6 4 -3 9 13 -2 3 16 3 0 11 20 9 0 10 -1 -7 10 3 11 -6 -4 6 5 1 10 3 0 12 -3 6 -3 5 8 -6 -5 -12 -6 -12 2 -8 -4 -6 14 5
5492ErQNj3MOJPj1Qj8KJ3KrnJ6j1nOP%mPJj9kR%lQoJmRNk1J9l%j1NPrK%%rJ1N
$$ 5 -4 4 9 -4 0 6 7 14 3 11 -7 -5 8 10 1 -4 12 1 -4 2 9 9 5 12 13 -6 -8 1 1 -2 6 0 1 -3 6 11 -10 9 6 6 -5 0 7 -2 0 0 0 -9 2 7
5542Gj5RnRrkQnjjJ5k2LJ1LjoJJ2j0mJ8j5oJ3MKjpjmOJ3j5mJ7nq%J2j7Ok0RQp
$$ 7 -8 1 -4 5 -4 -6 2 -3 -4 -5 10 -12 -9 2 5 4 -2 -1 11 1 -3 15 0 -6 7 11 13 12 5 4 0 6 19 4 0 17 12 4 4 16 -1 5 -15 -6 2 -5
5588eJ1rkLPJ0j7J4j1pRjrLPnkLpkj1JK1j5qMJ1KMLjrMJ0j0KKQj3JNlJKNJjLM
$$ -5 6 -3 -5 -2 5 15 -2 12 1 -6 3 2 -7 -4 3 -2 -4 -1 -8 -10 -21 -20 1 -14 -22 -18 -7 -5 -1 2 1 -8 -4 6 -4 -2 0 8 -5 -4 1 -2 -1 1 6 7 6 9 13
5637A3mKNkk1J7LqJJjj9MJ1Lj5J%MNmPJqJ2j3nQPJn%j2J1NOpj4JJ2lj7J5kKrM
$$ 13 9 11 16 14 -7 10 13 5 6 7 6 -13 -9 2 5 -10 -9 -9 -5 0 -4 3 4 -4 8 -5 -10 -2 5 6 1 1 -11 0 5 11 4 -10 -9 3 0 -17 -2 -4 -2 -11 -7
5684g%mPMlQooJ1KP%j5J1mj1PMRj3LmLmlJ1j1%J8j3JnJ9oj5mJJ5p%kmJRnjmJ0
$$ -7 -7 -11 -4 0 -3 5 -1 -7 4 6 13 13 -2 9 5 -6 1 5 14 1 4 0 3 -1 -4 7 -4 -4 14 1 2 -3 16 10 -5 -9 -8 7 0 0 -2 -6 -5 4 -1 -2 -6 4
5732Dj2JRjj5J4Pr%J3j7Rj7K2k8J6KlJ0lpNjKK8k6MjlNqQKKOoqMj4J9mnoJpJ6
$$ 4 -8 -7 2 1 -14 0 7 -2 -2 11 -6 3 -14 8 -20 -4 -2 -5 5 2 -5 0 -1 1 29 3 7 6 3 8 0 8 10 12 18 12 4 8 -6 13 9 4 -2 -1 -8 8
5778HlqrJ5j3RqMJnJ2NoLj6J1okJ3JMj6J2rmLJjkLK%lJ9mk0J2Mj0OJ1j9kJ5Nj5
$$ 8 5 -3 -12 3 -10 -1 -9 -5 -4 -9 3 8 2 5 -11 0 -6 -8 5 6 10 -6 6 -3 -7 -4 -3 -4 -6 -3 -1 -1 -4 15 11 -9 3 7 -3 3 14 -5 -7 8 13 -2
5824bK2rqJ%J0pKPqNjqNj2QM%j6Qoj0J4J2kpLj1JJ4jmoJ1mQj6MpQj3J2%rQP%j7
$$ -2 20 11 3 4 4 14 7 9 16 8 13 12 4 9 -3 5 9 9 -7 1 -5 -15 -1 11 9 2 5 -6 -5 9 8 4 -2 9 5 13 -3 1 -6 2 -11 1 1 -8 0 7 7 -10
5872a0K4oj1KORj0mLpJ7j2%J1qjlRkJ0k4J9nLqlOpkJ2jj9JnJJ4j2RJpjOKlKNk
$$ -10 14 8 -3 -1 5 14 4 0 3 -4 13 1 1 12 4 3 0 9 7 17 -7 12 7 10 2 -1 5 -2 -4 8 7 -12 -11 -16 -15 -1 -13 -4 -3 -10 -11 -5 -3 -6 -4 1 -1
5919ajJj6oK0qJ3PpPj5KK2k7J2%lRnM%j3PNJrNKmJ2Lj3LRj2NJnkLj2K2j9jPPj0
$$ -1 -2 -1 -17 -23 -3 -11 2 9 2 9 -6 -4 18 -9 3 3 0 9 4 8 8 -5 2 7 8 -1 4 6 2 14 17 4 7 16 4 9 10 5 3 6 -6 16 -3 -4 3 10 0
5966@jJ2j5J2olJ1Mj1lQk6L2j5j4J1NKk1J8jMnjK%OJ%kNkjrOLn%J4k0J2kMmNj1
$$ 0 -1 11 -4 8 2 -1 10 14 3 0 8 -18 14 -1 -15 -4 1 3 -18 0 -1 3 -2 -3 -1 -1 5 6 6 4 9 7 6 -3 3 6 1 1 15 -5 7 5 9 5 10 -1
6012aRrQj1jNOnKj4J4pLJMpjJJNmLJj3QJ2k4J5Jlj1J2Rj7jjJJ4j0%RmJLLK%Kj0
$$ -1 8 -1 7 -4 -5 0 6 1 3 -11 3 -4 -1 0 4 -3 -4 -3 -2 3 -1 2 3 -10 -2 10 -14 1 2 -1 -12 0 9 -8 -9 -10 -9 5 -5 -5 4 0 1 4 7 9 9 11 1
6061ARnmj0J0J1j1PnOllRj5Rj1RkNj1nJ0joJ3j2%kNoJ2jrLj6J6Ojo%LkLnmOrJ2
$$ 1 10 5 1 -9 1 12 1 8 3 9 6 3 12 -3 6 -5 4 2 7 -4 -9 1 0 -6 7 -5 -5 -7 -2 -8 4 3 -6 -3 -19 -3 3 2 -4 -4 -1 -3 0 -5 -9 -3 -12 0
6109@j2lPOklJ5j6K4j3qJ1koNJ0nKlkPPqJ0j4KJ6k1KKrPNrJPkj0MpNPj5J3qJ0
$$ 0 -12 -15 -8 -2 -4 -7 8 -8 16 3 -5 6 4 -2 3 13 8 10 7 5 12 19 11 21 7 9 25 4 6 8 -1 6 11 2 3 10 8 -2 2 -5 0 7 -8 5 -3 7
6155Gj2RKj0Rj0OooJ0Nj0J2kj4J5nJmLKNjKlj8K0moKJ4j1QkpJ2j2LkmOOj6J5j3
$$ 7 -5 4 6 -4 5 -5 1 -5 -11 -1 4 -6 6 4 -10 5 0 1 -3 0 2 7 6 8 5 -13 7 3 -3 -1 13 2 10 8 1 13 1 4 2 -2 4 10 -6 9 -4
6200dJ4Jlkj0J5j9J6rnONr%J2pNj5KkjjPoLJ%Nj0J2Oj0J4j2R%j0RLj1LjnJ5j2
$$ -4 10 11 8 6 -4 11 -8 8 -1 -6 0 5 -4 -4 8 1 6 -9 -7 -9 -10 -11 -4 -10 -7 -6 -6 -1 -11 1 7 -3 11 -1 8 8 -2 7 10 -1 2 1 -4 11 -1
6245aLKOm%lJ1j6nOMNPj0j1J6rPkmLNJnlLnqRnKOj3OjnMk1J0J1lPnQlJPnjjKj0
$$ -1 2 4 10 6 6 3 14 -2 -7 -1 3 8 15 5 -6 10 1 8 6 2 5 10 11 6 3 6 1 -7 2 -3 -1 5 -8 -2 -3 -8 -4 -25 -15 -4 -7 0 -5 3 0 1 8 3 2 1 3 -7
6297gJ8qMrPrjMkQkjlKNjkmMJ2mnlklQ%jrJ7LqmJ0nlpJ4qj1J2j8KJ1nNMj3NqJ3
$$ -7 11 3 7 -2 5 -4 -5 -1 -3 5 3 2 -1 1 6 5 3 -1 3 15 11 6 3 1 -2 6 6 5 -4 13 16 8 4 14 9 6 -1 13 5 -6 6 -12 -10 1 -4 1 5 -8 -3 -11 2
6348BnlNj4K3k1LJ8pNrOKJqLoJ0kOlKMmpm%J3okllLMKj0KOkoJ2qkMJ1%mq%Ojk
$$ 2 -3 -6 -1 -15 8 -13 -10 8 1 6 -3 3 5 6 -2 1 -5 5 3 9 6 8 12 8 1 -3 -3 10 4 2 -1 -4 -1 3 5 -5 -3 3 1 -5 7 -1 -3 1 12 12 8 0 0 6 5 3
6400CjNkj0Nj9J2jjlJ2%j3J8j4OkNlj3J1QnRj4LQjMQrpJ0j1J4o%JoQJj4QopQJ
$$ 3 2 7 5 -5 0 -19 -7 -8 -9 -12 0 0 -13 5 -9 -3 -5 0 -3 -16 -5 3 -2 7 -7 -4 4 3 7 15 6 -1 9 -2 12 6 6 7 1 9 10 -4 4 -2 -9 -1 0
6447@Kj0NKMNj1JQj7N%JkOnjMOLj0J0kj6J4kj3QrK0j2jNJnJ7k4J8j0J0pOLnJ1
$$ 0 2 -8 -3 -1 3 8 -3 -2 6 -11 -6 -6 -5 -7 -1 -6 -7 -3 3 6 -4 6 4 -12 2 0 -13 -5 -14 6 -6 -7 -2 -1 -6 11 -13 5 -5 5 -2 4 7 2 13
6492A3j7NJ3ookMRrklRj2NojPQj8J3Mj5KjRkMoj4mK5Lk0QNj4J5j0nJ0MNqRmoo
$$ 13 -4 1 14 8 2 0 4 13 4 2 -1 8 -4 1 -5 -6 1 9 -9 4 8 -7 -5 -6 3 1 5 -1 -15 -19 6 9 -11 -3 2 -12 3 -7 -12 -2 2 7 -1 8 4 -2 -8
6539hK0k1J1KjJpPrJ2ojmJ5Jj1M%Lj0lJ1%PpJ3j5J0j0J2j2KJ5k0MMpj0J1%k0J8
$$ -8 12 -9 2 4 3 4 -3 4 -5 7 1 0 -4 11 12 1 5 5 8 -2 -5 6 6 13 6 19 4 14 4 16 4 6 21 1 5 9 2 -8 3 3 -17 1
6581Aj0j0J6pMJkqJ5nJ3k0K%OPKj4NJ1llj0J8j0olPLLLJK%j6K7j0kMrNknj3J4
$$ 1 -9 -19 -3 -10 -6 -5 -7 -15 0 -5 8 -12 -10 -10 -4 3 5 -9 -4 7 4 1 -9 9 -1 -7 -10 -3 0 3 6 7 9 9 -7 20 10 8 12 3 8 6 1 -12 2
6626BnlJ4mJ1rj6K0rJJ2j4oLpOjrnJ1OnK1l0NRJoKJ4%olnqJ5Jo%KpQmPjKkkmL
$$ 2 -3 -6 8 4 15 6 -10 10 1 2 14 0 -6 -3 -10 -4 -5 -14 -19 -8 -2 -7 14 -16 -11 -2 -1 -7 -5 9 9 3 0 -5 -13 2 3 -3 -3 -1 -8 0 -4 3 2 4 2 0 -4 -1
6676aRm%k%Pk1J4MqNpJ0pK4j5kqRoOm%nJKnnKjNj6MJ9Jj6JJ1j8J5koQkmJ0j3K9
$$ -1 8 4 4 2 2 9 -12 2 6 -2 3 -4 6 -1 23 8 6 -2 7 1 7 3 3 -2 -1 1 -4 -9 -7 -8 -3 -19 -15 4 5 -11 -10 1 -17 -2 -4 -10 -2 -4 -8 2 -11 18
6724A8k7J1j3J2pJ3j0MOnpJ0PoJ2j5Mj0J1o%pOjlJ1j1%KOKjjNOj1KlrJJ1j4J1
$$ 18 -9 2 -11 1 -6 7 -3 1 7 2 -5 5 12 6 18 3 7 -3 8 2 2 -5 1 0 -3 8 -3 -3 -1 5 7 6 5 10 16 5 7 4 -5 -4 7 -7 4
6767D%J5k5%kj0K1j7RjJkjPj0mJ1jJ0j0RjlMj1JJ3Lp%LnNrLmJ1kkqJ1j2MQlJ0
$$ 4 4 19 -6 -6 -8 -18 3 -14 -5 -6 -5 -7 -8 -1 -11 -15 -4 -5 5 -5 4 3 0 4 -7 -6 7 10 3 3 6 1 6 -3 0 -4 7 5 3 -5 6 -6 -2 6 3 13
6813A3jmrKj0R%%%JmLqOj1J8Lj4KOj0RpoLKJrJ0MjJ1j0pJ4moj0J2J0j3P%lj0J5
$$ 13 12 8 -1 1 -9 0 0 0 0 1 -3 0 -8 -2 -13 5 8 -6 -4 2 -8 1 -6 -12 -9 -7 -6 -15 -5 -1 -2 9 -1 -8 6 2 -4 -14 -2 8 -5 2 2 -1 -11 4
6859DkJ6rj3KjLJLJlL%mNpJ6lk2J2j2jOPqQ%nqK1j2j7NJ2kLKrmJ1NrpQj4QNnK
$$ 4 2 18 9 -4 -2 -3 0 1 4 5 2 5 5 1 6 -1 15 12 -10 2 -10 -11 -5 2 -6 2 2 -3 -11 10 -2 -19 -14 -2 -4 -1 1 -8 -12 -1 4 -5 -12 -4 -18 -10 -5 -10 -8
6908hmPmkRMRj4%OMklRjlrJ2mLLqON%pK%n%MJj2oO%kQrMKnpOJ4j4LMNLpnMj0n
$$ -8 -12 -5 -9 -11 -2 2 11 -3 -3 3 7 5 2 11 10 7 -2 10 6 9 12 4 10 15 15 8 10 10 5 5 9 10 -2 -8 -2 -2 -4 4 -5 -1 1 -4 -11 -5 9 -5 -2 2 7 10 3 -2 2 -8 -13
6963a3QmLPj2J2oL%KLnOKmj4K4j5MolJ1j8K0J3k8K2koJ0j1oJ5moMj2%Pj4MJ4j8
$$ -13 -5 -9 -6 1 -11 1 -5 -2 -2 0 3 -2 4 6 2 -12 12 -3 1 -5 -8 3 -15 5 18 -10 12 10 4 14 3 -3 12 8 2 6 -6 -6 1 -13 -9 5 -13
7006a3J4JqQj3J7KpKpOpKkoR%JqNqPlMJ1%j3JQj6K1pOlj1K0k0MJkNjNlqJ5Nj5
$$ -13 1 2 -6 2 -11 6 8 1 3 -4 2 -5 -3 -5 -11 -2 -2 -1 -9 -4 -12 -5 -8 -4 7 7 -6 -5 3 -13 8 1 7 4 -7 13 -7 -3 -2 -4 1 0 5 2 -6 9 14 -1
7054aQJJ5j6oqPOj2R%qJ2Nj5JkLnmQqNQj6NOn%rNJ8rj0MKJ1jnJ2j5LkjkJ6j4%
$$ -1 7 8 23 7 1 -7 0 6 -6 3 3 -5 7 12 -3 -2 -4 -1 -6 -10 -2 -10 -5 3 -13 -8 -2 -7 -7 -16 -11 7 -2 -12 -8 -6 5 4 -1 11 -4 -1 -3 -4 -6 10 -4 -4
7102dpOj0J8%q%J4lpJ4j4RnoNNj0kJ3noNJkKpJ0qMMpJ3j1j2KLkNojLj3J7mJ0j0
$$ -4 -11 -5 -15 3 3 -5 -5 9 6 -1 13 -1 8 3 -3 2 7 -3 -5 8 3 -3 2 3 1 3 -4 6 -2 2 6 -1 12 1 -11 -9 -6 -8 -3 -9 -10 -7 -20 -3 -7 3 -7
7149gkLjKOj1QQrrK1mKmqNNoJ0MnljMNKj1nPJnLj0RpNj4J3lj0K2mkoljLnOJJj0
$$ -7 -9 -6 -7 -5 1 -10 -2 6 -3 -12 9 5 7 3 -5 0 5 -1 9 13 8 5 4 8 13 15 4 -1 6 7 2 5 -5 4 -3 2 -12 1 -2 -12 10 6 4 -2 -5 -6 -3 -8 -2 -1 0 -10
7201a0NmmjQrQj4J5%%MMojJj6RJnOPkJ5nj0K0ljj0KROolqjQk1J6lj5LJ1%njJ1
$$ -10 -5 -9 -13 -14 -6 -15 -7 -21 -6 -6 -6 -2 2 -4 -5 -4 -20 -11 -10 -15 -9 -2 -4 11 6 -4 16 13 12 2 4 13 19 13 10 2 1 9 -12 4 1 -14 -11 0 0 -5 -6 5
7249Ej1QqlRKnJ%kMmj0J1lljMNJnNj4J5nj1J2qnO%J3j8J1kpJ0LnJ6j1PpR%j3K3
$$ 5 -6 2 -6 -9 0 2 -3 -2 -2 -4 0 -4 -14 -3 -6 -9 -10 -6 -1 0 -5 0 -14 1 -4 -15 -3 -11 -16 -10 -10 3 -15 -4 -6 -13 -3 0 -5 11 0 7 0 9 9 -4 19
7296A9j2mj4J2Pj6PrQ%kRj0Ok%KJj7J3jmnKjlJ2pj1J3Po%oQqOLjMmJjkNJQj0N
$$ 19 7 3 -11 1 8 -8 -1 -10 -2 -2 -4 5 -5 1 -1 -1 1 2 -15 -2 -3 -7 -12 -10 -11 -14 -2 -9 -20 -7 0 -6 -6 -12 -4 -12 -6 -3 -4 0 -4 -3 -4 -6 -1 0 8 -2 3
7345Cj6OJmRJNP%oKRmqmpRqMLomLJ0JoOjjLk%k4J9Oj4OMrlQLrKMjOj1PPpN%Qk2
$$ 3 -13 -7 -6 -10 -1 0 5 12 12 6 8 17 13 5 1 -6 3 -5 -1 2 -4 -8 -5 5 6 0 6 5 4 7 5 5 -19 0 6 -8 -2 2 -7 -10 -2 1 -8 -6 -2 -3 3 -8 -1 6 -1 4 4 12 -10
7400a0J0mJj2RJ1j1kJ0mnM%kKJ3mJj4J2ml%mRJj0J6pn%J0rOJ0j6MoJpOqoJ8j3
$$ -10 0 -4 -3 -15 -6 5 -6 -8 2 -2 -7 -3 -3 -5 -3 10 6 7 -7 5 1 -2 -2 -6 3 4 -6 10 3 -2 -2 8 -1 5 15 -1 3 -3 -2 -9 -3 -11 -17 1 -12
7445a2J6jj4lJ4mPlQj4J0MopKJ0j6kQPl%kKNJ0j0%kNKlpJ0j7MNLJpKlqJ0OL%%
$$ -12 4 3 -11 -14 0 -4 3 0 8 -6 4 8 2 -5 -3 7 -9 -11 -3 4 1 1 -1 1 6 16 6 6 4 9 11 8 1 11 -6 -2 3 6 7 0 2 -1 -9 1 7 10 10 10
7493A0j4%J4kk1J7mrJ3j3jjmNPMnpmRqOMjJ5j9RkpJ6oKmJ1nj%mMNJ%Jj3kJ4nM
$$ 10 -4 -4 10 8 -13 4 0 -9 4 -9 -10 -11 -15 -10 -3 1 -4 -11 -15 -6 -14 -8 -4 -5 10 -9 0 -2 -9 7 1 3 -1 10 5 4 4 0 4 9 10 10 11 -2 -4 10 5 9
7541Ij5NPOj1jmKNnNKmpK0j7Pj2%J1J0j2Mj3J2kpkMRqMnj0J2lj5K7j4Km%oLoJ5
$$ 9 -6 -1 6 12 1 0 -4 -2 3 -2 3 5 1 -6 14 -3 4 -8 -8 3 13 1 5 -8 4 2 -5 -7 -3 6 -2 2 -3 -13 -1 -4 -19 8 -6 -4 -8 -8 -14 -11 -17 -2
7587bMOJj8LKOJ1j7MpJ8Jj2Pj3JJ0rNnJQkmNmQnmKkoMqJ3oP%%qnMPlj2J7p%jn
$$ -2 2 8 9 -9 -6 -4 2 13 -4 0 -7 11 12 0 7 -6 -5 5 -4 1 -4 -3 5 3 -1 4 0 8 3 -1 1 -1 -7 -3 -11 2 -4 3 3 3 -5 -10 -6 1 -2 -14 3 -4 -4 -5 -10
7638a0NqRJmPjKj0PKNkmNJj3RlRrKJpJ8noNKnKnlpOOnQKj4JJ4j7Rlj%jJKkOj0
$$ -10 -5 -13 -4 -3 -7 0 -1 1 -9 -2 0 5 3 -1 4 5 -8 1 -2 7 -2 0 1 -6 12 7 1 6 8 3 5 0 -3 -10 -4 2 -3 5 7 -7 -6 8 -9 0 -3 -4 -4 -5 -4 -2 -4 2 -8
7691hKLPj2Rm%lPj5%rJ1KNllPkJnJ7qpQmJmJ6qpOPLopJ5j3J2rQNor%%oLLLj7O
$$ -8 -6 -3 4 -8 1 -3 -3 -6 1 -14 -14 -23 -12 -10 -5 -8 -11 -4 -6 -5 -10 7 -1 -8 0 -4 -3 -7 9 1 -6 0 7 10 4 -3 12 -1 11 2 10 15 9 0 0 0 -6 -3 0 3 -14 -8
$$ [...]
8191a1
##END NTUPLES=NMR FID
##END=
