##TITLE=1H_BAU-N1-28.09.20
 CDCl3, 8 sc, 
 29.9.2020
##JCAMPDX= 6.0         $$ Bruker NMR JCAMP-DX V2.0
##DATA TYPE= NMR FID
##DATA CLASS= NTUPLES
##ORIGIN= UXNMR, Bruker Analytische Messtechnik GmbH
##OWNER= root
$$ XWIN-NMR		Version 3.5
$$ Tue Sep 29 10:50:39 2020 Russian Standard Time (UT+4h)  she@DPX200
##.OBSERVE FREQUENCY= 200.1315066352
##.OBSERVE NUCLEUS= ^1H
##.DELAY= (6, 6)
##.ACQUISITION MODE= SIMULTANEOUS
##.ACQUISITION SCHEME= undefined
##.AVERAGES= 8
##.DIGITISER RES= 18
##SPECTROMETER/DATA SYSTEM= spect
##.PULSE SEQUENCE= zg30
##.SOLVENT NAME= CDCl3
##.SHIFT REFERENCE= (INTERNAL, CDCl3, 0, 15.7039)
##AUDIT TRAIL= $$ (NUMBER, WHEN, WHO, WHERE, WHAT)
$$ ##TITLE= Audit trail, XWIN-NMR		Version 3.5
$$ ##JCAMPDX= 5.01
$$ ##ORIGIN= Bruker BioSpin GmbH
$$ ##OWNER= she
$$ F:/spectra/data/she/nmr/H-F/1/audita.txt
$$ ##AUDIT TRAIL=  $$ (NUMBER, WHEN, WHO, WHERE, WHAT)
(   1,<2020-09-29 10:48:56.46 +0400>,<she>,<DPX200>,
      <created by zg, POWCHK disabled, PULCHK disabled
       configuration hash MD5:
       00 E9 B6 7A A2 85 ED C7 34 08 36 98 17 FE 4E 26
       data hash MD5: 16K
       24 C9 1F 40 09 97 D0 BC 78 C7 A6 D9 30 D1 C8 85>)
$$ ##END=
$$ 
$$ hash MD5
$$ 77 74 2C D5 6D E2 CD EC 8B 1A 4C C5 58 1B FA 49
##$RELAX= 
##$RELAX= 
##$RELAX= 
##$RELAX= 
##$RELAX= 
##$RELAX= 
$$ Bruker specific parameters
$$ --------------------------
##$DU= <F:/spectra>
##$EXPNO= 1
##$NAME= <H-F>
##$PROCNO= 1
##$TYPE= <nmr>
##$USER= <she>
##$AMP= (0..31)
100 100 100 100 100 100 100 100 100 100 100 100 100 100 100 100 100 100 
100 100 100 100 100 100 100 100 100 100 100 100 100 100 
##$AQSEQ= 0
##$AQ_mod= 1
##$AUNM= <au_zg>
##$AUTOPOS= <>
##$BF1= 200.13
##$BF2= 200.13
##$BF3= 200.13
##$BF4= 200.13
##$BF5= 200.13
##$BF6= 200.13
##$BF7= 200.13
##$BF8= 200.13
##$BYTORDA= 1
##$CFDGTYP= 0
##$CFRGTYP= 5
##$CHEMSTR= <none>
##$CNST= (0..31)
1 1 145 1 1 1 1 1 1 1 1 1 1 1 1 1 1 1 1 1 1 1 1 1 1 1 1 1 1 1 1 1 
##$CPDPRG= <>
##$CPDPRG1= <>
##$CPDPRG2= <>
##$CPDPRG3= <>
##$CPDPRG4= <mlev>
##$CPDPRG5= <mlev>
##$CPDPRG6= <mlev>
##$CPDPRG7= <mlev>
##$CPDPRG8= <mlev>
##$CPDPRGB= <>
##$CPDPRGT= <>
##$D= (0..31)
0 1.2 0 0 0 0 0 0 0 0.06 0 0.03 0 0 0 0 0.0002 0 0 0 0 0 0 0 0 0 0 0 0 
0 0 0 
##$DATE= 1601362135
##$DBL= (0..7)
120 120 120 120 120 120 120 120 
##$DBP= (0..7)
150 150 150 150 150 150 150 150 
##$DBP07= 0
##$DBPNAM0= <>
##$DBPNAM1= <>
##$DBPNAM2= <>
##$DBPNAM3= <>
##$DBPNAM4= <>
##$DBPNAM5= <>
##$DBPNAM6= <>
##$DBPNAM7= <>
##$DBPOAL= (0..7)
0.5 0.5 0.5 0.5 0.5 0.5 0.5 0.5 
##$DBPOFFS= (0..7)
0 0 0 0 0 0 0 0 
##$DE= 6
##$DECBNUC= <off>
##$DECIM= 32
##$DECNUC= <off>
##$DECSTAT= 4
##$DIGMOD= 1
##$DIGTYP= 9
##$DL= (0..7)
0 120 120 120 120 120 120 120 
##$DP= (0..7)
150 150 150 150 150 150 150 150 
##$DP07= 0
##$DPNAME0= <>
##$DPNAME1= <>
##$DPNAME2= <>
##$DPNAME3= <>
##$DPNAME4= <>
##$DPNAME5= <>
##$DPNAME6= <>
##$DPNAME7= <>
##$DPOAL= (0..7)
0.5 0.5 0.5 0.5 0.5 0.5 0.5 0.5 
##$DPOFFS= (0..7)
0 0 0 0 0 0 0 0 
##$DQDMODE= 0
##$DR= 18
##$DS= 0
$$ [...]
##$SUBNAM2= <"">
##$SUBNAM3= <"">
##$SUBNAM4= <"">
##$SUBNAM5= <"">
##$SUBNAM6= <"">
##$SUBNAM7= <"">
##$SUBNAM8= <"">
##$SUBNAM9= <"">
##$SW= 16.880792210976
##$SWIBOX= (0..15)
0 0 2 0 0 0 0 0 0 0 0 0 0 0 0 0 
##$SW_h= 3378.37837837838
##$TD= 16384
##$TD0= 1
##$TE= 0
##$TE2= 300
##$TE3= 300
##$TEG= 300
##$TL= (0..7)
0 120 120 120 120 120 120 120 
##$TP= (0..7)
150 150 150 150 150 150 150 150 
##$TP07= 0
##$TPNAME0= <>
##$TPNAME1= <>
##$TPNAME2= <>
##$TPNAME3= <>
##$TPNAME4= <>
##$TPNAME5= <>
##$TPNAME6= <>
##$TPNAME7= <>
##$TPOAL= (0..7)
0.5 0.5 0.5 0.5 0.5 0.5 0.5 0.5 
##$TPOFFS= (0..7)
0 0 0 0 0 0 0 0 
##$TUNHIN= 0
##$TUNHOUT= 0
##$TUNXOUT= 0
##$USERA1= <user>
##$USERA2= <user>
##$USERA3= <user>
##$USERA4= <user>
##$USERA5= <user>
##$V9= 5
##$VALIST= <valist>
##$VCLIST= <CCCCCCCCCCCCCCC>
##$VD= 0
##$VDLIST= <DDDDDDDDDDDDDDD>
##$VPLIST= <PPPPPPPPPPPPPPP>
##$VTLIST= <TTTTTTTTTTTTTTT>
##$WBST= 1024
##$WBSW= 4
##$XGAIN= (0..3)
0 0 0 0 
##$XL= 0
##$YL= 0
##$YMAX_a= 878601
##$YMIN_a= -650844
##$ZGOPTNS= <>
##$ZL1= 120
##$ZL2= 120
##$ZL3= 120
##$ZL4= 120
##$ABSF1= 10
##$ABSF2= 0
##$ABSG= 5
##$ABSL= 3
##$ALPHA= 0
##$AQORDER= 0
##$ASSFAC= 0
##$ASSFACI= 0
##$ASSFACX= 0
##$ASSWID= 0
##$AUNMP= <proc_1d>
##$AZFE= 0.1
##$AZFW= 0.1
##$BCFW= 1
##$BC_mod= 2
##$BYTORDP= 1
##$COROFFS= 0
##$CY= 11.3945322036743
##$DATMOD= 1
##$DC= 2
##$DFILT= <>
##$DTYPP= 0
##$F1P= 16.9975609425685
##$F2P= -3.02152046262296
##$FCOR= 0.5
##$FTSIZE= 0
##$FT_mod= 4
##$GAMMA= 1
##$GB= 0.15
##$INTBC= 1
##$INTSCL= 1
##$ISEN= 128
##$LB= 0.24
##$LEV0= 0
##$LPBIN= 0
##$MAXI= 10000
##$MC2= 0
##$MEAN= 0
##$ME_mod= 0
##$MI= 1.114404
##$NCOEF= 0
##$NC_proc= 0
##$NLEV= 6
##$NOISF1= 3.799351
##$NOISF2= 2.8
##$NSP= 1
##$NTH_PI= 0
##$NZP= 0
##$OFFSET= 15.70392
##$PC= 1
##$PHC0= -9967.283
##$PHC1= 8.200891
##$PH_mod= 1
##$PKNL= yes
##$PPARMOD= 0
##$PSCAL= 0
##$PSIGN= 0
##$REVERSE= no
##$SF= 200.130013532006
##$SI= 16384
##$SIGF1= 3
##$SIGF2= 2
##$SINO= 400
##$SIOLD= 16384
##$SREGLST= <1H.CDCl3>
##$SSB= 0
##$STSI= 0
##$STSR= 0
##$SW_p= 3612.71676300578
##$SYMM= 0
##$S_DEV= 0
##$TDeff= 0
##$TDoff= 0
##$TI= <>
##$TILT= no
##$TM1= 0
##$TM2= 0
##$TOPLEV= 0
##$USERP1= <user>
##$USERP2= <user>
##$USERP3= <user>
##$USERP4= <user>
##$USERP5= <user>
##$WDW= 1
##$XDIM= 8192
##$YMAX_p= 0
##$YMIN_p= 0
$$ End of Bruker specific parameters
$$ ---------------------------------
##NTUPLES= NMR FID
##VAR_NAME=  TIME,          FID/REAL,        FID/IMAG
##SYMBOL=    X,             R,               I
##VAR_TYPE=  INDEPENDENT,   DEPENDENT,       DEPENDENT
##VAR_FORM=  AFFN,          ASDF,            ASDF
##VAR_DIM=   8192,          8192,            8192
##UNITS=     SECONDS,       ARBITRARY UNITS, ARBITRARY UNITS
##FACTOR=    0.000296,      1,               1
##FIRST=     0,             0,               0
##LAST=      2.424536,      0,               0
##MIN=       0,             -650844,         0
##MAX=       2.424536,      878601,          0
$$ Real data points
##PAGE= N=1
##DATA TABLE= (X++(R..R)), XYDATA
$$ [...]
2028a119K454j827J282n65o64J930j852J025m42N16o65O63n21N35j058J96J055
$$ -1119 1335 -492 790 225 -439 1491 -361 664 222 738 73 736 215 750 -308 -112 943
2045I43k364L033k722J625m74o08J070k031K287j425O36j83O62j133P92n54J96
$$ 943 -1421 1612 -1110 515 41 -567 503 -1528 759 -666 -30 -213 449 -684 108 -446 -250
2062b50N95j063K377k953K101r71n49J513k139K176j671R01j72l69l36Q51o72
$$ -250 345 -718 1659 -1294 807 -164 -713 800 -1339 837 -834 67 -105 -474 -810 41 -631
2079f31rJ008j638J915k195K301j292J87J643k147J903j324J093p83j01P83l60
$$ -631 -640 368 -1270 645 -1550 751 -541 -354 1289 -858 1045 -279 814 31 -70 713 353
2096C53m37N89J72j039J722k402K173j959J196O22k130K620k366J443q66L73N46
$$ 353 -84 505 677 -362 1360 -1042 1131 -828 368 990 -1140 1480 -886 557 -309 64 610
2113F10r72R13k66k45m39J396k076K326j757Q40rj234K417k942K466r17j02L79
$$ 610 -362 551 285 40 -399 997 -1079 1247 -510 330 321 -913 1504 -1438 1028 111 9 388
2131C88o54N62n25N25m61O11j510K122j801P39L10j429J951k345K818k275P55
$$ 388 -266 296 -229 296 -165 446 -1064 1058 -743 -4 306 -1123 828 -1517 1301 -974 -219
2148b19M95j132Q69k38L19j93L89o04J050j702J426l60q20J933k142K585k407
$$ -219 276 -856 13 -225 94 -99 290 -314 736 -966 460 100 -720 1213 -929 1656 -751
2165g51J001j8q92J632j205P22m56M76q71P52q28J219j054k15J795k527K406k069
$$ -751 250 232 -660 972 -233 489 33 509 -362 390 -438 781 -273 -488 1307 -1220 1186 -883
2183h83J060j5n96J553j842J460l30j45m12J065j014O05k05j0O85j734K426k514
$$ -883 177 162 -434 1119 -723 737 407 262 -150 915 -99 506 301 291 976 -758 1668 -846
2201h46J524l45q30J011j675J878j722M52K40j18m33O76n17j66Q05j085J841k431
$$ -846 678 333 -497 514 -1161 717 -1005 -553 -313 -431 -864 -188 -705 -871 -66 -1151 690 -1741
2219a741K122q76n18J276j398J448j401J462n68l51L53K28l01j87L77o66J202
$$ -1741 381 -495 -1013 263 -1135 313 -1088 374 -194 -545 -192 36 -265 -452 -75 -741 461
2236D61j768J985j393M21J215k388K183j287J207r46M83J72l43j85L65M95j144
$$ 461 -1307 678 -715 -294 921 -1467 716 -571 636 -310 173 345 2 -183 182 677 -467
2253d67J857j937J686j308O46M46j305K233k529J427l94L8Q6k08M98m76M2l60
$$ -467 1390 -547 1139 -169 477 923 -382 1851 -678 749 355 393 479 271 769 293 335 -25
2271b5R29j836J839j194L90K47j172J595k080K058j586J34P80q37R61q62O08k58
$$ -25 904 -932 907 -287 103 350 -822 773 -1307 751 -835 -701 79 -758 203 -659 -51 -309
2289c09M53q70J078j258R09K08j080J704k147J964j661P64N06q69P42n91P06q48
$$ -309 144 -726 352 -906 3 211 -869 835 -1312 652 -1009 -245 261 -608 134 -457 249 -599
2307e99J124j076R03p47J040n62o83J700j852J767j318J027j64q73J289j065O90
$$ -599 525 -551 352 -395 645 83 -600 1100 -752 1015 -303 724 560 -313 976 -89 601
2324F01o85O93n67O84n99N07k63k98J067j968K335j515M29J25n00R41j518J493
$$ 601 -84 609 42 726 127 634 371 73 1140 -828 1507 -8 421 546 46 987 -531 962
2342I62j097K29J17K47q33M88j72n88O71o89J524k175J202j1o22R07r55J313j146
$$ 962 -135 94 211 458 -375 113 -59 -647 24 -665 859 -1316 -114 -125 -747 160 -795 518 -628
2361f28O18j01k96R2M08j6n06R43j190J388j695J721j087l36J539j727J479r66
$$ -628 -10 -111 -407 -315 93 77 -429 514 -676 712 -983 738 -349 -685 854 -873 606 -360
2379c60Q27q07L57J03P1l47M10L03j204J708j873J193m89QJ038j464J400j233
$$ -360 467 -340 17 120 191 -156 254 557 -647 1061 -812 381 -108 -100 938 -526 874 -359
2397c59P37n39M81L0m66N04l20J01m38J168j558J254n78j25O47j308J584j701
$$ -359 378 -161 320 350 -116 388 68 169 -269 899 -659 595 17 -108 539 -769 815 -886
2415h86J208n46j00M8m10O84o47M20l98O13j271J587j186M90M99j277J765j687
$$ -886 322 -224 -324 -276 -686 -2 -649 -229 -627 -14 -1285 302 -884 -394 105 -1172 593 -1094
2433a094J705r97mO48o50L12k14O68n24K70o25Q98r80O47M8r80J717j867J504
$$ -1094 611 -386 -390 258 -392 -80 -294 374 -150 120 -505 393 -587 60 108 -872 845 -1022 482
2452D82r07O08J83q48J119n96L94o61Q11m96O58q37N13K12o16J359j845J617r26
$$ 482 -425 183 366 -482 637 41 435 -226 585 89 747 -90 423 635 19 1378 -467 1150 224
2471B24L23J03m72R17j019P45o40M59n34L59m35K62n4l37P75j644J776j497P19
$$ 224 547 650 178 1095 76 821 181 640 106 465 30 292 238 -99 676 -968 808 -689 30
2490C0N2p43J123j471J658r43J55J51K50n65N02%m27O17j269J462j457R00k12
$$ 30 82 -661 462 -1009 649 -294 -139 12 262 -303 199 199 -228 389 -880 582 -875 25 -187
2509a87p47J013j039J278j436P19k31K73j48m1k4k78Q25q61J338j389J302o70
$$ -187 -934 79 -960 318 -1118 -399 -630 -357 -505 -546 -570 -848 -23 -884 454 -935 367 -303
2527c03j24J292j602J613j130M60o3RP4l82M54j15K19o95J227j120R22p21J70
$$ -303 -427 865 -737 876 -254 206 143 152 226 -156 298 183 402 -293 934 -186 736 15 185
2546A85M72j218J860j433N63o3k31K04k73N15j94P3l50O38j243J091q18J09P00
$$ 185 657 -561 1299 -134 429 366 135 339 66 581 387 460 110 748 -495 596 -222 -113 587
2565E87j207J585j598J167o52P3M97n84M27m37M93p78N40n95R75j083M44L22j245
$$ 587 -620 965 -633 534 -118 -45 452 -132 295 -142 351 -427 113 -482 493 -590 -146 176 -1069
2584a069J385j434J474j354O24K65p76Q31o42P08l84O40m02L30p45O59q2q02J590
$$ -1069 316 -1118 356 -998 -374 -109 -885 -54 -696 12 -372 268 -134 196 -549 110 28 -774 816
2603H16j417Q88o59M74M07j094J529j119J42P5M22n79N49m08J31K5l76J099j677
$$ 816 -601 287 -372 102 509 -585 944 -175 -33 42 464 -115 434 26 157 182 -194 905 -772
2622g72J518q17K05J56n21R34j128J091n42J36l55L98k70J43l50l1O43r22J229
$$ -772 746 -71 134 290 -231 703 -425 666 124 260 -95 303 33 176 -174 -205 438 -484 745
2641G45j227M97P2o44R08j214J238q64J54p6K59l31O7M07m71P68j343J497j162
$$ 745 -482 15 87 -557 351 -863 375 -489 -335 -411 -152 -483 -416 -9 -480 288 -1055 442 -720
2660g20R34j24m49P81j064J060r69O71k54j64N99j85n6l51M17n25J006j140P16
$$ -720 214 90 -359 422 -642 418 -551 120 -134 -298 301 116 60 -291 126 -399 607 -533 183
2679A83j06l3Q25j518J405q93O55l90Q3K71l21N87n20K04q00J019j232R84k73
$$ 183 77 44 869 -649 756 -137 518 128 211 482 161 748 228 432 -368 651 -581 403 130
2698A30m62P61j230J861j520N61Q5j57L52j80J40j86K36n25N50o91P64o46J73
$$ 130 -332 429 -801 1060 -460 101 186 29 381 201 341 155 391 -134 416 -275 489 -157 16
2717A6M14j088J029j019J018r00K18N80r83M87l85O20l29M06n06O09o73K13L50
$$ 16 430 -658 371 -648 370 -530 -312 268 -715 -228 -613 7 -322 84 -422 187 -486 -273 77
2736G7r98J499j102R39o19K95J34o53P75n08J49k38K19k92K42j88K49K3l48R64
$$ 77 -921 578 -524 415 -204 91 225 -428 347 -161 -12 -250 -31 -323 -81 -269 -20 3 -345 619
2756F19j043R59n43R7M68r07J016q26N89n78L46q8K94n02K45J43m92O42j099J333
$$ 619 -424 535 -8 89 557 -350 666 -160 429 -149 197 109 403 -99 146 289 -203 439 -660 673
2776F73j005L01L05n77Q17r24Q35n67J66j13K54p0j88N31n90M71p95J344j617
$$ 673 -332 -31 274 -303 514 -410 425 -142 24 -89 165 95 -93 438 -152 319 -476 868 -749
2795g49J064k07o22P49r79R29o51K52J87k43K24r7j88j29M62p64J246r42O70k67
$$ -749 315 108 -514 235 -744 185 -466 -214 -27 -270 -46 -143 -331 -460 2 -762 484 -458 212 -55
2815e5k58J186j425J003o01N29m10o9J55k55K02J5J76o39J025o64K84j08l57O49
$$ -55 -313 873 -552 451 -150 379 -31 -100 55 -200 2 17 193 -446 579 -85 199 91 -266 383
2835C83q88J176q69N27j02m16M09l53L89l34O51m15L74q14O18j13l18R37j222
$$ 383 -505 671 -198 329 227 -189 220 -133 256 -78 573 158 532 -282 336 223 -95 842 -380
2854c80J062q41N50m87l7P31n66M9k45L79n59N10m74O09n55J60K07r13R95p84
$$ -380 682 -159 391 -96 -133 598 32 81 -164 215 -344 166 -308 301 -254 -94 113 -800 195 -589
2874e89O45o36M24N22q11O22j83q0k57M98l44N15n87j35O20n55Q24j038P28l56
$$ -589 56 -580 -156 366 -445 177 -6 -86 -343 155 -189 326 -261 -396 224 -331 493 -545 183 -173
2894a73l8L83p24Q87m23J62m12O40l38J33j78j5L18n68R20j337Q64m79M44L26
$$ -173 -211 172 -552 335 -88 74 -338 302 -36 97 -81 -96 222 -346 574 -763 101 -378 66 392
2914C92n95P69r78R36o14M23k45K52l29O7Q9o70J183r76O91r65N95K87p80Q29
$$ 392 -203 566 -412 524 -90 333 88 340 11 78 167 -503 680 -296 395 -570 25 312 -468 361
2934C61r01Q24q34P86l09k0K4k0K23n27O17p76Q85p57O67k12n99J169r57O24o45
$$ 361 -540 284 -550 236 -73 -93 -69 -89 134 -393 224 -552 333 -424 243 31 -568 601 -356 268 -377
2955c77N28l63RM4K1K17k04M29q31P20o45N43j31m82J231j385J262j048P04l93
$$ -377 151 -212 -203 -159 -138 79 -125 304 -527 193 -452 91 -40 -522 709 -676 586 -462 242 -151
2975a51k1N85p04P70n59M77p96J151o85K18l3j21L68q42J055q31N60j17k65k6
$$ -151 -172 413 -291 479 -80 397 -399 752 67 285 252 131 499 -343 712 -119 441 324 59 33
2995C3l83P97k73r3j77Q06r99R71r11n53J449r66J043n90J82l8k21K82n28N09
$$ 33 -350 447 174 81 -96 710 -289 682 -229 -782 667 -299 744 154 336 298 77 359 -169 340
3015C40n26L81l20K94m79N76j79l14L24o30R20j038O80m69K38M70r62O87k42K96
$$ 340 -186 195 -125 169 -310 266 87 -227 97 -533 387 -651 29 -440 -202 268 -694 -7 -249 47
3035D7m29N91n72M10l53M7L82p30J251j057N87m93L6M86m84N95p66P26j48J71
$$ 47 -382 209 -363 47 -306 -259 123 -607 644 -413 174 -319 -283 203 -281 314 -452 274 126 297
3055B97l12M11k41l2J91m55M81n53Q21q11M52J35m01M73o33N10m32Q8K0O2p2J84
$$ 297 -15 396 155 123 314 -141 340 -213 608 -203 249 384 -17 456 -177 333 -99 -11 9 71 -1 183
3077A83J00n97O52o37P78p78M03L45q32Q69p77N35m01J55K06m17J32J97J6m60
$$ 183 283 -314 338 -299 479 -299 104 449 -383 486 -291 244 -157 -2 204 -213 -81 116 132 -328
3097c28M99p90O92n38L89J17n02Q26j110R56m68L16m12J89J62m45M38k17M93r26
$$ -328 171 -619 73 -465 -76 41 -461 365 -745 211 -257 59 -353 -164 -2 -447 -9 -226 267 -659
3117f59R80n46J93k2l15Q65j039J186o40J79j99M3K38l24L49k99L44n17O00o61
$$ -659 321 -225 -32 -54 -369 496 -543 643 3 182 -17 26 264 -60 289 -10 334 -183 417 -244
3137b44M35j90k54P35r17R45r11P31m51lJ91j15M56m27J86j35K08m43M10L0l40
$$ -244 191 1 -253 482 -435 510 -401 330 -121 -124 67 -48 408 -19 167 32 240 -203 207 237 -103
3158a03N02q34P43q70R18l74l45P07q18O45m34L88m45O18n05N60m23K9N75j073
$$ -103 399 -435 308 -562 356 -18 -363 344 -474 171 -263 125 -320 298 -207 353 -70 -41 534 -539
3178e39J106j048P02m62k89P53o68O70n18L32k95K22l62L96%k11N26o17P44o56
$$ -539 567 -481 221 -241 -530 223 -445 225 -293 39 -256 -34 -396 0 0 -211 315 -302 442 -214
3198b14N48m27R6Q3m62R96j042R14n06L69l27Q9k5q2J66o89R14r72Q46l23N1J56
$$ -214 334 -93 3 86 -376 620 -422 492 -14 355 28 117 92 10 176 -513 401 -571 275 -48 3 159
3220A59k59P06r12O91k62L15j14M3j55k21O85m06J70p60R39m95j91M14r47Q34
$$ 159 -100 606 -306 385 123 438 324 367 212 -9 676 270 440 -320 619 124 -67 347 -600 234
3240B34q72O37m90K57Q3j1N0q2Q9j43N54n58O10p67M33K23p99M15m29Q00m84L09
$$ 234 -638 -1 -491 -234 -151 -162 -112 -194 -105 -248 306 -252 358 -409 24 247 -552 -137 -566 234 -250 59
3262E9j33K3P1l29J99P2P2l43N68o12M40K4k75Q09j241J089q13K34L41m18L19
$$ 59 -74 -51 20 -309 -110 -38 34 -309 259 -353 87 111 -164 645 -596 493 -320 -86 255 -163 156
3283A56j2J50m94O87m90O6k9J98j26j29M35p09O27l71M64k71j99K19l95M38k80
$$ 156 144 294 -200 487 -3 63 34 232 106 -23 412 -297 330 -41 423 152 -47 172 -223 215 -65
3304f5K25l50K09n2R4k11%J86o63R67p87N52l62j31P51q59M61l86N86l14O6k75
$$ -65 160 -190 19 -33 61 -150 -150 36 -627 340 -447 105 -257 -388 363 -496 -35 -421 165 -149 -83 -358
3326c58L13k66NM11o00P99p33O20k15k1L05o94O84o02N14n19M37P8k29j95p1M76
$$ -358 -45 -311 -306 105 -495 304 -429 191 -24 -45 260 -434 250 -352 162 -357 80 158 -71 -266 -337 139
3348A39n87P84r17R56n44P8M59m22N10o44M15j68K43p7j0r0K9N03q72O80o75N64
$$ 139 -448 336 -581 375 -169 -91 368 -54 456 -188 227 59 302 225 215 125 154 657 -215 465 -210 354
3370C54l95j8J20n73Q70r46Q54p00N40K8p8J55m52L79l80L92n42O04o43M16N5
$$ 354 -41 -59 61 -512 358 -588 266 -434 106 134 56 211 -241 138 -242 150 -392 212 -431 -15 40
3391D0m02P03p34N45m29K62o3r3L22m35J76k99O22q81R18k95k21J45k17N14o04
$$ 40 -362 341 -393 152 -277 -15 -78 -171 151 -284 -108 -407 215 -666 252 -43 -264 -119 -336 178 -426
3412d26O33l77J99J80l34J90k10K99n23N29n62O67l60P8Q2j11N14q18P53l26K40
$$ -426 207 -170 29 209 -125 65 -145 154 -369 160 -402 265 -95 -17 65 -46 468 -350 403 77 317
3433C17j42k42K55k56N98k63m3j69M7k9J19k10k73Q59q53N38n99N71j52k51M97
$$ 317 175 -67 188 -68 530 267 224 55 102 73 192 -18 -291 568 -285 253 -346 225 73 -178 319
3454C19m66L51l61K77n05N59k19k3O6j18M75j017J082q93O83k73k53O93p61M55
$$ 319 -147 204 -157 120 -385 174 -45 -68 -2 -120 355 -662 420 -473 210 -63 -316 377 -384 71
3474G1m26K63l77L59J6j13J91k67K31l13P30q11M15j9j20M96p50P97m40M05m39
$$ 71 -355 -92 -469 -110 -94 -207 -16 -283 -52 -365 365 -446 -31 -50 -170 326 -424 373 -67 338 -101
3495a01J36PK61j07l31N15n12L49n36O21m58J77L10m57M24o62P39k43k1Q1l31
$$ -101 35 42 303 196 -135 380 -132 217 -319 302 -156 21 331 -126 298 -364 375 132 111 192 -139
3516a39K55j3K07m88O28m41K48m74L16K41q27P96p59N56Lk08J00j89J41j37K65
$$ -139 116 103 310 -178 450 9 257 -217 99 340 -487 309 -450 106 109 -99 1 -188 -47 -184 81
3537H1k09L03o38M73j43L7J56l94M57n91P40k20l6j27j07K30m06N21p02P64l49
$$ 81 -128 175 -463 10 -133 -96 60 -334 123 -468 272 52 16 -111 -218 12 -394 127 -575 189 -160
3558a60L02k24J10L28o12O47r23P99j98j69M96n19L80m34L69l09K51j18K37l2
$$ -160 142 -82 28 356 -256 391 -532 267 69 -100 396 -123 257 -177 192 -117 134 16 253 221
3578B21k15L31n52O51p77N72k06L75l3o67P36n08J09j05K84k07L27j33o1J5m06
$$ 221 6 337 -215 436 -341 231 25 400 367 -300 436 -72 37 -68 216 9 336 203 142 157 -249
3599b49O68o03N08n21K80R2l78N16m19K29k22l7k10M94l35K53j44l05O75o77O07
$$ -249 419 -184 324 -197 83 175 -203 313 -106 123 -99 -136 -346 148 -187 66 -78 -383 292 -385 222
3620B22m25OL92m18J60l90P08m05P2k85J57Q4K55j26l83L40j65M40m75L86k17
$$ 222 -203 -197 195 -223 -63 -453 255 -150 -78 -363 -206 -122 133 7 -376 -36 -201 239 -236 150 -67
3641f7P2R5m85P08p55M41j6k07K29P9Nk37K87l17N29n73M34j91oL05p01O35m95
$$ -67 5 100 -385 323 -432 9 -7 -214 15 94 99 -138 149 -168 361 -212 222 31 25 330 -371 264 -231
3664b31M64J2j25K7j77K47k09mk05N48p02N13j62jL26o53P65q41Q33l32l31M59
$$ -231 233 245 120 147 -30 217 8 4 -201 347 -355 158 -4 -5 321 -332 433 -408 425 93 -238 221
3686B21l98K01k78M22m86L77j84M15m75J49l7j62O94q89M44l41L5K44l12M61j6
$$ 221 -177 24 -254 168 -318 59 -125 290 -185 -36 -73 -235 459 -430 14 -327 -292 -48 -360 101 85
3707H5q8l70N15l40M22l96K18K73n99N44l62L92m46K16L60m83K56k51P4k62M36
$$ 85 -3 -373 142 -198 224 -172 46 319 -280 264 -98 294 -152 64 424 -59 197 -54 20 -242 194
3728A94j46K66l57J53Rj21L41n58M98m88L99J50l06J92j94K24n24M12j36J19M4
$$ 194 48 314 -43 110 119 -2 339 -219 279 -209 190 340 34 226 32 256 -268 144 8 127 171
3749A71o5n1k47L37m05M94j69j64O5m12N99l39N97p87N57k01Q7j9l09K91k65O12
$$ 171 106 55 -192 145 -260 234 65 -99 -34 -446 153 -186 411 -376 181 -20 67 48 -261 30 -235 377
3771C77p30N52l49Q9K86o15N13l50L47l71K51o3%J53n2p9j73L37l68K97m59L63
$$ 377 -353 199 -150 -61 225 -390 123 -227 120 -251 0 -63 -63 90 38 -41 -214 123 -245 52 -407 -44
3793d4J00j99M57o16M87m34M53j59Q5j44r3K91n09N59m36N49n63K73M0m39N74
$$ -44 56 -143 314 -302 185 -249 204 45 130 -14 -107 184 -325 234 -202 347 -216 57 97 -342 232
3814B32m48N68n08L84k5k4J14m33K66m31L98j79M6j32L07o0j70M03o60Q44q40
$$ 232 -216 352 -156 228 203 179 293 -140 126 -305 93 -86 -40 -172 135 75 -95 308 -352 492 -348
3835c48K27N3j61J30l09M44k81K31o1K79m71J22R6k27M12k42L32o85M68Jm9J37
$$ -348 -121 -68 -229 -99 -408 36 -245 -14 -75 204 -267 -145 -49 -276 136 -106 226 -459 9 10 -39 98
3857I8l68K11j12k1J00L33k90J41k22P5L93m67N53n77K04l4K30j43k42M94k10
$$ 98 -270 -59 -171 -192 -92 241 -49 92 -130 -55 338 -129 424 -153 51 17 247 104 -138 356 146
3878A46K65l45K01p3k65p0L62J69m52K28n58L07J06M1J73o55Q04n38K82l90M79
$$ 146 411 66 267 194 -71 -141 221 390 -62 166 -392 -85 21 62 235 -420 384 -154 128 -262 217
3899B17k61o6J95r1K59n53O44q32N56j91K35p5n25N50n37P39n68J24O0K02k32
$$ 217 -44 -110 85 -6 253 -300 344 -488 68 -123 112 37 -488 62 -475 264 -304 -180 -120 82 -150
3920a50r9L97l75M54m53M32o93N27O6n95M48l07K78j42M33k02j39J19k08M77l05
$$ -150 -249 148 -227 227 -226 206 -487 40 106 -489 -41 -348 -70 -212 221 19 -120 -1 -209 268 -37
3941c7J83k17K30j67L48k92L5K01n66O28m82J58J75j80L59k73pm08Q04n77M18
$$ -37 146 -71 159 -8 340 48 83 284 -282 346 -136 22 197 17 376 103 96 -312 492 -85 333
3962C33k68k8J96l38L93m76N48n30N01j77p9p8k7M02n71K28k69M60m11k0K43k51
$$ 333 65 37 233 -105 288 -188 360 -170 331 154 75 -3 -30 372 -199 29 -240 220 -191 -211 32 -219
3984b19L81n28N83l10J56l0j90L34k41L67o42M96m01M04l51R2R5l48P34n56N00
$$ -219 162 -366 217 -93 63 33 -157 177 -64 303 -339 157 -244 160 -191 -99 -4 -352 382 -174 326
4005C26m68J50P4j51J64m96M63j9J65j12J75k95P8j82p6P17n60L42m58L75l38
$$ 326 -142 8 82 -69 95 -401 62 43 208 96 271 -24 54 -128 -204 513 -47 295 -163 212 -126
4026a26j80M75n64P12o86N54R5n4k18K06j19j40L54o15M86k13O5J77l18L96m99
$$ -126 -306 169 -395 317 -369 185 280 226 8 214 95 -45 309 -306 180 -33 32 209 -109 287 -212
4047b12L38k98M65o83M46p8jp2p3J46j84O42n66M29n87J41J60l40N17m62M05m32
$$ -212 126 -172 293 -390 56 -22 -23 -95 -168 -22 -206 436 -130 299 -288 -147 13 -327 190 -272 133 -299
4069b99K57j86O2J88j48Q6l63O24n78M63j59j70K51m79N96l81M96l20n8M41k06
$$ -299 -42 -228 -166 22 -126 -40 -403 221 -357 106 -53 -223 28 -451 145 -236 260 -60 -118 323 117
4090A17l6j94K20j49L84m46R3m0N5M98m62M71p32M38j86J65k24Q1Q8k42N03m47
$$ 117 81 -113 107 -42 342 -104 -11 -51 4 502 40 511 -221 217 31 196 -28 53 141 -101 402 -45
4112d5O23n78K12m69L64Kj36K85l59L62m62M13J2k95J32j16J87k98N27l81M5r7
$$ -45 578 0 212 -257 107 109 -27 258 -101 261 -201 212 224 -71 61 -55 132 -166 361 -20 25 -72
4134g2Q7J48m89N50n83M22k47L79o3k54L36n35L61o8K97m41R5o7JM15p41N75m43
$$ -72 15 163 -326 224 -359 63 -184 195 132 -122 214 -321 40 -28 269 -172 -77 -144 -143 272 -469 106 -337
4157c37N15o48N15l23J10L69m36M30l19K81j08j11K97m64M43l39K34r6J42k04
$$ -337 178 -470 45 -278 -168 201 -235 195 -124 157 49 -62 235 -229 214 -125 109 13 155 -49
4177d9K36p0k17J58j94K19j86L77k19MnJ02q5r6K89k12K37m17Q6K02l74J97l78
$$ -49 187 117 -100 58 -136 83 -103 274 55 59 54 156 71 -25 264 52 289 -128 -42 160 -214 -17 -395
4200c95O37l54M91m94j28N59m64L70l67L13k36J68k22K51j16k55K74l66L63m8
$$ -395 242 -112 379 -115 -243 316 -148 222 -145 168 -68 100 -122 129 13 -242 32 -334 29 -19
4220a9K63l10O0j09j88L03k10L58l67M40m31K36j21j22J44j73O20o70L52l45M22
$$ -19 244 -66 -6 -115 -303 0 -210 148 -219 221 -210 26 -95 -217 -73 -246 374 -296 56 -289 133
4241A33j73r3O2J66j33J23K31l55L06j84j61R1k18O89m47Q5k79J91K44m2j11j07
$$ 133 -40 -133 -71 95 -38 85 316 -39 267 83 -78 13 -205 484 37 122 -157 34 278 236 125 18
4263A8L65l95K89m06P6K03p9K25o78O16n07M39l06J18Q9j15L60o59M83k84M64
$$ 18 383 -12 277 -129 -53 150 71 296 -382 234 -273 166 -140 -22 67 -48 312 -347 136 -148 316
4284C16n17J34K20j11j25l19L71l36M60j94j05P3j73M13n63N63l17M2K4J48k36
$$ 316 -201 -67 153 42 -83 -402 -31 -367 93 -101 -206 -133 -306 107 -456 107 -210 -168 -144 4 -232
4305b32j39M33l43M31l44J88ol41L85j85K20k03J01j43L36j01J57k8k10K98k89
$$ -232 -371 62 -281 150 -194 -6 -12 -353 32 -153 67 -136 -35 -178 158 57 214 186 -24 274 -15
4326a5J75l08L54k21J76q4j35K90n34M76k75J27r7M7J74k67K86k59J94k54K95
$$ -15 160 -148 206 -15 161 77 -58 232 -302 174 -101 26 -71 -24 150 -117 169 -90 104 -150 145
4347A45l81L79j31N6K48n56L42k34N4R1q0R5j28pn9P8k0J93k20O7K07k46J44m94
$$ 145 -236 143 12 68 316 -240 102 -132 -78 13 -67 28 -100 -107 -166 -88 -108 85 -135 -68 139 -107 37 -457
4371d57O06l07K56r0L7k41r7M84j02J22k62J18r6J47j95J6J46k25K53k71K45k72
$$ -457 149 -158 98 8 45 -196 -293 191 89 211 -51 67 -29 118 -77 -61 85 -140 113 -158 87 -185
4393a85K31J74k86J29o4K00j08Q1k03q4J43l79Q89n69K66l28K65k64J54P7K7J30
$$ -185 46 220 -66 63 -1 199 91 172 -31 -115 28 -351 538 -31 235 -93 172 -92 62 139 166 296
4415B96n34L56l35K81P7J09l49j22L78k98L51l47J66J9k21L17j17K11m98M67k20
$$ 296 -238 118 -217 64 141 250 -99 -221 157 -141 210 -137 29 48 -173 144 27 238 -260 207 -13
4436a3j12o5R5J75r8K43n31M39m73J48M4%Q4J44n6l61L70m6j15K30k13K81j66
$$ -13 -125 -190 -95 80 -18 225 -306 133 -340 -192 -148 -148 -64 80 24 -337 33 -13 -128 102 -111 170 4
4459DJ49n56L72p2L34k54j09K36k57K16k02L44o71O08Mj09L1J54l8k34L06o01
$$ 4 153 -403 -31 -103 231 -23 -132 104 -153 63 -139 205 -466 142 146 37 68 222 184 -50 256 -345
4481c45O51m78K66j07l14L83k62L45k02L24j36l13m6L07j58j27J48m7K47j99K55
$$ -345 306 -172 94 -13 -327 56 -206 139 -63 261 125 -188 -234 73 -85 -212 -64 -111 136 -63 192
4502A92k35J3L04j32Q3l19K44j95k5o6J34J25j82r5J3K69k65K46j20k31L65m54
$$ 192 -43 -30 274 142 225 -94 150 -45 -70 -136 -2 123 -59 -154 -141 128 -137 109 -11 -242 123 -331
4524c31M15j13P0k63PJ65o3K45l50N94m46J66jm8Jj34L69m38L08m0n7Jn5j31M1
$$ -331 84 -29 41 -222 -215 -50 -113 132 -218 376 -70 96 95 47 48 -86 283 -155 153 113 56 57 2 -129 -88
4549h8J22Q4K58m04J01K7k8j63N3L93n33O22p65N59k40M5J38l02K34l37K70k22
$$ -88 34 118 376 -28 73 100 72 -91 -38 355 -178 444 -321 238 -2 43 181 -121 113 -224 46 -176
4571a76J22R2o8n7O5Jj89K04k35L95k35j9J75l17J20p0J91j39P1j20L04p4l10
$$ -176 -54 38 -30 -87 -22 -21 -210 -6 -241 154 -81 -100 75 -242 -122 -192 -1 -140 -69 -189 115 41 -269
4594b69K38j03L24k85M7j68J67r2K61P7o90N16M1p3j21K47l16J42K36j01J32k70
$$ -269 -31 -134 190 -95 -48 -216 -49 -141 120 197 -493 23 64 -9 -130 117 -199 -57 179 78 210 -60
4616f0J69n6j3L6N3q5R2J06k44K62l22J55K3j14M20p82N73l37L04j74P3K43m14
$$ -60 109 53 40 76 129 44 136 242 -2 260 -62 93 116 2 422 -360 213 -124 180 6 79 322 -92
4639i2K89m4J23l59R0J47k25J50m32L05MK60n67K94J16J55j73k54L87m57K41j3
$$ -92 197 153 276 -83 7 154 -71 79 -353 -48 -44 216 -351 -57 59 214 41 -213 174 -283 -42 -55
4661e5K6K33k57L4k07K10P6nj93M37m12l6J75k86L86j65o7J64J79m84K90j96K8
$$ -55 -29 204 -53 -19 -226 -16 60 55 -138 299 -113 -149 26 -260 126 -39 -106 58 237 -247 43 -153 -125
4684a25J84j10oj39K24P4p7m20L44K49l83K81p5K85l17L2J46k19N17m61J67j11
$$ -125 59 -51 -57 -196 28 102 25 -395 -51 198 -185 96 21 306 -11 21 167 -52 465 4 171 60
4706F0Q4j78J55k72L28j8l60K86k78K48j91P1J47J99k00k70M87k60j10J60K6r4
$$ 60 144 -34 121 -151 177 159 -201 85 -193 55 -136 -65 82 281 81 -189 298 38 -72 88 114 20
4728B0k31J88j51K21j97J87j43j18Q1j7K08k95L20j01j39O7J13N0p0Q6l50K34
$$ 20 -211 -23 -174 47 -150 37 -106 -224 -143 -160 48 -247 73 -28 -167 -100 13 63 -7 79 -271 -37
4750c7k46L37l73J06L12o1k5j73L02j40K07r7j53J32l43L25k43K51k55N56m17
$$ -37 -283 54 -319 -213 99 38 13 -160 142 2 209 112 -41 91 -252 73 -170 81 -174 382 -35
4771c5j80L56k28M35l78K79j59j99L67k39K4r9J85j54K5J7J34k16j70J52J92J63
$$ -35 -215 141 -87 348 -30 249 90 -109 258 19 43 -56 129 -25 0 17 151 -65 -235 -83 109 272
4793B72l59lm8J16p1k8K42j75K32m10L17j50L00l61R7K67k91J35m37M59k65K96
$$ 272 -87 -90 -138 -22 -93 -121 121 -54 178 -232 85 -65 235 -126 -29 238 -53 82 -355 104 -161 135
4815A35j79J62j38j33L40l81J27r7J17K04j33l7k2K08k54L58m85K59K4m50N29
$$ 135 -44 118 -20 -153 187 -194 -67 -164 -47 157 24 -13 -35 173 -81 277 -208 51 75 -375 154
4836A54j48O7k06p7k9N84n73M66r9m35L86m13M32n6p2J1j0J40l38K96j62P6j3
$$ 154 6 73 -133 -210 -239 345 -228 238 139 -296 90 -323 109 53 -19 -8 -18 122 -216 80 -82 -6 -19
4859a9k30M63n04M62k84K89l22J95r7J58r6L2M0l68J15p9M17kM6r5K1j68j81K13
$$ -19 -249 214 -290 172 -112 177 -145 50 -47 111 15 47 87 -281 -166 -245 172 170 216 121 142 -26 -207 6
4883Fk03J46j44L30q8j54K08m02M24j60Q4k14N4M6k48J76O8k35J88J11N0P0l82
$$ 6 -197 -51 -195 135 47 -107 101 -301 123 -37 47 -167 -113 -67 -315 -139 -71 -306 -118 -7 43 113 -269
4906b69K34P7l2K27n60L65j82J46J17j22J98j27p2r4L19k11K55k37JK1j33O47
$$ -269 -35 42 10 237 -323 42 -140 6 123 1 199 72 0 -94 225 14 269 32 33 54 -79 568
4928E68p46L07j17J06k6K1q4k6K27k21j2r5L3J44j28n8q5K53k63L32k39K41j23
$$ 568 -178 129 12 118 92 113 29 3 230 9 -3 -98 -65 79 -49 -107 -192 61 -202 130 -109 132 9
4951IPL25m63L81ql57O2K45j91rq1k30L97j55L79m61R6J15k55K16m13L62O6K46
$$ 9 16 341 -122 259 251 -106 -44 201 10 1 -80 -310 87 -68 311 -150 -54 61 -194 22 -391 -29 37 283
4975B83m49K06l4j1J7M5K7k75J49r0J76k58L96j82l41L33p4K91j24l3Q3m26N86
$$ 283 -166 40 6 -5 12 57 84 -191 -42 -132 44 -214 182 0 -341 -8 -82 209 85 52 135 -291 295
4998B95m79L79l96K12J62l6j34j2J26k05K83k64r2j04K89P3p3K45j85J31k40r
$$ 295 -184 195 -201 11 173 137 3 -9 117 -88 195 -69 -161 -265 24 97 24 269 84 215 -25 -34
5020c4K74k79o3J0J77l42N16k11K7K6q5K86n27K61k37N9KJ27J41j16K3l9j3n7
$$ -34 240 -39 -102 -92 85 -257 259 48 75 101 16 302 -225 36 -201 -142 -140 -13 128 12 35 -4 -17 -74
5044g4l3M0P4R2j83K0R8o9j59J76k2K7J17l5j53kQ4j00M44j78j53j90l9Q8J07
$$ -74 -107 -67 7 99 -84 -64 34 -35 -194 -18 -40 -13 104 69 -84 -86 -2 -102 342 164 11 -179 -218 -130 -23
5069b3L10m10P8K0k2L4j91J80r1L28l77L80p2j7j60K12m0k25J69N6k76J02L36
$$ -23 287 -123 -45 -25 -47 -13 -204 -24 -115 213 -164 216 144 127 -33 179 139 -86 83 139 -137 -35 301
5092C01k42j11k6jO3K9J25r5j91J4J01N4l34J65K42n4l27K96j00Q8J08m44K16
$$ 301 59 -52 -78 -79 -16 13 138 43 -148 -134 -33 21 -313 -148 94 40 -287 9 -91 -3 105 -339 -123
5115a23L11l87j0J61n7K22j95n4L64m93Q1J68q3J35k18K37j01%j45L84k65J39
$$ -123 188 -199 -209 -48 -105 117 -78 -132 232 -261 -180 -12 -95 40 -178 59 -42 -42 -187 197 -68 71
5137G1l1j4K95j67j62M1J46j99J78j07j0n7L5J26j96M67p69L61K2K9R0j26j1k56
$$ 71 40 26 321 154 -8 33 179 -20 158 51 41 -16 19 145 -51 416 -353 8 30 59 149 23 12 -244
5161b44M87k56L0J65k75K37j32J72n9n1j78J70n1j97K30j80k2k47N21k99K5L1
$$ -244 243 -13 17 182 -93 144 12 184 125 74 -104 66 15 -182 48 -132 -154 -401 120 -179 -154 -123
5183a23n7l9J9L9K03m57M36q4J14j49n4q5K79J4J13n33K26Q5o8K96l23K41j81
$$ -123 -180 -219 -200 -161 42 -415 21 -63 51 -98 -152 -237 42 56 169 -364 -138 -53 -121 175 -148 93 -88
5206h8L41m32R8J00O9o5L9j07N6j9k27M77j99j5P2j60M7n3J54l82L78J49r5o4
$$ -88 253 -179 -81 19 88 23 62 -45 11 -8 -235 242 43 28 100 -60 -13 -66 88 -294 84 233 138 74
5230G4k61M13l20Q5P1j75K25k67L29j35J70k93L53l02M7O7r8p9J03Q7m06M38m51
$$ 74 -187 226 -94 -9 62 -113 112 -155 174 39 209 -84 269 -33 14 81 -17 -96 7 94 -312 126 -325
5253c25K28L15l77J42M8J8m20K26r9R2J74P2n5j70J56j22K58l59K59rj05J43j72
$$ -325 -97 218 -159 -17 31 49 -371 -145 -244 -152 22 94 39 -131 25 -97 161 -198 61 52 -53 90 -82
5276h2J11J94q2j42j15L4rJ50L9j49j93L36oj58K61k93J05k4L17k81N9k44L12
$$ -82 29 223 141 -1 -116 -82 -91 59 98 -51 -244 92 86 -72 189 -104 1 -23 294 13 72 -172 140
5299A40j4j90J59j5p3j20L34k81K08m11N02l51m8J84j8k05L86J2k00l10K52j5
$$ 140 126 -64 95 80 7 -113 221 -60 148 -263 239 -112 -160 24 6 -199 187 199 -1 -311 -59 -74
5321g4K61r3j94R2J14k3k95L63k17K10l93J77j1J08r7j49K61k73K35j43M53l50
$$ -74 187 94 -100 -8 106 83 -212 151 -66 144 -249 -72 -83 25 -72 -221 40 -233 2 -141 312 -38
5343c8K73j53k25M5j39L24k23R7j73K03o3L4K3P3Kj18P7L3k06K45k28J04ll3M5
$$ -38 235 82 -143 -98 -237 87 -136 -39 -212 -9 -72 -38 -15 58 60 -58 19 52 -154 91 -137 -33 -36 -69 -24
5368b4m1J17j05Q0k10K46L3r1j0J26k08N8O4l0J94m62N34k98J37m9N0l41K72J26
$$ -24 -65 52 -53 27 -183 63 96 5 -5 121 -87 -29 35 5 199 -263 271 -27 110 61 111 -230 42 168
5392A68j70J03j79J71j30n3J14m0p9rK99l27J66k54L01k36KK04k46O2j79M03J49
$$ 168 -2 101 -78 93 -37 -90 24 -16 -95 -104 195 -132 34 -220 81 -155 -153 51 -195 -133 -312 91 240
5415B40j32J08l14K12m04K15k4k5K34k86K62M2K0k80J96k07K91j57k95L06l1P9
$$ 240 108 216 -98 114 -290 -75 -99 -124 110 -176 86 128 148 -132 64 -143 148 -9 -304 2 -29 50
5437E0j75L44j83R7j19q8m9J03oj3k2O7N0MQ0j30J63n1p2j54J55M2k21J59j66
$$ 50 -125 219 36 133 14 -74 -123 -20 -26 -39 -61 6 56 60 140 10 173 122 50 -104 51 93 -128 31 -135
5462a35L18Pm85K09k3j8j6J42L8J53l81N8K58j91n2j59L58k03p7J44j66M19l20
$$ -135 183 190 -295 -86 -109 -127 -143 -1 37 190 -191 -133 125 -66 -118 -277 81 -122 -199 -55 -221 198 -122
5485a22K86j32r3L5J11R8l06N1r0K02L6j69J53k85K75L8q7R7j90O5j40M19l57
$$ -122 164 32 -61 -26 85 183 -123 -72 -162 40 76 -93 60 -225 50 88 1 98 -92 -27 -167 252 -105
5508a05J04L5N2j26K50m34K58j62q4Q3j77M84l38J49J36j67l2M3O3J9N0j34K88
$$ -105 -1 34 86 -40 210 -224 34 -128 -212 -129 -306 178 -160 -11 125 -42 -74 -31 32 51 101 -33 255
5531B55j53k38K34j90J97j77j08Q6Q2R9j6J41j06r0l26K66J40o8j74p7K20K4O7
$$ 255 102 -136 98 -92 105 -72 -180 -94 -12 87 71 212 106 16 -310 -44 96 28 -146 -223 -3 21 88
5554H8k35L9J9J80j79M9L89l00k91J32N0K4nP6K8N6j37J05l36K68l13L85j03j15
$$ 88 -147 -108 -89 91 -88 -39 350 50 -241 -109 -59 -35 -40 36 64 120 -17 88 -248 20 -293 92 -11 -126
5578a26k3r0L51j99J03J08l35K86j93L65l09J21O9j22r6n1K81ln9J07n4QP9l31
$$ -126 -149 -239 112 -87 16 124 -211 75 -118 247 -62 59 128 6 -90 -141 140 137 78 185 131 139 218 -113
5602a13M9Q0K8p1K25j36k75K05m6L05l04J67j09k95M07k65L15l02K37n1J59r5
$$ -113 -64 16 44 -27 198 62 -213 -8 -54 251 -53 114 5 -290 117 -148 167 -135 102 51 210 115
5624A15Rj66K59j18j18MP1j42J56p2K44p12M35QK73l68q7M24k50K7j83K10j85
$$ 115 124 -42 217 99 -19 -15 56 -86 70 -2 242 -470 -35 -27 246 -122 -209 215 -35 -8 -191 19 -166
5647a66K19k30L9J26q1L02m47K34p2J58j05j18K30j13K20j15l7q1J86l56J24J46
$$ -166 53 -177 -138 -12 -93 209 -238 -4 -76 82 -23 -141 89 -24 196 81 44 -37 149 -207 -83 63
5669F3j10K5o9J32r9K88j71J93l12o1L25k46r4M8N4j0l9Q1m4j25J9J38R7j23j8
$$ 63 -47 -22 -91 41 -58 230 59 252 -60 -121 204 -42 -136 -88 -34 -44 -83 -2 -46 -171 -152 -14 83 -40 -58
5694e8J65o8R5O2k17K48n5r4n3j6J01j36K04k56R9n7j2J12k47L73m75L77k43J62
$$ -58 107 39 134 196 -21 227 172 78 25 9 110 -26 178 -78 21 -36 -48 64 -183 190 -285 92 -151 11
5718A1J89l02N6O7J9l71M53n1n4j85Q4j06K90k0j40J12p8M3k16L11q0l23oM25
$$ 11 200 -102 -46 21 40 -331 122 71 17 -168 -84 -190 100 80 -60 52 -26 17 -199 112 32 -291 -297 128
5742A28j32J34K66m65O4j5j67K77k47K68j4K18l69J6K6K5Q3j32L08l05k9j8K65
$$ 128 -4 130 396 -69 -5 -20 -187 90 -157 111 97 315 -54 -38 -12 13 96 -36 272 -33 -62 -80 185
5765A85l47J47j6m2N7j06K94j36J05N3k03J92l25M10m51%K05j21O9j42M78k85
$$ 185 -162 -15 -31 -73 -16 -122 172 36 141 194 -9 183 -142 268 -183 -183 22 -99 -30 -172 306 21
5787B1N1j39R2j73L08j61k36K52j0N4p9O1j67J81J42m03J49K78l17J50O6j34J14
$$ 21 72 -67 25 -148 160 -1 -237 15 5 59 -20 41 -126 55 197 -206 -57 221 -96 54 120 -14 100
5810A00k34L0N8J64p6p9j4J23j49J33j2j91J15%J06J07j10j13J63k44O1k83L90
$$ 100 -134 -104 -46 118 42 -37 -51 72 -77 56 44 -147 -32 -32 74 181 71 -42 121 -123 -62 -345 45
5833D5K60l47J63N2q9K0M1l35K91l38L30k13K45j68J41n4M8J8k00L4l1p6N0j17
$$ 45 305 -42 121 173 84 104 145 -190 101 -237 93 -120 125 -43 98 44 92 110 -90 -56 -87 -163 -113 -230
5857b30K48k6j72K24j19j30K83O0k62L04q3k12j40J05L95k23k06K22J51o8M4j94
$$ -230 18 -8 -180 44 -75 -205 78 138 -124 180 97 -115 -255 -150 245 22 -184 38 189 121 165 -29
5879b9P0o7n2p4Q2J48k27R9k33M28j57N0n4LK45j5j12n1K81l35J91k46M4Qq3K37
$$ -29 41 -26 -78 -152 -70 78 -149 -50 -283 145 -12 38 -16 -13 232 217 105 54 335 0 191 -55 -11 -3 -86 151
5905A51m3k4J94l20Q0o8j58J98J78j13n0m7K0M0N7k7l7P3o2n8j75K33n2N4J6J17
$$ 151 108 84 278 -42 38 -30 -188 10 188 75 25 -22 -2 38 95 68 31 104 42 -16 -191 42 -10 44 60 177
5931A77k45o2nR9r8J72l16L44j24l9j7R6k7J48j40j77M97l23j12o7J11n4J63j11
$$ 177 -68 -130 -135 -36 -134 38 -278 66 -58 -97 -114 -18 -45 103 -37 -214 283 -40 -152 -219 -108 -162 1 -110
5955a10J0J94k11K8j5J18j6N3J34j54o2%J38p9k58M2J65J12j81J30MJ55j70J64
$$ -110 -100 94 -117 -89 -104 14 -2 51 185 31 -31 -31 107 28 -230 -188 -23 89 -92 38 42 197 27 191
5979A91j59L0J08j34O4j38k92K25L1j23K32p1j18K35j21K68n12K06Q9M7k6j41
$$ 191 32 62 170 36 100 -38 -330 -105 -74 -197 35 -36 -154 81 -40 228 -284 -78 11 58 32 -109
6001a09J97j58J52Nq6j31J47K5j56j37J67lq3J8lj05J48J23l3q3M2K52l80K13
$$ -109 88 -70 82 87 1 -130 17 42 -114 -251 -84 -87 -170 -152 -155 -260 -112 11 -22 -105 -63 189 -191 22
6025B2j1K05j79pOJ5j2P9M6k07p2q1K37j39M8kl8R5r1m9J58J73k26j08L77J84
$$ 22 11 216 37 30 36 51 39 118 164 -43 -115 -196 41 -98 -50 -52 -90 5 -86 -135 23 196 -30 -138 239 423
6051D23n20J04Q1J5k17N7L37j57j55k83L66l4K02k85n5M02Nj22j44J77j17j92
$$ 423 -97 7 88 103 -114 -57 280 123 -32 -315 51 17 219 -66 -121 281 286 164 20 197 80 -112
6073a12J25j54J44J45q0j54J39j1k79J44O1L9m0j13p7m0L57k35J61j89K54m1r7
$$ -112 13 -141 3 148 68 -86 53 42 -237 -93 -32 7 -33 -146 -223 -263 94 -141 20 -169 85 44 -53
6096e3l2J26k91J33J43L7J21k79k09J59K83j36L4K59j84j8J09K7l99K5M89l48
$$ -53 -85 41 -250 -117 26 63 184 -95 -304 -145 138 2 36 295 111 93 202 229 -170 -145 344 -4
6118dJ78Mr8j10qJ67p5M1j36K55k30K05l99K28Q3n6K50l75K39p3j42J56m6p7J00
$$ -4 174 178 80 -30 -38 129 54 95 -41 214 -16 189 -210 18 101 45 295 -80 159 86 -56 100 54 -23 77
6143G7M1k71j4j41K06L0R6p4K79j66j72R0O0q9n4J94j66P8m01M37j03q3J07L1
$$ 77 118 -153 -167 -308 -102 -72 24 -50 229 63 -109 -19 41 -48 -102 92 -74 4 -397 40 -63 -146 -39 -8
6167hj21J81j24k19K11O8k55K81J43k27J43j23L59k52K11l74M27n0k90k8k6n3
$$ -8 -129 52 -72 -291 -80 -12 -267 14 157 -70 73 -50 309 57 268 -106 321 271 -19 -47 -73 -126
6189a26J47l0K9n8j06O7O5j48J28j98K83j46M9n4k1L86j90J8m9j6j48M02l58P0
$$ -126 21 -9 20 -38 -144 -77 -12 -160 -32 -230 53 -93 -44 -98 -119 267 77 95 46 30 -118 284 -74 -4
6213dO0j68J71R2j89kn2k7O8Q6l28P38o85M96k54j45n1J11k3j26K49j15k3P8j77
$$ -4 56 -112 59 151 -38 -40 -92 -119 -51 35 -293 445 -240 256 2 -143 -194 -83 -106 -232 17 -98 -121 -43 -220
6238b20m4L57j84mL56l56L29m66L21o0j37L9J41Q6m10K60j29J89k18K56p2J09
$$ -220 -264 93 -91 -95 261 -95 234 -232 89 29 -108 -69 72 158 -252 8 -121 68 -150 106 34 143
6260A43m44J28K01P5J62k06m5M3J26lj51M13m73k9M44m01K6o7L34k63Q7k44K46
$$ 143 -301 -173 28 103 265 59 14 57 183 180 29 442 -31 -60 384 -17 9 -58 276 13 100 -144 102
6283A02j28j51j3m1O63m82j1K80l81j07L42R4j44K20n17K17j95N23n36L40N6k82
$$ 102 -26 -177 -190 -231 432 -50 -61 219 -162 -269 73 167 23 243 -274 -57 -252 271 -265 75 131 -151
6305a51L63j31j08J63k78J42J60k58J32r3J03j14N2K06j04j69P3j27N3J69K6k83
$$ -151 212 81 -27 136 -142 0 160 -98 34 -59 44 -70 -18 188 84 -85 -12 -139 -86 83 109 -174
6327a74L07k93o8J87j72K60o4J84l14J38J76p0j0l51L21Q5o2l48K88nK02m2j04
$$ -174 133 -160 -228 -41 -213 47 -17 167 -147 -9 167 97 87 -264 57 142 80 -268 20 15 217 175 71
6350G1j08N1J71p6o1M1l91M81l19K13l2n1q9K97j81j80K77l76K68O5j02m7l7J6
$$ 71 -37 14 185 109 48 89 -302 179 -140 73 41 -10 -99 198 17 -163 114 -262 6 71 -31 -78 -115 -99
6374i9j53K98r6O1j90J19K4J48j24j23K8R1J11j0p6J1j11j32L03j98K41j22O9
$$ -99 -252 46 -50 11 -179 -60 -36 112 -12 -135 -107 -16 95 85 9 20 -91 -223 80 -118 123 1 70
6397G0k3j69O2l90K94K25k76M38m07K26j62J54l34K89K2J73o1l52J91Q2r1P8r2
$$ 70 47 -122 -60 -450 -156 69 -207 231 -176 50 -112 42 -292 -3 19 192 131 -221 -30 52 -39 39 -53
6420e3J11j07J21j07J94j15j11K39j97N0o2J16j53L17k23K10n2j26Qj25j14L59
$$ -53 58 -49 72 -35 159 44 -67 172 -25 25 -37 79 -74 243 20 230 178 52 60 -65 -179 180
6442A80m2l47K97R1j85J00k47P7Q0p4k5K05j32K33l27P4K3J2j8mk3j13P4J57j52
$$ 180 138 -209 88 179 -6 94 -153 -76 4 -70 -95 110 -22 211 -116 -42 -19 -7 -25 -29 -52 -165 -91 66 -86
6467h6K50j08J8J6r2J10L4Q7p41L76n2K91j06L9J69k61K9JP0j57J31Q1o1j04q
$$ -86 164 56 74 90 -2 108 142 229 -512 -136 -188 103 -3 36 205 -56 -27 -26 44 -113 18 99 38 -66 -74
6492g4r9K78%k07K48J00rk44r5K44l11K51J9K41m40R4O5O3j8l11K41p3K5j04k2
$$ -74 -173 105 105 -102 146 246 237 -7 -102 142 -169 82 101 342 -98 -4 61 124 106 -205 36 -37 -12 -116 -138
6517a38J92j1q8P7l3n5NJ98j01J90j40P4k97K61j78k7j90J26M7O4J49k22J47l3
$$ -138 54 43 -45 32 -1 -56 -51 147 46 236 96 170 -127 134 -44 -71 -261 -135 -88 -24 125 -97 50 17
6541A7L8k2j49L5R3O2r1L19j56l52K42L7n3r2M59k63j55j02J67n4l8L79k36k30
$$ 17 55 33 -116 -81 12 74 -17 302 146 -206 36 73 20 -72 387 124 -31 -133 34 -20 -58 321 85 -145
6565a45J12K67l59j21M8K50P0j43L0k1J10o3o4K27k61Q5l4k2J22j48K08j12o9
$$ -145 -33 234 -125 -246 -198 52 122 -21 9 -12 98 35 -29 198 -63 22 -12 -34 88 -60 148 36 -33
6588c3J10J05J53l07L3j88K60J38r1k28J07j45l7K97k70k6N9P1k32L60m52J69
$$ -33 77 182 335 28 61 -127 133 271 180 -48 59 -86 -123 174 -96 -122 -63 8 -224 136 -316 -147
6610a47K3k8K88L81l29k73j3J9o5M2j1J13K15l14J99j52j73J53K48j45L4k40K69
$$ -147 -124 -152 136 517 188 -85 -98 -79 -144 -102 -113 0 215 -99 100 -52 -225 -72 176 31 65 -175 94
6633I4j94K11j17j2j82L60k09m4J05k46M6K70P6k85K98j70Q2l0r2K38n5p6q1J73
$$ 94 -100 111 -6 -18 -200 160 -49 -93 12 -234 -188 82 158 -127 171 1 83 53 -39 199 144 68 -13 160
6657A60k24N2J5M0N1j92K56j62J45k35J37j19j22K00j04Q2J12j99J5K14nk33R2
$$ 160 -64 -12 3 43 94 -98 158 -4 141 -94 43 -76 -198 2 -102 -20 92 -107 -92 122 117 -116 -24
6680b4MK61o01K05J43p2J4P7J26l59J38j69K20N3K89m54J24J75k93L6L5M05m64
$$ -24 -20 241 -360 -155 -12 -84 -70 7 133 -226 -88 -257 -37 16 305 -149 -25 150 -143 -107 -72 333 -131
6703a31K3K26j14K29l22K97k71K46k83K68k15O2lP1l6o9k4k35M74l86J14K06r6
$$ -131 -108 118 4 233 -89 208 -63 183 -100 168 -47 15 12 83 47 -22 -46 -281 193 -193 -79 127 31
6726C1p9K22K4k6m8l09J83P4k97L41j57J45j30O1k8p7o7K31k48K18l57m6K93J9
$$ 31 -48 174 198 172 124 -185 -2 72 -225 116 -41 104 -26 35 7 -70 -137 94 -154 64 -293 -339 -46 -27
6750b7J34kj17P4j68J62l5J31q2j39K16n1l9k69M4m0L86k45J85j91j06K61j25
$$ -27 107 105 -12 62 -106 56 21 152 70 -69 147 96 57 -212 -168 -208 178 -67 118 -73 -179 82 -43
6773d3j07j5K22k10J53K23m51P8r2K49p7J97Q2m30j1J28J56l08L72j6J02j18M4
$$ -43 -150 -165 57 -153 0 223 -228 -150 -242 7 -70 127 209 -221 -232 -104 52 -256 116 100 202 84 128
6796A28o8l1l3m1M1J97q3j75J89q7j69J72m1K7o7N4K2j2Q5k46M8LJ34k19M18j80
$$ 128 60 29 -4 -45 -4 193 110 -65 124 37 -132 40 -1 26 -41 13 35 23 108 -138 -90 -87 47 -172 246 66
6822F6l14L93j25K32o2P3n00K26R7q4Q6j48K7j90K57N9J88l62R5N7l6j71J26j60
$$ 66 -248 145 20 252 190 263 -237 -11 86 2 88 -60 -33 -223 34 93 281 -81 14 71 35 -136 -10 -170
6846a70J37Q2J01m05L46p5J81Q1k12R5J17j29j95K14j94J6k00K83l88K55O3J72
$$ -170 -33 49 150 -255 91 16 197 278 66 161 278 149 -46 168 -26 -10 -210 73 -315 -60 3 175
6868A75j55k74R5p0M82o1j35j53R9j09j9P6M2J55j68R5J0Nm6N9r5j74K25K5o1
$$ 175 20 -254 -159 -229 253 192 57 -96 3 -106 -125 -49 -7 148 -20 75 85 90 44 103 8 -166 59 84 23
6893B3l4K13M4l35J02r3J94l06R3J09R3K22j01l22kk2R0J14k19K57j67L3J56k96
$$ 23 -11 202 246 -89 13 -80 114 -192 -99 10 103 325 224 -98 -100 -122 -32 82 -137 120 -47 -14 142 -154
6917a54K21j1j58Q3p8K11k48p1K46J20j22l3J00l34J65P5R6k12K54j19m6J02m
$$ -154 67 56 -102 -19 -97 114 -134 -205 41 161 39 6 106 -228 -63 12 108 -104 150 31 -15 87 83
6940H3J85l06L84l44J43j87n0R4p7n7J87j07j0j25J59L52j89l23M75l08J49k14
$$ 83 268 -38 346 2 145 -42 -92 2 -75 -132 55 -52 -62 -187 -28 324 135 -188 287 -21 128 -86
6962h6K10j70j4K50k54J54%M0N8k05J41N7j30l46K61m4K70k8j05k98J44l4J31
$$ -86 124 -46 -60 190 -64 90 90 130 188 -17 124 181 51 -295 -34 -78 192 164 59 -239 -95 -129 2
6985BR1j97L6j11J91P4K8N5j04m5r4J06J22l02M5J13j00j94J67J51k48L77Oj60
$$ 2 93 -104 -68 -179 12 86 114 169 65 20 -74 32 154 -148 -103 10 -90 -284 -117 34 -214 163 169 9
7009IJ78j65k61M75j06J68r7k01j6n4k3j30K02R0Oj95J69L8K4m6k08M14k26nj23
$$ 9 187 22 -239 236 130 298 201 0 -16 -70 -93 -223 -21 69 75 -120 49 87 111 65 -143 271 45 40 -83
7034h3L02q6k97J44P2K02l27K6j67K03M2J12k44j7K05k33K80o4j00O1K6j77J60
$$ -83 219 133 -164 -20 52 254 -73 -47 -214 -11 31 143 -101 -118 87 -146 134 70 -30 31 57 -120 40
7057D0K67m00K12k43Q3p9Q4J41j91k1O7J24k17K59k64m1J77j00J12l6nL9M3p3
$$ 40 307 -93 119 -124 -41 -120 -36 105 -86 -107 -40 84 -133 126 -138 -179 -2 -102 10 -26 -31 8 51 -22
7081b2J6p5j5J32j47K1OR8k23K28p3L4J53l00L44O6n1j11O8j42j3N0O7J38k37
$$ -22 -6 -81 -96 36 -111 -90 -84 14 -209 19 -54 -20 133 -167 177 243 192 81 149 7 -6 44 111 249 12
7106A2J32k46Q8l5K24%l62K88m06L51j8j2P2l65M53k92K17l24O7L96k88mK09j42
$$ 12 144 -102 -14 -49 175 175 -187 101 -305 46 28 16 88 -277 176 -116 101 -223 -156 240 -48 -52 157 15
7130A5k87K21j02J55J09L1j60j33K6K73J03l56K44m1o7j25J80K7n8J89l91J95
$$ 15 -272 -51 -153 2 111 142 -18 -151 -125 148 251 -105 139 98 31 -94 86 113 55 244 -147 48
7152D8J3m51N41N9k35j92K92J28pJ25m29R0k4j8j52K48k75K73r4m61N39k31J66
$$ 48 61 -390 151 210 -25 -217 75 203 196 321 -108 -18 -42 -60 -212 36 -239 34 -60 -521 18 -213 -47
7175d7j58J26p0J89q9K62k87K7n3j93m57N49L83p98O09n40j93M33N02l21k06L1
$$ -47 -205 -79 -149 40 -49 213 -74 -47 -100 -293 -750 -201 182 -616 -7 -547 -740 -307 195 -126 -332 -301
7197c01L01R7J78j32J66m20K9j18K00N7j86K78p5OmJ05m84M17j21j41J99k02P1
$$ -301 0 97 275 143 309 -111 -82 -200 0 57 -129 149 74 80 76 181 -303 114 -7 -148 51 -151 -80
7220h0rQ2k31J93l3O1k88O06k00j02K10k72K25j71P5L4j60K23k86J15J35k5k20
$$ -80 -89 -7 -238 -45 -78 -17 -305 301 101 -1 209 -63 162 -9 66 100 -60 163 -123 -8 127 102 -118
7243a18K26N3n19N15j48O7l28L16p8J3O8j84J23R6K4k46K73l74J90p2Q8J88l82
$$ -118 108 161 -358 157 9 76 -252 64 -14 -1 67 -117 6 102 126 -120 153 -221 -31 -103 -15 173 -209
7266b09J64L8N3K79j62j77M7K0q7K14l07K75k95j66K83J19J39l37O5k02J05M17
$$ -209 -45 -7 46 325 163 -14 33 53 -34 180 -127 148 -147 -313 -30 89 228 -109 -44 -246 -141 276
7288B76j79L8k16J00q6J22j97P7l9K97Pl47K97k29L52k46j22M0R9ojP9k05l4L65
$$ 276 97 135 -81 19 -67 55 -142 -65 -104 193 200 -147 150 -79 273 27 -95 -55 44 38 37 116 -89 -123 242
7313B42k68m6J30o6k41L90k79K1Q5J18J22k88M2J78J1j12nJ29q1k34J4K74k36
$$ 242 -26 -72 58 -8 -249 141 -138 -117 -32 86 208 -80 -38 140 151 39 34 163 82 -152 -138 136 -100
7336a00J70J32k63M7m5J77k05K76j91M4j40J75j15k16L00j12O1j86L62m03KK18
$$ -100 70 202 -61 -14 -59 118 -87 189 -2 42 -98 77 -38 -254 46 -66 -5 -191 171 -232 -230 -12
7358a2j28K24j49K74j84J12l90M1K26J27k03M8l7J02P7k62R9oq4J29J44j7l69
$$ -12 -140 84 -65 209 25 137 -253 -212 14 141 -62 -14 -51 51 128 -134 -35 -41 -125 4 148 131 -238
7381b38R9K6l9L9P1j8J76j89N5Q6m3J22j26j12J51j46qL0J07k37M23k73p3N0J34
$$ -238 -139 -113 -152 -113 -42 -60 116 -73 -18 68 25 147 21 -91 60 -86 -94 -64 43 -194 229 -44 -117 -67 67
7406F7j25K28j56j80L11k98M9M2K69k08j20J59q2J66k73O1o8K02k7k52J64J8J92
$$ 67 -58 170 14 -166 145 -153 -104 -62 207 -1 -121 38 -44 122 -151 -90 -158 44 17 -235 -71 -53 139
7429A39l41K39j77k0J25L74q5l24K33m18J61j28K30M99q94N01m11K06Q2N2o0J16
$$ 139 -202 37 -140 -160 -35 339 254 -70 163 -255 -94 -222 8 507 -387 114 -297 -91 -9 43 -17 99
7451I9L3j68J26j23K63o34L19J3Lo5J59k9j08K6j2L32k0N9m56n8M36k07O4JK07
$$ 99 132 -36 90 -33 230 -404 -85 -72 -69 -134 25 -4 -112 -86 -98 234 214 273 -183 -241 195 -12 52 53 260
7476B60j79j10L7p6J67k80K97k10J51nj30J99l04K23M2j49k6J10Ol0J33k09Q3
$$ 260 81 -29 8 -68 99 -181 116 -94 57 52 -78 121 -183 40 82 -67 -93 17 23 -7 126 -83 0
7499@Q8l0k79L91j90J04j43J14q6j08m8j83L17r2J11k02J01J79K32k22k31K81
$$ 0 88 58 -221 170 -20 84 -59 55 -31 -139 -187 -370 -53 -145 -34 -236 -135 44 276 54 -177 104
7521A04j65K7P0l09K67l10L83q2J17J10j12n9l7L9p2N9j92L61j46kJ11m7N3k79
$$ 104 -61 -34 36 -273 -6 -316 67 -15 102 212 100 41 4 43 -29 30 -162 199 53 51 162 115 168 -111
7545a11J4K29q9N7k87K78j20J81j63j8p3j22J79kK11l49L45j51j99M3n0J10J83
$$ -111 -97 132 43 100 -187 91 -29 152 -11 -29 -102 -224 -45 -47 164 -185 160 9 -190 -147 -197 -87 96
7568I6k27q9L85k07o4J30q1J47k89L59q9k6n7m2J92j91J8k69M43k3J12k85K52
$$ 96 -131 -220 165 -42 -106 24 -57 90 -199 160 71 45 -12 -54 138 -53 -35 -304 139 116 228 -57 195
7591A95l27J30J02q1j11j91L93k5r3j49q0L01Nj12k35N12j83j00R4q2r8L53k2
$$ 195 -132 -2 100 19 -92 -283 110 85 -8 -157 -237 64 69 -43 -278 234 51 -49 45 -37 -135 218 196
7614A96P0j25k98K47R0n4J56l77J55j15Q2q3K50m35K97J9n6n0K41on72M45L3j85
$$ 196 266 141 -157 90 180 126 282 -95 60 -55 27 -56 194 -241 56 75 19 -31 210 204 -368 77 110 -75
7638g5q0K65K2J0j58P2q0q4J63k31O5K75l29J86kJ39j13k68M21k59L46m05M55
$$ -75 -155 110 132 142 -16 56 -24 -108 55 -176 -111 164 -165 21 19 158 45 -223 198 -61 285 -120 335
7661C35l18j80J50J98l50K54J43m05L25l59N8J7J87k4J8j13k46L56K38l52p7J09
$$ 335 17 -163 -13 185 -165 89 232 -173 152 -207 -149 -132 55 31 49 -64 -310 46 284 -68 -145 -36
7683c6j22L00j41J44j88K50j67k53N41l22J74j99K0K05j93q5J07j01j58N8L82
$$ -36 -158 142 1 145 -43 207 40 -213 328 6 180 -19 1 206 13 -72 35 -66 -224 -166 216
7704B16j52k0l9K00j25R6j80l2J02j37K06r6Q1K8j57j42J70J84J11m65J57K04
$$ 216 64 44 5 205 80 176 -4 -36 66 -71 135 39 120 148 -9 -151 19 203 314 -151 6 210
7726B10J58l1m26Kj37J83Q3p4Q8l25L88k20m1J23q7J30K16q6l09L79l64K12J29
$$ 210 368 337 -89 -87 -224 -41 42 -32 56 -269 119 -101 -142 -19 -106 24 240 154 -155 224 -140 72 201
7749B01j24l2k07L12p1J64j97J81l12q3M38m08Q5K38k13j89N3M12m13K47r2J18
$$ 201 77 45 -162 150 79 243 46 227 -85 -168 270 -138 -53 185 -28 -217 -164 248 -165 82 -10 108
7771A08r1M5k5j29m4J48L38l78M2j74K00J70k67q2J19l3Q4J32j13j7J0j29K41
$$ 108 17 62 37 -92 -136 12 350 -28 14 -160 40 210 -57 -139 -20 -53 31 163 50 33 43 -86 155
7794A55j48k32J16k3J68l8ok98L91l11K99k28O7J11J18l05M06M3l99L23r3m7r1
$$ 155 7 -225 -109 -132 36 -2 -8 -306 85 -226 73 -155 -88 23 141 -164 242 285 -114 209 116 69 -22
7817b2J16J95l69JJ06m0n7L6Q7p1lj63J91J5NN5M7j80M6L9P3L2m04K15L4K20k90
$$ -22 94 289 -80 -79 27 -13 -70 -34 53 -18 -21 -184 7 22 27 82 129 -51 -5 34 107 139 -265 -50 -16 204 -86
7844h6j86M25k80R0r8K58k11K02J41j71J6j95j6j38J89M6J42M5j64j6J25J5k26
$$ -86 -272 153 -127 -37 -135 123 -88 114 255 84 100 -95 -111 -249 -60 -14 128 173 9 -7 118 133 -93
7867i3J69j15P0J08j96r9K76j08l3j0r5J4K60l09J32kP8j25J31k17K8%m8Q6j86
$$ -93 76 -39 31 139 -57 -156 120 12 -21 -31 -126 -112 148 -161 -29 -31 47 -78 53 -164 -136 -136 -184 -98 -284
7892b84L40P1o1k2K52p9k83M9p0K98m02L16j57J16j26K97m6j69k4j83L25q7M2
$$ -284 56 127 66 44 296 217 -66 -17 -87 211 -191 125 -32 84 -42 255 209 40 16 -167 158 71 113
7915A13k52K29j26J33pN2j91L4K18j07n5k2j12P1J48M2j59O3O6k04j29K17l6q0
$$ 113 -139 90 -36 97 90 142 -49 -15 203 96 41 19 -93 -22 126 168 9 72 138 -66 -195 22 -14 -94
7939i4L21l47J26j2j53K01L0J30k53N18n92K30j90j08L58k91J04k36Q5O8Q3%r8
$$ -94 227 -120 6 -6 -159 42 72 202 -51 467 -125 105 -85 -193 165 -126 -22 -258 -173 -105 -22 -22 -120
7962a20J0J43j06R1L06k34j97Q9Q7n7J05m3j94K62l73K88j91J49M5n7L28n84K19
$$ -120 -110 33 -73 18 324 90 -107 -18 69 12 117 74 -120 142 -231 57 -134 15 60 3 331 -253 -34
7985c4J24j50k5R4Q0j70P3N2K27l16L38l17j08jL1K36j32k70J42J42J03J47l06
$$ -34 90 -60 -85 9 89 -81 -8 44 271 -45 293 -24 -132 -133 -102 134 2 -268 -126 16 119 266 -40
8008d0J29r5J18k3j29K98l16J47j49p2N3j4J7J40q2k5j42K17j84R3J66j12Q8j98
$$ -40 89 -6 112 89 -40 258 -58 89 -60 -132 -79 -93 -76 64 -18 -43 -185 32 -152 -59 107 -5 83 -115
8032a15j74K25J56j2n6j42kJ88lK12p7l77K34P4k45J35j2j43R1P9N3j41O6k6O5
$$ -115 -289 -64 92 80 24 -118 -120 68 65 277 200 -177 57 131 -114 21 9 -134 -43 36 89 -52 14 -12 53
8057E3o0Q9m9l19K00J70j01j91J49m6K05k99M87J00m39J77l05R1J02L5j6J56j62
$$ 53 -7 82 33 -286 -86 84 -17 -208 -59 -105 100 -199 288 388 -51 126 -179 -88 14 49 33 189 27
8080B7k8J03j78K79k07m6J72j76j7l3K41k57q2J89j60J13J74l55N5P1r9K8P7N1
$$ 27 -1 102 -76 203 -4 -50 122 -54 -71 -104 137 -120 -202 -13 -173 -60 114 -241 -186 -115 -214 -186 -109 -58
8104e8L7P8K3p9J66q8P3j50O8J21k51J54j80KK6k6p0K74q1j3mq0Q1K05M5n39J91
$$ -58 -21 57 80 1 167 79 152 2 70 191 -60 94 -86 -84 -58 -84 -154 120 39 26 22 -58 23 228 273 -266 -75
8131g5Q7j08L8N2J3L45r2k48O0n2j51k2M15j77J12o2j64J65q7k65L18q1j9k32
$$ -75 12 -96 -58 -6 7 352 260 12 72 20 -131 -153 262 85 197 135 -29 136 49 -216 102 21 2 -230
8155b30J72J12k7k3J25L2Pk97r4L12n7Kl8j00K39j74j26K82j89L43m57J28J16
$$ -230 -58 54 27 4 129 161 168 -129 -223 89 32 34 -4 -104 135 -39 -165 117 -72 271 -186 -58 58
8178E8j12R8J01m09M24k7j72j7J8J93j71J74l77
$$ 58 -54 44 145 -264 160 133 -39 -56 -38 155 -16 158 -219
8191b19
$$ Imaginary data points
##PAGE= N=2
##DATA TABLE= (X++(I..I)), XYDATA
0@%%%%%%qJ6j6K4l2M0n6P2q8J12j44J76k11K51l04L68m37N17o08P08q20R49j095
$$ 0 0 0 0 0 0 0 -8 8 -8 16 -16 24 -32 40 -48 64 -80 96 -115 136 -168 200 -237 280 -328 380 -440 509 -586
29e86J255j434J638j862K108k382K680l008L373l770M206m682N200n767O385p061
$$ -586 669 -765 873 -989 1119 -1263 1417 -1591 1782 -1988 2218 -2464 2736 -3031 3354 -3707
45c707P801q609R490j0453J1512j2677J3961j5386J6970j8741K0734k2996K5587
$$ -3707 4094 -4515 4975 -5478 6034 -6643 7318 -8068 8902 -9839 10895 -12101 13486
58A3486k8588L2116l6328M1453m7847N6073o7082Q2623j06283J46822k33810P00866
$$ 13486 -15102 17014 -19314 22139 -25708 30365 -36717 45906 -60377 86445 -147365 553501
70E53501m00661p28426J454187j280346N29965M33462j130591R56357j08897p23288
$$ 553501 152840 -575586 878601 -401745 128220 561682 -568909 387448 278551 -444737
80d44737Q62683n87045J09084L74532o44400M99221p184m29856M43729k15533
$$ -444737 417946 -169099 -60015 314517 -329883 169338 162154 -267702 176027 -39506
90c9506o1822L21396l93301J66358K81180n23154M01923p5273l31179O12401m34682
$$ -39506 -101328 220068 -173233 -6875 274305 -248849 153074 77801 -253378 359023 -75659
101g5659q3137N26165o22335L35465Q9352o10703Q08559m64683k13355P31084
$$ -75659 -158796 367369 -254966 80499 169851 -440852 367707 -96976 -310331 420753
111D20753q22770M61906J49190p41694Q69139l32269l64521P22249n92216K04557
$$ 420753 -402017 59889 209079 -532615 336524 4255 -360266 361983 -230233 -25676
121b5676K46147o33941O25460j51659l37558M89125l05761N0692J65281l34141
$$ -25676 220471 -413470 211990 60331 -277227 211898 -93863 -43171 122110 -212031
131b12031K68452P8130l25610K91039o6723j27228K66568l29502J15292K74137
$$ -212031 56421 134551 -191059 99980 33257 -93971 172597 -156905 -41613 232524
141B32524m09908K20566J07306l41379M04157k57313j22261M70047n24639K73765
$$ 232524 -177384 43182 150488 -190891 213266 -44047 -166308 303739 -220900 52865
151E2865J29167m83629N34003k85493j85785N13408m83615J81214K16331m83453
$$ 52865 182032 -301597 232406 -53087 -238872 274536 -209079 -27865 188466 -294987
161b94987M86598j89322k35521M70949l71730J36602J53575l48410L02240l7382
$$ -294987 191611 2289 -233232 237717 -134013 2589 156164 -192246 109994 72612
171G2612k26951K59080j34949m873J69898k72629J70840O0490k55584K05385j9564
$$ 72612 -154339 104741 -30208 -35081 134817 -137812 33028 93518 -162066 43319 23755
182B3755j39658K12629j61583k9182K41420l16742J57724R3126k46583L16075
$$ 23755 -115903 96726 -64857 -94039 147381 -169361 -11637 81489 -165094 150981
192A50981k02499m9194K98240l39182J40142J33571k98353L21699j50361j24501
$$ 150981 -51518 -100712 197528 -141654 -1512 132059 -166294 155405 5044 -119457
202a19457L36310l66056J58532J23491l08906L10959j10316j45850K73311k17954
$$ -119457 216853 -149203 9329 132820 -176086 134873 24557 -121293 152018 -65936
212f5936J4254J66461k42360J88561M79j78079K20167j29282l8684J55697j52790
$$ -65936 -51682 114779 -127581 60980 61459 -116620 103547 -25735 -64419 91278 -61512
223f1512M4554J17604j78778J13681J1595j44825J96058j47650J2912J60809k22965
$$ -61512 -16958 100646 -78132 35549 47144 -97681 98377 -49273 -36361 124448 -98517
234i8517J27850M6032j95694K05408q9276q7241K39242k36977R7025Q7318k35789
$$ -98517 29333 75365 -120329 85079 -4197 -91438 147804 -89173 7852 95170 -140619
245a40619K36293j04045q4086K17456j88159M1455J17778k07323J54027j9633
$$ -140619 95674 -8371 -92457 124999 -63160 -21705 96073 -111250 42777 23144
255B3144j24525K13178j64889K3070J24844j89016J05647L5461j35463J36356
$$ 23144 -101381 111797 -53092 -30022 94822 -94194 11453 46914 -88549 47807
265D7807k4105r2163J47962j22160J3810Q9944j39512J16746r946r1487J28005
$$ 47807 23702 -68461 79501 -42659 -28849 61095 -78417 38329 28383 -63104 64901
276F4901p4530m5813J26003j32034O7436N5646j48952J69053r3297n0626J50083
$$ 64901 -9629 -55442 70561 -61473 5963 61609 -87343 81710 -11587 -62213 87870
287H7870j58069O4731Q3974j58613J22676n246j19517J57057j18639K4558R6498
$$ 87870 -70199 -5468 78506 -80107 42569 37323 -82194 74863 -43776 -19218 77280
298G7280j54867J27234k1326r5396J23986p2064k5891J14975j14739M7513M9566
$$ 77280 -77587 49647 28321 -67075 56911 -15153 -41044 73931 -40808 6705 56271
309E6271j21110J16047n9000l3841J11038r7541K0571O8806j08211N3948K7554
$$ 56271 -64839 51208 -7792 -41633 69405 -28136 -7565 61241 -46970 6978 34532
320C4532j00537J20256o4433k1065R9692j28570O6988K5875j07648J11082j8279
$$ 34532 -66005 54251 -10182 -31247 68445 -60125 6863 32738 -74910 36172 17893
331A7893q2301J26535r0958l373Q5330j28341J05047j6247o3092J11211q4672
$$ 17893 -64408 62127 -28831 -32204 53126 -75215 29832 13585 -49507 61704 -22968
342b2968m377P9901r8169M7657M4309r9395J05488m6707m0288Q8327r2818L9859
$$ -22968 -27345 52556 -45613 2044 46353 -53042 52446 5739 -34549 53778 -39040 819
354H19M3751q1420N5994K0569q8244Q1937k9499m1852Q8547q1985M4783K2718
$$ 819 44570 -36850 19144 39713 -48531 33406 3907 -37945 50602 -31383 13400 36118
366C6118p8450O9469k0277m5926Q7149o1233m128Q1633j08278O6803q483n8790
$$ 36118 -42332 27137 6860 -39066 48083 -13150 -17278 64355 -43923 22880 14397 -44393
378d4393R8707p6652J4197N6046q4284M3083J7128p7348Q3555l3281k9180P1946
$$ -44393 54314 -22338 -8141 47905 -36379 6704 23832 -53516 30039 -3242 -32422 39524
390C9524p5249M1567n243m9605O7325k3527l3425N7089k8367j7120M6017o8003
$$ 39524 -35725 5842 599 -49006 18319 -5208 -38633 18456 -9911 -27031 18986 -49017
402d9017M9969J1130n3244O3496l1435q472L8244n7287K4608N1304q7128N9958
$$ -49017 952 12082 -41162 22334 -9101 -17573 20671 -36616 -12008 39296 -47832 12126
414A2126P756m9668O3676p5023M1651K9587o8591O0188j2487l1447N5769n3964
$$ 12126 19882 -29786 33890 -41133 518 30105 -38486 21702 9215 -22232 33537 -20427
426b0427J103N7504o9943N2033r250k8436N3377n7631J4385L1888l5311R698K5856
$$ -20427 -19324 38180 -31763 20270 11020 -17416 35961 -21670 -7285 24603 -10708 -1010 24846
439B4846m0876K7702L192m7105M5409j3837J68J2811l0586K5217J7113o0857L8919
$$ 24846 -16030 11672 14864 -32241 13168 -669 -501 12310 -18276 6941 24054 -36803 2116
452B116J5415m1447N7428n9221L0977K6041p6212N9539j5925j0560M0881o0859
$$ 2116 17531 -23916 33512 -25709 5268 31309 -44903 14636 -1289 -11849 29032 -31827
464c1827K8702M4384q8747M5622P038k3306M7502o7231M5024J5627n3352L2777
$$ -31827 -3125 41259 -47488 -1866 5172 -18134 29368 -37863 7161 22788 -30564 2213
476B213K44r347K3194j2474j2280L9463l2718k933J9418j1814J5400n205j8880
$$ 2213 2457 -6890 16304 3830 -8450 31013 -1705 -4638 14780 2966 18366 13161 -5719
489e719K6724j506m3894N2616l6825O422M3490p0737M9295j0063k3714L8969m7632
$$ -5719 21005 19499 -24395 28221 -8604 -2182 41308 -29429 19866 9803 -13911 25058 -22574
502b2574K8720L4851p0281M6247L075m0365N2620o1878M2477K1207o2292M8544
$$ -22574 6146 40997 -29284 16963 20038 -20327 32293 -29585 12892 34099 -28193 20351
514B0351k4040J810J5740m1735K0366L4657m2509L080J7175j0457N445j9766J5648
$$ 20351 -3689 -1879 13861 -27874 -7508 27149 -15360 -12280 4895 -5562 -117 -19883 -4235
527d235J3884p109k0215L0165j0144j8624L0833m3462M4953n494l8404M5053l1674
$$ -4235 9649 2540 -17675 12490 2346 -16278 14555 -28907 16046 10552 -27852 17201 -14473
540a4473N969J5534m5312M7362j061m6283O6338n3371J0200L7400o3187N9951
$$ -14473 -8504 7030 -38282 9080 8019 -38264 28074 -25297 -15097 22303 -40884 19067
552A9067k1387n499L4128m5613K6728J3259l8516K6521N785j5000J8450l0027
$$ 19067 -2320 -7819 26309 -19304 7424 20683 -17833 8688 14473 -527 17923 -12104
564a2104J6767J978j6685N466q74J1100j3684Q860k2636K4617L77l5931M7339
$$ -12104 4663 6641 -10044 -4578 -5452 5648 -8036 824 -21812 2805 3182 -32749 14590
577A4590j4371o241J6254k3236K4390j52l7214N4532k5922q118L9340o1741M9089
$$ 14590 219 -6022 10232 -13004 11386 11234 -25980 28552 2630 -5488 33852 -27889 21200
590B1200j5133k7429M5081l8727K2743L394l3930L4670j4043k1170M0636k9225
$$ 21200 6067 -21362 23719 -15008 7735 11129 -22801 11869 -2174 -23344 17292 -11933
602a1933J1817J0697k3767K5559k2097J1612K375n507N860K603J169j9183K1949
$$ -11933 -116 10581 -13186 12373 -9724 1888 4263 -1244 4616 7219 8388 -10795 11154
615A1154j3486l588J5659j4721P658O433k1359J7747r388j0154L5986m5588L4434
$$ 11154 -2332 -5920 9739 -4982 2676 9109 -12250 5497 -3891 -14045 21941 -23647 10787
628A0787J149l7028M6049l5551J1221J3963k7384L0428j1741j8174L3089l1570
$$ 10787 11936 -25092 20957 -14594 -3373 10590 -16794 13634 1893 -16281 16808 -14762
640a4762M579K3842l4098L1414j7627J748J1224k3399K0245q038K581M979J77
$$ -14762 -10183 13659 -20439 10975 -6652 -4904 6320 -17079 3166 -4872 -2291 2688 2865
653B865n716N629J074r887P641M194k643j65L617r984J6128k3914J2543J2600
$$ 2865 -2851 2778 3852 -6035 1606 5800 3157 2992 6609 -3375 12753 -11161 1382 13982
667A3982l0348L7791k7613K052J9861l0264J8766k358o785K1892k5079M631K4801
$$ 13982 -16366 21425 -6188 -4136 15725 -14539 4227 1869 -4916 16976 -8103 -3472 21329
680B1329m1194K8685n836j1033K8601l2669J9798k619j1305J0902r687M040J0836
$$ 21329 -19865 8820 2984 -8049 20552 -12117 7681 5062 -6243 4659 -5028 -988 9848
693I848j2225k900J2885j1712K322o032J1074j468m652K952l384P623j7596J7954
$$ 9848 -2377 -5277 7608 -4104 -1782 -7814 3260 1792 -2860 92 -3292 4331 -13265 4689
707D689j2011L739J5667k6600J7431k014j0413J0656q113L026J6813k8454J9230
$$ 4689 -7322 -3583 12084 -14516 2915 901 -9512 1144 -6969 -3943 12870 -15584 3646
720C646J899k2739L1633k8056J3784J0616j8082J4448j1793M942O987j5557P283
$$ 3646 5545 -17194 14439 -13617 167 10783 -7299 7149 -4644 298 7285 -8272 -989
733i89J6325j9668Q291k461j542P553j5222J2591l340N545p043k27J429j289M586
$$ -989 15336 -4332 3959 1498 -44 7509 -7713 4878 1538 7083 40 -187 1242 -47 4539
748D539j6367K0121k078j0926N748O35k996K694p379R282P194k1290K4315j8366
$$ 4539 -11828 8293 6215 -4711 1037 1672 -1324 1370 -6009 3273 10467 -10823 13492 -4874
762d874L253J3352k3773K0810m825k477M584r598M313O664j7557J3141K764j3260
$$ -4874 -1621 11731 -12042 8768 3943 1466 6050 -3548 765 7429 -10128 3013 5777 -7483
776g483J6857j7936P495p42l140M393o772J0367l876k073n526J1040o396k993
$$ -7483 9374 -8562 -1067 -1809 -4949 -556 -7328 3039 -837 -2910 -8436 2604 -3792 -6785
790f785Q897j990R43k437R61k294P575j2428J2452k873l243J3480k4856J8029
$$ -6785 2112 122 1065 -1372 -411 -2705 4870 -7558 4894 2021 -1222 12258 -12598 5431
804E431j679j0412R137k096P73J715q748M951K789j4989K0693j3831L547P958
$$ 5431 3752 -6660 2477 381 1154 2869 -5879 -928 1861 -13128 7565 -6266 -2719 5239
818E239j4104J1325q661N932p39n42M148J893n850K022N751q973P683j886K820
$$ 5239 -8865 2460 -6201 -269 -1008 -1550 2598 4491 -1359 663 6414 -2559 5124 3238 6058
833F058l549N153n661k408O131r838J2088j2578Q734j583j1208J1254p208q91
$$ 6058 2509 7662 2001 -407 5724 -4114 7974 -4604 4130 2547 -8661 2593 -4615 -5506
847e506L753j08r24L541r903J3212r830j335J6036j8271J6444n698k872N500n542
$$ -5506 -1753 -1861 -2785 756 -9147 4065 -5765 -7100 8936 -9335 7109 1411 -1461 4039 -1503
862a503L066j420J792J715p04p786R691q508M06J029k10M556r840J0735r741M199
$$ -1503 1563 143 1935 3650 2946 -4840 4851 -3657 -3251 -2222 -2432 2124 -7716 3019 -6722 -2523
878b523j652L3M632o414J1006q609Q92N330l801l163Q692m829M136P28q623J4024
$$ -2523 -4175 -4142 490 -5924 5082 -3527 -2635 2695 -1106 -4269 4423 -406 3730 4458 -4165 9859
894I859j6187J1915j640p320J4496j0497J575m62J265r39j621o08R232q945j843
$$ 9859 -6328 5587 3947 -3373 11123 626 2201 1739 3004 2065 444 -164 9068 123 -1720
909a720P044p974O235r725R528k899j87K844j0946J1754o632J017r52L909L071
$$ -1720 5324 -2650 3585 -6140 3388 489 302 3146 -7800 3954 -2678 -1661 -2613 1296 4367
924D367o322n58P050n272l365J0940j0702J1699r439J758M483j2105J3740j1503
$$ 4367 -1955 -2513 4537 -735 -4100 6840 -3862 7837 -1602 156 4639 -7466 6274 -5229
938e229L726M510m882n84p63o75J965l554M87P667j0355J1146r138J494O072o640
$$ -5229 -1503 3007 -1875 -2459 -3222 -3897 -1932 -5486 -4999 2668 -7687 3459 -5679 -4185 1887 -4753
954d753Q585q920J2009m342n325N589r57J244k966K401L594k795n813Q998j0802
$$ -4753 3832 -5088 6921 2579 -2746 2843 1886 3130 164 2565 6159 3364 -2449 6549 -4253
969d253P812k960n470J4898j5360Q897p406J096Q720j3519O890N506n292q7R01
$$ -4253 3559 599 -4871 10027 -5333 3564 -3842 -2746 5974 -7545 -655 4851 -441 -528 373
984C73l443Q922j1400Q848m85o050J1986j4118Q194m135J516J235m364P604o401
$$ 373 -3070 5852 -5548 3300 2815 -3235 8751 -5367 2827 -1308 208 1443 -2921 4683 -1718
999a718P16k02m11j059K074l165O193n964K276K277j2433J8246j2305L075L482
$$ -1718 -1002 -1204 -1615 -2674 -600 -3765 2428 -3536 -1260 1017 -11416 6830 -5475 -2400 1082
1014A082n142R982j3319N380L822n658M601J421o020Q930o994K1N087r178J4200
$$ 1082 -4060 5922 -7397 -2017 1805 -3853 748 2169 -3851 5079 -1915 -1894 3193 -5985 8215
1029H215j3044P542K143r420Q226n985N372l669J362L426l013k217M495m796J839
$$ 8215 -4829 2713 4856 -4564 3662 -2323 3049 -620 742 4168 1155 -1062 3433 -1363 476
1044D76J904l886P978j1015J1146p562k085J0033j2798J1193n532J061K502o508
$$ 476 2380 -1506 6472 -4543 6603 -959 -3044 6989 -5809 5384 -148 913 3415 -3093
1058c093N162p09o395R248k557n267R922j2237R772o784N2Q698j3426J2990o581
$$ -3093 2069 1360 -5035 4213 1656 -3611 6311 -5926 3846 -2938 -2886 5812 -7614 5376 -1205
1073a205j354K978l359K011o59K47K723l438q56N830j0182Q546m889L493J987
$$ -1205 -2559 419 -2940 -929 -1588 -1341 1382 -2056 -2912 2918 -7264 1282 -3607 -114 1873
1088A873p721J1664j2809Q055k63n653P570l235J302m47k901M399r75o558J2270
$$ 1873 -5848 5816 -6993 1062 799 -4854 2716 -519 783 336 -2565 1834 859 -5699 6571
1103F571r647M885J916q828J1829j2365R338k974l220R118p338L85J889r64m99
$$ 6571 -3076 1809 3725 -5103 6726 -5639 3699 725 -2495 6623 -715 -330 1559 595 96
1118I6R65k205P263q544M787m31n642R765j0378P864l627J687J989q846R172l721
$$ 96 1061 -1144 6119 -2425 2362 1931 -3711 6054 -4324 3540 -87 1600 3589 -5257 3915 194
1134A94k139K142J066k31J17n056P263n400r60P552j1342J2986q513j13M311o978
$$ 194 -1945 197 1263 1032 1149 -3907 3356 -2044 -3004 4548 -6794 6192 -2321 -2434 1877 -5101
1150e101Q699p742K451N090m974j331M764n557M121k243j92N779r065J0046q670
$$ -5101 3598 -4144 -1693 3397 -1577 -2908 1856 -3701 420 -1823 -2015 3764 -5301 4745 -3925
1165c925K253L702n041N239n052O289l627j812K637j76j702L019k340J632J857
$$ -3925 -1672 2030 -3011 2228 -2824 3465 -162 -1974 663 487 -1215 1804 -536 1096 2953
1180B953n934P390r327Q969k222o568J1558q306L365l266Q14L505m232J84N347
$$ 2953 -2981 4409 -4918 4051 1829 -4739 6819 -1487 1878 -1388 -574 2931 -1301 -1117 4230
1195D230m313J32K313o186Q197o788M562j544j279N846j0149P330k844R93n91
$$ 4230 -83 49 2362 -3824 4373 -2415 2147 603 -676 5170 -4979 2351 -493 500 -91
1210i1n39L215k655j838K500j028l135P036p194N616l038l34L068p866J0397p184
$$ -91 -630 2585 -70 -1908 592 -436 -3571 3465 -3729 1887 -1151 -1485 1583 -6283 4114 -3070
1226c070J570K629k943K162k023L98N34n18k02M049p006P614m681j768N224n859
$$ -3070 -1500 1129 -1814 348 -1675 -1277 -743 -1261 -1463 2586 -4420 3194 -1487 -3255 1969 -3890
1242c890P858p672N145L63m934L765r62J81PJ414j637K288l994M536m492J787
$$ -3890 3968 -3704 1441 1804 -3130 635 -327 -146 -139 1275 -362 1926 -2068 2468 -2024 -237
1258b37L141n740P094o144M536l756j96M648n875M263m4o41q37J596k736L118
$$ -237 2904 -2836 4258 -1886 2650 -1106 -1302 3346 -2529 1734 1690 1049 212 1808 -928 2190
1274B190m029M334Q2n505Q509q874N218j539j125K826l729M801l432l27Q08Q23
$$ 2190 -1839 2495 2577 -2928 5581 -3293 1925 386 -739 2087 -1642 3159 -273 -600 208 1031
1290A031l503L808j894J019L8k719N068p539O972l525j05L244l743L137m749L836
$$ 1031 -2472 1336 -558 461 499 -2220 2848 -4691 2281 -1244 -1349 1895 -1848 1289 -3460 376
1306C76r32j748J113L062l536J146k82j479M087o092P299n466K813K083o617O028
$$ 376 -556 -2304 -1191 1871 -1665 -519 -801 -2280 1807 -4285 3014 -2452 361 2444 -4173 1855
1322A855l325K148j694P89J876j207k668L409j099k282M468n180N984m307J929
$$ 1855 -1470 678 -1016 -227 1649 442 -2226 1183 84 -2198 2270 -2910 3074 -1233 696
1337F96j18l091O439n897L149l42J218j005j795J862P66j883O62K276m117N139
$$ 696 578 -2513 3926 -1971 1178 836 2054 1049 -746 1116 1882 -1 661 2937 -1180 3959
1353C959o022K715o3j853M353p401P728k916k791J660J36O75j476J44J853J24
$$ 3959 -2063 652 589 -1264 3089 -4312 3416 500 -2291 -631 -495 180 -1296 -1152 701 825
1369H25l968N003n518M687n20l459N408m685M534n737K260K753l626J357J00R90
$$ 825 -3143 1860 -3658 1029 509 -2950 2458 -2227 2307 -3430 -1170 1583 -2043 -686 -586 404
1385D04j849O79j346K802l461M179k353o39M597o148M561m261M580p32l368N337
$$ 404 -1445 -766 -2112 690 -2771 1408 -945 -1584 3013 -3135 1426 -2835 1745 1013 -2355 2982
1401B982k573K81m81L76k35K112l412L701k686J346J557o930Q685n058J578m53
$$ 2982 409 690 209 585 350 2462 -950 2751 65 1411 2968 -3962 4723 -335 1243 790
1417G90l75L557o057K766N11k24j222J602j926K535k535j11J091k089N377p426
$$ 790 415 3972 -2085 681 1192 968 -254 1348 -578 1957 -578 -689 402 -1687 3690 -3736
1433c736N277q72k250J949l623N173l642O22J883j487p56K073l225J734J174k877
$$ -3736 1541 669 -1581 368 -3255 1918 -1724 -1102 781 -706 -1462 611 -2614 -880 294 -2583
1449b583M456o382O998l994j984M825m229L880k780J686j80p99J37O86j643K791
$$ -2583 1873 -4509 2489 -1505 -3489 1336 -2893 987 -1793 -107 -287 -1086 -949 -263 -1906 885
1465H85j35k737M217l631L557m411L100K250n764O374m298K109j090o10K090j845
$$ 885 750 -1987 2230 -1401 2156 -2255 845 3095 -2669 3705 -593 1516 426 -184 1906 61
1481F1Q91J399k256M24K327n266N263l624K452L6l535O478p148L727l84j197J735
$$ 61 952 2351 95 519 2846 -2420 2843 -781 1671 1707 -1828 4650 -2498 1229 845 -352 1383
1498A383j271R39j94j157O20J047l697N461m572J861J02k384L768n681N695l060
$$ 1383 112 1051 857 -300 320 1367 -2330 3131 -1441 420 522 -1862 1906 -3775 1920 -1140
1514a140j76K533k454R44j053M87j97L03n41K748m621M333j817j912M516n160
$$ -1140 -1316 1217 -1237 -293 -1346 -859 -1056 -753 -1294 1454 -3167 1166 -651 -2563 1953 -3207
1530c207N550m716K270J661m581L979j556J17P71p6n64J434l226L956k976j60
$$ -3207 2343 -2373 -103 1558 -3023 956 -600 -483 288 212 -352 1082 -2144 1812 -1164 -1324
1546a324M445o046N329l500J698j33k233M301l934J930O29j070l74J142j839J947
$$ -1324 3121 -2925 2404 -1096 602 469 -1764 2537 -1397 533 1162 92 -282 860 -979 968
1562I68j775J835R29m459O375n959K554M48j651L279m538M437k006j220J740p15
$$ 968 -807 1028 1957 -2502 3873 -2086 468 916 -735 2544 -1994 2443 437 -783 957 242
1578B42r12K419k443J152O11k754M102n972N549j625k245L766l720L089k984J058
$$ 242 -670 1749 -694 458 1069 -1685 2417 -3555 1994 369 -1876 1890 -1830 1259 -1725 -667
1594f67J332j519N75J220k071J327O7k434L485l755M608l434K45L462n457M174
$$ -667 665 -854 -279 941 -1130 197 264 -2170 1315 -2440 2168 -1266 -1021 2441 -3016 1158
1610A158k580J316k58o97J943j590o10J896j307j028L565m057L868l236J776J008
$$ 1158 -1422 -106 -364 -1061 882 -708 -1318 578 -729 -1757 1808 -2249 1619 -1617 159 1167
1626A167m386N840l990K199k49j085J293j167Q41R3p89P25J627l950M367l022
$$ 1167 -3219 2621 -1369 830 581 -504 789 -378 463 556 -233 492 2119 -1831 2536 -486
1642d86P13R17k485M909n976M180j114j333J602j504J145m29Q6J23j54j735L449
$$ -486 227 1144 -1341 3568 -2408 1772 658 -675 927 -577 568 139 225 348 194 -1541 1908
1659A908l970K182P59k624L727m245L780k823L90K192l130K052q8j6p25M92j082
$$ 1908 -2062 120 879 -1745 1982 -2263 1517 -1306 -916 1276 -1854 198 110 94 -631 -139 -1221
1676a221J769k873L361j284j952L866m612L937k830J353J011k340L467k793O78
$$ -1221 548 -2325 1036 -248 -2200 1666 -2946 991 -1839 -486 525 -1815 1652 -1141 -463
1691d63P04n7q77J742j320J551j344J47K088m392N195l093J114N62j595K575l597
$$ -463 241 184 -693 1049 -271 1280 -64 83 2171 -2221 2974 -119 995 1557 -38 2537 -1060
1708a060K466k53n86J46R30j598J136p04m51J564k875M429m453K492j42k116K614
$$ -1060 1406 1153 567 713 1643 45 1181 477 26 1590 -1285 3144 -1309 1183 1041 -1075 1539
1725A539k696K705k142M63P99n44p03J154j118k24J446k251L249l787L206j641
$$ 1539 -1157 1548 -594 -131 668 124 -579 575 -543 -767 679 -1572 1677 -2110 1096 -545
1741e45j513L751l706K503j761J538n99j315J056M49q74M14P16j870K900l294
$$ -545 -2058 1693 -2013 490 -1271 267 -332 -1647 -591 -142 -1016 -602 114 -1756 1144 -2150
1757b150K600j557J84K414m220M256k119O92n11J82J080r57L8O14J06j409K548
$$ -2150 450 -1107 -923 1491 -2729 1527 -592 100 -411 -229 851 -106 -68 546 652 -757 1791
1774A791l460L174j222n18J384k489L655l812J644K63m80N40n40O96p00J10q42
$$ 1791 -1669 1505 283 -235 1149 -1340 2315 -1497 147 410 -70 470 -70 626 -74 36 -806
1791h06J683k199K814j810P5J351k529K867l604L375j071j210J727j330P84j013
$$ -806 877 -1322 1492 -318 -243 1108 -1421 1446 -2158 1217 146 -1064 663 -667 117 -896
1807h96L46l86J175j454J869k442J829O59l327M065k791K432k292J049J392k465
$$ -896 -550 -936 239 -1215 654 -1788 41 700 -2627 1438 -1353 1079 -1213 -164 1228 -1237
1823a237J641o70K85n15J055j481J677j448N84l32r54L392l794K697j025N33j
$$ -1237 404 -266 19 -496 559 -922 755 -693 -109 -441 -1395 1997 -1797 900 -125 408 407
1840D07j570K904k133J119j23K00p80J117j343N83J77o15J633l593L927k563L94
$$ 407 -1163 1741 -392 727 604 804 24 1141 -202 381 558 -57 1576 -2017 1910 -653 -259
1857b59M79j317K558k449J921q10J5r3M07q51J487k22j302J918k083K527l281
$$ -259 220 -1097 1461 -988 933 123 138 45 452 -399 1088 866 -436 1482 -601 1926 -1355
1874a355J983R46k446K349k301K092k092Q61m5k54P6O24o05m58J929k809K541
$$ -1355 628 1574 -872 1477 -824 1268 -824 37 -8 -262 -186 438 -167 -625 1304 -1505 1036
1891A036k003K278j059j066K557l175K671j649P87j68l14K64n65k15M20L41k196
$$ 1036 -967 1311 252 -814 1743 -1432 1239 -410 377 209 -105 159 -406 -621 -201 140 -2056
1908b056L042k188J233p70k55J958l287L518k240R57N71r30N49k60M84m58J59
$$ -2056 986 -1202 31 -739 -994 964 -2323 1195 -1045 -88 483 -447 102 -158 326 -132 27
1925B7l62J727k993K292n82q82J593k349L243k922K030m98j100J355m25M35o76
$$ 27 -335 1392 -1601 691 109 -773 820 -1529 1714 -1208 822 324 -776 579 154 589 -87
1942h7R40j063J273j506K197k056L62J774k601K603k764K181j372l71J814k045
$$ -87 853 -210 1063 -443 1754 -302 60 1834 -767 1836 -928 1253 -119 -490 1324 -721
1958g21J163l90K73j095J152j101J135j348J261K28k305L180l037J975j100M18
$$ -721 442 52 325 -770 382 -719 416 -932 329 557 -1748 1432 -1605 370 -730 -312
1974c12O02j695J851j653P16j99O99j325J417q21L55j55r19K438l391L231j554
$$ -312 290 -1405 446 -1207 -491 -690 9 -1316 101 -720 -365 -520 -1439 999 -2392 839 -715
1991g15K52Q35j314J871k089J335k00j43l41R28q39M37K58r27J588k375L281k460
$$ -715 -463 372 -942 929 -1160 175 -25 -168 -509 419 -420 17 275 -652 936 -1439 1842 -618
2009f18Q54Q16j976J977k075K192j256M48J94o7o07J017l69p36J560k186K294
$$ -618 236 1052 -924 1053 -1022 1170 -86 362 556 489 -118 899 530 -206 1354 -832 1462
2026A462k225J744l89j877K756k328J700j130M44j5m58J83r7k27K09Q48k186K346
$$ 1462 -763 981 592 -1285 1471 -857 843 -287 157 142 -316 -133 -230 -457 -248 600 -1586 760
2044G60k057J490o55p44K538l326K769j263K31N8k07P88m78J59P2M1j078K382
$$ 760 -1297 193 -462 -1206 1332 -1994 775 -488 -257 -199 -406 382 -96 63 135 176 -902 1480
2062A480k526J587k50o97J180k353K991k597J298K59n91N64o49N14m46M48m69
$$ 1480 -1046 541 291 -406 774 -1579 1412 -1185 113 372 -219 345 -304 210 -236 212 -257
2079b57J265k155K601r52p53J713k122K365k352J614n24l95J107j404Q12m67N50
$$ -257 1008 -1147 1454 502 -251 1462 -660 1705 -647 967 443 48 1155 -249 563 96 646
2096F46r02Q26j031J267j356L16J040k534K770k167J906r08j67J348k246J670
$$ 646 -256 570 -461 806 -550 -234 806 -1728 1042 -1125 781 -127 -294 1054 -1192 478
2112D78o40K46l00O35r36O02p19Q30J75j422K749k832K023j260m6R50j613J929
$$ 478 -162 84 -216 419 -517 85 -634 196 371 -1051 1698 -1134 889 -371 -417 533 -1080 849
2130H49j808R09K6N6o16R35p36J70K99q92J827k641K608j801M63Q93j359J739
$$ 849 -959 -50 -24 32 -584 351 -385 -215 84 -808 1019 -1622 986 -815 -352 541 -818 921
2148I21j674J332p05LM22Q8n63O07j9r33J722j896K200k261J043O48j801K050
$$ 921 -753 579 -126 -123 299 387 -176 431 412 -521 1201 -695 1505 -756 287 935 -866 1184
2166A184j967J398j107M03J79m30J59J7n7o63J789k065K012j916J483m32q94K464
$$ 1184 -783 615 -492 -89 90 -340 -181 -164 -221 -884 905 -1160 852 -1064 419 -13 -907 1557
2184A557k626J742r18O61j04n60N17n74p2J32N88j432J761j623P75k83p42J746
$$ 1557 -1069 673 -245 416 312 -248 269 -305 -377 -245 343 -1089 672 -951 -176 -459 -1201 545
2202E45k516K240j289N60R6p48R03n02N64l75N68p18J250j645J489L8r39J470
$$ 545 -1971 269 -1020 -460 -364 -1112 -209 -711 -147 -522 46 -672 578 -1067 422 460 -479 991
2220I91j742K117k004J381j98p80Q63q18O94o18N37o20Q78j257J396r50j79J861
$$ 991 -751 1366 -638 743 545 -235 628 -190 504 -114 423 -197 681 -576 820 -130 -309 1552
2238A552k025J959k134J501l95q43J504r08O27n96K71j76P98j159P35n92L10O23
$$ 1552 -473 1486 -648 853 458 -385 1119 211 838 242 513 337 1135 -24 711 119 429 1052
2256A052j939K084j442R76r91p3J047j692J713j316L56j88N01q33P56k38k02L98
$$ 1052 -887 1197 -245 731 -260 -333 714 -978 735 -581 -225 -413 88 -745 11 -227 -429 -31
2274c1j100J777k280J857n39m00J557j471J416j747P13L75j83k47N78n88p5P55
$$ -31 -1131 646 -1634 223 -316 -716 841 -630 786 -961 -248 127 -56 -303 275 -313 -388 367
2292C67j267J620k102K370j377N55P02j166J497j713J043n29L87N61o20k56M49
$$ 367 -900 720 -1382 988 -389 166 868 -298 1199 -514 529 0 387 948 328 72 521
2309E21L48j179J585j732J620j375O84K50j603K064k084J536p82L76r8k94K13
$$ 521 869 -310 1275 -457 1163 -212 472 722 -881 1183 -901 635 -147 229 131 -163 50
2326E0k3L7k68J176j784J717j523M83J13q76J495j775J789j014p1J20k17L08o08
$$ 50 27 64 -204 972 -812 905 -618 -135 -22 -898 597 -1178 611 -403 -474 -354 -571 -263 -871
2345h71N07j32N19j165J617j426R01m3p19J516j790J668j264Q34K35n45M46k77
$$ -871 -364 -496 23 -1142 475 -951 -50 -93 -812 704 -1086 582 -682 152 387 -158 288 11
2363A1L72o07O98p76R98j278J195n7j028J475j851J705j406R75p6o20J163j023
$$ 11 383 -224 474 -302 696 -582 613 556 -472 1003 -848 857 -549 426 350 -270 893 -130
2381a30O16m67Q64j204R66q48O09o19L5J261k116J838j493J089k49m74Q89j056
$$ -130 486 19 883 -321 645 -203 406 -213 -178 1083 -1033 805 -688 401 152 -322 567 -489
2399d89O37l53L93o33P54o90M42l92p0N31j279K056k135J014j3n69P62j196J684
$$ -489 148 -205 188 -445 309 -381 61 -331 -401 130 -1149 907 -1228 -214 -227 -796 -34 -1230 454
2418D54r38K75j92N58p73O86j49Q4N57j109J547j620J710r53m74J084j180J434
$$ 454 -484 -209 -401 157 -616 70 -79 5 562 -547 1000 -620 1090 137 -337 747 -433 1001
2436A001j311J071o39J25l02M50k69k7O29r60J067j485J819j152M2J034j621J666
$$ 1001 -310 761 122 247 -55 395 126 99 728 -232 835 -650 1169 17 59 1093 -528 1138
2454A138j184Q73n73J4K67j35n2K98o3o94J172j646J508j023K53L56j189J579
$$ 1138 -46 827 254 268 535 400 348 646 583 -111 1061 -585 923 -100 153 509 -680 899
2472H99j614R98p33K00J74n45M01l94K65m40O73j059J304r84M03M31r84J488j599
$$ 899 -715 283 -450 -250 -76 -621 -220 -614 -349 -789 -116 -1175 129 -855 -452 -21 -1005 483 -1116
2491a116J425n03j0P9k51L61j81K95m01K60o48J062j320N47O23j156J416j720
$$ -1116 309 -194 -204 -125 -376 -15 -196 99 -302 -42 -690 372 -948 -401 222 -934 482 -1238
2509a238J834j282K80K49m77O33r8M04n00O42n11P67r33J123l87n12J184j365
$$ -1238 596 -686 -406 -157 -634 -1 -99 305 -195 447 -64 703 -230 893 506 -6 1178 -187
2527a87J367j375O08j8p52J308j136P92n08M27p67N80m09N45n19K29N91j662J670
$$ -187 1180 -195 413 395 -357 951 -185 607 99 526 -241 339 -70 475 -44 185 776 -886 784
2546G84j210Q55o09k79J113j305J327j041L39j05K22n76K11J55m27N90r27J537
$$ 784 -426 429 -180 -459 654 -651 676 -365 -26 -131 91 -485 -274 -119 -546 44 -883 654
2564F54j604J048m38k59J095j398J281j159P38m68K23m1K26k44j85N78j010J542
$$ 654 -950 98 -340 -599 496 -902 379 -780 -42 -510 -287 -328 -102 -346 -531 47 -963 579
2582E79j541J153n06j60J057j411J384r06N42k32K47Rk11L31k49M95m91Q37j256
$$ 579 -962 191 -315 -475 582 -829 555 -351 191 -41 206 215 4 335 86 581 90 927 -329
2601c29J100r72M28M82j453J515j134P33m63L30m7l60M36l13J64k25P32j258J178
$$ -329 771 -201 227 709 -744 771 -363 370 -93 237 190 -170 266 -47 117 -108 624 -634 544
2620E44r56M01J15q27J450j471J295o70k38L84m38L96m16M11m52L67n73J106j032
$$ 544 -412 -11 104 -723 727 -744 551 -119 -357 27 -411 -15 -431 -20 -472 -105 -678 428 -604
2639f04M40Oo48J185j486J388p38M16N47j114P25m32L68l30M79p01R13p32P87
$$ -604 -164 -158 -806 379 -1107 281 -457 -41 506 -608 117 -315 53 -277 202 -499 414 -318 469
2658D69po53R27j389J249r43M95L29p93Q64n96K34k71M87m12L94l98N06m09j46
$$ 469 462 -191 736 -653 596 -347 148 477 -316 548 -48 186 -85 402 -10 384 -14 492 83 -63
2678f3J014j413J313j122Q15j28n52Q40j213Q99N4m38l04M34n08J53J47m28Q36
$$ -63 951 -462 851 -271 544 416 -136 704 -509 390 444 6 -298 136 -372 -219 -72 -500 336
2697C36j285J620r29N47j25l56O43j322J304j067P83q8m18k8L78j2m21N72q65
$$ 336 -949 671 -258 289 164 -192 451 -871 433 -634 149 61 -357 -385 -7 -19 -440 132 -733
2716g33J350j427Q77k96k70P99j086J070p91O97l72j18M07J21Qk18O67j253J106
$$ -733 617 -810 67 -229 -499 300 -786 284 -507 190 -182 -300 107 228 236 18 685 -568 538
2735E38r23Q86o27l4N03r17J157j007Q08o37K20J2j01J23Q7R9m10J093j394J130
$$ 538 -385 501 -126 -160 343 -574 583 -424 384 -253 -33 -21 -122 1 88 187 -223 870 -524 606
2755F06l65j41L93r60J119q44N13k26l6K03m69L23k75K28k33L78q87J091q46J83
$$ 606 241 100 493 -467 652 -192 321 95 59 262 -207 116 -159 69 -164 214 -673 418 -428 -245
2775b45M64p53R83q88J014p20J04L21o22P87o87L76p26O74o28R67p89N0M59j055
$$ -245 219 -534 449 -439 575 -145 -41 280 -342 445 -242 134 -592 82 -546 421 -368 -318 141 -914
2795i14J348j118J026o37K03J91m25M52j67K48n45P82o57N92m49L28k11k79J046
$$ -914 434 -684 342 -295 -92 99 -326 126 -41 207 -338 444 -213 379 -70 258 47 -232 814
2814H14j240J052j235R04k13l55N58l44O65n97L21n24K83r7R5q2M6P26j232J047
$$ 814 -426 626 -609 295 82 -273 285 -59 606 9 330 -194 89 -8 87 5 51 777 -455 592
2834E92q87N41k35j71P91q51N77k80k94J12K88k99J38J34m25O21r23R82j037Q89
$$ 592 -295 246 11 -160 631 -220 357 77 -217 -105 183 -116 22 156 -269 352 -571 411 -626 263
2854B63k28l23M20q74O93o41O57k36on5J54l05j8P92r93R28r64Q66p9k06L72q88
$$ 263 35 -288 132 -742 -49 -690 -33 -269 -275 -330 -176 -481 -499 293 -700 228 -736 130 51 -155 217 -671
2876f71J026o55O60q44N76j8o6J69l67N78r30J200r38M25l19J23N12j022J232
$$ -671 355 -300 360 -484 92 74 8 177 -190 388 -542 658 -280 145 -174 -51 461 -561 671
2895F71q99N25m79J73K58l47N21n91P32q46J033j197Q90k21k46M17o37J207j369
$$ 671 -228 297 -182 -9 249 -98 423 -168 564 -282 751 -446 444 223 -23 394 -243 964 -405
2914d05J158p17L7J00k10L75m93K02l36O55q77N84n50P9M22o68J142j239Q44m86
$$ -405 753 36 73 173 -37 338 -155 47 -289 366 -511 73 -477 -398 24 -644 498 -741 103 -383
2934c83K20K22o33P56l99N73p10N56n03N21l91J31K83p06J039j151Q93o49J62
$$ -383 -163 59 -574 182 -217 356 -354 202 -301 220 -171 -40 243 -463 576 -575 318 -331 -169
2953a69K61m98Q04o83N90m42L43l72L38j85j16M71n85Q41j126J230r66N63m4n42
$$ -169 92 -406 398 -285 305 -137 206 -166 172 -13 -129 342 -243 598 -528 702 -264 299 255 -287
2973b87J071j113P39m04Q4j09L84m66J79L52o39Q48j342J680j175M45k3n58M58
$$ -287 784 -329 410 6 90 -19 365 -101 78 430 -209 639 -703 977 -198 247 224 -334 124
2992A24n69O00l31L04J19k90P1m90L45K87J0k13P38q57N09rr63J031j082R54l64
$$ 124 -445 155 -176 128 247 -43 28 -462 -117 170 180 -33 705 -152 357 348 -615 416 -666 288 -76
3013g6K14k32pQk03J51l26R05r90O10n36O26l97j51O53q19J064q87O36m58J27
$$ -76 138 -94 -101 -93 -296 -145 -471 434 -556 54 -482 144 -253 -404 249 -570 494 -393 243 -215 -88
3034h8L79l50K83k41K38o41J047p44M73k38k08R04j446J417j102P26l60J33R8
$$ -88 291 -59 224 -17 221 -420 627 -117 356 118 -90 814 -632 785 -317 409 49 182 280
3053B80k93J89l51K50j90N18o26L33o6j38J47m71J128j073O41m33m7M29m67M51
$$ 280 -13 176 -175 75 -115 403 -223 110 44 -94 53 -418 710 -363 278 -155 -202 227 -240 211
3073B11n73O71n16N28o30O87k90m64O88p42Q46j295J004l92M0L14n96P51n21M59
$$ 211 -362 309 -207 321 -309 378 88 -376 312 -430 416 -879 125 -267 -227 87 -509 242 -279 180
3093A80m23N30m92L48l81Q7M21q33J095r69P65m92K26J19m44R15j108Q07l29J13
$$ 180 -243 287 -205 143 -238 -151 270 -563 532 -437 328 -164 62 181 -263 652 -456 351 22 135
3113A35j70K38k39J14K80n21Q67j242J298p93K31K48p65P70p82Q69p05J58J01
$$ 135 -35 203 -36 78 358 -163 704 -538 760 -33 198 446 -319 451 -331 538 -167 -9 92
3132I2R4l48J70M08m13L73p41P47p75N78k05j82N94n96O75q92N00J8k02l5M7J2
$$ 92 186 -162 8 416 3 376 -365 382 -393 185 -20 -202 392 -204 471 -421 79 97 -105 -140 -93 -81
3154h1n66Q23p91Q14o58N89m2k76M94j122J004n38N43j85p3K71m06M22l58L26
$$ -81 -647 176 -615 199 -459 130 88 -188 306 -816 188 -350 193 8 -65 206 -200 222 -136 190
3174A90o21J002q74M41p8k15N18r96J234p94L06p4k35J32o4L00l76O73m61P28
$$ 190 -431 571 -303 138 60 -155 363 -633 601 -193 113 39 -196 -64 -128 172 -204 469 8 736
3194G36p52L41k74l31O59p65J023p97N20j47l41L65n29M83k31%k41M80m61M55
$$ 736 -16 325 51 -280 379 -386 637 -160 360 213 -128 237 -292 191 -40 -40 -281 199 -262 193
3214A93k69j51N20p73J154j187J001o18l3K97k73K97j84P0m21K95j49K85m12L12
$$ 193 -76 -227 293 -480 674 -513 488 -130 -163 134 -139 158 -26 44 -377 -82 -231 54 -358 -46
3234d6j6q32Q99o78M96j38m4O49o19M51j13L33n12L93l16J63J49O8j6p33J160
$$ -46 -62 -894 5 -673 -177 -315 -359 290 -329 122 9 342 -170 223 -93 70 219 287 271 -462 698
3255F98j097Q51o03M10j53l19O96q46N71l92L53j43L05k25Q3n3m04P14q37R57
$$ 698 -399 452 -151 259 106 -213 483 -363 208 -184 169 26 331 106 189 136 -268 446 -391 566
3275E66q16L10L18p22P60p28P23n44K80p4K7m7j42P8m10N55o68J194j115L87L04
$$ 566 -250 60 378 -344 416 -312 411 -133 147 73 100 53 -89 -11 -421 134 -534 660 -455 -68 236
3296B36q69J063p56N90n57K53j00m5J02j76K08l96P01o51M64l79N81k29l42N20
$$ 236 -633 430 -326 264 -293 -40 -140 -185 -83 -259 -51 -447 254 -397 67 -312 269 40 -302 218
3316B18o08O30l53J72q6p8J16k28M33k04Q6m15P51o47J95J53j96P79j168J207
$$ 218 -390 240 -113 59 -27 -105 11 -217 216 12 98 -317 434 -213 -18 135 -61 718 -450 757
3336G57r90M32k66L3L18m14K32l3j6l17N77n58N30P0m72N37m85N71p87L94O2l20
$$ 757 -233 199 -67 -34 284 -130 102 69 53 -264 313 -245 285 355 -117 420 -65 506 -281 113 175 -145
3358a45L19l88M75m68L03k28L58n15K53l47K98L46j001R66n14L74k82k9K72j75
$$ -145 174 -214 261 -207 96 -132 226 -289 -36 -383 -85 261 -740 226 -288 86 -196 -225 47 -128
3378a28J28k61K63j55J71m86K05J30j35N72j015J071p37M89m65L94L12q57O49
$$ -128 0 -261 2 -153 18 -468 -263 -133 -268 304 -711 360 -377 112 -353 41 353 -504 145
3397A45m84K68j42M07j50K58k82M9K43n03M66n05O84k73J8K41q73Q03n63P02m86
$$ 145 -339 -71 -213 194 44 302 20 69 312 -191 275 -230 454 181 199 440 -433 370 -193 509 23
3418B3N18n10N4q1k6L08m04Q72j155P59k80mK27m45N81p53O51j91M2p7l19J26
$$ 23 541 31 85 4 -22 286 -118 754 -401 358 78 74 301 -144 437 -316 335 144 186 109 -210 -84
3440h4P2jm52P40m55K49l45K16J68m67O08o88M18l75N25j18j96M52l73J30k79
$$ -84 -12 -13 -465 275 -180 69 -276 -60 108 -359 249 -439 -21 -396 129 11 -185 267 -106 24 -255
3461b55L75m42N01m28O8J76o16Q09o41N32l48M53l9j57L78m71J90k26K25n25Q38
$$ -255 120 -322 179 -249 -181 -5 -621 188 -453 79 -269 184 145 -12 366 -105 85 -141 84 -441 397
3482C97m09R8Nl12M64p04Q85k84K81m44O1L31k68K51m23K92k22K95n31N91l38
$$ 397 -12 86 91 -221 243 -461 424 140 421 -23 38 369 101 352 -71 221 -1 294 -237 354 16
3503A6j30O29j096J193r01O61m47l70Q47m07qJ04r8j11L01l09K53k1l73P88j221
$$ 16 -114 515 -581 612 -289 372 -75 -445 402 -5 -13 91 -7 -118 183 -126 127 106 -267 521 -700
3524g00J068p22J84Q5k45M38o04M73l81O90m56L03m27K43o4J96K99p84Q53n93
$$ -700 368 -354 -170 -85 -330 108 -496 -23 -404 286 -170 133 -294 -51 -115 81 380 -404 449 -144
3544a44L07k70j0M42p05N88m49L41k45M30n38N22l7j26K26o12R68r24N61k39J79
$$ -144 163 -107 -117 325 -380 208 -241 100 -145 285 -253 269 232 106 332 -280 688 -236 325 86 265
3565B65J49o42N20n66O96m74J29J70j42j21mJ54m87P00o41N95m73J87K60p27O87
$$ 265 414 -228 292 -274 422 -52 77 247 105 -16 -20 134 -353 347 -294 301 -172 15 275 -452 235
3586B35p84P53l31M36l14K3Q8k29K01l69M41o10N84l75N4J21l43O42l80L05m58
$$ 235 -549 204 -127 309 -5 18 106 -123 78 -291 150 -460 124 -251 -197 -76 -419 223 -157 148 -310
3607c10M10k77Q2J07l15L68l02L60n52P02n18J02L11n44Q33p33M58n15M06J26
$$ -310 100 -177 -95 12 -303 65 -237 123 -429 273 -245 -143 168 -376 457 -276 182 -333 73 199
3627A99l69K73k51K44j89M41n80M11k31K36p2l93Q08r24J023o10M05k18n14P33
$$ 199 -170 103 -148 96 -93 348 -232 179 -52 184 112 -281 527 -397 626 16 421 203 -311 422
3647D22o78M88k60J97m80N13j85R0J01l23K47l82M84l73J54j32j15N35n48L42
$$ 422 -256 232 -28 169 -311 202 17 107 208 -115 132 -250 234 -139 15 -117 -232 303 -245 97
3667I7k46L96l87J39LJ8j95k77N69l67O00p75L89K14l92N20o95O17m13J37K0J46
$$ 97 -149 247 -140 -1 2 20 -175 -452 117 -250 350 -425 -36 178 -214 306 -389 228 -185 -48 -28 118
3689A18j85J15k1l47O89m97M64o28L06j31J1L08o56P75l36k7J66R4J00k5j42l28
$$ 118 -67 48 27 -320 369 -128 336 -292 14 -117 -106 202 -454 321 -15 -42 124 218 318 293 151 -177
3711a77O31o93N65m16M42k71l6L41m32M46m63J36j40J45j20p3J05N7p7l73Q70
$$ -177 454 -239 326 -90 352 81 45 386 -46 400 -63 73 -67 78 -42 -115 -10 47 -30 -403 467
3732D67n50K91j64MK34m60L30k72L73p4J21l74r6K02j77L23m63K43j33J76o7j28
$$ 467 -83 208 44 48 282 -178 152 -120 253 179 300 -74 -170 32 -145 178 -285 -42 -175 1 -66 -194
3754a94L76k93J77n83N04j49J28j5l3J22m04L08k17L51l22O20n35K39J88n37O40
$$ -194 182 -111 66 -517 -13 -162 -34 -49 -82 40 -364 -56 -273 78 -244 376 -159 80 268 -269 371
3775C71p96M86k26J28K41m77O94o68N70p53P91m31M15n84Q1L18l62N57m53M09
$$ 371 -425 61 -165 -37 204 -273 421 -247 323 -430 361 -70 345 -239 -158 160 -202 355 -98 311
3795C11m55M17k25p2K53m15L88n40N58k23lJ1J6J06k00K06m18N03l17K29j58J46
$$ 311 -144 273 48 -24 229 -186 202 -338 220 -3 -6 5 21 127 -73 133 -285 218 -99 130 -28 118
3817A18R7l53K59j56P4J08m8j19J5n8j97L45p52Q35k40J74J99k53P2l06L27m11
$$ 118 215 -138 121 -35 39 147 99 -20 -5 -63 -260 85 -667 168 -72 102 301 48 120 -186 141 -270
3839b70K67j03L41l16l8J46k16N48n84M61m56L39L4l79L93k75L46k05O7M7q8J64
$$ -270 -3 -106 235 -81 -119 27 -189 359 -225 236 -220 119 153 -226 167 -108 238 33 100 147 59 223
3861B23q0J69n71N41l96L11k01pJ04l43L80n10P02n11M61j06j39K39k05r0j47
$$ 223 143 312 -259 282 -114 197 -4 -11 93 -250 130 -380 322 -189 272 166 27 266 61 -29 -176
3882a76L40m21K89k98K98j46j34K38k19N70p50M55PM9k32j46J95j51J40q2M8J55
$$ -176 164 -257 32 -266 32 -114 -248 -10 -229 341 -409 46 53 102 -130 -276 -81 -232 -92 -174 -126 29
3904B9nk21O5L32k45M67o07L11j99K30r7l41N32l51L07n08M44k90L58j65j03K58
$$ 29 24 -197 -132 200 -45 422 -185 126 -73 157 60 -281 251 -100 207 -301 143 -147 211 46 -57 201
3926B01m85Q37p21J83j44L36q5m23L54k12N10m84M01j95N4J87j99J25n93P41m93
$$ 201 -284 553 -168 15 -129 207 122 -301 53 -159 351 -133 268 73 127 314 115 240 -353 388 -105
3947a05L06l62Q1J84j66N18p09L93k22K84l99J58R4j97m8l8J42k69O96n07L4L74
$$ -105 201 -161 -80 104 -62 456 -253 140 -82 202 -197 -39 55 -142 -190 -228 -86 -355 341 -166 -132 242
3969B42l63L48n75M16k58K14k14L64k76J90j04j21L10n01O75n98L9j2L3L46m25
$$ 242 -121 227 -348 68 -190 24 -190 174 -102 88 -16 -137 173 -328 347 -251 -212 -224 -191 155 -270
3990b70M59l71L20l09K36Jn0N7l11N56p68Q12n38N6K68j60M77n35Q7o8M68m94
$$ -270 189 -182 138 -171 65 66 16 73 -238 318 -450 362 -176 -120 148 -12 465 -70 17 -51 417 -77
4012g7K93j61r9J32k36K11k60O12m39j80L30m68N90m94O21n48J28J05k27K39l43
$$ -77 216 55 -44 88 -148 63 -197 415 -24 -204 126 -342 248 -246 375 -173 -45 60 -167 72 -271
4033b71P64q24L01L1J80j10k37J75r6R6k75K31pO5o8j07K41l53J64n4Qo1N74n47
$$ -271 493 -331 -30 1 181 71 -166 9 -87 9 -266 -35 -42 23 -45 -152 89 -264 -100 -154 -146 -207 367 -180
4057a80K22j38Q0J66n11L90m56K96o0K54n7L4J77l97L82k20L48k95p2J7J09K9
$$ -180 42 -96 -16 150 -361 29 -427 -131 -191 63 6 40 217 -180 202 -18 330 35 -37 -20 89 118
4079A18l34N99n98N27Nm69L44k91L59l34L45n58L83K4j6j1j05J62m48P32m96L00
$$ 118 -216 383 -215 312 317 -152 192 -99 260 -74 271 -287 96 120 104 93 -12 150 -298 434 -62 238
4101B38j84j83L34m74J52Q4J08l67P03l18QK5n09L66m76P45m41q6J23j16L09j38
$$ 238 54 -129 205 -269 -117 -33 75 -292 411 93 101 126 -383 -17 -493 252 -189 -275 -152 -268 41 -97
4123i7L07n05M01k29J72m15L56K45l51k8j75N91m54L57m76R9L73m67L40k14M24
$$ -97 210 -295 106 -123 49 -366 -10 235 -116 -144 -319 272 -182 175 -301 -202 171 -296 44 -170 254
4144B54m16K29k09K4M09m04L50m68K87j89K78j24K96o7m92N88n83O66k17n8N6
$$ 254 -162 67 -142 -118 291 -113 237 -231 56 -133 145 21 317 250 -242 346 -237 429 212 154 210
4165B10k91L32j65K41m79O36n43L79m97J09L82m40K55j81L78o15K96J36m56K91
$$ 210 -81 251 86 327 -152 484 -59 320 -177 -68 314 -126 129 -52 326 -289 7 143 -313 -22
4185b2j16J40p4K01k73K22j60J10K4l06L94p03Q15j85L1k82J11Q8l77M82l84J26
$$ -22 -138 2 -72 129 -144 78 -82 28 52 -254 140 -563 252 67 98 -184 -73 15 -362 120 -264 -138
4207a38N5l2m5K77j93L4L8l46M94j10m3o1j44L45k35K47l42K99k54K61K04n34
$$ -138 -83 -115 -160 117 -76 -42 -4 -350 144 34 -9 -70 -214 131 -104 143 -199 100 -154 107 311 -223
4229b23M8K18L18n73P39q00M36k91j3K29j95J88k88K88l4J11l99K25J47j39R6
$$ -223 -175 43 361 -212 527 -273 163 -128 -141 88 -107 81 -207 81 47 158 -241 -16 131 -8 88
4250H8l18N61n37L89l39J13K64m44M14m11L42n10L19J34j18O4l22J62j17M68n70
$$ 88 -230 331 -206 183 -156 -43 221 -223 191 -220 122 -388 -69 65 -53 11 -311 -149 -266 202 -368
4271c68M23k99L29l4n95N19k99J32K51j34l61K42L21k21P6j61M28m55L51L7q8
$$ -368 55 -244 85 51 -544 -25 -324 -192 59 -75 -436 -194 127 -94 -18 -179 249 -206 145 182 94
4292I4k7n7K51n63M91k00K44j58k11K45k92M94o50M99m05M79j06q3M32l56R1l88
$$ 94 67 10 261 -302 189 -11 233 75 -136 109 -183 311 -339 160 -245 234 128 45 477 121 212 -176
4314a76L33l01L73j92r9K64j61L22m82K66k56M72k50l7J60j83K27o63N70n86N30
$$ -176 157 -144 229 37 -62 202 41 363 -119 147 -109 363 113 76 236 53 280 -383 187 -399 131
4335A31k22M4K76l77M09l67R8p1N4J58j46k46j39L83j97L14l57L13O1m09k3j51
$$ 131 -91 -47 229 -148 261 -106 -8 -79 -25 133 -13 -259 -398 -15 -212 102 -255 58 119 -290 -313 -464
4357d64N84k35N6k99M13j01l35N12k54N4q5K74j53l6O8j84M16l58K23j21J79m57
$$ -464 120 -115 -59 -358 55 -46 -381 131 -123 -69 -154 120 -33 -69 -1 -185 231 -127 96 -25 154 -303
4379c03M58k00k3K76k22M62n44L68m70K35L8K6l6l36M23j10K56m08K85J40j14
$$ -303 155 -45 -68 208 -14 448 -96 272 -198 37 75 101 65 -271 152 42 298 -110 175 315 201
4400B01l8l53M31k61L11m78J67J24l46M34k97J15j27o7o2K04R2k48N00l60j0k90
$$ 201 163 -190 241 -20 291 -187 -20 104 -242 192 -105 10 -117 -184 -246 -42 50 -198 302 -58 -68 -358
4422c58L95k63K63J4J7M0p9O9k24K17m6k0k26K79pk22M56k76M7k05J17J37j61
$$ -358 37 -226 37 51 68 108 29 98 -126 91 45 25 -201 78 71 -151 305 29 76 -129 -12 125 -36
4445c6j67M44J39n05K82j19Q6j56k46L88j66K83k89M66n17J35Q8j27K22j48K36
$$ -36 -203 241 380 -125 157 38 124 -32 -278 110 -56 227 -62 404 -113 22 110 -17 205 57 293
4466B93o17M60k65L50N0m30K60j79K16q3j14l1J29j18N8K34m02N79o69M11j33
$$ 293 -324 136 -129 221 271 -159 101 -78 138 55 -59 -90 39 -79 -21 213 -189 390 -279 132 -1
4487aL3K31l49J88l19M18l84K81j20j57R1n2K47m94O69m52J39l8J6K03l78M03
$$ -1 32 263 -86 102 -217 201 -183 98 -22 -179 -88 -140 107 -387 282 -170 -31 -69 -53 150 -228 175
4509A75n19M63k23Q0j06J33r6J93R2j85N6k18L85k87K86m19j25N27l68M93l11
$$ 175 -344 119 -104 -24 -130 3 -93 100 192 7 63 -155 230 -57 229 -190 -315 212 -156 337 26
4530B6J66j01J38n4j22K99m30K01l30K88k98J09L36J9k1m25L02m6j11J81q3k06
$$ 26 192 91 229 175 53 352 -78 123 -207 81 -217 -108 228 247 226 -199 103 57 -54 127 44 -162
4552a62OM01l55J72j13N15m69N8J4k11L75l44J00l73L51j91N7l9K88M7l86m7R0
$$ -162 -156 245 -110 62 -51 464 -5 53 67 -144 231 -113 -13 -386 -35 -226 -169 -208 80 127 -259 -306 -216
4575b16O3P5P2K2j25L05k84K44k50J2R4j53R7Lp2L03j7j64LL8jL5n8K69k34J21
$$ -216 -153 -78 -6 16 -109 196 -88 156 -94 -82 12 -141 -44 -41 -113 190 173 9 12 50 49 84 26 295 61 182
4601A82j01J10j15J17j20k12L75l83J43k52M36k12J92j99Q2K43l89K39l52J87
$$ 182 81 191 76 193 73 -139 236 -147 -4 -256 180 -32 160 -39 43 286 -103 136 -216 -29
4621b9j92L65j50K2O3k01K28k28J05L8J86k92J25j9l14M49l54J42j36K92j63j07
$$ -29 -221 144 -6 16 79 -122 106 -122 -17 21 207 -85 40 21 -293 156 -198 -56 -192 100 -63 -170
4643a70K86m07M19j21r6k33M41j66j63J62r2K5N3J01k30K54Q1j19j2J06K16m42
$$ -170 116 -291 128 7 -89 -322 119 -47 -210 -48 -140 -115 -62 39 -191 63 144 25 13 119 335 -107
4665a07J31n1J79j19j59L31k82K76l72L51k60K49j13l03M46k40Q4J04q3K3r4K06
$$ -107 24 -27 152 33 -126 205 -77 199 -173 178 -82 167 54 -249 197 -43 41 145 62 85 -9 197
4687A97k35q4O9K30l00L00nj87J25k60L45m44K90k38R6K8q8K12k27M60l57j34
$$ 197 -38 -122 -53 177 -123 177 172 -15 110 -150 195 -249 41 -197 -101 -73 -161 51 -176 284 -73 -207
4709b07J23o3N1K9O6k94N26l96J70J59k34M1n1n8r7L38N3J05l18j69Q3m6J83m3
$$ -207 -84 -147 -96 -67 -1 -295 231 -165 5 164 -70 -29 -80 -138 -235 103 156 261 -57 -226 -143 -189 -6 -49
4733d9J46k73K08k67K95j36O6J64k42K58l01K06k32M15k63L6k89J39K00k05L12
$$ -49 97 -176 32 -235 60 -76 -10 154 -88 170 -131 75 -157 258 -5 31 -258 -119 81 -124 188
4754A88k30J50k3J23j76j97M76j33j71k45k4M11k27J47j15K8n8M11m14J23J99
$$ 188 -42 108 85 208 32 -165 311 178 7 -238 -262 149 -78 69 -46 -18 -76 335 -79 44 243
4775B43m59K26k67M05j49k39K49j07j66K29J56l80L23k49R0M6M1j78Q1L80l73
$$ 243 -216 10 -257 148 -1 -240 9 -98 -264 -35 121 -259 64 -185 -95 -49 -8 -186 -105 275 -98
4796i8J80l2Q2k82K45k53L4K32m48K70k20M77m83L38j13K33J07l55M15l40M4j94
$$ -98 82 50 132 -150 95 -158 -124 108 -340 -70 -290 187 -296 42 -71 162 269 -86 329 -11 33 -161
4818a61L28qk31Q5k17L99m00L65n0J29j38k45K85p9K42j39J74l21P6r9j61L30
$$ -161 167 159 -72 13 -204 195 -205 160 110 239 101 -144 141 62 304 165 339 18 94 -5 -166 164
4840A64l12K97k11R9k53K73k15K77P4k21L13o67P03m21K74p5q0N4k66J56R1O4
$$ 164 -148 149 -62 37 -216 57 -158 119 193 -28 285 -382 321 -100 174 99 19 73 -193 -37 54 118
4862A18j13n8j16M2K84k90J65j38R0r9L07k87J47j80n9J54q4K77k53K79k41L6
$$ 118 5 -53 -169 -127 157 -133 32 -106 -16 -115 192 -95 52 -128 -187 -33 -117 160 -93 186 -55 -19
4884a9J2L0N0k62L17k61m0N7j03L59k34J94k47K66k63K92m2j23J0j57K19J86j36
$$ -19 -7 23 73 -189 128 -133 -173 -116 -219 140 -94 100 -147 119 -144 148 106 -17 -7 -164 55 241 105
4907A05j57R0K07k69K07k58J14l98N44o1j66K04k02L6J25J1k90K39r9J81n9J72
$$ 105 -52 38 245 -24 183 -75 39 -359 185 124 -42 162 -40 -4 121 132 -158 81 -18 163 104 276
4929B76k00m08M10j80K41l02K46j9k77J19j6K69l44R2o2N4K79l12K04k55M08l68
$$ 276 76 -332 78 -102 139 -163 83 64 -213 -94 -110 159 -185 -93 -155 -101 178 -134 70 -185 223 -145
4951a45q5J51L2L5j15L27m33K77m98P83k74J59k32l8M08n54R2J53N0p0r9K69l25
$$ -145 -230 -79 -47 -12 -127 200 -233 44 -454 329 55 214 -18 -56 352 -202 -110 43 93 23 -76 193 -132
4974a32J27L01k79l3J69J5r0L3q3J74j83K12j81J01j59j7K76j60j43k2k4K32J82
$$ -132 -5 296 17 -16 153 168 78 111 28 202 19 231 50 151 -8 -25 251 91 -52 -74 -98 134 316
4997C16m87K84L7j41Lj53J58k08L27j00k51K79k71M33l41R5j58K37j47K3j20K45
$$ 316 -171 113 150 9 12 -141 17 -191 136 36 -215 64 -207 226 -115 -20 -178 59 -88 -65 -185 60
5019F0M6k84J60k58M70Nk10j37L4J54k80J8J72J69j74lpJ12k5p3%j01L93l17K36
$$ 60 106 -178 -18 -276 194 199 -11 -148 -114 40 -240 -222 -50 119 -55 -58 -65 47 22 -51 -51 -152 241 -76 160
5044A60O1k2j31l03L67p9J96k27l9p0l0J7j56N51k49Q7n7r3j99Q1J72l28M96j42
$$ 160 221 199 68 -235 132 53 249 22 -17 -87 -117 -100 -256 295 46 133 76 -17 -216 -135 37 -291 205 63
5068F3K8l21K36l01L08J33j37M2o7J06j44J63L9j23L75o76K04j32J76o5m5M19
$$ 63 91 -230 6 -295 13 146 9 51 -16 90 -54 109 148 25 400 -276 -72 -204 -28 -93 -138 281
5090B81n60N07k58r2o9L47l10J15rk65L55o2J57j20K28k82P8q0l0K50l00J18N1
$$ 281 -279 228 -30 -122 -191 156 -154 -39 -48 -313 42 -20 137 17 245 -37 41 -39 -69 181 -119 -1 50
5113E0kj82K42L3j76K34l99L35o4p5j54J38M8o4J59k59M39k47J04j03K4j17l3
$$ 50 48 -134 108 141 -35 199 -200 135 71 -4 -158 -20 28 -36 123 -136 303 56 160 57 81 -36 -69
$$ [...]
8191a86
##END NTUPLES=NMR FID
##END=
