##TITLE=1H_Bay-J-2312
 DMSO, 8 sc, 
 23.12.2019
##JCAMPDX= 6.0         $$ Bruker NMR JCAMP-DX V2.0
##DATA TYPE= NMR FID
##DATA CLASS= NTUPLES
##ORIGIN= UXNMR, Bruker Analytische Messtechnik GmbH
##OWNER= root
$$ XWIN-NMR		Version 3.5
$$ Mon Dec 23 14:12:21 2019 Russian Standard Time (UT+4h)  she@DPX200
##.OBSERVE FREQUENCY= 200.1315
##.OBSERVE NUCLEUS= ^1H
##.DELAY= (6, 6)
##.ACQUISITION MODE= SIMULTANEOUS
##.ACQUISITION SCHEME= undefined
##.AVERAGES= 8
##.DIGITISER RES= 18
##SPECTROMETER/DATA SYSTEM= spect
##.PULSE SEQUENCE= zg30
##.SOLVENT NAME= DMSO
##.SHIFT REFERENCE= (INTERNAL, DMSO, 0, 15.7039)
##AUDIT TRAIL= $$ (NUMBER, WHEN, WHO, WHERE, WHAT)
$$ ##TITLE= Audit trail, XWIN-NMR		Version 3.5
$$ ##JCAMPDX= 5.01
$$ ##ORIGIN= Bruker BioSpin GmbH
$$ ##OWNER= she
$$ F:/spectra/data/she/nmr/H-F/1/audita.txt
$$ ##AUDIT TRAIL=  $$ (NUMBER, WHEN, WHO, WHERE, WHAT)
(   1,<2019-12-23 14:11:09.37 +0400>,<she>,<DPX200>,
      <created by zg, POWCHK disabled, PULCHK disabled
       configuration hash MD5:
       00 E9 B6 7A A2 85 ED C7 34 08 36 98 17 FE 4E 26
       data hash MD5: 16K
       EC AA 9C 83 33 9F 02 4C 93 94 76 67 A3 98 A7 A6>)
$$ ##END=
$$ 
$$ hash MD5
$$ E1 E7 8A 26 17 2A 61 B2 01 2A 64 24 E8 34 4E BB
##$RELAX= 
##$RELAX= 
##$RELAX= 
##$RELAX= 
##$RELAX= 
##$RELAX= 
$$ Bruker specific parameters
$$ --------------------------
##$DU= <F:/spectra>
##$EXPNO= 1
##$NAME= <H-F>
##$PROCNO= 1
##$TYPE= <nmr>
##$USER= <she>
##$AMP= (0..31)
100 100 100 100 100 100 100 100 100 100 100 100 100 100 100 100 100 100 
100 100 100 100 100 100 100 100 100 100 100 100 100 100 
##$AQSEQ= 0
##$AQ_mod= 1
##$AUNM= <au_zg>
##$AUTOPOS= <>
##$BF1= 200.13
##$BF2= 200.13
##$BF3= 200.13
##$BF4= 200.13
##$BF5= 200.13
##$BF6= 200.13
##$BF7= 200.13
##$BF8= 200.13
##$BYTORDA= 1
##$CFDGTYP= 0
##$CFRGTYP= 5
##$CHEMSTR= <none>
##$CNST= (0..31)
1 1 145 1 1 1 1 1 1 1 1 1 1 1 1 1 1 1 1 1 1 1 1 1 1 1 1 1 1 1 1 1 
##$CPDPRG= <>
##$CPDPRG1= <>
##$CPDPRG2= <>
##$CPDPRG3= <>
##$CPDPRG4= <mlev>
##$CPDPRG5= <mlev>
##$CPDPRG6= <mlev>
##$CPDPRG7= <mlev>
##$CPDPRG8= <mlev>
##$CPDPRGB= <>
##$CPDPRGT= <>
##$D= (0..31)
0 1.2 0 0 0 0 0 0 0 0.06 0 0.03 0 0 0 0 0.0002 0 0 0 0 0 0 0 0 0 0 0 0 
0 0 0 
##$DATE= 1577095868
##$DBL= (0..7)
120 120 120 120 120 120 120 120 
##$DBP= (0..7)
150 150 150 150 150 150 150 150 
##$DBP07= 0
##$DBPNAM0= <>
##$DBPNAM1= <>
##$DBPNAM2= <>
##$DBPNAM3= <>
##$DBPNAM4= <>
##$DBPNAM5= <>
##$DBPNAM6= <>
##$DBPNAM7= <>
##$DBPOAL= (0..7)
0.5 0.5 0.5 0.5 0.5 0.5 0.5 0.5 
##$DBPOFFS= (0..7)
0 0 0 0 0 0 0 0 
##$DE= 6
##$DECBNUC= <off>
##$DECIM= 24
##$DECNUC= <off>
##$DECSTAT= 4
##$DIGMOD= 1
##$DIGTYP= 9
##$DL= (0..7)
0 120 120 120 120 120 120 120 
##$DP= (0..7)
150 150 150 150 150 150 150 150 
##$DP07= 0
##$DPNAME0= <>
##$DPNAME1= <>
##$DPNAME2= <>
##$DPNAME3= <>
##$DPNAME4= <>
##$DPNAME5= <>
##$DPNAME6= <>
##$DPNAME7= <>
##$DPOAL= (0..7)
0.5 0.5 0.5 0.5 0.5 0.5 0.5 0.5 
##$DPOFFS= (0..7)
0 0 0 0 0 0 0 0 
##$DQDMODE= 0
##$DR= 18
##$DS= 0
##$DSLIST= <SSSSSSSSSSSSSSS>
$$ [...]
##$SUBNAM2= <"">
##$SUBNAM3= <"">
##$SUBNAM4= <"">
##$SUBNAM5= <"">
##$SUBNAM6= <"">
##$SUBNAM7= <"">
##$SUBNAM8= <"">
##$SUBNAM9= <"">
##$SW= 24.9337058887773
##$SWIBOX= (0..15)
0 0 2 0 0 0 0 0 0 0 0 0 0 0 0 0 
##$SW_h= 4990.01996007984
##$TD= 16384
##$TD0= 1
##$TE= 0
##$TE2= 300
##$TE3= 300
##$TEG= 300
##$TL= (0..7)
0 120 120 120 120 120 120 120 
##$TP= (0..7)
150 150 150 150 150 150 150 150 
##$TP07= 0
##$TPNAME0= <>
##$TPNAME1= <>
##$TPNAME2= <>
##$TPNAME3= <>
##$TPNAME4= <>
##$TPNAME5= <>
##$TPNAME6= <>
##$TPNAME7= <>
##$TPOAL= (0..7)
0.5 0.5 0.5 0.5 0.5 0.5 0.5 0.5 
##$TPOFFS= (0..7)
0 0 0 0 0 0 0 0 
##$TUNHIN= 0
##$TUNHOUT= 0
##$TUNXOUT= 0
##$USERA1= <user>
##$USERA2= <user>
##$USERA3= <user>
##$USERA4= <user>
##$USERA5= <user>
##$V9= 5
##$VALIST= <valist>
##$VCLIST= <CCCCCCCCCCCCCCC>
##$VD= 0
##$VDLIST= <DDDDDDDDDDDDDDD>
##$VPLIST= <PPPPPPPPPPPPPPP>
##$VTLIST= <TTTTTTTTTTTTTTT>
##$WBST= 1024
##$WBSW= 4
##$XGAIN= (0..3)
0 0 0 0 
##$XL= 0
##$YL= 0
##$YMAX_a= 757380
##$YMIN_a= -228805
##$ZGOPTNS= <>
##$ZL1= 120
##$ZL2= 120
##$ZL3= 120
##$ZL4= 120
##$ABSF1= 10
##$ABSF2= 0
##$ABSG= 5
##$ABSL= 3
##$ALPHA= 0
##$AQORDER= 0
##$ASSFAC= 0
##$ASSFACI= 0
##$ASSFACX= 0
##$ASSWID= 0
##$AUNMP= <proc_1d>
##$AZFE= 0.1
##$AZFW= 0.1
##$BCFW= 1
##$BC_mod= 2
##$BYTORDP= 1
##$COROFFS= 0
##$CY= 11.3945322036743
##$DATMOD= 1
##$DC= 2
##$DFILT= <>
##$DTYPP= 0
##$F1P= 16.9975609425685
##$F2P= -3.02152046262296
##$FCOR= 0.5
##$FTSIZE= 0
##$FT_mod= 4
##$GAMMA= 1
##$GB= 0.15
##$INTBC= 1
##$INTSCL= 1
##$ISEN= 128
##$LB= 0.24
##$LEV0= 0
##$LPBIN= 0
##$MAXI= 10000
##$MC2= 0
##$MEAN= 0
##$ME_mod= 0
##$MI= 1.114404
##$NCOEF= 0
##$NC_proc= 0
##$NLEV= 6
##$NOISF1= 3.799351
##$NOISF2= 2.8
##$NSP= 1
##$NTH_PI= 0
##$NZP= 0
##$OFFSET= 15.70392
##$PC= 1
##$PHC0= -10161.15
##$PHC1= 30.4008
##$PH_mod= 1
##$PKNL= yes
##$PPARMOD= 0
##$PSCAL= 0
##$PSIGN= 0
##$REVERSE= no
##$SF= 200.130013532006
##$SI= 16384
##$SIGF1= 3
##$SIGF2= 2
##$SINO= 400
##$SIOLD= 16384
##$SREGLST= <1H.CDCl3>
##$SSB= 0
##$STSI= 0
##$STSR= 0
##$SW_p= 3612.71676300578
##$SYMM= 0
##$S_DEV= 0
##$TDeff= 0
##$TDoff= 0
##$TI= <>
##$TILT= no
##$TM1= 0
##$TM2= 0
##$TOPLEV= 0
##$USERP1= <user>
##$USERP2= <user>
##$USERP3= <user>
##$USERP4= <user>
##$USERP5= <user>
##$WDW= 1
##$XDIM= 8192
##$YMAX_p= 0
##$YMIN_p= 0
$$ End of Bruker specific parameters
$$ ---------------------------------
##NTUPLES= NMR FID
##VAR_NAME=  TIME,          FID/REAL,        FID/IMAG
##SYMBOL=    X,             R,               I
##VAR_TYPE=  INDEPENDENT,   DEPENDENT,       DEPENDENT
##VAR_FORM=  AFFN,          ASDF,            ASDF
##VAR_DIM=   8192,          8192,            8192
##UNITS=     SECONDS,       ARBITRARY UNITS, ARBITRARY UNITS
##FACTOR=    0.0002004,     1,               1
##FIRST=     0,             0,               0
##LAST=      1.6414764,     0,               0
##MIN=       0,             -228805,         0
##MAX=       1.6414764,     757380,          0
$$ Real data points
##PAGE= N=1
##DATA TABLE= (X++(R..R)), XYDATA
$$ [...]
1935d31O9R26j02j252Q33N86m49r89P77P80n21p30M13R06o25q89N94N48m12m84
1955d52Q2J059p03o13J132K78j061m98R35P78j074n40Q68P54j170m33P79M27p14
1974a66m72J143J31j281r2J412k88j511O90J081r7j355K70R91j43o37j53J035
1992E58l89p53M24N19k60r68P22J095p19j331J067P75m84p06O86N78r35m90J077
2011D66p4o16l54J303Q5j192k03J267Oj200j12J107j79o28L7O95P7q32J55P45
2031E53Q0j378O26J135p48j211Q87Q57m72q71K52J005o90n18O26M76o75l98N58
2050I4L67p23n40J491J59j197q08J370M49p87m66N87N41j025k55O61O46j336J34
2069f38R30J48j344L54J204k91j064K95P98N8j064M1J049l59n94K47Q95n31q06
$$ plain form
1935 -431 -362 564 462 -790 43 629 180 -809 -32 748 227 -503 -90 816 191 -698 -104 444 32 -452
1955 -452 -370 689 -14 -627 505 783 -278 -776 159 937 -137 -677 191 945 -225 -658 121 548 -166
1974 -166 -638 505 636 -645 -737 675 387 -1124 -434 647 550 -805 -535 456 313 -324 -477 558
1992 558 169 -584 -160 359 99 -869 -147 948 229 -1102 -35 740 256 -450 236 814 -121 -611 466
2011 466 392 -224 -578 725 810 -382 -585 682 688 -512 -624 483 304 -324 -287 408 485 -347 -192 553
2031 553 633 -745 -119 1016 268 -943 -56 801 329 -542 -290 715 25 -493 133 609 -66 -464 94
2050 94 461 -262 -802 689 848 -349 -1157 213 662 -125 -591 -4 537 -488 -743 -82 564 -772 -638
2069 -638 292 440 -904 -550 654 363 -701 -406 392 450 -614 -573 476 117 -477 -230 665 134 -672
2088f72N81R74p48j018R30Q49o25q45N66O19o44l23L56O76r27n99J189L68j036
2107c29k97J110L15p64o49J197L3q32j98R50n7p63LR16m99r12P19O59l56o82K87
2128a49O09k5j310M55J056m94o02L58M95j8p84O78M50q57n29J060O3n66l83L38
2148a55O38l68n65L81M00q56J37P89j4n73j96P30L16j043J7N79l4n98K57M35m0
2169B37q70M87L41L14p32J02O20l67o16J85Q22m35q40N95P22m98n40K43L04J3
2189H7o61O83K27n58m51P36J27l86l41P99M1m73l87O79M23l85l55K20K27k94k82
2210c24N43r7m57L75K40J92o56j0P31k92o28Q3O25K02r32L81L34j98l69K10K00
2231A53J99m85K8P44q44m8M27L13k83l69K47k1j44l03L15K17k27k58N63j12j93
$$ plain form
2088 -672 -91 883 135 -883 47 896 271 -574 -8 611 -33 -356 0 676 -251 -850 339 707 -329
2107 -329 -626 484 799 35 -614 583 616 -216 -414 536 479 -284 -281 635 136 -776 -57 602 246 -436 -149
2128 -149 460 435 -875 -420 636 142 -460 -102 393 375 -409 269 719 -138 -667 393 456 -110 -493 -155
2148 -155 483 115 -450 -69 331 -525 -388 401 387 -186 -382 348 664 -379 -362 217 183 -415 -158 277 237
2169 237 -633 -146 195 509 -223 -121 499 132 -484 -299 523 88 -752 -157 565 67 -473 -230 74 87
2189 87 -574 109 336 -222 -673 63 190 -196 -537 262 303 -170 -557 122 545 160 -195 25 252 -42 -324
2210 -324 219 122 -335 40 280 472 -184 -194 537 245 -383 -300 325 527 -405 -24 310 112 -257 -47 153
2231 153 352 -133 -105 639 -205 -253 174 487 204 -165 82 61 -83 -386 -71 146 -81 -339 224 112 -81
2252h1j25M66k25n31K62L18j4l02J14K74J95l50O0K49m7m89L5L67kl85M04J95
2274C88k52n62K16L20J5l06J86j04N2j25p8J74n36L68L56P7n5k55K88Q2k56j14
2296a21M20j75j43R1K9k75M78m27N0L83n44K44j59K43m56L96o0J2l26K42K90l18
2318a26j10N30k31m6k88N09Nm07J61m0N6K71j63m6k06K56K53m06J01l8K5j5j71
2341a26J55k80J26K28K6l83k6L82l6r2n4L5J20k21M76l02j2K9J56j43j41J75p9
2364A3Q7j98K15J14p2l46RQ7K49j06j52L16l67J72J58J5j18l39L17Q3k36j86K90
2387El06M79n03K97k1L69m86O29m18O9k04J14K81m74J96j69K72k77K05L27m40
2408e5k94J41K0M03k86J24j11j30j13M06j36mN2O0N1m88Q7L14p8L6p3L80k05l64
$$ plain form
2252 -81 -206 260 35 -496 -234 84 70 -232 -118 156 351 1 61 310 263 -226 -191 176 174 -211 193 388
2274 388 136 -426 -210 110 125 -181 5 -99 -47 -172 -250 -76 -612 -244 112 189 134 -121 167 249 -7 -121
2296 -121 299 124 -19 72 101 -174 304 -123 -73 310 -234 10 -149 94 -362 34 -26 -14 -340 -98 192 -126
2318 -126 -236 294 63 17 -271 238 243 -164 -3 -43 13 284 121 75 -131 125 378 -28 73 35 60 45 -126
2341 -126 29 -251 -125 103 129 -254 -280 102 66 -26 -80 -45 75 -146 330 28 16 45 201 58 -83 92 13
2364 13 100 -98 117 231 159 -187 -178 -91 158 52 -100 216 -151 21 179 194 76 -263 54 137 -99 -285 5
2387 5 -301 178 -325 -28 -49 320 -166 463 45 114 -90 24 305 -169 27 -142 130 -147 58 385 -55
2408 -55 -349 -208 -188 215 -71 53 -58 -188 -301 105 -31 -35 17 77 128 -360 -273 41 -37 -1 -74 306 101 -263
2432b63K30R4J62l44J27M7k8l23K05Q8q8j29L17k39K43l33n1J78j34L08l69J76
2454a26K21j35l13J07J67m8J63j03j13J13L94r1j55k59J55L94l04K4j82P5J1k22
2476b27N34l06P4l86O20k49k66l5J66K37l86J92k2K15k57J29K82k8n94K07N33
2497D33j75k74j49O71p07k24M32K17Q4o54J95J44J70j77o7K99pn12K51K34m56
2518b72P2K34J56k27j56K90K49n23K01k40J00J64k55K69J2m9k76M77j96l39J56
2539a53L3j0P9j04J42O2k20R5J87P6m41L99%Q2o01M93J56m90k75J36P01m96K42
2562I3j23JOn6L97k6p55J20N01ml99k5K66J00l86p3N91o6j62j0J36k70p4L29Q9
2587B00o1o78J89M92L6l77K03L71n40J27Q5K14k89QJ36j1j7k14J61J59k32M4l74
$$ plain form
2432 -263 -33 61 223 -121 6 53 25 -298 -93 -5 -93 -222 95 -144 99 -234 -285 -107 -241 67 -302 -126
2454 -126 95 -40 -353 -246 -79 -127 36 -67 -180 -67 327 236 81 -178 -23 371 67 91 -91 -16 -5 -227
2476 -227 307 1 75 -311 309 60 -206 -241 -75 162 -224 -32 -54 161 -96 33 315 287 -307 -100 433
2497 433 258 -16 -165 506 -201 -425 7 224 308 -346 -151 -7 163 -14 -81 218 211 -301 -50 184 -272
2518 -272 -200 34 190 -37 -193 97 346 -177 24 -216 -116 48 -207 62 74 25 -251 226 30 -309 -153
2539 -153 -120 -130 -51 -155 -13 49 -171 -76 111 187 -254 145 145 227 -374 119 275 -215 -490 -354 347 -149 93
2562 93 -30 -29 -23 -79 318 292 -463 -343 158 154 -245 -270 -4 96 -290 -363 228 162 0 -10 126 -144 -218 111 200
2587 200 139 -539 -350 142 178 -199 4 375 -165 -38 47 261 -28 -20 116 105 88 -126 35 194 -38 6 -368
2610c68L46l4l29M01J91l80o9K82K30n06J45J64j29M6k29K30L37j15m09N29j73
2631A60n79M12K68k67k36m0N50k07k09K93m2n3k91M4M14k68m41O05K01m97p0K64
2653A1J36p0k34N12m01k60L57p5L80n96J07K91K61q02L24MJ21j1j14K60J66m22
2675e5k58M95j30j47j52O10m92KO5M88m21m97L59L73j86R9j80L54l23j39M40j5
2697B90l91l26M29K47l01j78R6M68m83k7L82R1l29j91M53k54J09l62L37N2m88
2718c76j70P80j71j59J55K04k81p3J94O3l01n4J02K93l49J53J42J68j66l87M12
2739A79j82Q7l03L00j57J53N7l12M76m40j70L96j8m3j70K26J55n20L16Oj61n6
2761a81J45k8K84m73J10L81j07l79P2N64k40n22K05M07j10j96J48qk43L58k71
$$ plain form
2610 -368 -22 -56 -385 16 207 -173 -242 40 270 -236 -91 73 -56 -10 -239 -9 328 213 -196 333 160
2631 160 -419 -7 261 -6 -242 -282 268 61 -148 145 103 50 -241 -197 217 -51 -492 113 314 -183 -253 11
2653 11 147 77 -157 355 -46 -306 51 -24 356 -240 -133 158 419 -383 -59 -55 66 55 -59 201 367 -55
2675 -55 -313 182 52 -95 -247 363 -129 -127 -62 426 5 -492 -133 240 54 153 -27 327 4 -135 305 290
2697 290 -101 -427 2 249 -52 -230 -134 334 -149 -176 206 297 -32 -223 230 -24 85 -277 60 112 -376
2718 -376 -546 234 63 -96 59 263 -18 -91 103 166 -135 -189 -87 206 -143 10 152 320 154 -233 179
2739 179 -3 84 -219 81 -76 77 134 -178 298 -142 -312 84 66 23 -147 79 234 -286 30 36 -125 -181
2761 -181 -36 -64 220 -253 -143 238 131 -248 -176 388 148 -374 -169 238 128 -68 80 72 -171 187 -84
2782h4O41n23j74K16L35n07N3J36k7l09K13q0J20K71m93K66K67k11m09M69nn5
2804A10k14J42j51N4k26K60j93J87mJ78j80J58k6n2q4o18Q27p4l11J36q5M28j46
2827A16j14j77K28p2n3J01K89o29K79J16k41K37k29K62k26J77k68J09L67k86l34
2848c48R1M58l50O4J16J79n81K47O1J75l05P3L7J60q7J36K39l84l19M0L85q9k28
2871b30J52M97m87j63L01j03J39k14K20j57J72j73r9K64j27o1O7J0k20K02j32
2892a42QJ39k14L18j25m8J02r9L27n67N27l07J83R9j98K72j67m39M39L7K27m30
2914e8L44r5l84J57J16m5L1m5J08k02k4K94m06L01P2j43j98J6k98M72j17J51p0
2937b3K7q3P7l16K27J34J79m90L66J06m23o7K06R3K73k21J80J14k35k0j58K58
$$ plain form
2782 -84 557 34 -140 76 411 -96 -43 93 66 -243 -30 -110 10 281 -212 54 321 110 -299 170 165 110
2804 110 -104 38 -113 -59 -285 -25 -218 -31 -35 143 -37 121 95 43 -41 -659 168 94 -217 -81 -166 262 116
2827 116 2 -175 53 -19 -72 29 318 -311 -32 84 -157 80 -149 113 -113 64 -204 -95 272 -14 -348
2848 -348 -257 201 -149 -85 31 210 -371 -124 -63 112 -193 -120 -83 77 -10 126 365 -19 -338 -298 87 -2 -230
2871 -230 -78 419 -68 -231 70 -33 106 -108 112 -45 127 -46 -145 119 -8 -69 -2 8 -212 -10 -142
2892 -142 -134 5 -209 109 -16 -64 38 -61 266 -301 226 -81 102 201 3 275 108 -331 108 145 372 -58
2914 -58 286 191 -193 -36 80 35 66 21 129 -73 -97 197 -209 92 164 21 -177 -161 -459 13 -104 47 -23
2937 -23 4 -79 -2 -318 -91 43 222 -268 98 204 -219 -286 -80 13 286 65 245 359 124 104 -54 204
2959B04n1n31nO44j20j47r7L26l29q1M79m48P2k38O22l28J53n2L1k33J51n6K19
2982A85J15m25J65j39j91K40j38J59K86k20N8M4j77j37R0n9J7j77K64J48j14r7
3004a03%N6O2r9k23K85J09k12L6K88R6m39K21R1k3j86n3L58j35K5J59m70j89K50
3028i6Kj13K42j88J63k41K09J03j51j23J77o0n9J89j74J61ln8m21L67K60k39j28
3051a81N7J80J82k07j45L32k30L4k9Rr9j48J44P8j26j74L58j37K00j89R5P4P4
3074A52k64J87j03J47k91M67J1m32M0j21m9L03n55M92j3m3N4l82P65n39L96l1
3096A91k28M00l83L2q0Q8j83J26p1K58n11N09l44J62J76m4o9o9r5k4M05l54LJ50
3120D5n9lJ30l53K57p8K35k59J89j08J97J4l65k56M04O0J98k58k18K77k81O0J83
$$ plain form
2959 204 153 -378 -383 261 141 -6 -103 223 -106 -187 292 -156 -84 -322 300 -28 125 73 104 -129 22 -34 185
2982 185 300 -125 40 -99 -290 -50 -188 -29 257 37 95 139 -38 -175 -85 -144 -127 -304 -40 108 -6 -103
3004 -103 -103 -47 15 -84 -307 -22 87 -125 -89 199 295 -144 77 168 145 -41 -94 264 129 154 313 -157 -346 -96
3028 -96 -94 -207 35 -153 10 -231 -22 81 -70 -193 -16 -76 -135 54 -120 41 38 -20 -441 -74 186 -53 -181
3051 -181 -124 56 238 31 -114 218 -12 22 -7 2 -97 -245 -101 -23 -149 -323 35 -102 98 -91 4 78 152
3074 152 -112 75 -28 119 -172 295 306 -126 -86 -207 -256 47 -508 -16 -29 -72 -18 -400 365 -174 222 191
3096 191 -37 363 -20 12 -68 20 -163 -37 -108 150 -361 148 -196 -34 142 98 29 -40 -135 -159 246 -108 -105 45
3120 45 -14 -17 113 -240 17 -61 174 -85 104 -4 193 207 -158 -414 -10 50 248 -10 -228 49 -232 -172 11
3143A1J23K85l27o5j74J57M25l95P9o1j7J39l00k41M80K91m89j47L81l05K7j2
3165a35L05j72n5OJ88p0l43J09q2M27m47L87j45J15j8j03K47K72m72M3J05Q7j43
3188A06k68L65k95K5K9J64k49m2M07R5l90l39L12J05l4k06K76Q2p7p1MLJ98j01
3212I9j69J09m31M82k99K52j71J64o9q8J51nj50K81k86K73j2L8j27jL07k12j39
3235cL16j64O2m22K10K90n12J42J66j1N7j10j33L01j62k64J01J86j26o7L19j39
3257C7l32K10r9L4Q2J24k75N04r4l31K07k08l1J04K46k29LL5J4N2k04R1jK27j99
3282c3J78j34k0q0R6K10k25k0O9K12j08j54m6O5J84k74JL08l91JK74k19k11K79
3306c8L7L16k15m8J65p0j29k37J14K88j85K3K07k59l76J42K83Lk12J07j91L58
$$ plain form
3143 11 134 419 92 27 -147 10 435 40 119 58 41 180 -120 -361 119 410 -79 -226 155 -150 -123 -135
3165 -135 170 -2 -57 -51 137 67 -276 -167 -249 178 -269 118 -27 88 70 -33 214 486 14 57 162 249 106
3188 106 -162 203 -92 -67 -38 126 -123 -165 242 337 -53 -392 -80 25 -9 -215 61 143 66 -5 -1 2 200 99
3212 99 -70 39 -392 90 -209 43 -128 36 -33 -121 30 25 -125 156 -130 143 131 169 42 41 348 136 -3
3235 -3 313 149 211 -211 -1 289 -223 -81 85 74 131 21 -112 189 27 -237 -136 50 -76 -143 176 37
3257 37 -295 -85 -184 -150 -68 56 -219 285 191 -140 67 -141 -172 -68 178 -51 -48 -13 1 53 -151 -60 -61 166 -33
3282 -33 145 11 -9 -89 7 217 -8 -28 41 253 145 -9 -55 10 194 -80 -79 229 -162 -161 113 -106 -317 -38
3306 -38 -1 315 100 52 217 147 18 -219 -105 183 -2 21 228 -31 -407 -265 18 21 -191 -84 -275 83
3328H3l17J87j42L41k07k99J88L34l6j92K58j60j20j18L17J01l97M04j21k94J66
3349b4L3m3J01P2l31M77m23J50K05k17J08n5K67l43K47l25O4j95K31J0j05k9l7
3372a62M51m47J42q4j47K03r6pK86j08j21N05m64J45k76K37j97J89k08J06o8K50
3394A29J9k80K04j26j74K51R9j20Q9NJ15l92J25J25j24L49m87K10O3k08L31j96
3416GK39m33Q6L12l68N22o19N5M86j98J20j09L2L4j90j58K49k52j2M02j24J82
3438B63j42k13J00j27J9O2J75l18J97j00R6k34K8L03j78J39J49K1k20J50k10J76
3460A36L1l76K18j16L61m49k4K51L5r3k64M77m18l9p3K13M4J59M8k07K7O4L80
3483C85n07K30L0j11Lj43j07L24p7P1J98m77K55l73J70K62q3j16L82k38l06K27
$$ plain form
3328 83 -234 -47 -189 152 -55 -354 -166 168 132 -60 198 38 -82 -200 117 218 -179 225 104 -190 -24
3349 -24 9 -34 67 139 -192 285 -138 12 217 0 108 53 320 -23 224 -101 -37 -232 -1 9 -96 -125 -162
3372 -162 289 -158 -16 -100 -247 -44 -140 -147 139 31 -90 415 -49 96 -180 57 -140 49 -159 -53 -121 129
3394 129 148 -132 72 -54 -228 23 122 2 91 96 211 -181 -56 69 -55 294 -193 17 80 -128 203 7
3416 7 246 -187 -101 211 -157 365 -254 -199 287 89 209 100 132 166 -24 -182 67 -185 -197 205 81 263
3438 263 121 -92 8 -119 -100 -38 137 -181 16 -84 12 -222 -194 109 -69 70 219 240 20 170 -40 136
3460 136 167 -209 9 -107 254 -195 -219 32 67 -26 -290 187 -231 -270 -343 -130 -86 73 121 -86 -59 5 385
3483 385 -122 108 138 27 30 -113 -220 104 27 98 296 -181 74 -299 -129 133 50 -66 316 78 -228 -1
3505ak8%J18k47m3N31k0n11K19q4jJ38j16L7J88j99J17J14O0k09j08K85j17L4
3529A57k35L35l13j71L14k29L24k36J77j29p5J37k87L56n1k5k42L70R5k37J61
3550A96j47j03K97k85K27m55M41J00l66p3L73k4k16j31j13K56N3k99K98j0O9J02
3572A90j85Q4M2P9k5j05j01J37m15J19J30QJ52J0p6L4L19o07M59k14J89j38l1
3595E5Q0j79J72K9K2r7k25O2Q0j39K21j92K25j52J07k06K67m2N0l06J32p1J33
3618B6J33mj67m5K08r3OP0j20k1J35k23K49k68L66j45j35L63k38j6k12q9K75M8
3642A03l07J68M5j50m3K98j71R1J16j95PK68j67P4L8k91J61O3Mm84J72L32LJ42
3666B77k47Nj41J81j1J31k40k56J33L5M01l57J04r2j02K48p2r3l0K62l05J76k72
$$ plain form
3505 -1 -29 -29 89 -158 -201 330 310 -201 18 -66 -67 71 -45 -8 180 -19 98 212 272 63 -45 240 123 157
3529 157 -78 257 -56 -227 87 -142 182 -54 123 -6 -81 56 -231 125 74 49 -193 177 272 35 196
3550 196 49 -54 243 -42 185 -270 171 271 -95 -168 205 181 -35 -166 -279 -23 30 -269 29 19 88 190
3572 190 5 89 131 210 185 80 -21 116 -299 -180 -50 -42 110 120 44 78 397 -210 249 35 224 86 55
3595 55 135 -44 128 157 179 82 -143 -81 -1 -140 81 -111 114 -38 69 -137 130 88 138 -168 -36 -107 26
3618 26 159 155 -12 -57 151 58 64 134 14 -7 128 -95 154 -114 252 107 -28 335 97 81 -131 -220 55 103
3642 103 -204 -36 9 -141 -184 114 -57 34 150 -45 -38 230 63 137 175 -116 45 108 112 -372 -200 132 135 277
3666 277 30 35 -106 75 64 195 -45 -301 -168 -133 268 -89 15 -77 -179 69 -3 -96 -126 136 -169 7 -265
3689b65J95%k20L16k38P2K08k88J21K59L5n16L62j68J0J5K83o7j36j5J51K62n04
3712a28J01J54k04l7L00J09k53Q9j2j16n9ML80j85j76j30K67j41nK23m75M57j77
3735a4L2J64j13j21J61j30Q7k15K42l72M98j15l24j30j20L49L46q7k06Q8p5j24
3757a79K39k04J79K65l04K40m67L85k50P3j30J58o8M67l77j15R6J86k48L78l28
3778dj96KJ50m1m0K76j42K27l28K17J7j51l76L63J61l57K72j22J88j15M6j57J5
3801i5j8n9K77j15L0o2J91j33n0K96m51L15j36k4J27k49R2K21J03l56J09l8J65
3824A40k20p6o8L50J08k64p7n3K4L33k17j83L49k12JJ19J49j29m5j11lQ5j22R0
3848c2J43O4l93K77P0q5l8J21J30M2j88L2l92P7K30Q2n5j34M33k06pk21k42M27
$$ plain form
3689 -265 -70 -70 -290 26 -212 -140 68 -220 -99 160 195 -321 41 -127 -117 -102 181 114 -22 -37 114 376 -128
3712 -128 -27 127 -77 -114 186 295 42 131 119 3 -56 -52 328 143 -33 -163 104 -37 -42 181 -294 163 -14
3735 -14 18 182 69 -52 109 -21 66 -149 93 -279 219 104 -220 -350 -470 -121 225 138 -68 20 -55 -179
3757 -179 60 -144 35 300 -4 236 -231 154 -96 -23 -153 5 -63 404 27 -88 8 194 -54 324 -4
3778 -4 -200 -198 -48 -89 -129 147 5 232 -96 121 138 -13 -389 -26 135 -222 50 -72 116 1 47 -110 -95
3801 -95 -113 -172 105 -10 20 -42 149 16 -34 262 -189 126 -10 -34 93 -156 -64 157 260 -96 13 -25 140
3824 140 -80 -156 -224 126 234 -30 -107 -160 -136 197 -20 -203 146 -66 -65 54 203 74 29 -82 -85 0 -122 -32
3848 -32 111 175 -218 59 129 44 6 127 257 299 111 143 -249 -172 58 140 85 -49 384 178 171 -50 -292 135
3872A35J79k06l20M32p6o2M9J77k60k58J30m20M18K59l0k9n01M45J97l60k08L92
3894H3k46N1K04k9n9R6k26K02j20j60K19R5j46Pj84K06P2k97O74n72N3j77L52
3917I8L7J45m33J30L0J29k02M11m42J05j20K31r8K13k23J63l58J85N9p0K1k17
3939b06K48k07K68m12L51r1J5K01k63j4J45j16J89k54L5K27j14j01K89k54K66
3960B02k42J45p6j04L73m35P9J64j90J32j4k05L32l24J81J71r8j89K8O7j71J60
3982a4L36r0l64K93l62M94m32O7K60J28l14k2N8j57J88k54L72P9m38K67j00r0
4004i5K61j46j01L9JL9o0P0L68j36k90J81M5m80R5J08J41m9q2j83L28L19m72K08
4028A09J97o4j85%l49K25l9L72rj99j70K25l3r2P0k24K2L50Q5l42k08J83l1K67
$$ plain form
3872 135 314 108 -212 220 144 82 131 308 48 -210 -80 -500 -82 177 147 118 -383 62 259 -101 -309 83
3894 83 -163 -112 92 63 4 100 -126 76 -44 -204 15 110 -36 -29 -213 -7 65 -232 442 -130 -77 -254 98
3917 98 135 280 -153 -23 7 136 -66 345 -97 8 -112 119 21 234 11 174 -184 1 60 -10 11 -206
3939 -206 42 -165 103 -309 42 -49 -34 167 -96 -110 35 -81 108 -146 -111 116 2 -99 190 -64 202
3960 202 -40 105 29 -75 298 -137 -58 106 -84 48 34 -171 161 -163 18 189 91 -98 -70 -3 -174 -14
3982 -14 322 232 -132 161 -201 293 -139 -72 188 316 2 -20 38 -119 69 -185 187 266 -172 95 -5 -95
4004 -95 166 20 -81 -42 -41 -2 -62 8 376 240 -50 131 176 -304 -209 -101 40 -9 -91 -274 54 373 -99 109
4028 109 306 242 57 57 -292 -67 -106 266 257 58 -112 113 80 -12 58 -166 -144 206 291 -51 -259 -76 -107 160
4052A60j09j59J59K4j01K97k12j62pJ82p9n8P1NJ02j82M8kJ82j68K02j44N13l20
4076B42P0q5k58P7o4j83L33J30j11k50K56j84j22J51O4O9j24j65K29k23L45k95
4098i8J30j68J69o0j38M23k32k70L28m5l63K93J94n1j95K55k11k31L95n2q0m2
4120d9O0L9j04k68J31M48n54J63J03KJ02J34j16k68J05J09J0J39k20O6j33K29
4142A28J39k70j9K79l0k86j42J19L08k82J71k34J41n6o0Q5r1M26l03M3k17K61
4164A10l3q7J3l1K20l3Q2l31Q2j0j33J24O5j8LJ03N0l80K41J91j29j73J09P5j95
4189h5j69L50n9j83L65l26o3K10K4J05j09J5k32P1M18l27j63K85k88j21K51L45
4211C14l47k41K55K43J36j23l21n5O3J17J55j58k08M72m6k62K45k73K81m26J61
$$ plain form
4052 160 51 -108 51 75 -26 271 59 -103 -110 72 -7 -65 6 11 113 -69 -21 -23 159 -9 193 49 562 242
4076 242 312 227 -31 46 -18 -201 132 262 151 -99 157 -27 -149 2 66 135 11 -154 75 -148 197 -98
4098 -98 32 -136 33 -27 -165 258 26 -244 84 39 -324 -31 163 112 -83 172 -39 -270 125 73 -7 -49
4120 -49 11 50 -54 -322 -191 257 -297 -134 -31 -29 73 207 91 -177 -72 37 47 186 -34 32 -101 128
4142 128 267 -3 -22 257 227 -59 -201 -82 226 -56 115 -119 22 -34 -94 -9 -100 326 23 66 -151 110
4164 110 77 -10 3 -28 192 159 241 -90 -8 -18 -151 -27 38 20 23 126 176 -204 37 228 99 -74 35 110 -85
4189 -85 -254 96 37 -146 219 -107 -170 40 64 169 60 75 -157 -86 332 5 -158 127 -161 -282 -31 314
4211 314 -33 -274 -19 224 360 237 -84 -139 -76 41 196 38 -170 302 256 -6 239 -34 247 -179 -18
4232a8l08J13K47p6j00K93n10K85jl22M03j36K62o4L5m19J82J59j00J72r8k15
4254b16J22J87NO1p7K4j98k17L66J8P9M0m38K96j92L19j4k24K83j58l63L63K43
4277C09k00j46j30N23o80M80n7k37R0J46j6j01j80K39J5Pn1J01J4l84n6L80j06
4300d0Q4l06J99J3j3j25J10K29m4J33l03J09Q7P8k92P8n5J27k05J09J16j33o2
4323a06P6m5M5J38j46j59K64N2R3k67L9N7J47N1j83RJ02J42l75Q6o5J59k59k11
4347c56K57J76O6m77K94L6p1J21K23l24O2jn6R9j02j68J51J31j11O4m32O44j90
4370C6Q8k72L60p6l54J78RJ37j53M7m62M68j0J58k19K23m58M01p0K23j61p1J23
4393A45j01L4k5j08nP1J2KQN0K8j32j58R8K75r7j5J24l3k17r3J24J73k70j54K65
$$ plain form
4232 -18 -326 -213 34 -42 -142 151 -359 -74 -75 -397 6 -130 132 68 103 -316 -134 25 -75 97 -1 -216
4254 -216 -94 93 98 159 82 106 -92 -309 57 75 154 194 -244 52 -140 179 165 -59 224 66 -297 66 309
4277 309 109 -37 -167 356 -324 156 99 -138 -48 98 82 -19 -199 40 55 62 11 112 126 -258 -314 66 -40
4300 -40 44 -262 -63 -50 -63 -188 -78 151 107 240 -63 46 133 211 -81 -3 -58 69 -136 -27 89 -44 -106
4323 -106 -30 -75 -30 108 -38 -197 67 119 212 -55 -16 41 188 239 56 65 167 309 -66 20 -45 114 -145 -356
4347 -356 -99 77 143 -334 -40 -4 -75 46 269 -55 7 6 -50 49 -53 -221 -70 61 -50 14 -418 226 36
4370 36 124 -148 212 136 -218 -40 -31 106 -47 0 -462 6 -4 154 -65 158 -300 101 31 254 93 22 145
4393 145 44 78 53 -55 -60 11 23 25 33 83 111 -21 -179 -81 194 97 82 206 173 -44 -137 -13 160 -110 -264 1
4419AJ58k28J10Q7p1n6Lr0K29j7p8L4k79M09m66J19j3L25j14r1k61M89k61L14
4443B53k53K68n16N30j69J09m38L18K4r8k37K42K7M49n44K1P2k81j45K91l8p7
4465a92K66N8J91k49J69k12j77K19l98N58j07j45N1j69K32j27K67m06K20k54J56
4486d9m19L67L44k46N9O2j99J21j56P5L3J30j91J07n5O7k46J5M50jj09k5p5p6
4510a7j26r7J87j53l6K79J93j08r4n34N97lk04J11O6r9J23M3p0j56N04l15k5j91
4534a25R2L2j14L35n2J3k7j53k97L41k9l7J87L4q7n3M0l08J13k5p7K4M22k11K17
4559B55k40k00M7o4J36j37J71jK28L8k05L27l42L90j08l08J82R6k63r0J19p5K07
4582A63j17l89K65M12m60K29r3n8L16k40Q5k62J09j54J96pj9NK00j24K75l90J67
$$ plain form
4419 1 159 -69 41 128 57 1 4 -86 143 126 48 82 -197 212 -254 -135 -148 177 63 -28 -289 200 -61 253
4443 253 0 268 -248 282 113 222 -216 102 126 28 -209 33 60 509 -35 -14 58 -223 -368 -77 -115 -192
4465 -192 74 132 323 74 243 31 -146 73 -325 233 126 -19 32 -137 95 -32 235 -171 49 -205 -49
4486 -49 -468 -101 243 -3 56 118 -81 40 -116 -41 -8 122 -69 38 -17 50 -196 -181 269 268 159 134 59 -17
4510 -17 -143 -240 -53 -206 -242 37 230 122 28 -506 91 88 -116 -5 61 -38 85 128 58 -98 406 91 66 -125
4534 -125 -33 -1 -115 220 168 181 154 1 -296 45 16 -21 166 200 113 60 100 -208 -95 -120 -197 -173 249 38 255
4559 255 15 -185 -138 -202 -66 -203 -32 -33 195 233 28 355 13 403 295 -13 169 265 2 -88 31 -44 163
4582 163 46 -343 -78 334 -126 103 10 -48 268 28 113 -149 -40 -194 2 -5 -24 -19 181 57 332 -58 109
4605A09R5oj64l52K76J6q7r5K51k29K31k91J29O3j00Q7N5L10l31k23P4L42k53
4628i3j26L79j58L26l97J54j52j08L31M2k11j57J22J66l1j97L62l71M63l94K52
4649B02l98M52m63L04J9R2j99j19L85m49j14L06j5m9j85K62l9m7J37Qm9l21P4
4672b06L04l31L95l47J80l20J09n4M00j69J96j15j81n6K22j71K24q5Q5J12k36
4693d4J97r1K6r2m07M03J29k88K99r5j51J85m7J34p8j93k90L84r2j07J91j23O0
4716i0O8J52k33Mj29o9K23J62r1P5k22K36k23L82o05O01l01q8P5K87r6p6k44R2
4740a10K19k38K67l44J51J09j53M0j30J59n5K35R5l99J95j08K43k58N7q3M5L7
4762b6J74l84K94j9k16J35L2J44l44L41j80j60N05j97M0j98L53k80j04p7K56m9
$$ plain form
4605 109 204 198 34 -318 -42 -26 -113 -208 43 -186 45 -246 -117 -54 -154 -67 -12 298 -33 -256 -182 160 -93
4628 -93 -219 160 2 328 -69 85 -67 -175 156 198 -13 -170 -48 118 87 -110 252 -119 344 -50 202
4649 202 -196 256 -207 97 116 208 9 -110 275 -174 -288 18 3 -46 -231 31 -8 -55 82 90 41 -280 -206
4672 -206 98 -233 162 -185 -5 -325 -216 -270 130 -39 157 42 -139 -195 27 -144 80 -5 80 192 -44
4693 -44 153 62 88 -4 -411 -8 121 -167 132 37 -114 71 24 158 80 -113 -403 -19 -111 -218 -27 -150 -90
4716 -90 -22 130 -103 -99 -228 -297 -74 88 -3 72 -150 86 -137 245 -360 241 -60 -148 -73 214 118 42 -202 -110
4740 -110 109 -129 138 -206 -55 54 -99 -59 -189 -30 -85 150 245 -154 41 -67 176 -82 -25 -108 -63 -26
4762 -26 148 -236 58 39 -177 -42 -10 134 -210 131 -49 -209 296 99 139 -59 294 14 -90 -167 89 40
4784D0Q2j54J68j9j85o8J52M9p0N5l88J52N3r6K98J36k21p0Q2q2J79r2j95J06
4808h8O7k5L7P0J10m12r2L04K07k30n3Q1L1q1K09l70J52M15k06k48n0K46J87k06
4832E5j13k98L09R4k53M16q9q8p8L06k98J15k6l69J96M65m54K07n8l5p7%J26J42
4856A95k74M4l2K87M3j39k07n2L09k51K07n87L79J52k01l97O49k80L3L28m30J19
4878a05K6j0R4K5J05L0l3K60l60j91K90j28j04L68o9l69J48k1m8O0k8N3J38r8
4902C3%j4Nk47J09L05k27L55n75LJ08J66l36M48Nj39k47L26k29J29J08l00J54
4925f0j64L19k29J3J55m6K7J19j73n5L14k77J95k08l7J24j97K11l4r4K14K0l61
4948b24M73l08J04k4m2R0n4l12P0J67K0N0J1j5n3K93l99K20L3l62K20r5q4M59
$$ plain form
4784 40 122 -32 136 117 -68 -136 16 65 -5 50 -338 -186 -133 -229 69 205 -16 -86 -4 -86 93 1 -194 -88
4808 -88 -21 -46 -9 61 171 -241 -333 -29 178 -52 -105 -24 7 -74 135 -235 -83 332 126 -122 -172 74 261 55
4832 55 -58 -356 -47 47 -206 210 121 33 -45 261 -37 78 52 -317 -121 344 -110 97 39 4 -73 -73 53 195
4856 195 -79 -35 -67 220 263 124 -83 -135 174 -77 130 -457 -78 74 -127 -524 125 -155 -122 206 -224 -105
4878 -105 -79 -89 5 30 135 165 132 392 32 -159 131 3 -101 267 198 -171 -23 -44 -92 -32 -60 -7 131 33
4902 33 33 19 24 -223 -114 191 -36 319 -256 -253 -145 21 -315 133 138 -1 -248 78 -151 -22 86 -214 -60
4925 -60 -224 95 -134 -121 34 -12 15 134 -39 -94 220 -57 138 -70 -107 17 -180 31 -3 -97 117 137 -224
4948 -224 249 -59 45 21 -21 69 15 -297 -227 -60 -40 10 21 6 -47 246 -153 67 100 -262 -42 -137 -221 238
4972B38k2k55J56l20L08M9k28J05p4l5J66r6j50K79k84L40j74o4L5K08K23n53
4994a48L85p3j8l6j2j41K2o9M58n21J50P8P8l68J53K43o1k92L07j28L20l11J76
5017A92J15n72L91m04J34K7q3q4K21L69m53M55m69k9L87r0j25J19j05j21k7K42
5039I0k07R1P2j68L26j79j78J65q2n0Q5J84o7o4j84MK79k56K29lj1j53L6J47L39
5064D45l69j47K3k18K99K3q8r8Q0j25P5J7l6p9L3K92k90O5Pj26L04k18l6J48K34
5089B15m4j43l22K10K23o7n3k06K45j32J16L1Ol36K31J00K71m52J92ll85N65j85
5112G7k19J06j25K34j58L15k96oK35M2K1j44K40l68q5P9N2K7j88K89j06J11k48
5135a15Q4P1k2Q8K94k61k23nK00L0j37K39m19K9K26P5m9j33K25k93L36l07J82
$$ plain form
4972 238 216 -39 117 -203 105 154 -74 31 -43 -78 88 -8 -158 121 -163 177 3 -61 -26 182 405 -148
4994 -148 237 164 146 110 98 -43 -21 -90 368 -153 -3 75 153 -215 -62 181 120 -172 135 7 327 16 192
5017 192 307 -265 126 -278 -144 -117 -200 -284 -63 306 -147 308 -161 -190 197 107 -18 101 -4 -125 -152 90
5039 90 -117 -26 46 -122 204 25 -153 12 -70 -120 -35 149 82 18 -166 -162 117 -139 90 87 76 -77 -41 106 445
5064 445 76 -71 -48 -266 33 56 -32 -130 -50 -175 -100 -83 -119 -198 -165 127 -163 -98 -91 -217 87 -131 -167 -19 215
5089 215 171 28 -294 -84 139 72 19 -187 58 -74 42 73 79 -257 -26 74 345 -107 85 82 -303 262 77
5112 77 -142 -36 -161 73 -85 230 -66 -72 163 205 226 82 322 -46 -131 -52 0 27 -161 128 22 133 -115
5135 -115 -31 40 18 106 400 139 -84 -89 111 141 4 243 -176 -147 79 154 105 -28 197 -96 240 -67 115
5158A15k00pK38l54L10r5M6j98M36m86j83M03j43J64K3l6Lj57K56j85J0P8l3K93
5182B98m14J09L2J81r4J53r8l63K91p7M7j55K32j20n5K4N1j26J32l0k21K38P9
5205A14k53J18K2J12M7K95j59j85k44j93O00j58Qnl1j60K34m41L65k85L21j27
5227enj12K65k9l20N10k06j00k52N16k58J14k68n2P9Q9J48j64k7l6M4L52m06O62
5251E39m96p2k10K53K00m25L05k40J41J46k95J38J6l76L22r3K04M5J53k15m0O2
5273F2r7r8j41L26k33M67j43k43p0K15N4o8l19N30p1l89J77j61L26P9l48J88j18
5296g5J95j83J54J16J06l68J89k56L08L5j58J2J02r9N4j53J76M5k44N0J42J81
5318C29l24k90M94o5k78L05L1o3k03J65l61K54L2p8Nk2r5P4J07jj73j1j2L44m3
$$ plain form
5158 115 -85 -92 146 -208 102 7 53 -145 291 -195 -378 25 -118 46 69 33 36 -121 135 -50 -40 38 5 298
5182 298 -116 -7 25 206 112 265 167 -196 95 18 65 -90 142 22 -33 -9 42 -84 48 18 -203 35 114
5205 114 -139 -21 1 113 160 455 296 111 -133 -326 274 116 124 119 88 -72 162 -279 86 -199 122 -5
5227 -5 -10 -122 143 114 -206 304 98 -2 -254 262 4 118 -150 -202 -123 -34 114 -50 -77 -113 -69 283 -123 539
5251 539 43 -29 -239 14 214 -211 94 -146 -5 141 -154 -16 0 -376 -54 -147 57 102 255 40 0 62
5273 62 -35 -133 -274 52 -181 286 143 -100 -170 45 99 31 -288 242 171 -218 -41 -202 124 203 -145 43 -75
5296 -75 120 -63 91 207 313 -55 134 -122 186 221 63 75 177 78 132 -21 155 200 -44 6 148 329
5318 329 5 -285 209 144 -134 171 202 139 -64 101 -260 -6 26 -52 -47 -69 -164 -90 17 16 -157 -168 -180 164 121
5343A21j59J29n8j23M70o79K81l23K50J40k37J54J09k20n6K60k01J81j69j31L83
5364A22p6J22j09J1k22R7J0J3j09K46J45m28M7J03K47j31p7l3j21j19L9J92J54
5387A23p7J70k47M3k98K74j67L52l06K46m18J92L34m07R8r0L95k21K28m18J35
5408e9J35J57m48L45k32j8Q6k52N1K17J30k89L31R7M5k65J48l42J69J05j67L8
5430a8K21k86J82L2Mj41j1q5K00j18j80P4l1J27o2K35k34r8J55K31k76M17l31
5453Gk01J20J40m8j27J83P0q3k18J90J8k1Jj30K3L12o2J05l19k1K71oj4R1k62
5478A9K79j31j60l8l1l2J80qk61J39J8K9k8q7j16K73j26L6J4r5K11k43J40J7J50
5503A49m41M20l06K46j06l1K50j34L1l8M5o2K04o5k92m0J62o1K10k28K16J11m04
$$ plain form
5343 121 -38 91 33 -90 380 -299 -18 -341 -91 49 -188 -34 75 -145 -201 59 -142 39 -130 -261 122
5364 122 46 168 59 70 -152 -55 -45 -32 -141 105 250 -178 -131 -28 219 88 11 -22 -143 -262 -223 -31 123
5387 123 46 216 -31 12 -286 -12 -179 173 -133 113 -305 -113 221 -186 -88 -178 217 -4 224 -194 -59
5408 -59 76 233 -215 130 -102 -120 -34 -286 -235 -18 112 -177 154 251 296 31 179 -163 6 111 -56 -18
5430 -18 203 -83 99 131 135 -6 -17 -102 98 -20 -200 -126 -157 -30 -92 143 -91 -189 -34 197 -79 338 7
5453 7 -194 -74 66 18 -109 74 144 61 -157 33 51 30 31 -99 -76 236 174 279 -40 -61 210 204 190 281 19
5478 19 298 167 7 -31 -62 -94 86 78 -183 -44 -26 3 -25 -112 -228 45 -81 -45 -31 -126 85 -158 -18 -1 149
5503 149 -292 128 -178 68 -38 -69 181 47 78 40 85 23 227 162 -130 -170 -8 -69 141 -87 129 240 -164
5526a64J83N2r3R8J11j32o6P7J97n43K53K08n9j81M05n36O1O2j35L46j71R0k59
5549a96R9J51Q9J46o4P9k74J05l61K60J45k89m8m2K29J64l37J67j85N6J10k96
5571b92J28l3J74L7LK52k62q8m8K11k9l00M48n18M93p8j90j04K99j50l0Q0R5j13
5595a5q4N05n01o0J05m8M9J64k47L49m51K00j10M6L04l71N20m64J68r6J5m8Q6
5618A6Q6k05k71L69q2O5RJ34J2m28J77R9J42m00L68m8L9M1l8J10k30K0r3qj67
5643b83N04k01j8J47j53J33j85K46k09K70l16P8J0k77P85n41j92RQR3K39k32N3
5666c2k7j0K2k42O83k47r1j22k71L94L1j8o8K9m9J38k11J58p1LJ85n11K34K21
5690A28k79K73j07j2K5q4j57j00M29l13J94k0J00k86R0J11k5L1K6O5k6k01R9P5
$$ plain form
5526 -164 19 71 -22 76 187 55 -11 66 263 -280 -27 181 122 -59 346 -190 -129 -67 -202 144 -27 63 -196
5549 -196 -97 54 143 289 225 304 30 135 -226 34 179 -110 -158 -200 29 193 -144 23 -162 -106 4 -292
5571 -292 -164 -197 -23 14 17 269 7 -81 -129 82 53 -247 201 -317 176 98 -92 -196 103 -47 -77 3 98 -15
5595 -15 -99 406 -95 -155 -50 -98 -49 115 -132 217 -234 -34 -144 -98 206 -165 355 -109 59 -37 -22 -70 16
5618 16 102 -103 -374 -5 -87 -22 -13 121 133 -295 -118 -19 123 -277 91 43 82 123 85 195 -35 -15 -108 -116 -283
5643 -283 221 20 2 149 -4 129 -56 190 -19 251 -65 13 23 -254 531 -10 -202 -193 -185 -92 147 -85 -32
5666 -32 -59 -69 -47 -289 394 147 56 -66 -337 57 88 70 2 31 -18 120 -91 67 -4 -1 184 -327 -93 128
5690 128 -151 122 15 3 28 -56 -213 -313 116 -197 -3 -23 77 -209 -119 -8 -33 -2 24 89 63 -138 -39 36
5714C6l92K62J12K22l76R5j99K62P3N5j08o3L21l10J61j62K14k48k61K46J60j67
5736f7K5j01J48j42l4Lj07L64Mj43k05N14l43L91k43k31K07J65N1k45j29K82l61
5759a97L55m44J09L54j67J51l21M62l30K21n4k27K72j47k41M46l12j77J63L51
5779B67k07J10P4j62J86l35l8j36M83m99L14P3j89p7k5J18N6J90k06j94O8M13
5801B84k86p1P3J03J42k03R0k82j5L08m6N7m09MJ85K27l02J65P2K0J02l74j68
5824c24N15J4l76K65j06k25L30o6m1p2K36l48K68mo7L3rJ33l59K29K6k96M20J56
5848C32l12k21J35L0J69n49J35O15j32j81J24l5n45J65J31J30O0O0l66kK29J42
5870A14k14J5O1j3J89j14M2l44J55Q1J73j1j42r4L23l20K76J08l85J40o0O2Lk87
$$ plain form
5714 36 -356 -94 18 240 -136 -41 -240 22 95 150 42 -21 300 -10 151 -11 203 -45 -306 -60 100 -67
5736 -67 -42 -143 5 -137 -171 -168 -275 89 93 -50 -255 259 -84 307 64 -167 40 205 256 11 -118 164 -197
5759 -197 158 -286 -177 177 10 161 -160 302 -28 193 139 -88 184 37 -204 242 -70 -247 -84 267
5779 267 60 170 244 82 268 -67 -105 -241 242 -257 57 130 -59 -136 -161 -43 13 203 -3 -197 -129 284
5801 284 -2 -73 0 103 245 42 132 -150 -165 143 97 154 -255 -251 -66 161 -141 24 96 116 218 -156 -324
5824 -324 191 205 -171 94 -12 -237 93 27 -14 -86 150 -198 70 66 -1 32 23 156 -203 26 52 -244 176 332
5848 332 20 -201 -66 -36 133 -416 -281 334 202 21 145 110 -435 -270 -139 -9 51 111 -255 -257 -28 114
5870 114 -100 -85 -24 -37 152 38 80 -264 -109 -28 145 134 -8 -102 221 -99 177 285 -100 40 -20 42 45 -242
5894b42L52K38j89pm68Q5J53J97k89J79P3n8K09m28j5K13P3k07j41O4N1j58K69
5917d6K37r2k89K04R4j0m14M28j3q8l6j09L92n1l32k3J85Q4Ol8j76k5q2K05r5
5942h4OJ75l97K51j95Q5J58j13L97n92K46j22L59j17j14K9J42l67lP3J68K41O0
5965B86o0j55k39K18Jj84j12N18j62k68R3L33l79J30J48j84N1j17K18ol57M60
5987B33l85J70K46m74J01L09j54J03O8k22K51l60RM2N6n5J5j26L46j85m5J37j77
6010i7K40M4j44R7j19Q6n9K2K90k50J81o50N47Q8j79l02J58J09j44n9J98m69N11
6033I9K2pk04o8L89o9jj7k8k54K60k10J74K53j89j82jM4m4K84l60l6J19j04J18
6058a2J01P5k12n5K53K56l18M9q8p5L19K2l4k61oJ0K26l19J79n3J59k39k0q7l04
$$ plain form
5894 -242 110 348 159 152 -316 -231 -78 119 -170 9 82 24 233 -195 -210 3 76 -131 -272 -208 -157 -315 -46
5917 -46 191 99 -190 14 108 98 -316 112 99 11 -25 -134 258 207 -125 -148 37 121 127 89 -87 -112 -194 11 -84
5942 -84 -78 97 -300 -49 -244 -159 -1 -114 283 -309 -63 -185 174 57 -57 -28 114 -253 -256 -183 -15 226 286
5965 286 226 71 -168 50 51 -133 -245 273 111 -157 -64 269 -110 20 168 -16 35 -82 136 130 -227 233
5987 233 -152 18 264 -210 -109 200 46 149 217 -5 246 -114 -105 -63 -7 -62 -47 -173 173 -12 -57 80 -97
6010 -97 143 187 43 140 21 107 48 70 360 110 291 -359 188 276 97 -205 -47 62 -82 -141 57 -412 99
6033 99 121 114 -90 -158 231 162 161 144 116 -138 122 -88 86 339 150 -32 -33 11 -33 251 -109 -145 -26 -130 -12
6058 -12 89 164 -48 -103 150 406 88 137 49 -26 293 315 281 20 14 24 250 -69 110 57 216 -23 -43 -130 -434
6083d34M13J47k24L56N0j80j78J90l38K49N1k07K47p3k86K17L71p61M92j69K76
6104B09j63J43J39m68K32j2j26k5J9J41L5l9r2p3p4PJ84J19m9k34K76n5k32M03
6128B65j18k01p9J54k5N9J21J16o4m15Q8j61J57k00M64q0l52L37ok60Q0N31k32
6151A79L9k06m8J46k46J28n1J33j13K14j68q3M25l77MJ85l34q7K95p1J44j3Lj25
6175b7O0j86K39o5m23O04k27J01k42L23k36J90o2O4j09R3J57n47J41J16O8%L03
6198C35J8m95L7K93k75L8J06n2J50k01J44k72M30j18j45j46j42J67M1J15l4j40
6220a46J90K59l20L51m31K65k69M12k05j77O3n6k8Q6M7J0j9Q2l43J53o5K46k17
6243a12p3K42L8k48J38J79m72K27M23j01j95L5J26j61l86M61k0JM1j08J64k60
$$ plain form
6083 -434 -21 126 -98 258 308 128 -50 140 -198 51 102 -105 142 69 -217 0 371 -390 102 -67 209
6104 209 46 189 328 -140 92 80 -46 -71 -52 89 124 85 -7 -80 -154 -147 37 156 107 -127 149 94 -138 265
6128 265 147 -54 -133 21 -4 55 176 292 228 -187 -99 -260 -103 -303 161 81 -271 66 60 -200 -120 411 179
6151 179 218 12 -36 110 -136 -8 -59 74 -39 175 7 -76 349 -28 -24 161 -173 -260 35 -36 108 95 98 -27
6175 -27 33 -153 86 21 -402 202 -25 76 -166 157 -79 111 49 113 4 97 254 -293 -152 -36 32 32 335
6198 335 353 -142 -105 188 -87 -49 57 5 155 -46 98 -174 256 138 -7 -153 -295 -128 -87 28 -6 -146
6220 -146 44 303 -17 334 -97 168 -101 311 106 -71 -8 -64 -92 -6 41 51 32 114 -229 -76 -141 105 -112
6243 -112 -185 57 95 -153 -15 164 -308 -81 342 241 46 81 207 46 -340 121 101 102 143 35 199 -61
6265f1Q9l61J64K37O8j5m70L47M8J60k69K1j0R1J77n2j20K86k88k8k53J84r8K60
6289A07k17O0J77j08j1J45O9j65j6n4j56n3J81J62j21k07L12J91j65q4N9J70l42
6312f6Jl0J01p4J47j80qJ64l38K77M0l24K64M7J53j58j1o5J54O4k26M8J85k18
6336e3J80l1O9l80K13j01J02j19Q3Qj86K76k4r9K56R0k27q1O0P9o0K28k42L1M9
6361A21l20L06j74M4K4L3q5j84J45K37l54P5QJ95l7n3m1J47j45J62r2j48L82l49
6385a03m1J11j1K31k32J01P2J42m41K72q3k32K12l18L25m05M70o1p1l37N24j31
6407fJ47k32o9K68K5j04k77J17K5L25Qp5k95L49l31N4K27j65O3n8M47m16j1J68
6431A84l28N18m93k1J33M3oQ5P3j45J20l35Q3P0r8L49o2rJ4q6m52K24K27j1o4
$$ plain form
6265 -61 28 -333 -169 68 136 121 -349 -2 46 206 -63 -42 -52 39 216 164 44 330 42 14 -239 -55 -153 107
6289 107 -110 -50 127 19 8 153 222 57 41 -13 -169 -222 -41 121 0 -207 105 296 131 47 106 276 -66
6312 -66 -65 -95 6 -68 79 -101 -109 55 -283 -6 34 -290 -26 21 174 16 5 -60 94 158 -68 -20 165 -53
6336 -53 127 96 165 -215 -2 -103 -1 -120 -37 -29 -215 61 37 -62 194 284 57 -24 36 115 55 283 41 72 121
6361 121 -199 107 -67 -23 1 34 -51 -235 -90 147 -207 -132 -124 71 34 -19 -60 87 -58 104 12 -136 246 -103
6385 -103 -144 -33 -44 187 -45 56 128 270 -171 101 18 -214 -2 -320 5 -400 70 9 -62 -399 125 -6
6407 -6 141 -91 -160 108 133 29 -248 -131 -106 219 227 152 -143 206 -125 -71 156 -9 54 -4 443 27 16 184
6431 184 -144 374 -119 -140 -7 36 30 115 188 43 163 -172 -89 -19 -117 232 170 161 175 89 -363 -139 88 77 13
6456A3m5J72jj69J31o5J09l77K48k0M0nj07Q6oJ66j36O0ql82K89J0L9Nj21O7R3
6483H6M5k75L70l70J7K81m66J77R9K11k03M34l26m4L8J73k38O9K6Q9k19o2J41
6506E3L6Q6K4j67K5j84k5R7k6K71j24k24K7J50J48l4J71j01j57K52m77J42j4N4
6530CJ5K06q4k84RJ66n1J18l12K08P8j00l0K36j20q7j69N45j86j68q2K89k78K01
6554A23k6m4L7l92K23K48Kk37K99j95J8K1n5K3l75J3K5M13O9j52J18k09l8K32
6578A41ko47M29J88J1p5O6k39J53M8k14K19P4J1k05k04P0J32j6J09k7j39KJ63
6602D8l37M07j25l5K79l55L56k64R2Rr9J08j06j1Q9o8K80q9k5j95M68k64l92P8
6626a51J98k5j65L05m2j04k7j8j24J20M4J70l21J0K64r2M7l08M04l22M52m97J69
$$ plain form
6456 13 -32 140 139 -30 101 36 145 -232 16 -4 36 31 -76 10 4 170 34 94 86 -296 -7 3 42 47 -74 -7 86
6483 86 131 -144 226 -144 -127 154 -312 -135 -36 175 -28 406 80 36 74 247 9 78 104 193 -26 -88 53
6506 53 89 175 199 32 57 -127 -152 -55 -81 190 66 -158 -131 19 167 133 304 203 46 298 -179 -37 -51 3
6530 3 18 224 140 -144 -135 31 -20 98 -214 -6 72 -28 -58 178 58 -29 -198 347 161 -7 -89 200 -78 123
6554 123 97 53 90 -302 -79 169 171 -66 233 38 56 77 22 45 -330 -317 -292 121 190 38 156 -53 -91 141
6578 141 139 -508 -79 109 120 45 111 -128 25 73 -141 78 152 163 -42 -246 -176 -44 -60 49 22 -117 -115 48
6602 48 -289 118 -7 -42 237 -118 238 -26 66 75 -24 84 -22 -33 56 -12 268 179 154 -41 427 163 -229 -151
6626 -151 47 22 -143 162 120 16 -11 -29 -153 -33 11 181 -140 -130 134 42 89 -219 185 -137 315 -182 -13
6649a3l33K97N0J90j61l13J88L66k03j21n4K5J76l32R1M3J29K51k82j48K07l65
6671c12O65l89R2j97J7J09m4K93K2k88P6k0j96n3L68P7j7m44N34l03j53J02L11
6694B50P2n8j66j12J82pj38r7J52p4K3P9J34m84J2J98L25m18r3K66N1j16J63j98
6718e4j60K58j18L23m21M18k62R2k8J07j02j25J45l13J35J58R4k48J87J01l24
6739a37K27k99L25q4j65K69O0J81n14P9K2P6k65K56j65K27P8l99K36K23k52K46
6761B25p77L39K62k06K35q8j12J4k08N66r7j3jJ6j08J22m51L16j94n0K39j77L13
6784A65l9J29k98j05nK9K79q7m3j06J21j32j77L11p6j68L97j98J21j43O1R8l20
6807a86K90p3N7j56joJ04j73K6k30K80L20l66K89m85M53p2R2Nj76n1J31J20l60
$$ plain form
6649 -13 -346 -49 1 191 30 -283 -95 271 68 -53 -107 -82 94 -238 -147 -104 25 276 -6 -154 53 -312
6671 -312 353 -36 56 -141 -124 -15 -59 234 256 -32 44 24 -172 -225 143 220 203 -241 293 -10 -163 -61 250
6694 250 322 264 98 -14 168 161 23 -74 78 4 27 106 240 -244 -232 -34 291 -127 -220 46 97 -19 144 -54
6718 -54 -214 44 -74 249 -172 246 -16 76 48 155 53 -72 73 -240 -105 53 147 -101 86 187 -137
6739 -137 90 -209 116 32 -133 136 196 377 -137 -58 -36 40 -225 31 -134 93 171 -228 8 231 -21 225
6761 225 -552 -213 49 -157 78 -10 -122 -108 -316 250 153 140 139 155 47 169 -282 34 -160 -210 29 -148 165
6784 165 126 255 -43 -148 -153 -124 155 68 25 -81 40 -92 -269 42 -34 -202 195 -3 118 -25 36 134 -186
6807 -186 104 31 88 -68 -69 -75 29 -144 -118 -348 -68 252 -114 175 -310 143 71 163 168 -8 -59 72 192 -168
6831a68r6J68j65L11m7l3L6j03r2J83K62k02J99q6l04K51O0o4k12K71j12j00Q6
6854D3j88j5L52J22n47K90n1R4K6J58k93R5J56o3k38MJ79j52l48Q58j84l44k04
6877b50L72J19j83r9K80m61M08j49M0JL2L0k09K41k53M65n90j09L43N13o09J78
6899A10j40J94j38J53r6j59J72r8J28k00R5k45L14k96M39k51R7q4k88K33Q5j1
6921A4j60K40j38j40J47K9k8K06m32JlL15J29k26j44K68R9l53nL51j05o7j52R6
6945e8j73L11N38p52J97r5k11K1L12K6j45J33P6L5l43J65j00K36j8j58J05j46
6967d4r5J99ok04m5J41m2Q5j92N08m0j77N2j10N3J27j92J33k7k13J29r2j06J64
6991Fo4M48p48K85k4L50n41L06k2o5N0p5Q4J00j01l83K57K04P9p3k04K01j43K40
$$ plain form
6831 -168 -264 -96 -261 50 3 -30 6 -97 -189 -6 256 54 253 167 -137 114 174 110 -102 169 57 -43 43
6854 43 -145 -160 192 314 -233 57 6 100 126 284 -9 86 242 179 -59 -55 124 -28 -376 482 298 -46 -250
6877 -250 122 241 58 -41 239 -222 186 37 77 78 110 140 -69 172 -81 384 -206 -315 28 541 -68 110
6899 110 -30 164 26 179 83 -76 96 -2 126 -74 21 -224 90 -206 233 -18 79 -5 -293 -60 25 14
6921 14 -146 94 -44 -184 -37 -8 -36 170 -262 -261 -264 51 180 -46 -190 78 177 -176 -181 170 65 -2 -154 -58
6945 -58 -231 80 618 -134 63 -32 -243 -222 90 116 -29 104 180 215 -128 37 -63 173 155 -3 102 -44
6967 -44 -139 60 54 -150 -195 -54 -96 -11 -203 305 265 88 140 30 83 210 18 151 124 -89 40 -52 -158 6
6991 6 -58 390 -358 -73 -97 253 -288 18 -4 -69 -19 -94 -10 90 -11 -394 -137 67 146 73 -131 70 -73 167
7015A67j74j04l0K20P8k01R7n5r3J01j14J37j83K42QK33l61r4J43j48q8K25o2
7038e6Lq7K48J1Jk38L57m32L77k85P0J57j61Mj17J74l9q7O3J09k39L90p3j8j23
7063IJ50l31K80J23j56J20k36j18O0p2J56Q0j16j69P55n16K0j64R0L56O1l74n0
7086d2K29k13R0p3Q3j67K56n64K58m5R7K5J46k92O8K28j89l8n6L19j67%j28K40
7110F5Q7K13k30j10j90K4M8j25J22J49L7j94L20k64m6N4O6M9J6pJ15k63r6o8M64
7135B36j34j13j28N8j7r5L22j63q0K6K74Q8k79J85k87j07M30k99M7L21m26L23
7157A82q5k78k9L95j38J44k12M6j48O3L3J9J09J5K1L3n6j2Q2k74P4r1J63p5k23
7182b42j8J45j81J9K79j74K74j2r9j05L03j33R2k41K43m3q4m0L85o44J78L2K35
$$ plain form
7015 167 -7 -111 -141 79 157 -44 53 -2 -95 6 -108 29 -154 88 96 329 -32 -126 17 -131 -219 6 -56
7038 -56 -53 -140 108 119 120 -118 239 -193 184 -101 -31 126 -35 -31 -148 26 -13 -100 -37 72 -167 223 150 132 9
7063 9 159 -172 108 231 75 195 -41 -159 -99 -171 -15 65 -51 -220 535 19 39 -125 -35 321 382 8 -42
7086 -42 187 -26 64 -9 74 -93 163 -401 -143 -188 -91 -66 80 -212 -144 84 -105 -143 -199 120 -47 -47 -175 65
7110 65 152 365 135 25 -165 -141 -93 -218 -96 53 90 -104 216 -48 -94 -40 26 75 91 84 199 -64 -160 -228 236
7135 236 102 -11 -139 -81 -98 -193 129 -34 -114 -88 186 274 -5 180 -107 -214 216 -83 -36 285 -141 182
7157 182 97 -181 -210 185 47 191 -21 25 -123 -60 -27 -8 101 116 137 170 114 102 184 -90 -16 -107 56 -19 -242
7182 -242 -260 -115 -296 -277 2 -172 102 90 -9 -114 189 56 148 -93 150 107 23 -17 368 -276 -98 -66 169
7205A69n1j80J07K09k69K31R1k43N5j92K28o1J87m37M8L59j9l19j81O02j07r6
7227A31l71N36l36L31k19l64J93j04J88K11k41n0K03j99k06K56Q4J99m12J85J37
7248A52mm6j06j10J44o5rj70K49l81M64j19k54L65l54J17K97k18Q3jJ05K2q6J07
7272A82m45L21p1k7L40m82L05L56m33l7K81l80P1J45j34J11j92k37K98k8M70l58
7294E6l02J88J14j07J45r3k07K71j87k6L56l20K10l6l45K55Q9k63L01K4j74J34
7316H3j93P1J24J1k52L97O0l83M9K88j56j74J68p8j99M11k73m6J96o5O8r9L40
7339C48n98L3N92n23l2J99J17J4j50J91k22L3L83l59k56J53OP0O4j24J11k00K92
7362A42k59L63k35j35N9J33r1J24k12Q2o2n7l0K16j93J6l3K65j6J70k93J05k08
$$ plain form
7205 169 118 -62 45 254 -15 216 307 64 119 -73 155 94 281 -156 -108 251 232 -87 -268 334 227 131
7227 131 -240 296 -40 291 72 -292 -99 -203 -15 196 -45 -95 108 -91 -297 -41 43 242 -170 15 152
7248 152 148 102 -4 -114 30 -35 -44 -214 35 -346 118 -1 -255 110 -244 -127 170 -48 35 34 139 161 75 182
7272 182 -263 58 -13 -40 300 -182 123 479 46 9 290 -90 -19 126 -8 103 -89 -326 -28 -56 414 56
7294 56 -246 -58 56 -51 94 1 -206 65 -122 -148 208 -112 98 62 -283 -28 61 -202 99 123 -51 83
7316 83 -110 -39 85 96 -156 241 301 -82 -33 255 99 -75 93 15 -184 227 -46 -92 104 39 107 8 348
7339 348 -250 -217 375 -148 -180 19 136 150 0 191 -31 2 385 26 -230 -77 -71 -1 63 -61 50 -150 142
7362 142 -117 246 11 -124 -65 68 -23 101 -111 -29 -91 -148 -178 38 -155 -139 -172 93 77 247 -46 59 -149
7385a49J28p7K80N0k36L2R5m58J21J06K22j42K7r1j01J46N4j93P6K70p6J37k34
7408a3J19j42J83q1k54K65M1k47k6J66m9M00l10j31J44j0J65m67J18j1L9J43P
7431D9Q8KQ0k09L67k79J54k14J40l04L21p7n9k11m5K67j8K6j9o4J06j08R6M6k36
7456a01nM5K40k30J13M0m42K83L42l81q9K27k27J16M7J67j74J47m09M45k03J62
7478A13p5j04J72k08J21j2k0M20m12m9k8R2mj55L73k50J56J24k16k2k0K29k12
7501A3j20m7J18k12J75J40k95L57J2j90j0J21q8k02M10l24kK95Rk77n0L86k89
7524g0N3J94j44J24r6j4j42J16r5L13j67q3K01k24P8j38L06k97K52k11J27j04
7546b1n5J15J68o6l56N8r7L85l4P9j93J04k2j35l6J17j44J52K9l05L88m03K99
$$ plain form
7385 -149 -21 -98 182 232 -4 28 123 -335 -214 -108 114 -28 -1 -92 -193 -47 7 -186 -110 160 84 221 -13
7408 -13 106 -36 147 66 -188 77 118 -129 -155 11 -38 362 52 -79 65 55 220 -247 -129 -140 -101 42 49
7431 49 137 139 219 10 377 98 252 38 178 -126 195 118 59 -152 -197 70 52 78 59 -5 101 -7 89 135 -101
7456 -101 -106 -61 179 -51 62 102 -340 -57 285 -96 -185 42 -185 -69 -22 145 -29 118 -291 154 -49 113
7478 113 38 -66 106 -102 19 7 -13 407 -5 -54 -82 10 6 -149 224 -26 130 254 38 16 -4 225 13
7501 13 -107 -154 -36 -248 -73 67 -228 129 141 -49 -59 62 -26 -228 182 -142 -144 151 160 -117 -167 219 -70
7524 -70 -17 177 33 157 61 47 -95 21 -74 239 72 -11 190 -34 44 -94 212 -85 167 -44 83 -21
7546 -21 -76 39 207 141 -215 -157 -254 131 97 176 -17 87 65 -70 -106 11 -133 19 48 -257 131 -272 27
7569B7k14L00j31L1l7O0J59Q6k18R5l2k97K11r5P6j06N9K44%l56K98m78K67k03
7593b54O69m95j13L07j15J01p6l1j18J32K72m24j12P9J71PO7l0q1n7J68j70K29
7616A26j69j67K52K8j84Q6J3j80J63O4j48p9R0j76M30j57R8l17J89J74m7j38l6
7639h5n4M4J66J12k3m9p2k02L76r9q3L2J86k06m9p7J50R8m32N2J10J72J82l88
7663a39O7L05m83K60l20K92J4k43P13n98J82j49K37k52J48mJ4m50K59j42J38K33
7685H2j43m6J78q0k11M44l00K95j58j20r4J28M2J44l42L7m1K20j35K91k32j77
7707b18k5K93K8K97m41J36k43K97j11J62p7m26K99K92m15L2L46l65R0O1r9J56
7729F9N8J88l49j44M70l05j48l2J10J29J37j92jj75M09l44R7J6K2N0j12l8L20
$$ plain form
7569 27 -187 113 -18 13 -24 36 195 281 63 158 126 -171 40 -55 21 -85 -26 218 218 -138 160 -318 -51 -254
7593 -254 415 -80 -193 114 -1 100 24 -7 -125 7 279 -145 -257 -178 -7 0 67 37 -44 -101 67 -103 126
7616 126 -43 -210 42 70 -114 -28 -15 -195 -32 32 -116 -195 -105 -281 149 -8 90 -227 -38 136 89 -49 -85
7639 -85 -139 -95 71 183 160 111 39 -163 213 114 31 63 249 43 -6 -83 67 165 -267 -215 -105 67 249 -139
7663 -139 -72 233 -250 10 -310 -18 -4 -247 466 -132 50 -99 138 -114 34 30 44 -406 -147 -289 -151 82
7685 82 -61 -107 71 -9 -220 224 -76 219 61 -59 -153 -25 17 161 -181 -144 -185 35 -100 191 -41 -218
7707 -218 -243 50 78 375 -66 70 -173 124 13 175 98 -328 -29 263 -152 -120 226 -139 -49 12 -87 69
7729 69 127 315 -34 -178 292 -13 -161 -193 -83 46 183 -9 -10 -185 224 -120 -23 -7 15 65 -47 -85 235
7752B35k01J75j81j01j4J85K4k42J13J15N2j74q3J07o6J67pK6j15L2m87L42J6
7775h2L6K83k05J61l5j37J1k36K28L30n06L82k97j50L6J89n8j30J09K73k84M44
7797C62m74K23k95J19Q5Mj61L11j95l7K35n6j8k19K26j33j41J96J42n52K18K85
7819A25k22L71N9l30l5J74j4j40J75k81L11k28N6n5J73k5j77J37j16ll0mk1k05
7843c05L60j42Q7j57J47j69J69KJ78o0n6J86l32K42r3P5j63l6L12n2j62K3j24
7866g0K00o6j28L51n32K78j18j88M56j98j5k3J91R4k08j00J48j62M05m68J65M7
7888E9O2j5K67j67k31nk9K21k96QJ34J41n9l8r6k6J27J06j63M8j9pOM2o2l6J27
7915I9j42J15j85L00k16M6j9K26j79r4m4l9R4q5L04l05M3o6J43K25j6j8j72j1
$$ plain form
7752 235 34 209 28 -73 -87 98 122 -120 -7 108 160 -14 -97 10 -56 111 104 130 15 47 -440 -98 -82
7775 -82 -46 237 32 193 158 21 32 -204 24 354 -152 230 -67 -217 -181 8 -50 -180 -71 202 -82 362
7797 362 -112 111 -184 -65 20 24 -137 174 -21 -58 177 121 103 -116 110 -23 -164 32 174 -378 -160 125
7819 125 -97 274 333 3 -32 142 128 -12 163 -118 193 -35 21 -34 139 114 -63 74 -42 -45 -75 -79 -100 -305
7843 -305 55 -87 0 -157 -10 -179 -10 -8 170 110 54 240 -92 150 57 132 -31 -67 245 193 31 54 -70
7866 -70 130 64 -64 287 -245 33 -85 -273 183 -15 -30 -53 138 232 24 -76 72 -90 315 -153 12 59
7888 59 121 106 373 206 -25 -30 -59 162 -134 -126 8 149 90 52 -44 -70 57 163 0 48 29 22 28 70 8 -28 99
7915 99 -43 72 -113 187 -29 17 -2 224 45 -49 -93 -132 -38 -123 181 -124 -81 -147 -4 221 205 187 15 4
7939Dl86M31j84L8O4j70K89j5J65k19m2o1J43l42K16Q7j77K19M1Q8l14J7P5N6
7963B3K72l19k58M68k00J12m6j2K2j17Q9K62l59J70q2Q0j30l3l7K06Lk60l2J2
7987a66K50k00K7k32M17l3L85n02N0K71k57J52m7j41p9J95K42l33J94o7o3K97
8009C60n31L69k97J63K5K4Q9J7l85M38l82K3n6M0K03k53L59j17J47k34k0j88K62
8032E6O7j01n9N3k0M5o1r5L45l99Q1o8Q7K51l29M8K84k70n9P8K17l40K02L20m08
8057g5j74L32Ro4q4J35J59m4o0l9m12L39Pr1j51K36lL4o8L51J2l37J8k13o6K27
8083b2J11j24M0l9J53m1j92n0J92N1q8L21m65J79K97k92J33K30nj60J8J7k90K55
8107B29m81L06j22p9K14J71l33m9K92o04P17k54L4k66K88L1j36R9o2J1j28J09
$$ plain form
7939 4 -382 49 -135 -97 -33 -203 86 71 236 17 -25 -86 57 -285 -69 18 -159 60 101 189 -125 -108 -33 23
7963 23 295 -24 -282 186 -14 98 52 40 62 -55 34 296 -63 107 25 105 -25 -58 -95 111 114 -146 -178 -166
7987 -166 84 -116 -89 -321 96 63 448 -54 -4 267 10 162 115 -26 -105 90 332 -1 193 126 63 360
8009 360 -171 198 -99 64 89 113 202 219 -166 272 -110 -87 -143 -103 100 -153 206 89 236 2 -18 -206 56
8032 56 123 22 -37 16 -4 41 -20 -115 230 -169 -88 -156 -69 182 -147 -99 185 -85 -144 -66 151 -189 13 333 -75
8057 -75 -249 83 92 28 -56 79 238 194 134 95 -317 22 29 -62 -213 23 20 54 -14 337 349 12 30 -183 -249 -22
8083 -22 89 -35 5 -34 119 78 -114 -164 28 79 -9 312 -153 26 323 31 164 394 389 229 247 264 -26 229
8107 229 -252 54 -68 -147 67 238 -95 -144 148 -456 261 7 41 -225 63 94 -42 57 -5 6 -122 -13
8129a3k15L7K97L3k20l24K42K16j90m5K66j48j32K06j69K13J51l25M8J8P7Om0
8152a1KK08q4j53K65l29K77J6j85j15J61j75J89j16J31j57L67j0k47k63J65J35
8174G1l71L55P3j39k7j9o2N3J88j79j49N70m03K1j62J67j50
$$ plain form
8129 -13 -228 -191 106 139 -81 -405 -163 53 -137 -182 84 -64 -196 10 -159 54 205 -120 -72 -54 23 29 -11
8152 -11 -9 199 115 -38 227 -102 175 191 6 -109 52 -123 66 -50 81 -76 291 281 34 -229 -64 71
8174 71 -300 55 128 -11 -38 -57 -119 -66 122 -57 -206 364 -39 -18 -180 -13 -163
8191a63
$$ Imaginary data points
##PAGE= N=2
##DATA TABLE= (X++(I..I)), XYDATA
0@%%%qJ6j6J6k4M0m8N6p2Q8j12J36j60J92k32K80l28L84m48N20o00O89p92R04
27D81j026J164j318J486j672J877k102K348k616K912l239L594l982M415m889N411
43B844n994O639p360Q173r096J0155j1381J2818j4533J6621j9233K2611k7167
56a4903L3696m3910O2301j05810L94004M32002m32233l3472J22778k9371l25731
67E9351j10323L1899k9318q2253J23967R0360r2670m0158K53057J49823k01053
78A52682k00334J60463J65390j69072k42704M8270J29372n2179r1117N8821M1684
89A276m9317M4178J47347k7539j73957J7981K08190L017k37627p7689J76600O9280
101A01740j56726q8985R0587M6818n8171N125M9211o0763o8897J00834J02857
$$ plain form
0 0 0 0 0 -8 8 -8 8 -16 24 -24 32 -40 48 -64 72 -88 104 -128 152 -176 208 -240 280 -320 369 -423 481
27 481 -545 619 -699 787 -885 992 -1110 1238 -1378 1534 -1705 1889 -2093 2322 -2567 2844
43 2844 -3150 3489 -3871 4302 -4794 5361 -6020 6798 -7735 8886 -10347 12264 -14903
56 -14903 18793 -25117 37184 -68626 325378 757380 325147 291675 414453 385082 59351
67 59351 -50972 -19073 -48391 -130644 -6677 83683 -8987 -49145 203912 353735 152682
78 152682 -47652 112811 278201 109129 -133575 -85305 44067 -8112 -99229 -40408 1276
89 1276 -48041 -3863 143484 115945 -58012 -40031 168159 171176 -66451 -144140 32460 101740
101 101740 -54986 -143971 -53384 -6566 -64737 -59612 -10401 -71164 -140061 -39227 63630
112F3630j21222j52511J02376J77506o8678j77987L8154J63664K015j03610J2536
123f4127P1991j9108j9622P2969J2797j12904j8382J49059M5918j62030q1268
134a24707J45745J00308j17689j03458P7904P9235n1869m1597M1871k043n4222
145e0522L7209Q4706m9692j12299M9290J41854k0740j38332M279J32027K2010
156I9790r5355j7630O7458O539l7955K3098K4695n7390l2771P7434M4163r5897
168F179p3334Q1173P8831p3611r0678M2890O9009l3962n3293K1465K0625l3572
180c8278l90N0181j2097p0941J2994R0994K687r3452j2973R2486K8949p1642k7112
193d8594N6207K0709l7450j415L0573j9595l3776L6035M3037m7050o0098M3439
$$ plain form
112 63630 -57592 -210103 -107727 69779 1101 -176886 -138732 24932 26947 -76663 -64127
123 -64127 7864 -11244 -30866 42103 54900 -58004 -76386 72673 118591 -43439 -124707
134 -124707 21038 121346 3657 -99801 -21897 57338 5469 -36128 5743 3700 -50522
145 -50522 -13313 71393 21701 -90598 -41308 100546 79806 -58526 -54247 77780 99790
156 99790 4435 -13195 54263 60802 22847 45945 70640 13250 -19521 57913 102076 6179
168 6179 -67155 14018 92849 19238 -71440 -28550 40459 6497 -46796 -25331 -4706 -38278
180 -38278 -38668 11513 -584 -71525 -58531 32463 35150 -58302 -71275 21211 50160 -21482 -48594
193 -48594 7613 28322 -9128 -10543 20030 435 -33341 2694 45731 -1319 -61417 -17978
205a7978O7506l5771p2498K1685O4120j2876m9341J0661L4013j4091j6670K9543
217H303J3360l9339q989N5423K0375n5118k5042N6219L4602m4815l2845L5413
229A7547K7211k6680j7378K1438K130k7073N096L0235j4495m1958R824M3929q455
242B1371m8594L98M2386J907l6138k806K7424j365j9752R718J7888j6373j7760
255b1696K3663K2895k5879k5738K4446K8296k0866k8333J4968K1507j3233j8120
267a8090J1063Q913j6386o836J8603K156k4400n276K6051O356k6085q977K3580
280i328J0130j8184p033J6081N135j1220J159J3210k551j3087P652J6797n686
293C075j7183N519J8521k063j6484J337J3205m99r667J781O276m226n184O885
$$ plain form
205 -17978 49528 13757 -58741 -37056 27064 14188 -35153 -24492 9521 -4570 -21240 8303
217 8303 21663 -17676 -26665 28758 49133 -5985 -31027 25192 59794 14979 -17866 17547
229 17547 44758 18078 700 22138 24268 -2805 2291 32526 18031 -23927 -14103 29826 21371
242 21371 -27223 -26825 15561 17468 -18670 -21476 5948 4583 -15169 -5451 12437 -3936 -21696
255 -21696 1967 24862 -1017 -26755 -2309 25987 5121 -23212 -8244 13263 30 -18090
267 -18090 -7027 1886 -14500 -21336 -2733 -577 -24977 -30253 -4202 2154 -23931 -32908 -9328
280 -9328 802 -17382 -24415 -8334 -3199 -14419 -13260 -50 -2601 -15688 -8036 8761 3075
293 3075 -14108 -8589 9932 7869 -8615 -7278 5927 5428 -4239 -2458 3818 -408 -5592 1293
307A293N829r506o867R440R362q095r413O362R258l328o805L001M414j771j083
322B091M298P3n424P34P729R25q477j844P819L981o175l754L410L310j393q45
338F458L84j383j172L468K977m012m522L017O303j556o042p18M979J686k213k305
354E349l18R26J517R20k752k970J028M080p5n015k474K675K715j499l823j485
370a201J505J752p80k933k554Q46K491l27m090k595J611K242j043l018k119J396
386h817J647l6k546k283N07K896N03l209k394J760L601Nl281j470K666K787m91
403h155j717n47J586J904J570j378j765J084L323K296k707k333K132M337M68k948
419b850o25K981K181j03r08k95O30J642K338l13k642K12M587K523l214k941L035
$$ plain form
307 1293 7122 -2384 -9251 189 9551 1456 -7957 -1595 7663 4335 -2470 531 4945 3174 2091
322 2091 6389 6462 1038 1772 9501 10426 1949 105 7924 11905 5730 1976 5386 8696 7303 6458
338 6458 6842 5459 4287 7755 10732 6720 2198 5215 11518 9962 3920 3202 8181 9867 7654 5349
354 5349 5031 5957 7474 8394 5642 2672 3700 7780 7705 2690 216 2891 5606 4107 284 -1201
370 -1201 304 2056 1276 -1657 -4211 -3365 -874 -1201 -5291 -7886 -6275 -4033 -5076 -8094 -10213 -8817
386 -8817 -7170 -7206 -9752 -12035 -11528 -8632 -8129 -11338 -13732 -11972 -8371 -8366 -11647 -13117 -10451 -7664 -8155
403 -8155 -9872 -10419 -8833 -6929 -5359 -6737 -8502 -7418 -4095 -1799 -4506 -6839 -4707 -370 98 -2850
419 -2850 -3475 -494 1687 1584 676 381 1011 2653 4991 4678 2036 2248 6835 9358 6144 3203 6238
436F238M821j129k926j75K903O28r56L15l84j919J059L173r59n540p64N705J119
453A1209n668l489L779K655l756k882J332N76k111O3K145k973m069K162N262k900
469A335p325J192O916p54p469p34N255N50m360J80K715k710k322M131L037o046
485f409m240O938N906o542p096N880P769l875o181L128M662k581j721M517M07
500E62o218J277Q997Pj0497p57J1600K794j0441l492R226M148p033j912N491j19
516C633n152L659O295n704q325P385J0150o857j2610N341J3150m029j2397K106
530c355R314k523p210L565L763p015l428R626L634j3522n478J4392P457j4566
544e346r565J2875R352r893p676P770N076p245p74Q435k356j1012M718J4333m729
$$ plain form
436 6238 11059 9930 7004 6829 9732 10360 9404 9719 9335 7416 8475 11648 10689 5149 4385 10090 11209
453 11209 5541 2052 5831 8486 4730 1848 3180 3756 1645 1708 3853 880 -3189 -1027 4235 1335
469 1335 -5990 -4798 2118 1364 -6105 -6839 -1584 -1034 -5394 -5214 -2499 -5209 -7531 -3400 -363 -6409
485 -6409 -10649 -3711 2195 -4347 -11443 -5563 2206 -1669 -7850 -4722 -60 -2641 -4362 155 562
500 562 -5656 -4379 4618 4625 -5872 -6629 4971 7765 -2676 -6168 3058 7206 173 -1739 3752 3633
516 3633 -1519 2140 8435 2731 -5594 1791 11941 5084 -7526 -2185 10965 6936 -5461 -3355
530 -3355 5959 3436 -3774 -209 3554 -3461 -6889 2737 6371 -7151 -12629 1763 9220 -5346
544 -5346 -14911 -2036 7316 -2577 -10253 -2483 2593 -4652 -5426 3009 653 -10359 -5641 8692 3963
559C963j7634L125J8956j425j7947j283J5228J105j1720L9Q646l873o408Q412
573h16P185j2554q750J5735J2444j5011j4312J4069J6960j0003j4352Q933J1685
586A1213o116o653Q744K815j1234O46J5832m67k0563r88K3006L323k3708o842
600a0992K0722P120j7577p239J3059K077j0795K715J0143p961j3151J1648J7136
613A6905j2925k1058J1550K4081q217k3378N135K0902l667j5927M280J0120p883
626h2o991J2957M112j9049o804K1627R559k4786j3752K1811J5204j9303j4747
639b0244J4285J1079j1483n554J1849j21j3496N741J8927o859k2579P461K7271
652A6277l584k6727Q99K5401K007k0358j649J5184j870j1120O243R139j3624j0622
$$ plain form
559 3963 -13671 -10546 8410 6985 -10962 -12245 2983 4088 -7632 -7593 1053 -2820 -9228 -816
573 -816 6369 -6185 -14935 800 13244 -1767 -16079 -2010 14950 4947 -9405 -472 11213
586 11213 5097 -1556 7188 10003 -1231 -585 15247 14780 -5783 -6771 16235 19558 -4150 -10992
600 -10992 9730 16850 -727 -7966 5093 7170 -3625 -910 9233 1272 -11879 -231 16905
613 16905 3980 -17078 -5528 18553 10336 -13042 -7907 12995 9328 -6599 -2319 7801 -82
626 -82 -7073 5884 9996 -9053 -15857 5770 15329 -9457 -23209 -1398 13806 -5497 -20244
639 -20244 -5959 5120 -6363 -11917 -68 -189 -13685 -7944 10983 4124 -18455 -10994 16277
652 16277 12693 -14034 -13135 12266 14273 -6085 -7734 7450 5580 -5540 703 9842 -3782 -14404
666a4404J7172J3576k1024j7947J9439K0972j7030k1339J2901J9169q967j3730
678a1212R804Q271j0441j534J5805J19j9876M38K5847K690k7246o048K6414Q604
692B1635k3140r434J7382O023j4062k571J1105n323j2991R535J5019j3865k0191
705b0878J3422K3643j1627k4443P802K3640m257j8544L862J4530m884q279J0115
718D102N873j4075m823J9946P136k2454r843K1966J3055k0438j4239J5941J1946
731A4093j3085r184J0437L263j1405J576J3534n224j7702O149K1843m694k3555
744a3954K899K3848N12k0265r44J6727R56j2277L261R627p892q513J2286R423
758A5694j5613j3264J6236J4758j5934j7760J2525J5762j0571j4316P866R155
$$ plain form
666 -14404 2768 16344 -4680 -22627 -3188 17784 754 -20585 -7684 11485 2518 -11212
678 -11212 -1408 6863 -3578 -5112 10693 10812 -9064 -8626 17221 19911 -7335 -13383 13031 21635
692 21635 -1505 -10939 6443 12466 -1596 -4167 6938 1615 -11376 -1841 13178 -687 -20878
705 -20878 -7456 16187 4560 -19883 -12081 11559 7302 -11242 -7380 7150 2266 -6013 4102
718 4102 9975 -4100 -8923 11023 18159 -4295 -14138 7828 20883 445 -13794 2147 14093
731 14093 1008 -8176 2261 5524 -5881 -4305 9229 4005 -13697 -7548 14295 9601 -13954
744 -13954 -11055 12793 13305 -6960 -7904 8823 9779 -2498 763 10390 2498 -6015 6271 15694
758 15694 81 -13183 3053 17811 1877 -15883 -3358 12404 1833 -12483 -4617 4538
770D538q851m979J0279J390j3704LJ7496R24j9721j422K0813M448j8808m749J6713
785D370M841j2649j717J0071j039r562N112R917q355j2422R611J3832r861j6278
799a4129P360J5818o048j4780M624J1191m138p956N623N861p797l947J1659M452
813G793j3171m308J4767P207j3354p606J2977P745j0177o167Q433M312q299q05
827f53P792j748j0049K900J1289l758j3859K618J3512j736j3071J49J1511k86
841D611r510J588P344k676n762N471N860p183o184Q556Q002q888q456Q005Q835
856I613p195q092N426N769n335m165M852K490o723j476P361L32r320q77R496J658
872C814r544j836Q649K574p121j959O366J205n509J827M821j994n065L115O352
$$ plain form
770 4538 -4313 -9292 987 2377 -11327 -11324 6172 7096 -12625 -14047 6766 11214 -7594 -12343 4370
785 4370 9211 -3438 -5155 4916 3877 -5685 -573 9344 989 -11433 -1822 12010 2149 -14129
799 -14129 -6769 9049 3001 -11779 -7155 4036 -102 -8058 -2435 3426 -4371 -8318 3341 7793
813 7793 -5378 -9686 5081 12288 -1066 -8672 4305 12050 1873 -4294 4139 8451 152 -653
827 -653 7139 5391 -4658 -1758 9531 5773 -8086 -5468 8044 6308 -6763 -6614 4897 4611
841 4611 -4899 -3311 4033 1357 -4405 1066 6926 -257 -6441 2115 10117 1229 -7227 778 9613
856 9613 2418 -5674 -248 5521 186 -3979 873 3363 -3360 -4836 2525 2857 -6463 -7340 2156 3814
872 3814 -5730 -7566 1083 3657 -3464 -5423 943 2148 -3361 -1534 3287 1293 -3772 -657 5695
887E695l489o584K887P316k833p238K503O106k218n523K410L384k777k881L247
902EK803m883k476N088L279n760l021N042L832m634k769M077K420l489j781M002
918A735O10l696Q4M211n50m815N20M715l42m730J50M304k53l884jL524p88l038
936b244J259K534j858k394K162K559k520k309K050K839j873k987J986K559j860
951i7j887J963J449j807j168K138N92j725p51K249P95k797l12K120Q24k363l34
968a111J860M37j534l25J891m55j540J60J922n36j730L45J943p38j454N69J470
985A174o49j503L38J661n59p87L72R53q07p67Q93Q38n90j033R73P55r01q05J072
1004F28L95q67o22Q90K61o77n89P99J74j220M2R07l95o31M3O48o9n03j42R86j36
$$ plain form
887 5695 2206 -4378 -1491 5825 2992 -4246 -1743 4363 2145 -3378 -968 2416 -361 -3242 5
902 5 2808 -2075 -4551 537 3816 -1944 -4965 77 3909 -725 -3494 583 3003 -486 -2267 1735
918 1735 2345 -1351 -1267 2944 2394 -2421 -1901 2814 2472 -2258 -2108 2196 1943 -1941 -1942 1582 794 -2244
936 -2244 -985 1549 -309 -2703 -541 2018 -502 -2811 -761 2078 205 -2782 -796 1763 -97
951 -97 -1984 -21 1428 -379 -1547 591 1183 -542 -1293 956 1751 -1046 -1358 762 1586 -777 -1111
968 -1111 749 1186 -348 -673 1218 763 -777 -617 1305 769 -961 -616 1327 589 -865 -296 1174
985 1174 525 -978 -640 1021 462 -325 47 1000 193 -574 319 1157 567 -466 507 1262 361 -444 628
1004 628 1023 156 -466 424 685 8 -581 218 392 -828 -786 121 -274 -905 -862 -214 -283 -786 -928 58 -78
1025g8q08L86N49J29p94Q00N66m49o99P38M21k48n52M10K54j66p45M12M70q20
1045b24m87L25O10p18r5o6J51j70k26N40J63n79J74K50M69n39l53R70N43p81Q5
1066D2Q83j15m28j62L79r8k63O7L26k73j074O34L43o99n56J02P04m93k59J83O23
1087a34n02k89M97O24m29p61R25L66j82j24O39P71q77j97O98M61q75m53R07J0
1107A075j077L09L22j25o50m64J089o31p09P8J220m67j437N61J132l00j014O83
1125d05P41j15o19L24J126r42m93J036Q27r40q30R33O43p32r73J110J84r53o24
1144g02R50J22j170l18J342N6j808J19J886j47j891M3J961j32j418J45J591m15
1162B14j022L27J688r87j262J373J320j411j436J351J496j171j939J052J848j474
$$ plain form
1025 -78 -886 -500 49 178 -616 184 750 301 -398 340 761 513 -39 371 625 459 -286 126 596 -224
1045 -224 -711 -386 224 -494 -589 -655 -504 -674 -900 -360 -197 -776 -602 -352 117 -422 -775 195 738 -43 42
1066 42 925 810 382 220 599 501 238 305 631 358 -716 -82 261 -438 -994 -892 -188 -681 -940 -757 -134
1087 -134 -636 -925 -428 196 -233 -994 -69 297 115 -9 630 1401 524 327 1025 1486 611 158 1065 1075
1107 1075 -2 307 629 504 -146 -610 479 -152 -861 -783 437 -30 -1467 -906 226 -74 -1088 -405
1125 -405 336 221 -398 -74 1052 110 -383 653 1480 540 -290 643 1286 554 -419 691 875 -78 -702
1144 -702 248 370 -800 -1118 224 280 -1528 -1409 477 330 -1561 -1518 443 311 -1107 -962 629 214
1162 214 -808 -481 1207 220 -1042 331 1651 240 -1196 155 1651 480 -1459 -407 1441 -33
1178c3j427J193R07j329j051K046M44k149n35K300R41k461r14K562J134k471n23
1195a366K175P13j990k4J888k91j669M87K415j190k445P30K836q30l218N92L218
1212B031q71k817Q51J746n84k093J550J589k590j316L007J452k304k081K889K402
1228B861k990j996K281J894j903j721K381J046k518n04L088m11l618K74L920j47
1244A937m381J84M137N2m043J08L197l20k605P15K382j190k553K167K775k281
1260B81l484K760L514k324l831K196L308j521l047J872K437k223j736K507J445
1275B154l695o53L781R89m569j039M632J397m134j625L489J335k913r41K829J95
1291A232k961P79L535j698m083K154M532j937m597J171M925j094m648J124L896
$$ plain form
1178 -33 -1460 -267 640 -689 -1740 306 750 -1399 -1934 366 1307 -1154 -2068 494 1628 -843 -1366
1195 -1366 809 1522 -468 -492 1396 1105 -564 -77 2338 1148 -1297 -567 2269 1439 -1779 -1187 2031
1212 2031 1160 -1657 -806 940 356 -1737 -187 1402 -1188 -2504 503 1955 -349 -2430 459 2861
1228 2861 -129 -2125 156 2050 147 -1574 807 1853 -665 -1169 1919 1508 -2110 -1836 2084 1937
1244 1937 -2444 -2260 1877 1929 -2114 -2006 1191 871 -1734 -1019 1363 173 -2380 -213 2562 281
1260 281 -3203 -443 3071 747 -3084 -888 2420 899 -2148 -276 2161 -62 -1798 709 2154
1275 2154 -1541 -2194 1587 2576 -1993 -3032 1600 2997 -1137 -2762 727 2062 -851 -1792 1037 1232
1291 1232 -1729 -950 2585 887 -3196 -1042 3490 1553 -3044 -1873 3052 1958 -2690 -1566 2330
1306B330r19l123J795K073k304k173L141K192l762k777M400L471m734l132L651
1321A29L141l313k597K936J900l095r51L394L05l929J24M525m27n188L38N472
1337B764O2m939q47M813J80l596P6L135r62k906K159K787k563l694L433L824l156
1354E70l972K312M718k724l935K189L412k288k267K431J333l389j253M134J236
1369B507m432j309M791J886n092j651M551J828l774j255L251J11k653K4L118r78
1385I23l336J288M269j759m691J591M583j086m231O17L867q50l508J247K679j937
1401c34j847K547J899l339j896L364K829l885k790L940K674k931l154L063K236
1416B376k736j270K808N96l319P5L490j02m138j35M914o37l774o70M097K42l411
$$ plain form
1306 2330 1411 -1712 83 2156 -148 -2321 820 3012 -750 -3527 873 4344 -390 -3522 129
1321 129 3270 -43 -2640 296 2196 -899 -1850 1544 1849 -2080 -1956 2569 2142 -3046 -2708 2764
1337 2764 2826 -2113 -2960 1853 2033 -1563 -1487 1648 686 -2220 -61 2726 163 -3531 -98 3726 570
1354 570 -3402 -1090 3628 904 -3031 -842 2570 282 -1985 446 1779 -1610 -2863 1271 2507
1369 2507 -1925 -3234 1557 3443 -1649 -3300 1251 3079 -695 -1950 1301 1412 -1241 -1217 1901 923
1385 923 -2413 -1125 3144 1385 -3306 -1715 2868 1782 -2449 -1832 2035 1185 -2323 -1076 1603 -334
1401 -334 -2181 366 2265 -1074 -2970 394 3223 -662 -3452 488 3162 231 -2923 140 2376
1416 2376 -360 -1630 1178 1774 -1545 -1470 2020 1918 -2220 -2355 2559 1922 -1852 -2522 1575 1817 -1594
1433a594k96K995m61k511J208K406j641k343K156K801k348k960K113L551k018
1448A058l298J758L066j958k160J686J514k018j086K456J104l411p70L311J273
1463B525l646j284L279J107k996r19K511M42j741o81K961o20k416R62K779j102
1479A161l310J355L192r55l051M45L331q09k902O04K191j184j547J490J306j587
1495b70j903K278J421j903j922K524J330j839j655J605K001k189j027J741O83
1510H75j589l73K042L5k379K1K457J50k272l48K106M93k210k44K219l53j483L35
1528e18J147k97j349M77J553r83j544J232J753j285j387Q51J477r44q64M91J345
1545A155j134p90J026O91j142o05J499K93j478k16J279Q85j440j109J478M90j163
$$ plain form
1433 -1594 -1890 1105 644 -1867 -659 1747 106 -2237 -81 2720 372 -2588 -475 3076 1058
1448 1058 -2240 -482 2584 626 -1534 152 1666 -352 -1438 1018 2122 -1289 -2059 1252 2525
1463 2525 -1121 -2405 874 1981 -1015 -1934 577 1019 -722 -1403 1558 938 -1478 -516 2263 1161
1479 1161 -2149 -794 2398 1443 -1608 -1163 2168 1359 -1543 -939 1252 68 -1479 11 1317 -270
1495 -270 -2173 105 1526 -377 -2299 225 1555 -284 -1939 -334 1667 -522 -1549 192 875
1510 875 -714 -1087 955 990 -1389 -1368 1089 1239 -1033 -1381 725 1218 -992 -1236 983 630 -853 -518
1528 -518 629 332 -1017 -540 1013 30 -1514 -282 1471 186 -1201 -350 1127 183 -681 -190 1155
1545 1155 21 -769 257 948 -194 -799 700 993 -485 -701 578 1463 23 -1086 392 882 -281
1562b81k75J358M3j437L72J122o48j017J52J505n62r51J22J363m67j146M92P78
1580E23k93o77K14R96p05m64M94N18o41r19O76J115o56r13J022N90p16p17P76
1599B23O19p92p18J151j96l19l77O75J27n14p26J007L29q74l04Q26J07l18k92
1618c66Q36m5j061M94O05j45p66O81K80K6r42M55M41m01l06L15L15l71k30K40
1638E5K94n07l75P02J33m86o34P74Ok46l32P16K88m96m34L94M43l81l92M83K50
1659B55m01j85O34R4p46M48K28R2r36P07J40o5n11k50P34l19k36J29L21j63l49
1680c79J97K85J71q87L18N09k14n1J73R2K09j22J66K5j08j82l4K99k78l06L81
1701B64J42r7l54j10M81k78j47K47j2l31k21L70M9m04j11P79l58J04K9N05k43
$$ plain form
1562 -281 -556 802 845 -592 -220 902 254 -763 -611 894 332 -619 -497 866 399 -747 -255 523
1580 523 230 -447 -233 763 58 -406 88 606 -35 -954 -278 837 181 -732 290 880 164 -553 223
1599 223 842 50 -668 483 287 -32 -409 266 393 -121 -847 160 489 -385 -689 137 244 -74 -366
1618 -366 470 425 -636 -142 463 318 -448 233 513 539 -403 52 493 92 -214 101 416 45 -185 55
1638 55 349 -158 -533 169 302 -184 -818 -44 -38 -284 -616 100 388 -108 -542 -148 295 -86 -478 5 255
1659 255 -146 -331 303 397 -349 99 327 419 -517 190 330 265 -246 -496 238 -81 -317 -188 133 -30 -379
1680 -379 -182 103 274 -613 -295 214 0 -51 122 214 423 301 467 492 384 202 168 467 189 -117 264
1701 264 406 309 -45 -155 326 48 -99 148 136 -195 -416 -46 3 -401 -512 267 -91 13 42 547 304
1722C04n69M79nl7k58K83M80n47l56L91K65j57k84J91nk26J9N1j61l5j4l05L59
1745a37k48l43O45k21n7j68N77O5k61l10K49M30m66j99Q32K08o35M27l02m4l12
1766b70Q7N72o6n74J87K95k20k97Jl9O4j9k64O74n99J27n1L24J0l65K93K09k20
1789a41l12P94j88j58k10N06J76l48k13P09j06o20J98K36jq06L19N19m02l84M55
1810B3j03q2l56L34L93n89m23Q76L4p8l33O23r5k38k31K69N37k52j97J15N45n16
1832B56k22P07j0q46j37O12N1m04n92Q81N6o28j54N85m7q45P07P27m57n50M0R87
1854G17o99m81L55P72l45o16M20O34k45r76L92P70o42o54R54K71r64l85Q34K95
1874D07j010k08O59L34o83j61N81L09q93J94O48K4q05J87R20m84o28J20P65L54
$$ plain form
1722 304 -265 214 209 172 -86 197 677 130 -226 165 430 273 -11 180 175 -51 -32 19 -142 -177 -191 -496 -137
1745 -137 -385 -728 -83 -304 -361 -529 48 113 -148 -458 -209 221 -245 -444 388 596 -39 388 86 42 -270
1766 -270 -183 389 323 -251 -64 231 11 -286 -285 -324 -260 -279 -543 131 -468 -341 -392 -68 -58 -423 -130 79 -141
1789 -141 -453 341 153 -5 -215 291 467 119 -94 615 509 -111 87 323 322 -484 -165 354 -48 -432 23
1810 23 -80 -162 -518 -184 209 -380 -803 73 107 29 -304 319 224 -14 -245 24 561 309 112 227 772 256
1832 256 34 741 731 -115 -252 360 411 7 -585 296 352 -276 -430 155 108 -737 -30 697 240 -310 -270 717
1854 717 18 -463 -108 664 319 -297 123 757 512 -464 -72 698 56 -598 356 627 -337 -722 112 407
1874 407 -603 -811 -152 182 -501 -662 -81 228 -665 -471 177 201 -604 -417 503 19 -609 -489 276 630
1894F30j260L79P12j94o91K11N43N0j016O40L89l65o91N74R56p65j003N25Q03
1913D27m80o45L39Q91p07m50P97K82n80l62P88L86p70l43J110N93j462k63J142
1932F93J20r61j62Q68k25p96O5R67n16q39L46R59o99r04L81J448l94j061L35J278
1952I03m86j070O36L26l39p43P89Q25q04o96J042M55q18q43Q83P30q78m18O64
1971A58L21o96l49J007J21j265J86J086j1j716K92J447l0j298J00J255K0j252
1989f24L10Q30n02o91P28R67j224k19N23R03o41j274O53Q72k53r24J048J43q64
2008b39n11R50N45j049l62J146M88j433j63Q90M26j173m68J457L21j215n06J096
2026B00L62r16J8Q08l16q39P79K71o2j295M70J035k69r74L57J000l92p18M65P34
$$ plain form
1894 630 -630 -251 461 267 -424 -213 330 380 -636 4 393 28 -663 -89 867 102 -901 -376 427
1913 427 -53 -698 -359 532 -175 -625 172 454 -126 -488 300 686 -84 -427 683 1276 -186 -449 693
1932 693 813 -148 -310 558 333 -463 -398 569 53 -786 -440 519 -180 -1084 -703 745 351 -710 -375 903
1952 903 417 -653 -17 309 -30 -773 16 841 37 -659 383 838 20 -823 60 790 -88 -506 158
1971 158 479 -217 -566 441 562 -703 -517 569 558 -1158 -866 581 551 -747 -647 608 628 -624
1989 -624 -314 516 14 -677 51 1018 -206 -425 98 1001 360 -914 -261 611 358 -566 482 625 -239
2008 -239 -750 200 745 -304 -666 480 968 -465 -628 262 688 -485 -953 504 825 -390 -896 200
2026 200 562 -354 -336 472 156 -683 96 367 305 -990 -520 515 246 -728 -371 629 237 -481 -16 718
2046G18o72n56L88O52j020m33Q67O35o73o65O55Q10j174k60Q78N97j293J03O38
2065A95J93q91l50J401j06j107J47P98J95q18k00J131pj175L66J042p08l64j14
2084c72J075p29o82M72J040n23j017P47O46p45m12O44O56p90p34Q65O13r86r4
2103c26N67K48p76n31J142O37r91n02Q95O2j097K82P34j83n03j33Q72o5p22J50
2123b40Q56m39p50j47J612m33j000K57J023n76q66M27P45l00n97M26P89r97l44
2142e54N31M71k46p59O85M51n12o32O30M05k93p85O93m1l48l47P92K85q72Q9N57
2163B00K56r70k52J333j01o99k2O38k93l16N5L33k28n64L52P18l05n99M80M17
2183D33j79m61J68N31m03p46P25R3j99l21O14K9p12J32K90M72o33j09N79J27n88
$$ plain form
2046 718 46 -510 -122 530 -490 -923 -56 579 -94 -759 -104 706 -468 -728 150 747 -546 -443 195
2065 195 388 -503 -853 548 442 -665 -518 280 475 -343 -543 588 581 -594 -228 814 106 -258 -372
2084 -372 703 -26 -708 -236 804 281 -736 11 657 -88 -500 144 800 10 -724 141 754 -232 -326
2103 -326 241 489 -287 -818 324 961 -30 -532 363 425 -672 -390 344 161 -342 -475 397 332 -390 -240
2123 -240 616 177 -573 -720 892 459 -541 -284 739 163 -703 -276 469 169 -428 -2 787 -210 -554
2142 -554 -23 448 202 -557 128 579 67 -565 65 470 177 -608 85 44 -304 -651 141 426 -446 -357 200
2163 200 456 -514 -766 567 466 -233 -255 383 90 -226 -171 162 -66 -630 -278 440 135 -464 16 433
2183 433 254 -207 -39 492 89 -657 68 161 -38 -359 255 284 -428 -296 -6 466 -167 -276 303 430 -158
2204a58l27N51J80m34O4M34n1j09l93N19J27o22O6K29J64n53K79M71l44m90N37
2225A40J83k39o7m8L59m98R4N2M35j30n96K77L38l03k35J9N08m14l34M82M06n79
2247a50j48J76O22m90j08L29l52k03J92L48K31p40K89J30l9m48K82L00J53n02
2267a28J12J03L8l43n4N12l13l92O19P0j65n16M43J17j74j34J36M01m12j31K92
2288H1K51l13k21J7L84j33r6K69Q2m52R3J15L91m32q3J18r4j37n5N86j71l95L35
2311A40k24K54n37N41K1k04k79J96J88J45l01N3q7K63m16L81q5K27m36M5K26l14
2333b03P5K26j48j24K47l8r4J09n9j93J87k59p4M67J56n42L53K04n5j48j43M60
2355D04j63l18j28O42n04pk11L88J07l90K1K24N3l84O0P2L33n58L76J20L6m23
$$ plain form
2204 -158 -485 66 246 -188 -124 310 259 150 -243 276 403 -219 -153 76 240 -313 -34 437 93 -397 140
2225 140 323 84 17 -31 328 -170 -76 -24 411 281 -315 -38 300 -3 -238 -219 289 -125 -459 23 429 -150
2247 -150 -298 -122 500 10 -98 231 -121 -324 -132 216 447 -293 -4 126 87 -361 -79 221 374 -128
2267 -128 -16 87 125 -218 -272 240 -73 -465 154 224 59 -457 -14 103 -71 -205 -69 332 -80 -211 81
2288 81 332 19 -202 -185 199 66 -30 239 321 -131 -38 77 468 36 -47 71 -23 -160 -215 371 200 -195 140
2311 140 -84 170 -367 174 195 -9 -288 -92 96 241 -60 -7 -94 169 -247 134 49 276 -160 -115 111 -203
2333 -203 -128 98 -50 -174 73 35 -59 50 -9 -202 -15 -274 -348 119 275 -267 86 290 235 87 -56 404
2355 404 241 -77 -205 437 -67 -74 -285 103 210 -180 -159 65 118 -266 -206 -134 199 -359 17 137 173 -250
2377b50J40M45k74j4Q6j63J57j79j7J27j20J29q1K59l21J69r8M45j13n98L68j91
2399i4J79l05OK56k79J47Q2Q2J9m84N19j82k44M90r7J3k7K43M9k97r4j13L24j11
2423H2j54Q0K46m77O1L07j55l23L44Q0J00r9k8k28K29k47J37o2L62m15j60L89
2445F9J72m35j06P11l18q2K5L1l56L9O6L82k10Q7J54k42K75j71LRj74%N42l98
2469G3j03j32J30K08M5k85M6q5j29k54N91O7K5j09K9J15r0k42J83Jl2q0o3L37
2493B46l33J0M8K22m83J33L66j53l74J78N29j91m91M80J09n64K37NK92p3l36J36
2515gL38m80m53N55L21m06nK17M02m97j71J35K09m34P1M14k14k21o9N10m00j75
2537c60j86N79J07k37n8P7p9k4J35k15M86k98j7M3K76k00L24L2k62m38O01j24
$$ plain form
2377 -250 -110 335 61 47 133 -30 127 -52 -69 58 -62 67 -14 245 -76 93 -5 440 327 -271 97 -94
2399 -94 85 -220 -214 42 -237 -90 -8 74 93 -391 128 -54 -298 192 95 108 81 324 373 76 -18 -131 193 82
2423 82 -72 8 254 -223 -162 145 -10 -333 11 91 191 92 64 -164 65 -182 -45 -107 255 -160 -320 69
2445 69 241 -194 -300 411 93 11 36 67 -289 -250 -184 198 -12 75 229 -13 262 91 94 103 -71 -71 471 73
2469 73 -30 -162 -32 176 221 -64 -18 -103 -232 -486 105 172 197 88 117 232 142 -100 83 84 52 -28 -91 246
2493 246 -87 -77 -29 193 -290 -157 209 56 -318 -140 389 198 -293 187 296 -268 -31 -26 266 193 -143 -7
2515 -7 331 -149 -602 -47 274 -132 -137 80 482 -15 -186 -51 158 -276 -205 209 -5 -226 -295 215 -185 -360
2537 -360 -546 33 140 -97 -155 -78 -157 -181 -46 -261 225 -73 -90 -47 229 29 353 385 123 -315 286 162
2559A62J9k09Q3o0J05j95J80q9j07J06J03j10j28J20m1M04o02L17J06K50m54j51
2581a91K40Kk14P8M81l81j85J76J90J05k57k13M37j98k17Kl1J97n25M85K1j87
2603a85L0J67K02%m17J01L22l48j89L92J65k26k98M46K69k07n04K11J76q6j37
2624a16L31n8l79J82L29j01n86K91J02Jj53PL18j2l67J97L91o10j48N79o1R6m56
2647b23J61K98j05l51M1Q8lp8K56nl11j4M44p9l92LL71K59n62l1R05l09m71j22
2671b30L26j67K19k63J80m4k53J80L36k47m96O87j07M9p33P98J86n28l0L64k53
2692b6L58n79L05Jk43O1N6K29k39l37O27k26j75j71N79L6o70K73J73K02n86K65
2714h7Rm4m1k43P47R2o48l3M60k68k24K29J53q3l64N34J59k67l90L16RJ20l18
$$ plain form
2559 162 181 -28 55 -5 100 -95 85 -4 -111 -5 98 -12 -140 -20 -61 343 -259 58 164 414 -40 -191
2581 -191 49 51 -163 -85 396 15 -170 6 196 301 44 -169 268 70 -147 -145 -176 21 -504 -19 2 -185
2603 -185 -155 12 214 214 -203 -102 220 -128 -317 75 240 14 -284 162 431 224 -280 -69 107 21 -116
2624 -116 215 157 -222 -40 289 188 -398 -107 -5 -4 -157 -150 168 156 -211 -14 377 -233 -381 198 137 233 -223
2647 -223 -62 236 131 -220 -179 -91 -94 -172 84 79 -232 -246 198 119 -273 -270 101 360 -202 -233 672 363 -108 -230
2671 -230 96 -71 148 -115 65 21 -232 -52 284 37 -459 228 121 170 -563 235 421 -107 -137 227 -26
2692 -26 332 -247 58 59 -184 -123 -67 162 -77 -414 213 -13 -188 -359 220 256 -414 -141 32 234 -352 -87
2714 -87 -78 -122 -163 -406 341 433 -215 -248 212 -56 -280 -51 102 19 -345 189 348 81 -309 7 16 136 -182
2737a82p2L60K61n80L51r0J23l73L83j00k07O7N37j20q38K6P81k72j89j06M55
2758B15j36m74L37K89k74o8k50M91J34l43O4J74l1k61L10J82k45k53J03J75P1
2779B10l23m4K95j96k43K75J38o0k27K18j60L2m5L21r2j98j95L60m9rj96L7L89
2802B38m11p1K58K9R5m84O50lm71K24J1j00J38j58K5p9j01j05O10j13j71k66M57
2825B02n16J87L25M3n01l06O77mk98K35P9j13K20n33K65O6l26J50K20L0N6o23
2847d65O40m15J03j20L86k49o4K41P7J39m57LJ28K0j42J06K78j99k32K19K42l53
2869a14j66L60J27k38q7L20P2n95J41L02k28K67j41r5J76m3j47J43JLl18J51J81
2892G2j68j04K46j55p4J03J14J83l85J49L09m56J97J09M1l4m12K80J47k16J04
$$ plain form
2737 -182 -254 106 367 -213 138 48 171 -202 181 81 -126 -59 478 358 -480 -454 327 55 -134 -240 215
2758 215 79 -395 -58 231 -43 -111 -361 130 264 -79 -15 159 128 -133 177 359 114 -139 -36 139 210
2779 210 -113 -157 138 -58 -301 -26 112 52 -175 43 -117 -85 -130 191 99 -99 -294 66 17 8 -188 -151 238
2802 238 -173 -244 14 43 138 -346 304 301 -170 54 65 -35 103 -55 -30 -109 -210 -315 295 182 11 -255 202
2825 202 -314 -127 198 241 -260 -566 111 107 -191 44 123 10 230 -303 -38 28 -298 -148 72 102 158 -465
2847 -465 175 -240 -137 -257 129 -120 -184 57 134 273 -184 -181 -53 -33 -175 -69 209 10 -222 -3 239 -114
2869 -114 -280 80 207 -31 -118 202 274 -321 -180 122 -106 161 20 -75 101 58 -89 54 55 58 -260 -109 72
2892 72 -96 -200 46 -109 -183 -80 34 217 -168 -19 290 -166 31 140 181 147 -265 15 162 -54 50
2913E0R8M9k54K76k65o5J12o6N4J74Rk04O6q9O7j5j6J29m92K20L54l07J01l38
2937c52K26R3n8K49n6j22k08N0L31J20k73Q7n8K14J8j91J22P7j15j02l26K24m1
2960i1nL1J95J98l27J85L7k03j7J12K5r0n07M94m3kK71k39j78L73q7q4j08j2L23
2985B51j19j99k23K78O3J39m35L7L56k38m2J53K93l97L28j53J11oN9m40J84K66
3007B66l93L20k13J4j44J97J63k23Lp2N4n3J72p2L5l52K96l3J57k2L5j29q8n3
3031a35R0K20j77J98j86JR8K00j54k07N56n26p7N33m78N6l34M54J75j86P1k38
3053d6j75J64K58p3k64J52q7K57q6K6K7j21j3l85K46j00K21n1N8k44OL38k12K11
3077A07n57K76L92l2j85k11K54J96M4j91o4k17q7P2K54q2m17M91k40M43m41R5
$$ plain form
2913 50 148 197 -57 219 -46 -111 1 -65 -11 163 172 -32 34 -55 12 -3 -19 110 -382 -162 192 -115 -14 -352
2937 -352 -126 -33 -91 158 102 -20 -228 -178 153 273 0 87 29 243 261 70 192 269 154 52 -274 -50 -91
2960 -91 -96 -65 130 328 1 186 223 20 3 115 140 50 -457 37 -6 -8 263 24 -154 219 132 48 -60 -72 251
2985 251 132 -67 -290 -12 51 190 -245 -208 148 -90 -132 21 314 -83 245 92 203 197 256 -184 0 266
3007 266 -127 193 -20 -6 -150 47 210 -13 -10 -82 -28 -81 91 19 54 -298 -2 -35 122 100 135 6 -82 -135
3031 -135 -45 175 -2 196 10 11 109 309 155 -52 504 -22 -99 434 -44 12 -322 132 307 121 192 -46
3053 -46 -221 -57 201 128 -136 16 -71 186 100 126 153 32 19 -366 -120 -220 1 -50 8 -236 -230 108 -104 107
3077 107 -450 -174 218 186 1 -210 44 240 284 93 29 -188 -275 -203 51 -31 -448 43 -197 246 -195 -100
3099a00k9J87J11Q9j93k23k31L70K29l86K77p5pOJ00l94K02L52k14P7P2k33J97
3122A84j30o5l6K93j25k60J19L01l53K9j04Q9M21m68R3p0K82k58j33J78j29o2
3144b04R9o8lJ23j08R3J63n8k35J22P1l4N2J20M3k69j79J83J97j81L24k37K26
3167B40k30K42j58j62k9L49k74J98j27j1K31k95J77J07m15J33M2M2n6O6l3j0m2
3190a5knL68l40m63J27R7K61M0q5q5l10J12L49J81n20K42L9O7j55L41k97q5J62
3214B4p3K88l07N8k01K59P2j62j55J32RJ14l08L51r0k1Pj9P0k58j49M66q1k37
3238b11m2L68k46J99j36L25q4n90K28K22k07L43k30O6q8L4J60l8K25k86J11j94
3260g1M2n8O4Rj05k23M91q3l23j00M03j6l08M12k04j8l81J84N11k24J91n03L88
$$ plain form
3099 -100 -129 58 169 258 65 -158 -389 -19 210 -176 101 26 19 25 125 -269 -67 285 71 148 220 -13 184
3122 184 54 -11 -47 246 121 -139 -20 281 -72 -43 -147 -58 363 -105 -12 -82 200 -58 -191 -13 -142 -204
3144 -204 -105 -173 -176 -53 -161 -68 95 37 -198 -76 -5 -39 13 133 176 -93 -272 -89 108 -73 251 14 240
3167 240 10 252 94 -68 -97 252 -22 176 49 38 269 -26 151 258 -157 -24 18 60 4 70 37 27 -15
3190 -15 -17 -22 346 6 -457 -330 -233 28 68 -17 -102 -412 -300 49 230 -290 -48 -9 58 -97 244 -53 -138 24
3214 24 -49 239 -68 -10 -211 48 120 -42 -197 -65 -56 58 -250 101 11 -10 -3 -22 48 -210 -359 107 26 -211
3238 -211 -253 115 -131 68 -68 257 173 -417 -189 33 -174 169 -61 5 -83 -49 111 73 298 12 123 -71
3260 -71 -29 -87 -23 -14 -119 -342 149 66 -257 -357 46 30 -278 134 -70 -88 -469 -285 226 2 193 -310 78
3283G8j8M04l88O8j98R0J25j62l55O6L97J4K2m87M17j18p3J82O8J62l02J14J16
3306B22j03o4l54N01j29j47j10L24Qk95j97N86n31M03n3l0M3m14K89J27K18j17
3328A77k52J43O3k41K39J23k21k20L9J66j11j00K66n7k01p4L37J76j95k79K67
3349D5j51R3k71L42q8L29k60OkN7j24K24k11j20K15L80l76j36K8J8j59n9J41n8
3373a37K58NR4j52j9O5n80O68j39p7J34n0J49k37k50J32M74j83J12l63P8n1J41
3396G2O5k97K14k73N48m68J66J15P3j60J8J77l35J4p6J40J04L2j66M34l93j73
3418a69J29j81K36j3K39k94K00K1R4l97k34O47n0j04p8l43M10p7l58J12L65j65
3440a0j40K61m31K23RM1k33M01j28r0N3k66Q3r6K79l9K02J33k46Q9J7l94L77J00
$$ plain form
3283 78 60 464 76 144 -54 36 161 -1 -356 -290 107 121 143 -344 73 -45 -118 64 132 294 -8 106 222
3306 222 119 55 -299 202 73 -74 -184 140 148 -147 -344 242 -289 114 61 31 74 -340 -51 76 294 177
3328 177 -75 68 131 -110 129 252 31 -189 -150 16 -95 -195 71 14 -187 -261 76 252 57 -222 45
3349 45 -106 -13 -284 58 -30 299 39 45 43 100 -24 200 -11 -131 84 464 88 -48 -20 -2 -161 -220 -79 -137
3373 -137 121 126 220 68 49 114 -466 202 63 -14 120 70 219 -18 -268 -136 338 155 267 -96 -18 -69 72
3396 72 137 -160 54 -219 329 -139 27 142 215 55 73 250 -85 -71 -147 -7 97 129 -37 397 4 -169
3418 -169 -40 -221 15 2 241 -53 147 168 262 -135 -369 278 228 124 46 -297 113 36 -322 -210 155 -10
3440 -10 -150 111 -320 -97 -88 -47 -280 121 -7 -97 -44 -310 -227 -323 -44 -83 119 252 6 95 112 -282 95 195
3464A95M7k22R0J03m41j16L06P4j88J22N3k08j76J24O69l78k57K77k82K17J25
3485A34j22L39m05n7J79K34l37j29K65j42o3n9K65m1k46J09K1L9l09K80J88Pj32
3508A8j00N7J98j20l4J0K4k80K05P5k36K21J06j90O7O6J04j04lj23K57k98r5N51
3532C76k20k30N2j89j23K82k16L05j05J6k14L20P3n3k50K81n8j30K38k23K7K45
3554B04j93p8P1K72l64K8K1L07l39K92n15J14L4J88j73J85j54J58O9n8j45kJ77
3577I9j4k70q9K21K54l67J2J5L21Ok55L0k41L70k30M9L1L5l97N04l9r2Q2J31j57
3602IK08j01l12M44m3Qm59K50p1J32j20k7J72j43q3K90q9r2%J37k86J28K2l5j41
3627b02K74j57K12k66K44Lj22j98M2j0q6L05Jk27K20n5j82J38J11q8Q5K74p2n56
$$ plain form
3464 195 242 20 110 213 -228 -344 -38 36 -152 -30 23 -185 -361 -237 432 54 -203 74 -208 9 134
3485 134 12 351 -54 -111 68 302 -35 -164 101 -41 -104 -163 102 61 -185 -76 -55 -16 -325 -45 143 150 18
3508 18 -82 -25 173 53 19 29 53 -227 -22 53 -183 38 144 -46 21 87 191 87 84 -39 218 -80 -175 376
3532 376 156 -74 -22 -211 -334 -52 -268 37 -68 -52 -266 54 127 74 -176 105 47 -83 155 -68 -41 204
3554 204 11 -67 4 276 -88 -60 -39 268 -71 221 -294 -180 -146 42 -131 54 -100 58 127 69 -76 -78 99
3577 99 85 -185 -274 -53 201 -166 -154 -139 182 188 -67 -37 -278 92 -138 -89 -58 -23 -420 84 45 -47 35 166 9
3602 9 217 116 -196 248 205 213 -246 4 -67 65 -55 -82 90 -53 -136 154 65 -27 -27 110 -176 -48 -26 -61 -202
3627 -202 72 -85 127 -139 105 108 -14 -212 -170 -180 -266 39 40 -187 33 -22 -204 -66 45 -43 42 316 244 -312
3651c12K92j82J88K16p3M3j08P7k41p3K57j39p1P6J78p1J87n9l57P9m2L06n6j32
3675a7L5J06j01j1K0L6m1O9m60J98K58Nk1k97M67j03k73Nm6J17M3k99J13K70k26
3700a53K85k41J32r9K42R4m72K29Pn9K41k30K37j53n1K47j60j4j49J40O0K0j10
3723D3n32N42lR2j86N0k0r5q2L1J24J23L4k0k58o7K19J43k66L45l68K10J85nj16
3748A23l34K12J83p7j48K13k38K9J08P0J02j22M4l38K32q3j95M37j65k49J44J6
3770c6M8j44M5L4l20L66K21l41j17K97j14k9J69J01j62m14N92j73j02K4k9J37
3792E3K57n40K6K20n9J35j21rj47J11r1Q8M31k57r1oK53J98p10J61L51r9k20L0
3816c6J13op4lK1j04k63M53o7o8J80j4k28J71Q3k9k99J44K40k27J50j97N8J53
$$ plain form
3651 -312 -20 -202 -14 202 129 172 64 141 -100 -173 84 -55 -126 -50 128 57 244 185 -172 -93 -135 171 115 -17
3675 -17 18 124 23 12 32 68 27 96 -364 -166 92 97 76 -221 246 143 -130 -125 -171 -54 -11 -310 -197 73 -153
3700 -153 132 -109 23 -76 166 260 -212 17 24 -35 206 -24 213 60 9 256 96 82 -67 73 133 153 43
3723 43 -489 53 50 142 -44 6 -14 -109 -191 -160 -36 87 121 101 -157 -224 -5 138 -128 217 -151 59 244 239 123
3748 123 -211 1 184 107 -41 172 -66 -37 71 141 243 121 165 -173 59 -24 -219 218 53 -196 -52 -36
3770 -36 12 -132 -87 -53 -373 -7 214 -127 -244 53 -61 -90 79 180 18 -396 196 23 -79 -55 -84 53
3792 53 310 -230 -204 16 -43 92 -29 -38 -185 -74 -165 -77 354 97 6 0 253 451 -259 -98 253 154 -66 -36
3816 -36 77 71 -3 -6 15 -89 -352 101 34 -34 146 132 -96 75 158 129 -170 -26 214 -13 137 -60 -2 151
3840A51k69pK04o1K87l32M5j87J30K14n5k52R3o7L33k72K29j00kJ2oq7J82o8k65
3865a50j05P11k92l64L34n43K77K78p7L03k63k51K01O9m1n3M4K18l88PJ9J72n5
3888E1j15N5J89k36Qj72M7K67k62N54j95j81kk6j3K00k50P9j35J66j49J20J65
3911A65j15O5J6M0j96J85k40j19K97J04k53P2l45K60J56j39p9K00j93J56k15R4
3933h4J42j70R1q9L28k71m9L86m40L9R8K26L3m12L18ol50L51J31j82j60J9l04
3956c55L67r5rK17n4j45M7K52j67j00O1q4k02K12M09l36k5%q3j01Q1J37J28j27
3980B8L75p33L05k61J66N8k07j4M0r8J49M55P2k11k07j3p8N4m7J99r5J01o9L7
4004Fo8J55k28K04m47N51l32R3P8L4O6r8j08K4K66j46J63l04K65k59J99q5J04
$$ plain form
3840 151 -118 -125 79 18 305 -27 18 -169 -39 175 120 -132 -39 -106 227 -45 184 84 82 94 88 1 183 115 -150
3865 -150 -255 456 164 -200 134 -409 -132 146 69 372 109 -142 59 128 87 34 78 296 -92 -85 -66 106 51
3888 51 -64 -9 180 -56 -48 -220 -173 94 -168 386 191 10 8 -18 -31 169 -81 -2 -137 29 -120 0 165
3911 165 50 115 131 171 -25 160 -80 -199 98 202 -51 21 -324 -64 92 -47 -126 74 -119 37 -178 -84
3933 -84 58 -112 -21 -110 218 -53 -102 284 -156 -117 -19 207 240 -172 146 140 -210 141 272 90 -70 -51 -355
3956 -355 12 -83 -92 125 71 -74 -27 225 58 -42 19 -65 -267 -55 354 18 -7 -7 -90 -191 -110 27 155 28
3980 28 403 -330 -25 -286 -120 -62 -269 -283 -243 -341 -192 263 335 124 -83 -96 -174 -120 -167 32 -63 38 -31 6
4004 6 -62 93 -135 69 -378 173 -159 -66 12 46 112 14 -94 -70 196 50 213 -91 174 -85 114 29 133
4027A33j78K51l83N32l02J16n74L09J40L5j65K4P0l88M81k66J73j44J80J48j7
4048A75l69J17K91k56J84l24L80m54L91k06o3j26J91K24q7n04L80J14k19K50J22
4069B11j68N6j94K97k07j29k6K32K2J29k75K0j39J20l6K02N9k19m0K18m6k3j15
4092e1K74m53L07k67M26Qk33l1j36Q1k77J13K3M69k81q4K96k93oP3K95r5l69M19
4116B08k07N6Q9j22O6Ql1k1K33j60o7l72J56J30j00lj13P3L46P0k48M35l26j15
4140a5K12l52mJ64K78j29n0k03K32k7k58J76j00j75L83K00o09L03J4l3j0k23J24
4163a02M9J61j00O9K02l68Q7J75k63j78M12k46K86m42L28r2J66j88K01J51k21
4184H7k0k55K27R4j46lP9n5J46j83jJ97l27K03Q9K3k26L48k28J74l85K30p8N8
$$ plain form
4027 133 -45 206 -177 355 53 169 -405 -96 44 79 -86 -62 8 -380 101 -165 8 -136 44 192 175
4048 175 -194 -77 214 -42 142 -182 198 -256 135 -71 -134 -260 -69 155 68 -436 -56 58 -161 89 211
4069 211 43 99 -95 202 -5 -134 -160 72 94 223 -52 -32 -171 -51 -87 115 174 -45 -85 133 87 64 -51
4092 -51 223 -230 77 -190 236 244 11 -20 -156 -75 -352 -239 -216 253 -28 -112 184 -109 -115 -42 253 158 -211 208
4116 208 1 57 146 24 90 98 67 46 279 119 52 -320 -164 -34 -134 -137 -250 -177 169 239 -9 426 100 -15
4140 -15 197 -155 -159 5 283 154 104 -99 133 106 -152 24 -76 -251 132 332 -277 26 40 7 -3 -226 -102
4163 -102 -53 108 8 77 279 -89 -2 173 -90 -268 144 -102 184 -258 70 -22 144 -44 157 308 87
4184 87 67 -188 39 133 -13 -16 63 8 154 -29 -30 167 -160 43 132 155 -71 277 49 223 -162 68 -10 48
4208D8n0o8K39l09O9J99q8j92L95j30j45m2Q5j13mR5J32p4j3l21J87L70j52j93
4232g5M12j58l00K02k28J64K09l13R5j68M7O9J40k81M04p1m96N39k38j67L28j02
4254A2J08Lk00J99m7j26L9j1o6J11K08j6j99k46K69p4J47k68K1L78l43K90j97
4277ho2J55k12j83N53p3k09K1Q5n5l0M0K40m6l1m50L41j9J7Lm2P4%j08l36J87
4303a48N6K48p6J28m33L58N7k94R7L9j19J08p8k3q8L25o6k47N27k72q3j14o6K03
4327C9K20j57k51J52j90K34J19j07o2j02K1J06j70N0p1K95j67l9R2J6J43k86M6
4350f9K09r6j62m5K79l95J72J01j56K89q3K05k64J19k44J89J67m02M34n4q7k27
4372a20k01J20L36M2r9J35O2l03K6j78m4n0K90Q8J04k01OJ17n1J16k79k22J60
$$ plain form
4208 48 -2 -70 169 -140 -71 128 40 -152 243 113 -32 -74 11 -102 -106 -11 121 47 34 -287 -100 270 118 -75
4232 -75 337 179 -121 81 -147 17 226 -87 8 -160 -113 -44 96 -185 219 148 -348 191 -47 -214 114 12
4254 12 120 123 -77 122 75 -51 -12 -23 -89 22 230 214 15 -231 38 -36 111 -157 -136 242 -101 189 -8
4277 -8 -70 85 -127 -310 243 170 -39 -18 67 12 -18 22 262 216 185 -265 76 57 74 77 35 109 109 1 -335 -148
4303 -148 -92 156 80 208 -225 133 190 -104 -7 32 -87 21 -57 -80 -168 157 91 -156 371 99 16 -98 -164 39
4327 39 259 102 -149 3 -187 47 166 59 -3 -105 -84 22 -148 -98 -169 126 -41 -80 12 28 171 -115 -69
4350 -69 140 44 -118 -163 116 -279 -107 -6 -162 127 44 249 -15 104 -140 49 216 -186 248 194 107 -120
4372 -120 -321 -201 135 177 78 213 275 -28 -2 -180 -224 -274 16 104 208 7 13 130 79 195 -84 -306 -146
4395a46J65k47K40N5m41M62k54J78j00o9M16l00R8k04J09J70j75M3k03K21k65
4416b47K07J45L30m91k75M05K02l50pJ78k85L41j04j67R3J38P0k24J60Qj68J55
4438A14J13k99K49J54l05j78J59Q4k5j43N9mJ36r1n6J32m56J24nK44q2J59j08
4461b5j89L10j52J51k37L18m63L92j41J0k53M0K59k94M17k57J24p0J13J2o3M47
4483D49l77j94K27N8J77k22k18JJ38J92j76r9j62K57J68m43M32k15p7Lm2M22l67
4506f8m7K97l69L6L3J83l95Q1L10kk70L90kk96K50j70q5j32M80j21k55L43j68
4529B3j90J47j36K5N7q4O7K66k81N3J86k05J18k76L10Mk33J18j96L60P5l34J77
4552E1j90N1J91K6j36j37K94l74J35O3K80q1J31o25M14j89L6J96m0k40N7l9J33
$$ plain form
4395 -146 19 -228 12 67 -374 88 -166 12 -88 -157 259 -41 57 -147 -38 132 -43 0 -203 18 -247
4416 -247 -40 105 435 -56 -331 74 276 -74 -81 97 -188 153 49 -118 -25 113 183 -41 119 127 -41 114
4438 114 227 -72 177 331 26 -152 7 91 66 -77 -18 -22 114 23 -33 99 -357 -233 -238 6 -76 83 -25
4461 -25 -214 96 -56 95 -142 176 -287 105 -36 -26 -279 -239 20 -274 143 -114 10 -60 53 65 2 449
4483 449 72 -122 105 163 340 118 -100 -99 39 231 55 -44 -206 51 219 -224 208 -7 -84 -81 -123 299 -68
4506 -68 -115 182 -187 -151 -118 65 -330 -249 61 59 -211 179 177 -119 131 -39 -124 -256 224 103 -152 191 23
4529 23 -167 -20 -156 -131 -74 -158 -91 175 -106 -53 133 -72 46 -230 80 84 -149 -31 -227 133 208 -126 51
4552 51 -139 -88 103 129 -7 -144 150 -224 -89 -26 254 173 304 -321 93 -96 -60 136 96 -144 -87 -126 7
4575GN9K49j33j3j69K79l67j47m8M50j94l5K6k19K08O8r6J99k27J76P3j61N8j35
4599i2L46l09J98j70N1K36m05N6q1L66Q7k98k42M27k11J5J40N4k69L06k13J57
4621A49j00j05K52j34k65J47M32k82j61L29o66N55o0k38K36l93L00j62K22m0J10
4642A26k43K88o0K23m51L15l90K21No9L9r6J36k44K15K41l37J10k53L15qJ01k04
4665b0J84J9j24oJ66n2k2J60m09J62j60J31j59K32j49K38p1k30j77L09j94L88
4687B16J18l42K55j35Qk52J44N4j38M30n36Q3K33j06J13j54J16j85P0J24l36K60
4709D0j37N0J06k8L37l81j97M3K5j66L20J22j94K84k49k8K55m47l6J83L12m24
4731b10K97m0N7l6N8k72K70k54J86qp2k55L85k8k45L64k71n0J15j8j59J55j05
$$ plain form
4575 7 66 315 182 169 0 279 -88 -235 -283 167 -27 -62 -36 -255 -47 21 -75 124 -103 73 146 -15 43 -92
4599 -92 254 -55 143 -27 24 260 -145 -89 -170 196 283 -15 -257 170 -41 -26 114 168 -101 205 -8 149
4621 149 49 -56 196 62 -203 -56 376 94 -67 262 -404 151 91 -147 89 -304 -4 -166 56 16 126
4642 126 -117 171 111 334 -117 198 -192 29 34 -35 4 -92 44 -200 15 256 -81 29 -224 91 83 184 -20
4665 -20 164 183 59 53 219 167 145 305 -104 58 -102 29 -130 102 -47 191 120 -110 -287 22 -172 216
4687 216 334 -8 247 112 120 -132 12 66 -72 358 -178 -95 138 32 145 -9 107 -78 -8 116 -220 40
4709 40 -97 -47 59 31 368 -13 -210 -167 -142 -308 12 134 -60 224 -25 -53 202 -245 -281 -98 214 -210
4731 -210 87 47 104 68 126 -146 124 -130 56 48 -24 -279 106 78 -167 197 -74 -124 -9 -27 -186 -31 -136
4754a36j2J21qR5rl71K56j5m0K05j34K6J66k88J03K01j60J23p2l61J93J26r5J06
4778B0m03M63k21j37J75M1j27M9M01j39J33j65j95L87k89k84K08M4J87m54L73
4799F7J05l05O1L33m50J13K41j57j4R4k49J02K3l3K33r5k12J60R9j77o3K9K5J27
4823E7Jj39K15m29M87K57l82l7J19j4j43j22J39J0L3k40p3N20J26r0l37K44l34
4846a32j12J69q5J03k05M7J58P7M09n25J00P5m22M14o5Q9L2L5k5k46J4L7J12j39
4870h5M6K80l67l5Nj3L13k12K41k70K85K2m20J84m9K59m38K50j13L62k2Q7m70
4893a60k88L18K01j41J62p2j75K13j00J30j51L54j63l8k02M06m04m3J02K54l74
4914a71J19J56K07j89l34K04k15K67j04J85k00OL8l1l4K77o8k72K13j70L05m18
$$ plain form
4754 -136 -148 -27 -35 60 51 -320 -64 -79 -119 86 -48 -22 144 -144 -41 160 0 123 51 -310 -117 9 -86 20
4778 20 -383 80 -141 -278 -103 -62 -189 -140 261 122 255 90 -105 282 -7 -291 -83 -39 148 -306 67
4799 67 172 -133 -72 261 -189 -76 165 8 -6 88 -161 -59 -36 -69 164 69 -143 17 116 -61 -124 -95 -70 57
4823 57 58 -81 134 -295 192 449 67 30 149 135 -8 -130 9 19 52 -188 -261 259 385 295 -42 202 -132
4846 -132 -244 -75 -160 -57 -262 -215 -57 20 429 -96 4 79 -343 71 6 95 127 162 137 -109 -95 -58 54 -85
4870 -85 -39 241 -126 -161 -156 -169 144 -68 173 -97 188 210 -210 -26 -75 184 -254 -4 -117 245 223 310 -160
4893 -160 -448 -130 71 -70 92 20 -155 58 -42 88 -63 291 128 90 -112 294 -110 -153 -51 203 -171
4914 -171 -52 104 311 122 -212 -8 -223 44 -60 125 -75 -69 -31 -62 -96 181 113 -159 54 -116 189 -229
4936b29J47P9%R6Q4Nj16k83K01J2KP7L4l10J51J93l30L03l96J04J74Jm1K63j15
4961A06j2j7k58J14K00M0j77q1j2K4k4q4K72j30J96l40M8L6nk15M26l27K72m33
4985c81J66J84R1m0j30K68N0n68M52j26J47l58J78L12m30L78l44j86N37j33j23
5006e6k58K85k5K02o5k77L61j86l61L95J01j09o7l18M97l78K64n3J12j88J41K76
5028B93m25J10M8K59l90K2lK20j06nO8J28m55J83J21k01K01mr1N0j30J6K55j58
5052FR5m46K06K14j25M5r3L4L74k36k5K03ok50O8L23o43M65k1j32M5p9kr7j50
5077b27L82J00n11K1L50J19j87r2L64K3m71L44k39J28m7j90J36j43J46r8O0j18
5099a50J78J30k03J8j07K07J6J51q6r3J96n4j06j16L2J6Q8j83L6n2N21n72J25
$$ plain form
4936 -229 -82 -3 -3 93 177 182 66 -217 -16 -4 -2 75 109 -201 -50 143 -187 116 -280 -176 -2 -1 -42 221 106
4961 106 94 77 -181 -67 133 173 -4 -85 -97 -73 -97 -181 91 -39 157 -183 -135 -99 -104 -319 107 -220 52 -381
4985 -381 -215 -31 60 20 -110 158 208 -360 92 -34 113 -245 -67 245 -185 193 -151 -337 200 67 -56
5006 -56 -314 -29 -54 148 83 -194 167 -19 -380 15 116 7 -60 -378 119 -259 5 -48 64 -124 17 293
5028 293 -132 -22 26 285 -105 -83 -86 134 28 23 91 219 -236 -53 68 -133 68 64 -27 23 -107 -91 164 6
5052 6 101 -345 -139 75 -50 -5 -98 -64 310 74 49 252 246 -4 64 387 -256 209 188 56 101 22 20 -77 -227
5077 -227 155 255 -256 -235 115 234 47 -45 319 342 -129 215 -24 104 57 -133 3 -140 6 -92 -32 -150
5099 -150 28 158 -45 -27 -134 73 89 240 154 61 257 203 97 -19 13 29 117 -66 -30 -82 439 -133 -8
5122hk11J37K92j02k70J18m7K42N4Qk42J19Lj87J08j96J97n2J29k94J84K53j48
5145H7M7k73K71m0k32K15K2K34l26k92M66j90j11k07M85j82r4J38m7j03J01m2
5167g3j17L70j89K53J30l82K9n3k77K56m1j82K92O4N0p4k44P0k9N02l54J56k01
5190d4J91l10q2L88j19R1rp5q0J87O8j85J81l38j57N43k60J60l54L87o9n9m7k33
5214b25oK44P0o5K82l8l94R1K53k86L58J42l26k55J92K14j50j00j5q7K23k37K93
5237A78K0M7k88J52P2jk09m9M60r4k70N6L0k09M3j05L88j71k30K94k39J75M7J61
5261B58j49o2p0K12m93L91Mm23N70p6j08k86L26q7n9J4L8L0J60m11L67k98K2P
5285a23O3m2L30k75m2K49l76M47j11k47J2J77j17K77j54J03l4r7l04L03m50L84
$$ plain form
5122 -8 -219 -82 210 108 -162 -44 -91 151 205 213 -29 90 93 -94 14 -182 15 -37 92 -202 -18 235 87
5145 87 134 -139 132 92 -140 75 97 331 5 -287 179 -11 -122 -329 156 -26 -120 18 -29 -132 -31 -73
5167 -73 -190 180 -9 244 374 -8 21 -32 -309 -53 -94 -276 16 80 130 56 -188 -118 -147 355 1 157 -44
5190 -44 147 -163 -245 143 24 115 106 31 -49 138 206 21 202 -136 -293 250 -10 150 -204 183 114 55 8 -225
5214 -225 -231 13 83 18 300 262 -132 -41 212 -74 284 426 100 -155 37 251 101 1 -14 -101 122 -115 178
5237 178 198 245 -43 109 181 180 -29 -78 382 288 18 74 104 -105 -62 -167 221 50 -180 114 -125 50 97 258
5261 258 109 47 -23 189 -304 87 91 -332 238 162 54 -232 94 7 -52 -38 0 30 190 -221 146 -152 -130 -123
5285 -123 -60 -102 228 -47 -89 160 -216 231 120 -127 -115 62 -55 222 68 171 137 40 -264 39 -411 -27
5307b7m7K9M6K0j57P9KJ06Rj19J81m42L87j91K6L51j83r2l6K61J1k08J94k54N1
5332cJ09rj63p4K57j68q4J3n2M3L07j09k63L16k02Q9rK9P5j70J8K70l76K19r4
5357c1O7p7k91L03J01nk33j17M83n6K0j1k32l3Q7K14j19R6p3j58P4J56j94m9o3
5382a41K99j46l30K56J52r1k2L03o0k08K50o89M38j03L9J0J37L1l28M09j93k06
5404a93N6K08m45M19K0o0r3M1k98L34K0M9R0j36l4p0K53j87j92mJ64qm9K46J14
5429B45j73k69J89Mj74k3K80n0L6q7K38k66j12K09q4k38J41l6L06j14j01k3o8
5452a70L66l74K58q3M7J36r4NK78p37K99N27n46J80l4k03k71N06J9O6o4j74O2
5475aJ13o7J82k46j89K03j18K06m15K92Q7N0k91J89n8Rj64R5M7RK18j73J51J83
$$ plain form
5307 -27 -74 -45 1 21 -136 -57 -55 51 60 -59 122 -320 67 -124 -98 253 70 -22 -58 203 214 6 200 -54 -3
5332 -3 106 97 -66 -140 117 -51 -135 -122 -174 -131 176 67 -196 120 -82 7 -2 27 102 -68 -50 220 -156 63 -31
5357 -31 36 -41 -332 -29 72 67 -166 -283 200 144 164 153 -79 -112 -25 189 70 166 93 -65 9 165 -29 -78 -141
5382 -141 158 12 -318 -62 90 -1 -23 280 220 12 262 -427 11 -92 -53 -43 94 125 -203 206 13 -193
5404 -193 -137 71 -374 45 65 5 -88 -47 -345 -11 9 58 148 12 -22 -92 161 -26 -218 -222 -58 -66 -115 131 245
5429 245 72 -197 -8 -4 -178 -201 79 29 65 -22 216 -50 -162 47 -37 -275 -134 -170 136 22 -79 -102 -170
5452 -170 196 -178 80 -3 44 180 86 91 369 -368 -69 458 -88 92 58 -145 -416 90 109 175 111 -63 -1
5475 -1 112 45 227 -19 -208 -5 -123 83 -332 -40 47 97 -194 -5 -63 -54 -218 -123 -76 -67 151 -22 129 312
5499C12l03J86M4k53J98l95L41K3l10J31J36m86M86m23K28K77k49j30P0K05m11
5520c23J61j85J62J28K10j97J66j63M0P4k02K38o7RJ33l20L7Q9P5M3o09L47K42
5543H8k33J83n2K6J33KL3k13J24j66J65k30r5L09J29n81J71M14n75K10K01j70
5565a27j55P4L09l78N15m67L94k83J55j1j37M9P0K0k79J87R1j5rL40o15L49K5
5588A02m7j41J3K17k02m5O6L5K20k79j4J13j01k68J30O6J20K20l38M01j6o7l30
5611a45R3j36L00j59N2k62L62j65J81k11q5M81k53J88N5l75J80m4QO1m00J78r3
5634a89M32or5O2k04m1J22j51R7J70O1k34N9L0l47L25k20j50P05o12L04l7R6P
5658A84L9l52j14L41o0L4m8J76j61k01L19k83L34k89K6K83j64j42Q3j36J92j55
$$ plain form
5499 312 9 195 239 -14 184 -211 130 153 -157 -26 110 -376 110 -313 -85 192 -57 -187 -117 88 -323
5520 -323 -162 -347 -185 -57 153 -44 122 -41 -1 73 -129 109 42 51 184 -136 -99 -10 65 108 -501 -154 88
5543 88 -145 38 -14 12 145 147 180 -33 91 -75 90 -140 -235 74 203 -378 -207 207 -368 -158 43 -127
5565 -127 -282 -208 101 -277 238 -229 165 -118 37 26 -111 -62 8 28 -251 -64 27 12 3 343 -272 77 102
5588 102 55 -86 -73 144 -58 -103 -37 -2 218 -61 -75 38 -63 -331 -201 -135 -15 205 -133 268 252 185 -145
5611 -145 -52 -188 112 -47 5 -257 105 -60 121 -90 -175 306 53 241 296 -79 101 57 65 126 -274 -96 -189
5634 -189 243 237 142 204 0 -41 81 -70 27 197 258 24 83 113 -234 91 -129 -279 426 -186 118 81 177 184
5658 184 223 -129 -243 98 38 72 24 200 39 -162 157 -126 208 -81 -55 228 64 -78 5 -131 61 -94
5680i4O9M19o00P6L64k25M4O1J51l17oK53k29J91j29N5k60L5L14k73M98j75p3
5703A49k17l6K35l64L60j18o9K3Q3q0J48l22J89Q1J52j28J96l28m7J28K10j34
5725A11k35J96j20l76J34K69K69j66j31J62J1l4m99L19L7j58J6K35m2n1k00P5
$$ plain form
5680 -94 -25 394 -206 -130 234 9 53 114 265 -52 -58 195 -34 157 28 83 -177 -142 172 -101 397 222 149
5703 149 -68 -104 131 -233 127 9 -60 -37 46 -34 114 -208 -19 62 214 86 282 -46 -93 35 245 111
5725 111 -124 72 -48 -424 -290 -21 248 82 -49 113 124 90 -409 -90 -53 -211 -195 40 -2 -53 -253 -178
$$ [...]
8191A9
##END NTUPLES=NMR FID
##END=
