##TITLE=1H_BAU-DTG
 CDCl3, 8 sc, 
 25.6.2019
##JCAMPDX= 6.0         $$ Bruker NMR JCAMP-DX V2.0
##DATA TYPE= NMR FID
##DATA CLASS= NTUPLES
##ORIGIN= UXNMR, Bruker Analytische Messtechnik GmbH
##OWNER= root
$$ XWIN-NMR		Version 3.5
$$ Tue Jun 25 14:36:32 2019 Russian Standard Time (UT+4h)  she@DPX200
##.OBSERVE FREQUENCY= 200.13155
##.OBSERVE NUCLEUS= ^1H
##.DELAY= (6, 6)
##.ACQUISITION MODE= SIMULTANEOUS
##.ACQUISITION SCHEME= undefined
##.AVERAGES= 8
##.DIGITISER RES= 18
##SPECTROMETER/DATA SYSTEM= spect
##.PULSE SEQUENCE= zg30
##.SOLVENT NAME= D2O
##.SHIFT REFERENCE= (INTERNAL, D2O, 0, 15.7039)
##AUDIT TRAIL= $$ (NUMBER, WHEN, WHO, WHERE, WHAT)
$$ ##TITLE= Audit trail, XWIN-NMR		Version 3.5
$$ ##JCAMPDX= 5.01
$$ ##ORIGIN= Bruker BioSpin GmbH
$$ ##OWNER= she
$$ F:/spectra/data/she/nmr/H-F/1/audita.txt
$$ ##AUDIT TRAIL=  $$ (NUMBER, WHEN, WHO, WHERE, WHAT)
(   1,<2019-06-25 14:35:20.78 +0400>,<she>,<DPX200>,
      <created by zg, POWCHK disabled, PULCHK disabled
       configuration hash MD5:
       00 E9 B6 7A A2 85 ED C7 34 08 36 98 17 FE 4E 26
       data hash MD5: 16K
       74 3F 42 40 5C 4F E0 20 F8 F6 4A 04 75 E1 0B 7B>)
$$ ##END=
$$ 
$$ hash MD5
$$ F1 F3 4F 69 AD 7C 23 32 5B 00 6E 26 45 18 FF BB
##$RELAX= 
##$RELAX= 
##$RELAX= 
##$RELAX= 
##$RELAX= 
##$RELAX= 
$$ Bruker specific parameters
$$ --------------------------
##$DU= <F:/spectra>
##$EXPNO= 1
##$NAME= <H-F>
##$PROCNO= 1
##$TYPE= <nmr>
##$USER= <she>
##$AMP= (0..31)
100 100 100 100 100 100 100 100 100 100 100 100 100 100 100 100 100 100 
100 100 100 100 100 100 100 100 100 100 100 100 100 100 
##$AQSEQ= 0
##$AQ_mod= 1
##$AUNM= <au_zg>
##$AUTOPOS= <>
##$BF1= 200.13
##$BF2= 200.13
##$BF3= 200.13
##$BF4= 200.13
##$BF5= 200.13
##$BF6= 200.13
##$BF7= 200.13
##$BF8= 200.13
##$BYTORDA= 1
##$CFDGTYP= 0
##$CFRGTYP= 5
##$CHEMSTR= <none>
##$CNST= (0..31)
1 1 145 1 1 1 1 1 1 1 1 1 1 1 1 1 1 1 1 1 1 1 1 1 1 1 1 1 1 1 1 1 
##$CPDPRG= <>
##$CPDPRG1= <>
##$CPDPRG2= <>
##$CPDPRG3= <>
##$CPDPRG4= <mlev>
##$CPDPRG5= <mlev>
##$CPDPRG6= <mlev>
##$CPDPRG7= <mlev>
##$CPDPRG8= <mlev>
##$CPDPRGB= <>
##$CPDPRGT= <>
##$D= (0..31)
0 1.2 0 0 0 0 0 0 0 0 0 0.03 0 0 0 0 0 0 0 0 0 0 0 0 0 0 0 0 0 0 0 0 
##$DATE= 1561458920
##$DBL= (0..7)
120 120 120 120 120 120 120 120 
##$DBP= (0..7)
150 150 150 150 150 150 150 150 
##$DBP07= 0
##$DBPNAM0= <>
##$DBPNAM1= <>
##$DBPNAM2= <>
##$DBPNAM3= <>
##$DBPNAM4= <>
##$DBPNAM5= <>
##$DBPNAM6= <>
##$DBPNAM7= <>
##$DBPOAL= (0..7)
0.5 0.5 0.5 0.5 0.5 0.5 0.5 0.5 
##$DBPOFFS= (0..7)
0 0 0 0 0 0 0 0 
##$DE= 6
##$DECBNUC= <off>
##$DECIM= 24
##$DECNUC= <off>
##$DECSTAT= 4
##$DIGMOD= 1
##$DIGTYP= 9
##$DL= (0..7)
0 120 120 120 120 120 120 120 
##$DP= (0..7)
150 150 150 150 150 150 150 150 
##$DP07= 0
##$DPNAME0= <>
##$DPNAME1= <>
##$DPNAME2= <>
##$DPNAME3= <>
##$DPNAME4= <>
##$DPNAME5= <>
##$DPNAME6= <>
##$DPNAME7= <>
##$DPOAL= (0..7)
0.5 0.5 0.5 0.5 0.5 0.5 0.5 0.5 
##$DPOFFS= (0..7)
0 0 0 0 0 0 0 0 
##$DQDMODE= 0
##$DR= 18
##$DS= 0
##$DSLIST= <SSSSSSSSSSSSSSS>
##$DSPFIRM= 0
$$ [...]
##$SUBNAM2= <"">
##$SUBNAM3= <"">
##$SUBNAM4= <"">
##$SUBNAM5= <"">
##$SUBNAM6= <"">
##$SUBNAM7= <"">
##$SUBNAM8= <"">
##$SUBNAM9= <"">
##$SW= 24.9336996594482
##$SWIBOX= (0..15)
0 0 2 0 0 0 0 0 0 0 0 0 0 0 0 0 
##$SW_h= 4990.01996007984
##$TD= 16384
##$TD0= 1
##$TE= 0
##$TE2= 300
##$TE3= 300
##$TEG= 300
##$TL= (0..7)
0 120 120 120 120 120 120 120 
##$TP= (0..7)
150 150 150 150 150 150 150 150 
##$TP07= 0
##$TPNAME0= <>
##$TPNAME1= <>
##$TPNAME2= <>
##$TPNAME3= <>
##$TPNAME4= <>
##$TPNAME5= <>
##$TPNAME6= <>
##$TPNAME7= <>
##$TPOAL= (0..7)
0.5 0.5 0.5 0.5 0.5 0.5 0.5 0.5 
##$TPOFFS= (0..7)
0 0 0 0 0 0 0 0 
##$TUNHIN= 0
##$TUNHOUT= 0
##$TUNXOUT= 0
##$USERA1= <user>
##$USERA2= <user>
##$USERA3= <user>
##$USERA4= <user>
##$USERA5= <user>
##$V9= 5
##$VALIST= <valist>
##$VCLIST= <CCCCCCCCCCCCCCC>
##$VD= 0
##$VDLIST= <DDDDDDDDDDDDDDD>
##$VPLIST= <PPPPPPPPPPPPPPP>
##$VTLIST= <TTTTTTTTTTTTTTT>
##$WBST= 1024
##$WBSW= 4
##$XGAIN= (0..3)
0 0 0 0 
##$XL= 0
##$YL= 0
##$YMAX_a= 66998
##$YMIN_a= -105590
##$ZGOPTNS= <>
##$ZL1= 120
##$ZL2= 120
##$ZL3= 120
##$ZL4= 120
##$ABSF1= 10
##$ABSF2= 0
##$ABSG= 5
##$ABSL= 3
##$ALPHA= 0
##$AQORDER= 0
##$ASSFAC= 0
##$ASSFACI= 0
##$ASSFACX= 0
##$ASSWID= 0
##$AUNMP= <proc_1d>
##$AZFE= 0.1
##$AZFW= 0.1
##$BCFW= 1
##$BC_mod= 2
##$BYTORDP= 1
##$COROFFS= 0
##$CY= 11.3945322036743
##$DATMOD= 1
##$DC= 2
##$DFILT= <>
##$DTYPP= 0
##$F1P= 18.9103706918063
##$F2P= -1.10871071338519
##$FCOR= 0.5
##$FTSIZE= 0
##$FT_mod= 4
##$GAMMA= 1
##$GB= 0.15
##$INTBC= 1
##$INTSCL= 1
##$ISEN= 128
##$LB= 0.24
##$LEV0= 0
##$LPBIN= 0
##$MAXI= 10000
##$MC2= 0
##$MEAN= 0
##$ME_mod= 0
##$MI= 1.114404
##$NCOEF= 0
##$NC_proc= 0
##$NLEV= 6
##$NOISF1= 3.799351
##$NOISF2= 2.8
##$NSP= 1
##$NTH_PI= 0
##$NZP= 0
##$OFFSET= 15.70392
##$PC= 1
##$PHC0= -8500.167
##$PHC1= 19.60097
##$PH_mod= 1
##$PKNL= yes
##$PPARMOD= 0
##$PSCAL= 0
##$PSIGN= 0
##$REVERSE= no
##$SF= 200.130013532006
##$SI= 16384
##$SIGF1= 3
##$SIGF2= 2
##$SINO= 400
##$SIOLD= 16384
##$SREGLST= <1H.CDCl3>
##$SSB= 0
##$STSI= 0
##$STSR= 0
##$SW_p= 3612.71676300578
##$SYMM= 0
##$S_DEV= 0
##$TDeff= 0
##$TDoff= 0
##$TI= <>
##$TILT= no
##$TM1= 0
##$TM2= 0
##$TOPLEV= 0
##$USERP1= <user>
##$USERP2= <user>
##$USERP3= <user>
##$USERP4= <user>
##$USERP5= <user>
##$WDW= 1
##$XDIM= 8192
##$YMAX_p= 0
##$YMIN_p= 0
$$ End of Bruker specific parameters
$$ ---------------------------------
##NTUPLES= NMR FID
##VAR_NAME=  TIME,          FID/REAL,        FID/IMAG
##SYMBOL=    X,             R,               I
##VAR_TYPE=  INDEPENDENT,   DEPENDENT,       DEPENDENT
##VAR_FORM=  AFFN,          ASDF,            ASDF
##VAR_DIM=   8192,          8192,            8192
##UNITS=     SECONDS,       ARBITRARY UNITS, ARBITRARY UNITS
##FACTOR=    0.0002004,     1,               1
##FIRST=     0,             0,               0
##LAST=      1.6414764,     0,               0
##MIN=       0,             -105590,         0
##MAX=       1.6414764,     66998,           0
$$ Real data points
##PAGE= N=1
##DATA TABLE= (X++(R..R)), XYDATA
0@%%%%%%%%%qJ6j6J6j6K4l2L4m2N1n9P2q4R4j09J26j45J68j90K15k46K78l10L46
33A83l89M36m86N42o02O69p42Q20r09J006j113J233j367J519j689J883k108K370
51A256k682L060l530M131m933O063p790J0793j7503O2148k5282q2672N1966J2647
65G672j2823J9454M2030m0299p0682k0762M7474L7436j182j0741L286l2396m0888
78g2421K8298P0578Q394k6291j828j1157l3339J4974N8084K5020k6387l2132j1508
91i715K118k103J1426M0307Q456o4857m4516L7349K7389k3536J2173L6617l1262
104a54o0616R919N2195J6400j3041o44O574j6279k3932K2545N2146J257l8578
117G792j43J3756k4518n516M4757J2076m1799j8061J3571m487j3261J1582K0717
$$ plain form
0 0 0 0 0 0 0 0 0 0 0 -8 8 -8 8 -8 16 -16 18 -24 27 -32 40 -44 50 -59 67 -78 90 -100 115 -131 147 -163 183
33 183 -206 230 -256 286 -316 353 -389 431 -478 528 -585 648 -719 800 -889 994 -1114 1256
51 1256 -1426 1634 -1896 2235 -2698 3365 -4425 6368 -11135 51013 25731 -56941 -4975 7672
65 7672 -5151 14303 56333 16034 -54648 -75410 -27936 9500 8318 -2423 863 -31533 -72421
78 -72421 -44123 26455 34849 8558 6730 -4427 -37766 -22792 35292 60312 33925 1793 -9715
91 -9715 -7597 -9700 1726 42033 50489 -14368 -58884 -21535 5854 -17682 -5509 31108 -154
104 -154 -60770 -50851 1344 17744 4703 4059 10633 -5646 -29578 -7033 45113 46370 7792
117 7792 7649 21405 -3113 -8629 36128 48204 6405 -11656 1915 -2572 -15833 -4251 16466
130A6466r057l5031j2919K9369J3349k7179K002L6061j2941m3821J9925M5789
142B2013j2805k7852J9353K0667j7713j5206J7100K0811j0723k2990R368K2786
154B4809j5704k4149J8706J4483k7399q045K8450j725k9179K545J8822n163r874
167a3423J0247J2544p589k0149L319K9765M444k2892P213K3911k2297k8305L1255
180H043L3808k3423k4914J3231N065k1378l854K6158J4493k5443l0375Q702J8122
193a765j1770l373K9116j280m3132p043L3018O888q511J4865O879k5015j7470
206b8593J8024K7370N985j2388l185L319j6787j3839L1700L1717k4384l1407J0642
219a826N763k0275P441L3637J021l4417j9956J2866J6072k104M19J7787l496l7261
$$ plain form
130 16466 7409 -27622 -40541 -11172 2177 -25002 -23000 13061 120 -43701 -23776 22013
142 22013 9208 -18644 709 21376 3663 -11543 5557 26368 15645 -7345 2023 24809
154 24809 9105 -15044 3662 18145 -9254 -17299 11151 9426 -19753 -17208 1614 -3549 -13423
167 -13423 -3176 9368 1779 -18370 -15051 14714 19158 -3734 3479 27390 5093 -23212 8043
180 8043 41851 18428 -6486 6745 11810 -9568 -13422 12736 27229 1786 -28589 -19887 -1765
193 -1765 -13535 -16908 12208 10928 -32204 -39247 -6229 659 -7852 7013 13892 -11123 -28593
206 -28593 -10569 16801 22786 10398 7213 10532 -6255 -20094 11606 43323 18939 -12468 -1826
219 -1826 3937 -16338 -8897 24740 25761 -8656 -28612 -15746 326 -1778 -1359 16428 12932 -24329
233b4329p731L8301J5225j7029M645J0320k5276j9032K5975K6450p105j4478l329
246B607l765j1843j966K3586J8268k3120k9427R894J1792j5898M724L1873m896
259A1829l7632n839K4278Q553n408O448J1189q893k3062P60L2449J2497k0626
272F543l304J4604j5265j9759K3190K5660j7341j9315O302P86j2196L005J7754
285A0664M286j7986j6283R639J2891j0085k165K2599j411l1657P80K9873K12j6769
299e412R469J2561j4684j5252J0223J8477j310j7552k642J3986p307j9323J3735
312e031K2156j8781k1526J6275J0489j7837r98J9798j0j6927j632J3571N369p279
326b363j943J3516K600j8093J34K4813j937k2103P941J8205j4628j5150J5244
$$ plain form
233 -24329 -32060 6241 21466 4437 9082 19402 -5874 -24906 1069 27519 20414 5936 2607
246 2607 -1158 -13001 -14967 8619 26887 3767 -25660 -15766 -3974 -19872 -15148 16725 11829
259 11829 -25803 -31642 -7364 1189 -4219 2229 13418 4525 -18537 -17777 14672 27169 6543
272 6543 3239 17843 2578 -17181 6009 31669 14328 -4987 1315 2101 -10095 -7090 10664
285 10664 14950 -3036 -19319 -9680 3211 -6874 -9039 13560 12149 -19508 -18728 11145 11357 -5412
299 -5412 4057 16618 1934 -13318 -3095 15382 14072 -3480 -6122 7864 557 -18766 -5031
312 -5031 17125 -1656 -23182 -6907 3582 -14255 -15253 4545 4535 -12392 -14024 -453 4916 -2363
326 -2363 -4306 9210 11810 -6283 -6149 18664 16727 -5376 2565 20770 6142 -9008 6236
339F236J1129j4069j1157P444Q189p121j1747P044J3664j1707j7142J5944J5702
352A2409j9182r817K2335L626k0303K971J8321l155j3563L362J1013j637j0840
365d460J041J3235k717j9124L956J9933j0258j9272J4426J2866j9237r175J8979
378A93N888j4345l607J1329M811q090n036J2373J1140j3543j1214J8654R177j9329
392a599j390K1621m537k0616O251J5165p893j0845N202O189o066j0416L326J2663
406G055m657j6217P472J4050j3739j2002K0390Q829j9928l787J8224N24j3361
419g147L370J2026l12j1105l616J1325O025j4157m740J6783j111k1051L746J9751
433I787q310j6462J0431J0062j1339o959J0678P411o231p147O138J0744o296j0440
$$ plain form
339 6236 17365 3296 -7861 -417 7772 651 -11096 -4052 9612 -2095 -19237 -3293 12409
352 12409 -6773 -16590 5745 9371 -10932 -7961 10360 7205 -6358 -2996 8017 6380 -4460
365 -4460 -3419 9816 7099 -12025 -8069 11864 1606 -17666 -3240 9626 -9611 -18786 193
378 193 6081 -8264 -11871 -542 4269 -3821 -8857 3516 14656 1113 -10101 8553 17730 -1599
392 -1599 -2989 18632 14095 -6521 -270 14895 7002 -3843 1359 7548 1482 -8934 -5608 7055
406 7055 2398 -13819 -6347 7703 -6036 -18038 2352 11181 -8747 -12534 5690 6214 -7147
419 -7147 -3777 8249 7937 -3168 -6784 4541 10566 -3591 -8331 8452 7341 -13710 -9964 9787
433 9787 1477 -14985 -4554 5508 -5831 -12790 -2112 5299 -932 -8079 -1941 8803 2507 -7933
447g933J3995J1646j7076p495J9789L229j9177K631J6523o720j4759M583R849
460I085m133j0091m85R410j359j4778J582J6783m687j7971R007J4949j2059r885
474a4632J5362P121j2019l732J0252M684o907m548Q277O852j0904q068J4036N350
488A1124j7816k144J7738m273j8720P235J4760r189j1067Q246Q441o009p989N901
502c762J1077l119j2252P148J4698q539j2166J3982J0219j4999o528J4595K588
515A2942j2814j272Q696L50j0005l598Q177L218j2588m537J3573Q40j7653K842
529a1829J7595p443j4374J0670J2174j1003o844J0891P453p474o326P545Q699
542I734p247r548J0534R853j4013q600J5516M285j6740j197J3864k538j2323K454
$$ plain form
447 -7933 6062 17708 632 -6863 12926 16155 -3022 -391 16132 9412 -5347 -764 9085
460 9085 4952 -5139 -5624 3786 2427 -12351 -10769 6014 1327 -16644 -7637 7312 -4747 -14632
474 -14632 730 7851 -4168 -7900 2352 7036 129 -4419 3858 10710 -194 -8262 5774 11124
488 11124 -6692 -8836 8902 4629 -14091 -6856 7904 -1285 -12352 -4106 4335 -1674 -9663 -3762
502 -3762 7315 4196 -8056 -908 13790 5251 -6915 7067 17286 2287 -4241 10354 12942
515 12942 128 -1144 7552 7902 -2103 -5701 2476 5694 -6894 -11431 2142 2982 -14671 -11829
529 -11829 5766 -1677 -16051 -5381 6793 -4210 -11054 -163 7290 -184 -6510 1035 9734
542 9734 2487 -7061 3473 13326 -687 -9287 6229 10514 -6226 -7423 6441 3903 -8420 -5966
556e966R596j326q758J58R505R18j1411J188J5178k447j5182Q079J4849j0731
570C650j0114J3059P902j3193n205J0459L736r845m531P415M918j1415p287J1841
584A390N561j5795l670J5658j529j5881M653J3393n377j0128O083Q194l344o718
598g510L653J0062k111j0705M664J3422o985j1798J1693R432j4218o695J4070
611F974L207j3736j146J0855l56j0535k244J0256K622j1615l208J3807J051j5557
625i625L057J7005n884j3553Q736J1230r330o600Q817N886o301o595M364P684
639H891n339r918P136Q672j2076q893J2909M344j4990k165J3580k207j2124K611
653i569J0117j596p808R60R840N97j0597K234J4975k948j3601P872J3660j0211
$$ plain form
556 -5966 3630 2304 -6454 -6296 3209 4127 -7284 -6096 9082 6635 -8547 -468 14381 3650
570 3650 -6464 6595 14497 1304 -3901 6558 10294 449 -4082 3333 8251 -3164 -10451 1390
584 1390 6951 -8844 -12514 3144 1615 -14266 -9613 3780 -1597 -11725 -5642 2552 -792 -7510
598 -7510 -3857 6205 4094 -6611 -1947 11475 4490 -7308 4385 13817 -401 -7096 6974
611 6974 10181 -3555 -4701 6154 5798 -4737 -6981 3275 5897 -5718 -8926 4881 5932 -9625
625 -9625 -6568 10437 4553 -9000 -264 10966 1636 -4964 3853 9739 3438 -3157 1207 8891
639 8891 3552 -6366 770 9442 -2634 -11527 1382 5726 -9264 -11429 2151 -56 -12180 -9569
653 -9569 548 -1048 -8856 -7896 1944 2541 -8056 -5822 9153 6205 -7396 476 14136 3925
667C925r288J2555O300j1998l718Q703J737p516l942N936L848p926p559R359O042
682F458j3177l771J4667L97j4567L233J3616m242r748N873Q561l757p127L419
696a65R343k754j1264M194J1844q198j2538J0212R855j4876p405J3366K383j3647
710i650k07R804q65q015m03P503K913p342k078J1809K651j2068K022J4479l502
725G051j1649P860J0149q494o270P036M973o387n207L285N478n182r292N774R004
740H129j0559r392J2490N394j4553j800J4467j208j1887L444J0100k473o676J721
754b803Q356M6r186O39J1343j896j2726M631J1869r219j0645J0039O474j1667
768d745m047Q739J816p631k698O171M362o130n637R056O933j0847l221J4424K063
$$ plain form
667 3925 -5363 7192 13492 1494 -2224 6479 8216 700 -3242 2694 6542 -1384 -8943 416 6458
682 6458 -6719 -10490 4177 4574 -9993 -6760 6856 2614 -7134 -1261 7300 3543 -3584 -165
696 -165 9178 6424 -4840 -646 11198 3000 -9538 674 10529 -4347 -11752 1614 3997 -9650
710 -9650 -9857 -53 -918 -8933 -9336 -1833 1080 -6262 -8340 3469 6120 -5948 -3926 10553 7051
725 7051 -4598 3262 13411 4917 -1353 5683 10656 4269 -938 2347 7825 2643 -6649 -875 8129
740 8129 -2430 -11822 668 6062 -8491 -10291 4176 2968 -8919 -5475 4625 2152 -4524 -2803
754 -2803 5553 5599 -3587 -2948 8395 6499 -6227 -1596 10273 1054 -9591 448 6922 -4745
768 -4745 -8792 -53 1763 -5868 -8566 -2395 1967 -4163 -9800 -744 6189 -4658 -7879 6545 8608
783H608j4066K953J3724m617r409O153P704n426o453L137N961k858q200J940Q631
798G782n738j1093P412R330j0942p086J1133K812j1222K9R222j41o479o17O235
813F37K660n930k634R168L486j2111j180J3632k531j2610N798J0752q658q646
827h167P785N514o378m931N088M103m750o397N945Q227p427p239J0499N288j1468
842d308j469J3265r9j0670K438Q233k435n477K130N962r95p541j301Q763m43j0246
858d193K102J0190p286j0549Q076Q002r356n548Q050K658p608k508O764M277n483
873b412n211O638N715q602l774J2584K031j2775M42J1975l232r057N693O875n483
888A407o186L740N394k121o211K019P095l644r383O761Q978q370o573R593L864
$$ plain form
783 8608 -5458 -2505 11219 6602 -2807 3346 11050 5624 -829 2308 8269 5411 -2789 -849 7782
798 7782 2044 -9049 -1637 7693 -3249 -10335 798 3610 -7612 -7583 1639 1498 -4981 -5598 637
813 637 3297 -2633 -5267 3901 7387 -4724 -5904 7728 5197 -7413 -1615 9137 479 -8167
827 -8167 -382 5132 -1246 -6177 -1089 3014 -1736 -8133 -2188 6039 -1388 -8627 1872 7160 -4308
842 -4308 -5777 7488 7389 -3281 -843 7390 4955 -522 1608 7570 6575 -966 -2267 6496 6053 -4193
858 -4193 -2091 8099 813 -9736 -1660 6342 -3014 -8562 -512 2146 -5462 -7970 -1206 3071 -2412
873 -2412 -7623 -985 4730 -3872 -7646 4938 6969 -5806 -5364 6611 3379 -5678 15 6890 1407
888 1407 -4779 -1039 4355 2234 -3977 -1958 5137 1493 -7890 -1129 7849 -521 -7094 2499 6363
903F363r801p58R390O68p252m47N770J880n559k584P637K382j0788j013J1245
918G133k132j1544M434Q813p239p595O915M568o239m322M852L934m057m883M496
933b866O858o096o777Q739O200r876k645J1052N88j0024K196Q704j900o525P11
948a661N930k38o441N5Q397q84j0766K459J0209m922q864P715O708r125n080Q688
964B180L423o657j353N073J990n582l070O679N162q141m451Q919R88j0588J579
979c849J0507l288r914L447N455l895m144L688M230k527o921J220Q287j937p289
994f930N114P767r028o517J0979N445r020r63Q167j260p093J115P243J464o007
1009D76l071O155J601q365M39J0848k413j1736L432Q703n770n462P361L547o504
$$ plain form
903 6363 -3438 -4196 5194 5862 -1390 -1837 3933 5813 254 -2330 5307 7689 -3099 -4112 7133
918 7133 5001 -6543 -2109 6704 -535 -8130 -1215 3353 -2886 -7208 -2356 1578 -2479 -7362 -2866
933 -2866 3992 -2104 -8881 -142 6058 -3818 -6463 4589 5177 -4847 -2651 6053 4153 -2372 -1661
948 -1661 4269 4031 -2410 -2355 6042 5158 -5608 -3149 7060 2138 -6726 989 7697 -1428 -6508 2180
964 2180 5603 -1054 -2407 2666 4656 -926 -3996 2683 7845 -296 -4747 4172 5160 -5428 -3849
979 -3849 6658 3370 -6544 -3097 2358 -1537 -5681 -1993 2237 -290 -7211 -5991 2296 359 -6930
994 -6930 -1816 5951 -3077 -9594 1385 6830 -2190 -3153 5014 3754 -3339 -2224 5019 6483 476
1009 476 -2595 3560 5161 -3204 -2765 8083 5670 -6066 -2634 6069 299 -5163 2198 5745 -759
1024g59m126M247M345j857m560L435N038o002o861Q506O318r376l981R478n13
1039C332j0028K430Q505k459o766J133M353j118m821R01P086j091r083K213R916
1054D503m058p848P814O596q734l870Q489K575n858o62M690J339m344l192M911
1069B351M875o729m443Q046K173j0130P1J0237k965r236M281O773n044n123M247
1084f16M206k399m886J779O993l106q014N105P943p407o313Q960L386j0382q32
1099e583Q571q22o648Q27M362n40m116r83N428K439p562j826R269k67r088M258
1115b281R610o241o981O998M971n333k021M801K197m077m339L581N939m026o354
1130c556O032M272r467l626J1322O89j0240J165P356l928n486L980N209k002m722
$$ plain form
1024 -759 -4885 -638 3707 1850 -2710 725 5763 -239 -7100 1406 7724 -1652 -5633 3845 3332
1039 3332 -6696 -4266 4239 1780 -4986 -3853 500 -618 -5439 -4538 2548 1457 -7626 -5413 4503
1054 4503 445 -7403 411 7007 -1727 -5597 2892 5467 -391 -1053 3637 4976 632 -2560 2351
1069 2351 7226 497 -3946 4100 6273 -3857 -3786 6451 3486 -5750 -1469 5304 260 -4863 -616
1084 -616 3590 1191 -3695 -1916 5077 1971 -6043 -938 7005 -402 -6715 2245 5631 -4751 -5583
1099 -5583 2988 2166 -4482 -3655 707 167 -3949 -4932 496 2935 -4627 -6453 2816 2549 -6539 -2281
1115 -2281 7329 1088 -5893 1105 6076 743 -1278 3523 5720 1643 -2696 885 6824 2798 -3556
1130 -3556 2476 6748 -2719 -6345 4977 5666 -4574 -3409 3947 19 -5467 -1487 3722 1720 -3002
1145c002k35M845N06o316J982Q639m370r223N694O938o589l867P337J076p513
1160d098j339N234K032l618k336L875K460o407k955Q990L492r236r88R819k584
1175B341p989N947P462n076n451M191L285k755k748K858M753l442p299L469O948
1190F494n658n871P766L126r671k286Q643L14o929J471M512j231m611m74N365
1205I60K580o372j596P663o21q684L172R254m892p526N757M450o518k669O292
1220A250J726m123l315L037M086l677m330N768M946q329l041Q745J805q252J579
1235b125P928k776n975K880M725j151l748P53M574n79o969Q23Q277k589q735N056
1251C69O299p793m982P733L124p473j848N756rn127r07N114K908n865l138O405
$$ plain form
1145 -3002 -3237 1608 2114 -4202 -2220 6419 2049 -7174 -1480 5458 -1131 -4998 2339 3415 -4098
1160 -4098 -5437 -203 1829 -1789 -4125 -250 2210 -4197 -7152 1838 5330 -3906 -4894 4925 2341
1175 2341 -5648 299 7761 2685 -2766 1425 4710 1955 -793 2065 6818 3376 -3923 -454 6494
1190 6494 836 -5035 2731 5857 -3814 -6100 2543 2857 -4072 -2601 1911 680 -3931 -4405 960
1205 960 3540 -2832 -4428 3235 2614 -6070 -2898 6356 1464 -6062 -305 4145 -2373 -5042 1250
1220 1250 2976 -1147 -4462 -1425 2661 -1016 -5346 422 5368 -2961 -6002 2743 4548 -3704 -2125
1235 -2125 5803 3027 -2948 -68 4657 3506 -242 511 5085 4506 -2463 -1640 6637 4048 -4687 369
1251 369 6668 -1125 -6107 1626 4750 -2723 -4571 1185 1176 -3951 -4858 256 3164 -2701 -5839 566
1267E66K030p564M51R081k197q506L798O651m105m032M453K955l200m074K027
1282a666N158j634n344K374N799n251n783P331N071p641k408P254J05o684J362
1297a957O213l75m798p65M667J248n529k96P796j199q860K461P810m890o045O068
1313A549L840o975l121M852K118l421k709K343K961l692m496N018N586p058l576
1328f781P648K020q317J219Q153j634o010K628M716j798l608J357M713p35o245
1343b674P69P343k440p760M905O228p189m575P417K510p075m49N334J61m283l98
1359b176L826K255l983l213O102K660p319o45Q205j678p765K698O414m389m359
1374c367L203K783l332l378J694L641j794n462K818N998m971n725P227M135p744
$$ plain form
1267 566 2596 -4968 -4517 4564 2367 -6139 -2341 4310 205 -3827 626 3581 381 -3693 -1666
1282 -1666 3492 1858 -3486 -1112 4687 -564 -6347 984 6055 -1586 -3994 3260 3365 -3319 -1957
1297 -1957 4256 3881 -917 -1682 2985 4233 -1296 -1592 6204 5005 -3855 -1394 6416 1526 -4519 1549
1313 1549 5389 -1586 -4707 145 2263 -1158 -3867 -1524 1437 -2255 -6751 -1733 3853 -3205 -6781
1328 -6781 867 2887 -5430 -4211 3942 2308 -3702 -1074 3642 1844 -1764 -407 4306 3571 -2674
1343 -2674 -1905 5438 2998 -4762 143 6371 -818 -5393 2024 4534 -2541 -2990 2344 2505 -1778 -2176
1359 -2176 1650 3905 -78 -3291 2811 5471 -1848 -2493 5712 4034 -3731 -1033 5381 992 -3367
1374 -3367 -164 2619 -713 -4091 -2397 1244 -550 -6012 -3194 2804 -2167 -7892 -665 3470 -4274
1389d274j557Q611r6o451K018N031q99l485O75L566J050m523j066O277k61p479
1405b863J629P592m640o386N279M341n950k687M774J456l572k006K804L252k593
1420D30m521M480M701n826l692P892J567q383P89P393k638n821K866M262l150
1435C49l524R43L447r09m431M87N837k652o276M012O237n766m141P040K053n877
1451c171k86N596M66l253l79K652K097k651l025M978L041o939j557P643l31q275
1467c394K981O279m771m703L836L324l865k468K229K878k107m291K565N400l805
1482H8n074N439L936p086j673P505O1o487J270M422j296l488P34K994K49l918
1498b324j273M587R40o288P71O980l127o779M749N544n201k810N043J875l861
$$ plain form
1389 -4274 -5831 2780 2684 -3767 -1749 3282 2383 -1102 -427 3139 4189 -334 -1400 4877 4616 -2863
1405 -2863 -1234 6358 1718 -4668 611 4952 -998 -3685 1089 2545 -1027 -3033 -229 3023 430
1420 430 -4091 389 5090 -736 -4428 3464 5031 -3352 -2563 4830 2192 -3629 -763 3499 349
1435 349 -3175 -2232 1215 306 -4125 -3638 2199 -453 -6729 -2717 3520 -2246 -6387 653 2706 -3171
1451 -3171 -3457 2139 2605 -648 -1027 1625 3722 1071 -1954 3024 6065 -874 -2431 5212 4881 -3394
1467 -3394 -413 5866 1095 -3608 228 3552 -313 -2781 -552 2326 219 -4072 -1507 3893 88
1482 88 -4986 453 4389 -2697 -4370 3135 3196 -3291 -2021 2401 1105 -2383 -1649 1345 1594 -2324
1498 -2324 -3597 990 1930 -4358 -3587 3393 266 -6513 -1764 3780 -1421 -4231 812 2687 -1174
1513a174j054K953K573k081l138L092M192m963l306O952J921p626J92O937k744
1528B726n693L078L836l271k814J141K073l6l456L19M229j051o198K786N944m469
1544h56m459N976K692o055j229N549M48l614o47L097J020l191j897M271K374n872
1560b393j525O801o47p396L241N914l624n016M338K855l235j588K744K143j739
1575H73l115J987M252k132m608M474M015o056k348O598N51n978P16M741j784l521
1591a335L11K661M79l667j157L731P21n905O37O292k670n817L829M824m932k945
1607d943N554J706m255r73L136J733k235k307K747K876m059k378N520J634o207
1622b451l10O258j481n428K532L948k441k881J799K647o27l036L18M608j155n425
$$ plain form
1513 -1174 -2228 725 3298 1217 -1921 1171 5363 400 -2906 4046 5967 -1659 -1467 5470 2726
1528 2726 -2967 111 3947 676 -2138 -997 1076 1040 -2416 -2097 2132 1081 -5117 -2331 3613 -856
1544 -856 -5315 661 3353 -2702 -3931 1618 2066 -1548 -2195 902 1922 -1269 -3166 1105 3479 -2393
1560 -2393 -3918 2883 2236 -5160 -1919 3995 371 -4645 -307 2548 -687 -2275 469 2612 873
1575 873 -2242 -255 3997 1865 -2743 1731 5746 -310 -2658 3940 4491 -1487 -771 3970 2186 -1335
1591 -1335 -1024 1637 2116 -1551 -2708 1023 1744 -4161 -3524 2768 98 -5719 -1890 2934 -1998 -4943
1607 -4943 611 2317 -1938 -2911 225 1958 -277 -2584 163 3039 -1020 -3398 2122 3756 -2451
1622 -2451 -2761 3497 2016 -3412 -880 3068 627 -2254 -455 2192 1565 -1471 -1153 3455 2300 -3125
1638c125L092N460m400m818N702K719n690j131N406k79m348m1K786L23l029j032
1654b405L496J206n197j153N989m31o339K155N155l604l994M394L053l169k259
1669c103K217K153j456k364J908L918k290m778L922M060n101j845N782N80n899
1684b296L11N088j068l241Q90K853r31k762n77M492L85n055M40N412k462n339
1700c860M556M360m884l096M274J292l275n91K511Q26k732k246J971L369l298
1715h23l011M607J957o826m55O476p91n059K063L481k325k983K461K915q10l388
1731b511P43L805q42m470K858N334m315m088M869K476n116o78N121k51m500K27
1747a338K518J005k230j096K707J535m542j311N808K27n904J243N306l005m508
$$ plain form
1638 -3125 -33 5427 1027 -3791 1911 4630 -1060 -2191 3215 2936 -1412 -1453 1333 1656 -1373 -2405
1654 -2405 1091 2297 -2900 -4053 1936 1505 -4834 -2679 2476 -1128 -5122 -728 2325 -844 -3103
1669 -3103 -886 1267 -189 -2553 -645 3273 983 -3795 127 4187 -914 -2759 3023 3603 -2296
1684 -2296 -1985 3103 2035 -1206 -316 2537 1606 -1156 -1733 2759 3144 -1911 -1471 3941 1479 -3860
1700 -3860 696 5056 172 -2924 1350 2642 -633 -1224 1287 2113 -619 -2865 -894 2475 -823
1715 -823 -3834 773 2730 -4096 -4551 1925 1134 -3925 -1862 1619 -706 -3689 -1228 1687 877 -2511
1731 -2511 -1768 2037 1195 -3275 -417 4917 602 -3486 1383 3859 -1257 -1935 3186 2935 -1565 -1338
1747 -1338 1180 2185 -45 -1141 1566 3101 -1441 -2752 3056 3283 -2621 -1378 3928 923 -3585
1762c585L895L014l013k220J618J963j795k416J844L377k646m362L206M174n326
1777b272k300O113M60o203J007M949j236l244J358K603n84k310l1L716R06m477
1793a545M8M862j653n071L608M389m137l369M461J541l534m48K765Q51k452k291
1809a975K302K960l163k928M827J947n693j106O280j236n310K188L840k374l233
1824b674K231K215j491k525J98L312o93m123J655M666l208m704M753L244n299
1839b443j274M799K20l646M58L000M63k181j243K867J761l392j656N325K94n799
1855b447J202N853k753m484L412K982l622k260L124J759j925k125J421K254j915
1870D76l185K798L878m231l124N301J055n266R3N270j830l913J040L139r89k275
$$ plain form
1762 -3585 310 3324 311 -1909 -291 1672 -123 -2539 -695 2682 36 -4326 -1120 3054 -2272
1777 -2272 -4572 1541 2001 -4202 -3195 1754 518 -2726 -1368 1235 651 -1659 -1690 2026 2932 -1545
1793 -1545 -1497 3365 1712 -3359 249 4638 501 -2868 1593 3134 -400 -848 1917 2768 316 -1975
1809 -1975 327 3287 124 -2804 2023 3970 -1723 -2829 3451 2215 -3095 -907 2933 559 -2674
1824 -2674 -443 1772 281 -2244 -2046 1266 573 -3550 -1895 2771 -437 -5141 -388 2856 -2443
1839 -2443 -3717 1082 1302 -2344 -1886 1114 1577 -604 -1847 1020 2781 -611 -2267 3058 3352 -2447
1855 -2447 -1245 4608 1855 -2629 783 3765 143 -2117 1007 2766 841 -1284 137 2391 476
1870 476 -2709 89 3967 -264 -3388 1913 2968 -2298 -2205 3065 1235 -2678 -1638 1501 512 -1763
1886a763r9K831K10m171k55N151o47n387K489M729l983l775M706K653l935r79
1902b225L126M19k016j091K438K242k848k308L494K678m775p93N643o82n438J338
1918g98M605k346k717J975K178k093k445Q79K851k19l983J017L865k756m175M101
1934f1L354m641j987M568K66m016L41L575R6l084o11K432Q33l011o15M361L90
1951B190n703P51N448k017m297L226L062l518k333L447J349j910j316J432K142
1966A953j257l137K976L451l369k725M176K005n159j88M966o98m177J236K466
1981B519q90k332N5K782m37l602o3M010r27m315K056M074l727l656M541K145m380
1998b147n04K925N11k312o24K181J952k403k334L029K138l816j423N208k13n185
$$ plain form
1886 -1763 -1862 969 1179 -2992 -3247 1904 1257 -4130 -1641 3088 -895 -4670 36 2689 -1246 -2225
1902 -2225 901 1320 -696 -1787 651 2893 45 -2263 1231 3909 -866 -1659 3984 3302 -2136 -798
1918 -798 3807 1461 -1256 719 2897 804 -1641 -762 2089 1870 -2113 -1096 2769 13 -4162 -61
1934 -61 3293 -1348 -3335 1233 1499 -2517 -2176 1399 1495 -1589 -2200 232 1065 -1946 -2561 1800 2190
1951 2190 -3513 -2762 2686 669 -3628 -402 2660 -858 -3191 256 1605 -305 -1621 -189 1953
1966 1953 696 -2441 535 3986 617 -2108 2068 4073 -1086 -1274 3692 2994 -1183 53 2519
1981 2519 1629 -703 -648 2134 1697 -1905 -1968 2042 1115 -3200 -1144 2930 -797 -4453 88 2233 -2147
1998 -2147 -2651 274 785 -1527 -2151 30 1982 -421 -2755 274 2412 -1404 -2827 2381 2168 -3017
2014c017J508M098j976l107J836K423j512j935N98K953q30l123J092M595l074
2029E29l115L726L193m221k033M353Q56m150P0L684o72k348n21J921P34l001j137
2046b132L337N79m378j22M874j960m378K717K992k841k157K675J866k552j237
2061b717J572K601j398k334K283K784l280k739M804J883n149k12M689j058m060
2076b331J462L360j575j928K96J874r7k314J89L501o53m235J478M093k613k829
2092b322M079J713m025j050L046Q04j968q36J483J337k851j845L109J878l624
2107a072j921M329l7n325J728M246j888l431J335K438j424j533J819K034j039
2122B59k901R77L671j203l339L461K958m665k211M915J134l526nK859j063k428
$$ plain form
2014 -3017 -1509 2589 613 -2494 -658 1765 253 -1682 -1084 1869 1039 -2084 -992 3603 529
2029 529 -2586 1140 4333 112 -1921 2432 3288 -862 -792 2892 2220 -128 -649 1272 2006 -995 -2132
2046 -2132 1205 1784 -2594 -2716 2158 198 -4180 -1463 1529 -1312 -3469 -794 1072 -1480 -2717
2061 -2717 -1145 1456 58 -2276 7 2791 -489 -3228 1576 3459 -1690 -1902 2787 1729 -2331
2076 -2331 -869 2491 916 -1012 -716 1158 1061 -1253 -1064 2437 1784 -2451 -973 3120 507 -2322
2092 -2322 1757 3470 -555 -1605 1441 2245 277 -559 924 2261 -590 -2435 674 2552 -1072
2107 -1072 -2993 1336 1299 -4026 -2298 1948 60 -3371 -2036 402 -1022 -2555 -736 1298 259
2122 259 -2642 -1665 2006 803 -2536 925 3883 -782 -2993 1922 3056 -470 -475 2384 1321 -1107
2138a107M00K343J031k850j420K773O97l982N79N274j721m583J942L300k907j547
2154a778K939J273k157k075J607J869p98k191J590K189l389k980M463K126m655
2169a967r46L951r64l715J570L654j324k633O63J603J64k319P48L398j35m597
2185b849J414M099j985k900L529K281l847j533L193P93j805n95J445P57k009j790
2201a802K764K150l634j864M329P5m377P84M816j934l730K231J908k134j434J897
2217D5J683j291k123M05L309j453l439K549K938l716k175L510J383l192n11K721
2233F43k24k167q8K018P97k197j107L053P46l548m5M849j083m521K665L819l163
2250D47k268L123J549k790p41J924J138j487j923J331K282k176k567L404J626
$$ plain form
2138 -1107 -707 1636 2667 -183 -1603 1170 1867 -2115 -1536 3738 2017 -2566 -624 2676 -231 -1778
2154 -1778 1161 2434 277 -1798 -191 1678 880 -1311 279 2468 -921 -3901 562 2688 -1967
2169 -1967 -2913 1038 74 -3641 -2071 1583 259 -2374 -1711 -108 56 -2263 -1515 1883 1748 -2849
2185 -2849 -1435 2664 679 -2221 1308 3589 -258 -1791 1402 2195 390 -205 1240 1997 -12 -1802
2201 -1802 962 3112 -522 -2386 1943 2018 -2359 -1575 3241 1307 -2423 -192 1716 -418 -1852 45
2217 45 1728 437 -1686 -1281 2028 575 -2864 -315 2623 -1093 -3268 242 1625 -1567 -2078 643
2233 643 419 -1748 -1836 182 979 -1218 -2325 728 1474 -2074 -2119 2730 1647 -2874 -209 3610 447
2250 447 -1821 1302 2851 61 -680 1244 2382 895 -1028 303 2585 409 -2158 1246 2872
2265B872m369p91M336n15l368Q45K386j224k319Q94K148k03j937r17L544k99l681
2282b598J395L444j995l615K965K539l511j215L945O8k904m01J970J184j845q10
2298a384J502J612l109j128M117R79m128L14M190j828k832K059K810j736k133
2313f95J054J563j089j528J240K525j754l579J930L175l153j844L277J115m424
2328b187m55L913J78k748j99J787r3k061l69L147P79l655o40L649q05l274K095
2345i38L618k805k653K587J311j708o23J502P86j343j901J774K418j585k439K837
2361H38J836l794q76M317R7l553N49K961j380k248J461K163n59k635J89K233j97
2378A402l067J549L270k455l560K861K238l417p24K557O30l075j92J750J001j665
$$ plain form
2265 2872 -1497 -2288 2048 1533 -1835 -990 1396 172 -2147 -1253 895 692 -1245 -2162 1382 1083 -2598
2282 -2598 -1203 2241 246 -3369 -404 2135 -1376 -2591 1354 1422 -1482 -1883 87 1271 -574 -1384
2298 -1384 118 1730 -1379 -2507 1610 2589 -1539 -1225 2965 1137 -1695 364 3174 1438 -695
2313 -695 359 1922 833 -695 545 3070 1316 -2263 -333 2842 -311 -2155 1122 2237 -2187
2328 -2187 -2642 1271 1449 -1299 -1498 289 196 -1865 -2234 913 1692 -1963 -2603 1046 241 -3033 -938
2345 -938 2680 -125 -2778 -191 1120 -588 -1211 291 1077 -266 -2167 -393 2025 440 -1999 838
2361 838 2674 -1120 -1996 2321 2418 -1135 -586 2375 995 -1253 208 2371 1812 -823 -634 1599 1402
2378 1402 -1665 -116 3154 699 -2861 0 2238 -1179 -1903 654 1284 -1791 -1983 -233 768 -897
2394h97j189J916J386l128p63L421J130l985J67L874j650k846K384K576k335j787
2410a726J224K146j275j627R92K512j479k639J794L145l061k066L691J047l732
2425a054kL394r36k280O44J927k61j633o54K719M19l613K07L110o50l718J435
2442i46L263k695k206K283J584k307j107J827N69r62j374J295K077j556k598L069
2458B16J980l444r57L841Pl584R37L114j695j894J209J692q00j571M51K005k32
2475A275k699N99L408j755l310L084K562l452j479L342K22k325q9J828K42j131
2491C22j190J776J210k601j229L259M50m161L60L802j492l315K171K060k338j408
2507b324J870R65j040j406P10J946m72k654J869K722k560k499L800J398l512n53
$$ plain form
2394 -897 -2086 -170 1216 -1912 -2675 746 1876 -2109 -1942 1932 282 -2564 -180 2396 61 -1726
2410 -1726 -502 1644 369 -1258 -266 2246 767 -1872 -78 3067 6 -2060 1631 2678 -1054
2425 -1054 -1056 2338 1402 -878 -234 1693 1432 -201 -855 1864 2283 -1330 -1123 1987 1337 -2381 -946
2442 -946 2317 -378 -2584 -301 1283 -1024 -2131 -304 265 -697 -2071 -776 1301 -255 -2853 216
2458 216 2196 -1248 -2205 1636 1643 -1941 -1004 2110 415 -1479 -270 1422 622 -949 -498 1507 1275
2475 1275 -1424 -825 2583 828 -2482 602 3164 -288 -1767 1575 1797 -528 -617 1211 1453 322
2491 322 -868 908 2118 -483 -1712 1547 1997 -2164 -1804 1998 506 -2809 -638 1422 -916 -2324
2507 -2324 -454 511 -529 -1935 -1225 721 249 -2405 -536 2186 -374 -2873 927 2325 -1187 -1740
2523a740L467k97k344M62J975l96j428n64J769Q02k302n31K968j84l778J465L542
2540B886k376k548K801J332k394r29K117P55j306j142J045J701j731k365K500
2555C46J739l097j474L666K10l598P17K806j588j886R34J233m12j368L01J877
2571D06J29k674O19L248j170l213K574K640l085j427L236Q07k681j79K095M87
2587A812j584j064J720J213k139j104K524J196m005R2L244o73k986J698K219j930
2603B33j707J827J184j237j088N52J600m57k431Q20K755k165k461K954J710l627
2619a538n05K825M6k815R73J489m40j346p7J395M12j842n75L089j69l360J335
2636a103L056j544k510K754J545k365p12K067O11j503l74P40J467j331j655J971
$$ plain form
2523 -1740 1727 1430 -914 -452 1523 1127 -301 -865 904 1706 -596 -1127 1841 1657 -2121 -656 2886
2540 2886 510 -2038 763 2095 -299 -1228 889 1644 338 -804 241 1942 211 -2154 346
2555 346 2085 -1012 -2486 1180 1390 -2208 -1491 1315 -273 -2159 -1225 8 -404 -1772 -1471 406
2571 406 535 -2139 -1520 1728 558 -2655 -81 2559 -526 -1953 1283 2090 -591 -770 1325 1812
2587 1812 228 -836 884 2097 -42 -1146 1378 2574 -1431 -1339 1905 1232 -1754 -56 2163 233
2603 233 -1474 353 1537 300 -788 -236 1364 907 -1524 -704 2051 -114 -2575 379 2089 -1538
2619 -1538 -2043 782 828 -1987 -1014 475 35 -1311 -1388 7 419 -1423 -1998 1091 922 -2438 -1103
2636 -1103 1953 409 -2101 653 2198 -167 -879 1188 1799 296 -78 662 2129 798 -857 1114
2652A114J653k978j523L310N89l522M41K900j128k436J162J414p28j251J31J394
2668E42R0j971L1K627p88l177K364K366k661j574K525J049k902J11K336p68j303
2685a103l98J491Q10j711r31K092J327l003k05L133k82l464J819K517j477j561
2701i46J419J051j324n11O20J589p01k126J181K499k060k408L000J468l633n52
2717a434K551k76k401Q26J771p94j199m9J052N73j722o46K758j63l074P00L182
2734A655j386k361J771J980k279j148J746O12q86p43Q31J108j094j581J900J610
2750A735k615j186L207K22k832M79K707o74k567J191J849n15j507O76J357K79
2766A806k461L89K316m46k991J914J954k370k133K875P31k543k24J727k4j555
$$ plain form
2652 1114 2767 -211 -1734 1576 2165 -1357 -916 1984 856 -1580 -418 996 268 -983 -852 542
2668 542 632 -1339 -1308 1319 531 -2646 -282 2084 -577 -2151 374 1423 -1479 -1368 968 200 -1103
2685 -1103 -1501 -10 800 -911 -1842 250 1577 -1426 -1631 1502 1220 -2244 -425 2092 615 -946
2701 -946 473 1524 200 -311 309 1898 1197 -929 252 2751 691 -1717 1283 2751 -882 -1434
2717 -1434 1117 841 -1560 -734 1037 243 -956 -1005 47 620 -1102 -1748 1010 847 -2227 -1527 1655
2734 1655 269 -2092 -321 1659 -620 -1768 -22 590 -296 -1039 -208 900 -194 -1775 125 1735
2750 1735 -880 -2066 1141 1363 -1469 -990 1717 1043 -1524 -333 1516 1001 -506 170 1527 1806
2766 1806 -655 -266 2050 1604 -1387 527 2481 111 -2022 853 1584 -959 -1183 544 520 -1035
2782a035j38J004O90j525r54J918Q07k678R6L003n96l021J488K483j778j344J403
2799a77J216j561m81N80J162n5j809R51J937j731j931K587J416k867o98K915k89
2816A165k306N59J969q26r23J96J077M42j419n96K576j48k877L96K825j467k351
2833a708J999J795k485j004J710M48j350o83J173O72j275j655J715J546k032j357
2849b491K829M92k871P01K698j180j866J184J332r41o14O36R72k5j194j79J809
2866A292n18k172J514K292j963k232K732O86j961j78J860j96j459j39J030M75
2882A063p17j337J728J026k790m91L263m28k909R27K414j822j919K010J056j278
2898b04q26L64O65m50j251J071J676r94k339J865J490k433q36L024p2k611N50
$$ plain form
2782 -1035 -1173 -169 521 -1004 -1958 -40 767 -1911 -1815 1188 592 -2429 -941 1542 -236 -1580 -177
2799 -177 1039 -522 -1003 -423 739 684 -1125 -174 1763 32 -1899 688 2104 -763 -1461 1454 1165
2816 1165 -1141 -582 1387 561 -362 -166 911 1353 -66 -662 1914 1766 -1111 -715 2110 643 -1708
2833 -1708 291 2086 -399 -1403 307 755 -595 -1278 -105 567 -708 -2363 -648 898 -1134 -2491
2849 -2491 338 830 -2041 -1340 1358 178 -1688 -504 828 -113 -727 -91 881 856 -338 -517 1292
2866 1292 774 -1398 116 2408 445 -1787 945 1631 -330 -508 1352 1156 -303 -442 588 1063
2882 1063 346 -991 737 1763 -1027 -1518 1745 1317 -1592 -665 1749 -73 -1992 18 1074 -204
2898 -204 -1030 -666 -1 -451 -1702 -631 1045 51 -2288 -423 1067 -1366 -2202 822 750 -1861 -1311
2915a311K170m81j207PJ447P9j445k44J812J157k724L29K480j117k561J986K228
2932B605k652j040K104J83j777K38J216K57q48j185Q41J231j264j348K515N90
2948A666k853l34K790p61k172J367J357j266j087Q00P96j92r62r9J178j82k164
2965b118J118K792k000k106K499J026k448j59K127J0j762M29J153K66j051n38
2981g62J639R00k182r59K938J12k676O65K584j615j791J448J612j452p91R27M55
2998A052p17j004L66K016j049k272J669J575k435j318K880L61k601J82J901k47
3014C59j706K97J548n18r80k4J172N47k079R4K687j141k067J346J659j364j349
3031a519K117K73j459o9R86L85m62q80Q83J200j262j385J959J110k373l64K575
$$ plain form
2915 -1311 859 378 -829 -822 625 704 -741 -985 827 1984 -740 -411 2069 952 -1609 377 2605
2932 2605 -47 -1087 1017 1200 -577 -339 877 1134 286 -899 -58 1173 -91 -1439 1076 1666
2948 1666 -1187 -1521 1269 508 -1664 -297 1060 -206 -1293 -493 303 111 -851 -950 228 46 -2118
2965 -2118 -1000 1792 -208 -2314 185 1211 -1237 -1396 731 741 -1021 -592 561 827 -224 -762
2981 -762 877 1777 -405 -1364 1574 1686 -990 -325 2259 644 -1147 301 1913 461 -330 597 1052
2998 1052 335 -669 -303 1713 664 -1608 61 1636 -799 -2117 763 1124 -1477 -1295 606 359
3014 359 -1347 -1050 498 -20 -1000 -1024 148 695 -1384 -1290 1397 256 -1811 -465 1194 -170 -1519
3031 -1519 598 871 -588 -657 329 714 252 -628 255 1455 193 -1192 767 1877 -496 -860 1715
3048A715o22k285R51J904j059j261R72O87n04q69j73J871m21k435O47K033r51
3065B00k131K399J048k778k56J980j51j358L04Q47L51j481k86J141J178j771o53
3082a417K277J12k823P65K464p00j997J151J122j238p12J496P50o28j157K08J558
3099A231o61j304J276J703j991j465K452K69k201J45K175j141j362P29L74M00
3115F29p93j81Q18R5j837J42K653o84k559J174J668j535j406K047O93j493n35
3132a104R34J65l22p87O35J670j451j658K146J284k524k68K574n46k401J188J862
3149A397r59o29M73N17m58q38J87J756m55j753N88J962j251k020K285J374k117
3166E9j215K022R9j542L86J032p5j157m54P16J125j518q84K021J93k582M33K608
$$ plain form
3048 1715 1093 -1192 -241 1663 604 -657 315 1002 498 -371 -544 1327 906 -1529 -882 1151 200
3065 200 -1931 468 1516 -1262 -1518 462 311 -1047 -743 104 455 -1026 -1312 -171 1007 -764 -1417
3082 -1417 860 972 -1851 -1086 1378 678 -1319 -168 954 -284 -996 500 1250 622 -535 -327 1231
3099 1231 570 -734 542 2245 254 -1211 1241 1510 -691 -546 1629 488 -874 -145 229 629
3115 629 -164 -345 473 568 -1269 -1127 1526 842 -1717 -543 1125 -410 -1816 231 924 -569 -1104
3132 -1104 -170 -5 -327 -1114 -479 1191 -260 -1918 228 1512 -1012 -1280 1294 748 -1653 -465 1397
3149 1397 438 -191 282 799 341 -497 -310 1446 991 -762 -174 1788 537 -1483 802 2176 59
3166 59 -1156 866 965 -577 -191 841 766 -391 -845 -129 996 -522 -1406 615 808 -1774 -1341 1267
3184A267j129j583J011J373j576k94R89L52n08o28O3J137n05j357J438J035j387
3201c02j093K239M31k106J01K503j136j643P18R51l94l48rP32O66j684j24K144
3219A646m78k061P51K028j479j458J842O20j927l79J274J12p35l91L65Q62r67
3236c75r17J422J150k295o47K573l30k282J029J622j075q07Q24N21n26m54L9Q98
3254C70j5j429rK288p49j720J410J469j962p39K086L81j892L52R49j4q77q7N67
3273C79O21j116r06J884N14k109J97K125q19j781J301R56j208p96J197P8p81m16
3291f80K54J144k89j762P16J346j073j627J915J068k407l0K000l63j596P19J018
3308C53j53q93K13R90J21j184k53J559M53k637J019K240j316j588J388J140j665
$$ plain form
3184 1267 138 -1445 -434 939 -637 -931 58 410 -98 -726 -663 474 -31 -1388 50 1085 -302
3201 -302 -1395 844 1275 -831 -730 1773 637 -1006 -288 663 269 -79 -88 644 1310 -374 -498 1646
3219 1646 1168 -893 -142 1886 407 -1051 791 1411 -516 -895 379 491 -244 -635 -270 592 -375
3236 -375 -1292 130 1280 -1015 -1662 911 581 -1701 -672 950 -125 -932 -108 413 -113 -567 -528 370
3254 370 355 -1074 -1083 1205 456 -1264 146 1615 -347 -1086 1000 1381 -511 -159 790 776 -101 -188 379
3273 379 1000 -116 -1022 862 1376 -733 -536 1589 770 -1011 290 1246 38 -758 439 517 -264 -680
3291 -680 -426 718 429 -1333 -617 729 -344 -1971 -56 1012 -1395 -1425 575 212 -1384 -665 353
3308 353 200 -693 -480 510 631 -553 -806 753 1206 -1431 -412 1828 512 -1076 312 1452 -213
3325b13l11J306J88j066J1J01R25p77r15J337P44j770o54K197j22j863P53J577
3343A448j223j323J023Q33q00o53K07N93K85j538L02J981r97k098J482J615j834
3360f97o74J863J07j709M33J017n9q77J7P69K87o63o41J299Q80k107L58J772m97
3379H78j678J104J401j148j185R27P63p55n64O94O06r7j603N28J505r35j695J548
3397B94J169k388n7J982l40j510M99N24m51m16J35O85K83j499R5J531o5j847M79
3416h97J946j457j364J782P64j520l42J334l1q02r3J123L19n63j252J399R29j420
3434a45p02J849K51j822K18J749r47r19Q90O46n52q32L90Q84j23j114K19J148
3452A088q16j389J068J069j695o06J485L80j574R5J039P2q65K7L97M93p94m32
$$ plain form
3325 -213 -524 782 970 -96 -85 16 941 164 -751 586 1330 -440 -1094 1103 981 -882 -129 1448
3343 1448 225 -1098 -75 758 -42 -695 -488 105 390 -1148 -846 1135 138 -1960 -478 1137 -697
3360 -697 -1371 492 599 -1110 -677 340 281 -596 -579 190 477 -186 -827 472 1352 -755 -397 1375 878
3379 878 -800 304 1705 557 -628 299 1062 307 -257 437 1043 946 -657 -129 1376 441 -1254 294
3397 294 1463 -925 -982 1000 660 -850 -351 173 -278 -694 -559 126 409 -1090 -995 536 471 -1376 -897
3416 -897 1049 -408 -1772 10 774 -746 -1088 246 215 -587 -680 443 762 199 -1053 346 1275 -145
3434 -145 -847 1002 1253 -569 -351 1398 451 -468 422 1068 516 -316 74 958 835 -279 -60 1088
3452 1088 272 -1117 -49 1020 -675 -1281 204 584 -990 -895 144 216 -649 -622 -225 268 -526 -958
3470i58R46O47j828j46K152m70j731J159J383j131j154J334N16q68l78O53N05
3487F31j37j144M67J235p46j369J584P03j789p0J873o27j278Q41Q55m49o86K9
3505g7P48o4r93o8J132J96j780M23J574r70j465J502Q33j620m66R37K82r39J1
3524h04Q02J93o63p60R95J050j747l25J796r8j706N97J839j028j410J251P64p54
3542hm39L59P08m97p27N01R33l28j529J117J346j273j111J522N83j977N20J393
3560A093o69q46M89L85K55o39n24P14Q10j881QJ888k17k166Q47J488j171r68R70
3579a34Q24j295l79Q05M0q3m81j24J512j011j024J561Q10j767j0J505j21j738
3597a110R67P92n16m29J54O78L47q34o20J773mj911M44J867q71j465J284R23j905
$$ plain form
3470 -958 -12 635 -1193 -1339 813 343 -1388 -229 1154 23 -1131 203 719 -149 -527 126 631
3487 631 494 -650 -183 1052 306 -1063 521 1224 -565 -635 1238 611 -667 174 1029 580 -106 -77
3505 -77 671 607 -386 -454 678 874 -906 -483 1091 121 -1344 158 991 -629 -1095 -158 124 -815 -804
3524 -804 -2 191 -472 -1232 -237 813 -934 -1259 537 439 -1267 -670 1169 141 -1269 -18 746 -8
3542 -8 -447 -88 620 123 -604 -103 830 502 -1027 90 1436 163 -948 574 1157 -820 -300 1093
3560 1093 424 -422 67 452 707 68 -456 258 1068 -813 -805 1083 866 -1300 -453 1035 -136 -1104 -134
3579 -134 690 -605 -984 -179 -139 -222 -703 -827 685 -326 -1350 211 1021 -746 -756 749 628 -1110
3597 -1110 -143 649 133 -296 -142 536 883 49 -571 1202 1198 -713 -269 1598 727 -738 546 1469 -436
3616d36k28J483l38n95j53M96L61m81p13O18J003j205j127J635P67k061K23J610
3634H59j046p97P79Q68j044m22O16K67P3j115J80J100k02j263N35J489j381p30
3652a234J670J91j127k11J220k0p71J30P63J42n04m67Q46L22j171j33J538m15
3670G69j392M55J609r66j506J544O79j612j44Q34Q6k90q03L98R55m03j061Q19
3688b9R19j689r69K182r3j526N39J046l40r32O26N54j48o54j96J046J0j309L25
3707f38J523p73j085J093Q67j112l75J363K61j385l43R83J25m53k65O57M68o24
3725B87q60Q90J006j720K34J311p84j135R11P23p72o33M40O73o79j25j24J029
3743F72o45j117J77J549q76j515K059L14j667J71J183l12p24L6R29k0o03k54Q61
$$ plain form
3616 -436 -664 819 481 -114 -267 229 590 109 -604 14 1017 -188 -1315 320 1087 -974 -751 859
3634 859 -187 -984 -205 663 -381 -803 -187 80 153 -962 -782 318 116 -1147 -612 877 -504 -1234
3652 -1234 436 627 -500 -711 509 489 -282 -152 611 753 249 -218 628 950 -221 -354 1184 769
3670 769 -623 -168 1441 475 -1031 513 1192 -420 -564 270 356 66 -737 -339 616 213 -848 -29
3688 -29 890 -799 -1768 414 321 -1205 -666 380 40 -892 -266 288 140 -514 -710 336 346 -963 -638
3707 -638 885 112 -973 120 987 -125 -500 863 1124 -261 -604 379 504 51 -214 443 911 287
3725 287 -573 317 1323 -397 -163 1148 364 -771 140 863 91 -542 -102 571 -108 -233 -357 672
3743 672 27 -1090 -913 636 -240 -1755 304 618 -1049 -878 305 -7 -731 -695 234 214 -389 -643 218
3762B18K84r33k73J311Rj438Q00J049p46j032J157K27q15p6M40Q95o76n37J70
3781C4R39k37j272Q46Q06j347o19J880k07j203J71Q47l87p73O17L13p1p57k81
3800g01J078K36j362K54R86l52j280Q27R37j079r27J712j54j040J0O81N74n54
3818a54k68N48O68j016o94J336M05j665L89J695o01j439R22J114j106o65Q73L40
3836F82k49l24N8M77k51j032K91J722j107r22J230J85j304J37P69j05p84J3N92
3855G8M1l38o48M43O50q63n41J715k05j297M66J011p17j015R68P11q95K8L44L50
3875B86m27k06L99N29m35j028R35Q44r91m78J410J43j837Q10J135q29m39N66K48
3894F35j1o51k06Q22J96p46m27J255l27j618R47J158j374o66J300j42p05j60O56
$$ plain form
3762 218 502 -431 -704 607 616 -822 -22 1027 281 -751 406 633 -182 -258 182 1077 401 -136 34
3781 34 973 736 -536 310 1116 -231 -850 1030 823 -380 -209 638 251 -522 95 408 337 -420 -701
3800 -701 377 613 -749 -495 491 139 -1141 -314 623 -456 -1383 329 175 -865 -855 -174 400 -154
3818 -154 -422 126 794 -222 -916 420 825 -840 -451 1244 643 -796 126 1240 134 -531 342 682
3836 682 433 109 167 644 393 -639 -348 1374 267 -655 575 760 -544 -407 362 257 -527 -514 78
3855 78 119 -219 -867 -424 226 -637 -1178 537 332 -965 -499 512 -205 -1220 -252 459 -436 -408 -64 286
3875 286 -141 -347 52 581 146 -882 53 897 -94 -572 838 981 -856 -46 1089 260 -179 387 635
3894 635 624 -27 -233 589 785 39 -388 867 540 -1078 -131 1027 -347 -1013 287 145 -560 -720 -64
3913f4K44m45k70j03P97j49r49R92N22j637M4J818p87j055Q25P89n26r65R53N51
3933E85n04n08Q6N00L96j364M24J400n50j359J315M36j165J65J106m02p20L46
3951A87M23k69k08l90P98L8q66l87J620j65j519K73J185p25q94J052P74j226m25
3970g24N00J33l52l67N24M51K18j243L18J355j062n41J003N53j813L25J420o87
3988A1j65N23l3k57m05K38O48J26j197L82P58k81j176R93R44j023q55J262K79
4007G72j272L91N64K04p32lJ71K18J15q49O81L45j291k82J606l02j543J184M49
4026D26o57n23Q08K30n05m18J82K76M41j163N94Q03o67r68J275M02j079l72J383
4045D68J35j498M76R27j91k36j02J37K41l68k99N96M91j083P4J291p63q02J029
$$ plain form
3913 -64 180 -265 -535 -638 159 10 -939 53 575 -1062 -1018 800 13 -1042 -217 572 46 -919 34 585
3933 585 81 -427 -341 159 555 -809 -385 1015 465 -894 421 857 -308 -143 963 561 -159 187
3951 187 610 341 133 -257 541 579 -287 -674 946 781 -738 -465 720 -5 -899 153 927 -299 -724
3970 -724 -224 -91 -443 -810 -286 165 383 -860 -542 813 -249 -790 213 766 -1047 -722 698 11
3988 11 -154 369 336 79 -326 -88 560 686 -511 -129 629 348 -828 165 1109 86 -769 493 772
4007 772 -500 -109 455 659 -73 -76 95 313 428 -421 260 605 -686 -968 638 336 -1207 -23 426
4026 426 -231 -754 54 284 -221 -639 -457 -181 260 -903 -309 494 -173 -1141 134 536 -543 -915 468
4045 468 603 -895 -419 508 317 81 -21 116 357 -11 -310 286 777 -306 -232 1059 296 -506 523
4064E23J27o69k97R40j0q78J98n6L23K48j034P03M60o17o03R26L80j461K86J039
4084E28l97j232O63O55n54J23l49Q61l24l66l58J072j65r45O57Q85p10j008J189
4103B25L64j101L3J042j35k21l37J12N26m48n58J389J61j195j85J220k14j268
4121e90K70J094m19p42M85N41p69l65M66L44J8o34k5Q97m66j096J216M64j297
4140f08J25P65j12o20o1M89K2j57m21L33L05n03j12O79J94p90k07J483n60r03
4160f59O90M88n46o17J064r2j99q5K12L51l35m62N38O44q39p32J599k31j336N71
4180B4P51j13j481R33L64l37k56P7j72N46p02R8O94r5j307M48R09o24j051J481
4200A87J97j059J60O10k0o38j60N64L23k96p18Q85M12p66l65J114q1j125L88J220
$$ plain form
4064 523 650 -19 -316 624 614 -264 -66 -122 201 449 -585 118 578 -39 -642 284 664 -797 -511 528
4084 528 131 -1101 -438 217 -337 -214 -563 298 -26 -392 -750 322 157 -788 -131 754 44 -964 225
4103 225 589 -512 -479 563 428 207 -130 -18 508 60 -498 891 1052 -143 -328 892 678 -590
4121 -590 -320 774 355 -387 98 639 -130 -495 -29 315 333 -301 -326 571 105 -991 225 689 -608
4140 -608 -483 282 170 -450 -511 -22 0 -157 -578 -245 60 -443 -555 124 318 -472 -679 804 244 -659
4160 -659 31 519 -27 -644 420 328 129 44 256 607 272 -190 348 992 153 -579 1020 789 -547 24
4180 24 775 662 -819 114 478 141 -115 -38 -210 336 -366 -268 426 331 -976 -528 381 -243 -1294 187
4200 187 384 -675 -515 95 75 -563 -723 -159 164 -132 -850 35 447 -319 -684 430 349 -776 -388 832
4220H32p33p40J118Q5k91k16M3M11j16m44o8O29j22q57R28M43j150m64J235nq66
4241c48N58J84j98l32J10J96m22Jj52O80j28q91L43P60n53p57Q42P57j366L0P75
4262H9J2n19k15M31J09j8m10J42Q68m38n50P60L65j182L78R22j81r81J35R89o78
4283B8j8P1M53n42j58J65M80n7p24K64J029r12q74R39O28j347O4J007r5p04k01
4304e04O77k16q3m00N47N82j047j44P70J80j182L81R03q43l37O24M92o77j09K80
4324a06j8j00j94J15O35j73r79O87J075j360q0J217l3o68j48J251o59p52P13k35
4344A88L20j32n20N12K08j064K38J022m44j274Q69M77m58j21L22K3q08K20j8N85
4364A45r2n12K29L53j51q90R92L92r03k45J277k34r90L03P99n06n83M37J53Q7
$$ plain form
4220 832 99 -641 477 562 271 55 98 509 393 -51 -119 510 388 -469 459 902 -248 -712 523 518 -348
4241 -348 210 394 196 -136 -26 170 -252 -251 -403 277 149 -742 -399 361 -192 -949 -107 650 -716 -686 89
4262 89 101 -418 -633 -202 -93 -111 -521 -379 489 51 -499 261 626 -556 -178 744 563 -418 -283 706 28
4283 28 10 81 534 -8 -166 -1 479 422 -302 -38 991 79 -795 144 772 -575 -511 496 401 -303 -504
4304 -504 173 -43 -126 -526 21 603 -444 -588 182 362 -820 -439 464 -379 -716 -92 400 -277 -386 -106
4324 -106 -124 -224 -418 -303 332 159 -820 -133 942 -418 -498 719 686 18 -130 1121 462 -290 423 188
4344 188 508 376 -144 368 576 -488 -250 772 328 -946 -77 400 -58 -179 143 166 -642 -422 -440 145
4364 145 53 -459 -230 123 -28 -918 74 466 -437 -682 595 361 -629 -326 473 -33 -616 -179 -26 61
4384F1J4m77N38j83n56L76P57q4j096R26L50p18m80J327k20n57j07R20l38l66
4404H7k36M76L87q56j91P96L12j365L36P86o02n03N77K57n08n79M52L60j54l43
4424e11K60N38m9j136N76J011j033o08R94J97j090M66O49n19n39M44P02o80K54
4443g4j83O49j05m67o8O38j24p55L13R76p19n44P47L62p13r8O66k01k00k95L75
4464A80P06o36q02R13L73j085k85J652o92r11N00M13o22j36L68j23J54m66m7O21
4484G5l9o81PJ147n06r17R57O45j110j11P72k26q7K33j22K77k48L1K8M24p62k99
4506e12Q95J58q38K25R15n43p56R29K86o70l2K21J48m91l8Q0M69l09l24M55M06
4527F74r54k53Q56J91j005K95P51m97l48Q8K90K1n96k87P09J83o73k54J106q1
$$ plain form
4384 61 75 -402 136 -47 -603 -227 530 446 -650 276 626 -92 -572 755 535 -22 -129 791 453 87
4404 87 -149 327 714 -142 -333 463 775 -590 -254 532 -70 -573 4 261 -247 -826 -374 -14 -168 -511
4424 -511 -251 287 238 -898 -322 689 -344 -952 42 239 -851 -385 264 -255 -794 -350 352 -328 -74
4443 -74 -257 392 287 -180 -248 390 266 -489 -176 800 81 -463 284 646 -67 -165 501 300 100 -195 180
4464 180 886 250 -552 361 734 -351 -636 1016 324 -587 -87 326 -296 -432 -64 -187 -33 -499 -546 75
4484 75 36 -645 -638 509 3 -914 43 688 -422 -533 239 13 -74 159 37 314 66 97 125 549 -213 -512
4506 -512 383 541 -297 -72 843 300 -456 473 759 89 57 278 426 -65 -103 -23 446 137 -187 268 674
4527 674 -280 -533 323 514 -491 -196 555 58 -290 -202 88 109 -487 -774 -65 118 -555 -809 297 216
4547B16q64L68R02q70k13N20N02p44j54M23L56k53j82J84L77k09q88O45O10o55
4567G1m25Q92J1r23L06O32l14q89O87J11j18l6k81N59M1m86Q7L46O3j041P13M17
4589D23j002J5Q70L7n12rL54l39j21J5L85o5l41k23L68L45p33K3J032n69l84L90
4611d1L63m22n4R8M35l27m55L41L97m1l45K60Q64q51p02R98j58k30j41N5K16o12
4633c52M8L64j60J13j80L58K70o32k99Q38j12r42M27Q08q86o89J070L24n68q2
4653b82L80K12o27j35O04Kl58k07M24M45r85j06J037j99q32L78J070j065r9O10
4673B67J38l40j66K77n1J51k88J09N30Rq20M90K48o81l89J161l96k55p5L91j90
4694A20j92L8k10M40o8n54L91J65o26l07J032J31j198J001o1l49m21N75J8r1J49
$$ plain form
4547 216 -648 -280 622 -248 -461 59 561 -183 -337 86 442 189 7 191 568 359 -529 116 726 71
4567 71 -354 538 549 -374 -68 564 250 -639 48 159 41 5 -276 283 324 -162 -75 271 334 -707 6 423
4589 423 -579 -564 306 343 -169 -178 176 -163 -284 -269 116 51 -290 -513 -145 200 -533 -510 522 -47 -431 -41
4611 -41 322 -100 -154 -56 379 52 -403 -62 335 294 -51 209 1073 222 -480 518 360 130 -11 44 260 -352
4633 -352 -304 60 -100 13 -167 191 461 -171 -470 368 256 -686 -259 549 -337 -1026 44 368 -200 -282
4653 -282 98 310 -317 -452 152 154 -204 -411 13 458 -527 -633 404 205 -627 -249 821 -244 -343 267
4673 267 405 65 -101 176 125 276 -12 97 627 636 -184 306 554 -127 -516 645 249 -6 -81 310 120
4694 120 -72 -34 -244 196 128 -426 -35 130 -496 -803 229 360 -838 163 102 -247 -668 -93 -75 -166 -17
4715a7k11N70m17m68K04Q17p75n7N90M53j132j3J271o01m33M04K68j05n65J55
4735f2N79n0k43l45O18p1r14N91M93m00n99N61J82r42N79L30j70l47M7K69J55
4756B61j57l60J81L36o88j96J042J46j415O59N05m41o71P54J3Q9j70l50P18l68
4776a12j41P4N07R0j026P53M99p58n20J082l1n29K35K40J94n13J49j12L45m53
4796b7k07N72K73m38l97J281l84j065P08M16q79k07N36J75l28k92J63nr8m31M65
4817a69K91l1p63L72N13m68j42O69m48m25M63K69j99l91N92n3J00m82r7N67j5
4838A53o53L57O27o88l85R28K73p33N0L70Q9l07l5q5J90N1k99R2J99j31j16L49
4860B96J10p83J19O45l93n10O25L22o22k26L25J82k2m86OM58j64l66K09P84q07
$$ plain form
4715 -17 -228 342 -75 -543 -339 478 -297 -354 236 689 -443 -456 815 214 -219 185 453 348 -217 -62
4735 -62 517 467 224 -121 497 426 -488 103 596 196 -403 158 340 -602 -23 307 137 -210 -163 106 261
4756 261 104 -256 -75 261 -427 -623 419 565 -850 -191 314 -127 -798 -44 -31 58 -112 -462 256 -112
4776 -112 -253 -179 328 418 -608 145 644 -114 -634 448 417 -112 123 363 557 44 193 81 426 -27
4796 -27 -234 338 611 173 -224 1057 673 -392 316 732 -147 -354 182 357 29 -263 -100 -105 -203 -634 -169
4817 -169 122 91 -672 -300 213 -255 -397 272 -176 -601 -138 131 -68 -459 133 80 180 -302 -399 168 153
4838 153 -500 -143 484 -204 -589 339 612 -121 -71 299 388 81 46 -39 151 202 -97 -5 194 63 -53 296
4860 296 406 -377 -258 387 -6 -516 109 431 -191 -417 -92 90 68 -418 -412 46 -118 -484 -275 509 -298
4881b98l37Q08J46j030N23M40k77j2p8K12l2J57l76N02J08o63n5Q09k32n53M31
4902A93L91m10m89P48J77m92M6j70M61k74j50m9M60k37o12N02M33j138J84J025
4922E99l68n49K73n2Pp0j18rL93k89m70R51l06k81J3M53n79l04J047m42m35J40
4944c96P29k2n86j91N63R3K1l64J70M85n33k66O88M37j065J41O02j19n85N82r5
4965B89l21l05P51lj07l00J66K01j44l48K55K77m92l81N80K50q24K23M81m13o4
4986b29J58J49n9l43j00N87j20m92j67Q00j83q53P16K23j24k09K87M83p36q5M74
5007A77j82J49l66L81K52j20o52P25J55p50K32M87l87j56L2N33l04l45K64R8R7
5028C20n98K14K78k17j80P0Q61n78o60N89K94n97o10R59j3n75O21l71Q2j30j73
$$ plain form
4881 -298 -635 173 319 -711 -188 252 -25 -37 -115 97 65 222 -154 348 456 -207 -262 547 315 -238 193
4902 193 584 174 -315 433 610 118 164 -6 455 181 31 -18 442 205 -407 95 528 -610 -426 599
4922 599 231 -318 -45 -97 -90 -160 -278 -287 106 -183 -653 298 -8 -289 -276 177 -402 -706 341 -101 -536 -396
4944 -396 333 311 -275 -466 97 190 211 -153 17 502 -31 -297 391 828 -237 -96 506 387 -198 384 289
4965 289 -32 -337 414 411 304 4 170 371 227 -121 134 411 -81 -462 118 368 -456 -233 248 -165 -229
4986 -229 -71 78 19 -324 -424 163 43 -449 -616 184 1 -852 -136 87 -37 -246 41 524 -212 -297 177
5007 177 -5 144 -222 159 411 291 -361 364 519 -231 1 488 101 -55 -23 510 206 -139 125 223 320
5028 320 -278 -64 214 -3 -183 -113 748 170 -490 99 393 -204 -814 145 132 -443 178 -193 -111 -241 -414
5049d14q2O40o05j57Q92j38k31m09Q33m38r37J048L14l63J96M6j27J19j38n07
5069d58Q79k86n74M81Q47o58m49N97J73q26K72K95o6l37J54J20l6j87l11J67M14
5090B11o4j81K54q6m30M19Q3r2j024Q77L01m66p4L55k80L22n12Q3M84j98p81P91
5112hJ53k80j50N55j72m79M4O21m15k21M58J24k85m6j28M92J45m06r8N80o6q30
5134d12N05K27m2o70O88J21k94k28L00J49k93m54N2O57j92p88O59N85j064J08
5154c86N49j36m96k43J050m14l66N00j88J24k88K5L70J51q14L41O52n60l55M87
5174CM67p81K8O42n79J76p7K90K04n26K76j7L73n89k74Q14o6p09K17P11l10m26
5196a53M72k46k94J35j04M57j78r6L9P1k97j18J17M78k73l88N87j89k59J04K54
$$ plain form
5049 -414 -496 144 -461 -618 274 136 -95 -504 329 -109 -1046 2 316 -47 149 195 68 187 49 -458
5069 -458 421 135 -439 42 889 231 -218 379 552 -274 -2 293 227 -110 44 164 128 -59 -370 -203 211
5090 211 147 -34 220 134 -296 123 206 114 -910 -33 268 -198 -272 83 -197 125 -387 -304 180 -18 -799 -8
5112 -8 145 -135 -285 270 98 -381 -337 284 -131 -352 106 230 -55 -101 -229 263 408 2 -96 484 418 -412
5134 -412 93 320 278 -392 296 417 123 -105 195 344 51 -403 -351 306 114 -674 -15 570 -494 -386
5154 -386 163 27 -469 -712 338 -76 -442 58 -130 -6 -294 -269 101 252 -562 -221 431 -129 -484 3
5174 3 470 -311 -283 359 -220 -44 -121 169 373 -153 123 106 479 -110 -384 430 364 -345 -128 583 273 -153
5196 -153 319 73 -221 -86 -190 267 89 -7 32 103 -194 -312 -195 283 10 -378 209 20 -239 -135 119
5217A19n39K93n5PJ60k09j00N33j62j49m15Q64r5l14j88Q87n74q6N56n30l47M47
5239A03K09O4k80l23qL81K12o36O30J32o04K6P31l01q13L84N26l81j12R6O8K64
5261C68l81p0K55L8m03K80K85n34l59P31K29q85J56L51k78l75J27M67J15m22K05
5282a00K57j02m2m14N89L0m50j11J051n65m28N79j01k79J60L25j24k53lj55M91
5303C55l42j40K78J23n28M5N25K59o57m1M33j95l52p6M02j05j70P5R4M49n89k40
5325c97P95l20o10M05M34o62J04J89L33o47M96k8l61j5j99L48K72n16K05K99p3
5346E2l79k5P88j09o33J41O78p08n8K19K72k89N0N2K49J15n91K71L82j11o41J24
5368a51L43k76J38J76j01m90K62P5J77j27k02P5K30k35m89M70L1k82P0M35k85
$$ plain form
5217 119 -420 -127 -182 -175 -15 -224 -324 209 47 -102 -517 347 252 -62 -250 637 63 -23 533 3 -344 103
5239 103 312 376 96 -227 -235 146 358 -278 352 484 -120 -94 637 336 -477 -93 433 52 -60 36 104 368
5261 368 -13 -83 172 210 -193 87 372 -162 -521 210 439 -446 -290 61 -217 -592 -465 2 117 -305 -100
5282 -100 157 55 13 -401 188 218 -232 -343 708 143 -285 294 193 -86 74 399 275 22 19 -136 355
5303 355 13 -127 151 274 -254 -209 316 575 -82 -123 310 115 -237 -313 89 -16 -186 -111 -17 432 -157 -397
5325 -397 398 78 -532 -127 307 -355 -251 -62 271 -376 120 92 -269 -284 -483 -135 137 -379 -174 125 52
5346 52 -327 -352 436 327 -306 -165 513 -195 -253 -34 238 -51 -1 51 300 415 -176 95 477 366 -275 -151
5368 -151 192 -84 54 230 129 -361 -99 -24 153 26 -176 -101 129 -106 -595 -125 -94 -376 -306 129 -156
5389a56l31N29J26o33M7K06K61l8k85K33j8N2j64K49L80m06l15N35J53q03J10
5410b68N62j71J31p7L3p8l42K65J63K26m44Q1K84Q3o86L80K15l30l70N42j85k77
5432b63R2J10n1J16L7J30j51j65k47J84M56q04L40L25k75j86Q4O88m39l27K96
5453e0M29l62j54M73j17j23k56o1N70L11j110N26L84q45M19N21k9r84M50J13j10
5474ej36J34j90L57K4n0J38k78l60K80O43m64p31P21r1k89K80j82O1n8j56K20
5496a32J59m0k30J46M75p19J3M25L4m32k91R10l73k94M49J84l96N9k19K01K52
5517A81m82K03M10k8m41L55L20o45Q6N55l16j53j39L43P9l63M2J59J5j30l52L28
5539B7L55n60J01K28j43j23J98K75l46m87M05J69J06p10M70L1J26k90k34M69k65
$$ plain form
5389 -156 -487 42 168 -465 -418 -212 49 11 -274 -41 -59 -7 -171 78 458 52 -263 272 425 -378 -268
5410 -268 294 123 254 177 210 132 -210 55 218 444 0 81 365 448 -238 142 357 27 -343 199 14 -263
5432 -263 -171 -61 -112 4 41 171 20 -145 -392 -208 248 -556 -216 109 -166 -352 -268 420 -19 -346 -50
5453 -50 379 17 -137 336 219 96 -160 -221 349 660 -450 76 460 -385 34 555 526 -458 -8 105 -5
5474 -5 -141 -7 -197 160 184 134 272 -6 -366 -86 557 93 -638 83 -8 -297 -17 -199 -138 -196 -352 -132
5496 -132 27 -13 -243 -97 378 -341 -328 97 131 -301 -592 318 -55 -349 100 284 -112 -53 -272 -71 181
5517 181 -301 -98 312 284 -157 198 518 -127 -41 514 198 45 -94 249 328 -35 7 166 181 51 -301 27
5539 27 382 -178 -77 151 8 -115 83 358 12 -475 -70 99 205 -505 -35 -4 122 -168 -402 67 -198
5560a98l13R22k23m24j35O10M4n35L17J61j18k94%K32J66j55K2pO46o10j43P03
5582F68o46q6K52M22m27n3J74k56r3L33m17J7J78PJ32l28j6J44J8J98l81M49K5
5605C14l68m08L69J44P4m01Q7%J33m0k70M04j26j43qL33k79k23P41j68o83K48
5627b70M31L0k21j21L58O9r1k94M81P6m51k36L72L46r22M87O03n51k95N29j01
5648B29q9J02j86J42m30K27Q2Q1j07m59N86K8o38J33M26k61r6J01m4J54l33K36
5670a16J86k15J81k82J29K76l06j76P37m32l66M44N16o54p4J27N1OJ94j84L1K73
5692C46l96k71O06k40m27O69J74o25L1N93m78l70K44M58l73O5m0R1j7n24L54J75
5714D5P6m19K21K48k37m12Q88k18n87J7K92M8j04j96J84l05L71k7J32K28m73Q7
$$ plain form
5560 -198 -511 411 188 -236 -371 239 283 -252 65 226 108 -186 -186 46 212 57 79 72 718 108 -35 668
5582 668 22 -64 188 610 183 130 304 48 -45 288 -129 -112 66 73 205 -123 -139 5 23 221 -160 289 314
5605 314 -54 -462 -93 51 125 -276 -189 -189 -56 -96 -366 38 -88 -231 -239 94 -185 -408 333 165 -518 -270
5627 -270 161 191 -30 -151 207 276 185 -109 372 448 -3 -239 133 479 -443 44 647 96 -199 330 229
5648 229 140 242 56 198 -232 -5 77 158 51 -408 178 206 -432 -299 127 -134 -230 -129 -173 -19 -352 -116
5670 -116 70 -145 36 -246 -117 159 -147 -323 414 -18 -384 60 576 -78 -152 -25 26 32 226 42 73 346
5692 346 -50 -321 285 45 -382 287 461 -164 -133 460 -18 -388 -144 314 -59 6 -34 57 40 -484 -130 45
5714 45 121 -298 -77 171 -66 -478 410 192 -395 -378 -86 -38 -142 -338 -154 -459 -88 -115 17 245 -228 -141
5736a41L05L2n38N37M64p66l04K07O13l19k34L73j53J48l70J83L86j93o03M48
5756G5K17l52j08K67Nn48N78Q4l50K54mK0k08J52k63l1J33j59j43M65P0m31N2
5779b25M94o47R1L22l49k36M20k15J51j05rL35M2K6n62M80N30o01L39J26l37k60
5801a90K90J64k67m6R0K97k15q1O0K33J79m92l25N47m29l05N85R7l86j20N84j63
5823A07l16o2K25j51q7L10k9J04n9l11J30J49l08r7L74M7m07Q6L39k45j66J07
5845b60J02J55K27l88J55j2l24L44J36n26J94M95J70n64j11O15q7m96J32p5n7
5866a75J66j49M93j8l33l40O69Q0l97k16M36k2l92N24l11j40J42j89r1P4J31j90
5888b48M74n61O8M50k39j37O0K85Lp95O60M5j92k8O6k86K82Q0p6L54k58j56K63
$$ plain form
5736 -141 164 196 -342 195 659 -107 -411 -204 409 90 -144 229 76 224 -146 37 423 230 -373 75
5756 75 292 -60 -168 99 104 -444 134 218 -132 122 118 138 -70 82 -181 -212 -79 -238 -381 84 154 -277 -225
5779 -225 269 -378 -287 35 -314 -550 -130 -345 -194 -299 -308 27 69 95 -467 13 543 -58 281 407 70 -190
5801 -190 100 264 -3 -49 41 338 123 42 102 335 514 22 -303 244 -185 -490 95 192 -194 -314 270 107
5823 107 -209 -271 -46 -197 -284 26 -3 101 42 -269 -139 10 -298 -395 -21 26 -381 -295 44 -201 -367 -260
5845 -260 -158 -3 224 -164 -9 -21 -345 -1 135 -391 -197 298 468 -96 -207 408 321 -175 -43 -118 -175
5866 -175 -9 -158 335 317 -16 -356 313 393 -4 -220 216 194 -198 326 15 -125 17 -172 -263 -189 -58 -248
5888 -248 226 -335 -267 183 -56 -193 -133 152 155 -640 20 65 -127 -155 -89 -375 -93 -13 -89 265 7 -149 114
5911A14J56j79l15L53L14k62k20K65J67j01m27M06K3P1l10j71K54k45L1J83K5
5932A32m53L72J87j31o96O31J46l11K14O6j36n49M89l71L87k18N0o1J88j93l1
5953b88N81l97j87J64J61j5m06K45N3J03M3J61k86M92l16j47N08o36O9k4L04j71
5975A1j59Q32l93j19J23o1j72n8J1J4J31O6m76M32j41o6q2R7l4j85J08J95j60
5998h6r2P7Mk96J12K61J56o1m34M4J96K29m94J49J56j80j88P06m8l88K02J78k11
6021hj57J27O02m58J08n44L49l3m8%P44k71o22P10k22k80j12K19K00l42K35j56
6043D1L29l34l83P7N07l44k41P00j17l62j03M57j45k01l8k31M04j33On4L18l43
6065a90K2L82k1o81K58J66j47NJ51jm29J65P40k69M6j08l1K34r6l01M7K25k53
$$ plain form
5911 114 270 91 -224 129 443 181 -39 226 393 292 -135 271 294 365 55 -116 138 -107 -76 107 132
5932 132 -321 51 238 107 -589 42 188 -123 91 157 21 -528 -39 -410 -23 -241 -191 -252 -64 -257 -288
5953 -288 293 -104 -291 -127 34 19 -387 -142 -89 14 57 218 -68 424 108 -39 469 -167 -98 -122 182 11
5975 11 -148 684 291 172 295 234 62 4 15 29 160 226 -250 182 41 -25 -107 -10 -44 -229 -121 74 -86
5998 -86 -178 -101 -97 -393 -281 -20 136 75 -359 -315 -119 110 -384 -235 -79 -259 -447 259 211 -177 25 203 -8
6021 -8 -165 -38 564 106 214 -330 19 -14 -62 -62 682 411 -211 499 277 -3 -115 104 304 -38 197 41
6043 41 370 36 -347 -270 237 -107 -348 352 235 -127 -230 227 82 -119 -157 -388 16 -117 -111 -165 153 -190
6065 -190 -168 214 193 -488 -230 -64 -211 -206 -55 -56 -485 -320 420 151 197 89 58 292 196 -105 -58 167 -86
6088h6l00P48j88n87K44J52J49j3K31j26m07l9J63P4O7J2l41L81j7l72K41K38
6110B24l19p1M46j62n41K05M25l04N9j91Q0K39k41j1J60J08m13J06M22j46m37
6131c62L32M8k15l3M34k02J6M4j14L32m34K53k14M75l94l1J81K76o08J20N18k38
6153A84l02L4L17o2l97L02k44K86j46K42L3m89j91N31K9l96O0L47j23l6J53P4
6175B06l48j48R4p5K59p7r0k6M84m13RJ47j79k23J69M20l18M3J09j04K58K05l25
6198G7k9K73j98r9J32J6j93O9N9JJ30j12K04l54J86m7Oj50K02k18l4K94l61J51
6222Ej09K17q0K33j5n19K53J39k41k54J77N84m15k77K56P6N9m0k14N38m19k29
6244b75M15pj98l4M13m37j56N14m7l51QL08j43q8J86k36P17k65m78L49o6k50K82
$$ plain form
6088 -86 -386 362 174 -413 -169 -17 132 119 350 224 -183 -222 -59 15 82 94 -247 134 117 -255 -14 224
6110 224 -95 -166 280 118 -423 -218 207 -97 -38 -229 -149 90 -151 -162 -2 106 -307 -201 221 75 -362
6131 -362 -30 18 -197 -230 204 2 18 62 -52 280 -154 99 -115 360 -34 -65 116 392 -216 -96 422 184
6153 184 -118 -84 233 171 -226 76 -168 118 -28 214 247 -242 -433 98 127 -269 -209 138 15 -21 132 206
6175 206 -142 -290 -196 -271 -12 -89 -179 -205 279 -134 -125 22 -157 -380 -211 209 -109 -66 43 -61 197 402 77
6198 77 48 321 123 24 156 172 -21 48 107 108 238 126 330 -24 162 115 121 -29 173 -45 -79 215 -146 5
6222 5 -104 113 33 266 251 -268 -15 124 -117 -371 -194 390 -25 -302 -46 30 89 49 -165 373 -46 -275
6244 -275 140 133 -65 -99 314 -123 -279 235 188 -163 -155 153 10 -78 108 -128 589 324 -154 195 129 -121 161
6267A61J51j37m72JM53j00j27k92M27l86K88l80L20L82o99J90M56p8l60L60j53
6288EO6m19L79nj97K31m4K48m19K8J52j6J15m41K75M61n27k79N92o8k03J06Q6
6311A26N3Q1O8k55j55n2k5K41N14o11j50M57O8n17J96L17m85j65N32n1n08L05
6333a6L3K02k07n6O8k9J4n13L58K81l92J39L22k10j98J05r2L10n6o7l7J17l68
6356b92J95J64M3k81M3N24n29jL09K03n67n4M38l7l89L69L0j98J70k2K4J06j37
6379A11k76M19J43o05K78J25j73J9r0jK42o13K63K93j99J8j92K50j08l53M01J22
6401G4j13k72K98J24l37J15J08l30Q4J07J83k5R6k64J63J86o35K44L24j97k8M22
6423C27k83J48m33L93J65K0m14J5K79j18j77M3L58j41o44N67L21n78j97N49r5
$$ plain form
6267 161 312 175 -297 -296 157 57 -70 -362 65 -321 -33 -413 -93 289 -410 -220 236 158 -202 158 5
6288 5 71 -348 31 26 -171 60 16 264 -155 -127 25 9 124 -317 -42 419 -108 -387 205 137 -66 40 126
6311 126 179 260 328 73 -82 -134 -159 82 596 -15 -165 292 360 -157 39 356 -129 -294 238 187 -321 -16
6333 -16 17 219 12 -44 24 -5 9 -504 -146 135 -257 -118 204 -6 -204 -99 -191 119 63 -4 -41 76 -292
6356 -292 -97 67 110 -171 -128 396 -133 -134 175 378 -189 -243 195 158 -231 138 168 -30 140 118 142 248 111
6379 111 -165 254 397 -208 70 195 22 41 -49 -50 192 -421 -158 135 -64 -46 -238 12 -96 -449 -48 74
6401 74 -39 -311 -13 111 -226 -111 -3 -333 -249 -142 41 16 112 -152 11 197 -438 -194 130 -67 -95 327
6423 327 44 192 -241 152 317 337 -77 -62 217 99 -78 -35 323 182 -462 105 426 -152 -349 200 105
6444A05k45J65Q7j2k54k5J23j84J53k34J96L72m94k04O65k17k43K74j33p0J06
6465f9Q2j09J14n2K35l56K5J42J38O4k72L3J88K00m47m73R18m39j99J77K07O8
6487A75k97L39j25j03J66k06L49m03J6p2J05p7k8J0N25k30l16K77j03M7j82J76
6509D3k87L84m7k96L87m11j70N38j87n26L27N20o70m7N37L5k33k42M07J68j42
6530H8R5l2L79l38j76O3L64l59k20P54m44j46j20K62n7k14L82q7k45Q5j03K82
6552B13l1j15j33J89P8p64L22J06J16l4J43J01l55J03j9O0Q3j38r9K67m30K8L53
6575D4k3R7j32J38M5m23K48J07p0l8J44m06M55l97J4K52R3l07J22M63l89L92k42
6598A87O3j56k49M31j37k47o1K05J49j83J88Q7P0o39L67p3m4j07k8K81k61P0J86
$$ plain form
6444 105 -140 25 112 100 -154 -179 -56 -240 -87 -321 -125 247 -247 -451 214 -3 -246 28 -105 -175 -69
6465 -69 13 -96 18 -34 201 -155 -130 12 150 214 -58 -25 163 363 -84 -557 361 -78 -277 -100 107 175
6487 175 -122 217 92 -11 155 -51 298 -105 -89 -161 -56 -133 -161 -151 374 144 -172 105 2 49 -133 43
6509 43 -244 140 93 -203 184 -227 -397 141 -46 -572 -245 275 -395 -442 95 130 -103 -345 62 230 88
6530 88 183 151 530 192 16 79 443 84 -136 618 174 28 -92 170 113 -101 281 194 -51 34 -69 213
6552 213 182 67 -66 123 201 -563 -241 -135 -19 -53 90 191 -164 -61 -80 -20 63 -75 -174 93 -337 -309 44
6575 44 21 118 -14 124 169 -254 -6 101 31 -7 137 -269 186 -211 -197 55 148 -159 -37 426 37 429 187
6598 187 250 94 -155 276 139 -108 -169 36 185 2 190 277 347 -292 75 2 -42 -149 -177 104 -157 -87 99
6621I9j52m22M85KJ63k90k41J68P6K83l17rM79p58J90L18j48j39J00J30Q7k48
6643a44K42k98nL30k69N02k29P5MK3j53q2K2M36m90K26j09L42p12L86J39QP2n27
6667b11Q4O8J41k6l26L86k92l1J72m8j10P1L28k54j09J06j52K05r9K38k36j10
6689b05J63j61J62K26l11K90J17m30J64K41m30k05O27r4l31M81l20K32J27l36
6709GJ3R7K8r5j95K01k41K01J49m8l82L59Rk35L27l9k43L5K09j69K9N3n6j70K52
6734I6k76j69J08L41k87RK03k61N25l98j16M26J02m29k50K18J14J20L26k59k68
6755a25J90k84K18r9n6L10m58L00J71j65K3j71J53L78qm73J07M33j33l14j62L06
6777A41j10l79N48k05N0k8r1O1j51K45k04J62j43n9K19r8r4J62L24j07l29j40
$$ plain form
6621 99 -53 -475 10 12 175 -115 -356 -188 -112 171 -146 -155 324 -434 -244 74 -74 -213 -113 17 104 -144
6643 -144 98 -200 -205 125 -144 358 129 204 208 231 78 -4 18 454 -36 190 81 423 -289 97 236 244 316 -211
6667 -211 -127 -59 82 56 -270 116 -176 -207 -35 -83 -193 -122 206 -48 -157 -51 -203 2 -97 141 -95 -205
6689 -205 -42 -203 -41 185 -126 164 281 -149 15 256 -174 -379 248 154 -177 304 -16 216 343 7
6709 7 20 117 145 50 -145 56 -185 16 165 117 -265 94 103 -132 195 156 -87 -52 157 -12 17 70 14 -156 96
6734 96 -180 -349 -241 100 -187 -178 25 -236 289 -109 -225 201 303 -126 -376 -158 -44 76 402 143 -125
6755 -125 65 -219 -1 -100 -156 154 -304 -4 167 2 25 -146 7 385 377 -96 11 444 311 -3 -165 141
6777 141 31 -348 200 -5 45 17 -74 -13 -164 81 -123 39 -104 -163 56 -42 -136 26 350 243 -86 -226
6799b26J35m6R4K52J20j69k0j10n0K18m63M18J84q4n71L32K20m09J84J44p7J46
6821B22m31L54l78L85n41N37J06k51J23J3j95k72L70M30k15m36J97O5j64R9j23
6842a05J90k37p0j98L43J4P9j05J64J74m61K61J53R2k61k57L43j95O0Ln7L35k84
6865a9j25L69o8k41K51j23k70Q4K4J36l93L37P3P1l17O8M0P7o4m3L74Mr7K3K36
6890D07o79N36Kk97L9p5M13n26N4J21Ol3J92O1l70K13Q7j77N0L8k65K14L63m13
6914c9L3K38m62K44k34L46o8j22j35J73K27l04p2K43K39n94J41N92j25j92Q2k7
6936A84j70j2J19k81J21N5j38L00k57l1J23k0k09M5K96j99j48K92J55k90j01K65
6958I9j9k18r2N00k99J83l12N6K28n2j08j46K36J73m77Q6N11n00K33l3l54L74
$$ plain form
6799 -226 -91 -137 -43 209 329 160 140 30 -20 198 -265 153 337 253 -318 14 234 -175 9 153 76 222
6821 222 -209 145 -233 152 -389 148 254 3 126 139 -56 -328 42 472 257 -179 18 83 -81 18 -105
6842 -105 85 -152 -222 -420 -77 -63 16 -89 75 249 -212 49 202 294 33 -224 119 -76 -16 -13 -70 265 -19
6865 -19 -144 225 157 -84 167 44 -226 -142 -118 18 -375 -38 35 106 -211 -143 -103 -26 -90 -133 241 245 148 171 407
6890 407 -272 264 266 -31 8 -67 346 -180 -126 -5 1 -32 160 221 -149 64 151 -26 24 62 -203 11 374 -39
6914 -39 -6 232 -230 14 -220 126 58 -64 -199 -26 201 -103 -175 68 307 -287 -146 446 321 129 211 184
6936 184 14 2 121 -160 -39 16 -122 178 -79 -110 13 -7 -216 -171 125 -74 -222 70 225 -65 -166 99
6958 99 80 -138 -230 270 -29 154 -158 -102 126 74 -34 -180 56 229 -248 -162 349 -151 82 49 -305 69
6980F9j50j7K35l20J9L40P6k8j19K69j55j98q3L48j45k16K73J23j23n6k98J85
7002B9n3l73M76M4lm93M84K22m75M9K5J02p4O8k35k1l8M84l58M75m31m5M00q4
7026A75m22q3L84K45m35j9M52k42j79J08p6J40k43O8L34j75l42J14L47m13M06
7047A44j13Q9K57p7J49n26J62l67M49J76k76r8O0K18j65k72J93m3J24K36l16Q8
7069I2l41K37j25J4J56J08j07m4p5j39L17k28j70M81j32j24J54K09l98j9L49n7
7091A58R5l60o2K05O7q6p1J79j93p2q3K31j54K42K1N5l33J27K23O0k93L86n03
7114a61n9K94j55k6K49k02j85K48K90l03j94L58J26n07L76l42J45o4K89q8o0K62
7136B91k64J1k72M12k77K97k34r1K97l63J51j56K76j10q9J06J33m5J41l55k8M59
$$ plain form
6980 69 -81 -98 137 -183 -164 176 252 224 105 374 219 21 -62 286 141 -75 198 321 198 142 -156 29
7002 29 -24 -397 79 123 120 -373 111 333 -142 -93 -68 34 -40 28 -207 -228 -266 218 -140 335 -96 -141 259 175
7026 175 -247 -330 54 299 -136 -155 297 55 -124 -16 -92 48 -195 -127 207 32 -310 -196 151 -262 144
7047 144 31 120 377 300 449 -77 85 -282 167 343 67 -31 29 247 82 -190 3 -40 84 320 4 92
7069 92 -249 -12 -137 -123 33 141 34 -10 -85 -224 93 -135 -305 176 44 -80 74 283 -115 -134 215 158
7091 158 253 -107 -169 36 103 17 -54 125 -68 -140 -223 8 -146 96 117 172 -161 -34 189 249 -44 342 -161
7114 -161 -220 74 -81 -107 142 -60 -245 3 293 -10 -204 154 280 -227 149 -193 -48 -112 177 89 29 291
7136 291 27 38 -234 178 -99 198 -36 -127 170 -193 -42 -198 78 -32 -121 -15 118 73 214 -141 -169 290
7158B90m17J49K61N1l92J27M08n09KK59K5l35O0qJ88k88J54k08J80nj55J54K51
7181B42l74O1mM2j26J27j7k05K80j31j62K77R2k21R1L9j62m9O10l34m13L30J85
7204A78j84J7Q4L2k79R0j21K86j83K83k49J23k85J83NL73m16K5J03J61l30J25
7226B1r3k65L26k5k01r1K23k11N10k31r5j05M38k28J11L4j17l78J68K16j23j82
7248b98M08J16j9k89j40K62rk44oJ49J64k89K0N3j51K76J07j66j29K06q8j2J62
7271H3K57j65j29j39k08J74J99N7l40J76K19m33L61N7m05R5J94j11N0L01k95n4
7293e6mj41j35L68pl64M9M24r2J18j47rl55J21L57l8r8Pj72P6l7p4L36j23k5J20
7319I9K6J00m14k53M35k20N34k15p2K40k58Pk43m0J48j68M45k68j11Q6K72p4k26
$$ plain form
7158 290 -127 22 283 334 -58 69 477 -32 -30 229 254 -81 -21 -29 159 -129 25 -183 -3 -8 -163 -9 242
7181 242 -132 -71 -75 -33 -159 -32 -49 -254 26 -105 -267 10 102 -119 -28 11 -151 -200 410 76 -337 -7 178
7204 178 -6 11 95 127 -152 -62 -183 103 -80 203 -46 77 -208 -25 -20 353 -63 -38 65 226 -104 21
7226 21 -72 -337 -11 -36 -237 -328 -105 -316 194 -37 -132 -237 201 -27 84 118 1 -377 -209 7 -116 -298
7248 -298 110 226 207 -82 -222 40 31 -213 -219 -70 94 -195 -175 -122 -273 3 110 -56 -185 21 -67 -79 83
7271 83 340 175 46 -93 -301 -127 72 129 -211 -35 184 -249 112 169 -236 -141 53 -58 -8 293 -2 -56
7293 -56 -60 -201 -336 32 25 -339 -290 134 42 160 13 4 -351 -230 127 89 -9 -2 -174 -98 -135 -209 127 4 -21 99
7319 99 125 225 -189 -442 -7 -227 307 92 20 260 2 9 -234 -274 -126 -294 151 -117 -228 -142 130 56 -170
7342a70J57k9k30M27P4j79q7L51n12J53J91l26M43q2l01j87N90n19J16K57J79
7363C16j03j62j93K33J1k03j86L01J89o1j34l95P28l42M6k30K97j52L07k45j40
7384a18L99j46k70J29L0K0P7q5J14J30k07l47L21M6j85j29P40n84q4L77r0j17
7406B1j97J44l8m8j15K56j53K32j43O7r6j01M18l06Q6k68N6K06l19K56o3R5M8
7429C8J07j01l39L54J97n26K38K7J35N2M9P2k48k48M27k33P7k78R9J63k41K94
7451A15J60l53M46m53M16o14K90J32J62J6n24L65k31K13k81N4N7K32l38K7L34
7472B25k61M6m7j44J82j56K17j83K1K07kJ04j23k04J85J28l70J76J95k80k03J44
7494a43J09Q1Q5lK18o82M57j81o0lK49J37k99k18K40M6O5%j07J12k3L1m0M8j3
$$ plain form
7342 -170 -13 -42 -272 155 229 50 -37 314 -198 -45 146 -180 263 181 -120 -307 283 -236 -120 137 316
7363 316 213 51 -142 91 102 -101 -287 14 203 142 8 -387 341 -1 45 -185 112 -40 267 22 -118
7384 -118 281 135 -135 -6 24 44 121 36 150 280 73 -274 47 93 -92 -221 519 -65 -149 228 138 21
7406 21 -176 -32 -70 -118 -233 23 -130 102 -41 26 -70 -171 247 -59 27 -241 -185 21 -298 -42 -105 -10 38
7429 38 145 44 -295 59 256 -270 -32 -5 130 182 231 303 55 -193 234 1 78 -200 -101 62 -179 115
7451 115 275 -78 368 -85 331 -283 7 139 301 317 -207 158 -73 140 -141 -87 -30 202 -136 -109 225
7472 225 -36 10 -37 -181 1 -155 62 -121 -100 107 105 209 86 -118 67 195 -175 1 196 -84 -287 -143
7494 -143 -34 47 132 129 347 -335 122 -59 -119 -122 127 264 -35 -253 -13 33 98 98 -9 103 80 111 71 119 106
7519A06l30K82j05j47L24k62oJ16kl1K82Q2m09J45m5P5k14K42j0m06K50J31k41
7542a73L53l58J88K79j04J29j98j51n6K30J25k21O2J31K0o8m42N91o14K12J42
7563G7j01l39M50Q6j4j93P9Q1j00N17r96N06J49m03M6j1M90m37L54k04r5J58L3
7586A33k38N0J86m13N6M67k00j10K7J12o8j69M22j87q0K01m92L75j22O6j25L25
7608B16m35K45n4J08k9N7o0K2%M4J03j36J49m2K55l57J06k47O4k3J15j95K62l66
7632a98j78M81j62k37J85K74k47j93K46J49K1k35J54m1lJ54k48K11K2m50L64K63
7654C32j4l95L70j59k08K81M6k1J9j22P7Km30K03K68J5j52j78J94k06j96M26Q
7677A60l95K35J34j1k60j05K21M9p0j01R3N6l01K72K1l6k18Q6P7m9o1J87p6j38
$$ plain form
7519 106 -224 58 -47 -194 130 -132 -138 -22 -24 -55 227 309 -100 45 0 75 -139 103 93 -313 -63 68 -173
7542 -173 180 -178 10 289 185 314 116 -35 -91 139 264 43 105 236 256 188 -254 337 -277 -65 77
7563 77 -24 -363 87 173 159 -34 45 126 26 543 -453 53 202 -201 -155 -166 324 -113 241 37 -58 100 133
7586 133 -105 -55 131 -282 -226 241 41 -69 -42 70 2 -167 255 68 -12 189 -303 72 -50 16 -109 216
7608 216 -219 26 -28 80 51 108 48 70 70 114 217 81 230 188 443 86 192 -55 9 -14 101 -94 168 -198
7632 -198 -376 105 -57 -294 -109 165 -82 -275 -29 120 141 -94 60 19 16 170 -78 133 155 -295 69 332
7654 332 318 -77 293 134 -74 207 253 232 251 129 206 208 -222 -19 249 264 112 -66 128 -78 -274 152 160
7677 160 -235 0 134 123 -137 -242 -21 28 -42 -143 -50 6 -295 -23 -2 -38 -256 -170 -93 -142 -203 -16 -92 -230
7701b30L46j01k47N30l28l94N63j22j09n1M66m61K31K10k64o6O9J40q8l28n1K85
7723@J50k6J60mP8k36j59L04k24R1N4j62p9N0o1J47k2r3j31J41K01j89k39O6N8
7748a25k09L34P3m77L85Oj37mK44K2j00k4j47R3M08n2m90O5L18j15l67L58N6k41
7772a26K47j56k11L95L8l4m09L85k80J90L40l90J72N2k60j05J38J21n31O44mj58
7794E8l3k04L12j04J85l03l4k17L70o5P3j2k45K55j34K27j46K4K98n65M39q5L1
7817A25k22j8J80k7j08j04J65L80n80J00L3J26l14M97k93j4r9K70k83L97J89n20
7839a20J18J41k8j4J16n8l78j16N51r9k73K99K08q71N35k10J69L5p7m3K75l26
7861a66Q5J03j77j57J87M93o37J66J91%p1j85L7K18k47L5o6M33l04n1J55k85J25
$$ plain form
7701 -230 116 15 -232 298 -30 -424 139 17 -92 -143 323 -138 93 303 39 -27 42 182 94 -234 -285 0
7723 0 150 124 284 280 358 122 -37 267 43 134 188 26 -53 -3 -64 83 61 -32 -163 -22 179 -10 -249 -183 -125
7748 -125 -334 0 73 -404 -19 -13 -150 -154 90 112 12 -12 -159 -66 342 290 -200 -135 183 68 -299 59 115 -126
7772 -126 121 -35 -246 149 187 153 -256 129 -151 39 379 -11 161 213 -47 -152 -14 107 -424 220 216 58
7794 58 25 -179 133 29 214 -89 -123 -340 30 -35 38 26 -219 36 -98 129 -17 7 305 -260 179 94 125
7817 125 -97 -115 65 38 -70 -174 -9 371 -209 -109 -76 50 -264 233 -60 -74 -173 97 -186 211 400 -120
7839 -120 -2 139 111 97 213 155 -223 -339 212 113 -160 139 347 -524 11 -199 -30 5 -72 -115 160 -166
7861 -166 -81 22 -155 -312 -125 368 -269 -103 88 88 17 -168 -131 87 -160 -125 -191 242 -62 -113 42 -243 -118
7884a18K6M26p9j63o6K24j24j77L10k63o9L09q6k85L0P2J26j25K13q9q5K00k97
7907i0k83L66K96k70j43K79o1k60L54k31r0P2r9k4J2N8l06M05R5l26L40O3j83
7930b6j05j27J57K49l83K00M0O9q3j50K79j21j2P1K49k31J74o3j56j92J12K30
7952A81k95j2O6P0j07K08m3r1J24Q9k7j51J06r7j47M55o01Q7K54p2j38o0J83m2
7976f0J91k30j29R6K77r3l7j66M0P8J59k09j57K24J8k73J12J57N8j5M6Nj99J44
8000C7q7K35k09p8l63N63K77m23rP4K10k6k6J02j4m13p4L12J22k29M7p9J63q2
8024C0j02L88k06l22J63N0J57J29k54K9l44r4K07L21j90p7J92n5p6k4k6K39k11
8047g6J60j13o9k52M50k61R4J76O2l08J47j38JJ39n4R6k04R3K12k53J54J72J9
$$ plain form
7884 -118 -92 334 255 92 26 250 126 -51 259 -4 -73 236 150 -135 -105 -33 93 -32 181 92 7 207 -90
7907 -90 -373 -7 289 19 -124 155 94 -166 188 -43 -133 -61 -160 -184 -172 -114 -420 -15 80 -246 94 157 -26
7930 -26 -131 -258 -101 148 -235 -35 5 74 -9 -159 120 -1 -13 58 307 76 250 187 31 -161 -49 181
7952 181 -114 -126 -60 10 -97 111 68 -23 101 190 163 12 118 21 -126 329 -272 -185 69 -3 -141 -201 -18 -60
7976 -60 131 -99 -228 -132 145 52 15 -151 -111 -33 126 -83 -240 -16 2 -271 -159 -2 56 41 87 92 -107 37
8000 37 -50 185 -24 -102 -465 98 375 -48 -57 17 227 201 175 277 263 -150 -224 88 210 -19 28 -51 112 30
8024 30 -72 316 110 -212 -49 1 158 287 33 62 -282 -376 -169 152 -38 -115 77 22 -54 -78 -104 135 -76
8047 -76 84 -29 -98 -350 100 -161 -67 109 171 -137 10 -128 -127 12 -42 54 -150 -57 155 -98 56 228 247
8070B47j68k03J39J21k40L6K59K7O3n47K32qJ23k39K98m76K86O0Q9l98P5L05J71
8093B52m80j12M37J05l48L2K14r3P2j75K52k56K6P9J3k17J59P7p9j58J38o6L28
8116B00p8k72L41K46n87J92J7J08j52K94j38n9o2j9J28L7k81O3k5L63j29l27J29
8139a1k03K10J53j42q5J85k31j30J76j22J79J01p3J58M5j55m66J86L21J4k62O4
8161h8J91m5J45l24Q7O4n0J74k54L08m19J25J87k0J04j24j97K1j24J96J42n20
8183d21M90k21K75Jk92M07k31j65
$$ plain form
8070 247 79 -124 15 136 -104 -68 191 218 281 -266 -34 -42 81 -158 140 -336 -50 10 99 -299 -224 81 252
8093 252 -228 -340 97 202 -146 -114 100 7 79 -96 156 -100 -74 5 18 -199 -40 37 -42 -200 -62 -128 200
8116 200 122 -150 191 437 -150 42 59 167 15 309 171 112 50 31 159 196 -85 -22 -47 316 187 -140 -11
8139 -11 -214 -4 149 7 -78 107 -124 -254 -78 -200 -21 80 7 165 210 55 -411 -225 96 110 -152 -88
8161 -88 103 58 203 -121 -34 30 -20 154 -100 208 -211 -86 101 81 185 61 -136 -115 -239 -43 99 -421
8183 -421 69 -152 123 124 -168 239 8 -157
8191a57
$$ Imaginary data points
##PAGE= N=2
##DATA TABLE= (X++(I..I)), XYDATA
0@%%%%%%%%%%%%qJ6j6J6j6J7k5L2l3M1m8N5o3P1q0R0j06J21j36J52j68J86k10
35a12K34k59K90l22L55l90M31m78N29n87O51p24Q08r05J016j145J302j494J737
54I37k053K487l119M132o015J0644m1927p0676P5951M1973k1384J684K4752m0688
68b3302n6712J2161O8962L8133j8640k8192j202j2245j6055L9142O4948q434n2740
81E824j1620L974j4881J8939N0168L096n0402l6419J170J7090R837P495J9167
94B3438o054n9277k9591N4996M3302k5496o087K8196k4477m9071K6421O3978Q255
107D8533l1312j1402N516q931j2284K2609L9718j2896n1047p031K3550j3059q816
120a6852L4793N556m8641j9509K6201P428j0553J0702J5954j1797k7783j000L6021
$$ plain form
0 0 0 0 0 0 0 0 0 0 0 0 0 0 -8 8 -8 8 -8 9 -16 16 -17 24 -24 31 -32 39 -41 49 -57 64 -72 80 -88 98 -112
35 -112 122 -137 153 -169 186 -204 227 -251 278 -309 342 -382 426 -479 537 -608 694 -800 937
54 937 -1116 1371 -1748 2384 -3631 7013 -34914 -105590 -29639 12334 -9050 -7366 17386 -23302
68 -23302 -80014 -67853 1109 39242 20602 -7590 -8792 -21037 -37092 2050 66998 58564 5824
81 5824 -5796 -1822 -16703 2236 52404 55500 5098 -31321 -30151 -13061 -3224 4271 23438
94 23438 17384 -41893 -71484 -16488 26814 1318 -4769 23427 -1050 -50121 -23700 40278 48533
107 48533 17221 5819 11335 2404 -9880 12729 52447 39551 -11496 -18527 5023 -8036 -16852
120 -16852 17941 23497 -25144 -44653 -18452 -11024 -21577 -10875 5079 -6718 -34501 -35501 520
133E20J8252k5024m718L2451o811l8822J9729M7290j6076l6735J6199K2163j9632
146H786j8070J7005J6359j5392k3599P862K1629j3986k4630J6724J9571k4089
158a1830j0906K8686L451k9164L661K5550j910j2424R284J0573q870j5613O656
171b856K6663K232k7755j243K1551j5995k6398K7459L0600k9815l2893J5594J3129
184B73j7308k486K4227P702k8057k3916J7515K7391o455q463K0570J59l6941o10
198b6399M2168J0928j8706L859N341k1686j1371K4447K4630n455k2409q917M722
211A152o932o949K5548K2868l1949l6051J5434J8665j3060L661K7690n781l7013
224b2717j1021K5343K1641l292p270Q574m492k7810j120M1345J4500k8411q382
$$ plain form
133 520 18772 -6252 -10970 21481 14670 -24152 -4423 42867 26791 -9944 6255 28418 8786
146 8786 -9284 7721 24080 8688 -14911 -7049 14580 594 -24036 -7312 12259 -11830
158 -11830 -22736 5950 9401 -19763 -16102 9448 7538 -4886 4398 14971 6101 -9512 -2856
171 -2856 23807 26039 -1716 -2959 18592 2597 -23801 3658 34258 4443 -28450 -12856 273
184 273 -17035 -19521 4706 12408 -15649 -39565 -22050 5341 -1114 -9577 10993 11152 -25789 -26399
198 -26399 15769 26697 7991 11850 17191 -4495 -15866 8581 33211 27756 5347 -3570 1152
211 1152 -5780 -12729 12819 35687 3738 -32313 -16879 1786 -11274 -7613 20077 14296 -22717
224 -22717 -33738 -8395 13246 9954 2684 11258 6766 -21044 -22164 19181 33681 5270 -3112
237c112J0808j6812j4289K8235K3605j8011k3677k183K860k450L694J8818R479
250A6965k5362k6276J6421K3124q819j140K4762o032l6043P20L4408J0147j2678
263A0197l79O152r841j6828N944K9476P204k8817j1324J4789o829j7188K0534
276C090K2351k2370k5039R508R509p845L435J5358l44j8902j1194J4564J7431
289I552p313o633J5833k88k7805J705L2364M71k3088M011J2653j3422j4122J2961
303c121J6842o288j9572k425J5272k587j5560J1456K1524j6948k2100J7639J7522
316A1654j5467m219K0226M19j8192O77J5726M604r605l497R523J959j6721j559
330d472K1787j656k4871L161J9255j2414j7647J4995J2623j6236j1797J0817R331
$$ plain form
237 -3112 7696 -9116 -23405 4830 28435 10424 -13253 -15436 -12576 -15026 -11332 7486 16965
250 16965 -8397 -34673 -18252 4872 -3947 -5087 19675 13643 -22400 -21680 12728 22875 10197
263 10197 9818 15970 6129 -10699 -4755 24721 31925 3108 -8216 6573 -256 -17444 3090
276 3090 25441 3071 -21968 -12460 -2951 -10796 -7361 7997 7653 -11249 -22443 -7879 9552
289 9552 2239 -4394 11439 11151 -16654 -14949 17415 17886 -5202 -1191 11462 -1960 -16082 -3121
303 -3121 13721 7433 -12139 -14564 708 -1879 -17439 -5983 15541 -1407 -23507 -5868 11654
316 11654 -3813 -8032 12194 12613 -5579 -4902 10824 15428 5823 2326 11849 13808 -2913 -4472
330 -4472 17315 15659 -9212 -6051 13204 790 -16857 -1862 10761 -5475 -17272 -6455 2876
343B876o857r260P034J3314q549j5320J4413J7681j7172j2630K1112P306k1249
356g301J75J9578l735j6525L278J1412k825j0588N15J1266k077j6640L326J9591
370I450o833j9404J2599J6639j6965j0272K0548Q386j6139m482J3777M542q555
383C291m597R832Q391j3128j1901J5551J0289j9666o428J9715k762k1949M704
396h658J7166p828j3034N660P585n803q017N127J1535l161j3915N970J5918r501
410i56j2322J7983J0864k0145o345J9959J834j5770K162J2041k917j1588j699
423f899J0499M577j3171n926J4816J957j8972K552K1235o392j7449J0002J3668
436A0497j0319p544J1974P125p447o926O258R238n747j0292R574J0175j6080j0801
$$ plain form
343 2876 -3981 -13241 -6207 7107 -1442 -16762 -2349 15332 -1840 -14470 6642 13948 -7301
356 -7301 -7126 12452 8717 -7808 -4530 6882 4057 -6531 -6016 5250 3173 -13467 -10141 9450
370 9450 2617 -16787 -4188 12451 -4514 -14786 5762 14148 -1991 -6473 7304 11846 3291
383 3291 -1306 8526 16917 3789 -8112 7439 17728 -1938 -8366 11349 8587 -13362 -8658
396 -8658 8508 680 -12354 -6694 891 -4912 -12929 -7802 3733 572 -13343 -7373 8545 -956
410 -956 -13278 4705 15569 -4576 -10921 9038 10872 -4898 -2736 9305 6388 -5200 -6899
423 -6899 3600 8177 -4994 -10920 3896 5853 -13119 -10567 10668 4276 -13173 -3171 10497
436 10497 178 -7366 4608 11733 4286 -2640 3618 12856 7109 -3183 6391 16566 486 -10315
450a0315J8261N005k0894j018J7098o118j6416N526J1740m300j0353J620R585
463e79j26j1093J687J6442k218j6954P749J7325r950j1703J4459Q627j3539n132
477e005J1142L353q381m807O727M974r465q241J1570P022j5894m692J7751m11
491E643j8793O478J6936p989j2055R413R914o367p168O226R593m052j1510M995
505A264J3355p997j3774J0439J0966j5516r504J4678L356j4671k557R843mr418
519i540j971Q840L699r965m089J3813L332j5216J936J8464m477j5696J0090J3792
533A3012j0307q666J1024P278r510o916P258P407p411r581P995R176j2553r954
547a1748J4657O409j6695l013J5870q61j3275L244J1293j959q191J018R185J445
$$ plain form
450 -10315 7946 12951 -7943 -8961 8137 2019 -14397 -8871 2869 -1431 -11784 -10164 -579
463 -579 -705 -11798 -10111 6331 4113 -12841 -5092 12233 2283 -9420 5039 13666 127 -5005
477 -5005 6137 9490 1109 -3698 3029 8003 -1462 -9703 1867 8889 -7005 -11697 6054 5643
491 5643 -13150 -6672 10264 2275 -9780 -367 9547 3180 -3988 2238 11831 7779 -3731 1264
505 1264 14619 6622 -7152 3287 14253 -1263 -10767 3911 7267 -7404 -9961 -118 -122 -9540
519 -9540 -11511 -2671 1028 -8937 -13026 787 4119 -11097 -9161 9303 4826 -10870 -780 13012
533 13012 2705 -5961 5063 12341 2831 -4085 3173 10580 3169 -6412 1583 10759 -1794 -11748
547 -11748 2909 9318 -7377 -10390 5480 4619 -8656 -5412 5881 3922 -4269 -3251 5934 7379
561G379j0205L5J3503j699j5623N452J5003j0158j3207J1618Q394j3722p114J1312
575I68L328j0273m288P812M653r479o320J1370P322j3927m371J6549J624j5324
589a0356M013J6025n003j1146O703R157m199o756L945P738k343j0535K851J1641
603A1735o053j2576Q604J0405j3696q848J3992M251j3929k278J1650O13j0561
616f691r11J0480K900j0612k992J3070K755j4920J617J6705m381j5670P727J2004
630A1081r106r122Q690N793q058o310M422O430n063r269N820R194r714r510J3056
645a666P440j3677l035J4898J35j2516L726J2053j687q186J804R610o6r562N12
660b17J3081k172j4692N018J3588r849j2637J1120P565j3657n726R957K138q397
$$ plain form
561 7379 -2826 -2791 10712 9013 -6610 -1158 13845 3687 -9520 2098 10492 -3230 -10344 968
575 968 4296 -5977 -10265 -2453 2200 -7279 -13599 -2229 5093 -8834 -13205 3344 4968 -10356
589 -10356 -6343 9682 4679 -6467 236 9393 5194 -1562 2383 10121 7778 -2757 94 11735
603 11735 5682 -6894 1710 12115 -1581 -10429 3563 7814 -6115 -8393 3257 3870 -6691
616 -6691 -7602 2878 5778 -4834 -7826 5244 7999 -6921 -5304 11401 7020 -8650 -923 11081
630 11081 1975 -7147 1543 7336 -722 -7032 -2610 3820 -1243 -10512 -4692 4502 -5212 -14722 -1666
645 -1666 5774 -7903 -10938 3960 4095 -8421 -4695 7358 5671 -2515 -711 8899 8833 -729 -217
660 -217 12864 10692 -4000 1018 14606 4757 -7880 3240 10805 -2852 -8578 1379 3517 -4880
674d880l213O133M044o785n895Q925O950j0446m659J4667J971j4019K208J4835
688I836l799j1833N751Q761n203p796L415P880l540j1152K526J1371o455j3042
702a3280R410J0981j2987q527J4543M745j3065j95J2402L0q261J160Q367K766
716H089p105j901J0051K670j1746n40J3391l079j3943N862R601q870q547P058
730I91M414p443n667M008N392m888p692N354R553p924r479J2020Q348j3236k887
745i136J5219M72j2968L093J1344l089p828K250O722o49q694o55R938j515j2444
760g940K674J2074p419j1430R203R167j1005m876J0161L348p731j157O957M014
774F040m938m749Q042O711r061n586J2695K945j4810N71J3582m292j2497N542
$$ plain form
674 -4880 -8093 -1960 2084 -4701 -10596 -1671 5279 -5167 -9826 4841 6812 -7207 -4999 9836
688 9836 6037 -5796 -45 8716 3513 -4283 -868 7012 3472 -7680 -5154 6217 -238 -13280
702 -13280 -3870 7111 -5876 -14403 140 4885 -8180 -8375 4027 4057 -4204 -3044 5323 8089
716 8089 984 -917 9134 11804 58 -482 12909 9830 -4113 1749 11350 2480 -6067 991
730 991 5405 -2038 -7705 -3697 1695 -3193 -10885 -5531 4022 -3902 -13381 -1361 6987 -6249 -9136
745 -9136 6083 6555 -6413 -3320 8024 4935 -2893 -643 6079 5430 -3264 -3919 6019 4504 -7940
760 -7940 -5266 6808 -611 -12041 -2838 6329 -4676 -9552 609 3957 -3774 -4931 2026 6040
774 6040 1102 -3647 4395 11106 2045 -3541 9154 12099 -2711 -2140 11442 7150 -5347 195
788A95P563o925p281L858N407l092p652J790Q030l999r623O816J0255r144p524
803a1326J1213N271j0977m93J1209o9q006O5O585J908n711k836P585L102j0902
818c382k787J2482mj3816L991J1486p610r591Q364P470p566m893N466M962m645
833g3m889N721Q042o466q032Q954O940j1158l126J2712J51j2596J172R315l010
848C657o974K243M767k307o642j063Q235J17r649J010J0130m786j0984Q449R169
863E372q475o409R214M048p293k223P847L503n394m697N957N957p474m561J0749
878F121L094j3076p11J2431k336j0991M654P888n947o896M501N852k859n458J590
893b143O799k808q382N581R675p370q352R247N247r545k208R551M67q338n45N903
$$ plain form
788 195 7758 833 -6448 -2590 2817 -275 -7927 -6137 1893 -2106 -11729 -4913 5342 -3802 -11326
803 -11326 -113 5158 -5819 -6312 4897 4828 -3178 -3113 3472 5380 -331 -3167 4418 7520 -3382
818 -3382 -6169 6313 6309 -7507 -3516 7970 360 -9231 -867 6603 -963 -5856 -390 4572 -73
833 -73 -4962 759 8801 2335 -5697 3257 10197 -961 -4087 8625 8776 -3820 -2648 6667 3657
848 3657 -3317 -1074 3693 1386 -5256 -6319 1916 2033 -7616 -6606 3524 -1262 -12246 -3797 5372
863 5372 -3103 -9512 -298 3750 -3543 -5766 2081 5584 190 -4507 1450 7407 -67 -4628 6121
878 6121 9215 -3861 -4572 7859 5523 -5468 -814 7074 1127 -5769 -1268 4584 1725 -3733 -2143
893 -2143 4656 1848 -6534 -953 8722 1352 -7000 2247 7494 -2051 -4259 5292 5759 -2579 -3124 2779
909B779J117o057k333O386K082r648j788J0573n62j1499L012J0502o341p982P241
924b518O252o469l765N666M466l751m059M621O148n245o530P724P063r437m432
939d266J0609J163j0688J150R225k302p732P77O004o34o018k8P005n47r802J427
955d657J0735l097j0240O877P706q800n703R579L665p560k035N437J649n542k383
970d369N683M092p541n171P939K903r700K58J0757k969j0588L724P505l274m316
985e067L912M512l173n311K460P868r18p926L698Q017p119p057R984O358r689
1000E49l908Q509k58p851J561O350M64o738l056N572K545p102p67R632j550j1721
1016g769K647J0611m662o795O660M456p298l733N391M352k809m456K277M307m199
$$ plain form
909 2779 3896 -2161 -4494 1892 3974 -5674 -7462 3111 2549 -8950 -5938 4564 -1777 -9759 -2518
924 -2518 3734 -2735 -6500 -834 3632 -119 -4178 443 6591 1346 -5184 2540 9603 166 -4266
939 -4266 6343 7506 -3182 -2032 7193 4891 -2841 -2064 3940 3306 -2712 -2740 4265 3718 -6084 -4657
955 -4657 6078 2981 -7259 -382 7324 -1476 -7179 2400 6065 -1495 -3530 1907 3556 -1986 -4369
970 -4369 1314 5406 -2135 -7306 633 3536 -6164 -5906 4851 1882 -8706 -4982 2523 -751 -5067
985 -5067 -1155 3357 184 -5127 -2667 5201 4283 -3643 55 8072 953 -6104 3880 10238 549
1000 549 -3359 5150 4892 -2959 -1398 4952 5416 -1322 -4378 1194 3739 -3363 -4130 5502 3952 -7769
1016 -7769 -5122 5489 827 -5968 692 5148 -2150 -5883 -492 3860 1051 -3405 -1128 3179 -1020
1031a020o362P651O796r263n498R252J649r644J633R552k801p809K366N240m87
1046A255m008J370N858n11q455J481J0097k756q724O289P675q928n332Q853K983
1061G147p324j489M742Q04m772k597M822L512n908m943P185L533r785j328J0819
1076D418j496j0085M039P782n086m763M165M196k437m748J681N791k173o976L674
1091b018Q054o609p061Q354M539r890k006R733Op842J240N429p26l722J80N032
1107B693K144o248k327Q326J353q598J991R673m961q365N626O319o049l421M688
1122B844J725n290l575L857N172l866o535M548N377q434l435J0406K263j0810
1136e753j44R035k520o104M371N204k757m960P45M641R44n480N02P425l417r292
$$ plain form
1031 -1020 -7382 269 7065 -2198 -7696 1556 3205 -6439 -4806 4746 1945 -5864 -3498 1742 1255
1046 1255 -2753 -1383 4475 3964 -4491 -3010 7087 4331 -4393 1896 9571 643 -4689 4164 7147
1061 7147 -177 -1666 3076 3880 -892 -3489 1333 4845 -1063 -6006 1179 4712 -5073 -6401 4418
1076 4418 2922 -7163 -3124 4658 -428 -5191 -1026 3170 733 -4015 -2334 3457 1284 -5692 -2018
1091 -2018 6036 -573 -7634 720 5259 -4631 -6637 3096 3102 -4740 -3500 1929 1203 -2519 -2339 2693
1107 2693 4837 -1411 -3738 4588 5941 -2657 -666 9007 4046 -4319 1307 7626 1577 -1844 2844
1122 2844 4569 -721 -4296 -439 4733 867 -5668 -1120 4257 -4177 -7612 2794 5057 -5753
1136 -5753 -5897 3138 618 -5486 -1115 4089 1332 -3628 -2883 1758 2702 -2778 -2276 5149 1732 -7560
1152g560M910Q610o127n903P632K229p955j245P075J872m327j827L302K467m193
1167a040k702Q141L885r617k069R649r65q785M396Q002n785p250M405M312l885
1182F92k902K122L457l244o353L007P471m682o495O540M381r025k325R459J013
1197C116p513R50N473j206m266M64N308J778o092k402P437P74q608J622R665m049
1213B451r101N400O523o452l459O297K603n332k598L576L888l208l880M961M615
1228F284o616l918Q121K787q674M16P923k491p315K826N534k714m411R97L998
1243B747r92o053N82P864k572q206L500P174o260n925Q157L968p650k197O462
1258E99P82m607p37N329K011m999k971N880L258o921q51Q782j661q984L274P523
$$ plain form
1152 -7560 -2650 5960 -167 -6070 1562 3791 -4164 -5409 1666 3538 -789 -2616 686 3153 -1040
1167 -1040 -3742 4399 8284 -1333 -3402 6247 5282 -3503 893 8895 3110 -4140 265 4577 692
1182 692 -2210 -88 3369 125 -6228 -3221 4250 -432 -6927 -387 3994 -5031 -7356 2103 3116
1197 3116 -4397 -3447 2026 820 -3446 -2982 2326 4104 -1988 -4390 3047 3821 -4787 -3165 6500 2451
1213 2451 -6650 -1250 5273 -1179 -4638 1659 4262 -1070 -3668 -92 3796 588 -3292 1669 6284
1228 6284 -332 -4250 3871 6658 -2016 -1600 6323 3832 -3483 -657 4877 2163 -2248 -1251 2747
1243 2747 1755 -4298 -3716 4148 1576 -6630 -3130 4044 -2216 -8141 16 3984 -3666 -5863 599
1258 599 1381 -3226 -3963 1366 3377 -1622 -4593 1287 4545 -2376 -3227 5555 3894 -5090 -1816 5707
1274E707l579n369M376L177m231l250K821M455j739n315K058N675m124o039O685
1289A308N850p839m180P907J117o966J068O314r42n365n94M276J290n437o52O312
1305C467p58q340J256Q355l218p641N098N178o719l785O229K831l883k356L109
1320a177K645k810l218M859N165n870m438P769K990q100L9Q538j413p558J944
1335f35N365j719m249J169L999j101n450n1O955j600p836L553O743o042n467P814
1351A448L443p428q83N679L34m098m71L830J811m155k534N017K194o413k205P884
1367C453o81q491K139O830l787n572M094L359l101k935K290L881j838m073K176
1382b256O484l638n457O145N783p336l088Q411R26p587J131O087j723m306M37
$$ plain form
1274 5707 2128 -3241 1135 4312 81 -3169 -348 4107 2368 -2947 -889 4786 662 -5377 1308
1289 1308 7158 -681 -4861 3046 4163 -2803 -1735 4579 3637 -1728 -2322 1954 3244 -2193 -2845 3467
1305 3467 2709 -5631 -4375 3980 762 -6879 -1781 3397 -3322 -7107 -878 1953 -1930 -4286 -1177
1320 -1177 1468 -1342 -4560 299 5464 -406 -4844 2925 5915 -2185 -2146 6392 4979 -2579 -635
1335 -635 4730 3011 -1238 -69 3930 2829 -2621 -2672 4283 2683 -5153 -1600 5143 -899 -6366 1448
1351 1448 4891 -2537 -3420 2259 2593 -1505 -1976 1854 3665 -490 -3024 1993 4187 -2226 -4431 3453
1367 3453 2772 -5719 -3580 3250 -537 -6109 -2015 1344 -1757 -4692 -2402 1479 -359 -4432 -2256
1382 -2256 4228 590 -4867 1278 7061 -275 -3363 5048 5974 -1613 -482 5605 3882 -424 13
1397A3L379J52m459j405N165K23o999P69P390l136p264M661N674n623l090M954
1413D04K131m192j109K997K306k311l838L709M422n064m613P449K349q491o17
1428d468P877j703o847K919M501k974l791K468L107p58l324J97N488j161n914
1443d383L324O874m786m864O252L414o248p07N799l31l990o88K971J112k719k946
1459a916L239L444o457k632P438M0p875J368P256m143n599M352L980l567k726
1474c798K369L025j780l193J891N126l198m895M270M651o356k747P952N03p363
1489c543O08N237j505l690J431K675O0l164j279M442J359n507k1P239k211o562
1505d431L987O521n287l530N340K039m581j225L526J630k619l056K749L494m347
$$ plain form
1397 13 3392 3544 -915 -2320 2845 3068 -3931 -3162 4228 1092 -6172 -1511 4163 -1460 -4550 404
1413 404 2535 -1657 -2766 231 2537 226 -3612 97 4519 -545 -5158 2291 4640 -3851 -4468
1428 -4468 3409 1706 -5141 -2222 2279 -695 -4486 -2018 1089 331 -2993 -2796 2692 1531 -4383
1443 -4383 -1059 5815 1029 -3835 2417 5831 -417 -1124 4675 4344 354 -334 2637 3749 1030 -1916
1459 -1916 1323 4767 -1690 -4322 3116 3156 -4719 -3351 3905 -238 -5837 -1485 2495 -1072 -3798
1474 -3798 -1429 1596 -184 -3377 -1486 3640 442 -4453 -183 4468 -1888 -4635 3317 3820 -3543
1489 -3543 -2935 2302 797 -2893 -1462 1213 1273 -1891 -3170 1272 2631 -2876 -2897 4342 2131 -4431
1505 -4431 -444 6077 790 -2740 2600 4639 58 -1167 2359 3989 1370 -1686 1063 4557 210
1520B10l787N809K361p689j232P163j191o577K834M762l569l297J918K754p23
1535b54k845M87M028o78n327K611N908l382m978M892L699n812j424N512P81m388
1551a170j08K828M93k710j959L987K323n038k162O478L70p003K006O834l629n506
1567c966M524L617l723k237L588J785k466k690K293L280k305m627L384M176n666
1582a033l093O173J304o607k84N416j429m432J403K851j21k993j064M281Q49n055
1598c834L76O517j823o558M134N520m492l504N118K306m708j079L849R15k588
1613A49j827K755K126k696l547N114K318o357r25O533p71n972J726M956k421l398
1629b237J912K916r79k913L59L543n64m676J309N587l496n241M681M096o408k005
$$ plain form
1520 210 -3577 2232 4593 -3096 -4328 2835 1644 -4933 -2099 2663 -906 -4203 -2285 469 -254
1535 -254 -3099 -2612 1416 738 -4589 -1978 3930 548 -4430 462 4161 -1651 -3075 2437 3218 -1170
1551 -1170 -1278 1550 2043 -667 -2626 1361 3684 -1354 -3516 2962 3332 -3671 -1665 5169 1540 -3966
1567 -3966 558 4175 452 -1785 1803 3588 1122 -1568 725 4005 1700 -2927 457 4633 -1033
1582 -1033 -4126 2047 3351 -3256 -3540 1876 447 -3985 -2582 269 148 -2845 -3909 372 1221 -3834
1598 -3834 -3458 3059 1236 -5322 -1188 4332 -160 -3664 1454 3760 -948 -2027 1822 2737 149
1613 149 -1678 1077 3203 507 -3040 2074 4392 -1965 -2890 3643 2872 -3100 -1374 3582 1161 -2237
1629 -2237 -325 2591 1612 -1301 -942 2601 2037 -2639 -1330 4257 761 -4480 201 4297 -2111 -4116
1645d116N686O7m734k06L758L47k753j426L171J549m042j013N618L23o057J173
1661b655N817k278m607L734L838l375k048K497J693j515j757J168L040j860m771
1676c079L519M427m441l426N815J086o330r3N659p25m304J363K333q03k678oL691
1693B008O16m914k91N499j503n615L333N297n005m245M561K296l750q06L090K33
1709H04k511j657K384K952k686l029L889K312n227j194O782J4n608J592M277k345
1725G49l157K752L000j212k993L7L946n29m028J767M606l436n370M507L864n365
1741h62j524M997j40m784L27L401K21k173j307K499J257l569j497N269Q91o106
1757c100K42N951k675m888L807L941l926l093K894J757j373k191J707L007k146
$$ plain form
1645 -4116 1570 1637 -3097 -3303 455 802 -1951 -3377 -206 1343 -2699 -3712 1906 2229 -3828 -2655
1661 -2655 3162 884 -3723 11 3849 474 -1574 923 2616 1101 -656 512 3552 1692 -3079
1676 -3079 440 4867 426 -3000 2815 3901 -2429 -2522 3137 2412 -1892 -529 1804 1001 -1677 -1683 2008
1693 2008 2624 -2290 -2581 2918 1415 -4200 -867 4430 -575 -4820 -259 2037 -1713 -2519 571 804
1709 804 -1707 -3364 -980 1972 -714 -3743 146 2458 -2769 -3963 2819 2833 -2775 -1183 3094 749
1725 749 -2408 344 3344 2132 -861 -824 3122 2593 -1435 332 4938 1502 -3868 639 4503 -862
1741 -862 -2386 2611 2471 -2313 -1986 1415 1636 -537 -1844 655 1912 -1657 -3154 2115 3006 -3100
1757 -3100 -2858 3093 418 -4470 -663 3278 -648 -3741 -847 910 -463 -2654 -947 2060 -86
1772h6l806K688M307l640l307N658J687n961J04N398o70l794J130L101j040k584
1788h15L27K957P16l940o43M814r35n681K713M903l943m192M870J900m318r84
1804b251L464M74k678j304K109K249k242k988L361K638n258j554O335j75o236
1819d056J769M853k805l420K774K452j938k071P89K446k50l286J159M368k002
1834G82m814M228M021m936k192N224Q31m473N83L374j90k449r37K742J262k918
1850A38j764L987J073n755M7O127k116n250L017L698l757k815L595J815k765j642
1866b367J590J891j679k321K315L503l744l665N044K346n340o67N502j192m309
1881c093J149L432j045k078j54K670M55l307l13M458r7m860J367N262l061m291
$$ plain form
1772 -86 -3892 -1204 3103 -537 -3844 1814 3501 -2460 -2356 3042 2372 -1422 -292 2809 1769 -815
1788 -815 -488 2469 3185 -755 -1398 3416 2481 -3200 -487 4416 473 -3719 1151 3051 -1267 -2251
1804 -2251 1213 1687 -991 -2295 -186 2063 -179 -3167 194 2832 -2426 -3980 2355 2180 -4056
1819 -4056 -2287 2566 -239 -3659 -885 1567 -371 -2442 -1653 793 543 -2743 -1584 2784 782
1834 782 -4032 196 4217 -719 -2911 2313 3144 -1329 -746 2628 2438 -11 -948 1794 3056 138
1850 138 -1626 2361 3434 -2321 -2274 3853 1737 -3513 -496 3202 -555 -3370 225 2040 -725 -2367
1866 -2367 -777 1114 -565 -2886 -571 2932 -812 -4477 567 2913 -2427 -3094 2408 1216 -3093
1881 -3093 -1944 1488 443 -1635 -1789 881 1336 -1971 -2284 2174 2077 -2783 -1416 3846 785 -3506
1897c506M726L130m725j624L774J132k922p09K241J901k594l211L602K479m198
1912e04j743N165k02n680J000M988j985l835J949K378j971k157R49K746k96l388
1928b586L12L977j709m315L486M264m253l345M753J610m546K99L630J0l278l71
1944b062K681J071k384j248L643P23m813J25N434r86n123K634L951l464k389L235
1960A028K072k487j398J465J856j427k317K138K874k878l576L960K293n186j009
1975b592N151n38m880N86L653r60k876P99K410l27l387k07M469p49m048J535M306
$$ plain form
1897 -3506 1220 4350 -375 -1999 1775 2907 -15 -724 1517 3418 824 -2387 1215 3694 -504
1912 -504 -2247 2918 2716 -2964 -1964 3024 1039 -2796 -847 1531 -440 -2597 -1648 1098 802 -2586
1928 -2586 -2274 1703 -6 -4321 -835 3429 -824 -4169 584 2194 -2352 -2053 1577 1587 -1691 -2062
1944 -2062 619 1690 -694 -1942 1701 2424 -2389 -2264 3170 2184 -2939 -305 3646 182 -2207 1028
1960 1028 3100 613 -785 680 2536 1109 -1208 930 3804 926 -2650 1310 3603 -1583 -2592
1975 -2592 2559 2021 -2859 -2273 1380 420 -2456 -1657 753 426 -2961 -3168 1301 552 -3496 -1961 2345
$$ [...]
8191b8
##END NTUPLES=NMR FID
##END=
