##TITLE=1H_BAU-DIT18
 CDCl3, 8 sc, 
 24.6.2019
##JCAMPDX= 6.0         $$ Bruker NMR JCAMP-DX V2.0
##DATA TYPE= NMR FID
##DATA CLASS= NTUPLES
##ORIGIN= UXNMR, Bruker Analytische Messtechnik GmbH
##OWNER= root
$$ XWIN-NMR		Version 3.5
$$ Mon Jun 24 13:57:58 2019 Russian Standard Time (UT+4h)  she@DPX200
##.OBSERVE FREQUENCY= 200.13155
##.OBSERVE NUCLEUS= ^1H
##.DELAY= (6, 6)
##.ACQUISITION MODE= SIMULTANEOUS
##.ACQUISITION SCHEME= undefined
##.AVERAGES= 8
##.DIGITISER RES= 18
##SPECTROMETER/DATA SYSTEM= spect
##.PULSE SEQUENCE= zg30
##.SOLVENT NAME= CDCl3
##.SHIFT REFERENCE= (INTERNAL, CDCl3, 0, 15.7039)
##AUDIT TRAIL= $$ (NUMBER, WHEN, WHO, WHERE, WHAT)
$$ ##TITLE= Audit trail, XWIN-NMR		Version 3.5
$$ ##JCAMPDX= 5.01
$$ ##ORIGIN= Bruker BioSpin GmbH
$$ ##OWNER= she
$$ F:/spectra/data/she/nmr/H-F/1/audita.txt
$$ ##AUDIT TRAIL=  $$ (NUMBER, WHEN, WHO, WHERE, WHAT)
(   1,<2019-06-24 13:56:14.70 +0400>,<she>,<DPX200>,
      <created by zg, POWCHK disabled, PULCHK disabled
       configuration hash MD5:
       00 E9 B6 7A A2 85 ED C7 34 08 36 98 17 FE 4E 26
       data hash MD5: 16K
       63 74 7D A4 B6 9F 17 94 3D 7A F5 5D 43 90 CD 85>)
$$ ##END=
$$ 
$$ hash MD5
$$ 4E 28 05 81 1C 86 0C BC 1E 7E 57 C6 BB C8 F1 09
##$RELAX= 
##$RELAX= 
##$RELAX= 
##$RELAX= 
##$RELAX= 
##$RELAX= 
$$ Bruker specific parameters
$$ --------------------------
##$DU= <F:/spectra>
##$EXPNO= 1
##$NAME= <H-F>
##$PROCNO= 1
##$TYPE= <nmr>
##$USER= <she>
##$AMP= (0..31)
100 100 100 100 100 100 100 100 100 100 100 100 100 100 100 100 100 100 
100 100 100 100 100 100 100 100 100 100 100 100 100 100 
##$AQSEQ= 0
##$AQ_mod= 1
##$AUNM= <au_zg>
##$AUTOPOS= <>
##$BF1= 200.13
##$BF2= 200.13
##$BF3= 200.13
##$BF4= 200.13
##$BF5= 200.13
##$BF6= 200.13
##$BF7= 200.13
##$BF8= 200.13
##$BYTORDA= 1
##$CFDGTYP= 0
##$CFRGTYP= 5
##$CHEMSTR= <none>
##$CNST= (0..31)
1 1 145 1 1 1 1 1 1 1 1 1 1 1 1 1 1 1 1 1 1 1 1 1 1 1 1 1 1 1 1 1 
##$CPDPRG= <>
##$CPDPRG1= <>
##$CPDPRG2= <>
##$CPDPRG3= <>
##$CPDPRG4= <mlev>
##$CPDPRG5= <mlev>
##$CPDPRG6= <mlev>
##$CPDPRG7= <mlev>
##$CPDPRG8= <mlev>
##$CPDPRGB= <>
##$CPDPRGT= <>
##$D= (0..31)
0 1.2 0 0 0 0 0 0 0 0 0 0.03 0 0 0 0 0 0 0 0 0 0 0 0 0 0 0 0 0 0 0 0 
##$DATE= 1561370174
##$DBL= (0..7)
120 120 120 120 120 120 120 120 
##$DBP= (0..7)
150 150 150 150 150 150 150 150 
##$DBP07= 0
##$DBPNAM0= <>
##$DBPNAM1= <>
##$DBPNAM2= <>
##$DBPNAM3= <>
##$DBPNAM4= <>
##$DBPNAM5= <>
##$DBPNAM6= <>
##$DBPNAM7= <>
##$DBPOAL= (0..7)
0.5 0.5 0.5 0.5 0.5 0.5 0.5 0.5 
##$DBPOFFS= (0..7)
0 0 0 0 0 0 0 0 
##$DE= 6
##$DECBNUC= <off>
##$DECIM= 16
##$DECNUC= <off>
##$DECSTAT= 4
##$DIGMOD= 1
##$DIGTYP= 9
##$DL= (0..7)
0 120 120 120 120 120 120 120 
##$DP= (0..7)
150 150 150 150 150 150 150 150 
##$DP07= 0
##$DPNAME0= <>
##$DPNAME1= <>
##$DPNAME2= <>
##$DPNAME3= <>
##$DPNAME4= <>
##$DPNAME5= <>
##$DPNAME6= <>
##$DPNAME7= <>
##$DPOAL= (0..7)
0.5 0.5 0.5 0.5 0.5 0.5 0.5 0.5 
##$DPOFFS= (0..7)
0 0 0 0 0 0 0 0 
##$DQDMODE= 0
##$DR= 18
##$DS= 0
##$DSLIST= <SSSSSSSSSSSSSSS>
##$DSPFIRM= 0
$$ [...]
##$SUBNAM2= <"">
##$SUBNAM3= <"">
##$SUBNAM4= <"">
##$SUBNAM5= <"">
##$SUBNAM6= <"">
##$SUBNAM7= <"">
##$SUBNAM8= <"">
##$SUBNAM9= <"">
##$SW= 44.9344731272789
##$SWIBOX= (0..15)
0 0 2 0 0 0 0 0 0 0 0 0 0 0 0 0 
##$SW_h= 8992.80575539568
##$TD= 16384
##$TD0= 1
##$TE= 0
##$TE2= 300
##$TE3= 300
##$TEG= 300
##$TL= (0..7)
0 120 120 120 120 120 120 120 
##$TP= (0..7)
150 150 150 150 150 150 150 150 
##$TP07= 0
##$TPNAME0= <>
##$TPNAME1= <>
##$TPNAME2= <>
##$TPNAME3= <>
##$TPNAME4= <>
##$TPNAME5= <>
##$TPNAME6= <>
##$TPNAME7= <>
##$TPOAL= (0..7)
0.5 0.5 0.5 0.5 0.5 0.5 0.5 0.5 
##$TPOFFS= (0..7)
0 0 0 0 0 0 0 0 
##$TUNHIN= 0
##$TUNHOUT= 0
##$TUNXOUT= 0
##$USERA1= <user>
##$USERA2= <user>
##$USERA3= <user>
##$USERA4= <user>
##$USERA5= <user>
##$V9= 5
##$VALIST= <valist>
##$VCLIST= <CCCCCCCCCCCCCCC>
##$VD= 0
##$VDLIST= <DDDDDDDDDDDDDDD>
##$VPLIST= <PPPPPPPPPPPPPPP>
##$VTLIST= <TTTTTTTTTTTTTTT>
##$WBST= 1024
##$WBSW= 4
##$XGAIN= (0..3)
0 0 0 0 
##$XL= 0
##$YL= 0
##$YMAX_a= 384813
##$YMIN_a= -320147
##$ZGOPTNS= <>
##$ZL1= 120
##$ZL2= 120
##$ZL3= 120
##$ZL4= 120
##$ABSF1= 10
##$ABSF2= 0
##$ABSG= 5
##$ABSL= 3
##$ALPHA= 0
##$AQORDER= 0
##$ASSFAC= 0
##$ASSFACI= 0
##$ASSFACX= 0
##$ASSWID= 0
##$AUNMP= <proc_1d>
##$AZFE= 0.1
##$AZFW= 0.1
##$BCFW= 1
##$BC_mod= 2
##$BYTORDP= 1
##$COROFFS= 0
##$CY= 11.3945322036743
##$DATMOD= 1
##$DC= 2
##$DFILT= <>
##$DTYPP= 0
##$F1P= 18.9103706918063
##$F2P= -1.10871071338519
##$FCOR= 0.5
##$FTSIZE= 0
##$FT_mod= 4
##$GAMMA= 1
##$GB= 0.15
##$INTBC= 1
##$INTSCL= 1
##$ISEN= 128
##$LB= 0.24
##$LEV0= 0
##$LPBIN= 0
##$MAXI= 10000
##$MC2= 0
##$MEAN= 0
##$ME_mod= 0
##$MI= 1.114404
##$NCOEF= 0
##$NC_proc= 0
##$NLEV= 6
##$NOISF1= 3.799351
##$NOISF2= 2.8
##$NSP= 1
##$NTH_PI= 0
##$NZP= 0
##$OFFSET= 15.70392
##$PC= 1
##$PHC0= -8504.24
##$PHC1= 25.60097
##$PH_mod= 1
##$PKNL= yes
##$PPARMOD= 0
##$PSCAL= 0
##$PSIGN= 0
##$REVERSE= no
##$SF= 200.130013532006
##$SI= 16384
##$SIGF1= 3
##$SIGF2= 2
##$SINO= 400
##$SIOLD= 16384
##$SREGLST= <1H.CDCl3>
##$SSB= 0
##$STSI= 0
##$STSR= 0
##$SW_p= 3612.71676300578
##$SYMM= 0
##$S_DEV= 0
##$TDeff= 0
##$TDoff= 0
##$TI= <>
##$TILT= no
##$TM1= 0
##$TM2= 0
##$TOPLEV= 0
##$USERP1= <user>
##$USERP2= <user>
##$USERP3= <user>
##$USERP4= <user>
##$USERP5= <user>
##$WDW= 1
##$XDIM= 8192
##$YMAX_p= 0
##$YMIN_p= 0
$$ End of Bruker specific parameters
$$ ---------------------------------
##NTUPLES= NMR FID
##VAR_NAME=  TIME,          FID/REAL,        FID/IMAG
##SYMBOL=    X,             R,               I
##VAR_TYPE=  INDEPENDENT,   DEPENDENT,       DEPENDENT
##VAR_FORM=  AFFN,          ASDF,            ASDF
##VAR_DIM=   8192,          8192,            8192
##UNITS=     SECONDS,       ARBITRARY UNITS, ARBITRARY UNITS
##FACTOR=    0.0001112,     1,               1
##FIRST=     0,             0,               0
##LAST=      0.9108392,     0,               0
##MIN=       0,             -320147,         0
##MAX=       0.9108392,     384813,          0
$$ Real data points
##PAGE= N=1
##DATA TABLE= (X++(R..R)), XYDATA
0 0 0 0 0 0 0 0 0 0 0 0 0 0 0 0 -8 8 -8 8 -8 10 -16 16 -24 24 -32 32 -40 48 -56 64 -72 80 -90 103 -116 130
36 130 -145 165 -183 204 -228 252 -280 312 -344 378 -418 460 -508 560 -617 680 -749 827 -914
55 -914 1012 -1124 1254 -1404 1580 -1793 2056 -2390 2824 -3423 4296 -5685 8155 -12413 236925
70 236925 384813 209813 -63417 -273680 -244134 -46892 161653 194239 48363 -152695
80 -152695 -218291 -91330 141079 285678 228869 685 -225421 -291692 -155939 64246 207111
91 207111 178240 29917 -105389 -117100 -13004 104952 123817 22513 -119340 -183707 -116279
102 -116279 35754 159832 171454 72755 -53732 -117814 -88180 -9405 45459 36325 -15410
113 -15410 -53580 -38163 20813 76087 83829 38707 -26556 -70356 -73140 -45108 -9347 18699
125 18699 37552 49592 50474 31741 -5515 -43257 -56203 -34023 5780 29860 17709 -16946
137 -16946 -35341 -8602 51092 93684 71170 -17099 -114287 -145184 -77281 47467 139728 131244
149 131244 30440 -82042 -117278 -50952 55423 105516 50030 -68229 -146205 -106516 33308
160 33308 168149 187007 64866 -111333 -208430 -151805 13498 157211 168435 44408 -107765
171 -107765 -159359 -66867 91454 179766 117055 -52989 -195217 -191548 -38119 149402 226764
182 226764 135594 -50666 -186806 -171533 -25907 127420 165516 63697 -88130 -161840 -96660
193 -96660 53113 164448 146502 13355 -129425 -171354 -84158 58761 145166 113809 -176
204 -176 -99562 -106338 -23274 73907 102223 39931 -58437 -110614 -74325 19728 96312 97778 28414
217 28414 -53306 -85019 -49484 16152 56005 41650 -7829 -46450 -41898 -20 43366 54242
229 54242 26693 -16152 -44274 -43563 -21765 2960 18859 25302 26087 21040 6942 -14635 -32185
242 -32185 -31305 -8915 19623 30217 11695 -21474 -37886 -16336 32026 67360 52923 -11061
254 -11061 -80882 -100222 -46460 46021 108999 92370 6940 -81313 -102437 -39543 55336 102455
266 102455 59649 -40211 -114089 -96193 5541 112278 136789 54666 -72600 -145357 -105639
277 -105639 15141 120231 125798 28999 -89415 -131230 -61300 63025 138471 100923 -21670
288 -21670 -130840 -137771 -35503 94811 149744 86598 -42186 -132691 -113720 -3242 107134
299 107134 127908 43431 -76094 -133311 -82493 34467 123385 114233 16747 -89749 -121440
310 -121440 -56943 48051 108679 79095 -12029 -88397 -89027 -16842 66788 94007 45163 -37914
322 -37914 -88226 -68172 2413 65820 74028 25822 -36493 -63805 -39360 11597 46258 39507
334 39507 1848 -33299 -38722 -13633 18982 33896 22893 -2073 -21699 -24943 -14449 -118
346 -118 10549 15724 15943 10526 -1547 -16639 -24815 -17081 5144 27023 29842 7609 -24405 -39522
360 -39522 -21215 19753 50894 43009 -3414 -54421 -67563 -27139 39355 80239 60335 -8010
372 -8010 -72380 -80450 -23775 53430 88096 50049 -31427 -90046 -75499 3233 83833 99617
384 99617 34893 -60446 -110150 -73051 22231 99762 97238 16884 -75977 -105900 -48559 49010
396 49010 106857 77097 -16533 -98379 -101606 -22961 74746 113624 63095 -35644 -103653 -87769
408 -87769 -2845 81523 97903 34828 -54839 -98177 -60850 25836 91680 84329 10669 -69916
420 -69916 -94362 -45578 35550 84891 66011 -2152 -63562 -70627 -21514 41274 67217 37714
432 37714 -20941 -61260 -52735 -4641 44126 56928 27363 -19134 -47078 -38733 -4945 26611
444 26611 33906 15679 -10801 -25475 -19947 -1205 16177 20989 12079 -3717 -16975 -20756 -13161
457 -13161 2159 17751 24505 16695 -2955 -22789 -28528 -13867 12656 31749 27277 79 -30009
470 -30009 -38350 -15042 24003 48271 35666 -7530 -49112 -54822 -17235 36594 64214 41967
482 41967 -14552 -61068 -59209 -8788 50603 70292 32344 -34108 -75487 -56420 9866 71106
494 71106 77362 21799 -52333 -85952 -51486 24112 80527 72566 6653 -63997 -82452 -33712
506 -33712 42683 85003 58683 -15263 -77405 -77974 -16286 58351 86835 47193 -28410 -79898
518 -79898 -67359 -2548 61912 75150 28209 -39575 -73633 -47663 15871 65358 61747 9291
530 9291 -49413 -68102 -33748 24868 61421 48839 -210 -45759 -53129 -19334 26526 48171
542 48171 30653 -9736 -40299 -38338 -7593 26743 38912 21916 -9497 -31494 -29648 -7888
554 -7888 16438 26664 17680 -1962 -18050 -20602 -9333 7268 18460 17446 4853 -11563 -21539
567 -21539 -17966 -1820 17291 26532 17994 -4099 -25021 -29168 -11629 16030 33162 25357 -3195
580 -3195 -31380 -36008 -11319 25135 44715 29750 -10512 -45429 -46417 -10460 35671 55640 32380
593 32380 -17037 -53668 -47418 -2503 45649 57538 22290 -32467 -62449 -42072 13660 60493
605 60493 60256 11842 -46800 -69002 -36658 24755 66334 54901 -95 -54516 -64679 -22459
617 -22459 37813 67718 42931 -16468 -62954 -59392 -8781 48421 67038 32735 -26478 -63635
629 -63635 -50040 2168 50823 57738 18865 -33599 -57760 -35544 13804 50377 45997 5770
641 5770 -37360 -49503 -22886 19746 44565 33456 -2652 -34325 -37682 -12140 20547 35039
653 35039 21778 -6889 -28215 -27076 -6335 16932 25731 15272 -4931 -19750 -19612 -6246 9686
666 9686 17648 13278 584 -11750 -16122 -10062 2480 13769 16447 8138 -6560 -18141 -17901 -4488
680 -4488 13754 23855 17021 -3323 -23070 -26608 -9538 16582 31774 23085 -4568 -30313 -33240
693 -33240 -9099 24246 40295 24908 -11525 -40535 -38128 -4562 34493 47742 23228 -20516
705 -20516 -48940 -38542 3067 43116 49097 15536 -30944 -52920 -32002 15255 50990 45756
717 45756 3252 -42710 -55004 -23233 27516 56741 40833 -7595 -50096 -52782 -13696 35693
729 35693 56165 31522 -17998 -52757 -45020 -1530 42782 52580 20301 -27844 -53677 -37057
741 -37057 8174 45931 46973 11512 -31545 -48587 -27389 13826 42230 36396 2557 -31534
753 -31534 -39519 -16590 17849 36732 26514 -3281 -28884 -31410 -10630 16218 29032 19555 -3196
766 -3196 -21608 -22927 -7934 11099 20493 14608 -966 -14668 -17630 -8564 5602 15566 14991 4635
780 4635 -8749 -16567 -13481 -1127 12645 18490 11557 -4182 -18047 -19431 -5990 13510 24687
793 24687 17808 -3524 -23944 -27230 -9179 17800 33130 23666 -4769 -30835 -33617 -9604 23319
806 23319 39185 24355 -10541 -38162 -35762 -4146 32176 44125 21001 -19646 -45792 -35955
818 -35955 2638 39690 45729 15428 -27218 -48266 -30887 11183 44092 41546 5331 -35422
830 -35422 -47963 -22108 21534 48104 36182 -4699 -41920 -46069 -13848 28784 48097 28961
842 28961 -12810 -43786 -39550 -4129 33760 43978 18834 -20869 -43470 -31203 5413 36972
854 36972 38742 10096 -25591 -40353 -23526 10652 35013 31247 3690 -25064 -32922 -15081 13098
867 13098 29469 22046 -1840 -23015 -25593 -8657 13662 24542 16600 -2883 -18832 -20189 -7190
880 -7190 9544 17977 13019 -448 -12227 -14378 -6348 5580 12926 11134 1732 -8745 -13419 -9043
894 -9043 1747 12019 14986 8051 -4793 -15042 -15198 -4228 10641 18691 13019 -2984 -17627
907 -17627 -19194 -4985 14787 24774 15676 -6887 -26048 -26019 -5304 20985 32515 19119 -9503
920 -9503 -31303 -28784 -3156 25434 34068 15007 -16989 -36372 -26801 4977 34116 37089 10682
933 10682 -24920 -41800 -26380 9355 37463 35814 5835 -28414 -39625 -18919 16918 39152
945 39152 29594 -4187 -35404 -39054 -11962 24499 41699 26367 -9066 -36679 -35123 -6416 26000
958 26000 36674 17759 -14784 -34856 -26770 2516 29371 32887 10823 -19041 -33641 -22383
970 -22383 4968 27056 27498 7412 -16626 -26405 -15346 6655 22226 19902 2517 -16049 -21942
983 -21942 -11342 7058 19600 17690 3586 -11850 -17925 -11192 2610 13390 14026 4825 -7009
996 -7009 -13147 -9567 944 10986 13429 6403 -5426 -14073 -13174 -2812 10258 16882 11935 -1668
1010 -1668 -14483 -16931 -6646 9227 18621 13861 -2209 -17348 -19340 -5567 13932 23866 15428
1023 15428 -5833 -23849 -24064 -5342 18243 28309 16401 -8527 -27142 -24316 -2013 22166
1035 22166 28893 12213 -14900 -30921 -22476 4112 28111 30349 8521 -20377 -33725 -20884
1047 -20884 8114 30384 28411 3755 -23659 -32181 -14879 14222 31862 23870 -3531 -28463
1059 -28463 -31105 -9357 19531 32881 20340 -7778 -29135 -27297 -4300 21183 29065 13571
1071 13571 -12173 -27722 -20977 2207 23297 25887 8515 -14916 -26332 -17471 4044 21401
1083 21401 21812 5985 -13152 -21047 -12370 5288 18007 16436 2444 -12919 -18094 -9573 5725
1096 5725 16476 15300 3420 -9986 -15563 -9962 2110 11839 12669 4652 -6100 -11829 -8697 859
1110 859 9993 12145 5617 -5284 -12990 -11751 -2013 9770 15325 10203 -2408 -13560 -14987 -5062
1124 -5062 9049 16620 11369 -3133 -15975 -16606 -3781 13058 20801 12479 -6250 -21104 -20273 -3732
1138 -3732 16083 23726 12914 -8138 -23059 -19785 -624 19253 23973 9287 -13595 -26397 -18673
1151 -18673 4034 24108 25549 6934 -17358 -28318 -17222 7173 25654 23491 2553 -20559
1163 -20559 -27262 -12159 12762 27644 20473 -3047 -24328 -26582 -8061 16457 27675 17018
1175 17018 -6633 -24467 -22624 -3036 18392 24796 11417 -10528 -23830 -18190 1490 19546
1187 19546 22119 7736 -11940 -21707 -14461 3508 17948 18148 4667 -11586 -18275 -10578 4739
1200 4739 15977 14880 2827 -10494 -15338 -8586 4075 13104 12135 2554 -8019 -12180 -7260 2627
1214 2627 10274 10478 3379 -5738 -10709 -8160 -31 8108 10793 6177 -2844 -10014 -10187 -2959 6737
1229 6737 11904 8235 -1992 -11469 -12714 -4066 8392 15264 10652 -2679 -14716 -16101 -5036 10269
1243 10269 18030 11692 -4099 -17048 -16815 -3036 13603 19867 10132 -8222 -20910 -17533 -153
1256 -153 17870 22297 9249 -11265 -23213 -17052 2410 19850 21362 5625 -14883 -23699 -13462
1269 -13462 7764 23232 20191 1007 -19331 -24769 -10864 11322 24323 18145 -2118 -20104
1281 -20104 -21762 -6092 14003 22555 12730 -7133 -21203 -18355 -1037 16917 21685 9755 -9112
1294 -9112 -20309 -15609 676 15542 17744 6286 -9144 -16555 -10433 3660 14653 14052 2740
1307 2740 -10277 -15189 -8586 4028 13194 12439 3061 -7534 -11665 -7070 2144 8886 8562 2044 -5436
1322 -5436 -8502 -5143 1842 7543 8136 3251 -3978 -8734 -7885 -1982 5367 9285 7043 -92 -7299
1337 -7299 -9340 -4474 3909 9505 7722 -667 -9407 -11391 -4254 7103 13946 10412 -1596 -13300
1351 -13300 -15490 -6099 8119 16193 11667 -2142 -14370 -15178 -3636 11187 17268 9189 -7078
1364 -7078 -18724 -15994 -417 16157 20618 9145 -9621 -21034 -16089 1259 17313 19174 5423
1377 5423 -12858 -20800 -11667 7299 20865 17947 460 -17762 -22400 -9561 10470 22172 16450
1390 16450 -1735 -17789 -19143 -5163 12522 19626 10761 -6708 -18721 -15651 -25 15676 19337
1403 19337 8183 -8626 -18217 -13522 1098 13937 15398 4939 -8504 -14327 -8267 4266 13201
1416 13201 11603 963 -10088 -13241 -6381 4728 11831 10059 1521 -7044 -9496 -4882 2553 7045
1430 7045 5714 307 -4848 -5975 -2742 2352 5744 5409 1683 -3187 -6260 -5770 -1923 3301 6604
1445 6604 5846 1116 -4514 -7171 -4649 1571 6799 6681 811 -6658 -9628 -5016 4396 11435 10204
1460 10204 798 -10190 -14120 -7493 4941 13759 11832 355 -11634 -14433 -5418 8552 16070
1473 16070 10544 -4274 -16821 -16589 -3189 13350 19940 10959 -6652 -19130 -16466 -708 15515
1486 15515 19042 6815 -11226 -20338 -12799 5566 20126 18913 2639 -15828 -21969 -10816 8539
1499 8539 20826 16437 -650 -16508 -18444 -5169 12240 19572 10961 -6513 -18930 -16162 -714
1512 -714 15268 19262 8519 -8107 -17551 -12868 1499 13688 14211 3296 -9757 -14247 -6823 6102
1526 6102 14088 10846 -684 -11287 -12931 -4910 5955 11314 7840 -888 -7610 -7515 -1565 4764 6408
1541 6408 2736 -2955 -5954 -4399 124 4121 4924 2810 -483 -2969 -3605 -2786 -1017 1121 2741 3045
1557 3045 1469 -1334 -3565 -3252 -227 3482 4519 1472 -3860 -7171 -5123 1626 8133 9062 2836
1572 2836 -6261 -11326 -7815 1895 10328 10572 1946 -8721 -12606 -5883 6351 14315 10791 -2061
1586 -2061 -14292 -15777 -4634 10646 18019 11200 -4554 -16653 -15201 -1275 13945 17818 6945
1599 6945 -10061 -19229 -12723 4573 18856 18525 3498 -14291 -20844 -10829 7560 19698 15881
1612 15881 -406 -15964 -18199 -5329 12007 19790 11523 -6051 -18881 -16736 -1355 14900 19346
1625 19346 8720 -8102 -17923 -13140 1827 14546 15121 3387 -10644 -15645 -7945 5982 14914
1638 14914 11918 -208 -11586 -13588 -5201 6341 12050 8050 -1670 -9004 -8680 -1689 5785 8010
1652 8010 3738 -3003 -6957 -5491 -320 4241 5308 2710 -1112 -3462 -3392 -1608 416 1698 2039 1517
1668 1517 219 -1566 -2779 -2335 96 2973 4146 1903 -2590 -6004 -5183 53 6111 8007 3676
1683 3676 -4132 -9410 -7472 695 8854 10196 3137 -7063 -12057 -7238 4054 12836 11580 722
1697 722 -11346 -14726 -6243 7634 15850 11410 -2303 -14306 -14793 -3002 11577 17027 8652 -6905
1711 -6905 -17173 -13603 1195 15324 17442 5594 -10589 -18247 -11148 4928 17050 15374 1299
1724 1299 -13704 -17573 -7068 9136 18131 12525 -2981 -15861 -15935 -3227 11809 17095 8595 -6551
1738 -6551 -15955 -12299 1140 13344 14506 3940 -9430 -14973 -8423 4425 13183 11060 404
1751 404 -10005 -11922 -4427 5979 10851 6739 -2444 -9167 -8307 -1077 6313 8184 3627 -3295 -6976
1766 -6976 -5213 118 4396 4649 1455 -2264 -3593 -2107 417 1868 1546 392 -548 -734 -751 -993 -1033
1783 -1033 -139 1608 2892 2134 -839 -3975 -4557 -1357 3626 6263 3978 -1979 -6974 -6405 -237 6904
1799 6904 8900 3486 -5407 -10532 -7157 2578 10999 10964 1947 -8984 -12912 -6325 5823 13553 10418
1814 10418 -1443 -12419 -13352 -3160 10137 15707 8622 -5509 -15539 -13047 1 13293 15948
1827 15948 5827 -8971 -16455 -10446 4138 15488 14333 1487 -12680 -16664 -7145 8107 16896
1840 16896 12067 -2294 -14616 -14988 -3330 10641 15731 7927 -6067 -14966 -11543 1035 12484
1853 12484 13622 3798 -8741 -14012 -8043 3805 12031 10216 402 -9144 -10983 -4076 5549 10062
1867 10062 6303 -2290 -8547 -7840 -1211 5729 7571 3463 -2901 -6419 -4657 325 4240 4317 1066
1882 1066 -2485 -3556 -1817 748 2131 1624 194 -681 -640 -334 -489 -868 -505 846 2310 2202 -17
1899 -17 -2874 -3844 -1485 2719 5291 3675 -1361 -5886 -5780 -500 5894 8065 3622 -4206 -9136 -6648
1915 -6648 1596 9175 9555 2165 -7337 -11085 -5618 4804 11871 9420 -829 -10718 -12134 -3524 8289
1930 8289 13734 8182 -4111 -13198 -11652 -536 11236 14021 5388 -7721 -14736 -9778 3247 13795
1944 13795 13228 1914 -10977 -15054 -7020 6610 14737 10800 -1811 -12934 -13434 -3098 9531
1957 9531 14236 7269 -5482 -13756 -10883 454 11086 12454 3852 -7546 -12520 -7433 3290 10807
1971 10807 9315 376 -8507 -10319 -3935 5131 9645 6360 -1760 -7996 -7639 -1429 5289 7269 3419
1986 3419 -2725 -6125 -4450 461 4434 4448 1106 -2668 -3823 -1954 1068 2623 1896 122 -1157 -1022
2002 -1022 -272 98 -118 -330 387 1419 1697 272 -1890 -2878 -1386 1921 4144 3134 -793 -4541 -4689
2019 -4689 -692 4600 6585 3222 -3137 -7441 -5677 1109 7462 8157 2182 -5870 -9400 -5179 3597
2034 3597 9863 8283 -268 -8884 -10565 -3458 6770 11885 7442 -3242 -11514 -10623 -1048 9582
2048 9582 12487 5235 -6433 -13098 -9042 2348 11944 11793 2005 -9560 -13552 -6596 5578 13125
2062 13125 9868 -1356 -11507 -12287 -3211 8216 12764 6842 -4526 -12109 -9883 132 9652 11165
2076 11165 3636 -6643 -11264 -6785 2827 9821 8663 636 -7533 -9479 -3791 4457 8772 5904
2090 5904 -1417 -7072 -6891 -1261 4898 6676 3100 -2643 -5755 -4141 572 4294 4330 1146 -2409 -3524
2106 -3524 -1780 915 2324 1708 63 -882 -747 -28 229 -158 -359 231 1166 1445 293 -1595 -2387 -897
2124 -897 1898 3750 2667 -982 -4261 -4317 -527 4220 5979 2994 -2689 -6472 -5021 780 6371 6938
2140 6938 1730 -5250 -8239 -4454 3360 8866 7319 -319 -8109 -9617 -3389 5776 10430 6696 -2631
2155 -2631 -10022 -9305 -940 8320 10841 4439 -5839 -11592 -8130 1994 10591 10603 2000 -8207 -11831
2170 -11831 -6014 4507 11072 8516 -960 -9626 -10454 -2843 6901 10921 6079 -3554 -10290 -8657 -373
2185 -373 7905 9610 3500 -5028 -9283 -5888 1963 7968 7298 756 -6163 -7957 -3436 3599 7419
2200 7419 5307 -746 -5733 -5840 -1436 3699 5437 2797 -1850 -4453 -3171 503 3512 3493 938 -1986
2216 -1986 -2926 -1555 678 1903 1590 481 -356 -434 -193 -240 -537 -364 426 1362 1444 297 -1427 -2043 -814
2235 -814 1539 3006 1985 -1052 -3674 -3490 -232 3720 5068 2388 -2457 -5654 -4408 484 5214
2250 5214 5781 1536 -4247 -6744 -3697 2656 7170 5868 -484 -6880 -7999 -2639 5039 8840 5524
2265 5524 -2409 -8535 -7879 -776 6863 8965 3572 -4924 -9585 -6449 2014 8850 8518 1254 -7143
2280 -7143 -9906 -4755 4135 9519 7169 -948 -8212 -8778 -2290 5852 9209 4970 -3235 -8784 -7221
2295 -7221 -24 7069 8374 3026 -4587 -8185 -5272 1779 7128 6546 866 -5345 -6930 -2899 3289
2310 3289 6686 4723 -775 -5288 -5347 -1250 3566 5234 2890 -1433 -4040 -3190 104 2923 3225 1093
2326 1093 -1501 -2567 -1494 448 1774 1694 613 -404 -810 -705 -505 -259 168 887 1402 1028 -285
2343 -285 -1683 -1992 -612 1581 2737 1734 -921 -3261 -3071 -219 3181 4348 1919 -2443 -5187 -3990
2359 -3990 579 4940 5491 1594 -3959 -6513 -3907 1997 6424 5654 89 -5820 -7193 -2754 4143
2374 4143 7752 5018 -2035 -7619 -7223 -988 6053 8182 3651 -3977 -8445 -6070 1080 7353 7560
2389 7560 1570 -5711 -8411 -4267 3197 8078 6300 -446 -6869 -7616 -2307 4774 7923 4700 -2209
2404 -2209 -7150 -6242 -383 5669 7021 2756 -3516 -6748 -4418 1371 5892 5584 861 -4230 -5672
2419 -5672 -2432 2627 5369 3826 -598 -4163 -4212 -915 2847 4170 2220 -1104 -3148 -2499 32 2218
2435 2218 2433 833 -1135 -1883 -1153 367 1293 1223 499 -325 -671 -685 -517 -243 200 789 1087 672 -395
2454 -395 -1454 -1499 -319 1290 2089 1134 -986 -2667 -2275 60 2655 3352 1248 -2173 -4166 -2936 670
2471 670 3985 4083 723 -3484 -5073 -2593 2154 5303 4160 -601 -5145 -5754 -1715 3736 6293 3729
2487 3729 -2014 -6132 -5397 -223 5148 6303 2310 -3753 -6854 -4504 1510 6411 6150 1022 -4887
2502 -4887 -6933 -3474 2728 6572 5120 -400 -5519 -6003 -1661 4154 6628 3802 -2009 -6185 -5358
2517 -5358 -328 4885 6222 2756 -2664 -5612 -3970 795 4719 4666 968 -3382 -4697 -2293 2051
2532 2051 4631 3617 -47 -3421 -3878 -1489 1867 3490 2413 -288 -2354 -2377 -632 1467 2185 1199
2548 1199 -567 -1753 -1599 -361 960 1531 1127 147 -796 -1200 -1035 -353 547 1078 1042 266 -801 -1410
2566 -1410 -1039 190 1410 1656 472 -1377 -2473 -1723 450 2538 2807 792 -2133 -3599 -2366 738
2582 738 3366 3247 405 -2995 -4082 -1872 2035 4381 3231 -787 -4400 -4649 -1302 3238 5189 3104
2598 3104 -1523 -4908 -4376 -317 4037 5034 1918 -2845 -5294 -3511 1281 5141 5073 988 -3898 -5699
2614 -5699 -2976 2014 5349 4469 114 -4209 -4902 -1620 3071 5250 3221 -1391 -4842 -4381 -395 3982
2630 3982 5146 2426 -2058 -4668 -3511 332 3762 4041 1215 -2408 -3794 -2080 1308 3553 3043
2645 3043 184 -2664 -3273 -1522 1281 2926 2361 146 -1867 -2309 -984 866 1843 1393 -131 -1423
2661 -1423 -1720 -740 611 1415 1280 289 -858 -1498 -1228 -285 726 1305 984 15 -1112 -1486 -845 458
2679 458 1540 1400 91 -1618 -2317 -1313 821 2483 2329 292 -2198 -3110 -1700 1127 3104 2610
2695 2610 -36 -2809 -3350 -1170 2071 3790 2411 -1010 -3781 -3643 -620 3025 4261 2233 -1572
2710 -1572 -4111 -3340 91 3541 4052 1382 -2478 -4287 -2680 1243 4274 3990 632 -3197 -4448 -2188
2726 -2188 1844 4412 3482 -116 -3456 -3938 -1205 2561 4224 2586 -1097 -3780 -3441 -302 3042 3952
2742 3952 1912 -1548 -3575 -2763 191 2850 3177 1049 -1762 -3057 -1868 689 2626 2539 504 -1832
2758 -1832 -2681 -1588 575 2113 2082 480 -1341 -2099 -1330 291 1586 1545 336 -1116 -1768 -1209 138
2775 138 1312 1551 666 -710 -1629 -1492 -419 901 1550 1077 -259 -1474 -1705 -710 874 1821 1415 -239
2793 -239 -1897 -2216 -847 1178 2495 1896 -246 -2307 -2656 -957 1546 2798 1899 -597 -2682 -2606 -425
2810 -425 2250 3160 1674 -1253 -3257 -2671 9 2770 3420 1410 -1600 -3348 -2374 492 3030 3214
2826 3214 827 -2193 -3408 -1902 1205 3494 3079 322 -2664 -3453 -1517 1620 3495 2694 -243 -2830
2842 -2830 -3071 -848 2089 3293 1940 -911 -3024 -2687 -284 2305 3085 1516 -1125 -2780 -2278 -82
2858 -82 2010 2433 996 -1186 -2363 -1713 134 1879 2080 659 -1269 -2215 -1615 114 1648 1877 766
2875 766 -931 -1867 -1475 -58 1245 1496 613 -762 -1613 -1344 -133 1154 1545 773 -566 -1635 -1628 -508
2893 -508 919 1682 1172 -207 -1523 -1779 -671 947 1878 1374 -285 -1824 -2016 -636 1364 2401 1650
2910 1650 -460 -2239 -2341 -593 1655 2609 1530 -700 -2369 -2199 -131 2126 2740 1272 -1205 -2766
2926 -2766 -2106 256 2479 2858 1098 -1494 -2821 -1890 597 2654 2664 550 -1943 -2912 -1507 1167
2942 1167 2956 2473 77 -2308 -2775 -1080 1508 2837 1980 -423 -2396 -2412 -543 1730 2625 1449
2958 1449 -846 -2395 -2031 -200 1735 2249 997 -934 -2127 -1639 22 1580 1851 690 -1012 -1859
2974 -1859 -1427 5 1358 1567 628 -797 -1616 -1324 -70 1090 1364 623 -606 -1435 -1237 -210 977
2991 977 1348 733 -433 -1389 -1380 -427 804 1459 1058 -182 -1336 -1574 -640 837 1660 1319 -143 -1619
3009 -1619 -1902 -715 1117 2151 1633 -255 -1975 -2174 -719 1480 2489 1617 -537 -2274 -2150 -257
3025 -257 1938 2709 1350 -1061 -2628 -2179 93 2365 2854 1219 -1315 -2703 -1907 444 2524 2567 711
3042 711 -1801 -2782 -1570 958 2794 2497 285 -2094 -2824 -1327 1174 2715 2057 -135 -2154 -2381
3058 -2381 -713 1464 2433 1458 -715 -2296 -2092 -308 1642 2244 1139 -755 -1973 -1687 -185 1283
3074 1283 1599 673 -766 -1625 -1212 13 1169 1326 534 -786 -1438 -1182 -148 842 1166 585 -337 -1046
3092 -1046 -988 -307 483 859 551 -196 -904 -925 -405 492 1040 888 38 -884 -1258 -813 261 1126 1208 371
3112 371 -809 -1402 -862 407 1408 1385 210 -1220 -1736 -856 805 1934 1663 104 -1533 -1980 -772
3129 -772 1068 2136 1524 -259 -1803 -1897 -329 1574 2339 1218 -780 -2205 -1921 -10 1935 2433 1034
3146 1034 -1119 -2333 -1650 355 2123 2244 501 -1597 -2417 -1341 911 2471 2067 76 -2009 -2438
3162 -2438 -975 1201 2368 1667 -426 -2087 -2051 -435 1508 2209 1061 -895 -2191 -1753 -72 1623
3178 1623 1934 720 -984 -1935 -1402 120 1362 1468 411 -1041 -1599 -962 321 1253 1203 171 -963
3195 -963 -1447 -886 214 999 991 262 -595 -951 -655 41 644 747 252 -382 -733 -631 -145 474 828 644
3215 644 -10 -679 -970 -575 229 1001 1039 314 -667 -1205 -757 362 1293 1328 270 -1056 -1538 -824 661
3234 661 1823 1575 162 -1404 -1834 -825 938 1965 1540 -118 -1681 -1867 -534 1375 2227 1341 -620
3251 -620 -2085 -1936 -214 1775 2390 1146 -969 -2317 -1777 212 2041 2222 602 -1508 -2390 -1381
3267 -1381 771 2338 1997 29 -1928 -2400 -984 1130 2249 1510 -459 -2068 -1998 -374 1421 2001
3283 2001 906 -898 -2038 -1608 31 1484 1645 525 -1008 -1745 -1141 266 1313 1237 165 -1032
3299 -1032 -1425 -724 508 1209 924 -45 -931 -1086 -472 454 903 634 -56 -595 -651 -252 240 448 422 40
3319 40 -192 -374 -250 -4 227 426 434 92 -240 -579 -437 99 681 845 455 -335 -908 -776 101 965 1125
3340 1125 422 -688 -1216 -768 453 1394 1350 247 -1057 -1577 -792 702 1724 1464 14 -1471 -1710
3357 -1710 -647 1120 1962 1332 -402 -1887 -1791 -286 1580 2179 1065 -943 -2209 -1730 140 1873
3373 1873 2045 554 -1396 -2275 -1305 666 2125 1716 -54 -1870 -2206 -855 1147 2116 1340 -467 -1933
3390 -1933 -1852 -387 1321 1845 865 -896 -1849 -1401 142 1452 1604 402 -1103 -1753 -1090 350 1390
3407 1390 1286 126 -1016 -1309 -556 580 1182 752 -240 -984 -933 -172 646 970 510 -201 -631 -558 -89
3426 -89 345 456 236 22 -166 -93 -18 70 114 203 212 88 -75 -280 -246 -6 507 715 426 -176 -697 -702 -87 688
3450 688 994 545 -309 -955 -794 122 1051 1209 394 -801 -1433 -889 432 1512 1446 276 -1155 -1661 -791
3469 -791 732 1695 1311 -220 -1595 -1743 -441 1346 2009 1055 -830 -2079 -1765 -79 1663 1956 697
3486 697 -1195 -2122 -1285 533 1894 1698 -5 -1726 -2132 -874 1020 2045 1389 -394 -1849 -1842 -449
3503 -449 1313 1822 845 -839 -1904 -1408 190 1561 1658 432 -1135 -1787 -1003 508 1513 1278 31
3520 31 -1203 -1321 -394 794 1325 715 -364 -1118 -865 14 906 989 386 -320 -712 -393 178 556 451 29
3540 29 -284 -223 42 243 271 79 -66 -44 85 100 -74 -155 -195 122 461 500 128 -368 -627 -359 313 722 594
3563 594 -93 -773 -842 -160 768 1105 539 -559 -1304 -1103 93 1194 1367 382 -993 -1588 -960 553 1525
3582 1525 1285 -149 -1555 -1766 -564 1163 1885 1063 -653 -1943 -1645 -106 1489 1864 644 -1105
3598 -1105 -2027 -1297 486 1831 1638 68 -1616 -2078 -908 947 1981 1388 -346 -1791 -1801 -373 1310
3615 1310 1868 887 -871 -1869 -1343 203 1587 1721 427 -1168 -1713 -906 614 1576 1212 -115 -1251
3632 -1251 -1306 -255 961 1381 727 -460 -1214 -909 155 962 998 337 -503 -734 -346 305 667 497 -96
3651 -96 -484 -369 65 415 447 122 -183 -220 -13 170 188 -47 -212 -63 233 331 250 -140 -516 -419 74 562
3673 562 526 58 -553 -771 -300 516 901 528 -371 -1152 -969 -31 992 1220 373 -849 -1467 -955 352
3692 352 1382 1199 -34 -1287 -1535 -578 944 1628 978 -543 -1738 -1534 -128 1363 1739 671 -1005
3709 -1005 -1958 -1278 340 1705 1590 225 -1438 -1886 -854 891 1910 1353 -260 -1707 -1694 -329 1378
3726 1378 1862 934 -730 -1773 -1314 205 1565 1609 395 -1154 -1673 -815 693 1629 1247 -72 -1244
3743 -1244 -1295 -313 954 1417 731 -425 -1121 -842 174 989 987 297 -615 -854 -403 354 759 541 -56 -496
3763 -496 -462 -14 434 430 56 -268 -315 -81 266 278 53 -276 -286 4 296 263 -83 -457 -458 -33 481 625 176
3786 176 -512 -858 -469 293 863 629 -239 -973 -988 -177 847 1106 419 -715 -1355 -962 277 1253 1231 115
3806 115 -1170 -1463 -668 729 1482 982 -432 -1531 -1396 -151 1269 1653 684 -929 -1711 -1223 368
3823 368 1590 1529 269 -1251 -1711 -756 865 1753 1234 -326 -1597 -1535 -191 1325 1794 771 -758
3840 -758 -1680 -1142 338 1508 1497 249 -1075 -1491 -572 816 1542 1035 -283 -1240 -1152 -86 996 1308
3858 1308 599 -550 -1125 -702 320 1018 853 20 -767 -887 -297 528 878 527 -211 -692 -527 37 496
3877 496 406 -71 -418 -442 -38 348 411 13 -396 -400 -151 302 336 0 -454 -442 -112 444 620 104 -528 -871
3899 -871 -460 273 813 628 -156 -904 -907 -137 737 1023 350 -718 -1245 -807 365 1293 1203 42 -1111 -1437
3919 -1437 -622 774 1472 976 -326 -1423 -1309 -94 1253 1606 652 -899 -1730 -1120 379 1619 1600
3936 1600 228 -1282 -1642 -726 847 1752 1153 -306 -1542 -1429 -139 1310 1724 752 -735 -1577 -1072
3953 -1072 374 1416 1374 209 -1031 -1367 -516 781 1456 960 -313 -1188 -1057 -99 941 1152 420 -562
3971 -562 -1069 -624 308 895 732 -88 -826 -867 -200 548 807 411 -351 -716 -463 130 484 389 -104 -531 -401
3992 -401 39 436 400 -22 -431 -526 -142 357 396 22 -412 -576 -195 390 606 240 -428 -806 -513 181 734
4013 734 664 -41 -744 -819 -204 611 954 465 -467 -1066 -782 245 1070 1040 174 -888 -1220 -539 610 1295
4033 1295 899 -266 -1228 -1157 -88 1108 1420 631 -766 -1445 -991 345 1445 1353 239 -1137 -1460 -591
4051 -591 812 1565 1048 -356 -1396 -1333 -73 1210 1562 656 -765 -1469 -961 341 1380 1267 93
4068 93 -1092 -1351 -448 764 1401 849 -342 -1223 -1102 -89 942 1170 433 -610 -1113 -708 242 904
4086 904 713 -49 -817 -891 -264 526 836 364 -400 -810 -538 72 507 420 -104 -496 -434 -71 386 385 -17 -445
4108 -445 -500 -174 238 414 65 -305 -479 -162 270 481 197 -357 -703 -410 163 691 589 -55 -661 -759 -185
4129 -185 568 835 417 -415 -904 -604 279 1027 926 90 -857 -1144 -426 591 1226 864 -259 -1115 -1066 -9
4149 -9 1058 1291 468 -765 -1368 -801 475 1416 1262 126 -1081 -1319 -469 799 1438 851 -380 -1330
4167 -1330 -1138 56 1176 1336 497 -839 -1412 -866 366 1224 1074 72 -973 -1200 -426 691 1172
4184 1172 713 -422 -1156 -934 -73 893 1050 347 -632 -1071 -634 240 826 657 -107 -774 -774 -179 458 702
4204 702 290 -404 -785 -532 88 514 380 -17 -393 -405 -73 238 259 -62 -347 -369 -74 289 373 115 -231
4225 -231 -396 -133 192 360 132 -253 -479 -245 255 585 505 -108 -586 -544 -80 561 721 321 -363 -746 -441
4246 -441 285 861 738 9 -765 -895 -307 679 1095 708 -269 -1020 -855 41 992 1093 347 -660 -1158 -605
4266 -605 481 1255 1035 15 -1037 -1144 -338 716 1227 709 -359 -1136 -988 73 1066 1114 303 -783
4284 -783 -1252 -734 361 1063 941 -17 -931 -1106 -410 545 1015 563 -362 -1027 -848 -45 737 902 262 -612
4304 -612 -993 -551 225 716 555 -74 -661 -645 -190 403 538 222 -319 -621 -406 115 454 347 8 -339
4324 -339 -331 -72 213 295 49 -202 -246 -47 205 293 80 -181 -237 -76 198 346 112 -201 -376 -161 215 477
4346 477 343 -60 -459 -447 35 567 655 282 -377 -652 -410 282 796 657 7 -676 -767 -154 611 960 525
4367 525 -347 -900 -699 124 872 941 269 -680 -1043 -478 411 1033 789 -32 -913 -981 -262 725 1022 562 -427
4388 -427 -1059 -861 26 852 968 268 -667 -1056 -651 256 947 753 -98 -877 -996 -302 549 929 460 -378
4408 -378 -900 -723 -45 648 745 155 -551 -815 -381 212 663 474 -87 -606 -622 -134 392 542 241 -224 -471
4429 -471 -302 47 318 243 -7 -240 -260 -28 194 258 104 -92 -159 -29 149 202 25 -146 -118 58 249 261
4451 261 130 -172 -323 -74 235 418 229 -99 -384 -265 116 495 547 127 -387 -572 -234 328 698 532
4471 532 -76 -582 -571 -47 578 782 330 -406 -783 -550 170 803 735 63 -647 -856 -394 394 856 641 -178
4492 -178 -825 -787 -163 609 848 367 -459 -979 -702 126 768 813 128 -654 -923 -496 292 733 579 -113 -757
4513 -757 -800 -160 521 769 356 -351 -803 -619 25 574 615 151 -434 -630 -304 233 541 363 -94 -451 -471
4534 -471 -140 278 438 269 -101 -305 -271 2 242 289 57 -112 -162 -44 123 214 120 -43 -10 -27 74 65 11
4557 11 -35 40 145 176 192 -25 -155 -150 33 299 315 112 -144 -257 -107 161 441 330 -38 -446 -443 -80 380
4580 380 554 272 -203 -602 -475 63 495 557 125 -410 -647 -377 270 686 514 -78 -635 -750 -266 389
4600 389 730 450 -231 -743 -633 -62 506 704 220 -467 -829 -566 159 707 682 60 -600 -800 -393 252
4620 252 676 485 -116 -608 -599 -99 454 631 296 -345 -629 -467 30 470 529 191 -295 -480 -274 148 370
4641 370 327 28 -277 -302 -99 239 354 213 -23 -218 -176 -31 186 181 165 -3 -32 16 46 36 54 -6 14 37 57
4666 57 -3 -14 -35 31 204 207 78 -109 -212 -155 135 328 304 22 -246 -306 -108 204 374 220 -167 -412 -377 15
4690 15 396 475 175 -352 -587 -357 134 454 451 24 -434 -543 -255 292 573 377 -182 -626 -606 -163 432 602
4712 602 275 -329 -658 -548 2 496 519 68 -486 -645 -372 193 558 487 -56 -519 -605 -190 310 566 340
4733 340 -215 -555 -468 27 416 438 173 -258 -479 -343 127 441 421 125 -229 -366 -158 108 321 281 26
4754 26 -199 -192 -26 125 242 234 2 -110 -121 -25 114 133 142 29 43 -8 -6 13 17 84 111 92 -20 -74 -61 -22 140 208
4782 208 207 -53 -193 -229 -53 249 333 182 -152 -357 -260 27 334 400 114 -279 -470 -245 143 451 393 31
4804 31 -377 -511 -239 227 490 305 -123 -500 -509 -126 312 560 254 -226 -573 -460 -16 439 502 179 -320
4825 -320 -553 -355 141 467 466 41 -406 -544 -236 282 497 389 -112 -442 -419 -56 306 413 228 -153 -370
4846 -370 -285 23 304 420 158 -161 -336 -208 72 270 310 132 -132 -219 -147 75 277 193 27 -134 -147 -36
4868 -36 141 161 161 95 -31 -94 -24 -4 89 125 97 16 -48 -109 -95 47 109 168 90 -60 -220 -173 14 214 279 102 -143
4895 -143 -283 -230 17 257 271 78 -211 -364 -193 153 360 295 -12 -386 -440 -181 168 419 279 -88 -421
4916 -421 -403 -141 257 373 191 -231 -488 -451 -8 346 471 154 -301 -529 -345 76 418 420 53 -347 -512
4937 -512 -167 215 462 277 -94 -420 -467 -85 308 446 273 -133 -346 -282 -20 288 323 127 -124 -295 -149
4958 -149 121 304 310 148 -100 -224 -130 83 254 228 117 -106 -143 -50 92 161 175 76 -106 -68 -68 5 108 136 109
4983 109 21 -89 -135 -80 -13 114 176 118 -28 -150 -128 -33 106 215 89 -136 -273 -255 30 266 307 128 -189
5006 -189 -421 -268 66 299 312 35 -320 -424 -228 134 385 298 -90 -413 -447 -153 329 456 253 -134 -442
5027 -442 -415 -49 336 422 151 -239 -500 -339 115 459 433 109 -341 -519 -275 199 488 382 -52 -370 -402
5048 -402 -155 268 443 272 -115 -396 -316 82 332 421 202 -200 -300 -225 72 296 306 55 -203 -225 -68 149
5070 149 204 222 4 -123 -171 -62 67 162 153 6 -67 -81 -38 45 51 75 -1 -29 -29 -28 -29 -31 50 93 102 -67 -124 -182 -78 89
5100 89 187 153 -61 -219 -252 -88 137 268 103 -167 -330 -312 -18 284 327 53 -296 -441 -289 83 347 329
5122 329 -8 -367 -486 -204 149 426 278 -161 -439 -450 -149 291 476 251 -155 -437 -399 33 388 404 119
5143 119 -332 -518 -254 174 461 425 20 -367 -455 -180 288 483 316 -113 -384 -376 -22 361 440 169 -165 -398
5165 -398 -229 98 329 338 130 -207 -304 -141 113 284 212 21 -176 -203 -21 138 192 135 -48 -173 -195 10 90
5188 90 125 93 -49 -61 -66 -27 26 36 -38 -7 1 -16 -63 -62 -30 -34 82 91 15 -113 -210 -97 94 182 173 2 -234 -291 -99
5217 -99 125 236 153 -159 -363 -221 3 262 320 84 -269 -401 -283 80 360 283 0 -356 -464 -125 215
5238 215 454 272 -92 -418 -447 -60 352 466 232 -196 -537 -370 68 448 494 136 -351 -490 -193 152 536
5259 536 415 22 -408 -443 -106 340 502 292 -164 -366 -304 67 378 430 162 -223 -367 -211 107 373 356
5280 356 32 -239 -263 -120 162 313 208 -114 -213 -187 -31 154 215 120 -88 -195 -113 -1 75 73 -30 -93 -103 -33
5304 -33 11 29 -34 -62 -46 26 -20 -30 -89 -124 -21 87 150 43 -138 -247 -139 23 197 207 -41 -239 -297 -111 196
5329 196 315 145 -192 -401 -281 -1 250 319 102 -264 -382 -248 108 405 333 -10 -332 -398 -173 248 490
5350 490 292 -108 -442 -399 -20 411 470 204 -204 -531 -308 135 478 467 80 -355 -467 -181 312 562 371
5371 371 -45 -407 -362 -23 344 549 204 -191 -413 -305 99 371 359 84 -244 -300 -151 172 314 225 -37
5392 -37 -238 -293 -1 250 254 116 -119 -283 -213 25 180 185 -16 -126 -159 -78 116 97 50 -129 -153 -79 40 96 9
5417 9 -76 -128 -49 31 93 -45 -198 -198 -38 73 203 84 -114 -258 -167 24 190 160 -25 -285 -258 -91 167 309
5441 309 161 -108 -390 -310 -39 292 405 136 -238 -395 -230 129 425 407 64 -353 -439 -110 304 569 310
5462 310 -92 -454 -428 -42 423 529 210 -210 -481 -304 179 564 461 53 -403 -476 -186 296 549 374 -89
5483 -89 -418 -389 24 365 492 191 -234 -422 -273 151 389 366 71 -273 -385 -163 190 359 285 -85 -303
5504 -303 -295 -53 246 280 72 -138 -347 -192 11 218 161 -44 -175 -196 -54 136 111 -16 -173 -206 -91 76
5526 76 127 42 -97 -184 -53 82 86 34 -123 -198 -154 54 199 110 -48 -223 -192 17 185 225 -10 -207 -281 -125
5550 -125 185 344 221 -56 -308 -298 -115 255 428 186 -157 -379 -253 52 444 437 51 -308 -435 -157 248
5571 248 518 383 -61 -425 -402 -19 418 509 214 -215 -478 -325 183 510 451 65 -365 -510 -136 264 509
5592 509 291 -90 -428 -436 -48 336 499 209 -227 -474 -330 58 351 329 45 -339 -432 -214 176 401 210
5613 210 -139 -391 -350 -77 259 311 89 -226 -329 -197 32 281 207 -79 -229 -223 -50 149 209 50 -158 -235
5635 -235 -121 40 165 43 -112 -178 -150 1 101 146 -116 -196 -112 46 181 99 9 -150 -162 -9 161 190 51
5658 51 -128 -259 -136 112 334 276 11 -274 -310 -45 284 389 185 -172 -351 -256 97 465 420 98 -276 -404
5680 -404 -145 306 541 363 -35 -377 -401 -17 424 498 214 -235 -446 -299 146 500 441 24 -374 -459 -175
5701 -175 247 475 361 -118 -431 -436 -24 354 460 178 -262 -484 -314 51 381 409 -11 -328 -448 -185 215
5722 215 349 247 -153 -396 -368 -40 240 277 66 -213 -322 -210 86 223 139 -83 -243 -247 -52 158 187 20
5744 20 -147 -182 -59 94 173 75 -67 -135 -133 55 163 125 -46 -163 -107 -19 165 171 9 -124 -197 -33 195 274 131
5769 131 -68 -254 -170 57 294 231 26 -268 -263 -38 229 371 210 -129 -342 -256 76 420 428 108 -270 -382
5791 -382 -149 224 481 304 -110 -409 -387 -25 346 457 194 -230 -493 -327 83 459 387 82 -362 -500 -189
5812 -189 240 542 335 -101 -480 -495 -97 339 435 150 -245 -511 -327 55 392 334 -20 -364 -482 -216 192
5833 192 390 245 -117 -411 -364 -26 241 301 82 -236 -399 -193 112 296 218 -85 -304 -280 -69 157 226 112
5855 112 -131 -201 -104 83 150 133 -42 -194 -113 62 172 188 51 -113 -154 -38 109 199 73 -124 -168 -85 180
5878 180 270 171 -57 -224 -188 54 233 275 37 -219 -282 -59 242 332 208 -134 -370 -292 56 334 421 80 -230
5901 -230 -383 -179 162 419 289 -95 -393 -413 -46 340 475 230 -209 -510 -373 3 366 414 66 -346 -445
5922 -445 -225 245 504 270 -118 -524 -499 -117 344 465 217 -266 -508 -345 61 375 358 -6 -396 -493 -200
5943 -200 276 430 235 -115 -438 -391 -53 278 340 100 -200 -325 -175 118 272 210 -25 -287 -255 -67 150
5964 150 281 166 -81 -209 -159 29 183 154 -39 -137 -136 -3 132 240 53 -79 -185 -47 132 195 102 -56
5986 -56 -137 -67 137 246 144 -51 -224 -189 63 236 250 89 -154 -253 -96 155 260 186 -88 -348 -234 45
6008 45 282 314 70 -224 -361 -179 133 308 201 -64 -359 -341 -62 261 380 187 -194 -464 -347 56 366
6029 366 386 65 -323 -455 -208 193 411 291 -116 -446 -433 -64 303 400 199 -195 -493 -328 65 347 340 8
6051 8 -319 -406 -100 214 406 259 -91 -332 -339 -26 268 361 122 -146 -283 -193 87 298 223 4 -232 -288 -55
6074 -55 185 310 118 -68 -257 -139 19 193 202 0 -148 -162 -30 184 215 116 -35 -138 -39 35 190 89 -47
6097 -47 -164 -65 66 185 127 -32 -156 -112 37 153 180 62 -116 -193 -70 142 223 159 -91 -262 -203 13 221
6120 221 247 48 -193 -342 -153 91 271 216 -44 -338 -337 -94 225 352 142 -155 -411 -316 52 345 340 44
6142 44 -322 -404 -132 165 380 246 -92 -387 -388 -66 278 351 160 -192 -444 -314 99 360 308 37 -304 -363
6164 -363 -142 190 398 224 -92 -304 -299 -27 272 346 184 -108 -296 -236 53 278 260 52 -187 -220 -83 178
6186 178 258 197 -54 -175 -160 -1 193 184 53 -121 -116 -51 125 175 81 -54 -168 -46 19 69 111 -8 -110 -37 47
6211 47 152 65 -63 -143 -57 -9 114 137 39 -92 -137 -60 90 176 105 -146 -251 -202 7 146 222 54 -189 -322
6235 -322 -162 86 220 184 -39 -282 -283 -48 194 285 137 -195 -381 -258 24 303 284 20 -286 -365 -147 137
6257 137 354 210 -73 -380 -300 -43 260 386 167 -174 -325 -270 18 286 293 72 -210 -329 -145 159 323
6278 323 227 -29 -317 -269 -60 228 349 214 -127 -239 -180 42 280 244 65 -188 -258 -119 167 256 136 16
6300 16 -188 -146 -17 136 182 29 -47 -161 -72 109 91 101 -29 -135 -80 -6 75 66 -9 -78 -60 -30 37 36 -52 -99 -107 22
6328 22 26 62 -43 -33 -106 -74 63 98 49 -48 -145 -135 31 140 157 23 -169 -233 -131 58 221 120 -42 -246 -270
6353 -270 -15 180 235 84 -150 -300 -251 46 291 232 53 -192 -290 -122 174 269 208 -57 -278 -238 2 229
6375 229 325 179 -121 -304 -193 40 271 282 77 -179 -320 -145 107 280 264 3 -236 -267 -127 198 230 152
6397 152 -96 -221 -149 4 250 248 57 -164 -233 -173 91 196 185 -4 -171 -118 -49 78 127 67 -73 -150 -110 22
6421 22 120 100 -8 -51 -108 -53 -1 5 31 -26 -69 -49 29 6 -10 -5 -64 -24 -16 12 -79 -62 -39 -23 9 74 -7 -107 -138 -128 30
6452 30 106 95 6 -119 -129 -41 96 170 69 -117 -250 -166 43 209 236 -2 -123 -214 -128 91 207 130 3 -199
6476 -199 -218 -45 225 288 194 -54 -247 -188 6 230 209 92 -81 -226 -151 109 225 182 63 -174 -211 -96 113
6499 113 307 214 -22 -207 -250 -70 166 223 125 -73 -154 -170 16 221 188 -17 -137 -198 -96 13 157 135 12
6522 12 -75 -155 -51 23 91 37 -17 -96 -102 -30 9 29 43 -41 -116 -112 -44 -30 -1 -6 30 -30 -32 -49 -10 1 -5 4 4 -19 -19 -34 -48 31
6556 31 57 34 -27 -109 -116 -4 103 120 50 -48 -127 -124 -12 146 117 21 -148 -184 -74 67 210 180 10 -175 -192 -92
6582 -92 171 192 160 -25 -166 -118 -5 159 256 123 -53 -183 -138 56 228 214 82 -59 -230 -95 29 210
6604 210 215 43 -135 -165 -78 116 186 112 -34 -194 -160 -47 147 202 108 -28 -140 -137 -13 116 102 -8 -84 -121 -105
6629 -105 19 91 125 3 -89 -153 -147 -2 56 112 -18 -81 -93 -103 9 68 30 10 -67 -99 -10 39 68 33 27 -31 -63 -88
6657 -88 -69 5 61 19 18 -37 -67 -94 -16 84 34 -1 -70 -83 -57 10 78 95 66 -94 -166 -72 69 217 152 49 -116 -117
6685 -117 -71 105 167 79 -44 -155 -154 -35 142 190 115 -41 -147 -139 3 128 178 60 -62 -160 -89 41 205 177
6709 177 65 -148 -169 -89 82 214 180 -2 -158 -243 -90 73 153 99 -68 -150 -168 -26 66 86 74 -74 -171 -120
6733 -120 4 85 94 14 -77 -137 -123 -18 25 63 29 -77 -132 -96 -45 36 66 45 -61 -109 -79 -52 38 87 10 0 -110 -66
6761 -66 -33 63 55 76 -30 -74 -50 -22 43 109 45 26 -47 -111 -82 6 112 122 63 -59 -94 -13 105 167 104 -34 -134 -107
6789 -107 26 106 201 85 -57 -113 -75 -14 168 147 88 -57 -154 -92 34 131 147 61 -40 -150 -85 20 174 142 61
6814 61 -72 -194 -73 86 196 126 -8 -139 -168 -53 97 179 102 -16 -124 -154 -34 34 102 57 -102 -110 -61 -32
6838 -32 66 61 -13 -81 -77 -106 -61 21 63 68 -29 -75 -77 -49 22 33 60 -25 -65 -102 -59 3 18 16 -4 -115 -111 -65 19 89 58 2 -51
6871 -51 -68 -80 13 113 87 18 -44 -114 -46 50 134 124 22 -81 -131 -77 107 216 179 25 -109 -116 -66 135 201 143 -56
6898 -56 -132 -78 51 215 210 149 -53 -164 -102 43 138 188 63 -77 -110 -87 81 180 141 -7 -109 -140 -65 95 227
6923 227 130 5 -163 -157 -65 70 138 118 -44 -198 -153 -51 89 131 42 -43 -163 -77 15 65 79 15 -76 -103 -80 3
6949 3 36 20 -19 -49 -52 -61 -17 3 29 -21 -47 -60 -56 -84 15 53 38 -27 -52 -61 -6 57 33 36 20 -30 -53 -85 13 113 99 24 -51
6982 -51 -119 -75 23 93 145 83 -61 -113 -95 55 146 139 29 -121 -186 -96 87 234 182 -13 -187 -160 -20 99 174 144
7008 144 -63 -148 -114 56 200 195 114 -43 -183 -165 -1 174 234 75 -114 -152 -117 66 170 142 -2 -134 -211 -79
7032 -79 107 202 171 -51 -233 -203 -48 153 173 94 -81 -153 -121 4 118 108 -2 -156 -170 -105 2 125 71 -23
7056 -23 -75 -113 -83 10 56 42 -22 -62 -46 -20 5 -21 23 -7 -34 -34 -54 -21 56 49 64 25 18 -27 -41 -25 0 75 64 -32 -44 -73
7088 -73 39 26 85 84 -11 -109 -117 3 120 181 92 -26 -142 -121 19 203 174 24 -123 -190 -76 106 249 151 -51
7113 -51 -150 -194 -53 92 228 127 -33 -188 -173 14 188 237 96 -86 -206 -146 4 216 221 51 -179 -217 -94
7136 -94 59 197 155 -72 -147 -228 -92 124 225 110 -145 -245 -185 -4 136 173 -6 -106 -158 -116 36 133 117
7159 117 -19 -137 -142 -30 27 118 20 -13 -80 -60 -65 45 63 5 -51 -76 -24 46 3 -8 -8 -55 -10 -50 32 6 -19 18 63
7188 63 59 26 -4 -38 -39 -14 84 86 88 -109 -107 -41 27 111 115 7 -115 -126 4 143 216 87 -96 -186 -127 45 213 191 50
7217 50 -134 -225 -62 73 236 184 -5 -180 -271 -51 140 263 143 -24 -184 -152 -35 174 245 88 -105 -239
7239 -239 -180 36 256 198 6 -198 -253 -129 88 231 190 -72 -210 -231 -27 158 254 104 -105 -215 -157 -2
7261 -2 170 179 24 -122 -230 -139 68 179 88 -64 -150 -128 -13 93 171 37 -94 -103 -90 5 67 93 13 -60 -85 -23
7287 -23 46 53 43 15 -72 21 17 88 20 4 2 18 80 45 5 -50 -53 1 49 110 47 -12 -83 -79 54 140 129 39 -96 -141 -31
7318 -31 129 217 126 -30 -179 -141 8 179 201 106 -84 -173 -171 33 231 198 10 -149 -251 -92 116 203 196 -65
7342 -65 -240 -199 -52 195 278 95 -125 -265 -269 44 253 276 64 -185 -340 -188 41 259 202 -46 -228 -195 -38
7365 -38 170 232 55 -134 -296 -190 30 195 209 91 -162 -210 -138 73 195 113 18 -149 -157 -32 81 154 114 -73
7389 -73 -144 -145 -8 95 115 9 -43 -86 -16 91 121 60 -23 -149 -52 45 126 56 -42 -31 -15 32 91 58 -18 -64 -89 79
7417 79 127 123 -10 -89 -58 -13 82 117 18 -80 -103 -65 81 191 138 -26 -167 -160 -52 111 179 79 -97 -222 -174 29
7443 29 201 199 39 -173 -262 -128 90 234 179 5 -249 -244 -93 138 252 126 -98 -308 -227 -10 260 273 43
7466 43 -204 -280 -140 101 283 192 -32 -244 -258 -50 183 210 115 -101 -220 -195 36 176 235 91 -124 -180 -157
7489 -157 28 195 161 7 -110 -152 -48 155 210 106 -31 -131 -165 16 117 139 76 -52 -88 -48 92 105 62
7512 62 -78 -80 -30 41 100 109 -19 -62 -60 69 44 45 -39 -52 10 65 119 89 1 -93 -98 28 74 121 74 -51 -151 -79 40
7541 40 172 122 -32 -142 -168 -47 83 192 125 -57 -191 -188 24 164 219 34 -175 -256 -166 76 233 197 -15
7564 -15 -191 -267 -126 157 263 180 -100 -324 -235 -4 259 251 79 -168 -293 -144 74 251 235 -45 -204 -273 -33
7587 -33 159 232 152 -55 -261 -194 37 215 182 112 -94 -187 -114 58 198 185 24 -166 -171 -12 153 191 134 -28
7611 -28 -156 -132 50 200 143 63 -88 -97 -28 118 185 49 -66 -110 -83 89 93 62 -34 -96 -55 36 93 99 -36 -85 -90 -41
7639 -41 72 64 -2 -81 -126 -34 62 97 68 -43 -100 -167 9 112 119 33 -96 -205 -125 80 180 142 -64 -183 -206 -39
7665 -39 162 244 85 -130 -238 -187 20 267 193 -4 -229 -236 -108 156 275 129 -69 -278 -191 -4 249 250 144
7688 144 -171 -321 -169 92 250 228 29 -151 -202 -102 176 281 223 -51 -216 -188 30 211 288 107 -98 -252
7710 -252 -175 81 253 211 -33 -158 -214 -82 127 258 131 -73 -193 -138 9 148 164 15 -150 -147 -26 77
7732 77 132 64 -63 -126 -82 -7 120 65 -19 -111 -102 -13 90 101 32 -55 -122 -35 35 128 43 -22 -96 -51 21 119 40 -22 -119
7761 -119 -112 -24 77 194 74 -113 -172 -136 19 167 133 -7 -192 -155 -92 152 181 100 -108 -246 -118 38 247
7784 247 197 50 -158 -263 -108 102 255 202 -56 -257 -196 -16 187 271 140 -122 -245 -175 59 240 239 75
7806 75 -140 -235 -127 120 225 197 -18 -225 -241 -40 196 254 141 -78 -265 -191 70 209 192 40 -210 -204 -86
7829 -86 94 201 96 -47 -195 -157 -14 139 125 43 -102 -163 -79 80 105 102 -38 -79 -134 0 74 87 52 -61 -93
7854 -93 -54 42 75 54 -35 -135 -109 55 72 32 -21 -103 -97 0 59 79 -15 -127 -147 -67 80 128 74 -91 -155 -91 7 148
7882 148 138 -13 -207 -179 -44 107 218 94 -90 -177 -147 40 165 180 54 -117 -212 -114 104 229 195 -30 -136
7905 -136 -177 -8 148 234 119 -68 -235 -190 -6 200 224 58 -141 -159 -135 109 212 245 6 -242 -228 -37 178
7928 178 235 161 -103 -261 -185 80 241 248 -13 -215 -197 -109 76 205 132 -32 -132 -194 -10 99 152 38 -130
7951 -130 -168 -73 23 82 100 -25 -111 -176 -49 78 73 27 -58 -125 -42 7 111 98 -35 -97 -106 -81 77 87 7 -77 -82 -39
7979 -39 94 97 13 -71 -95 -5 41 125 39 -42 -140 -93 21 112 104 8 -150 -162 -21 145 206 65 0 -181 -156 -19 171
8006 171 180 76 -79 -168 -113 36 234 198 43 -158 -182 -32 151 249 149 -64 -194 -209 21 232 222 78 -136
8029 -136 -221 -117 108 259 159 5 -188 -202 -45 183 243 123 -87 -203 -132 31 181 176 43 -149 -216 -149 58
8052 58 152 101 -15 -183 -152 -79 57 168 84 -79 -191 -134 10 90 125 32 -106 -144 -74 49 90 64 -47 -133 -81
8077 -81 28 85 61 19 -99 -79 9 74 78 -3 -85 -129 -59 69 87 8 -10 -96 -29 88 82 28 -22 -84 -25 32 94 98 -1 -46
8107 -46 -87 -59 108 149 117 -25 -120 -136 44 111 162 122 -19 -134 -115 16 212 163 92 -108 -152 -77 98 205 135
8132 135 -17 -164 -190 0 152 182 117 -104 -243 -147 62 238 157 12 -175 -181 -83 92 192 80 -84 -150 -156 -3
8156 -3 139 149 13 -127 -194 -144 -31 144 121 -46 -144 -165 -106 72 126 73 -62 -192 -126 -20 171 105 17 -110 -172
8181 -172 -124 68 139 48 4 -120 -113 5 84 110
8191A10
$$ Imaginary data points
##PAGE= N=2
##DATA TABLE= (X++(I..I)), XYDATA
0 0 0 0 0 0 0 0 0 0 0 0 0 0 0 0 0 0 0 1 -8 8 -8 8 -8 16 -16 16 -24 24 -29 33 -40 44 -49 57 -65 73 -81 92 -104
39 -104 115 -128 143 -158 177 -196 217 -240 264 -292 321 -353 389 -428 472 -521 576 -636 705 -786
59 -786 877 -987 1113 -1270 1459 -1696 1992 -2321 2405 2054 211381 -9770 -288271 -320147
73 -320147 -142115 118534 238192 153087 -57076 -193212 -144539 56049 231248 233228 41801
84 41801 -197231 -307033 -201648 33827 228148 245566 97260 -88718 -167119 -97665 40326
95 40326 116483 66656 -63071 -154929 -124877 11884 151308 188687 97999 -49323 -147451
106 -147451 -136111 -42710 51127 77685 34688 -24184 -40640 -1886 53978 74175 37672 -30155
118 -30155 -80928 -82902 -41341 12130 47877 57061 48511 32290 10240 -18848 -47648 -59110 -40332
131 -40332 948 37266 41977 13959 -18146 -20261 14624 54757 54386 -4095 -86094 -126157 -80386
144 -80386 31190 132514 147095 60151 -65206 -134907 -98626 9134 95789 87723 -7145
155 -7145 -103578 -110157 -8758 123891 175550 91598 -74415 -197400 -179082 -28905 139891
166 139891 198650 105654 -60243 -163482 -122403 24349 149767 144113 6948 -150072 -193907
177 -193907 -80337 107243 222166 172151 -6210 -175877 -208545 -84700 92612 183172
187 183172 121500 -33602 -150984 -135369 -3262 133355 160400 54712 -98639 -177391 -120375
198 -120375 25296 144778 148831 42416 -84177 -131579 -70385 39997 105082 74094 -21629
209 -21629 -98429 -91687 -7837 83692 109880 52295 -40635 -96384 -76725 -5043 57853 65244
221 65244 19857 -33821 -50026 -18733 29593 53140 33431 -12088 -48174 -50656 -22824 12415
233 12415 33439 34393 23152 9218 -4250 -18344 -29542 -29346 -11986 14947 32596 25342 -2812
246 -2812 -27868 -24994 8106 44172 47057 4070 -57478 -87374 -53378 28101 98821 102358 30833
259 30833 -64302 -110352 -70801 22873 94713 85166 1231 -87036 -103296 -28485 79650 131782
271 131782 80038 -39952 -134876 -127803 -21892 100330 142383 71728 -53326 -130685 -97537
282 -97537 17769 119194 121354 20485 -101823 -144831 -71324 61429 147500 117901 -3262
293 -3262 -119001 -137671 -46811 78141 135819 81268 -39019 -125978 -109330 -3472 105148
304 105148 129270 50677 -66319 -128694 -89155 17200 103975 103991 21907 -72527 -103376 -48975
316 -48975 42392 95394 68519 -13304 -82572 -84647 -20868 55493 84678 47407 -22437 -68596
328 -68596 -58411 -5712 44054 53087 19413 -25153 -44280 -25892 11018 35699 30820 3787
340 3787 -22471 -29948 -17296 3015 17091 19753 14117 5178 -4746 -14513 -19896 -15030 1508 21101
354 21101 28711 14963 -12884 -33488 -27412 4371 37906 43293 10889 -36987 -61436 -37634 20817
367 20817 69654 67638 11681 -57131 -84131 -45373 30522 83266 68963 -2658 -74016 -85601
379 -85601 -25210 59587 99177 58306 -32724 -101339 -90744 -7172 83645 108890 47781 -50720
391 -50720 -107332 -76315 16580 95447 95666 16657 -77068 -108853 -51969 48196 111110 85980
403 85980 -6983 -93603 -105436 -34327 61329 105084 63487 -27759 -93993 -82531 -4078 76718
415 76718 94667 36015 -51334 -97776 -67501 13705 81031 83045 21359 -52774 -81284 -44979
427 -44979 23342 67959 55131 -1541 -54461 -62040 -20572 35176 61558 40362 -9137 -48119
439 -48119 -49051 -15378 24575 41604 26957 -4010 -26713 -26290 -6963 14657 23321 15064 -2224
452 -2224 -16609 -20017 -11535 3428 17213 22502 15408 -1584 -19432 -26640 -16308 6756 27240
465 27240 29157 8576 -20550 -35656 -22538 11198 39938 38738 5057 -37054 -53577 -28384
477 -28384 21906 58698 51167 2662 -50032 -64474 -27355 33019 68298 48374 -12338 -65262
489 -65262 -66269 -12295 54492 79864 41364 -31950 -81867 -67534 780 69183 82924 30729
501 30729 -45668 -84959 -55494 18602 77562 73479 9450 -62870 -85074 -39003 38484 85696
513 85696 64951 -6830 -72522 -80609 -25853 47213 80611 49207 -20000 -71013 -63854 -5976
525 -5976 54926 70174 28685 -35032 -69998 -49352 8893 58080 60535 16492 -37608 -59686
537 -59686 -34787 14681 48949 42782 3807 -35341 -44515 -18591 19940 41189 30344 -2062
549 -2062 -30513 -34860 -14233 14128 29893 23630 2474 -17462 -23263 -12776 5145 18279 18676
562 18676 6847 -9136 -19464 -17323 -3271 14308 24179 18569 -359 -20836 -28248 -15664 9473
575 9473 29530 28517 5400 -23414 -35459 -19500 13883 38971 34414 1251 -35993 -47381 -21502
588 -21502 23362 52495 41578 -2575 -46055 -53980 -18939 31955 57791 36736 -15108 -56093
600 -56093 -52207 -4947 48120 63934 28315 -31419 -67702 -50953 6379 58766 64599 19096
612 19096 -41305 -68376 -40468 19616 63532 55844 2856 -52804 -66342 -26867 33981 67720
624 67720 47713 -9652 -58679 -60978 -15700 40468 63086 35341 -19258 -56830 -48321 -2031
636 -2031 44116 53846 20762 -27330 -52191 -35368 8017 42940 42805 9654 -28795 -42627 -22902
649 -22902 12837 36220 30196 1786 -25744 -31786 -13622 13066 27973 21219 -21 -19102 -22734
662 -22734 -10196 8052 19056 16330 3160 -10794 -16498 -11152 1233 12794 16238 9254 -4034
675 -4034 -15464 -17034 -6496 9996 21244 18229 1421 -18062 -25627 -14014 9641 28021 26106
688 26106 3433 -23510 -33593 -17234 14252 36410 30519 -553 -33204 -40960 -15931 23337
700 23337 45774 32249 -7896 -43353 -45362 -11163 32693 50941 28326 -17579 -50170 -42705
712 -42705 -596 42336 51354 18354 -30287 -55452 -36241 12414 51653 49856 8020 -40614
724 -40614 -57287 -28557 22510 55298 43825 -2392 -46222 -52766 -17103 31737 54811 33842
736 33842 -14028 -50362 -46515 -5976 38707 52401 24955 -21047 -49281 -38365 1719 38626
748 38626 43942 14987 -24066 -42480 -26955 8638 35727 33916 6136 -24712 -35168 -18514
760 -18514 10823 30166 25930 3207 -19793 -26454 -13346 7950 21663 18840 3114 -13242 -18977
773 -18977 -11123 3854 15447 16307 6543 -7064 -15793 -13984 -2804 10719 17652 12982 -928 -14945
787 -14945 -18986 -9115 8567 21639 19332 1959 -18558 -26560 -14286 10400 29189 26613 2858
800 2858 -24755 -34684 -17801 13901 36035 30265 -54 -31736 -39182 -15377 21622 42469 29568
813 29568 -7942 -40619 -42016 -10049 30472 47416 26748 -15580 -45992 -40190 -2546 36895
825 36895 46596 18758 -24314 -48093 -33259 8373 43413 43772 8969 -33203 -49128 -26050 17528
838 17528 46918 39020 437 -37882 -45597 -17042 24481 45765 30252 -8928 -40293 -38961 -6613
851 -6613 30415 42846 21221 -16470 -40283 -32030 834 31832 37143 13727 -18923 -35283 -23590
864 -23590 5466 28542 28310 6378 -18976 -28300 -15265 8633 24781 21444 2499 -17013 -22773
877 -22773 -11669 6883 19120 16826 3177 -11163 -16136 -9366 3392 12790 12710 3910 -7141 -12963
891 -12963 -9785 180 10488 14256 8712 -3002 -13462 -15290 -6521 7451 17000 14684 1194 -14046
905 -14046 -19397 -9719 8535 21502 18038 -608 -20885 -26460 -11415 13950 30178 23618 -1830
918 -1830 -27129 -32099 -12240 17487 33718 22866 -7006 -32074 -31854 -5598 26197 37955 19407
931 19407 -15550 -39661 -33259 -986 32283 40348 16813 -19549 -40112 -28562 5602 34997
943 34997 35915 7561 -27298 -40644 -21497 15084 40295 34129 1407 -31923 -39974 -16882 18430
956 18430 38232 27441 -4474 -31642 -32657 -7408 23371 35283 19249 -11502 -32801 -28336
968 -28336 -2507 24334 31793 15215 -11427 -27550 -21726 128 20383 23771 8797 -11947 -22581
981 -22581 -15600 2902 18642 20232 7351 -9888 -19165 -14477 -159 13021 16186 8009 -4862
994 -4862 -13294 -11680 -1755 9117 13277 7881 -3276 -12559 -13359 -4708 7861 15638 12884 793
1008 793 -12408 -17368 -9855 5105 16730 15921 2588 -13416 -19628 -10425 7855 21014 18006 40
1022 40 -19504 -25067 -11248 12018 26875 21089 -1504 -23529 -27601 -10026 15537 28884 18950
1035 18950 -6633 -27613 -26849 -4446 22181 31695 16087 -12720 -32239 -26787 -396 26306 32279
1048 32279 12890 -16498 -32578 -22509 5450 28894 29132 5867 -22244 -32693 -17101 12235
1060 12235 32049 26856 780 -25332 -31183 -12553 15291 30373 21207 -4207 -25310 -25713 -5477
1073 -5477 18760 27920 15097 -9113 -25777 -22173 -1846 19177 24993 11980 -9014 -21850 -17336
1086 -17336 3 16253 19224 7372 -9518 -18472 -13013 2113 15337 17104 6483 -8246 -16450
1099 -16450 -12749 -482 11203 14320 7320 -4204 -11910 -10685 -1816 8079 11961 7082 -3198 -11591
1113 -11591 -12134 -4004 7460 14273 11238 -58 -11854 -15649 -8237 5394 15210 13512 1229 -12711
1127 -12711 -17241 -8165 8010 18744 15037 -1160 -17673 -21522 -8776 11241 23115 17238 -2144
1140 -2144 -20258 -22722 -7363 13960 24270 15016 -6603 -23678 -22237 -2837 19462 26988 13376
1153 13376 -10997 -27201 -22322 -15 22311 26989 10386 -14291 -27401 -18508 5392 25096
1165 25096 24894 4781 -19250 -28095 -14668 10325 27281 22816 787 -21227 -26000 -10162 13241
1178 13241 25771 17662 -3963 -21881 -22068 -4786 15922 24011 13332 -7100 -21370 -18722 -1887
1191 -1887 15717 20638 9739 -7930 -18633 -14592 418 14430 17005 6683 -8107 -16154 -11885
1204 -11885 864 12236 13958 5489 -6405 -12933 -9810 168 9364 11329 5131 -4459 -10705 -9415
1218 -9415 -1749 6922 10699 7144 -1453 -9199 -10761 -4850 4584 10884 9326 594 -9187 -12657 -6586
1233 -6586 5008 13504 12011 811 -11874 -16348 -8438 6346 16801 14474 675 -14082 -18202
1246 -18202 -7927 8846 19025 14020 -2533 -17825 -19443 -5537 13424 22417 14005 -5655 -21319
1259 -21319 -20546 -3703 16085 23227 11948 -8839 -22548 -18097 1134 19764 22925 7578 -14050
1272 -14050 -24887 -16089 5472 22917 22473 4656 -16269 -23877 -12428 8562 22305 18003 -546
1285 -546 -18272 -21045 -6843 12864 22482 14564 -4259 -19373 -19162 -4387 12980 19820 11297 -5134
1299 -5134 -16521 -14378 -1057 12482 15733 6560 -7486 -15470 -11483 944 12275 14175 5704
1312 5704 -6181 -12921 -9957 -376 8375 10125 4328 -4067 -8861 -6869 -10 6558 8201 3917 -3188
1327 -3188 -8284 -8167 -2746 4549 8974 7498 1024 -6320 -9513 -6204 1667 8313 8688 2075 -6654
1342 -6654 -10736 -6324 3714 11861 11248 1505 -10503 -15390 -8778 4737 15192 14205 2271 -11498
1356 -11498 -16308 -8123 6651 16254 12652 -1655 -15451 -17297 -5014 12032 20522 13224 -4599
1369 -4599 -19255 -19137 -4195 13945 21043 11398 -7132 -19632 -15981 1050 17653 20268 6365
1382 6365 -13002 -22440 -14222 5434 20998 20405 4236 -14627 -21381 -11058 7596 19568 15584
1395 15584 -834 -16212 -18134 -5299 11902 19859 12334 -4678 -17733 -16971 -3499 11867 17420
1408 17420 9448 -5088 -14706 -12111 -163 11286 13238 4450 -7738 -13795 -9193 2120 11455
1421 11455 11914 3785 -6394 -11109 -7639 651 7173 7532 2299 -4021 -6646 -4097 1249 5354 5506
1436 5506 1850 -3051 -6148 -5606 -1855 3131 6335 5810 1637 -3811 -7007 -5548 -182 5465 6992
1451 6992 2879 -4059 -8348 -6160 1610 9185 10256 3145 -7393 -13297 -9404 1901 12301 13594
1465 13594 4389 -8295 -14522 -9075 4049 14261 13067 799 -12993 -16910 -7172 9146 19216
1478 19216 14612 -1543 -16775 -18984 -6237 11455 20017 12387 -5254 -18526 -16497 -567 16441
1491 16441 20602 8155 -11135 -21984 -15484 3173 19305 20172 5429 -13033 -20435 -11201 6751
1504 6751 18864 15270 -802 -16275 -18589 -5905 11586 19965 12749 -4067 -17284 -16788 -3563
1517 -3563 11417 16499 8167 -6069 -14606 -10880 1676 12492 12932 2811 -9378 -14210 -8135 3617
1531 3617 11878 10642 1817 -7299 -9876 -4748 3057 7186 4921 -1153 -5766 -5513 -1057 3847 5514
1546 5514 3386 -732 -3791 -4302 -2699 -261 1846 2927 2866 1443 -966 -3048 -3354 -1162 2140 4059
1562 4059 2541 -1690 -5358 -5031 -61 6103 8507 4373 -3779 -10005 -8945 -737 8519 11542 5444
1577 5444 -5174 -11785 -8648 2115 11923 12372 2299 -10552 -15667 -8157 6585 16958 14395 374
1591 374 -14070 -17341 -6605 9557 18037 11735 -4385 -17182 -15901 -1226 15164 19857 8550
1604 8550 -9807 -20745 -15366 2073 17777 19232 5457 -12264 -19738 -11040 6499 18633 15409
1617 15409 -514 -16270 -19077 -6694 10997 19976 13176 -3665 -17278 -16975 -3592 11829 17099
1630 17099 8403 -6756 -15919 -11968 1498 13386 14223 3671 -9518 -14997 -8801 3587 12362
1643 12362 11078 1502 -8246 -10831 -4866 4047 8810 6130 -1116 -6824 -6922 -1838 4009 6270 3907
1658 3907 -690 -4151 -4337 -2011 897 2509 2504 1479 -9 -1358 -2187 -1916 -261 2089 3506 2373
1674 2373 -1031 -4396 -4766 -1091 4329 7298 4878 -1796 -7804 -8120 -1745 6626 10342 5864 -3644
1689 -3644 -10702 -9130 356 10318 12467 4396 -7775 -14294 -9344 3522 14209 13867 2321 -11324
1703 -11324 -15994 -7611 7134 16438 12368 -1894 -14901 -16030 -3966 11572 18076 10076 -6090
1716 -6090 -17532 -14975 -431 14400 17528 6455 -9811 -18152 -11762 4113 16544 15560 2013
1729 2013 -13238 -17895 -8222 7734 17230 12688 -1884 -14621 -15435 -3853 10373 15889 8301 -5819
1743 -5819 -14952 -11951 372 11913 13516 4391 -7793 -13207 -7998 3096 10953 9612 732 -8167
1757 -8167 -10019 -3920 4745 9071 6003 -1402 -7103 -6839 -1538 4221 6080 3243 -1443 -4166 -3303
1772 -3303 -239 2347 2605 1038 -689 -1275 -861 -330 -91 179 1005 1882 1817 -4 -2589 -3785 -1941
1789 -1941 2159 5323 4667 68 -5227 -6654 -2413 4486 8294 5410 -2389 -8948 -8450 -655 8527
1804 8527 11377 5009 -5815 -12498 -9098 1824 11779 12315 2770 -9420 -14114 -7247 5945 14630
1818 14630 11583 -1166 -13401 -15100 -4599 9740 16455 9915 -4673 -15575 -13953 -1012 12687
1831 12687 15997 6139 -8880 -16897 -11313 3428 15435 14940 2411 -12030 -16801 -8121 6735
1844 6735 15782 11908 -1581 -13523 -14284 -3568 9767 14905 7837 -5353 -13984 -11290 136 10882
1858 10882 12621 4312 -6978 -12072 -7285 2871 10122 8908 733 -7480 -9317 -3677 4437 8531
1872 8531 5711 -1062 -6385 -6203 -1343 3981 5574 2875 -1588 -4059 -3002 159 2655 2648 903 -896
1888 -896 -1395 -742 -43 45 -5 473 1453 1788 632 -1641 -3163 -2070 1245 4218 4115 360 -4282 -5760
1906 -5760 -2408 3653 7324 5143 -1678 -7772 -7821 -1241 6860 9894 4836 -4495 -10543 -8134 1192
1921 1192 9981 10759 2624 -8046 -12567 -6915 4605 12775 10598 -272 -11280 -13369 -4697 7854
1935 7854 14184 8896 -3755 -13591 -12531 -1247 11113 14594 6038 -7525 -15203 -10729 2368 13431
1949 13431 13477 2632 -10308 -14819 -7327 5972 14223 10778 -1437 -12316 -13213 -3511 8761 13736
1963 13736 7601 -4321 -12446 -10323 -137 9698 11446 3957 -6278 -11015 -6746 2670 9597 8675
1977 8675 1051 -6939 -8930 -3854 3915 8074 5700 -776 -6000 -5935 -1297 3995 5587 2782 -1789
1992 -1789 -4279 -3190 253 2953 2970 895 -1290 -1837 -883 320 673 287 110 606 1053 575 -908
2009 -908 -2236 -1797 653 3127 3351 511 -3219 -4702 -2160 2650 5802 4301 -1104 -6243 -6524 -1324
2025 -1324 5423 8175 4204 -3553 -8886 -7188 511 8117 9235 2674 -6477 -10780 -6363 3489 10768
2040 10768 9346 154 -9609 -11915 -4640 6464 12434 8259 -2830 -11932 -11446 -1681 9535 12970
2054 12970 5793 -6276 -13385 -9765 1807 11842 12259 2657 -8956 -13303 -6835 5077 12710 9993
2068 9993 -746 -10673 -11774 -3401 7550 12292 7006 -3579 -10963 -9309 -189 8750 10427 3863
2082 3863 -5414 -10033 -6349 2186 8658 7993 1166 -6108 -8029 -3526 3513 7323 5144 -880 -5591
2097 -5591 -5502 -1069 3877 5310 2646 -1690 -4061 -2999 185 2675 2736 842 -1101 -1504 -647 315 505
2114 505 121 -56 367 944 622 -736 -1882 -1433 643 2730 2718 161 -3154 -4293 -1899 2509 5297
2131 5297 3894 -1022 -5551 -5881 -1398 4533 6944 3541 -3125 -7652 -6084 639 7193 8107 2154
2146 2154 -6011 -9790 -5796 3012 9577 8507 465 -8268 -10435 -4121 5582 10849 7154 -2535 -10457
2161 -10457 -9974 -1304 8546 11630 5297 -5320 -11738 -8705 1246 10064 10705 2633 -7370 -11267 -5880
2176 -5880 4233 10840 8628 -382 -8986 -10274 -3250 6134 10445 6381 -2454 -8943 -7977 -679 6925
2191 6925 8671 3476 -4288 -8305 -5441 1671 7242 6971 1332 -4891 -6903 -3323 2608 5973 4483
2206 4483 -320 -4248 -4379 -988 2958 4178 2073 -1386 -3426 -2471 93 2169 2312 913 -655 -1236
2222 -1236 -830 -184 -56 -106 114 644 1038 441 -848 -1820 -1410 436 2177 2168 -44 -2731 -3484 -1384 2277
2241 2277 4466 3096 -1107 -4927 -5061 -1196 3876 5955 3178 -2472 -6344 -5117 397 5825 6551
2256 6551 1722 -4969 -7985 -4600 2756 8172 7108 188 -7103 -8776 -3384 4804 9138 6035 -2117
2271 -2117 -8588 -8045 -828 7247 9548 4045 -4770 -9837 -6903 1554 8791 9006 2011 -6419 -9483
2286 -9483 -4817 3725 9215 7201 -453 -7610 -8500 -2442 5531 9046 5411 -2387 -7944 -6978 -502
2301 -502 6253 7816 3191 -3709 -7231 -4795 1468 6396 6092 1046 -4482 -6226 -2966 2429 5548
2316 5548 4208 -221 -4024 -4295 -1278 2358 3782 2115 -1004 -2940 -2379 -162 1803 2140 887 -637
2332 -637 -1388 -1170 -489 33 342 618 822 669 -104 -1269 -1823 -1085 759 2168 1962 -94 -2477 -3163
2350 -3163 -1276 1959 3881 2625 -1036 -4386 -4469 -925 3669 5526 2960 -2256 -6033 -5013 50
2365 50 5332 6301 2097 -4075 -7159 -4463 2057 7082 6466 425 -6132 -7839 -3192 4237 8331 5767
2381 5767 -1507 -7560 -7479 -1294 5971 8414 4115 -3530 -8128 -6140 936 7266 7744 2012 -5195 -8159
2397 -8159 -4420 2904 7822 6512 66 -6147 -7332 -2506 4245 7515 4745 -1618 -6429 -5873 -566
2412 -566 5041 6451 2738 -2987 -5988 -4089 1057 5109 4921 922 -3636 -5016 -2391 1893 4417
2427 4417 3289 -209 -3225 -3427 -1064 1787 2804 1546 -760 -2227 -1886 -194 1260 1489 616 -484
2443 -484 -1118 -992 -478 -35 301 554 714 467 -218 -1117 -1456 -754 688 1722 1388 -281 -2075 -2380 -746
2462 -746 1793 3033 1902 -1097 -3540 -3377 -427 3104 4279 2009 -2110 -4694 -3604 619 4537
2477 4537 4846 1144 -3803 -5762 -3101 2323 5992 5046 -44 -5121 -6094 -2038 3833 6584 4084 -1726
2493 -1726 -6203 -5591 -291 5379 6895 2943 -3312 -6898 -4938 944 6063 6367 1684 -4201 -6517
2508 -6517 -3452 2505 6349 5193 -202 -5342 -6188 -2070 3685 6531 4291 -1201 -5506 -5240 -927
2523 -927 3945 5397 2492 -2260 -4947 -3566 616 4235 4299 1107 -2971 -4412 -2633 1037 3594 3224
2539 3224 458 -2291 -3073 -1518 948 2276 1688 -166 -1741 -1944 -815 743 1551 1219 174 -955
2555 -955 -1458 -1128 -307 556 1056 949 265 -653 -1290 -1121 -150 1006 1482 806 -773 -2020 -1842 -119 1950
2574 1950 2735 1402 -1221 -3154 -2790 -164 2743 3592 1565 -1814 -3827 -2653 822 3873 3861 709
2590 709 -3274 -4684 -2352 2139 5081 4167 12 -4185 -4942 -1743 2951 5256 3350 -1224 -4826 -4377
2606 -4377 -258 4252 5459 2461 -2626 -5589 -4172 596 4912 5351 1654 -3165 -5287 -3094 1627
2621 1627 5010 4282 145 -4160 -4997 -1831 2861 5228 3542 -873 -4489 -4480 -1119 3045 4441 2366
2637 2366 -1533 -3987 -3149 105 3110 3498 1060 -2184 -3712 -2385 608 2859 2847 740 -1711 -2720
2653 -2720 -1746 342 1931 1769 307 -1327 -1844 -1095 411 1453 1443 415 -832 -1522 -1331 -364 818
2670 818 1332 1102 117 -940 -1368 -957 214 1273 1475 527 -1031 -1915 -1422 370 2081 2432 952 -1468
2688 -1468 -2911 -2103 384 2715 3063 998 -1936 -3307 -1961 1095 3480 3064 188 -3016 -3847 -1548
2704 -1548 2115 4282 3182 -407 -3617 -3925 -1038 2699 4270 2522 -1320 -4004 -3414 -18 3578
2719 3578 4345 1792 -2237 -4489 -3179 668 4003 4142 1073 -2765 -4351 -2448 1380 4013 3339 3
2735 3 -3384 -4002 -1506 2182 4046 2691 -707 -3523 -3569 -899 2259 3455 1897 -1090 -3113 -2644 -215
2752 -215 2238 2819 1129 -1371 -2823 -2165 21 1962 2367 951 -1076 -2224 -1768 -89 1439 1785
2768 1785 780 -820 -1712 -1422 -134 1215 1642 912 -433 -1518 -1554 -597 801 1618 1330 120 -1194
2785 -1194 -1624 -934 555 1703 1629 323 -1322 -2063 -1175 752 2262 2189 427 -1758 -2586 -1415 954
2802 954 2717 2426 275 -2101 -2754 -1170 1510 3139 2299 -373 -2766 -2983 -820 2151 3504 2181
2818 2181 -827 -3097 -2965 -492 2431 3405 1668 -1333 -3324 -2613 238 2923 3418 1147 -2005 -3664
2834 -3664 -2429 715 3216 3182 648 -2339 -3453 -1874 1165 3169 2583 -102 -2687 -3155 -1172 1659
2850 1659 3106 2109 -542 -2728 -2813 -853 1579 2656 1609 -669 -2336 -2170 -468 1546 2270 1132
2866 1132 -846 -2210 -1907 -307 1465 2058 1142 -580 -1821 -1746 -400 1095 1716 1055 -392 -1437 -1440
2883 -1440 -346 986 1589 1095 -218 -1404 -1548 -674 744 1702 1466 256 -1190 -1697 -937 582 1784
2900 1784 1658 298 -1321 -1926 -1021 915 2238 1953 158 -1767 -2347 -1086 1127 2598 2074 -6
2916 -6 -2031 -2452 -836 1506 2689 1838 -517 -2475 -2543 -511 1939 2920 1667 -903 -2742 -2460 -200
2933 -200 2173 2865 1313 -1351 -2877 -2176 243 2519 2711 797 -1853 -3018 -1885 737 2676 2435
2949 2435 295 -2083 -2789 -1347 1104 2524 1916 -253 -2206 -2452 -819 1345 2339 1530 -476 -2046
2965 -2046 -2022 -520 1309 2016 1118 -546 -1792 -1662 -338 1161 1737 1015 -475 -1582 -1479 -337 1004
2982 1004 1543 935 -309 -1293 -1315 -334 876 1463 1041 -135 -1141 -1349 -546 653 1462 1291 168 -1015
3000 -1015 -1483 -812 530 1589 1506 357 -1189 -1758 -1015 711 2021 1909 335 -1519 -2226 -1139 945
3017 945 2364 2022 159 -1866 -2361 -951 1317 2565 1877 -323 -2303 -2498 -626 1776 2812 1772
3033 1772 -685 -2559 -2451 -416 1958 2745 1385 -1150 -2750 -2209 101 2344 2697 936 -1624 -2875
3049 -2875 -1989 456 2468 2486 538 -1788 -2715 -1449 815 2335 1918 -89 -2035 -2377 -869 1216
3065 1216 2239 1588 -312 -1955 -2026 -681 1072 1826 1130 -336 -1520 -1443 -308 1001 1470 833 -451
3082 -451 -1369 -1260 -297 823 1348 957 -62 -948 -1068 -481 455 1007 831 71 -654 -905 -439 390 1003
3101 1003 982 261 -680 -1099 -792 166 1075 1289 687 -483 -1208 -1058 28 1142 1471 668 -713 -1611 -1128
3120 -1128 313 1637 1771 571 -1221 -1983 -1244 527 1935 1849 291 -1487 -2043 -986 944 2160
3136 2160 1620 -232 -2002 -2206 -675 1384 2399 1570 -525 -2271 -2113 -412 1608 2362 1102 -1066
3152 -1066 -2442 -1928 140 2009 2299 692 -1608 -2622 -1660 538 2229 2037 240 -1794 -2339 -1079
3168 -1079 979 2196 1615 -358 -2019 -2026 -575 1298 2083 1255 -549 -1808 -1697 -306 1247 1739 847
3185 847 -597 -1555 -1279 13 1216 1463 622 -655 -1326 -1011 59 1051 1274 629 -389 -969 -797 -69
3203 -69 662 906 486 -157 -656 -591 -150 450 826 668 137 -524 -811 -543 182 885 1042 520 -402 -1060 -909
3224 -909 25 1016 1297 576 -629 -1419 -1098 193 1454 1616 581 -1025 -1864 -1296 347 1744 1738 392
3242 392 -1358 -1988 -1126 710 1967 1627 -88 -1870 -2198 -896 1197 2287 1589 -440 -2168 -2240 -533
3259 -533 1538 2293 1174 -962 -2375 -1920 44 1934 2249 676 -1486 -2473 -1570 493 2138 1975 215
3276 215 -1725 -2242 -998 1013 2068 1503 -321 -1834 -1855 -458 1281 1981 1149 -528 -1724 -1452 -108
3293 -108 1228 1570 711 -623 -1399 -962 216 1230 1196 353 -744 -1122 -678 339 1039 954 243 -503 -732
3312 -732 -384 189 613 528 176 -164 -347 -188 37 291 408 343 127 -222 -441 -417 -66 476 770 565 -122
3333 -122 -758 -823 -191 663 1051 627 -348 -1127 -1029 -34 1044 1314 568 -782 -1573 -1153 135 1448 1576
3352 1576 436 -1129 -1857 -1149 478 1710 1518 47 -1571 -2008 -840 986 2002 1457 -412 -2018
3368 -2018 -2115 -530 1409 2207 1154 -869 -2166 -1767 28 1822 2048 589 -1400 -2263 -1370 646 2098
3385 2098 1873 192 -1637 -2109 -901 995 1952 1387 -264 -1647 -1681 -315 1272 1839 962 -628 -1645
3402 -1645 -1329 31 1379 1642 671 -686 -1367 -914 277 1201 1128 246 -772 -1021 -435 524 1045 805
3420 805 12 -680 -729 -231 367 600 464 85 -204 -228 -86 57 118 140 130 20 -60 -196 -220 -57 239 490
3442 490 386 -102 -597 -789 -354 375 820 633 -157 -859 -927 -271 645 1067 561 -534 -1315 -1174 -88 1123
3462 1123 1455 578 -844 -1682 -1257 181 1419 1530 290 -1291 -1817 -933 721 1837 1439 -223 -1797
3479 -1797 -1984 -647 1241 2077 1256 -614 -1998 -1731 -87 1651 1986 672 -1215 -2122 -1302 538 1995
3496 1995 1878 282 -1466 -2016 -917 908 1944 1451 -186 -1584 -1636 -285 1321 1887 972 -632 -1726
3513 -1726 -1322 154 1472 1640 557 -855 -1423 -773 482 1345 1111 -8 -980 -1077 -288 744 1109 711
3531 711 -186 -815 -699 2 530 622 202 -240 -416 -156 151 285 157 -93 -185 -101 27 -26 -130 -154 -62 194
3553 194 360 158 -296 -632 -503 17 514 617 112 -567 -909 -494 352 955 715 -244 -1146 -1175 -317 844
3573 844 1364 762 -571 -1517 -1260 -9 1241 1441 417 -1104 -1713 -987 635 1784 1469 -90 -1626
3590 -1626 -1928 -718 1082 1992 1230 -504 -1833 -1625 -21 1530 1925 763 -1066 -2006 -1335 507 1929
3607 1929 1813 344 -1394 -1914 -847 895 1971 1427 -204 -1625 -1627 -291 1394 1926 936 -705 -1683
3624 -1683 -1275 152 1525 1600 480 -926 -1445 -728 629 1411 1096 -124 -1130 -1165 -248 786 1170 617
3642 617 -410 -951 -708 47 650 631 76 -516 -575 -194 272 457 227 -178 -406 -265 -31 170 74 -138 -184
3663 -184 -44 177 220 -117 -421 -515 -191 330 519 209 -366 -744 -557 143 706 683 -44 -827 -1027 -370 690
3684 690 1195 724 -429 -1333 -1187 -94 1151 1395 463 -922 -1522 -961 490 1595 1367 18 -1398
3701 -1398 -1660 -597 1047 1836 1207 -446 -1679 -1557 -110 1446 1893 808 -910 -1825 -1232 429 1786
3718 1786 1754 323 -1333 -1857 -843 896 1964 1412 -133 -1563 -1616 -354 1312 1831 936 -657 -1677
3735 -1677 -1241 182 1463 1526 406 -971 -1472 -737 594 1376 1002 -121 -1094 -1189 -250 790 1097 563
3753 563 -433 -965 -758 19 719 702 120 -488 -698 -321 192 482 231 -256 -476 -262 12 250 140 -187
3773 -187 -342 -188 111 226 102 -293 -483 -216 278 542 330 -268 -749 -664 42 666 782 173 -681 -978
3793 -978 -462 510 1090 740 -306 -1176 -1119 -83 1112 1372 622 -696 -1433 -979 355 1419 1330 189
3811 189 -1162 -1497 -544 948 1675 1158 -349 -1581 -1450 -95 1357 1793 811 -755 -1686 -1153 360
3828 360 1631 1598 245 -1233 -1685 -678 898 1814 1233 -338 -1523 -1503 -212 1275 1685 700 -755
3845 -755 -1551 -1050 327 1431 1345 160 -1143 -1397 -612 679 1310 860 -290 -1156 -1066 -162 833 1047 357
3864 357 -669 -1083 -672 253 798 669 -50 -714 -798 -268 350 567 163 -349 -571 -332 146 428 216 -230
3884 -230 -503 -337 125 373 258 -214 -419 -244 196 495 300 -236 -706 -604 48 695 853 217 -597 -942
3904 -942 -406 459 1019 710 -272 -1035 -966 37 1082 1301 541 -707 -1394 -886 354 1380 1310 193 -1063
3923 -1063 -1402 -529 897 1647 1102 -335 -1500 -1411 -96 1361 1756 763 -829 -1685 -1156 320 1593
3940 1593 1508 191 -1213 -1629 -650 877 1699 1171 -322 -1487 -1410 -200 1164 1517 633 -738 -1504 -997
3958 -997 316 1314 1137 97 -1064 -1357 -601 639 1174 790 -288 -1091 -943 -111 740 935 229 -611
3976 -611 -985 -555 282 819 621 -109 -708 -728 -184 425 562 122 -346 -535 -210 311 519 197 -266 -523
3996 -523 -296 180 538 315 -194 -486 -358 152 553 422 -84 -592 -609 -12 606 786 266 -472 -797 -468
4016 -468 340 881 728 -116 -847 -851 -109 850 1196 540 -509 -1155 -823 250 1191 1199 209 -882 -1251 -513
4036 -513 811 1425 986 -310 -1316 -1279 -130 1171 1514 635 -764 -1525 -1022 349 1428 1284 137
4053 137 -1175 -1541 -595 810 1538 1035 -384 -1469 -1355 -178 1117 1429 545 -786 -1428 -911 337
4070 337 1263 1073 -2 -1089 -1349 -556 638 1233 783 -286 -1138 -1004 -64 806 940 269 -649 -1003 -606
4089 -606 309 819 642 -99 -723 -772 -184 483 602 234 -355 -547 -217 277 528 290 -201 -514 -309 146
4109 146 494 331 -55 -413 -324 91 510 416 -58 -494 -490 2 613 725 248 -425 -741 -395 327 830 610
4130 610 -97 -759 -743 -54 818 1062 427 -525 -1091 -706 320 1121 1064 127 -889 -1158 -434 659 1294 812
4150 812 -413 -1257 -1124 -7 1140 1346 435 -792 -1439 -899 330 1278 1113 1 -1128 -1319 -439 793
4168 793 1354 806 -484 -1408 -1200 -31 1073 1305 437 -728 -1325 -796 344 1095 914 -34 -1000 -1152
4186 -1152 -390 650 1116 653 -312 -1055 -886 -59 742 848 320 -496 -807 -484 317 723 566 -135 -645
4205 -645 -646 -92 513 639 259 -285 -448 -221 192 374 274 -135 -317 -188 168 420 304 -75 -346 -244 113
4226 113 360 360 -37 -331 -315 63 520 544 144 -412 -603 -267 362 699 539 -97 -662 -613 31 643 821 275
4248 275 -562 -961 -530 350 1006 867 57 -877 -1028 -361 635 1090 662 -392 -1113 -937 96 982 1098
4267 1098 284 -764 -1248 -757 359 1127 986 -40 -1023 -1124 -330 671 1132 634 -426 -1182 -991 49
4285 49 1016 1104 346 -646 -1143 -742 250 1005 894 -52 -845 -1006 -294 576 999 511 -335 -940 -734 -26 710
4306 710 793 266 -466 -745 -383 263 724 515 -92 -505 -475 -23 443 528 233 -210 -394 -138 180 339 219
4327 219 -67 -257 -121 132 330 225 -13 -232 -140 103 272 290 -4 -276 -258 47 378 428 68 -362 -465
4348 -465 -213 359 591 338 -176 -609 -536 10 597 680 183 -520 -793 -474 298 844 651 -94 -838 -874 -212
4369 -212 609 969 503 -440 -1024 -788 78 868 916 214 -740 -1067 -608 396 1001 784 -127 -947 -998 -313
4389 -313 658 1041 560 -417 -1014 -843 14 897 924 257 -694 -1034 -538 352 941 765 0 -787 -872 -234 535
4410 535 887 486 -249 -753 -604 56 658 682 178 -420 -638 -268 330 637 506 -26 -386 -404 -85 308 411
4431 411 147 -153 -257 -160 130 315 242 -18 -185 -105 91 167 119 -55 -126 -53 107 235 148 -86 -286 -185 58
4454 58 350 316 -23 -318 -377 -100 256 436 254 -280 -556 -416 115 528 565 24 -528 -758 -381 291 700
4475 700 476 -182 -736 -696 -62 643 787 297 -515 -893 -603 145 798 738 110 -650 -892 -422 421 834 554
4496 554 -189 -811 -810 -135 667 940 443 -407 -904 -710 104 735 813 162 -539 -827 -391 381 856 593 -12
4517 -12 -652 -705 -144 511 725 424 -214 -600 -488 55 501 546 148 -303 -477 -233 261 579 391 15 -318
4538 -318 -368 -95 193 375 208 -81 -158 -114 56 165 101 0 -81 -61 -34 57 62 -18 -45 37 94 112 16 -168 -228 -78
4564 -78 147 233 159 -85 -315 -246 17 275 276 -1 -386 -556 -264 224 512 386 -91 -548 -614 -176 356 576
4586 576 289 -296 -673 -516 28 614 611 106 -534 -799 -466 226 731 609 15 -557 -742 -246 436 703 471
4607 471 -256 -700 -658 -39 614 755 341 -389 -769 -495 103 692 669 184 -405 -660 -237 306 719 537 -54
4628 -54 -522 -517 -92 438 663 399 -114 -486 -382 24 373 429 184 -201 -317 -181 160 363 342 56 -255 -275
4650 -275 -133 87 227 204 16 -123 -104 -68 58 49 20 -49 -27 36 5 -44 -83 -65 38 125 -6 -143 -275 -233 -19
4675 -19 194 227 74 -218 -386 -276 60 295 240 -80 -435 -432 -146 284 408 222 -181 -534 -476 -82 391 521
4697 521 166 -317 -530 -377 134 511 454 34 -419 -580 -257 296 640 478 -27 -535 -576 -116 410 615 334
4718 334 -233 -606 -445 80 574 601 174 -399 -637 -316 234 633 523 39 -412 -501 -130 358 526 342 -112
4739 -112 -435 -373 33 432 492 261 -147 -369 -267 70 323 314 102 -166 -292 -84 72 267 232 17 -163 -184
4761 -184 -90 46 168 117 35 -59 -138 -73 -30 18 52 36 42 -46 -127 -136 -98 41 94 113 -45 -213 -259 -146 57 293 171
4788 171 -83 -321 -370 -93 197 351 151 -171 -460 -396 -21 359 404 110 -305 -490 -316 118 479 439 78
4809 78 -381 -540 -263 262 571 442 -52 -481 -484 -101 381 581 350 -143 -497 -413 53 460 608 185 -248
4830 -248 -468 -321 190 565 498 129 -336 -440 -156 245 550 385 17 -336 -342 -26 300 463 270 -132 -314
4851 -314 -254 -31 278 361 199 -92 -220 -186 0 210 246 57 -99 -177 -149 2 152 180 54 -46 -145 -111 -29
4874 -29 26 39 55 -55 -65 -151 -132 -56 45 119 40 -74 -240 -184 -121 75 203 119 -73 -285 -281 -104 171 263 150
4899 150 -159 -360 -291 13 310 250 64 -281 -436 -279 91 419 405 55 -303 -445 -233 173 432 331 -75
4920 -75 -376 -382 -112 335 500 349 -123 -464 -401 -38 374 539 269 -208 -474 -252 130 475 441 93 -331 -402
4942 -402 -229 249 532 399 63 -323 -364 -132 280 435 230 -76 -283 -199 -6 316 356 172 -139 -263 -242
4963 -242 45 183 230 142 -96 -200 -149 -33 117 118 22 -102 -120 -127 9 40 117 84 -53 -126 -168 -78 -26 21 72 54
4989 54 -55 -162 -216 -131 10 176 113 -55 -271 -260 -64 141 277 156 -143 -366 -357 -57 263 316 140 -238 -408
5012 -408 -288 44 357 385 69 -282 -458 -229 197 497 432 42 -381 -457 -148 283 507 340 -42 -396 -386
5033 -386 -17 394 504 288 -208 -489 -363 113 498 533 133 -270 -453 -225 184 463 361 35 -332 -367 -86
5054 -86 326 489 272 -65 -353 -250 -25 267 356 180 -132 -252 -251 35 214 247 14 -146 -213 -116 65 176
5076 176 146 20 -96 -123 -140 -17 27 17 18 -36 -101 -65 -73 -40 -12 11 0 -21 -118 -215 -113 10 135 135 0 -182 -239
5103 -239 -167 60 266 121 -46 -284 -315 -94 229 346 184 -197 -399 -328 -15 343 385 154 -215 -400 -282
5124 -282 90 424 371 57 -329 -436 -175 225 487 380 -62 -398 -474 -105 365 517 313 -126 -429 -378 64
5145 64 436 538 166 -259 -474 -274 129 481 463 65 -340 -455 -179 250 453 320 -48 -385 -325 -62 334
5166 334 402 205 -161 -338 -226 26 258 277 92 -166 -249 -154 44 186 193 -41 -179 -204 -89 61 147 77 -27
5189 -27 -116 -119 -39 -80 32 -11 -69 -73 -23 -58 -29 -60 -44 42 32 -33 -89 -168 -121 4 161 122 6 -177 -260 -120 46 252
5217 252 186 -49 -297 -295 -103 221 340 205 -173 -362 -325 -57 338 428 150 -252 -377 -229 149 418 392 40
5239 40 -292 -447 -195 275 504 366 -40 -428 -396 -49 383 508 287 -174 -497 -345 95 479 511 151 -273
5260 -273 -458 -265 195 480 372 -21 -381 -385 -108 286 441 270 -158 -399 -336 57 234 331 124 -242 -367
5281 -367 -222 66 277 252 11 -223 -308 -110 112 194 114 -61 -187 -200 -57 78 99 44 -84 -173 -79 -9 19 -9
5305 -9 -35 -11 -63 -18 -32 -66 -71 -42 14 109 54 -33 -194 -172 -17 160 198 43 -165 -271 -128 88 276 208 -9 -295
5331 -295 -279 -63 219 371 223 -150 -334 -275 17 328 418 151 -207 -472 -270 158 497 432 77 -318 -463
5352 -463 -142 254 500 382 -44 -426 -413 -32 439 553 227 -228 -520 -337 115 498 481 70 -319 -451 -220
5373 -220 234 480 368 -64 -428 -367 -51 293 426 148 -187 -445 -303 10 289 322 21 -198 -346 -184 121
5394 121 263 191 -34 -260 -288 -67 167 226 41 -117 -223 -114 34 120 81 -63 -129 -144 14 86 113 -7 -143
5417 -143 -73 48 109 40 5 -131 -103 42 155 142 -42 -151 -181 8 137 262 62 -153 -209 -128 121 309 277
5440 277 -16 -226 -302 -86 264 376 246 -76 -323 -286 34 356 420 164 -216 -404 -241 160 503 432 73
5461 73 -353 -525 -159 287 549 327 -99 -479 -441 -32 430 543 212 -275 -543 -336 114 511 449 20 -365
5482 -365 -516 -200 251 457 313 -127 -444 -436 -79 297 403 153 -215 -420 -319 15 316 318 12 -253 -372
5503 -372 -131 126 311 228 -117 -289 -275 -60 181 249 96 -177 -246 -74 28 203 112 -97 -141 -132 33 159 163
5526 163 25 -63 -63 31 113 89 -33 -107 -93 68 160 139 73 -130 -197 -15 182 264 139 -74 -243 -183 61 287 313
5551 313 43 -194 -313 -135 186 389 282 -44 -373 -290 -40 339 389 169 -220 -464 -308 133 465 461 52
5572 52 -381 -481 -184 259 494 337 -145 -492 -419 -62 403 549 149 -286 -551 -322 78 434 391 27 -373
5593 -373 -492 -239 156 458 282 -134 -470 -418 -106 327 413 178 -233 -452 -311 80 358 327 16 -340 -375
5614 -375 -186 189 350 196 -71 -352 -307 31 264 265 57 -170 -228 -122 120 214 166 -39 -181 -113 52 207
5636 207 189 6 -129 -103 13 183 156 26 -100 -92 3 179 207 114 -79 -151 -89 123 214 141 -25 -228 -191 26
5660 26 249 257 69 -231 -349 -162 173 321 302 -50 -370 -314 -40 308 448 144 -193 -442 -310 125 412 402
5682 402 11 -380 -497 -181 225 487 257 -146 -443 -447 -56 368 458 175 -296 -516 -304 57 432 428 -13 -333
5704 -333 -463 -221 246 497 296 -149 -449 -404 -117 292 454 158 -277 -452 -245 83 361 349 22 -294 -366
5725 -366 -148 203 357 186 -83 -301 -250 41 292 325 70 -142 -252 -88 153 281 181 -48 -183 -122 44
5746 44 185 168 24 -94 -123 -22 163 180 54 -74 -89 -63 96 157 70 -50 -181 -63 100 180 142 -12 -256
5769 -256 -187 -53 183 258 121 -133 -267 -163 98 318 241 -43 -347 -371 -112 240 360 195 -264 -437 -269
5790 -269 95 342 375 11 -396 -447 -190 224 488 296 -120 -468 -448 -83 336 442 162 -275 -453 -321 76
5811 76 420 406 52 -416 -499 -254 253 465 346 -69 -463 -400 -39 378 504 172 -301 -469 -281 137 452
5832 452 421 18 -325 -402 -124 250 367 209 -60 -345 -244 71 321 356 126 -161 -252 -107 176 334 219
5853 219 -42 -197 -140 28 210 197 48 -156 -154 -18 115 219 123 -38 -190 -74 11 151 140 -33 -193 -99 23
5876 23 230 222 -14 -191 -238 -77 189 290 102 -168 -255 -137 80 304 215 -42 -302 -358 -114 211 401 220
5898 220 -189 -433 -311 18 301 308 1 -310 -449 -206 193 443 285 -92 -448 -420 -111 282 437 238 -174
5919 -174 -413 -334 59 447 376 24 -360 -496 -216 253 498 365 -48 -437 -388 -61 351 462 253 -214 -399
5940 -399 -233 164 435 401 17 -345 -340 -120 267 422 283 -62 -272 -254 17 314 362 122 -167 -283 -117 173
5962 173 331 239 -26 -199 -234 -15 178 241 105 -121 -201 -59 122 201 152 -34 -199 -160 35 184 153 -22 -148
5985 -148 -119 -49 140 173 -11 -173 -184 -110 151 205 107 -125 -298 -157 16 249 214 -12 -276 -300 -90 165 270
6008 270 110 -142 -358 -296 -18 262 272 9 -302 -409 -180 210 432 263 -102 -334 -413 -126 277 422 200
6029 200 -162 -409 -331 2 375 352 17 -297 -437 -145 247 483 344 -35 -368 -413 -35 345 481 220 -172
6050 -172 -374 -204 134 409 353 13 -278 -329 -108 247 447 303 -48 -232 -234 -4 269 283 136 -126 -257 -143
6072 -143 106 306 255 14 -205 -242 -56 138 257 89 -108 -202 -129 43 165 109 -45 -199 -170 -26 87 97
6094 97 20 -145 -144 -40 75 148 18 -159 -217 -140 71 137 103 -102 -227 -169 55 202 117 -32 -230 -244 -102 130
6118 130 249 135 -134 -308 -279 40 231 278 64 -245 -315 -132 214 343 211 -29 -330 -330 -64 291 438 201
6140 201 -175 -370 -282 113 375 365 46 -291 -355 -152 253 484 315 -31 -355 -322 -30 361 477 213 -133
6161 -133 -350 -211 82 380 342 85 -266 -332 -63 222 377 246 -55 -302 -261 -37 242 309 121 -144 -291
6182 -291 -168 51 263 268 39 -171 -247 -83 151 195 91 -64 -179 -110 48 141 69 2 -160 -162 -50 52 113 -1
6206 -1 -115 -132 -2 62 100 2 -93 -185 -62 75 99 70 -86 -152 -125 43 129 100 -12 -169 -209 -67 163 254 149
6231 149 -106 -255 -253 -26 194 291 114 -163 -249 -144 163 309 175 -11 -293 -273 11 280 401 260 -137 -336
6253 -336 -225 74 303 350 68 -264 -317 -110 283 376 277 -44 -339 -275 6 293 382 219 -134 -335 -243 55
6275 55 314 310 75 -239 -316 -124 155 361 252 -55 -281 -286 -75 198 318 135 -133 -259 -194 0 241 217 68
6298 68 -182 -250 -69 113 169 89 -49 -192 -137 31 74 87 0 -146 -187 -95 48 60 -5 -56 -65 -68 9 -1 -31 -67 -105
6325 -105 -42 30 86 53 -66 -147 -52 7 89 72 0 -141 -118 -19 132 174 66 -84 -181 -102 47 170 218 72 -121
6350 -121 -189 -68 167 319 180 -47 -206 -244 -2 247 329 151 -84 -260 -172 124 357 312 58 -196 -273 -96
6372 -96 145 295 274 -51 -223 -229 -28 215 297 167 -131 -245 -185 56 255 296 105 -146 -291 -164 119 271
6394 271 295 0 -198 -252 -43 134 257 113 -145 -249 -208 37 178 191 63 -124 -191 -149 21 121 92 -58
6416 -58 -180 -137 -11 61 117 20 -55 -114 -80 -3 -33 77 -1 -68 -12 -18 -15 40 -35 -71 -39 -6 -3 -27 -15 -20 24 31 72 58 -42
6447 -42 -104 -89 -12 119 206 64 -54 -102 -44 73 207 125 -6 -142 -133 -19 158 250 151 -53 -189 -121 34 183
6471 183 201 87 -105 -180 -91 136 243 219 -27 -179 -242 -67 156 252 191 -31 -258 -229 -18 197 253 89 -125
6494 -125 -242 -128 91 226 237 84 -193 -232 -105 86 212 124 -48 -193 -187 -49 121 179 58 -85 -206 -208 -17
6517 -17 118 145 9 -120 -210 -97 1 67 77 4 -104 -78 -89 -14 87 40 6 -122 -90 -60 -27 42 52 9 -16 -18 -41
6544 -41 -8 -20 -3 27 0 13 -30 9 26 -22 40 65 -6 -35 -63 -45 92 128 124 -27 -116 -98 -12 152 191 56 -17 -138
6572 -138 -119 7 192 192 59 -127 -180 -104 78 205 180 24 -101 -170 -70 108 216 93 -59 -168 -144 -55 142
6595 142 205 143 -101 -188 -170 -24 146 207 112 -172 -245 -139 44 150 188 -3 -174 -205 -115 82 178 76 -36 -164
6619 -164 -171 -70 92 139 112 -50 -162 -143 -22 105 56 22 -60 -128 -108 -1 75 66 44 -39 -64 -96 -10 93 75 27 -39
6646 -39 -56 -21 68 61 47 25 19 -67 -72 16 -19 56 41 30 0 -62 -45 22 41 110 58 -45 -78 -81 -4 94 139 77 -73 -91 -73
6677 -73 52 107 158 76 -72 -145 -94 -8 132 125 21 -118 -153 -57 101 203 113 -17 -122 -171 -73 85 181 87 -16
6702 -16 -179 -198 -45 92 192 92 -97 -178 -166 23 195 185 72 -119 -186 -162 33 152 125 6 -128 -143 -79
6725 -79 47 114 95 -65 -145 -123 -47 62 111 75 -28 -141 -82 -54 45 95 75 -14 -110 -75 -10 94 99 90 -23 -103 -97 -27
6753 -27 47 117 28 -15 0 -75 -31 60 86 104 -10 -6 -73 -14 21 99 124 31 -47 -126 -72 -20 100 136 35 -45 -138 -91 47
6782 47 118 158 32 -35 -153 -57 88 191 123 -21 -124 -152 -70 63 119 79 -21 -133 -104 7 127 190 38 -55
6806 -55 -154 -147 -21 99 151 81 -93 -177 -156 29 126 168 44 -131 -195 -132 38 157 132 -25 -146 -162 -68 7 148
6831 148 63 -16 -129 -130 -14 54 128 51 11 -119 -114 39 46 88 55 16 -60 -87 -48 94 73 124 62 -56 -40 -56 33 83
6859 83 52 56 -39 -71 -69 45 92 119 66 -8 -84 -87 26 82 122 95 -47 -41 -101 11 81 127 87 -66 -177 -117 82 170 162
6888 162 87 -123 -162 -101 84 219 167 9 -129 -155 -59 126 193 89 -54 -169 -178 -22 155 216 80 -72 -178
6911 -178 -147 -21 102 143 64 -123 -174 -105 33 177 171 40 -160 -211 -71 76 138 127 8 -77 -123 -84 70 131 101
6936 101 -28 -153 -147 -37 114 146 86 -60 -66 -71 -25 47 53 13 -22 -20 -49 24 66 51 6 12 -48 -53 -27 -7 60 76 7 31 -59
6967 -59 -3 5 86 102 37 4 7 -35 -25 78 105 85 3 -127 -71 -39 62 103 101 -36 -138 -115 -5 121 116 73 -115 -139
6995 -139 -118 30 154 161 37 -151 -240 -147 56 220 171 -21 -154 -173 -67 107 181 83 -60 -230 -204 -35 137
7018 137 188 80 -68 -218 -205 -61 126 155 65 -142 -159 -132 25 185 148 -38 -138 -217 -103 97 223 135 0
7041 0 -154 -151 -11 94 143 69 -51 -143 -112 14 154 108 58 -33 -90 -24 66 111 102 47 11 -17 -31 40 62 77 2 -29 -40
7070 -40 -40 33 56 97 50 38 19 9 -83 -3 26 52 69 -18 -9 -62 -29 31 131 97 22 -74 -107 -72 46 120 120 12 -196 -157
7100 -157 -47 48 171 95 -112 -217 -150 10 170 201 19 -183 -230 -144 40 156 185 -9 -194 -233 -90 99 199
7123 199 136 -53 -185 -234 -9 119 218 48 -98 -178 -182 0 209 225 96 -138 -271 -86 26 217 172 -21 -203
7146 -203 -185 -40 97 222 105 -53 -144 -143 -42 129 134 36 -118 -101 -63 69 132 101 9 -70 -98 7 52 98 70 -1
7172 -1 0 -9 20 24 31 18 1 8 3 11 28 28 57 55 58 25 -4 -39 -67 -10 74 81 45 -61 -81 -87 32 92 90 -12 -82 -146 -100 66 141
7207 141 126 -19 -186 -205 -71 107 154 87 -77 -223 -177 10 161 178 34 -191 -258 -158 17 196 154 12 -238
7230 -238 -301 -118 67 217 101 -68 -240 -235 -55 187 243 65 -126 -304 -208 33 193 206 49 -174 -270 -129
7252 -129 102 230 187 -22 -219 -200 -95 174 246 134 -89 -161 -122 37 181 188 77 -63 -107 -43 23 168 120 40
7276 40 -129 -112 -6 99 88 68 -45 -60 -38 23 97 48 -18 -64 -25 21 34 93 57 -12 -24 32 51 32 10 -60 -90 -35
7304 -35 36 114 2 -82 -113 -32 85 129 44 -77 -181 -124 44 104 171 1 -158 -215 -97 56 133 100 -73 -202 -203
7329 -203 -40 111 187 66 -142 -287 -201 13 178 199 55 -205 -257 -164 79 242 164 2 -218 -287 -33 188
7351 188 263 131 -148 -315 -202 90 254 245 43 -163 -290 -126 173 284 187 -61 -230 -221 -40 193 261 126
7373 126 2 -229 -177 20 217 218 68 -73 -167 -63 90 204 177 39 -150 -129 -49 83 117 97 6 -78 -52 30
7397 30 120 102 9 -96 -87 16 99 80 21 -51 -71 36 42 35 31 -72 -74 19 39 103 1 -55 -140 -91 17 63 47 -81 -119
7426 -119 -106 -36 163 109 -17 -166 -192 -79 61 171 114 -75 -229 -215 -63 120 203 94 -92 -274 -242 9 222
7449 222 232 45 -139 -268 -172 90 227 236 -26 -245 -251 -35 175 310 194 -88 -303 -220 29 243 340 134 -149
7472 -149 -235 -146 149 292 210 21 -186 -220 -36 188 283 180 -21 -199 -199 42 205 201 133 -50 -185 -92 87 195
7496 195 188 -2 -135 -151 30 111 137 91 9 -76 -94 8 127 68 7 -95 -93 -41 94 123 -14 -86 -99 -14 12 44 -12
7523 -12 -48 -100 -56 65 63 0 -82 -135 -84 16 46 53 -44 -141 -121 -35 78 118 33 -123 -171 -138 61 152 137 -44 -174 -221
7551 -221 -75 88 201 138 -105 -208 -170 21 201 238 71 -148 -278 -150 75 255 224 -1 -193 -254 -56 187
7573 187 294 163 -59 -258 -215 8 241 287 65 -166 -260 -124 109 269 218 21 -167 -206 -88 142 270 164
7595 164 -72 -248 -170 8 217 251 122 -101 -190 -123 101 238 187 15 -151 -183 -7 132 160 136 -87 -151 -128
7618 -128 29 129 115 -14 -130 -122 -50 80 121 45 -71 -110 -43 23 92 -29 -66 -116 -26 -14 60 7 -38 -73 -83 4 110
7645 110 87 -20 -156 -147 -41 34 104 42 -56 -174 -163 -26 150 130 13 -132 -225 -114 113 216 180 -31 -247 -194
7669 -194 11 239 294 85 -139 -266 -193 146 238 264 39 -188 -268 -43 197 298 228 -72 -219 -209 40 254
7691 254 281 157 -106 -227 -155 97 222 205 64 -181 -272 -84 146 271 175 -46 -228 -187 -17 179 246 174 -137
7714 -137 -197 -100 59 251 158 -32 -164 -203 -71 133 204 72 -103 -176 -137 15 126 104 -17 -95 -115 -34 64 70 0
7739 0 -27 -135 -56 9 88 16 -40 -95 -58 -3 71 66 -26 -148 -77 -4 56 100 25 -96 -164 -60 55 86 119 -74 -185 -173
7767 -173 -2 132 205 73 -101 -207 -105 46 197 159 -20 -191 -183 -36 190 234 146 -87 -254 -168 94 237
7789 237 227 63 -146 -212 -101 158 263 133 -79 -220 -212 -33 161 254 153 -146 -222 -153 34 223 242 49 -186
7812 -186 -235 -110 113 265 158 -34 -227 -180 -40 174 269 87 -130 -284 -157 50 168 142 13 -172 -191 -26
7834 -26 117 150 83 -51 -176 -156 0 89 114 15 -68 -146 -94 57 75 73 -63 -80 -96 -38 36 86 -17 -86 -83 -26 51 70
7862 70 24 -76 -147 -87 53 76 58 -46 -90 -96 22 138 138 -3 -110 -144 21 136 159 86 -80 -157 -150 125 217 123
7888 123 -34 -170 -190 -63 150 220 82 -54 -178 -125 32 199 189 28 -153 -206 -84 84 248 196 9 -195
7910 -195 -207 -37 160 253 192 -89 -175 -187 52 233 249 49 -145 -257 -97 96 259 161 4 -203 -221 -45 159
7933 159 264 74 -108 -198 -155 38 187 188 14 -137 -201 -118 41 165 114 -11 -141 -85 -46 57 152 26 -73 -152
7957 -152 -69 12 85 113 21 -96 -80 -40 63 98 49 -83 -112 1 64 71 72 -35 -57 -65 91 146 15 -92 -103 -70 86
7984 86 113 90 -62 -118 -119 -16 134 182 100 -54 -91 -42 79 133 145 37 -132 -168 -49 117 158 93 -27 -164 -137
8009 -137 -25 202 179 89 -107 -205 -124 58 231 180 -6 -158 -230 -129 85 211 115 -61 -189 -188 -3 173 222
8032 222 19 -177 -300 -124 105 206 160 -15 -214 -179 -81 145 188 89 -73 -190 -129 51 172 187 8 -124
8054 -124 -169 -100 90 151 117 7 -109 -108 -52 135 139 70 -20 -123 -58 42 139 99 -23 -106 -118 -37 71 103 61 -65
8080 -65 -84 -51 60 93 42 -2 -72 -93 41 98 78 8 -47 -81 40 59 124 22 -64 -111 -13 57 135 91 -15 -110 -93 39
8108 39 105 140 -11 -102 -161 -64 23 158 115 -35 -172 -148 -49 117 174 77 -97 -175 -162 50 173 180 5 -211 -224 -87
8134 -87 97 184 98 -57 -220 -154 25 181 196 69 -117 -202 -116 67 161 144 27 -164 -189 -78 113 185 76 -77
8158 -77 -180 -162 2 130 167 25 -128 -133 -93 39 166 98 19 -136 -106 -42 132 165 133 -13 -140 -99 9 134
8182 134 178 76 -22 -73 -32 54 123 19 4
8191D
##END NTUPLES=NMR FID
##END=
