##TITLE=1H_BAU-DGA-1
 CDCl3, 108 sc, 
 1.8.2019
##JCAMPDX= 6.0         $$ Bruker NMR JCAMP-DX V2.0
##DATA TYPE= NMR FID
##DATA CLASS= NTUPLES
##ORIGIN= UXNMR, Bruker Analytische Messtechnik GmbH
##OWNER= root
$$ XWIN-NMR		Version 3.5
$$ Thu Aug  1 13:54:17 2019 Russian Standard Time (UT+4h)  she@DPX200
##.OBSERVE FREQUENCY= 200.13155
##.OBSERVE NUCLEUS= ^1H
##.DELAY= (6, 6)
##.ACQUISITION MODE= SIMULTANEOUS
##.ACQUISITION SCHEME= undefined
##.AVERAGES= 8
##.DIGITISER RES= 18
##SPECTROMETER/DATA SYSTEM= spect
##.PULSE SEQUENCE= zg30
##.SOLVENT NAME= CDCl3
##.SHIFT REFERENCE= (INTERNAL, CDCl3, 0, 15.7039)
##AUDIT TRAIL= $$ (NUMBER, WHEN, WHO, WHERE, WHAT)
$$ ##TITLE= Audit trail, XWIN-NMR		Version 3.5
$$ ##JCAMPDX= 5.01
$$ ##ORIGIN= Bruker BioSpin GmbH
$$ ##OWNER= she
$$ F:/spectra/data/she/nmr/H-F/1/audita.txt
$$ ##AUDIT TRAIL=  $$ (NUMBER, WHEN, WHO, WHERE, WHAT)
(   1,<2019-08-01 13:51:20.39 +0400>,<she>,<DPX200>,
      <created by zg, POWCHK disabled, PULCHK disabled
       configuration hash MD5:
       00 E9 B6 7A A2 85 ED C7 34 08 36 98 17 FE 4E 26
       data hash MD5: 16K
       8C DE E8 4B 3F 79 80 93 A6 FA B8 4D D7 7D 20 70>)
$$ ##END=
$$ 
$$ hash MD5
$$ 70 10 64 F1 5C 3D 4F 66 C6 A8 9D A7 6D 85 E2 B3
##$RELAX= 
##$RELAX= 
##$RELAX= 
##$RELAX= 
##$RELAX= 
##$RELAX= 
$$ Bruker specific parameters
$$ --------------------------
##$DU= <F:/spectra>
##$EXPNO= 1
##$NAME= <H-F>
##$PROCNO= 1
##$TYPE= <nmr>
##$USER= <she>
##$AMP= (0..31)
100 100 100 100 100 100 100 100 100 100 100 100 100 100 100 100 100 100 
100 100 100 100 100 100 100 100 100 100 100 100 100 100 
##$AQSEQ= 0
##$AQ_mod= 1
##$AUNM= <au_zg>
##$AUTOPOS= <>
##$BF1= 200.13
##$BF2= 200.13
##$BF3= 200.13
##$BF4= 200.13
##$BF5= 200.13
##$BF6= 200.13
##$BF7= 200.13
##$BF8= 200.13
##$BYTORDA= 1
##$CFDGTYP= 0
##$CFRGTYP= 5
##$CHEMSTR= <none>
##$CNST= (0..31)
1 1 145 1 1 1 1 1 1 1 1 1 1 1 1 1 1 1 1 1 1 1 1 1 1 1 1 1 1 1 1 1 
##$CPDPRG= <>
##$CPDPRG1= <>
##$CPDPRG2= <>
##$CPDPRG3= <>
##$CPDPRG4= <mlev>
##$CPDPRG5= <mlev>
##$CPDPRG6= <mlev>
##$CPDPRG7= <mlev>
##$CPDPRG8= <mlev>
##$CPDPRGB= <>
##$CPDPRGT= <>
##$D= (0..31)
0 1.2 0 0 0 0 0 0 0 0 0 0.03 0 0 0 0 0 0 0 0 0 0 0 0 0 0 0 0 0 0 0 0 
##$DATE= 1564653079
##$DBL= (0..7)
120 120 120 120 120 120 120 120 
##$DBP= (0..7)
150 150 150 150 150 150 150 150 
##$DBP07= 0
##$DBPNAM0= <>
##$DBPNAM1= <>
##$DBPNAM2= <>
##$DBPNAM3= <>
##$DBPNAM4= <>
##$DBPNAM5= <>
##$DBPNAM6= <>
##$DBPNAM7= <>
##$DBPOAL= (0..7)
0.5 0.5 0.5 0.5 0.5 0.5 0.5 0.5 
##$DBPOFFS= (0..7)
0 0 0 0 0 0 0 0 
##$DE= 6
##$DECBNUC= <off>
##$DECIM= 24
##$DECNUC= <off>
##$DECSTAT= 4
##$DIGMOD= 1
##$DIGTYP= 9
##$DL= (0..7)
0 120 120 120 120 120 120 120 
##$DP= (0..7)
150 150 150 150 150 150 150 150 
##$DP07= 0
##$DPNAME0= <>
##$DPNAME1= <>
##$DPNAME2= <>
##$DPNAME3= <>
##$DPNAME4= <>
##$DPNAME5= <>
##$DPNAME6= <>
##$DPNAME7= <>
##$DPOAL= (0..7)
0.5 0.5 0.5 0.5 0.5 0.5 0.5 0.5 
##$DPOFFS= (0..7)
0 0 0 0 0 0 0 0 
##$DQDMODE= 0
##$DR= 18
##$DS= 0
##$DSLIST= <SSSSSSSSSSSSSSS>
##$DSPFIRM= 0
$$ [...]
##$SUBNAM2= <"">
##$SUBNAM3= <"">
##$SUBNAM4= <"">
##$SUBNAM5= <"">
##$SUBNAM6= <"">
##$SUBNAM7= <"">
##$SUBNAM8= <"">
##$SUBNAM9= <"">
##$SW= 24.9336996594482
##$SWIBOX= (0..15)
0 0 2 0 0 0 0 0 0 0 0 0 0 0 0 0 
##$SW_h= 4990.01996007984
##$TD= 16384
##$TD0= 1
##$TE= 0
##$TE2= 300
##$TE3= 300
##$TEG= 300
##$TL= (0..7)
0 120 120 120 120 120 120 120 
##$TP= (0..7)
150 150 150 150 150 150 150 150 
##$TP07= 0
##$TPNAME0= <>
##$TPNAME1= <>
##$TPNAME2= <>
##$TPNAME3= <>
##$TPNAME4= <>
##$TPNAME5= <>
##$TPNAME6= <>
##$TPNAME7= <>
##$TPOAL= (0..7)
0.5 0.5 0.5 0.5 0.5 0.5 0.5 0.5 
##$TPOFFS= (0..7)
0 0 0 0 0 0 0 0 
##$TUNHIN= 0
##$TUNHOUT= 0
##$TUNXOUT= 0
##$USERA1= <user>
##$USERA2= <user>
##$USERA3= <user>
##$USERA4= <user>
##$USERA5= <user>
##$V9= 5
##$VALIST= <valist>
##$VCLIST= <CCCCCCCCCCCCCCC>
##$VD= 0
##$VDLIST= <DDDDDDDDDDDDDDD>
##$VPLIST= <PPPPPPPPPPPPPPP>
##$VTLIST= <TTTTTTTTTTTTTTT>
##$WBST= 1024
##$WBSW= 4
##$XGAIN= (0..3)
0 0 0 0 
##$XL= 0
##$YL= 0
##$YMAX_a= 360633
##$YMIN_a= -469809
##$ZGOPTNS= <>
##$ZL1= 120
##$ZL2= 120
##$ZL3= 120
##$ZL4= 120
##$ABSF1= 10
##$ABSF2= 0
##$ABSG= 5
##$ABSL= 3
##$ALPHA= 0
##$AQORDER= 0
##$ASSFAC= 0
##$ASSFACI= 0
##$ASSFACX= 0
##$ASSWID= 0
##$AUNMP= <proc_1d>
##$AZFE= 0.1
##$AZFW= 0.1
##$BCFW= 1
##$BC_mod= 2
##$BYTORDP= 1
##$COROFFS= 0
##$CY= 11.3945322036743
##$DATMOD= 1
##$DC= 2
##$DFILT= <>
##$DTYPP= 0
##$F1P= 20.1537800932815
##$F2P= 0.134698688090026
##$FCOR= 0.5
##$FTSIZE= 0
##$FT_mod= 4
##$GAMMA= 1
##$GB= 0.15
##$INTBC= 1
##$INTSCL= 1
##$ISEN= 128
##$LB= 0.24
##$LEV0= 0
##$LPBIN= 0
##$MAXI= 10000
##$MC2= 0
##$MEAN= 0
##$ME_mod= 0
##$MI= 1.114404
##$NCOEF= 0
##$NC_proc= 0
##$NLEV= 6
##$NOISF1= 3.799351
##$NOISF2= 2.8
##$NSP= 1
##$NTH_PI= 0
##$NZP= 0
##$OFFSET= 15.70392
##$PC= 1
##$PHC0= -9215.654
##$PHC1= 7.40097
##$PH_mod= 1
##$PKNL= yes
##$PPARMOD= 0
##$PSCAL= 0
##$PSIGN= 0
##$REVERSE= no
##$SF= 200.130013532006
##$SI= 16384
##$SIGF1= 3
##$SIGF2= 2
##$SINO= 400
##$SIOLD= 16384
##$SREGLST= <1H.CDCl3>
##$SSB= 0
##$STSI= 0
##$STSR= 0
##$SW_p= 3612.71676300578
##$SYMM= 0
##$S_DEV= 0
##$TDeff= 0
##$TDoff= 0
##$TI= <>
##$TILT= no
##$TM1= 0
##$TM2= 0
##$TOPLEV= 0
##$USERP1= <user>
##$USERP2= <user>
##$USERP3= <user>
##$USERP4= <user>
##$USERP5= <user>
##$WDW= 1
##$XDIM= 8192
##$YMAX_p= 0
##$YMIN_p= 0
$$ End of Bruker specific parameters
$$ ---------------------------------
##NTUPLES= NMR FID
##VAR_NAME=  TIME,          FID/REAL,        FID/IMAG
##SYMBOL=    X,             R,               I
##VAR_TYPE=  INDEPENDENT,   DEPENDENT,       DEPENDENT
##VAR_FORM=  AFFN,          ASDF,            ASDF
##VAR_DIM=   8192,          8192,            8192
##UNITS=     SECONDS,       ARBITRARY UNITS, ARBITRARY UNITS
##FACTOR=    0.0002004,     1,               1
##FIRST=     0,             0,               0
##LAST=      1.6414764,     0,               0
##MIN=       0,             -469809,         0
##MAX=       1.6414764,     360633,          0
$$ Real data points
##PAGE= N=1
##DATA TABLE= (X++(R..R)), XYDATA
$$ [...]
1527a14J33M80k31k59k26J99Q6j10J39o9j89KQ3k74p6L30J10L7k04l62L26J84
1549el95J39Q9l0p1k16M75J69o3j33j03K99k23j38O2M41l75K71o7j59lJ44L73
1572D81l28m24M06L70m44j27N04o5n35J17J39J53k26n3K12M7k48R8J31l52j16
1593b60J89K57k03k00l1L80l75j8J26n7M9N3p9R7L5k24K69k0kq1O0j41J22r8L01
1618A49ql86q5L63J01k4N0N3M1l90K1L55n3ko8K13j41l23K81O2m9n3M08m56k29
1643a70j80M90K29l45O6n2J43m76K14Q4r9J24m9L6m25L6K18K75r2l3j13r2n7K8
1667b40K52J25j11j63l08L09Q0l3J11K13j55j60M5m4J03K00Q2kl84M0K28k07m0
1690e9K56M19m09l55K13J76J4j38j8M5k72m2K19Rj59K51J07l13n5J2K6L14k76
$$ y = [-114, 19, 499, 268, 9, -217, -18, 68, -42, 97, 28, -161, -159, -76, -350, -426, -96, 14, 51, -153, -515, -189, -5, -400, -261, -172, -202, -273, -489, -14, 155, 92, -41, -144, 155, -68, -206, -144, 297, -78, 193, 126, -33, -36, 108, 481, 153, -271, 135, 505, 61, -66, 438, 373, -162, -45, 94, 247, 21, -32, 180, 227, -21, 77, 208, -144, -260, -71, 186, -17, -217, -248, 132, -243, -261, -135, -192, -143, -90, -169, -72, -37, -261, 8, -12, -14, -95, -35, -176, -54, -152, 149, 141, -245, -330, 33, 134, 110, 160, 213, 254, -136, -115, 240, 187, 185, 117, 330, 189, -134, 147, 209, 160, 107, 515, 59, -170, -350, 140, 369, 24, 90, 38, 181, -295, -81, 3, -96, 28, -21, 15, -410, -374, -156, 119, 27, -6, -119, -211, -268, -240, 12, 137, 26, -137, -445, -136, -56, -89, 22, 235, 80, -80, -35, -79, 24, 224, 306, 304, -80, -40, 188, -19, -59, 197, 616, 207, -148, 65, 241, 255, 117, 99, 144, -128, -170, 49, 58, -101, 150, 257, -56, -111, -99, -73, 241, -35]
1713c5%L7l64K19k2M4K04rq5k60Q1j38M4K84j76K23Mk10q9R0J66k5K5j77R5J47
1739G3k63J72k46M97j46q9J05Q5j34L4L40j56l09L60J13n38m0M26J28n15J17l7
1761b3K05j63l4O6M0l01J61j1j15j03M55n0m02J19J86j76q7o6L30M4j12k84J02
1784b19J80Q8j14J07j89P9J79l60J30J57J50l17J01J34j42L51l00J75j20J36j7
1805A89l15P0L22L5q3q2K23k60j16J10R1k36n9J78j16p7j35L83j38o7J64j01q6
1828a06k25L03Q3L0j08O7o4k44m6K01pL8O0l5%j03L34r5j06j26J19J24j07p1m6
1853a30K26l4K43j99j86J17P5k1rJ76P9k94j62K70P3j88J41m6k16j27M80l4k03
1876C1J08k0k86l59M18K59j41LJ84l13l70K38N5P9KN1j00j85J28J44K51k04k38
$$ y = [-35, -35, 2, -362, -143, -165, -121, 83, 74, -11, -271, -190, -328, -284, 0, -176, 47, 51, -159, -248, -158, 8, -17, 8, -169, -74, 73, -190, -18, -264, 233, 87, -2, 103, 188, 54, 88, 428, 272, -37, 323, 436, -102, -142, 284, 412, -103, 14, -23, 182, 19, -15, 51, 91, -210, -49, -60, -175, -278, 177, 127, -275, -156, 30, -146, -233, -299, 31, 75, -37, -321, -219, -39, 49, -65, 42, -147, -68, 111, -249, -119, 38, 188, -129, -28, 106, -36, 315, 15, 190, 70, 206, 189, -126, -56, 266, 301, 218, 136, 359, 99, -17, 93, 184, -52, -111, 67, -49, -126, -261, 122, -16, -83, 81, -20, -106, -331, -28, 55, 85, -23, 44, -20, -264, -310, -109, -116, -78, -18, -53, -53, -156, 178, 83, -23, -149, -30, 94, -13, -84, -130, 96, 62, 305, 106, -80, 37, 112, 91, 82, 258, 337, 43, -119, 151, 224, 36, 177, 131, -85, -212, 268, 234, 31, 139, 119, -167, -526, -108, 151, 10, 13, 197, -116, -486, -248, -193, -114, -112, -61, -161, -346, -218, -74, 177, -27, -265]
1899b65K87l7j31lL4O6J3K95k90k98L73l5J20J28q1k01L0N3P7j17k1L44k06k35
1923a00R2L88k27l38L58N2l70L9P4J71l74K70O3p3j39O9j8k34Q3K99J5m80J02
1946b78K46j75j2O5J78l67L1J65P8k69J55L34k09j87J77J42Lk89L00P4k26o7N8
1969g3J56K20k83K86j83o4O2Q4q9o8J84J65k38j56l7n1K75O5l27N9p3K48k08k02
1993b48K31J27k60r8L45r8j73J47J09k40m4J74k18j73Q3N17r1k92L1M74m43m8
2015a88J28N8k5j4K21q5p0Q3l7k11l0L64n0k18J45K66m4l45j24L99k36J0K49j75
2039G1N8qk9M2j54J11K3j95J68j18O3j99r0M99k11r9J06k44j29K50J26q6k78L25
2063Bq6k8j01L77j83j16PQ9ml41M97K75n39nL75j37j17NL70j25l0j30rJ42j40
$$ y = [-265, 22, -15, -146, -149, -115, -49, -36, 259, -31, -329, 44, 9, 129, 257, 176, -25, 5, 58, 135, 18, -3, 341, 135, -100, -8, 380, 153, -185, 173, 225, -145, -106, -32, 139, -235, 35, 98, 25, -114, -45, -63, -297, -214, 85, 100, -380, -278, -32, -207, -219, -154, 24, -343, -312, -147, -69, -338, -183, 151, -58, -245, -68, 74, 77, -212, 88, 162, -64, -131, -73, 83, 303, 20, 306, 123, 59, 121, 205, 116, 48, 232, 397, 159, 3, -34, -85, 190, 255, -72, -13, -86, 162, -46, -248, -17, 110, -150, -248, 97, -1, -174, -27, 82, -158, -202, -28, -246, -419, -336, 181, 90, -202, -171, 303, -140, -188, -60, -2, -27, -41, 180, 95, 25, 108, 71, -140, -170, 194, 144, -74, 71, 337, 293, -52, -176, 223, -13, -3, 246, 71, 129, 121, 92, 134, -20, 91, 114, -81, 87, -31, 32, -167, -257, 242, 31, -68, 38, -206, -335, -85, 41, -45, -323, 2, -84, -112, -213, 164, -19, -135, -128, -39, -43, -384, 113, 388, -151, -156, 219, 82, -35, -30, 340, 215, 185, 55, 46, 188, 48]
2088D8J5J06k92J68K13j84k0K27K1j53l19J64J25j10l1J34L6k15L8j84J93j6J0
2111b6Jk10r9M81l75K5J38K7o3J15j11j09K04j21J48k14l3K70r6j85L07J00q0
2134I4j45L49l34O2J28J77j94l00J82K36o7j75Q8J47q9k90K78l6j51J99J5l37
2156a63n5M14n3k83k6M68m41j36L24M3k04j27K02Q6j99k7J81j01j21K61qm08J35
2179b38K76J55k92j7K40j26j7N6N8j39m0J84l4j90L10J73k83l55M09J8j91j00
2201a43M14j85r3M7J01l50J21M06n5k24j81L59k25j87K35J54k17k50J61J32k31
2222b11J10N8q8k70L00J97k11q9L38k0l20K0J52J7l34M77j66jk9J69pl37K87j32
2246i0K31k87K23J44j30j84K06J77m80J71L02l79K11K44J7l78N7l6M1k85M01k
$$ y = [48, 63, 169, -123, 45, 258, 74, 54, 281, 302, 149, -170, -6, 119, 9, -22, 112, 148, -67, -29, -213, -20, -36, -26, -25, -235, -334, 147, -228, -203, -65, -38, -101, 14, -97, -206, -2, -123, 25, -189, -222, 48, -48, -233, 74, 174, 94, -51, 298, -36, 26, 154, 331, 137, -163, 19, 255, 188, 13, 101, 248, 159, -131, 147, 111, -40, 159, 174, -163, -218, 196, 143, -140, -166, 302, -139, -275, 49, 92, -112, -239, -37, 49, -150, -177, 4, -97, -218, 43, 35, -373, -238, 38, 193, -99, -116, 124, -2, -19, 37, 95, -44, -84, 100, 66, -124, 186, 359, 76, -279, 130, 148, -43, -143, 271, 86, -7, 40, 141, -209, -88, 318, 263, 39, -142, 217, -8, -195, 40, 194, -23, -273, -112, 20, -211, -101, -43, -131, -401, -101, 96, -115, -204, 134, 114, -206, -186, -34, -17, -351, 126, -40, -41, -70, 99, 92, -245, 42, -90, 141, -146, 77, 221, 91, -93, 113, 290, -190, -19, 283, -96, 115, 359, 376, -2, 55, 19, 60, -225, 176, 174]
2268A74j99k07L26j89j12L12J45l39l06K06K45l75Q9K39o4k88L36J86l64j09L71
2289G7q8q0mO7J05m30K75M48l91k20K86j51k9R7L11o4j87J05J35k96l7N68j96
2312C01k56N5K27l08o0K10J52m68O7K72n7k25k7N54l57k81K49J24k60j88J93K9
2334e4j76J05O5n4j13K81o9k74KL09j85j22J79M23l21k52L13J8j92j94N90j84
2356I5k66K52J83l08N8K93j87l35K46J25P1l52L06J10j73k13M68j62j70q%K21
2378B54l05L3L04k94p4J87n7k53M4J53j61K4L68l11j47J77L08k13m52J11M81j31
2400D6m07L16K2j45J23Q0q6j14O4L44n21L06J80k0k52k2K18j89RJ34J75j90J21
2423A92K39l14k26J33L09k63OJ53J95o61l9M00q0q1L8L39m51j10J92J30j99j23
$$ y = [174, -25, -232, 94, -95, -207, 105, 250, -89, -395, -189, 56, -319, -230, 9, -55, -343, -7, 179, -185, -294, 77, -11, -91, -95, -28, 77, -353, -78, 370, -21, -241, 45, -106, -135, -38, 273, 209, 22, 127, 262, -34, -71, 497, 301, 45, 100, 327, 19, -41, 169, 321, -147, -80, 192, 135, -90, -117, 437, 80, -201, 48, 172, -88, -276, -83, -54, -230, -125, -60, -114, -227, 54, -15, -289, -287, 22, -163, -285, -106, 317, -4, -256, 57, 75, -117, -311, 279, 95, -171, 81, 264, -44, 14, 307, 120, -215, 31, 156, 227, -125, 181, 291, 118, -95, 373, 211, 41, 33, 33, 254, -51, -18, 286, -8, -82, 105, 48, -205, -161, -8, -169, -145, 223, -88, -235, -58, 250, 37, -415, -304, 177, 46, -361, -45, -23, -168, -45, 35, -51, -165, -101, 243, -278, 28, 208, 188, -64, -86, 132, -57, -48, 86, 261, 71, 192, 431, 117, -109, 24, 333, 70, 76, 229, 424, -237, -276, 124, 44, -37, 1, 340, -111, -221, -29, 101, -98, -221]
2445b21M47j52l18M8J86j64n4J56j25l1O6J75K2l86L46M3k54J8K82J2l19J78K86
2468B41j32j95L4K53oj08K42K6m53J21J08j45J62j7K28k62j19L45P6m32k2L24
2490B69j55j90J21J96l15n5K30k42l8O8J19j61n6J70Mj83J08K16k66j09R7J09
2512f3q6j94K39L13l42K8K35j39j54K5J07l0J10M6K24j27j02J09k62M8l1K81j99
2535C6r2N19l11j49L04r0k57o8K49K08l29K7o7Q6p6JJ03P2l44K40j7o8j01J00
2559b4K48k91P8J30k30J28l2j98O7k14K90O6k32L3J19j49k4M57r3q8j44M29k86
2582D0j6M6k8N8q2J56m4J9K4p8J44k07K33R3n91K54K26k96O8J6K96k81J7j09K22
2607A80k21j88L55r1j05R5k7j01r4L16j9l73R1J43L1l94L69J91j85l35L05n1m4
$$ y = [-221, 226, 74, -244, -196, -10, -174, -228, -72, -197, -228, -162, 13, 35, -351, -5, 38, -216, -198, 84, 96, -223, -45, 241, 109, -86, -52, 201, 195, 87, 329, 355, -98, 23, 131, -14, 148, 131, 359, 97, -22, 323, 399, -33, -55, 269, 114, -76, 45, 241, -74, -129, 101, -141, -179, -111, 8, -153, -209, -39, -35, -218, -110, 106, -160, -269, -172, -63, -149, -343, -104, 209, -133, -105, 130, -9, -163, -138, -31, -61, 49, 95, 319, 192, 90, 199, -63, -15, -46, 235, 36, -56, 463, 152, 3, 307, 217, -40, -108, 141, 349, 20, 47, -20, 66, -10, -9, 94, 166, -178, 62, 45, -23, -124, -24, 224, -67, 11, 141, -89, 39, 7, -191, -124, -338, -48, 18, -214, -181, -62, -211, -235, 222, 129, 41, -103, 326, 40, 24, 70, 42, 100, 18, 174, 130, 149, 173, 95, 239, 32, 265, 358, -233, 21, 247, -49, 19, 35, 331, 50, 67, -42, 180, -41, -229, 126, 35, -70, 25, -2, -103, -197, 119, 100, -273, -182, -39, -8, -402, -33, 158, -27, -362, -57, -108, -152]
2630a52J88m3k9J8m1N6r2L0P7K4r5p8L84o3j80O0q1R0j69L87j15o0j75K62l33
2655a30j1K18%N2k06N39m04j84J9M29l41rQ2O6l17j64L31K20l63Q5J18k50q9L97
2679H8J41l25j83K92mj17p0J01m2R6r3J37k0j96M52l05K3K10j12pj08J15L7j84
2703g4O7J98j91q2K13p5R4j98M24k57k29K70Q7k75J31j9J41k60l5L92l19r2J74
2726H5J44j97j90J45J03m46K20n9K04m5p2j2J68k94J95k8Q2P1m5j16K7M7Mo4J8
2751e5m8J85l15J77J08k1j26K93J7j01k19K31j08l8M6J9L35m23J32J63k90j23
2773a61J83L1o1J0P1j10j16M04j49k06K0J15j51k8J32Qn0j87pK97j47j6O9J6r1
2798a24j16L37j89j18K54J86l38M0J69Q8j65r9J77j79Q8L46p4ml21J19j71J00
$$ y = [-152, 36, -7, -36, -18, -59, -3, -95, -65, 12, 36, -59, -137, 247, 184, 4, 64, -17, 73, -96, 291, 176, 116, -59, 203, -130, -141, 77, 77, 129, -77, 462, 58, -126, -107, 322, -19, -28, 54, 120, -197, -361, -30, 190, -173, -88, 30, -220, -309, 88, 229, -96, -279, 13, 9, -108, -178, -77, -119, -23, -116, 21, 1, -195, 257, -48, -25, 185, 73, 66, -42, 73, 110, -74, -7, 191, 0, -82, 131, 56, 150, -48, 376, 119, -110, 160, 247, -28, 103, 84, 225, -35, -70, 322, 3, -89, 85, 229, 32, -158, -13, 90, -356, -136, -195, 9, -36, -108, -120, 48, -246, -51, -79, 3, 74, 29, -87, -60, -13, -9, -73, -55, -103, 82, -233, -56, 52, 31, -95, 198, 215, 114, -105, 126, 18, -20, 26, 45, 380, -43, 89, 252, -38, -161, 22, 53, -8, 2, 73, -37, -153, 251, 102, -104, -84, 31, -120, -148, -16, -8, -58, -245, -252, 45, -102, -118, -49, -33, -124, -240, 97, -92, -210, 44, 230, -108, -68, 101, 189, 24, -75, 102, -77, 11, 357, 283, 279, -42, 77, -94, 6]
2820Fl9J36j09q8L14P0k05J7J34r7l84P8J42j12J80J03j65m0K51j15n7j35J77
2843F2N8j56L3J01j22K6j81K49k32J41m5KP2j4J56j9j26k67K92n8J39j19j1l6
2867e5p8J22o1Mj30M54j03j26J83R1l36J08J54r9j17J80j75pj16L01j11k18J05
2890c0m3R6j5k7J9r0J0K7k4r9K25L8m9J1q4j93mR2J76P9k17J20j25J60j11O9j7
2917fk28J57J65j63N3j32J37qN7J10l2j45j49J77J26L7J6r8M6K2Kk24J03j08J34
2942D9k0l1J67j7j61o3K2N4l0N6J71p6k49R9M5k5L4L8N3k86K15p3p0OM01k42r3
2969b6j53N3K1J33mJj28L8K60j08p8n4r3N3P2L8j11K65k31L9R7j03l9P9j7k44
2995b40K46K02j02k86J65j35M4Q2R9m2j53K18k31m9K68P2p0r0j2j3P4k3Q7j8k74
$$ y = [6, -33, 103, -6, -94, 220, 290, 85, 102, 236, 139, -245, -167, -25, -137, 43, 146, -19, -59, 192, 77, 20, -115, 62, 120, -36, -3, 98, -24, 2, -179, 70, -162, -21, -66, -64, 8, -6, 150, 131, 5, -262, 30, -28, 111, -8, -19, -55, -133, -11, -72, -68, -198, 256, 153, 27, 210, 301, -35, 73, 227, 128, 11, 191, 16, 9, -107, 194, 83, -135, -30, -73, 23, 8, -19, 0, -90, -80, -53, -77, -176, 49, 87, 38, 49, -35, -228, -232, -140, 36, 115, -102, 18, -107, 53, -58, 11, -6, -234, -77, 88, -75, -22, -154, -17, -25, 32, 142, 110, -35, -184, -7, 119, 156, 172, 74, 120, 142, 144, -80, 23, -85, 49, 29, -2, 165, 148, -13, -76, -54, 0, -30, 26, 197, 121, -128, -29, 16, -9, 25, 63, 116, -170, 45, -28, -98, -92, 309, 67, -26, -179, -126, -105, 28, 24, 25, -103, -65, 195, 87, 9, -45, -138, -85, -13, 25, -86, 179, -52, -13, 84, -19, -58, 21, 4, -240, 6, 208, 106, -180, -15, -150, -106, -24, 75, 33, -120, 98, -133, -182, 86, 158, 88, -2, -14, -27, 47, 24, 111, 93, -181]
3020a81O1pJ04o6K74k38j30J73J52n5K9r2K12m01K25O7L4k21J3J48j33M5J70l9
3044A44j14Q0rn4q4J85j2j89MK22p8j22J14k4J3j95M6K43k53j0J69j37j18J85
3068Fj62J7j05J32O6J44l6j38k9O7J7mJ5M3r4J13m4K2K6Qk4Ok4K8k7q2J60k8r1
3097a8J39j30P3m9n4K25j22j00J42k42J94p9N5P9j71P2l2M4J30k29J15j38J55
3120E9n4j02K5j16K83k92J65Q9P7j99n1J12r6J7J75k3m4qo8l7j36L06j16OK0J37
3146A29O7j01k0P2j4r1n3O4o9P2J86k24R3o1O0j62M9J22l0q3J3O4r1K75k27N6
3172I6m8o7J85j75l4m1P1j05J90n8L0k61J40J03M0l41P6J96ko4K10k16j89P1K87
3197I4j85L47k70j38K70l02J70r0L4J22O2L0j96J00K3n1M4J07k59J24m0l7K8J17
$$ y = [-181, -120, -127, -23, -89, 185, -53, -183, -10, 142, 87, 116, 24, 236, -165, 60, 127, 161, -60, -47, 101, -32, 13, 183, 144, 30, 110, 101, 47, -37, 148, 136, -53, -49, 173, 95, -27, 87, 63, 76, -119, -73, 170, -83, -93, 76, -61, -179, 6, -156, -139, -244, -112, -46, 98, 62, -76, -105, -38, -21, -25, -10, 33, -61, 52, 8, 30, 56, 64, 40, 46, 22, 50, 23, -59, 101, 73, -18, 121, -9, 64, 15, -39, 186, 64, -36, 106, -136, 58, -21, 34, 113, -58, 14, -18, 26, 156, -73, 42, -96, 59, 5, -97, -72, -188, 95, -197, -32, 57, 134, -65, -116, -4, -100, -83, 92, 69, 25, 17, -51, -88, -224, 82, -34, -28, -8, 129, 196, 95, 75, 147, 133, 42, -11, 53, -16, 56, 242, 18, 111, 50, 110, -52, -3, 119, 89, 6, 19, 83, -8, 267, 40, 96, 48, -19, 166, -9, -43, -84, -13, -118, 72, 14, 44, -217, -77, 26, 66, -275, -199, -3, -5, -69, 141, -75, -264, -193, 94, -91, 256, -14, -152, 118, -184, -14, -104, -70, 52, 114, 144, -52, 48, 71, 20, 64, 171, -88, 36, -4, -41, -13, 104]
3221A04j2qq4mQ9r4n9K25j15k46L81k48J04m1p1Q4J31j35j25K3J11k61J84M9R9
3246H1l25J8K18L2Pl2J8J3j31O7K6K7oK0k7l7N6k1k1q7j50K58J08l3j53J37k42
3273a79Q7R0j55M00j44n9q0j03P3j24J09O4J13k72K60j34J87M5j75n5j69K36J13
3296A28j64o0J44p3q4l3N4O0Nj08j3nN6J63n6Lk07P6J39j82N1J15M6J9L1n8n8
3323a1r4K63j16j30K53j92J8K40r7j41L6j62k6J89k7K87m30J55n7K45m54P2K65
3346H6j46L4M7j11L5j65J30P7j56K28j47J02j95P0R5j7J2J94k26K26k51K02l8
3369H6j42K42j58q2K9J71k44K09o2j77K54k23J05P7q9j13J77M8k18L00j32K6k55
3392a71L2J31k7K4J84j67j89J75k32K55L3J3K0j9j87j9K31k01J30J01j05m7P3
$$ y = [104, 92, 84, 0, -4, 85, -9, -68, 157, 42, -204, 177, -71, 33, -8, -79, 5, 136, 1, -124, -101, 10, -251, -67, -18, 81, -244, -226, -8, 24, 31, -1, 17, 30, -101, -34, -8, 19, 13, 33, 6, -31, 25, 4, -17, -104, -254, 4, 112, 79, -74, 63, -179, -92, -2, -157, 243, 99, 40, -40, -143, -70, -194, -85, -21, 92, -180, 80, -54, 133, 178, 3, -52, -221, 15, 128, -36, -96, 48, -25, -109, -142, -88, -28, -23, -131, -144, -149, -93, 70, 14, 17, -190, -114, 25, -157, -106, 9, 55, 74, 105, 47, -11, -105, 158, 42, -88, 165, -27, -9, 231, 134, -7, 29, -133, -159, 30, 3, 290, -140, 15, -42, 203, -251, -179, 86, -60, -26, 21, -90, -55, -220, -90, -13, -169, 59, -88, 14, -181, -111, -16, -33, -21, 173, -53, 173, -78, 124, 86, -56, 186, 28, -54, -25, 146, -98, 111, 49, -128, 126, -97, 8, 85, -4, -117, 60, 108, -110, 190, 58, 84, -171, -139, -8, -35, -11, 173, 6, -183, -8, -240, 15, 48, 61, 81, 62, -125, -144, 87, -114, 16, 117, 12, -35, 38]
3415C8P7o9k23K66j41J60q5j22pM5J04j45N6n7J98j2p2N1j6j18J73m0J53j86Q2
3440A10q8Jk9M2J54j53j2q9N5K9k3j4J1Q1Kp6O8k05K10O7k19l5J18J6j50Q8K64
3467B23l88P7N0O9k0N1j21q9J80j46K9J66p0l7O9l0q4%K4j4K9n9Q8O8j87L71l19
3494g0K12q8m6L7%k43Q4J32j7j2K5l0Q0k1p3R6m4m7Q6n2Nnr8L5O1J66j88j37J56
3523DJ6k76J82l8K0r3L06k01%j29L12j24J02L2l07L53Jj27R4L7k04J21r7J51J7
3548A52j89O3J40M0j82J92m23K88l6J21k39k1l6QP7J61n2q6J58p6R2k91K28Mj76
3573h3N4j6N5j16L0J56j43Q0o0o2j01l3K90j38j19J43j38J96j03K7J14n0O1N1
3597I5n6k4J14k5n6J37p3L3j41Q6j24J60j61J38j85O0J1L6j3n7J20j28M9q7j5
$$ y = [38, 115, 46, -177, 89, -52, 108, 23, -99, -106, -61, 43, -102, -46, -103, 95, 83, 11, 62, 46, -72, 101, 61, 214, 28, 110, 22, 23, -6, 36, 190, 37, 25, -64, -9, 20, -3, -17, -6, 75, 77, 1, 69, -136, 74, 141, -78, -113, 5, 21, -129, -41, 223, -165, -88, -38, 31, 11, 62, -59, -148, 32, -114, -85, 81, 11, -26, 43, 13, -71, -71, -47, -61, -32, -91, -3, 65, -122, 249, -70, 142, 54, 8, 45, 45, -198, -114, 18, 1, -11, 14, -16, 64, 43, -30, 66, 22, -25, 61, 9, 14, 9, -89, -54, 7, 173, -15, -152, 4, 20, -256, -74, -112, -92, -185, 121, -80, -80, -209, 103, -21, 81, 113, -194, 159, 160, 33, 127, 164, -40, 81, -16, 135, 152, -37, 26, 166, 206, 24, 216, -207, 81, 45, 166, -73, -94, -130, -122, -45, 116, 64, -22, 136, 60, 152, -139, 89, 93, -83, -29, -45, 10, -106, -76, 80, -63, 17, -43, -105, -206, -239, 51, -87, -206, -63, -201, -5, -108, -81, 33, -17, 44, 95, 39, 15, 129, 104, 48, 185, 112, 145, 4, 90, -34, 126, -35, 103, -82, -22, -11, 25, 12, -45, 75, -53, -4, -91, -106]
3622a06J16o2o3N5L3J66j98P6n0Q8J29j38j84J22l8j72K20%j71L2J89k61K62q9
3646d4R5j19K24j39P3nk80K06L2M9j17j9K51j90j41K05kJ10l5j77k7o1J88p8M
3671Cm9J14o6L8q1J14k4m4n6K4mJj5J86p7r4J08j67J51n3j27Qk5J71P5k32J55
3698C4k27J16J79k49NJ28j33J09J12J05j23j0j39k1M5J45j47O1j69K16k1j38J84
3721F2Jl4nK4m7l5O3l5P5o3P7o2k13K88j73nKJ31njj6l1j20J28m2N2j24J62q3
3750b9l2m2nN8J04q1m3mn9J80m8k7J21N7o1j61J35j47N1R2o4J32j9j44O5po3j7
3778e8J30M4q2rl0j8J35j54R9m6m8k3K38lj30J49j90K3l9o4J29Q0j76L6k7K2P2
3805F0k77M66l09q6K21j73P0J19k00J86j33p5r3L12n3n3J47n7k34K33j38J20k06
$$ y = [-106, 10, -52, -115, -60, -27, 139, -59, 17, -33, 55, 184, 46, -138, -16, -54, -226, -6, -6, -177, -145, 44, -217, 45, -44, 51, -68, 156, 17, 90, 85, -195, 11, 43, 92, -25, -44, 207, 17, -124, 81, 79, 189, 154, -23, -50, -111, 77, -1, 3, -46, 68, 2, 40, -41, 73, 49, 5, -51, -27, -31, -30, -45, 141, 64, -30, 78, -89, 62, 9, -118, -110, -135, 36, 111, -121, 34, -193, -77, 102, -147, -142, -14, -147, -38, 74, 179, 56, 46, -93, -114, -69, 76, -71, -10, -179, 37, 16, -122, 62, 63, 29, 24, 48, 1, -34, 29, -6, 69, 6, 83, 21, -192, 96, -77, -82, -80, 51, 46, 45, 29, -2, -122, 6, -36, 16, -108, 54, -29, -61, -103, -108, -50, 54, -27, -70, -74, -133, 47, -1, -28, 93, 150, 89, -72, 63, -84, -33, 59, -5, 127, 108, -36, 29, 22, -41, -58, 72, 116, 34, 25, -5, -23, 112, -42, 57, 11, -37, -60, 178, 175, 45, 194, 4, 27, -12, -76, 53, 133, -43, -7, -34, -12, 60, -217, 249, -60, -146, 75, -98, -28, 91, -109, 77, -56, -131, -224, 88, 35, -18, 129, 72, -162, 71, -67, 53, -153]
3828a53K24l6r3P9q7K95k52J26m5o0q1J97j94Q0j27K28Kl6K1l89M8J99r4J31j7
3853c4J27j80Q3m0j06J8K5J48J9k91R1J75O0n7l8O9K4n5n4q2J41j35M3m6R6J45
3879A46k09Pp7J52n0K9j56R4J2l4K63k56Q1l2nJ45l57J56k5J35m3k5m3M6M1o7
3905g2J21R1K0j20o9N7O5j24L5N6L4j02j10p2J84M6j88R1M3Q8nR6q4j91j48J58
3931a00k9p7P9K1P9J0k1l2J72j71j12L02j58P0j22J68j08k6J09j37J55r2K1N2
3955E3j79J35k40K85l28J94oP6j0p4J76j5o3k88L58P3l5k04J00K02k96J15N2j90
3979a09J45r6K2n0N5o2lK79l10K54k56Q1m7J59P0k12J5K78q7r9m7j06J68k2L1
4004E1J77j46j57K64k38Q0j03J82j86j90K29j18N8J87j50jr4N0J64k56J57pJ26
$$ y = [-153, 71, 35, -58, 21, -66, 229, -23, 103, 58, -2, -83, 114, -80, 0, -127, 101, 103, 67, 88, -301, -253, -54, -148, -17, -34, 93, -87, -4, -44, -150, -132, -107, 41, 60, -231, -140, 35, 95, 38, 0, 69, 93, 38, -16, -98, 43, -92, -49, -95, 1, 146, -63, -56, -133, 19, -31, -2, -158, -64, -52, -86, 177, -79, 2, -30, -35, 110, -247, -91, -116, 19, -24, -49, -92, -46, -5, -72, 49, 140, 160, 40, -29, 28, 93, -31, 4, 60, 94, -8, -118, -190, -6, 40, -148, -57, -14, 74, 69, 165, 81, -110, -258, -100, -129, -206, -127, -106, -27, -17, -38, -70, 102, -69, -181, 121, -37, 33, -89, 79, -29, -55, 54, -83, 72, -20, 1, 53, -126, 9, -231, 54, -274, -80, -86, -10, -20, -94, 82, 67, 4, -284, 74, 147, 112, -92, 8, 210, -86, 29, 81, -109, 36, -60, -38, -88, -33, -95, -98, 181, -129, 125, -131, -50, -97, 62, 132, -80, -65, 213, 126, 27, -20, -126, 42, 20, 51, 228, 82, -75, 189, -49, 31, -72, 110, -76, -266, -37, -155, -97, 90, -60, -61, -155, -105, 59, -197, -40, -47, 79]
4027G9q9J03j94J12M0j20N0k0j97O3J97Q3p1p9j1M2r8O8K10r0j56OL6J89k94j2
4053a53J15J57k7j56N0p0J18r5P4P7j72K93j56o6n6J87o0j31L5L22l38P8M2k01
4077a33J61j15n4J89j74M8J62j11J18l6j17j6K0j53K17j58R0j01J88j03J01j4
4099Il5j35J68j13K62q2j29J24J24k11J4J74j14M8l07J5P3K15k01J49J3j73K8
4122h4N5l5L9j04J87o5j19J97l2J23k58J10J95k23Q8p4J09l00J83j06J45M7j20
4145d2J42o8K2k2l0R3l4j09k0j91K03K09J7q0n7l11K31M2j21K40l6P2k02J02M1
4170I1l7J66j27j2j51O1j25J42J27j60k7J21j71J62P1p0k49L35j63J64j35J7j47
4193a17R4N4o5l3J8P5k41J46j19K73k01L7o8K46j76M5j6l3p2N0K2k4QJ00n6J31
$$ y = [79, -10, 93, -101, 11, 51, -69, -19, -39, -236, -173, 24, 107, 36, -43, -54, -12, -110, -42, 168, 78, -78, -72, -36, 153, -141, -153, -38, 119, 92, -64, -14, -84, 34, -61, 13, 90, -82, 211, 55, -11, -67, 120, 60, -71, -36, 286, -52, 26, 68, -133, 28, -87, -141, 48, -126, -78, 84, -27, 91, 55, -62, -78, -58, -211, 6, -152, -62, -163, 25, -78, 23, 9, -26, -161, 7, -106, 156, 74, -55, 69, 193, -18, -4, 170, 56, 104, -203, -188, -115, 100, -101, 48, 61, -112, -84, -29, -64, -25, -129, 58, -7, -126, 71, 39, 162, -96, 14, 209, -14, 74, 0, 109, -191, -8, -114, 31, 78, -42, 100, 32, 54, 32, 2, 95, 61, -48, -68, -259, -56, 153, 170, 90, 33, -278, -47, -5, -126, 114, 78, 150, -52, 50, 91, 54, 220, 93, 81, -70, -9, -134, 8, 135, -25, -52, 69, -102, 60, 131, 61, -188, 147, -16, 148, 13, 30, -117, -23, 31, -34, -67, -49, 26, -215, -69, -188, 85, -116, -79, -147, 99, -77, -32, -48, -81, -153, -103, -81, -105, -97, 3, -53, 78]
4219G8j52J57K1j01K8j9j8J73k17J94p2j56J38j5j41M9M1Qj96K28n0N5q8Q7J54
4244A86r3m9j23o2J43p3J57l6l5l7J10j23N0o6l3K5Q1j9kJ41j06Qj31L00m4r5
4270G4k8j7R7k10J00j40K3K03j16j59J80K7M9j03K0j35K09j08J34j19q5K03j00
4293aq6J74%o0k42L18n0k15J92N3l2kj4J80j87k45J08J86j23J73r2L6m3p9l0J93
4319A12L8m3k9J48k17R7Q9k76L4K95k42J15j17K6m2J65Nk00Q6O6j82P2On7J38
4344H7k21N8K22k77L49k61j3j4LP8m1L9lQ7j57j0Q0J21k15Q5kK3L7p3m4n3K30
4371A15k9p1K1j3M9j24J42j60N0J18j45J46k20J72j17J55k21R4J28o2p9K24k28
4394e5L10j36p7R4j59K2Q4J0k09K44j39J4k12N2J15J84r7r9QP2rJ1P7j51RJ35
$$ y = [78, -74, 83, 104, 3, 31, 12, -6, 167, -50, 144, 72, -84, 54, 39, -102, -53, -12, -4, -200, 28, -22, 33, -55, 32, 186, 93, 44, -79, -141, 2, -71, 86, 50, 15, -22, 88, -35, 15, -51, -84, -59, 22, 3, 1, 142, 36, 44, -87, 213, 169, 74, 46, 29, 126, -84, 16, -124, -101, 102, -14, -173, 7, 34, 83, -20, 0, -135, 74, -34, 100, -19, -104, 99, -1, -87, 87, 87, 27, -215, 103, 53, -162, 30, 83, 51, 49, 35, 215, 28, -217, -109, 77, -46, 127, 35, 71, 28, -51, -81, 112, 150, 107, 78, 226, 9, 106, 195, -81, -47, 248, 6, 121, 4, 30, -12, 153, 158, -42, 44, 110, -72, 0, 6, -51, 87, -134, -76, 146, -131, 218, -43, -56, -70, -67, 11, -30, 9, 6, 93, -64, -74, 6, 127, -88, -3, -5, 18, 55, -18, -62, -115, 115, 86, 15, 36, 23, 72, -52, 90, -70, -20, 98, -47, 99, -121, 51, -66, 89, -132, -38, 90, 28, -51, 173, -55, 255, 119, 42, 136, -23, -1, 83, 93, -116, 128, -11, 3, -209, -157, -42, 142, 45, -54, -46, 26, 17, 28, 105, -46, -37, 98]
4420I8j65Q2k43J12Q3%J31p1PJ5o4J47rk2j46rl2J6J65l2p4K26m7m6J59l06Q9
4447F4Q0n5j01N2Q0j09K04k35J24n4R4k22O1j20L49j98j6QJ20oj88J76l42K72
4471C8j82k1L88m25N8J80k0j07J51J5j69J95j85qN5kj14j59M38l9k27J71j61K48
4495A18n7r1J13J09j78J4N5K0%k02q4L35j04k9M7j65K11ok57J78m3J72j56J8o2
4520d4J25o5l5P6k9k1Kj53J11P6j80J01O6k2j22o8K69J2k03n9J7P6P7J16p1m7
4546Ej15J31j09J4L2O7M0Lo0j2l7J67j00j8Jj44K17m0n2O7q0p8K70k26M9j41J05
4573d4O5%j89J08R7p9P7k74K08o5l1J50M1k02Q1J96n5j09j44K17j43rK70j17m5
4598DM7J47k39M0J53p6j78J06K5j27k2J86M3k0M0j76n7j5J65l1k77K38O4n3O6
$$ y = [98, -67, 15, -228, -116, -33, -33, 98, 27, 34, 49, -15, 132, 123, 101, -45, -54, -86, -70, 95, 63, -11, 215, 168, 122, 281, -25, 64, 144, 89, -12, 40, 120, 11, 215, -20, 104, 50, 144, -78, -17, -137, 212, 14, -2, 6, 126, 120, -68, 108, -234, 38, -144, -165, 223, -202, -144, 36, 16, -91, 60, 75, -94, 101, -84, -92, -37, -39, -153, -312, 126, 87, -140, 31, -130, 118, 61, -30, 83, 192, 14, 28, 83, 103, 103, -99, -183, 152, 48, 19, 66, -99, 112, 106, -151, 27, -16, 156, 0, 18, -44, 81, 16, -19, 57, 28, 7, 9, -144, -33, 43, -137, -36, 30, 8, -114, -182, 87, 99, -104, -163, -146, -70, 7, 123, 52, 5, -110, 21, -88, -74, -42, 25, 65, 68, 8, -4, -41, 126, 26, 8, 9, -135, 82, 42, -10, 57, -23, -101, 169, -57, -8, -149, -44, 21, 21, -168, -60, 37, -42, 35, -239, -31, -96, -127, 23, 64, -138, -57, 139, 84, -25, -169, 48, -95, -104, 166, 49, 4, 51, 198, -41, -1, 152, 76, -102, 4, 29, -98, -120, 66, 109, 89, 129, -47, -104, -119, 46, 15, -262, -24, 40, -13, 53]
4623E3l3Lj0k6M6j65J85L8r7j79R9L9J07R1j94M8J31j15jj56K86k67P9O3J50j86
4649a1k9r6O6J51j66j07J95m1J85l53J20J30J1j88J30l8J23j71K50j87J29p8J1
4672C6j40O9Q2p5J44n2K32j36j43k08L04j89J12k05k8J98o4K52j28mj0j64L18
4695B01k29j83J94r2M2M7R8q2K8l4k4O3r6q7K05k09K64k06Q0O7M5j32K69k64j26
4720a61J27j10J11k16K85L2k7k44L5J42J80k51j40J50P4j94J54j56L63j62j7j06
4742a31J18j2l8J39k05K15j84J49j72k7N2K66J8m5k79Q8J84k69j27J63K3P5k1
4765b0O2j63J0R9j03j9J95j70J4O8P6m2Pj9K32j57M5r0K01j79m8J3k79K77O3P3
4791A46j9j87jo8J29J85j98n4M8j65J60N1j7j7N1j6J06j08j19J59M0k56N9K09
$$ y = [53, 20, 23, 13, -13, 33, -132, 53, 91, -6, -185, -86, -47, 60, 151, -43, 5, 136, 21, 20, -136, 150, -117, -38, 25, 175, -11, -40, -136, -70, 81, -85, -192, 3, -38, 147, -206, -86, 44, 55, -133, -3, -41, 82, -89, 161, -26, 103, 25, 36, -104, -35, 47, -28, 116, 64, 296, 160, 17, -191, 113, -76, 36, -169, -197, 1, -63, 189, 61, 57, 47, -117, 201, -28, -211, -17, -109, -67, -20, 78, -4, 24, -10, -34, 29, -67, -154, 51, -158, 106, -100, -20, 47, 92, -40, 229, -35, -161, -34, -144, -33, -249, 36, 68, 41, -203, -168, -26, 154, -97, -237, -87, -13, -207, -53, -209, 154, -8, -25, -131, -13, -25, -63, 76, -129, 86, -98, 51, -121, -148, -96, 170, 188, 143, -136, -48, 136, -133, -260, -97, -74, 1, -20, 42, -121, -111, -12, -115, -134, 61, -109, -95, -27, 49, 7, 14, -5, 227, 70, 115, 25, 226, 47, -1, 12, -267, 10, 73, 146, 127, -60, -61, -129, 0, 185, -13, -67, -19, -184, -24, 27, 10, -7, 44, 28, 134, 26, -93, 66, 106, -150, -91, 118]
4815A18l9p7J72l54J25pJ49l4j41Q0KJ19j43r0P8m0J40j38J42m1N1j04L9k60K30
4840b3N9ok1p1M8n0J43k89J70N5r1J30r4K60k74K3r6J44n8J79L9k03j9j02J58
4865A1J41o8j45K1o2K71l11J10j3r1L1J56K6r1J02j76Nj48O8J35J93j9J16l61
4889i9K19j32m4mm7J36q6L7j21J94q9n3J12l3KP3P2r6l3Nl0p4Ql8L04j52k53K89
4917F7N7k07L5K84k40r0M8J91j96q7J06K3k62M10j08k3j62L29k21p5J32R0k7j87
4941a13J37M2p7K42j69p6p1J45j7j26l2J28r2l4K47j55J06k35N3J17P5m7j77M0
4965h9L5M9J64j71j55J39k6K48k48J23K12l29O1j80L03p3p4K0o3O1k1M7k62L08
4989G9q2k2j82K29N5k09R2lJ5K66l45J00M7MJ41k09K20k09J26j15r8J82k5n0P1
$$ y = [118, 79, 2, 174, -180, -55, -62, 87, 53, -88, -8, -6, 113, -30, -120, -42, -82, 58, -80, 62, 21, 72, -32, 7, -253, -23, 36, 30, 9, -62, -14, -64, 79, -210, -40, 15, -76, 54, -40, 220, -54, -31, -127, 17, -41, 138, 177, -26, -45, -147, 11, 152, 84, -61, -40, -102, 169, -142, -32, -45, -136, -105, 51, 77, -14, 88, -88, -83, -231, -163, -28, 165, 146, 262, -99, 120, -12, -56, -60, -107, 29, -57, -20, -141, 53, -36, -89, 23, -10, -8, 65, 137, 41, 8, 13, -17, -91, -83, -121, 183, 31, -222, 67, 124, -83, -48, 236, -4, -94, -46, 145, -51, -138, -32, -9, -271, 139, 31, 8, -154, 175, -46, -121, 11, 101, 74, -113, 24, 66, -11, 231, 62, -14, -85, 60, 43, -83, -115, 13, -79, -113, 134, -21, 85, -150, -97, 20, 95, 48, -129, -89, -54, -5, 159, -12, -167, -28, -54, 194, -54, 69, 281, -48, 13, -167, 136, 63, -11, 9, -54, 7, -14, 33, -229, 79, -3, -25, -207, 22, 77, -132, -40, -43, -28, 238, -107, -7, 40, 44, 185, -24, 196, -13, 113, -2, -100, 82, 57, 7, 78]
5014G8P5j05n4L3M5j22K46j63r7k52K31p8J40J27l19N3K14P7k13R4N7R5J4l46
5038a70K16M2J7j10j00N8J14L6l8k4k10K29j48JJ16j08m5L3K56j28j4j43J86j23
5062e7k4j11L59l45K24q3j33J88m9P0Nk07Q6J43Lj54P1j10R0o2J86j6jJ03k52
5087g6K67l21J51k3K9Q2j5l14K68j57j05J16K35k26J36L9k43O7K59j22J39k94
5109a08K10j10P5J66l72K05P8j79M7O7m0J05l13J89Nl4o4j51K38N1K5q5M5O5m
5134A11j9k1j28O3n5oK6m1j6J47j33r6J21Q9J78j03j14p2j41L45j89l7K61l45
5158a75K83k13M2r5K20q1J45k11K46m5j4k81K45j90K46k12L4L1r4K12n3N1q4O4
5182G1J78K0k94R9k06N5j3J33J3j86J24r3Q5j3lO9j8Qln4J7J39q2j71MJ56L4q8
$$ y = [78, 153, 48, -6, 27, 72, -50, 196, 33, -64, -316, -85, -163, -23, 104, -215, -162, 52, 129, -84, 10, 67, 162, 176, -170, 46, 88, 105, -5, -105, -47, 67, 103, 65, 41, -169, 60, -88, -87, 29, -79, -124, -91, 165, 37, 23, -120, 66, -57, -81, -192, 167, -178, 46, -37, -170, 18, -31, 39, 44, -163, -77, 66, 69, -85, -14, -124, -34, -96, 90, 74, 73, 176, -76, 191, -130, 21, -2, 27, 109, 94, -220, 48, -109, -214, -98, 137, -89, 47, 86, -157, -90, 169, 47, 186, -108, 102, -8, 67, 233, -139, 66, 144, -35, 12, 79, 39, 144, -169, 20, 25, -9, -73, -224, 14, 65, 90, 5, 50, 115, 111, 92, 71, -57, 6, -49, -55, -29, -70, -86, 61, -72, -168, -47, 42, 220, 117, 3, -69, -210, 135, -54, -91, 170, -175, 108, -105, -63, -158, 62, -19, 126, -85, 161, 116, 102, -179, 66, -124, 122, -90, -56, -25, -119, 93, 40, 91, 7, 71, 249, 269, -25, 74, -132, -77, -90, 43, 56, -130, -6, -99, -14, -27, -30, 39, 21, 29, 26, -28, -11, 128, 46, -125, -121, 35, 69, -19]
5210a9rN2l3j52J09m4Q0j28K36k24J54m9q9J80j3qk30o0K08K64k27O9n2kl4J41
5236A20j38K6p3P7pl8l5L5Q1M0j41N1q4jJ37mJ18j88P9j16P6J87j69r6J66j79
5262g6K41o6k73K64q9j6rJ17r1Q0N6j2K2k93K20O8j36L9N6n9j23L30n9m11J55
5287f5M5J73P4j77k42J40J10N1N5m9p9l6j58K35j72o2R2J36P3q7q4N4j47J40R0
5312A10j08J7n8j52J59j72K30O1j91P8J59j28n5Lp3J45P8r0p5J10j0k0j08J81
5336I1j94P8rK5J44r8j61K38p7o6P4k07J63O3j62J55k94K09j00R7O1nJ3j15J92
5361A15n3j15j81K38k22K70j60K46m0j47l8K6%j0J34om4N4R2m9q3k86K26j2J89
5386A44j25L9k5K1j20J61j97J34N1j06k0M3J04p8p7J38j30j8J43p2J40k70K59
$$ y = [-19, -28, 24, -9, -161, -52, -96, -16, -144, 92, -132, 22, -27, -116, 64, 51, 43, -187, -247, -39, 225, -2, 67, 15, 13, -21, 120, -18, 8, -65, 12, 5, -33, -68, -33, 48, 88, -53, -2, -86, -87, 50, 46, 164, -24, 55, -61, 15, 202, 33, -63, 103, -76, 165, 99, -174, 90, 1, -15, -24, 93, 2, 82, 138, 126, 148, -145, 75, 143, 7, 46, 102, 43, -80, 250, 191, -220, -65, -20, 153, 227, 50, -192, -52, 58, 109, 164, 115, 36, 0, -158, 77, -95, -157, -65, 71, 144, 57, -27, 27, -120, 20, 110, 2, 19, -39, -191, -32, -204, 26, 87, -104, -26, 133, 5, -50, -47, -120, 25, 103, 13, -62, 48, 38, 18, -90, 91, -103, -25, -34, -9, 135, 37, -124, 114, 37, -29, 45, -162, 1, 64, -98, 57, -237, -28, -128, -31, 30, 25, 38, -77, 115, 62, -53, -234, 4, -218, 52, -108, 138, 98, -49, -87, -61, -61, -71, 63, 57, 13, 67, 159, 110, 27, -259, -33, -45, 144, 19, 58, 33, 54, -66, 95, -102, 32, 83, -23, -43, 0, 104, 26, -51, 87, -43, -61, 82, 10, 150, -120, 139]
5409A39k2j91N5N6n6M9P2j19J4J9k8M3L6j28J2m2p5J59j27K31j87K02nk69J17
5434d5m9K2J56N6J42k94K22k67M3n0R6M3O0r8j64K29k16j6J03J30r7M3J13k2j61
5459b1J25j44l3J52n9N6j44P5J87l15K0R0j91J55j8l2Q7k8o3j57L30p0k6J75j22
5484B9j60J47o0k6J86n1j27o2J13K31l03J49l8rk1j57K62p1l4K79k77N9j43J91
5508A07k52J75l16M14K3j06q0J25J03k07n3J25j00M6q8P7j03K16N1j96O8j22J81
5531H8m7k21J89q2K38j73J19oj28K84j01k69J67n4J43j38nM7j00P6j0J33rj88
5555d7J86o2j6J00k13J33j34J82k29RO2j57J21J07p1J29o2rj35L33l46J22J33
5578A36j27L2k55J88J16Q0j53J2j06o3L18k24j60j31K39K13k05J27J2n6j99J63
$$ y = [139, 117, -74, -19, 37, -19, 30, 102, -17, -3, 16, -12, 31, 67, -61, -49, -91, -166, -7, -134, 97, -90, 112, 107, -162, -45, -94, -72, 84, 140, 282, -12, 210, -57, -14, -64, 32, 75, 135, 37, -127, 102, -114, -130, -27, 103, 6, 49, 162, 140, -21, 104, -40, -73, 79, 20, 76, -68, 7, 194, -121, -101, -11, -202, -47, -65, -97, -10, -38, -101, -258, 72, 2, -24, 151, 29, -131, 16, -44, -70, 116, 65, -62, -124, -11, 220, -83, 66, 28, 19, -2, -159, 103, 32, -2, 277, 0, 59, -84, 107, -145, 30, -286, 128, 151, 45, -35, 90, 193, -14, -67, 58, -42, 4, -84, -7, -110, 106, 157, -39, 29, -93, 88, 41, -180, 9, -73, 165, -8, 111, 105, -23, 261, 160, -109, 58, 4, 147, 9, 4, 51, -49, 27, 17, 150, 141, -47, 139, 77, 61, 161, -52, 81, -53, 129, -100, -91, -29, -186, -65, 42, -29, 100, 38, 29, -106, 227, -119, 3, 136, 9, 41, -214, -26, 90, 170, 17, 29, -77, -140, 178, -46, -206, -337, -98, 115, -90, 37, 49, -7, -206, -43]
5600d3J29j38L6q0J32J0r5j02L57k17r0J65j4j38R0P7k00Q0J85j17l8l5O3p9O1
5625aP1j06J1p9L07k25J01j05p5K10m3o3O3j48J65ok10J28k03K37Q2j97J49j32
5649f9k9N6K3J00l1j50J09J21p7k21K07j32J56K3l67L3L51j51P0r1pM8K10k79
5673i7j9J75n7m0L9P3k60K82j84k3K04k84J28J85K9j74M6J2j14Kl3N1l6J0m4L71
5699B42j26j14J97j58j52q5L02k0j03O5l00L78n6J00p4k12K13p1q4J2r6L8K11
5722A07j53j24K30L6j23q0J45p2k14R4J82J0K2J38j68J31j34J2j39K9O1J2M4j15
5746f9J65k5r8o9J17J23j0M4l08J03J45l47K47j03j5J35j69J14r5J53j87R5l3
5769h7N9j3R2k02J07l8J28p0L2j76L13j47pL7j10j09K56j28nO2l0J71j39n6K8
$$ y = [-43, 86, -52, -16, -96, 36, 46, -49, -151, 206, -11, -101, 64, 50, -88, 2, 79, -121, -41, 144, 27, -11, -46, 17, -62, -1, 70, -36, -25, -104, 203, -22, 79, -26, -101, 109, 66, 3, 66, -82, 83, 77, -133, -5, -208, 29, 111, -86, 63, -69, -98, -42, -19, 81, 50, -100, 9, 130, 53, -168, 39, -93, 63, 86, -281, -248, 103, -48, 22, -69, -76, -28, 182, -97, -116, 59, 2, -38, 1, 74, -186, 96, -88, -111, 93, -191, -63, 122, 151, -23, 23, 35, -79, -77, -110, -59, -95, -85, -129, 242, 116, 2, 199, 41, -111, -196, 106, 86, -17, 48, -252, 126, 70, 170, 96, -116, 97, 26, -58, -46, -142, -104, 107, -46, -170, 60, 96, -27, -107, 38, -34, -248, -154, 28, 38, 60, 198, 30, 161, 27, 39, -100, -71, -10, 2, 46, -69, 96, 71, -27, -96, 21, 144, 134, 178, -130, -27, 118, -229, 18, -85, -100, 35, -134, -20, -115, 38, -149, -54, -87, -28, -41, 51, -151, -44, -82, 46, -24, 8, -168, 145, -2, -9, 28, -82, -191, 65, -63, -68, -6, -36, 135, -4, -60, -32]
5794c2k7q9K52o7k04R4J57j75K28k49R4J39k06n7K89k79K3O1J40j32O8m2J0j50
5818a54N8K61j27K3lm0j74L04o9j36L5L19l20J7M3J09j72L2m4l3Q8r3K2J52M6
5843A44l4k12J27j72k9K1N9J81j59Q5J6r8j95L03J46j03j70J42O5j87P4j22M6
5866g2L26l80J39r6K3J05j81J3J56j8j4J70k14k6J29J83k57pO9r8l0J22j5m8P4
5891E3np5O3j25L77k94J22j12j27J86r0J08j28Q0j01q2R1Q0n1pj10J94k07Q1N
5916g4N1R1N6l49K46M4K2l22J40Q8P3k04J05L0q9J24o6m2O0j25R1j02K97l11J51
5941a5o5L6K34k61R6n0O7M9n5lp2J12j4J6j02Q3j79K45K4m8r7n8J56j79j01J85
5967Dm7J93k61J51j66J98k9K6p6lJ22p8O1n7k0o0j26J66j14J37N8j1J11k52L90
$$ y = [-32, -59, -148, 104, 37, -167, -73, 84, -91, 137, -112, -18, 121, -85, -142, 147, -132, -109, -48, 92, -40, 28, -14, -4, -154, -96, 165, 38, 61, 58, 18, -156, 148, 79, -57, -22, 297, -23, -6, 37, 146, -26, 6, -38, -71, 17, -76, -54, 98, 144, 110, -102, 25, -147, -176, -155, -96, 85, -74, 11, 27, -71, -266, 37, 183, 80, -90, 52, 117, -70, 4, -118, -72, 254, -126, 13, -83, -60, 45, -136, -123, 33, 15, 1, 171, -43, -69, 60, 243, -14, -21, 48, -50, -80, 42, 27, -21, 53, 48, -27, 36, -89, 288, -6, 116, 4, -123, 63, -27, 81, -47, 33, -68, -150, -59, 21, -30, -37, -147, 47, -160, -79, -74, -23, 68, 124, -225, 21, 65, 87, -235, -95, -7, 66, -138, -33, -3, -92, 32, -34, -76, -16, -141, -50, -152, 145, -166, -15, -80, -44, 190, -71, 25, -25, 42, 91, 36, 33, -39, 73, 59, 75, -27, 56, -123, 122, 146, 98, 1, -57, 99, -80, -181, 4, -43, 150, -111, 40, -126, 72, 43, 69, -7, -10, 112, 34, 95, 38, 18, -42, -168, -2, -116, 21, 79, 68, 179, -73, 317]
5992C17m29P4M3o6l0N2K2j74R3J64k36J39j13K07p5K0J47j73J32k5j60L6o4K36
6016A37j04j25J43j11R3lO0l6k0j05J63l06J07J4Q0j2RJ1Q7j11J38j89J98Nk81
6041a58L04o2o8J27n8j85l8J20O5j27oR8K2J19k21O6j37k1j7Q1M0J15l3k0M4n1
6067aJ1Q6j9J2j39j4k4L15j06J37j32k84M9R3K01j54l4j2j45J31K2N2o8J04k46
6092a65J64O1J4j06j8n6K13J00j73J43l01K8J43K3J18j86l8J37m06L48l10M41
6114A74j13n5J39m5m5j43J02p3J48q3j28J44N4r7Qm1j66L63Nm06Q4K30J2j9q1
6139c2J81j33j6K7j08k14Q8K43N7j75J98j86K57p4r8J4J1o3j50P7Nk8J08P2k29
6164a68K79o2r6QQ6j58K02j95J15j80P6J73k07O7J17k5N1o1l9nkL5j99J68J10
$$ y = [317, -112, -38, 5, -61, -91, -39, -17, -191, -98, 66, -170, -31, -144, 63, -12, 8, 155, -18, 114, 89, -71, -35, -99, 137, 33, -92, 51, -60, 33, 30, 90, 54, 34, -71, 92, -214, -107, -93, -13, -25, -16, -5, 82, -29, 109, -80, 118, 123, -158, 146, 84, 16, 143, 85, -100, -138, -18, 47, -80, -86, 12, 34, 153, -68, -2, -139, -160, -177, -96, -56, 59, 26, 6, 50, -1, 10, 96, 77, 89, -50, -64, -88, 227, 121, 258, 126, -158, -109, -16, 185, 31, -3, -15, -160, -29, -7, 45, -23, 81, -165, -1, 60, 74, -32, -50, -106, 107, 207, 34, 177, -124, -96, 47, 70, 188, 2, -36, 101, -305, 43, -267, 174, 61, 6, 145, 100, 55, -88, 14, -59, 89, 6, -122, 22, 76, -21, -13, -54, -220, 143, 148, -258, -174, 56, 68, 49, -32, 149, 16, 0, 27, -81, -295, -207, 36, 93, -82, 116, -70, 187, 113, 15, 29, 40, -23, -173, -96, -91, -119, -11, 61, -168, 111, 49, -47, -39, 47, -111, 91, -104, 11, -169, -93, 80, -127, -60, 57, 32, 83, 22, -17, -22, -24, 11, -188, -20, 90]
6189I0k8j46J28m6Q7j69j7p5K42j47K41l60K18o4N7K6j48M7J49l5J4j61J2J63
6213G8k16J86j25p0K4J44j12M6n1R2n8J31r7J32j27j04J40M1K9Jj61L52k74o4
6237f3J99jj65jP2Kl7o6QOk76M19j62M9K23k11Lj71J90j17R6N3k2p4M7m4J93k56
6265a06J61K2o4o0N4k8J14qj86K39j42j74K24o2j26J40K73j74j3j85k7J6J83p
6289F4r9J98j19j27O1j08P2QL7K7k03L7L1K73j09k8o2n5J78j01j15K76j30j55
6313a49o4L12k1j77O1K57j96r7k10K78jl4P0p7n8p0J28l9Q5Q3P4k20J27j52K81
6338A91k4k38J11Qr9J57Q6j05J1J6k0R5j52r0K73k09k4nq1R2j4J04n4J9J1m8j31
6365a20J19j24kL4K21j97J08P5j68Jn1J03j24k2L8R4j22K1J15O3j9r9M6N4K5k20
$$ y = [90, 62, -84, 44, -2, 85, -84, -101, -176, 66, -81, 160, -200, 18, -46, 11, 37, -111, -64, 85, 50, 64, -97, -85, 78, -138, 48, -77, -147, -123, 21, -91, -45, -96, -4, -62, 69, -28, 104, -23, -127, 13, 54, 83, 84, -77, 275, 1, -63, 136, 135, -30, -31, 41, 43, 6, -60, -52, -46, -322, 97, -65, -16, 207, -4, -1, -172, 18, -99, -3, 50, 28, -46, 1, -43, 150, -106, 55, 77, 13, -47, 7, -21, 93, 85, -101, 138, -4, -178, 46, -16, -142, -2, 271, 97, 84, -101, -128, -112, 71, 64, -35, 163, 44, -83, -22, -130, -58, -50, -13, 14, -189, -152, -121, 152, 43, 15, -47, -102, 76, -25, -140, 136, 6, -149, -213, 99, 78, -99, -38, 219, 23, -74, -284, -6, -7, -41, 29, -48, -106, -176, -48, -87, -2, 81, 155, -65, 62, -90, 191, 167, -71, 40, 48, -51, 106, 192, 87, 98, 114, 94, 189, 37, -53, 220, 11, -13, -18, -99, -7, -21, 83, 29, 48, 59, 11, -120, -1, -125, -127, -93, 128, -69, 39, 114, -54, -53, -104, -1, -125, -147, -109, -15, -137, -116, -1, 62, 43, -56, -10, 44, 69, -151]
6391a51J46o1O3j26J19j40M3K22j15j04J30j75J43k22K36l5J70k68P5J06Q8j35
6413Il10L46P2k08P2Ok0J9m4J8No3P7j17P2J62k37M1Q9R5P0J4j84Q5J06p4k09
6440a08K98l10J34j62J41K8m0J66jj30k35J11P2pj1J10q6J41k81J27j93J25J3
6463i8R9R1Q5n2k22k3R4M6j6q1L1J30m8n2k7L24l86Q0j20K5M1N4J52j99J24j02
6489e0j91K63n5Q4J2j42J38Q7j47m6n6mJ89j53R7k2Q4j1l4m1Q9K4kn7m6N8j13
6516d5MM8J10j41J64k10L57j82j02j0m2m3J59j5Nk66K29M8o1J45j51j9k4O1P6
6541I5j94ON4N5K47k17L2p7qJ30k09K51k12P3R6k92K35j9o3O2j20P7J32q7M5P7
6567A69k61j2J30k33J16R4R0k17M7M1N3K0K15j83q3p4K5J76r7j03K32Pj18P2p8
$$ y = [-151, -5, -66, -3, -129, -10, -150, -107, 115, 0, -104, 26, -149, -6, -228, 8, -27, 143, -125, -50, 56, 144, 9, -301, 45, 117, -91, -19, -13, -33, -14, -58, -40, -35, -98, -21, -138, -66, 96, -141, -100, -11, 84, 154, 168, -16, 69, 175, 101, -108, 190, -120, 14, -148, -7, 21, -19, 147, 146, 16, -219, -108, -36, -43, -54, 56, -30, 111, -170, -43, -236, -111, -98, 1, 92, 177, 125, -97, -120, -26, 20, 4, -77, -46, 84, 36, -16, -43, 281, -105, -25, -145, -120, -79, -25, 127, -72, 52, -50, -241, 22, -33, 51, 63, -79, 59, 146, -1, -47, -103, -107, 82, -71, 26, 4, 88, 77, 43, 2, 91, 115, 113, 56, 10, 68, -45, -41, 7, 117, -24, 140, -70, 287, 105, 3, -7, -49, -92, 67, 52, 57, -209, 20, 68, 7, 152, 1, -18, -42, 19, 95, -99, -93, -39, 16, 263, 46, 78, 1, -7, 123, -86, 165, -47, 26, 122, -170, 65, 46, -17, 45, -75, 2, 134, 47, 92, 169, -92, -104, 26, -207, -91, 3, 93, -124, -77, -36, 17, 37, 252, 69, -14, -88, -63, 113, 16, -87, 145, 152, 34, 106, 28]
6592B8Jk5j67L75p7k6k70J83m2L2K8Ko8J70j06j42K01rj33j07R2P9P3k85J18K
6618g3J52j93J83j34l5K22j17o1K8Q0j09J50j22N4j08N6%J07M8k85J71l7q7m1
6642a51K33j3k1j29N4J74l27J25o2L9J39p8lK6n1o7J51j27K25r1j33J35n3j31
6666a36J44l9J21j06J22l26L1K92j18j94l2K58J57j61k1L0Q0j33j21K99k60K07
6688I4j61R7K3q2jK9p7M8n6K24o5n6J8l2J57j85N6JpO9j66j3J19p4K05j71K9j39
6716a16K55l25J22Q0Q1q0r6K03q9P9OM2l47K14o8J22K7j41J18j20K61k56p5R3
6740a0k61L39n2M3j00O8l7m3m7pqJ85j92Q6l8K25j48J79j45o9J27k82K47j75J43
6765B8j81L32k57K12j29JJ80j19K8J0k36J04R9L1j98M2K6j45J80j7J3j80K27j54
$$ y = [28, 29, 4, -163, 212, 135, 109, -161, 22, -20, 12, 40, 42, -26, 144, 38, -104, 97, 88, -45, -152, -60, 19, 92, -193, -75, -73, 79, -114, 69, -65, -100, 122, 5, -56, -28, 52, -57, 93, -29, 25, -83, -27, -27, 80, 128, -157, 14, -23, -110, -151, 82, 69, 48, -81, -27, 147, -180, -55, -117, -78, 61, -17, -20, 6, -45, -112, 39, -88, 137, 46, -87, 48, -5, -136, 8, -31, 90, -16, 106, -220, -189, 103, -15, -209, -241, 17, 174, 13, -8, 22, 102, -31, -152, 147, -113, 94, -67, 30, 53, -29, -30, -1, -78, -30, -86, 138, 73, 17, 35, 3, 160, -25, 31, 32, 25, 94, -72, -85, 34, -40, 165, -6, 23, -116, 139, -186, -64, 16, 97, 17, -79, 124, 35, 114, 120, 162, -185, 29, -39, 83, 110, -31, 87, -33, 228, -28, -103, -10, -271, 68, 16, 59, -41, 27, -10, -53, -100, -107, -115, 70, -122, -36, -74, 151, 3, 182, 37, -32, 95, -187, 60, -115, 28, -153, 179, -78, 134, 5, 6, 186, 67, 95, 105, -131, -27, 72, 103, -95, -53, -27, -172, 8, -9, 4, -176, 51, -103]
6789a03R0j7Q0M9j94Q5o4o3K03l01K69n3O1j65J24K19j26q7j04J20j28N0r9K49
6813I5j29m2L9RNK24j59k27P4J22L8k16J66M1qj9R5j26m9J59k0o1l35M19n6R1
6839A30j52K1o8k6K01j63q4J90m1N1k90K64l1j04K45k87J14KJ75j19j47J54j20
6862h5L67l50LR3j33J68k1j38J1p1K04p1O4J00j52n4P3j35J13O1M9L1j72J53j90
6887h2P4L0k28K41j41J72m6o6K73j11j75j16J56K6J54q5N0j79J9J31o6l8l2J39
6911A00O8o6j10J13k65L24j58M9j17j47K3M7J55R1j93L7J56R2k18R3j29o8j3K74
6935A38n2n0J8j72J46M0n0o0J11oL7l36O1J78K4m6j50K44N3j68P5n1O8J6j63l4
6961a29J78n8J69pK7k34%J0n2J86j57M9j24J42j6j84K06k1J43j00j08J5J19j4
$$ y = [-103, -13, -30, 50, 99, -95, -10, -74, -137, 66, -235, 34, -19, 42, -123, 1, 220, 94, 7, -97, 23, -105, -55, -154, 95, -34, -76, -37, -28, -23, 201, 42, -185, -111, 11, 49, -167, -1, 40, 32, 13, 108, -18, -67, 92, 72, 11, -324, 95, 39, 130, -22, -1, -69, -95, 106, -57, -141, 49, 8, 59, -231, 33, 2, -102, 143, -144, -30, -28, 147, 28, -119, 35, -85, 282, -68, -65, 28, -105, 63, 42, -96, -85, -156, 48, -23, 41, 141, -11, -65, 8, -127, -14, 47, 96, 127, -45, 108, -82, -8, 22, -206, 35, -106, 66, 20, -46, 227, 116, -59, -175, -19, 7, 161, 76, 126, -53, -34, 97, 31, -7, -39, 100, 168, 102, -8, 105, -160, 164, 6, 55, -62, -209, -186, -139, 16, 107, -86, -49, 107, 199, -19, 74, -55, -123, -136, 138, 86, 36, 54, -118, 28, 68, 18, -42, 69, 63, 100, -236, -175, 3, 27, -19, -169, 75, 128, -40, 35, -16, 52, 68, -95, -129, 49, -9, 160, 153, 180, -54, -54, -44, -96, 90, -67, -18, -142, 0, -16, -200, 6, -15, 128, 28, -80, -65, 54, 40]
6985D0R5m0l2m6N8o4mK8r3L2k2O4n3r3P6R5j40L1J05M5P3j49q3K6Q6Q2j47k4M6
7014hk14J42L7K1O8k34O1K42j51r3K31j43JQ2m5p5R7K8M8M5k79K28q3Jn2N6M5
7041E6j12n8l9J57k5J36j25J29k9o7J08j98n0J90o5p2J85j08J00n5k29J68K67
7064B64l05K37j78J18q9l3k1j17%K71j56K2M7j95P1p9K05j14L8%p8N6j3Q8l0n0
7090d1M0R6j14M8j20n5N5M9j8J57j20J45j50P5k17O4J18M9q7K3J30J29k76J08
7114H8j32O9Q4j39K1J5mJ71J0k56k7L21k16K3l9r1J06K3N2N8k2K0m2k78K76j46
7140e5P8R4l50J99N2k05R8n1M6N1J61k26P1J50j17J48k30O4R2J24k10Q6r1J10
7164H9k29K23j66Q2o3J21m0r6J4R2Q2j40l2L9O9j43K4n9R4j56J15m1J44n8J21
$$ y = [40, 135, 95, 63, 17, 75, 11, 7, 35, -58, -26, -48, 16, -37, -130, -54, 41, -99, -68, 37, 82, 155, 6, -77, -51, 35, 117, -30, -54, -8, -222, -80, -43, -22, 46, -188, -127, 115, -36, -129, 102, -41, -40, 42, -3, -78, 19, 47, 95, 140, -139, 89, 6, 7, -45, 11, 56, -56, -114, -153, 4, -21, 115, -10, 119, 90, 23, 131, -67, -117, 73, 8, -64, 121, 13, 113, 58, -171, -3, 264, -41, 196, 18, 136, 47, 14, -7, -124, -124, 147, -9, 13, 60, -135, -64, -143, 62, -52, -14, -14, -92, -36, -49, 39, 9, -41, -1, 95, -19, 29, -91, -146, -91, -42, -60, 97, -23, 122, -28, 47, -170, -106, 12, 61, -26, -3, 127, 256, -20, 88, -44, 25, 109, -30, -9, 6, 2, 173, 183, -73, -100, 221, 5, 28, -11, -102, 4, 27, 79, 137, 115, 135, 93, -185, 91, -55, 23, 117, -233, -34, 18, -187, -89, -140, -94, -43, 118, -108, -37, 113, -4, 144, -86, -22, 70, 194, -16, 70, -21, 89, -140, 83, -83, -1, -64, 57, 17, -79, -65, 27, 109, -31, -63, -24, 45, -98, -74, -133, -39, -195, -80, -121, 23, -35, 86]
7189H6n9k21L09m3j48j09L3J24J54j42J02J1j21J57j49j03K47q8pLj89J75L8j02
7213d2q8l1J88QK14m78K11M1J0j3N2l1k39K82j44J73p9k5M8o6r4N3k0n7J53m0
7239a4j42K44j47Q6o4J8P1j64J02J8m4L6o9K25j13j30j7j8R9J5m0k9p0J98j06
7264e5j04R4n1K7J08nl1P5j29J43p5J16j37r7J1K54k52k0n8L30j75MnK51k61J11
7290F9K5j37J7rlO0J70k9m6r3%L00l87j16K20o2J44QN8k86J03L1Q5L5k50Q7J39
7317A33o6M7pP2k20J2N2Ml12L41%M7j51M3j16L9J83j97J59k09K50q8J17j65k5
7342e7J38j95J8M5J86p1J09j92J2M4r1J51j37j27M02j23j83LQ4Kj60j7M2J22j41
7367a36Q4J28O1j49K79l50J11p0J18o5m8J27j38Q2pL4j57J54J6L0j16M8j44J73
$$ y = [86, 27, -194, 115, 72, -76, -185, -152, -28, 126, -16, 86, 97, -24, 133, -16, -119, 128, 40, 33, 36, -153, 22, 60, -42, -130, -161, 27, 35, 249, -229, -18, 23, 33, 20, 72, 41, -198, 84, -60, 113, 34, 9, 57, -9, -103, -50, -70, -127, 26, -14, -156, 88, -59, 27, -37, -19, 52, -112, -10, 8, -36, 0, -69, 156, 43, -87, -104, -122, -23, -8, -48, -77, -147, 51, -55, -159, -65, -116, -89, 19, 14, -17, 58, -71, 72, -3, 113, -24, -121, -110, 144, -108, -128, -186, 144, -31, -27, -32, 219, -42, 69, 94, -43, -26, -35, -38, 22, 192, 163, 117, 24, 24, 324, -63, -179, 41, -21, 123, 131, 189, -97, 6, 37, 122, 157, -93, -6, 133, 67, 114, 107, 179, -41, -29, 23, 27, -285, 56, 56, 103, -48, -5, -121, -82, 101, -96, 63, -146, 104, 16, 133, -32, -57, 81, -114, -96, -51, 135, 64, 173, -19, -7, 37, -54, 97, -40, -167, 235, 112, -71, -68, 16, 18, -142, -159, -117, 5, -136, -52, 76, 137, -12, 267, -83, 28, -42, 76, 11, -37, 90, -48, 34, 27, 61, -96, 58, 74, 104, -12, 36, -108, 65]
7391F5n1j91J88J08K0j31K3M4j7k06J37n1J48P3j66O4j52R4J30j73O3k7N9k35
7415a84J41J4J7j0OL53l15O5N0n8j67K18N8k24Rl6K6J5J57r9P6pj02J8J21rr0
7442D3j23J26p8K46j17j08n2j26J86j17k4J95L2o8R3n1o6j01K74n4o3q7lj13N7
7467i9J44o8O0o9p7J81r6M8p1j3L8K6j35J88j36J10rO5p4K5q8N2N6j0k9j12J96
7494A03k01J16N5j84R6j15J70j3M5j60K92j67k3NJ28l56J86J4k89L53k0l3m6j06
7518a50P8O6jk6J1Mp7J40j84L34j46m9j01N5J19k4J2l0q3J99r4k62L30p3j25K66
7544A89k78J01j11N3J0O1j04J22j12J41r6j88K11M6mm5J22k18J64j34M1Jn3J12
7568C1j08N5j5O0o5k8Q5p4J7K1j03K00j4k08J74n3J54o3r1k9M5o6J24j82J49K5
$$ y = [65, 14, -177, 11, 119, 139, 8, 31, 75, 58, -148, -11, -62, 86, 159, -7, 57, -95, -1, 129, -44, 19, -8, 51, -184, -43, -29, -12, -22, -16, 337, 22, 87, 137, 79, -88, 130, 188, -36, -27, -63, -37, -22, 135, 36, 112, 105, 3, 21, 142, 133, 43, -80, 46, -32, 214, 97, -11, -63, -189, -3, -120, -144, 51, 83, 15, 108, 57, -9, -110, 164, 110, 47, -40, -43, -156, -99, 45, -23, 37, -32, -109, 72, -24, 24, -47, -60, -22, 4, -131, 57, -79, 31, 22, 87, 13, 38, -50, 2, 58, 48, 19, -93, 103, -98, 18, 73, -111, -15, -130, 40, 27, 72, -88, 204, 37, 14, 19, 147, -209, -23, -9, -298, 55, 35, 2, -44, -150, -72, -6, -7, -33, -22, -18, -95, 45, -139, 195, 49, 0, -101, -46, 73, 49, 61, 31, -52, 147, 53, -209, 121, 48, -77, 189, -89, 12, -99, -46, -36, 25, -79, 43, -69, 72, -24, -212, -1, 45, 41, -4, 118, -100, 64, -70, -29, -28, -81, 31, -77, -22, -37, 23, -42, -70, 15, -59, -42, -21, -124, 76, 62, -146, 28, -25, 129, 66, -25, -54, -9, -75, 49, -133, 16, 41]
7594D1j35j03k7L25M0k18J42J9j16o3L1K2j02J13m0K62j65m9J08j66k5R5J53l12
7618a70k8J53o9Q2O8KJ07N7j97L1J27o5K3q3r7K40r2o7Q8j13j3j07J58n3K83l22
7644e7q9K25j34J9k4K61j22j88q0J41m9J23l16K01P4l1R0N1j68R7k86K52M0Q5
7668A15k78N1K04j71P3q0L7K20l17J02N2j12J74m4jk60O5K01j61N3R2j26K33M4
7692A66m1j11N2Lm4p1O1J18k17K5p5K04J35m20J28Q2J5l3J04k24L3J97J02j87
7716BL7j37qK24j48J35k11Q7O3j4n8P0J6n1j16L59k75N0j16J90j45j11J43j03
7740a17J93k76K43r5O9MK3k18J41o0J37k19K63l9j18O8k43J10R8J65k68J88j50
7763a01R7MK6J1q6M9J07j55j87J66J98j47K18k18K05r9l8J13k4l9j12QJ8P8mj50
$$ y = [41, -94, -197, -224, 101, 141, -77, 65, 84, -32, -95, -64, -42, -144, -31, -71, 191, 26, -23, 85, -81, -106, -11, 142, -170, -198, -45, -114, -32, 36, 38, 145, 202, 5, 36, 163, 98, 121, 38, -59, 181, 89, 22, 110, -3, -16, -123, 35, -18, 265, -57, -146, 79, -55, -36, -60, 201, 79, -109, -189, -48, -97, 26, -290, -89, -15, -46, 44, 95, -73, 24, -262, -10, 30, 115, -163, -112, 92, -79, -6, -86, -49, 171, -146, -44, 8, -104, 70, 26, 25, -235, -170, 31, -130, -77, 15, -111, 122, 166, 125, 14, 66, 69, 25, -46, 15, 133, -84, -59, -134, 70, 205, -215, -87, -5, 10, -23, 81, -143, -110, 87, 189, 2, 39, -98, -106, 118, -30, 105, -106, -19, 44, 30, -28, 42, 58, 7, -109, 250, -25, 25, -91, 99, -46, -157, -14, -117, 76, -200, 43, -52, 17, 21, 44, -174, -33, -93, 44, -175, 88, 49, -69, -1, -244, -134, -36, 129, -139, 49, -101, -4, 0, 26, 37, -49, 0, 107, -48, -235, -69, 129, -18, 200, -18, 187, 88, 50, 163, 139, 100, -12, -4, 14, 92, 88, -62]
7789f2K11k0j99K9q1K59j37j65J77q3J43p6j8p5O2J52r5j18J20r0p5J13p8L40
7813B34j41k73L59j91KJ30j68M8J30r4J21k80J86j80K90k63M7n9J30Q9J79n39
7835b43J87N3j00J82k6rp0J65j41r2R7J80l43L00j79Q4p5K68l75J59P7n1o2N5
7859D1qK4l61K71Q9o4o7K03m9j56K1J56j86k02L49j00N8Q2k87J16J74k06R6%P7
7884G1L5j17q4J49K6j28Q8M9j13N3Q3q3J07l44K94j48k9L02l22Q0M2J65k14j9
7908e7K2J93k79J37J54o3j82P7L0qk6pm5R5k2O0j54j8j34K76j59j6J83k53K26
7933C0o9oK38l47J78j16N1J31q4Q4j28r0K95o7%P3k34K73l11J20Rp5Q8K2R6k04
7959d3L2J28l5m5N5j8j39OQ5P8j36M7J81l78J17J23J8k26J36Q4p0j67O4J73j92
$$ y = [-62, 149, 129, -70, -41, -122, 137, 0, -165, 12, -71, 72, -4, -22, -97, -35, 117, 22, -96, 24, -66, -141, -28, -106, 234, 93, -180, 179, -12, -10, 120, -48, 0, 130, 36, 157, -123, 63, -117, 173, -90, -43, -102, 28, 117, 296, -243, -56, -3, -103, 79, 53, 44, -26, 139, -2, -94, 3, 183, -160, 140, -39, 45, -30, 238, -137, 22, 99, 48, -14, 41, 33, 57, -304, -33, 56, -8, -75, 128, 79, -77, -56, 100, -86, -288, 61, -39, 19, 101, -186, -70, 104, -102, -6, -6, 71, 106, -11, -95, 54, 80, -48, 40, 89, -24, 29, 112, 29, 136, -208, 86, -62, -91, 211, -111, -31, 11, 176, -38, -57, -35, 158, -121, 16, 170, 107, -75, 2, 32, 24, -2, -9, -54, 41, 19, 79, -75, -93, -227, 49, -110, -126, 57, -196, 30, -39, -45, 193, -154, 24, -92, -41, 90, 6, 90, -38, -128, 167, 100, 100, 173, -61, 212, -99, 21, 30, -45, 43, 65, 161, -43, -11, 117, 82, 37, 92, 74, -65, -59, 26, 104, -32, 15, 196, -182, -65, 58, 76, -150, -14, 70, 0, -167, -103, 70, -122]
7984a22J83k45L9J72J6k2j09KJ15o2P8r8L2O5j63J98M8j20R4j25J32j87j75K53
8008aP7p1l6J79j95j13R9N9J3o6J27O5j87J3L0K12j65M4j36n4l7K18j57O0m7K
8034f7K7q1O3p4J36j65L6K5l5J21R8r9k14L74j53J3R9j98j97P1J87O7j35K6O6
8059ikMK15k25j2J79pj66P5K3J66j81l6RJ00j49m2N9J8k7Q5J1j51n2K7K1k8Q8
8087gk0m9J83j40N7j16K30n3j13J00pp8n6K28Kl01K15j49J24l2j62J94ml9j2J45
8113A40k01p3J00K1n1N0k3Q9n4P2o5j87J21L5m0n4J99M7%L1j2k31J16j9l4R7M
8140G8Qq2J19q9P7q0K37l67K09k66K98n9k18L91o2j97j09J91j98N3O2R3j94J30
8164B5j42mO8N0r7J88o6n9P7j9l3J58j45jk1K0j28J40n7J87k89l4L17r0J32j79
$$ y = [-122, 61, -184, -145, 27, 43, 21, -88, -86, 29, -33, 45, -53, -21, 44, -119, 79, 127, 7, 101, -24, 108, -79, -254, -1, 76, 5, -31, 148, -47, -160, -61, -2, 11, -55, 72, 137, -50, -37, -7, 205, 40, 84, -52, -106, -143, 75, -82, -22, -69, -67, -40, -121, -58, -132, 4, -161, -125, -100, -135, -14, 84, -15, -229, 145, -8, 5, 104, -94, -291, -220, -33, 34, -101, -75, -9, -11, -7, 208, -17, -29, 150, 143, -23, 52, 75, 241, 60, 24, 33, 133, -16, -58, 1, 19, -8, 77, 88, -63, -115, -88, -67, -95, -7, -27, -76, 107, -33, 24, -92, 138, 85, -28, 72, 65, -13, -69, 159, 161, -140, 75, -74, 50, 18, -144, 50, 46, 7, -5, 140, -61, -134, -34, -13, -64, -14, -37, 52, -2, 70, 5, -182, -61, -26, -66, -120, 79, 126, 126, 157, 145, -86, 30, 11, -23, 74, 78, 86, 4, 123, 34, 111, 31, 268, -99, 110, -156, 142, 83, -135, 256, 194, -3, -112, 79, -119, -66, -4, 89, -105, 25, -117, -121, -53, -3, -100, 88, 22, -37, 40, 21, -12, 146, 1, 0, -21, -1, -129, 11, -46, 141, -148, -182, 135, 45, 177, -2]
8190bJ55
$$ y = [-2, 153]
8191A53
$$ Imaginary data points
##PAGE= N=2
##DATA TABLE= (X++(I..I)), XYDATA
0@%%%%qQ%Qj6J6k4L2m0M8n6P2q8J04j20J39j63J90k18K52k92L34l79M29m88N52
30B92o18O92p78Q71r69J080j203J334j478J639j817K012k224K461k729L030l367
47a772L751m198M717n328O065o974Q128r646J1734j4804J9757k9023N1944k03240
61a68889l00920O37759J92683n31243j04278N15047m1159n06566J08779N12711
71C13924j67081m77520J94353M52459k08447l98688J88206L23332j84692k16294
81a80448K23470J62846k78430j72301K74820K01095k17672j81424J68221J39171
91A39348j59324j05720J73911R9226j86971r1744K05520Q2550k42958r3717K63036
102H3157J07134k49350q0018K33854P029k58899N9952L06712r0898l30624J02140
$$ y = [0, 0, 0, 0, 0, -8, 0, 0, 8, -8, 8, -16, 16, -24, 24, -32, 40, -48, 56, -64, 75, -88, 102, -116, 136, -156, 178, -201, 228, -260, 292, -326, 366, -412, 459, -510, 570, -633, 701, -777, 862, -955, 1057, -1167, 1294, -1435, 1595, -1772, 1979, -2219, 2498, -2830, 3235, -3739, 4389, -5257, 6477, -8327, 11430, -17593, 34351, -168889, -469809, 167950, 360633, -170610, -274888, 240159, 199000, -307566, -198787, 313924, 146843, -330677, -136324, 316135, 107688, -291000, -102794, 220538, 35846, -180448, 43022, 205868, -72562, -244863, 29957, 231052, 13380, -168044, 177, 139348, -19976, -125696, 48215, 147441, -39530, -131274, 74246, 156796, -86162, -179879, 83157, 190291, -59059, -139077, 94777, 101806, -157093, -97141, 209571, 118673, -211951, -109811]
113a09811L02612j41428k61227J99660K24772k49627j80466K91582J21527l38403
123a40809p1483L76599M0847l75325m287L37629o5865l04028J50090L00934k00193
134D4109k92225K16906K56885k27611k05588K46740J65623k54323j32522K43404
144F1398R1044k34754m8401K43099L4182k42902m2324K17685L9540j88141k0441
155i0015J81318N374j92941j2839J93940K0137j83123m980J84629k0240k05930
166a24670L2247K19359m1256k15987O5517K09899j03774k14183J32975K13368
176A73495j48596j88209J73531J51792k12730j28600K40672J11829k41188p7309
186a45313K31491K4420k32219K3978K36043n2566k21532P8682J92906j11728j69820
$$ y = [-109811, 192801, 51373, -209854, -10194, 214578, -35049, -215515, 76067, 197594, -140809, -212292, 164307, 205154, -170171, -174458, 163171, 97306, -206722, -56632, 244302, 44109, -248116, -31210, 225675, -1936, -207524, 39216, 204839, -49484, -182006, 61398, 152442, -82312, -130713, 112386, 146568, -96334, -138658, 79027, 118567, -69574, -90015, 91303, 96677, -96264, -109103, 84837, 104974, -78149, -83129, 101500, 81260, -124670, -92423, 126936, 85680, -130307, -64790, 145109, 41335, -172848, -39873, 173495, 24899, -163310, 10221, 162013, -50717, -179317, 61355, 173184, -68004, -145313, 86178, 110598, -121621, -97643, 138400, 85834, -135698, -57016, 135890, 24162, -145658]
197a45658J36729J51380j41041j20119J40443P7050j50533m5129J63066L5542
207A01730j54358k7953J28590L972j11713K2318J13097l1614j13169K7918J03994
218F2812l0203r7077L7367J02123l5458j06270K6645R5556l3566q4282N7741R1712
230H7100p8575j08876Q0829J10438q0858r3525R6802P5006j22240o6631J37680
241C7150N4184j45179l0269J57881Q077j71005K100J67769j4471j46628M4456
252c5935J29866q0927j27772J01561J25326j03735j04221J08160P6329j20626
262c1974n6396J28072M3839j22280k3991J16343J343j18618Q800J18368o734j01363
274d4591J0775P8997k8657p1179M3508P5219m3287p4524L6726O3326m0821n6391
$$ y = [-145658, -8929, 142451, 1410, -118709, 21734, 98784, -51749, -96878, 66188, 101730, -52628, -80581, 48009, 51981, -59732, -37414, 75683, 44069, -69100, -41182, 62812, 32609, -64468, -27101, 75022, 39564, -66706, -40061, 55495, 21929, -62353, -4612, 87100, 8525, -100351, -19522, 90916, 10058, -83467, 13335, 88341, -33899, -100530, 37150, 91334, -53845, -84114, 73767, 81844, -89161, -87061, 80708, 66237, -80391, -35935, 93931, 13004, -114768, -13207, 112119, 8384, -95837, 12323, 88652, -31974, -88370, 39702, 83541, -38739, -62730, 53613, 54956, -63662, -54862, 63506, 56772, -44591, -33816, 45181, 16524, -54655, -11147, 64072, 20785, -53739, -17013, 46313, 5492, -50899]
286e0899M9448N8778n1280o0152M7993N0716n4619m2575O8844M4689p6841m8455
298f4353P3208L8499p1602j9331Q1862O526r2756j508R3414p890q7237K6424Q7573
311F2829m1541q9212M7649Q1954n2487o5222O5944N3702p9160m8739Q1302M0672
323E7691p6341k2365P6909M623q2858L163Q2338p575p2807J7887O4923l1233o4768
336e0413L5398O2215l2757n2295L4026M0400m2627l7226M6657L6852m2756l1043
348c3569L9804K0528m5977j5144N1965J7311n1296j5478M7050P144m9148M28N5646
361B9264p68n5800J439N0479q896m7507J9696N0933k4485n0328K5952M3035l2527
374D87l4605M3871L2897n0098l1638M9081K3974m9028j2757N4308O444n8573m225
$$ y = [-50899, -1451, 57327, 6047, -54105, -6112, 44604, -10015, -52590, 16254, 60943, -15898, -64353, 8855, 47354, -24248, -43579, 38283, 44809, -47947, -49455, 43959, 36069, -51168, -24744, 62829, 21288, -67924, -20275, 61679, 9192, -56030, 9914, 63616, -15544, -64283, 17019, 57691, -18650, -41015, 35894, 40517, -42341, -39178, 43160, 35585, -37222, -19335, 45588, 14355, -50413, -15015, 47200, 14443, -37852, -3826, 36574, -6053, -43279, 3378, 40230, -2526, -33569, 6235, 26763, -19214, -34358, 17607, 34918, -16378, -31856, 15194, 22338, -26810, -26382, 29264, 28496, -27304, -25865, 24614, 15718, -31789, -12093, 38840, 14355, -35973, -10021, 33014, 487, -34118, 9753, 42650, -7448, -39086, 9995, 33969, -15059, -27816, 26492, 32936, -25637, -29862]
387b9862N3839j936m7169J2865M6072k1736m6950K2803M1917k5265l2509L2130
399D199K7236l9242k7632L8642K4962l5375j6073L6021R283m0931q291M0137Q679
412B1615l4241k289L1246n843l3795Q690L5373p283l0910J0423K6829j7237k8395
425b5817K1238L1397j9091k7984J8696K1846k4369j9560L0457K0970k9741j8704
437b0662K6965J0872l0052l845L5250K630l6057j192L2047o082l1102J3570L4200
450B6542j5752l4742J4638K8148j8287k1536K5035K0274k8596j9618K5749J3899
462A5754k4897n381K8731J560l1315k333K8419r8k3969P099K4481j0982k7209
475b0140R801K5144q276j8410J1467J6153j6211j7197J5732J6911j2938j1681
$$ y = [-29862, 23977, 22041, -25128, -12263, 33809, 12073, -34877, -12074, 29843, 4578, -27931, 4199, 31435, -7807, -35439, 3203, 28165, -7210, -23283, 12738, 22021, -18910, -27201, 12936, 21615, -12626, -14915, 16331, 10488, -23307, -14617, 20756, 13473, -17437, -7014, 19815, 2578, -25817, -4579, 26818, 7727, -20257, -1561, 20285, -4084, -23644, 6813, 27783, -1958, -20662, 6303, 17175, -12877, -16722, 18528, 21158, -14899, -16091, 15956, 9874, -21228, -7658, 26542, 10790, -23952, -9314, 18834, 547, -20989, 4046, 24320, -4276, -23894, 1855, 15754, -9143, -14524, 14207, 15767, -15548, -17881, 10538, 10440, -13529, -6430, 18051, 7069, -20140, -10339, 14805, 6529, -11881, -414, 15739, -472, -17669, -1937, 14974, 2036, -9645]
487i645J5126P519k0709q926K2896J1047k0026p960J9088J854k2614l65K6045
500A3330J264k3895J32K0994o451k1648J0285K3223j0409k0505J1511J4541j7637
513e265j2179K3505J3378k3501j3062K0990P223k1184j850K3397N77k3257O14
526a0614J9588m926j7274R527J8659j0000j7539Q216J2542r975p613J4874Q422
539A3887j6919j0835J4545R720j1370o597J3197N087j4488n863J2858M804j1685
552c659q55J4305j245j7892p88J7396R21j3902L235J3745r258j7003J0728J8444
566A4172j0135j6029J1693J3016j5837j2229J6672J0773j5628n671J6448l81k0004
579a3140J691K1875j270j8391L938J4529q962j4543J2256J5293j0739j2650J0147
$$ y = [-9645, 5481, 13000, -7709, -16635, 6261, 17308, -2718, -10678, 8410, 10264, -12350, -12715, 13330, 14594, -9301, -9169, 11825, 5374, -16274, -5989, 17234, 6825, -13680, -2169, 12372, -5265, -17444, 6061, 19439, -4062, -17124, 3866, 11089, -10095, -11945, 11452, 12029, -11228, -10614, 8974, 4048, -13226, -3699, 14960, 4960, -12579, -4363, 8179, -1796, -9409, 5465, 13887, -3032, -13867, 678, 10398, -972, -7569, 5628, 10715, -3773, -9636, 3222, 8026, -3659, -4514, 9791, 8546, -9346, -10134, 7262, 8183, -5719, -2484, 11261, 2003, -15000, -4272, 14172, 4037, -11992, -299, 12717, -3120, -15349, 1323, 12096, -3532, -9203, 7245, 6864, -13140, -11449, 10426, 9156, -9235, -5297, 9232, 270, -14273, -2017, 13276, 2537, -10113, 34]
592C4Q285j1793o009J3006O826j0894m820Q426M82r177J552J1866O10j0976k293
607d875Q018K14p956K260J0771r64j2670j731J0642R38r416K542J1126n199j3228
622i528M722J1782o530r701J1244R446j4597j0664J3942Q318j3723k820J7149
635I040o26k0584K10K0094o65j5516M707J3225r388j2816J1637J1228j1868o910
649h232J4305M646j6253m915J4621M449j0194J14Q802m632j1135M184J2063o63
663G160r043m90M597r86m312K103M744j413m279J165L930l755p108M118J1355
678G786j506j1827j050Q449k171o529P877Q683j0820j0953J0682R379j0373o167
692h540J2819L734j3171j253J2667l625j3044Q769J6066r641j7205Q051J3093
$$ y = [34, 8319, -3474, -9483, 3523, 10349, -545, -5365, 3061, 3543, -5634, -4082, 7784, 8394, -2582, -4875, 3143, 3357, -4599, -2339, 8432, 7468, -5202, -6933, 3709, 4647, -4769, -2227, 8899, 3700, -9528, -4806, 6976, 446, -9255, 1989, 11435, -3162, -13826, 116, 8434, -5289, -8109, 9040, 8414, -12170, -11960, 8134, 7469, -8047, -3340, 9885, 497, -12319, -682, 10546, -1322, -8232, 6073, 10719, -5534, -10449, 4172, 8621, -1573, -1459, 7343, 2711, -8424, -4240, 7823, 7160, -1883, -2373, 2224, 1238, -3074, -971, 3773, 2360, -1919, -754, 3176, -579, -7687, -3569, 7786, 6280, -5547, -6597, 1852, -319, -6848, 1029, 9712, -1108, -12061, -1379, 8000, -2373, -8540, 4279, 8013, -5158, -6411, 6256, 2631, -10413, -1644, 14422, 4781, -12424, -4373, 8720]
705H720p881o498J1531K860j4831k510J4959J186j2760J328J1514l720r730M044
719a788O627o011l902Q661M370r321o882N441O555j081l145L0J63j563p82K396
735b32K796j753l774J853M749l164o790L405Q263k812o527M543M062r519l607
750h507J3482O095j3964o102J2211K671j1655J692J2186m281j2028P131J0356
763I287j0443r576J2536R226j1828o809J0804J438j1625K215J3766k781j3164
776f954K274R595l381o171N799M506o601l127N941J029o257L05O503Q35n231j810
792b745K052O83rN38R15K40k004l380J505M714l76m312J297L917l785m620M961
809d09M659n520k271P116J02j0064Q3J1607l29j0116K868Q556n733r367Q159R304
$$ y = [8720, 839, -5659, 5872, 8732, -6099, -8609, 6350, 7536, -5224, -3896, 7618, 3898, -5832, -1788, 4839, -1172, -5074, 3587, 7957, -1364, -8246, -2805, 3750, 2669, -476, -446, -283, -1846, -2628, -232, 2564, 811, -2963, -1110, 3639, 475, -6315, -2910, 5353, 2541, -3986, 557, 4619, -4900, -8507, 4975, 11070, -2894, -8996, 3215, 5886, -5769, -4077, 8109, 3828, -8200, -1069, 9287, -1156, -10732, 1804, 11030, -798, -7607, 3197, 4635, -6990, -4775, 8991, 6210, -6954, -4680, 4915, 1534, -4637, 1162, 5668, -933, -4060, 1881, 2910, -3347, -3042, 3461, 4296, -935, -2745, -693, -10, -19, 519, 1434, 1674, -330, -3710, -2205, 2509, 2133, -2179, -882, 3035, -750, -5370, -409, 4250, -1270, -3541, 3575, 3677, -6387, -6304, 5303, 4974, -5142, -2274, 6282, 549, -8818, -659, 8645]
825H645q165o502Q578L029j0391o44J1440p8j0587K760Q900n594q732O949Q187
840G795n800o433N595K705o637j260P163J346n731o40K995j663k472K536L430
855B929k059k689M08Q25j31q00K48K020J309l033l078K213L757k160k108L947
871A598J509n926j791O282J722n412R03N789l479o612M448O984n032n273O939
886B649L695q859l202R078K486q089R0P317k646p940L674P290l997n350N061L250
902D507o896l021P294K308o020j271N209q65n222R21M977n97l308O27J854j723
918a226j149J954J220n66j200L18J87k48p10R84K490o1l472j162L915P57l129
935a098L31M087j152n051J711M536k145l523L350L715m833l467M863J959m980
$$ y = [8645, 480, -6022, 2556, 5585, -4806, -5450, 5990, 5912, -4675, -1915, 6985, 1391, -7341, -392, 7795, 1995, -4438, 1157, 3862, -2775, -4035, 3128, 4474, -1257, -1897, 1098, -565, -3037, -501, 2929, 870, -1819, -1411, -586, -717, -1517, -1269, 751, 2060, -973, -4051, -1838, 1919, -241, -2349, 1598, 3107, -2819, -4610, 1672, 3394, -2018, -1115, 4674, 1195, -5417, -969, 6015, 983, -4290, 2649, 6344, -2515, -5717, 3361, 5847, -2242, -2152, 5165, 2519, -5421, -1747, 5543, 1546, -3804, 1257, 4507, -2389, -5410, 1884, 4192, -1828, -3099, 2110, 1245, -3977, -3056, 1921, 1324, -1984, -1357, 497, -1226, -2375, -421, 799, 233, -967, -649, -462, -710, -1420, -436, 2054, 1993, -1479, -2641, 1274, 2031, -1098, -767, 3320, 2168, -2883, -1172, 3364, 1219, -2304, 1046, 4761, -72, -3539, 1324, 3283, -1697]
950a697O3O114j586p367J597O739j966n382K991M234m330l819M666K647m799j184
966c079N184J7n394J65M698p73l453K092K805k457l654K299L541j111k369R75
982e14J316r04j039J099R05m21m54N18O35j208j287R25K600m42k326O19J604j916
1000b90j738L075K737l473l043L157K187l578j335M029Q89m100j13L352j402l533
1016c179K575M278k903m344K737K772l224j530M053J687m881j495M025O52k787
1031a564L13K839j021k676J098K127j531j280K457J476k246k071J707J501j025
1046A04m17J343M08j722j201J362J476r1j169J96M83j077o18J264J183j163o35
1063b74J236J70k508k36K936Q11k635o11K047p86k331J014L490j054l092O35J908
$$ y = [-1697, -1634, 4480, 2894, -4473, -2876, 3863, 1897, -3485, -494, 3740, -590, -4409, 257, 2904, -1895, -3079, 2105, 2122, -3272, -3107, 1591, 818, -2635, -543, 2262, -195, -3849, -1550, 1991, 880, -1489, -514, 802, -102, -1141, -42, 863, 442, -12, 506, 1141, -67, -1354, -429, 2171, 1729, -597, 22, 1626, -290, -2028, 1047, 3784, 311, -2732, 425, 2612, -966, -2301, 1728, 2617, -1483, -1596, 1756, 354, -3179, -604, 3674, 771, -3573, -836, 1936, -1288, -2818, 1235, 2922, -1959, -3454, 571, 1223, -1564, -1251, 1588, 567, -2109, -1011, 1116, -415, -1695, 762, 2238, -8, -2079, -372, 1129, 104, -313, 1030, 1438, -284, -1485, -123, 1353, 1262, 93, 289, 772, -305, -923, 341, 1524, 361, -274, 962, 1132, -1376, -1612, 1324, 2135, -500, -1111, 936, 150, -2181, -1167, 2323, 1269, -1823, -1188, 720]
1080G20j264j474K598J261k866j034K878nk899M94L507l48l185R8K103m11j700
1097a527J692K105j802k069J149J436j103L4J243J62j759l07J399L0j090J51J501
1114A245L60j797j057J075J164n58l43P46l78j378j07J504M97j104l04Q75m02
1131C8j421P66J521p39j489J034J243j454j750J608K112j221j502J018O32j460
1147a064k12K215J01k048N32J260o37j329J013J560p35j340Q11J191j609q73K049
1164H85Q75j344q47Q37J7n50J99Q79j36j029N0O40m20n52M52R18m3j287m0O34
1184A38P1q53L73J156n09j505J45R14K69r37N96N53o91q70N82R17q55k51J270
1203E13M05j812n38J845K95j345L22J207l10j796O56J438j67j062Q28N28j171
$$ y = [720, -544, -2018, 580, 1841, -1025, -2059, 819, 814, -2085, -1591, 1916, 1568, -1617, -1519, 584, 173, -1527, 165, 2270, 468, -1601, -452, 984, -119, -85, 1158, 1320, -439, -746, 653, 683, -407, -256, 1245, 1605, -192, -1249, -174, 990, 432, 89, 835, 457, -921, -1028, 476, 973, -131, -435, 440, 38, -1383, -617, 904, 165, -1324, -290, 953, -501, -2251, -643, 1469, 248, -1254, -236, 396, -1064, -1276, 939, 1040, -1008, -476, 784, 147, -1182, -169, 1391, 656, -684, 127, 1318, -291, -1164, 885, 1760, 416, -431, 406, 423, -127, 72, 951, 815, -214, -164, 476, 56, -496, -44, 874, 831, -456, -496, 138, 209, -644, -271, 885, 376, -1129, -984, -70, 199, -738, -142, 411, -280, -1150, -568, 349, -506, -757, 513, 918, -894, -1432, 413, 708, -637, -315, 892, 582, -1214, -558, 880, 713, -349, 479, 1007, -164]
1220a64p48J251O87r26k55J159l1j765p8J757J41j058j99P72k79j041L41R54j30
1239C88m41K02o0m13k98L74O34k80n16M1J95k68l45M92J021n66j130L07Q32k28
1259e9n34O67Q42j041o28O91L18o05M41Q68l43j251P6J310m09r86R96Q06r73j062
1279h76P89P72o13k71O12L71r89l74P91J66n88L60O15o93q02K91P30k35k11K82
1299A27J56l62r58N39Q14j5m24r4O7m52J94M84L11l99l48J23K62m95k42Q71N63
1320G22q66l00L81M12q43j29J069K48o76l91P17R3o90K86O06m15o39P84J6p15
1340c30p0J173J27j141l91Q96J16o68K36O02j11q57K38M21j17l94R4L55k75l87
1360d83M47J04m62N1N49J33p46k68J15N41P5k5j86K01l72j32L63J35j76j69L34
$$ y = [-164, -912, 339, 1026, 100, -155, 1004, 973, -792, -870, 887, 1028, -30, -229, 543, 264, -777, -436, 518, 388, -53, 149, 89, -324, -622, -248, 386, 106, -410, -369, -174, -442, -787, -295, 726, 160, -970, -663, 169, -59, -593, 74, 916, -125, -753, -62, 256, -349, 92, 960, 617, -634, -558, 752, 343, -643, 353, 1159, 186, -876, -87, 685, 72, -199, 413, 784, -205, -579, 212, 378, -210, 150, 765, 72, -730, -439, 291, 56, -155, 127, 283, -79, -1037, -498, 316, 301, -123, -217, -150, -602, -408, 76, 387, -12, -360, -237, 25, -470, -712, 159, 722, -144, -444, -63, 349, -494, -623, 446, 694, 18, -373, 344, 437, -253, 33, 639, 224, -415, 369, 385, -330, -400, 773, 900, -241, -632, 264, 380, -288, -52, 550, 439, -418, -180, 241, 124, -270, -176, 179, -96, -483, -36, 68, -394, -343, 206, 339, -407, -675, -560, -19, 56, 31, -155, 46, -326, -458, -95, 40, -136, -305, 29]
1381B9K67n52r4L94J23m21J45P42o01p49M40J242j28j097K81K60k82j89O74J98
1401F82o91k31O45j26n17J2N34Q5n73N7N17o80m13N19N20k68q34J43M06L2k07
1422c88K17R5j24j64K64k20J02m6L19K12n50L4M6K12k28P7M70Qm97l06M98M51
1444D82r5k49L04j25m21K96P4K17l67L41J99o30m33O62J46k36j96J93K62q15J7
1465c74M31L20m95N8j44ll89K16N49l57n3R7J14n42K5L70K75k26j48J68j2j7j79
1488c16M56L9j03k00j73J79l7K17J38p4j17N9pK23k94N9L93J64r34L24N51l54
1510A93j17J96O1L6n65K72J83j74k13K35J13m55j87N47l5l40J62J43j95l15p5
1531e30O27Q8m92L2P6n5q4K01N6k20K11K09l77K40l39N85mk14j87L03N5j1l04
$$ y = [29, 296, -256, -350, 44, 167, -254, -109, 633, 32, -717, -277, 965, 837, -260, 21, 281, -1, -190, 484, 682, -9, -240, 405, 279, -238, -226, 308, 393, -180, -123, 394, -286, -699, -180, 340, 72, -762, -619, -213, -181, -388, -171, -76, -200, -364, -100, -320, -218, -264, 55, 267, -283, -249, -203, 9, -219, -142, 328, 336, -161, -467, 31, 482, 387, 138, 442, 317, -104, 192, 266, 483, 116, 457, 656, 26, -407, 255, 401, 165, -31, 162, 424, -391, -374, 57, 377, -118, -60, -204, -207, -596, -380, 169, -188, -241, -144, -30, -572, -547, -177, 98, -128, -276, -108, -120, -137, -316, 140, 179, 76, -124, -297, -118, -155, 62, 200, 126, 9, 68, 61, 284, -10, 49, 442, 606, -328, -4, 547, 193, 76, 272, 333, 369, -196, 76, 259, 85, -128, 107, 220, -235, -422, 125, 90, -250, -88, 55, -140, -455, -530, 97, 185, -307, -275, -199, -254, -338, -137, -81, -301, -90, 119, -258, -18, -357, 228, 224, 10, -177, 126, 181, 170, -134]
1554a34K13K43k62Pn8L04k4l14K80J96k45l25L63o4k24K25N8J8o38N22Q1r0l03
1577a71J01L18l59j56J44K84n00K04J27m1k80M54k19o5k94N75q1j57m27K67M54
1598A78k20j06J02N7l0p0p8L12J34k35l0j2j3J09K2J6j46J71K1K6j65j88M32K54
1622E41n16j92M45m7k45j14M59j51l45L92L4l70j08L41q8o4PN5q3k28p1N38ql22
1646a40p4J60r9nj11J59K29j11o9O7l46J86L08n6j55m3J6j3l8J02L34k9j09k05
1670d2L3L21P1k37k8l3m3k81K42M3K40J7K4K4o30M00o8K08l74K56K50n13j32k8
1694b80N07r4j26m6l9j15j40L72J1k31L00n9j73k82J47M14l53m9M9J78k73J3K36
1717c3L4o3J10p8l0K8J72K7k06J45p4J0P7j08O2L6J41l13N9N4J63r6r1N4L58m03
$$ y = [-134, 79, 322, 60, 67, 9, 313, 289, -25, 255, 451, 206, -119, 244, 180, -44, 181, 239, 257, -381, 141, 222, 132, -171, -70, 248, -111, -267, -123, 161, -339, -135, -8, -49, -329, 125, -94, -159, -453, 122, 41, -116, -543, -276, 178, -42, -148, -46, 11, -19, -89, -167, 145, 279, 44, 14, 2, -11, 98, 120, 136, -10, 161, 182, 208, 43, -145, 287, 541, 25, -167, 278, 231, -14, -128, 331, 180, -165, 227, 261, -109, -217, 124, 36, -28, -21, 34, -49, -277, -348, 190, 182, -140, -214, -54, -153, -158, -269, -110, 119, 8, -61, 6, -340, -154, 154, 98, -57, -100, -84, -97, -135, -33, 301, 272, 163, -42, -9, 312, 383, 146, 118, 85, 42, -239, 3, 46, 286, 303, 327, 351, -279, 121, 53, 261, -113, 143, 393, -120, -252, -280, 227, 133, 7, -39, -78, -193, -333, 39, 50, -181, 119, 60, -113, -395, -248, 166, -187, -236, -187, -9, -282, -269, -33, 1, -62, 48, -30, -60, -32, 140, 167, -39, 106, 32, 42, 119, 11, 73, 109, 250, -63, -4, 50, 213, 117, 26, 80, 438, 35]
1743C5j23O6J71K3l3j0j71j17J79K9j28j75J68L22m09k22L12K61m98J36J82j30
1765a32k31K25Nk0J14P4N1l15K8K16p0k65L33L50l39j96K2J40J02lm6o6J48n2
1789G3J18k46K72J1q6P7k0k71M3K27o7k72J11J45P9k40j46K45R9j12l37K22M2
1812c3j53K95j97J44k51n8O0l22J22M65M4m82L48N7k38m6L8J74J22j16j06K47
1834A14j91R3Q5o9Q9k43J20J62l19O6M22m8l90o8M21k75J65j27K06o7O1k37j46
1857a76M01M5k04J6q3L9l57L77k3O7j11J87l38n4Q3J59P4k58J44J28j76j64J73
1880e1K2J5j52J92n1k11K39P0j33k9L11q0l63O9K49M10m08k31J21K21j79R2nJ
1904A19R2J24l20N4J23N8j5n1j74N6jr4J17K73j15k04r1j90L08J33q9j93J36o2
$$ y = [35, -88, -22, 149, 172, 139, 129, -42, -159, 20, 49, -79, -254, -86, 236, -173, -395, -83, 178, -320, -184, -2, -132, -363, -138, -133, -153, -39, 35, 86, -229, -201, 15, -55, -320, 13, 363, 24, -172, -150, -10, 92, 89, 43, -23, 125, 73, 191, -55, 217, 228, 142, 219, 199, -72, -29, 198, 131, -141, -30, 115, 194, -46, -192, 53, 152, 40, -297, -75, -33, -186, 109, -88, 56, -195, -253, -193, -515, -393, 72, 116, -366, -18, 39, -199, -245, -207, -33, 89, -27, -133, 114, -77, 16, 101, 32, 121, -122, -2, 160, -159, -93, 329, 281, -109, -177, 244, -31, 134, 7, 213, 146, 207, -30, -176, 225, 270, 66, 82, -1, 38, -319, 58, 35, 102, -9, 178, -160, -214, -131, 28, 102, -156, -12, 116, -60, -224, -51, -29, -14, -166, 26, -25, -236, 3, 73, -60, -89, 222, 142, -221, -152, 97, 507, 99, -132, -11, 210, 31, 123, 118, 119, 211, 335, 15, 69, 192, 250, 235, 184, 10, 66, 65, -29, 88, 361, 246, 42, -49, -239, 69, 202, 113, -80, 56, -6]
1928fk14l0J53o8J74j02r0K49k17M6Q5j52K2J08O9q5l14M38j54J49k63N80k51
1951A27j57K80Jn6k02K05O2m07M04n3q9m6J50K21l41j39K30J71k58o1L9j73L7
1974e5RK25k32j02K73J20l27L3L9k04J68j28J58j87P8J98j7l16J07J43k25Q9L08
1997A55P0m89J50J87J9N5j42J31j56k5K26o0k51J46M15m54J32R0O0n5k00J21R9
2020B24p9K1K57k31m5n9L82o11k2K05J20j49n5j15J29r8J84j67l28K99J03k65
2042c00j1J54J87k36P2M4L3j26k42O76k50j01L4p2j6R4J28K03m92J83J70j51p9
2065i8J98J59j35J19M8j09k03K27K36l74j76L32r3j28L2M10j64k95p5K35j06k35
2087a95L63k10k18K51P3j20r1p2K74k29J6J10nk53J38L65k35k38J67pj23m9K73
$$ y = [-6, -220, -250, -97, -165, 9, -93, -183, 66, -151, -105, -20, -172, -150, -42, 27, -58, -372, 66, -88, 61, -202, 378, 127, -30, 250, 251, 195, -7, 198, 260, -147, 257, 204, 115, 69, 219, 440, 99, -40, 190, 361, 103, 42, 81, -92, -55, -46, 179, -53, -155, 118, 238, -89, -56, -17, -221, -53, -181, -23, -210, -132, 66, 49, -267, -160, -17, -242, -153, 155, 225, -264, -114, 73, 92, 147, 5, 136, -20, -45, 181, 121, -130, 16, 431, -23, 109, 199, 259, 204, 4, 125, 224, 145, 166, 423, 192, 147, 88, 470, -141, -163, 42, 162, 13, -42, -157, -28, -126, 58, -109, -437, -138, -35, -300, -311, -157, 30, -206, -134, -90, -57, -183, -425, 251, 1, -100, -66, -138, -154, -60, 68, 271, -221, -38, 132, -19, -98, 100, 259, 124, 243, 291, 182, -21, 206, 442, 68, -108, 224, 131, 3, 35, 445, 281, -14, -89, 146, 40, -195, 168, -42, -260, -9, 64, -56, -147, -219, 55, -174, -158, -48, -53, -306, -168, 197, -38, -276, -109, -116, -239, -288, -15]
2110a5R0k15R3L9j59Q8K87o0n0j74K30kj40R3k3Pl8N5J71m86L19K18l21n3k4M44
2136C74n21n0L54m1k22P1K03p0l41L96K87l93r1k1K10l45J56q0l7k17L18j2j20
2159a92J33L50l38k77J08K50q8j81J29N8j05R2N9L4j91J65J32j30rL07j78k00
2181g2rN41q0m31K76L6k70L3J96J06l65L1K40k25j3l2J59j78j48K93p5p2o1K51
2205A31j77k88L54l6j48N7J46o5l45L24J34l78j18K28J42k06R0J67k26L3J99J65
2227A83k38K3R2Nm8j3J22j68K41j11L9j21l4L12l16j27K28K40k37k09J50Q7K6
2250A26q8J90k23O9k08L15l09J54J23j40l30J41K81Q7m54K72K45m39j38M18j10
2271a8l70L15Q3j88j91K45K12j42j78K52O9k88J47K90j04k55L04Nk21%K58N2k05
$$ y = [-15, 75, -140, -47, -8, -167, -79, 208, 148, 98, -76, 154, 152, 12, 105, 82, 89, 51, 106, 277, -209, 110, 328, 7, -46, -70, 374, -147, -197, 157, 116, -106, -35, 168, 98, -243, 153, 440, 47, -44, -65, 145, -200, -44, -124, -161, -378, -60, -72, -192, -59, 291, -47, -324, -216, 34, -54, -235, -106, -48, -153, -61, -2, 32, -159, 6, 138, 8, -1, 306, 128, -72, -81, 460, 380, -51, 225, 261, -9, 24, 220, 326, -39, -8, 232, 7, -6, -38, 121, -57, -205, 88, 13, -59, -120, 131, -46, -334, 20, -16, -164, -107, 39, -26, -371, -47, 87, -291, -409, -181, -39, -245, -155, 12, -214, -181, 18, 183, -55, -32, 60, 65, 17, 4, 126, -42, 199, 88, 127, 6, -28, 284, -32, -159, 69, 309, 72, -137, 13, 100, 126, 38, 228, 5, 74, -134, 181, -128, 26, 149, 9, -321, -180, 101, 188, -266, 6, 251, -188, -326, 92, -18, -388, -73, 10, -178, -369, -124, 88, -54, -232, 20, 89, -199, -52, 238, 134, -121, 183, 188, -33, -33, 225, 277, 72]
2294G2P3K26l74k37L27J21j70J9K80k76k12K22N7l30J18K52J4l22m2L72o8l95
2316b73K28J53k11k31L70n3l79N37n1q1k18P2M91m50k73L92q5O4l92L79j16L3
2338i4p1Q1k80K34K31l7l17L46K87k63l20J86M82l98mK05J33m69K02J61j52j94
2360e1R4J76l83L9L34k48P3j02L78k95J10l10J61j28J0K10Q1n93M22L9l20J8L48
2383F3m2l59J65J32p9k48M24J24k59j05K27mk18J18K51l15l0N3K87j82j81L80
2405B02o6k33L39j36r7K09o2Q5j99m3L09k45j65K9M78l38m3K52j01l22J75J26
2427A54j27k65K95j06p4K0M9k0j1o6J1n3j0L55m4j95l13L69J6j06J7M43k05k37
2451a03n4M31k55k31M46m3l31L02J57j82k79M03j18q5j4J55q0l5M9L09m14r9J10
$$ y = [72, 145, 371, -3, -240, 87, 208, 38, 57, 337, 61, -151, 71, 128, -202, -84, 168, 182, -140, -182, 190, 122, -273, -45, 108, -103, -334, 36, -17, -396, 141, 90, 9, -209, -137, 354, -96, -369, 23, -62, 2, -390, -11, -127, -94, -165, -84, -364, -130, 101, 64, -253, 93, 380, 117, -203, -17, 465, 67, 63, 268, 401, -68, 134, 295, 143, -51, 43, 219, -164, -125, 209, -39, 34, -68, 310, 15, 125, -185, -24, -152, -142, 68, 149, -444, -22, 17, -303, -285, 63, 21, -338, -173, -41, -120, -368, 56, 180, -79, -184, 43, 39, -179, -61, 190, -125, -155, -102, 185, 3, -178, 202, 136, -97, 242, 106, 9, 218, 156, 241, 42, -1, 308, 63, -102, -73, 405, 67, 24, 276, 175, -147, 28, 154, 27, -238, 57, -49, -123, -103, -54, -74, -85, -151, -140, -193, -203, 152, 108, -87, -400, -31, -15, -121, -104, 339, 134, -103, -157, 274, 19, -212, 234, 191, -140, 162, 319, 137, -142, 261, 143, 58, 44, 199, 119, 84, 133, 442, 28, -71, 39]
2474C9J59l30p3M75k14k71K79K11k98k81N54j52k38K04r2K3j82P9K31j91r4M6
2496a16M9n2L0J49q1j13J06K47m76J7L08j19J1O0J94l63p2L82m4j21j7M02q7n42
2520b48M01l1j71jK07q1k1J29M4j12j82J54J5j59jJ65Q7l14J33J15n6k18J01K04
2544A60l61K6R8J93m77K88J0k26K02O1J14k77K16o6L6j29P8J29k34N3O7l5R3r1
2568g2J24J80n17K41J74Pl79L76K48m71N7P5P3p0j19L80m35P0J27k9j65K34K64
2591C73j84k57J94r4k28L4J04R0k14p4J32m3M8J97O0l32j17K65Q5j24M6J77k20
2614h2j74J43J30q5K3J30j52r3kJ69M0j68K97j80J59k31K19j66j44L09M7k37Q1
2637C3MJ50k30LK76q1l4j12J73l63n2K08K08l04K18j13R7l56J59Q4R5k65K66O6
$$ y = [39, 198, -132, -205, 270, 56, -215, 64, 275, -23, -304, 250, 98, -140, 64, -28, -5, -187, -108, 123, -68, -162, -116, -67, -119, -89, 60, -21, -134, -28, 219, -257, -240, 68, -51, -40, 20, 214, -149, -221, 161, 117, -4, -21, 381, 294, -248, 153, 122, -49, -50, 157, 76, 55, 184, 228, 116, -66, 88, 103, -56, -57, 108, 195, -119, 14, 129, 73, -145, -44, 160, -201, -175, -77, 116, -361, -73, -63, -289, -87, -26, 88, -189, 27, -39, -3, -132, -54, 75, -159, -106, -39, -74, 19, -72, 52, 232, -285, -44, 130, 137, -242, 134, 382, -89, -32, 43, 116, 46, -73, 307, -128, -58, 69, 40, -125, 109, 373, 189, -68, 126, 32, -196, -162, -58, 32, -182, -256, -124, -167, -119, 78, 138, -194, -311, -46, 39, -85, -39, 138, -82, -256, -113, 17, -68, -45, 85, -67, -160, -162, 7, 47, -121, 176, -4, 155, -76, 143, -23, -167, 142, 189, -48, 33, 37, 187, -43, -40, 236, 155, 121, 9, 182, -181, -233, -25, 183, -121, 97, -16, 81, -275, -116, -32, 63, -202, 64, 130]
2661A30l71J37K30j25l32J44J87o5l8K89j35k14P0L14l70n5K19M5j86J0J34M6
2683F4j52J31n8J57j35N2l1k46K93K70j31k74K73J04j09j55J02O3j77l9J67nm6
2706A18q7ll11P6K39J65m86Q6M34m13O1P4J71l78M2L03m9p7q0J58lj61J79L8j13
2731a7p7J00m0j91J78o0K96k81J35K80l35J7K37k46j62K83P5q6j81Q2K54k47j06
2754i2K23n3n6n4K19j62r6J53R6k59K5O4j0j77J77K3k49K56Qn0r4Q5K2j33N0M0
2780d4L6j39%Q1j05n0L3L06j29K8M8j29O5R1j1j98k7J51L36l60k79K50K1J07L1
2805A13P5r1r4K41j87km3o0J92k88J03K84j88l7j76L68l25K8L8J04j58n0K45j73
2829h1K9j5R3k57J82k0j31P1O9P2J00k27J46N4m8l79K29R9j27J40K5J68l23K55
$$ y = [130, -241, -104, 126, 1, -331, -187, 0, -65, -103, 186, 51, -163, -93, 221, -149, -204, 15, 60, -126, -116, 18, 64, -88, 43, -15, 142, 7, 59, 28, -218, 75, 345, 214, -60, 213, 317, 208, 53, 155, 218, 41, 2, 169, 164, 118, 31, 28, -283, -207, 32, 197, -289, -203, 231, -182, -121, -47, 124, -254, -212, 91, 42, -35, -115, 43, 40, -121, 58, 96, -17, -94, 6, -34, -225, -47, -107, 189, -92, 43, 323, -12, 5, 242, -4, -166, 117, 192, 106, -75, 7, 261, 14, -92, 131, 78, 22, -32, 187, 25, -71, 82, 178, -81, -56, 8, -2, -179, -2, 21, -228, 28, 36, -14, -108, -23, -1, -134, -84, -44, -8, -147, -147, -66, -171, -221, -188, 118, -11, 17, 65, -64, 1, 92, 81, -117, -144, 7, 343, -17, -296, -46, -25, 82, 113, 188, 97, 3, 244, 57, 55, 12, -48, 144, -144, -41, 243, 55, 18, -158, 210, -115, -87, -49, 55, -103, -153, 92, -81, -52, -67, 26, -231, -49, -69, -200, -129, -60, 12, 112, -115, 31, 85, 37, -342, -113, -14, -141, -1, 24, 192, -131, 124]
2853A24J72n63K50K56j04k18J09J32j61P3J59l44L7LJ64O2k20J29J01k72J07K61
2875B57k31M5k64J21l7l6K27J03k95r3L02j15K5o9M8pk59J06J36j7K7O9j94J16
2899c5j70K66j88K77j01PN8j35OJ93j90j9N2l2J02N4k8k59J92J21o6n0K03k57
2923Ar0J92n1j5P4j41KRo4K1K2j07M3J64q8Qj07J08K7j29K03pj77nK39p4q7N0
2951B1p6l7P8Q1l0j86q4K34J4n2J1RP2J8j3j7n3Oj7J01j73J75J11k99j9L94k13
2978E6j13R0J11j10r9nJ09MO9m2M9k64J35M3q8j35K65n9j44nL76k13j72K0n4J41
3004c5k77K22n6lR4N3Mj02M2K2k4o3K60n8k43P9J52p5N4p9J12mj10J74P7j59j99
3031a42K03N9k59Q4L53l44R8Ln2j3l1L3N3j07K24J12k92J76j51K6k43J89r3J07
$$ y = [124, 296, -267, -17, 239, 135, -83, 26, 158, -3, 70, 229, -115, -78, -75, 89, 151, -69, 60, 161, -111, -4, 257, 26, 71, -193, -72, -109, -145, 82, 185, -110, -203, 99, -16, 9, -60, -12, -19, -278, -172, -36, -53, -26, 43, -151, -35, -205, 61, -127, 150, 49, 56, 114, -21, -15, 178, -12, -31, 21, -11, 91, 145, 117, -142, 50, 171, 105, 55, 258, 1, -89, 103, 52, 37, 111, -30, -28, -19, -83, -62, -40, -147, -104, 60, -28, -20, -127, -19, 8, -121, 82, 75, -102, -107, 132, 58, -29, 21, -55, -92, -14, 67, 37, -149, -233, 1, 15, -37, -26, -17, 55, 73, 60, 43, -10, -4, -21, 80, -93, 82, 193, -106, -125, 269, 56, -57, 33, 144, 34, -65, -70, 39, 43, 112, 70, 119, -145, -10, 33, -55, -190, 75, 16, -128, -133, 243, 30, -142, -122, -176, -35, -312, -90, -146, -149, -55, -2, 2, -100, -58, -36, -60, -123, 137, 79, -164, -85, 67, -8, 46, -33, 79, 75, -35, 139, 216, 57, -142, 61, 120, -139, -55, 298, -46, 52, 55, 3, -10, -41, -8, 45, -62, 162, 274, -18, 158, 7, 33, -210, -21, -114, -7]
3055gj03r8R8R2m6K68k0l18J38j78J05M6JK37k67K9R6j62R3j9Q9o7O0O5j26j86
3081a80J12J36o7k3O7N8j92K62J5l84K57J10J04l89J64k28L65l0j57K28l90J37
3103b5RL3l3j0o2R9j89K33j00K58k89p3J19j39O1J19J28k19K00k31R7l25K84M5
3127a0q4R2k3k4j83K11J47r5O3j29J63j37qr0K88j48j36K74j87J07j52R6J68k29
3151b6J25L9k17O2l1J56j53KL8m1J16k88K77o0K3J4j19m6J9K7R4m7o0J03mM8j10
3178e9q1J49j08k1Q8o3Q9J2jM7J51k36Q1j56J00p0J75P2j64J2M5J53j34k15K71
3203A37j81K86j98j20R3R0J51o1Nl01Q1J19k67R0K13k05J29l8l3L6k52K28j5Q5
3227G2p6l4J43k93K68p5l7k0J20j24J38q1J42j36J56q4j87J77j40J9O8J3p9L30
$$ y = [-7, -110, -208, -110, -18, -64, 204, 184, -134, 4, -174, -69, -23, -22, 215, -52, -23, 73, -89, 4, -15, 74, 7, 67, 132, 6, -180, -68, 68, 1, -22, 45, 103, -89, 173, 188, -196, 61, 171, 275, -114, 50, -178, 187, 157, 0, 228, -162, -25, -16, 17, -16, -26, -88, 11, -178, 55, -45, 213, -76, -149, -30, -169, -108, 11, 139, -80, 120, -111, -14, -339, -55, -10, -94, -2, -25, -49, -232, -21, 126, 31, 94, -35, 128, -9, -17, -107, 181, 33, -103, 171, -16, 91, -61, 35, 203, -26, 99, 138, -79, -17, -48, 108, -45, -43, -5, -46, 70, -218, 59, -1, 22, 36, -83, -129, -110, -83, 11, -36, -96, 7, 3, 51, -59, -140, 9, -99, -120, -32, -95, -6, 6, 5, 52, 203, -33, 48, -108, -8, -78, 97, 169, 5, 17, 62, 215, 81, -134, 137, -44, 242, 44, -76, 17, 107, 258, 197, 202, -99, -18, 101, -166, -76, 137, -68, 61, 23, -10, 26, -226, 2, -13, 72, -4, -38, 105, -188, 80, 5, -32, -52, 68, -56, 82, 1, 143, 7, 163, 79, -108, 69, -71, -52, 16, 29, -50, 280]
3251B80l53P9J30j25K2rKn6K6J23k40R7L1J67r2N2j07J88j97j30J44m6j07J24
3275CK4K02k20o4J42j45l0J0J3qJ07o7J11l37L89k99k9K8K42m3k08L03j19j11
3299a06K24l8K9k64K4K02q5J13o7J08M5j41j15K60k45P5J90j68lJ80k00m9l0j1
3323g2J02k2O8j00j71L7Q1K01j30j04kJ57Qj79N9J29k54l0K25k1kp9O0qo2J92
3349H3j31l9J37m8J06r5j02p3L18j04l6o3j53K29K26n5k06L3p2l1K6J56j71N5
3373a0kK8J39p8M3J73k93o6J04j82L61J7k64J71k04p6J78n4O0p9K1j21K28j44
3397e0L0j06R2j24K7K47j87L11m60K38J02j58Q8Q4j10k44L18j79J34k01P7J30
3419E9j91J72M8j84J83j11J32q1P1k43K39k62K52n8n6J02n0p5k6J8j2kJ13l6J38
$$ y = [280, -73, 6, 136, 11, 33, 24, 26, -30, -4, 119, -121, -24, 7, 174, 82, 134, 27, 215, 18, -112, 32, -14, -121, 3, 27, 229, 9, -55, 87, -58, -88, -78, -65, -73, 34, -33, 78, -259, 130, -169, -198, -170, 72, 29, -179, 124, 5, -106, 118, 80, 109, -155, -131, 71, -14, 99, 32, 140, 185, 44, -71, 189, -56, 19, 209, 41, 38, 218, 18, -31, -61, -72, 30, 8, 76, -24, -195, -158, -77, 124, -6, -110, -112, 45, 53, -126, -67, 62, -192, -222, 3, -18, -20, -99, -39, -47, -109, 83, -48, -87, 50, 2, 108, 13, -89, -162, 156, 52, 16, -47, -200, 29, 255, 200, -6, 27, -45, -76, -50, 106, -65, -10, -12, 16, 155, 77, 120, 293, 0, -66, 38, -144, 217, 234, -30, 141, -63, -139, 39, -15, 45, -34, -13, -134, 94, -50, -20, -126, -34, -158, -131, 116, -71, 240, -220, 18, 120, -38, 50, 134, 24, -220, 98, -81, 53, -148, -71, 59, -132, 40, 88, -96, 87, -24, 108, 27, 98, -145, 94, -168, 84, 26, -30, 72, 22, -53, -79, -61, -73, -75, 38, 2, 140]
3444A40k23j6O7J03n0m0m5N6l14K73J05j10qN0j6O3P1jk52K21M8j99K12o7J49
3469B17l52K36l40L04L3k62L60j18k52L43l1l79K14L2P3Q6j76L8l6l5J56k03J13
3492B1N5k30K06j1o0j0R3m0k9j33Q3p8J27M3o0l3J97k9k37l9J80K1L7o5n0J85
3518A44n6M1m4l4r6Q4r9q8J83o3l1P9j6J79k68K71p9Q3l61J58N5M9k24K72l6j61
3544e8J86l9j4N1k49Nl6J52J2p0K71j54r8j03j8O5l9J40r9j7J58j02J71J05l87
3569a67L43j20l4j29l0J66lj8j30J15o4J51P1k29J40k2K7n7n2Q0n1K81m11J02
3593d1k6M2J81j28j4k0J92l50J25n6K11n9J4j03Pl0M1P9%j72K21m8q7l2L2Pj61
3620a75J91j9o9p2R6J03j03M2Q5K1j48M0o1j61M06j10O5m6r4q6K10qj30j9J43
$$ y = [140, -83, -99, -32, 71, 21, -19, -64, -8, -322, -49, 56, -54, -62, -12, -28, 35, 106, 105, -147, 74, 122, -77, 135, 68, 217, -135, 101, -239, 65, 98, -164, 196, 78, -174, 169, 138, -241, -27, 5, 78, 164, -12, 26, -10, -45, 111, -92, 21, 76, -154, 52, 41, -19, -29, 64, 24, -5, -138, -55, -133, -6, 37, -23, -56, 141, 112, -125, -164, 16, 37, 74, 9, -41, 144, 88, 129, 85, 51, -45, 39, -60, -148, 35, -28, -59, 20, 4, 183, -85, 186, 107, 190, -171, -13, 42, 91, -133, 139, 103, -58, 128, 89, 75, 126, -123, -118, -154, -2, 10, -60, 211, 57, -41, -144, -162, -97, -136, 4, -95, -112, 46, -56, 115, 220, -167, 176, 56, 22, -107, -137, 29, 26, 8, -122, -7, -71, 80, 151, -78, 62, 40, 67, 10, -42, 38, -13, 268, -143, -41, -67, -25, 156, 28, 14, -6, 186, -164, -39, -95, 116, 57, 71, -32, -25, -55, -14, 65, 65, -107, 114, 66, -21, -53, -21, -14, -175, 16, -3, -72, -144, -48, 55, -48, -6, 79, 100, -48, -8, -69, -230, 176, 66, 131, 85, -9, -95, 115, 107, -23, -42, 101]
3645A01K5k06K45N3k51L9j9K3L8m8j82K95n1k21J25K09k02J45j4k46Q8J32%j57
3669g9K60k25r7rK63l7k29L7n1Q4k7J99k85J86m7N2n1L2o5M2J38j66J36j99r1
3694b29K56K6k57K39k25J20j0P9J01j04N5p2K60j72j11K47l46L5J98j87L63l28
3716f2r0L29j96N8J31j84M3m4r5M2K5Q4Qk43J56K36o8k24o9L87m10J68l0Jr3J53
3742A3n7j4n1M7O4k07J79R8n9Q1j18On9K08j89J07j4k09K98j16Q0J52j49j2j9
3767F0O5op9q1MK06j64JM3O1j83P2j62J18J73q4n7L2j6J13j04N4n1J18j2n5j32
3794f6J76Lr7P9k11M3J30n3J50k39O7J32r6J86k12j02J17J00j25l3J09r2j13O0
3818h7K20k9j64l6j0K9j3J95J4k0o2Pq1kO9q1J8J52l2p4m2j25R6J48r0j79K87
$$ y = [101, 126, -80, 165, 218, -33, 6, -13, 10, 48, 0, -182, 113, 62, -159, -34, 175, -27, 118, 104, -142, -54, 78, 78, -79, 181, -44, -141, -150, 113, 76, -153, -116, -167, -83, -110, 89, -196, -10, -57, -5, -56, -24, -89, -47, 91, -75, 61, -138, -229, 27, 53, -204, 35, -190, -70, -80, -1, 100, -4, 51, -21, 239, 67, -44, 203, -143, -108, 90, -97, 266, -62, -152, 177, -19, 39, 170, -14, 29, -15, -110, -68, -43, 41, 49, -194, -38, 198, 130, -94, -163, 224, -186, -18, -48, -47, -140, 13, -44, -58, -109, -62, 2, -205, -26, 72, 13, 94, -24, -18, -77, 131, -58, 49, 35, -174, 124, 8, 88, 240, 91, 79, 60, 125, 119, 40, -41, -37, 169, 5, 6, 49, 110, -73, -1, -163, -45, 128, 44, -13, 19, 3, 116, 12, 66, 15, 133, 121, 66, -66, 110, 113, 16, 95, -116, -73, 57, 4, 154, -85, -18, 114, 18, 204, -8, -110, 7, 107, -18, -51, 58, -34, -147, -87, 133, 104, -60, -96, -106, -77, -90, 105, 119, 99, 37, 44, -37, -39, 30, -51, -33, 119, 87, 13, -29, -154, -58, 90, 0, -179, 108]
3845A08k04oL7M4J3j0j3L1rN2p1J78j69L%l6J56n8l51K24J4k3q9K47j02J34J0
3872A10k64K28j42J46p8q7rJ80j28R3k6J11k3K55n60K52J03k41J59q9Q7k2O7j34
3896a2j03j9J21k1p1m6R7j06N5J49j86K11r9J71k42R5p2K01j24j0n2j18L37l53
3920a97P3J22j08J78m3j08M7J94j26L3j21K19l8q0J4k1j59J02q6p3O0L1Q4M5L2
3945G4l3K28l83pR5L6k7N0j76R1PJ20j77P7j42L54j83n9Q1K5j77j9J29M8j06J77
3971A03j11m6J14q4mJ1R2m5K21l23L3M7j5j47J64O5m9m4j5rl8K50k24K25o1m4
3997F6K9m8j56J66l2r7N7J00K2j56J16q1j3R2j60L5j8J26m5r1J03PK3j37k4J38
4023B2k45J73j0J80j27N9j03n1k43L28j16L72j96k1J00j1l06M06k2j14O1j08L7
$$ y = [108, -96, -102, -65, -21, -8, -18, -31, 0, -9, 43, -28, 150, -19, -16, -16, -52, 104, 46, -305, -81, -67, -90, -179, 68, -34, 100, 110, -154, 74, -68, 78, 0, -87, -96, 84, -44, 49, 23, 134, 111, 366, -194, 58, 161, -80, 79, -10, 77, 55, 122, -12, -115, -134, -13, -34, -105, -151, -54, -160, -105, 44, -142, 69, -30, 141, -101, -6, -78, 123, -1, -11, -63, -181, 156, -197, -124, -2, -110, 68, 25, -83, -36, 158, 32, 65, -56, 163, 125, 45, 59, 38, -121, -19, -105, -178, -118, -87, -3, 42, 74, 41, 269, -114, -121, -26, 10, -17, 33, -143, -52, -45, 75, -102, -25, -167, 187, 4, -55, 26, 51, -126, -145, -16, 32, -74, 103, -8, -54, 60, -24, -28, -17, 75, 30, 251, -72, -39, 8, -7, -154, 10, 75, 26, -18, -33, -42, -80, 170, -54, 171, 110, 66, 95, 47, -109, 57, 25, -72, -15, 85, 107, -49, 67, -14, -27, 65, -95, -60, -78, 48, 3, -88, 15, 22, 45, -92, -116, 22, -223, -50, -60, 120, -7, 52, -51, -102, -345, -17, -133, 239, 43, 22, 122, 111, -195, 211, 189, 75, 136, 28, 65]
4046F5l56J53L23j16j01J09j83J27j1O1k9k3L9P1l16N3J58M4k83L30k51R8K93
4069B55j56J2j97L3j49L04j57R9J7k09J63j66R5O4N0m2P4j77N3K51j64J01o6R
4093I7j11O0k2P5j83J48j81K64N1k80J09j01O5J55n7j44n7Q3L26l27M8M3j68m3
4117a50K25j71J89r1k41J78QM6O8j34J90j44J91j82j81L03p4J28k20Mj51M02K
4140A95j96k03R8RO1%j6K7l6o6J56N3J38j58P6r6P4p0L8n8m0MK01j87Pmj02j27
4168b22J28R2N7q8J23r9r5K82q5k5Q4j73k5jJ4O1n1l8m1o4Q3N4K04l80J66q1K79
4195A59k73J5J54q5J7j04J34j9R5j45J93J21k99J47j52J33j16j2K40j73m3j01
4217a14K80k57J61n6R6j85Q0j47Q7L4q0K86k12P0j68J71J03o3M9j41j88R9p6K29
$$ y = [65, -291, -138, 185, 69, -32, 77, -106, 21, 10, 71, 42, 19, 58, 129, -187, -134, 24, 68, -215, 115, -136, -38, 255, 99, 111, -86, -53, -202, 102, -55, 44, 61, -148, 15, -151, -56, 8, 58, 16, 90, -87, -34, 217, 53, 154, 88, 97, -14, 46, 24, 99, -84, 64, -117, 147, 198, -82, 27, -74, -9, 146, 89, -55, -112, -29, 297, -30, 18, 61, -107, -150, 75, -96, 93, 2, -239, -61, -53, -7, 61, -73, 117, -27, 164, -18, -199, 104, 30, 158, -62, -58, -209, 193, 195, -1, -204, -106, -97, -36, -36, -52, -25, -61, -127, 29, 82, 220, 62, 138, 42, 116, 46, 84, 26, -14, -10, 191, 4, 11, 7, -95, -222, -94, -2, 55, -33, 90, -9, -104, 178, 93, 68, 152, -21, -46, -47, -33, 28, -23, -61, -102, -166, -83, -29, 175, -205, -39, -120, 159, -114, -99, 55, -30, -13, -117, 17, -2, 93, -52, 141, 262, -37, 110, -42, 91, -25, -37, 203, 30, -13, -114, 166, -91, 70, 14, 110, -75, 5, -142, -55, -21, -101, 185, -27, 43, -125, 46, 149, 86, 135, -6, -194, -95, -171, 58]
4241E8o4J37r0j87Q2o3J60k1k1ML3K6N0mo1j32J95o2j51j06J67J37j38J37l9q9
4267d2j21L22p4J1O8k1m5m6M3n4k19J40K19j00j16k5K31k22mQMm2N5M4j44M3M6
4294d1J9j08K03L8j59l7P1j02O8Q6j84J70m3K20j74r8N5K10j93j09K72k26K2K3
4318a7J92k32M3L03l75J16r5m4L46k68LJ76l1l2k1Q5k70J31j52J7J82m1Mp8qr
4344g5k0R1l4O9Loj22p2K8J14J42l59M02k69k2M8l8O8j10K08m4M2j04n3K34k31
4370a10j4J49mj60Q4k4P5l6J33k45L01k8j01N2j64K11k00K56k52K86j91k3J59
4393A54j39q0n6L48k42o2j22J58m8J23n4nP3N5j24j37J49JM5J7j53Q8j16O4J23
4418F0j7j22J77m3p0m9J36m3L2L7Oq2mr3J12Oj02M6M9k5j32Q8R4lq5J57n0k06
$$ y = [58, -6, 131, 41, -146, -64, -127, 33, 12, -9, -5, 28, 54, 104, 100, 39, -93, 102, 40, -111, -217, -50, 87, -51, 86, 47, -42, -163, 159, 85, 96, 164, 143, 98, 52, 95, 41, -178, -38, 181, 81, -35, -60, 171, -51, -55, -47, -43, -85, -30, 14, -130, -87, -41, -22, -130, 73, 111, -48, -85, -14, -116, -48, 38, -146, 24, -19, 201, 27, -71, -16, 194, 1, -108, 164, -62, -40, -17, 175, -57, -14, 289, -86, 30, -65, -109, 237, -31, -28, 148, 117, 85, 64, 149, -121, 10, -142, -125, 57, 16, 20, -58, -66, -75, -95, -4, -38, 31, 34, 28, -94, -166, -138, -24, 118, -241, 161, -108, -130, -82, -120, -52, -162, 46, 2, 44, -60, -113, 121, -110, -124, 25, 21, -139, -55, -79, -4, -40, 93, -152, 149, 121, 20, 72, -92, 119, -81, 175, -77, 209, 18, -5, 154, 15, -65, -121, 227, -15, -77, -199, -41, -89, 34, -20, -25, 48, 103, -21, -158, -9, -8, 37, 54, -99, -11, -127, -63, 60, 43, -79, 98, 55, -15, -64, 72, 29, 61, 98, 104, 22, 18, -75, 37, 43, -59, -13, 36, 11, -121, -33, 61, 58, -27, 130, 80, -126]
4446a26J79m0J04O3r9l0l52K42n1J20N5R1j85q5Q3r4K35k82J82j88K98k86P0J23
4470B7j28L4l7Q3j05K73j59k9R5mj93K82j94K18k64J91j79j73K63J30k14PM5j85
4494b16M32r6p6J03o7J48k26k2on3J49M8j1l11K16j56J80j43J61m6k20J1K45n
4518C9j71J00J15j7j87r4N5NK0o1PL49j74j70J16R4k7j49L46j47l0K4j88J30N6
4543D1j80k5K14k1K07j54k9n9k1J26r2J16j6j84j25J45J91qr2q5K2P3r5P7o0Q7
4569E3k43J83j61J21q2K03j38J31j10k9J54k37J30J13j07l0j12L08k03j22J2L40
4591A74q6N0L1r8l84J78J75jjr2K47l64K06O6q5mJ69j08m4j18L59k89P5j62M9
4616e7k3J94o8R5n7m2J08k01q7Q6J68j7j35J93j36n2J60k06P6l0n0pP0O9L1j33
$$ y = [-126, 53, 13, 117, 180, 81, 51, -301, -59, -110, 10, 65, 156, -29, -114, -31, -125, 110, -172, 10, -178, 120, -166, -96, 27, -101, -67, -104, -21, -126, 147, -12, -41, 54, 50, -143, 139, -55, 163, -101, 90, -89, -262, 1, 131, -83, -76, -31, -216, 216, 120, 44, 147, 80, 228, 2, -20, -26, -79, 70, 118, 107, -204, 12, -144, 36, -107, 54, 8, -212, -201, 44, 39, -132, -32, 83, 66, -121, -215, -160, -155, -135, -196, -189, 160, -14, -184, -68, 26, -1, -150, 196, 49, 19, 43, -145, -15, 41, -139, -164, 50, 29, 236, 82, 53, -6, -27, 99, 7, 123, 107, -77, -202, -57, 134, 126, 34, -51, -29, 44, -51, 26, -34, 53, -190, -7, -168, -47, -129, 74, -64, 67, -43, -72, 82, -155, -25, 88, -19, -49, -161, 147, -56, -178, -166, 174, 88, 138, 169, 71, -313, -135, 40, 39, 38, -54, 193, -171, 35, 101, 16, 12, 181, 73, 29, -89, 270, -19, 56, -106, -57, -80, 114, 46, 141, 84, 42, 150, -51, -138, -52, 116, 99, -36, 157, 21, -31, 129, -77, -1, -31, -81, -88, -18, 51, 82, -51]
4642e1l4n8K78l45K34O9pj91K98j6k78K79r0k0k00K19k0o3j53J26K7k34L64k19
4666h5J4J61j77J25j59M32l65J7N8j45K18j39J64j76q3J97O7r0j92N4J84j77R2
4689eN6k29K86j46J8J63p2r1K2R5p0j06J17j9oj52J78j31M9J71K5k42J89j54r
4714f3QL01l15J24j0j24J80N2k44n4K14L8j17O1j19qj11J59N4q6R8J49q8j47m0
4739h8oK10N0k50L6L2j02%J04P3m2m7J1J09l08K38q0K13r6j00o8P8p6K08j93K62
4765A68j67N4j18l8J50j51K12O2j07k4j64k5j5K65j35O9j58J44m6M8K06k85k1
4788g6R6O7j36Q0j4m6P5k28O4J63j88Kr1R9J24j08R0J80j95O0j25O1q1K41j43
4813b9R9p4m5n4J93j78J06J05k08R6J4j15K11j44n6O7J70j80R0R8k68J07N2j5
$$ y = [-51, -85, -143, 135, -210, 24, 93, 86, -105, 193, 177, -101, 178, 88, 68, -132, 87, 67, 4, -149, -23, 4, -230, 134, -85, -71, 90, -87, 38, -121, 311, -54, -37, 21, -124, 94, -45, 119, -57, -140, 57, 124, 34, -158, -104, 80, -97, -5, 51, -178, 108, -38, -20, 143, 71, -20, 2, 97, 27, -79, 38, 19, 13, -139, 39, -92, -43, 128, 153, -89, 100, -54, -63, -55, 246, -69, 55, 45, -79, 101, 153, -91, -145, 69, 107, -10, 51, -68, -76, -187, -28, 26, -60, 38, 187, 99, -48, -88, -94, 116, 166, -84, -48, -16, -118, -118, -14, 59, 17, -30, -19, 90, -218, 20, -60, 153, 57, -43, -111, -33, -109, 99, -94, 168, 1, 55, -63, -101, 49, -102, 110, 172, 65, 41, -123, -148, -163, 102, -33, 36, -122, 22, -24, 24, 230, -55, -76, 20, 87, -49, 31, 17, -29, 46, -182, -118, 45, -143, -141, -232, -133, -9, -117, -27, 153, -42, 18, -107, -46, -127, 114, -29, 70, -4, -49, -103, 90, -88, 18, 123, -85, 11, 25, -90, 121, -23, -79, -12, 158, -22, 68, 166, -102, 5, 57, 42]
4837D2n8N2n0K4m3MK3n2m4qJ65n0P0k48Q9m5N1J12j5r9R8l8n6NL48l45P0r2M7
4866d3J17m5M2n5J38p8j19o6K08m2j38r4J72J47K3l9l34L56k03J36j56K70j56
4889D1q1L2N7N6q7nk06K25j94K81q4j6P3j1k30L31q%o0m5Q3k61J30j00M9m4M6
4916b8J74Q7o0j60l0K7r4J05P1p5j2J19k3j83J56j03j0J26o4q1J43l2q8J70l9
4941I6j63K74j76j38P1K81r0j3j26o2O9M4j25J30j92J64r6J17j44N1J63l43L49
4964A41o1m9K3J30j38p0q9J81j06n6J36N2J58k72J25j80J42p0r0J12P7K3k41J50
4988B8o5P8j18J03j66K68j49oN3jo7j42O6O6j1L0k15L25O4j69j24K85q6m6m6K25
5014A80k98k5L8j26K09r6J40k31K09j0j48J83J08r7J36m0j40Pr6J75O8j02M1j80
$$ y = [42, -16, 36, -14, 10, -33, -29, -6, -58, -102, -110, 55, 5, 75, -173, -84, -129, -78, 34, 19, -80, 18, -20, -76, -71, 277, -68, 2, -90, -43, 74, 29, 71, 16, 154, 76, -43, -109, 99, 57, -81, -175, -3, 144, 167, 128, -206, 150, -53, 83, -73, 197, 41, -40, -8, 49, 105, 18, 13, -193, 32, -162, 119, 35, 19, 92, 81, -149, 182, 174, 174, 114, 69, 152, -109, 21, -79, -30, -74, -28, 146, 233, 173, 13, -17, 10, -84, 21, 92, 17, 5, 124, 101, -82, 74, -29, -39, 87, 23, -58, 85, 53, -35, 135, 96, -67, 207, 31, -107, -36, 245, 155, 142, 16, -46, 23, 67, -58, 72, -120, 44, -52, 65, -79, -28, 135, -208, 141, 80, 31, 54, 184, 46, -24, -113, 68, -38, -94, 42, 94, 252, -20, 105, -75, 67, -3, -93, 19, 96, 119, -122, 28, -37, 41, -77, 26, -140, 128, -21, -27, 26, 25, -42, -184, -118, -52, -63, -33, -248, 77, 141, -28, -152, 133, 47, 1, -45, 180, -118, -143, -105, -231, -22, -118, 22, -209, 0, -10, -158, 25, 133, 36, 172, 132, -8, -1, -97, 78, 146, 44, 85, -95]
5038i5N1R8j16j43J64l4L05j29j94L05k6k70J76J81l99J58M0k67L48Q0k83n7J73
5061F6l3o6J84k46J05N8m2J13j29j26J89j86K0p7J39j56J04J24O4q3q0q2K53l0
5085H3k5O8np7K0k8M9k27K6J20j8J25m2n8o2P0R6k71L78j96J72l93K84j73K31
5110A47oj70N6M1P4r7o1J45j03j6J98k46n1O9R1M3k56O5J7M0j06J26J43j72J19
5135I0O1l71L04j06Q3k85Q5K98l16K81k5j09K2q8k4K41j45J11J4r7K3R3k19J28
5159D9L4J1j01j16p9L82k40K5J07J15l20J48m0J41O1o8m8k3m1Mn3J16r1J63j96
5184f0j45Q3p4K11l7M9m2j59J02q3R3J7LJ8J92j6j77J69jk7m6nm4N4j51k0J27
5211C1j14k1J90j60J68j9q5j86L45r7j17J01l0k9K7J9j07j5nR8R0p6j46o4K27
$$ y = [-95, -44, 54, -62, -205, -41, -75, 230, 101, -93, 212, 186, -84, 92, 273, -126, 32, 72, -195, 153, 233, -50, -107, 66, 33, -33, 151, -95, 10, 68, 26, 139, 10, -116, 73, -113, -93, -170, -31, -187, -83, 41, 105, 22, -58, -140, 113, 83, 58, 126, 121, 44, 64, 36, 85, -142, -116, 4, -14, 111, 69, 11, -51, 19, 115, -156, 222, 26, 198, -195, 89, -84, 147, 141, -29, 27, 68, 142, 45, -16, 129, 26, 10, 208, -38, -89, -20, 71, 114, -142, -77, -60, -20, -126, 0, 143, -29, 90, 151, -220, 84, -22, 61, -224, -139, 159, -157, 124, 99, -10, 12, -76, -100, 141, -4, 107, 121, 24, 47, 140, -79, 49, 83, 94, -7, -123, -202, 180, -60, -35, 72, 187, -133, 15, -25, 116, 177, 109, 61, 38, -3, 1, -52, 64, -27, 136, -60, -205, -122, -196, 15, -22, 27, -15, -174, -72, -155, -62, -45, -42, -24, 168, 152, -25, 144, 143, 116, 70, 65, 21, 75, -76, -96, 31, -83, -104, 86, -74, 94, 75, -10, -196, 149, 52, -65, 36, 6, -23, 4, 23, -84, -99, -104, -6, 84, 8, -138, -202, 25]
5236B5O3j94Q2K2j28J07j75J18L4n6J77j28J28P3l37K56l6J25j00j67J39P3o1
5259D0q8O3j59J99j78j4J80r4m8K63j67l4L2l3K22q2q5l3J86J3k72J07j15J43
5283D6ko1J77j53n6P7l0q1J0k1L2o8J8n4K36O0k25J52j67L18m16K60k36J90k1
5308a5M9j5rQ3q9k1j94N3N6N6q5K08pJ1%k6j49J76j48Q9mj4N2J77l36N8K10J15
5336B81j58K7n8j83k5J05J26j29o1O4J00j89J16J32m7j39MK49k82j21j7K27J0
5359C2L7pr2j04J2N8J28k22M2J45j28K81K4q7k75M38j61k21K26n1r6J21L2r5j38
5384a01j17L00o1J11p3Q8p3j54Q0lj21J98N4j90O9J35k50J77K4o2L8j38p2J68
5408B7k52L00m6k03J83J20j21J50k7j18J06k42Rl8K04J7j76N0Lq6J32Q0J3k40
$$ y = [25, 88, -106, -24, -2, -130, -23, -198, -80, -46, -102, 75, -53, 75, 148, -189, 67, 31, 156, 56, -111, 28, 101, 40, -48, 15, -144, 55, -123, -137, 43, -51, -99, 164, -3, -37, -5, -38, 184, 102, 17, -16, 170, 183, -89, 18, -97, 46, 44, -17, 160, 7, -49, 28, -2, -83, -73, -94, -62, -130, -112, -166, 70, 130, -95, 57, -110, 208, -208, 52, -184, 6, -15, 34, 19, 10, 93, 4, -17, -211, -158, -102, -46, -131, 77, 70, 81, 81, 55, -94, 82, -66, 23, 19, 5, 57, 234, -102, -44, 166, 281, 123, 150, 92, -91, -116, -11, 115, -14, -75, -11, 89, -100, 16, 148, 101, -38, -34, 215, -67, -188, -205, 22, 32, 69, 62, -30, -134, -122, -64, 64, -158, -116, 29, -99, 182, 206, 119, -156, 282, 121, -100, 126, 75, -21, 100, 132, 37, -101, -218, 82, 21, 132, 59, 147, 74, -80, 0, -3, -124, 74, 128, -62, 7, 142, -108, 69, 93, 31, 69, -69, -141, 27, -225, 75, 29, -174, 9, 129, 8, 158, 131, 13, 119, -123, -114, -152, 52, 69, -107, -57, -54, -140, -8, 72, 85, -155]
5432a55K70j47n0N8j15mL07j04Jo6j1J30j40J53j05Q1j83K08m4P2k84K61k68K60
5456A25j68j95J08K73J39k41N8k44J5R8M6n6j00O8M2j4q2K03m8N6j51l5P2j21
5480a52J22M3r7m3R0MN5o8J1L1J5J9j17J77q1k3M6r0K41q6Ql5q9L5L6n3r8J2n6
5509a43K15k2o0K1R9J9l03K53p2J01j94J44Jq4J38l39J98j02o8K98M4j97r3R7
5533d9n4J35%jM4l9L7j12K32k77Q2n3j0J50j58j17K33j04q2J7J23Q8j08NO8j57
5559a07K10j33n5J79o0p4L7J7Mo0J91m6k30K98r7j72L7J69k51L3O1Q0j24O1M1
5584IQ1l3m2J65j89Q5j12lk0mJ00M9j22O7J3K52j96j78J43n4j20l3M5J36P0j67
5610e8J04j05K01K0q9n5M7l7Jj10K88l84J78rN9J17o4j76j91J03Q3lK03j06P9
$$ y = [-155, 115, -32, -82, -24, -139, -143, 164, 60, 61, -5, -16, 114, -26, 127, 22, 103, -80, 128, 84, 156, -128, 133, -135, 125, -43, -238, -130, 143, 282, 41, 99, -145, -130, -32, 14, -42, -142, -74, -32, -46, -128, 75, 27, 83, -68, -103, -31, -152, -30, 13, -84, -127, -37, -33, 22, -46, -35, -4, 11, 30, -87, 90, 9, -14, 32, -58, 183, 97, 105, 70, -19, 16, 52, -1, -99, -87, -143, 72, 50, -10, 11, 110, 129, -174, 79, 7, 108, -86, 58, 59, -25, 113, -226, -28, -130, -198, 100, 144, -53, -146, -49, -103, 32, 32, 31, 75, 36, 73, -39, 193, -84, -2, -55, -65, 85, -73, -190, 43, -61, -143, -126, -3, 85, -23, -18, 50, -107, 103, -30, -85, 94, 34, -40, -3, 14, 18, -42, 149, 103, -127, 171, 74, -98, -61, 108, -143, -110, -49, 31, -93, -32, 9, 90, 57, 15, 180, -9, 76, -36, -39, -59, -63, 37, 86, -36, 31, 44, 296, 100, -78, 65, 11, -109, -142, -97, 39, 109, -58, 46, -59, 142, 162, 73, 18, 65, 28, 29, -81, 207, -177, 1, -8, 51, 168, 104, -72, -263, -160, -77, -80, 123, 17, 96]
5635I6j1j75L9J65j56Q6J25q1j69K8K52k13J22k08K5J73p6J2J42k4j51PK2k29
5659a99J57j6J00l2j38K51R2j44m6J3j3q6Q5k4M0q7J28k25n8M31l03o0J37K01
5683B04k23J65k95J87O9nk17n8n1K95p5j35O7J8K20j48m2q2K17j04Jl2K3mQ0L6
5709A11j30J11j59M9Oj60J28M8L8j13J31j80J47k45J67K03j88j05J98kj56J94
5731I3p1Q6j15okK6P6j05K64k37o6Rq4M3jN8o0J62k7j49J19k16J31L9N3J23m7
5758I6k52R8M0K19k09Q6k05M7Q9J58l04J50j92K11q6J12j53k2j18J85n8LK47k82
5782a40K43l03Q2q3K17O0q6J16j06K34k33jo8l0K20r1m1P5l2l6R6Mk7J23k23O0
5808C0l3P0l7J45k64Jp4P9j3J09M2m4O7q3K5j7R9j08n5q7J79j28J23j48K03j36
$$ y = [96, 85, -90, -51, 114, -42, 44, 169, 88, -81, -53, 199, -14, 108, -100, -75, 98, 22, 34, 176, 152, 1, 8, 30, -199, -42, -58, 42, 10, -128, 123, 215, 71, 25, 38, 25, -61, 24, 0, 40, -47, 81, -144, -202, 229, -74, -134, 3, 204, -19, 146, -149, 38, 107, 102, -115, -173, -224, 71, -4, -139, -72, -54, 166, 18, -24, -106, 111, 7, 8, -24, -1, -5, 75, 111, -19, 92, -67, -18, -12, -172, -44, 4, 42, -71, 60, -120, 27, -218, -51, 152, -36, -141, 57, 55, -101, 93, 22, 108, -7, -13, -15, 11, 87, -18, 246, 9, -57, -48, -132, -89, -90, -32, -92, 70, 43, -106, 13, -203, -72, -33, 20, 143, 96, -156, -58, -18, 201, -8, 78, -127, -80, 9, 167, -137, 13, -179, 32, -54, 58, -95, -117, -235, -50, -108, -105, 142, -140, 103, -200, -118, -201, 16, 76, -10, 106, 0, 234, 1, 0, -68, -98, 122, 31, -10, 65, 33, -3, 93, 97, 70, 193, -30, 30, -3, 67, 30, 175, -89, -88, -162, -83, -96, 13, 55, 11, 78, -5, 20, 3, 102, -6, -61, -148, 31, -97, 26, -122, 81, -55]
5834e5m6J04J27p5L1j15Q2j54l7N9j8O9J82j62M3j31J13j25j09K71j43J01PJ0
5858B9o6j16Q4K37k31J28Rk47K23p0l2N6j88Q6J60n6j91J20L05l42J32n3j1K36
5882B02j61J2j51P2J71lj33k2m7K43j66J70k42o6J52j6rJ36kr8K0j42M3J04j25
5907e8O5j00J13j63M0J75j77n8K48pP8k10m4P0J89j4j67J15p9n1J56q9r6J52r3
5932eJ68k65J66o6R7NR9l22Q9J63k24J74n2l0q3R3j34k2K12k83L04k10L1N2OJ05
5958F8n4j75J89K3j26J51O6o0k7j2j46J89p2j96K28k9k6O6mr2P9j67J36Rp6l6
5984i4M4K9J47j55J08j90J47o2J00k10R7L9O3j72Q3N0r7nJ13o7J49p6n2J09j08
$$ y = [-55, -101, 3, 130, 55, 86, -29, 53, -101, -138, -79, -97, -28, 154, -8, 35, -96, 17, -108, -217, 54, -89, 12, 19, 29, -37, -153, -69, 168, -63, 65, 74, -173, 50, -20, -52, 4, -184, -98, 62, 6, -185, -65, 240, -102, 30, -23, -34, 202, 41, 53, -98, -26, 145, 142, 9, -13, -60, 183, 17, 187, -55, -121, 31, 15, 6, 142, 140, 42, 62, -80, -37, 67, -58, 7, -93, 20, -143, -103, 72, -105, -163, 85, 78, 156, -54, -98, -28, 161, 147, -20, 95, 16, -35, 121, 32, -64, 88, -5, 163, -102, 64, -2, 95, 100, 199, -123, -34, 129, -95, 79, 27, -3, -86, 7, -127, -149, 63, -220, 84, -126, -95, -43, -37, 68, 14, -161, 28, 51, -75, 76, 142, 82, 55, 43, -103, 86, 14, -182, 46, 17, -9, 57, 53, -39, 40, -127, 9, 18, -58, -94, -50, -21, 126, -29, 79, -111, 36, -26, 74, -136, -39, 0, 63, -109, -26, 24, -73, -78, 35, -32, 117, 41, -11, 98, -10]
$$ [...]
8191G0
##END NTUPLES=NMR FID
##END=
