##TITLE=1H_BAU-DB
 CDCl3, 8 sc, 
 24.6.2019
##JCAMPDX= 6.0         $$ Bruker NMR JCAMP-DX V2.0
##DATA TYPE= NMR FID
##DATA CLASS= NTUPLES
##ORIGIN= UXNMR, Bruker Analytische Messtechnik GmbH
##OWNER= root
$$ XWIN-NMR		Version 3.5
$$ Mon Jun 24 13:50:07 2019 Russian Standard Time (UT+4h)  she@DPX200
##.OBSERVE FREQUENCY= 200.13155
##.OBSERVE NUCLEUS= ^1H
##.DELAY= (6, 6)
##.ACQUISITION MODE= SIMULTANEOUS
##.ACQUISITION SCHEME= undefined
##.AVERAGES= 8
##.DIGITISER RES= 18
##SPECTROMETER/DATA SYSTEM= spect
##.PULSE SEQUENCE= zg30
##.SOLVENT NAME= CDCl3
##.SHIFT REFERENCE= (INTERNAL, CDCl3, 0, 15.7039)
##AUDIT TRAIL= $$ (NUMBER, WHEN, WHO, WHERE, WHAT)
$$ ##TITLE= Audit trail, XWIN-NMR		Version 3.5
$$ ##JCAMPDX= 5.01
$$ ##ORIGIN= Bruker BioSpin GmbH
$$ ##OWNER= she
$$ F:/spectra/data/she/nmr/H-F/1/audita.txt
$$ ##AUDIT TRAIL=  $$ (NUMBER, WHEN, WHO, WHERE, WHAT)
(   1,<2019-06-24 13:48:58.10 +0400>,<she>,<DPX200>,
      <created by zg, POWCHK disabled, PULCHK disabled
       configuration hash MD5:
       00 E9 B6 7A A2 85 ED C7 34 08 36 98 17 FE 4E 26
       data hash MD5: 16K
       DF 00 EF 97 79 0A 23 B2 62 8F 6E 9B A8 AA 21 57>)
$$ ##END=
$$ 
$$ hash MD5
$$ 3C 9D 91 FF E6 A3 1A A2 2F 1E 0C 76 96 2B 30 63
##$RELAX= 
##$RELAX= 
##$RELAX= 
##$RELAX= 
##$RELAX= 
##$RELAX= 
$$ Bruker specific parameters
$$ --------------------------
##$DU= <F:/spectra>
##$EXPNO= 1
##$NAME= <H-F>
##$PROCNO= 1
##$TYPE= <nmr>
##$USER= <she>
##$AMP= (0..31)
100 100 100 100 100 100 100 100 100 100 100 100 100 100 100 100 100 100 
100 100 100 100 100 100 100 100 100 100 100 100 100 100 
##$AQSEQ= 0
##$AQ_mod= 1
##$AUNM= <au_zg>
##$AUTOPOS= <>
##$BF1= 200.13
##$BF2= 200.13
##$BF3= 200.13
##$BF4= 200.13
##$BF5= 200.13
##$BF6= 200.13
##$BF7= 200.13
##$BF8= 200.13
##$BYTORDA= 1
##$CFDGTYP= 0
##$CFRGTYP= 5
##$CHEMSTR= <none>
##$CNST= (0..31)
1 1 145 1 1 1 1 1 1 1 1 1 1 1 1 1 1 1 1 1 1 1 1 1 1 1 1 1 1 1 1 1 
##$CPDPRG= <>
##$CPDPRG1= <>
##$CPDPRG2= <>
##$CPDPRG3= <>
##$CPDPRG4= <mlev>
##$CPDPRG5= <mlev>
##$CPDPRG6= <mlev>
##$CPDPRG7= <mlev>
##$CPDPRG8= <mlev>
##$CPDPRGB= <>
##$CPDPRGT= <>
##$D= (0..31)
0 1.2 0 0 0 0 0 0 0 0 0 0.03 0 0 0 0 0 0 0 0 0 0 0 0 0 0 0 0 0 0 0 0 
##$DATE= 1561369737
##$DBL= (0..7)
120 120 120 120 120 120 120 120 
##$DBP= (0..7)
150 150 150 150 150 150 150 150 
##$DBP07= 0
##$DBPNAM0= <>
##$DBPNAM1= <>
##$DBPNAM2= <>
##$DBPNAM3= <>
##$DBPNAM4= <>
##$DBPNAM5= <>
##$DBPNAM6= <>
##$DBPNAM7= <>
##$DBPOAL= (0..7)
0.5 0.5 0.5 0.5 0.5 0.5 0.5 0.5 
##$DBPOFFS= (0..7)
0 0 0 0 0 0 0 0 
##$DE= 6
##$DECBNUC= <off>
##$DECIM= 16
##$DECNUC= <off>
##$DECSTAT= 4
##$DIGMOD= 1
##$DIGTYP= 9
##$DL= (0..7)
0 120 120 120 120 120 120 120 
##$DP= (0..7)
150 150 150 150 150 150 150 150 
##$DP07= 0
##$DPNAME0= <>
##$DPNAME1= <>
##$DPNAME2= <>
##$DPNAME3= <>
##$DPNAME4= <>
##$DPNAME5= <>
##$DPNAME6= <>
##$DPNAME7= <>
##$DPOAL= (0..7)
0.5 0.5 0.5 0.5 0.5 0.5 0.5 0.5 
##$DPOFFS= (0..7)
0 0 0 0 0 0 0 0 
##$DQDMODE= 0
##$DR= 18
##$DS= 0
##$DSLIST= <SSSSSSSSSSSSSSS>
##$DSPFIRM= 0
$$ [...]
##$SUBNAM2= <"">
##$SUBNAM3= <"">
##$SUBNAM4= <"">
##$SUBNAM5= <"">
##$SUBNAM6= <"">
##$SUBNAM7= <"">
##$SUBNAM8= <"">
##$SUBNAM9= <"">
##$SW= 44.9344731272789
##$SWIBOX= (0..15)
0 0 2 0 0 0 0 0 0 0 0 0 0 0 0 0 
##$SW_h= 8992.80575539568
##$TD= 16384
##$TD0= 1
##$TE= 0
##$TE2= 300
##$TE3= 300
##$TEG= 300
##$TL= (0..7)
0 120 120 120 120 120 120 120 
##$TP= (0..7)
150 150 150 150 150 150 150 150 
##$TP07= 0
##$TPNAME0= <>
##$TPNAME1= <>
##$TPNAME2= <>
##$TPNAME3= <>
##$TPNAME4= <>
##$TPNAME5= <>
##$TPNAME6= <>
##$TPNAME7= <>
##$TPOAL= (0..7)
0.5 0.5 0.5 0.5 0.5 0.5 0.5 0.5 
##$TPOFFS= (0..7)
0 0 0 0 0 0 0 0 
##$TUNHIN= 0
##$TUNHOUT= 0
##$TUNXOUT= 0
##$USERA1= <user>
##$USERA2= <user>
##$USERA3= <user>
##$USERA4= <user>
##$USERA5= <user>
##$V9= 5
##$VALIST= <valist>
##$VCLIST= <CCCCCCCCCCCCCCC>
##$VD= 0
##$VDLIST= <DDDDDDDDDDDDDDD>
##$VPLIST= <PPPPPPPPPPPPPPP>
##$VTLIST= <TTTTTTTTTTTTTTT>
##$WBST= 1024
##$WBSW= 4
##$XGAIN= (0..3)
0 0 0 0 
##$XL= 0
##$YL= 0
##$YMAX_a= 351828
##$YMIN_a= -407606
##$ZGOPTNS= <>
##$ZL1= 120
##$ZL2= 120
##$ZL3= 120
##$ZL4= 120
##$ABSF1= 10
##$ABSF2= 0
##$ABSG= 5
##$ABSL= 3
##$ALPHA= 0
##$AQORDER= 0
##$ASSFAC= 0
##$ASSFACI= 0
##$ASSFACX= 0
##$ASSWID= 0
##$AUNMP= <proc_1d>
##$AZFE= 0.1
##$AZFW= 0.1
##$BCFW= 1
##$BC_mod= 2
##$BYTORDP= 1
##$COROFFS= 0
##$CY= 11.3945322036743
##$DATMOD= 1
##$DC= 2
##$DFILT= <>
##$DTYPP= 0
##$F1P= 18.9103706918063
##$F2P= -1.10871071338519
##$FCOR= 0.5
##$FTSIZE= 0
##$FT_mod= 4
##$GAMMA= 1
##$GB= 0.15
##$INTBC= 1
##$INTSCL= 1
##$ISEN= 128
##$LB= 0.24
##$LEV0= 0
##$LPBIN= 0
##$MAXI= 10000
##$MC2= 0
##$MEAN= 0
##$ME_mod= 0
##$MI= 1.114404
##$NCOEF= 0
##$NC_proc= 0
##$NLEV= 6
##$NOISF1= 3.799351
##$NOISF2= 2.8
##$NSP= 1
##$NTH_PI= 0
##$NZP= 0
##$OFFSET= 15.70392
##$PC= 1
##$PHC0= -8592.618
##$PHC1= 25.60097
##$PH_mod= 1
##$PKNL= yes
##$PPARMOD= 0
##$PSCAL= 0
##$PSIGN= 0
##$REVERSE= no
##$SF= 200.130013532006
##$SI= 16384
##$SIGF1= 3
##$SIGF2= 2
##$SINO= 400
##$SIOLD= 16384
##$SREGLST= <1H.CDCl3>
##$SSB= 0
##$STSI= 0
##$STSR= 0
##$SW_p= 3612.71676300578
##$SYMM= 0
##$S_DEV= 0
##$TDeff= 0
##$TDoff= 0
##$TI= <>
##$TILT= no
##$TM1= 0
##$TM2= 0
##$TOPLEV= 0
##$USERP1= <user>
##$USERP2= <user>
##$USERP3= <user>
##$USERP4= <user>
##$USERP5= <user>
##$WDW= 1
##$XDIM= 8192
##$YMAX_p= 0
##$YMIN_p= 0
$$ End of Bruker specific parameters
$$ ---------------------------------
##NTUPLES= NMR FID
##VAR_NAME=  TIME,          FID/REAL,        FID/IMAG
##SYMBOL=    X,             R,               I
##VAR_TYPE=  INDEPENDENT,   DEPENDENT,       DEPENDENT
##VAR_FORM=  AFFN,          ASDF,            ASDF
##VAR_DIM=   8192,          8192,            8192
##UNITS=     SECONDS,       ARBITRARY UNITS, ARBITRARY UNITS
##FACTOR=    0.0001112,     1,               1
##FIRST=     0,             0,               0
##LAST=      0.9108392,     0,               0
##MIN=       0,             -407606,         0
##MAX=       0.9108392,     351828,          0
$$ Real data points
##PAGE= N=1
##DATA TABLE= (X++(R..R)), XYDATA
$$ [...]
3574H684l065p076n850r80M517P202L878j811o153m658Q79N678P434K591m961
3589F309p621n815P26N690P121L393k934o336l923K64L804N389J831l573n986
3604a661n713l42M889P764L774k020o791o907j144M481P022L616m091p201n756
3619a0080N79P361Q182L235m707p751n651R66N944O625J604l778n983l271J829
3634d896O429N919J750l900o128n115K55M902N651L494k526n855m812N77N198
3649I43O012K467m411p040o496M94N915P547K605l817p066m569J000M893N197
3664C674P91l684n879m094J381M494N812K345k266n720m713p69M172N797L323
3679D664j901n860m575n99N546Q137L465k884p344o604N61O487P224L490l678
$$ y = [8684, 5619, -1457, -7307, -8287, -3770, 3432, 7310, 5499, -654, -5312, -4433, 1245, 8679, 11270, 6309, -1312, -7127, -6401, -711, 6410, 9803, 6869, 533, -3390, -3126, 678, 6067, 7898, 4325, -1661, -7374, -7716, -2827, 4937, 8711, 6691, -100, -7007, -8151, -3670, 3352, 6968, 2877, -4324, -10080, -9501, -2140, 6042, 9277, 4570, -3181, -8832, -7866, -1922, 4703, 6307, 2529, -3454, -6725, -4896, 1533, 7452, 9202, 5302, -826, -5941, -5686, -784, 4867, 8361, 5835, -20, -4832, -4255, 943, 6955, 9422, 5011, -2029, -8525, -8031, -2116, 5431, 8036, 4219, -2847, -7416, -6416, -1523, 3674, 4465, 781, -5098, -9192, -7811, -3317, 2495, 4840, 2574, -3146, -7859, -8628, -4456, 1341, 4664, 2763, -3097, -7672, -8271, -2725, 5412, 8877, 5993, -1351, -7955, -7394, -907, 6317, 9807, 6129]
3694F129p490m757K067O463O776J054m404p264m501J712N696N660J572k976o124
3709c87m309R57M149N195K262l609o375n443N35N068O737K935l282p072n470j64
3725h273O188O122J839m431o858l885K466O403N787R95m305n900l831J427N277
3740i79N019J221k058m527l407L91M197N214K157k069n537n099p13M781O734L712
3756I037k513o750n755k58N453O935K061l779p716n292J661N990O729J810m502
3771C111p140m200R57N457N543Q60l562n750l439P88N306N525K133k904o713m089
3787h117P82M544O631K416k687o480m964J308O996O893J580n005o660l810J468
3802e105O847N751J787m688n520l527K549M703M153N81m032n074k798Q20M462
$$ y = [6129, -1361, -6118, -4051, 2412, 9188, 10242, 5838, -1426, -5927, -4215, 1481, 7141, 8713, 5737, -387, -4696, -3739, 410, 5605, 7867, 4258, -2117, -7560, -7025, -1957, 4780, 7715, 4433, -2639, -8109, -8273, -2085, 4037, 5876, 1445, -5413, -9298, -6832, -429, 5358, 6353, 2048, -3852, -7683, -6256, -979, 4040, 5261, 3203, -1324, -4731, -4340, -143, 5071, 7228, 5159, -378, -5477, -6190, -1409, 5325, 9037, 6524, -226, -5981, -6239, -786, 6149, 8210, 4431, -3285, -8577, -6916, -926, 5803, 7613, 3111, -4029, -8229, -7272, -1815, 3728, 4588, 1026, -4724, -8163, -7375, -2069, 3456, 5589, 2685, -4028, -8117, -7335, -2791, 3840, 6256, 3569, -2911, -7875, -6567, 429, 7322, 8902, 3897, -2763, -6573, -5105, 1742, 7493, 9280, 4592, -928, -4455, -1906, 2797, 6950, 7531, 3499, -1575, -4373, -3553, 909]
3817I09N357K232k952n785m418q82L954N675K302k376o214n198J30N909O473K650
3833G766m711p232n016J214O036O889J301m128o187l908J777N656N071J156l511
3848B173n651m142J383N258N506K355k838n548m510M02N513N853J899l735o467
3863b549m743J145O585O318K070m670p306m230J221O335N327J056m462o741k279
3878f923J906N975M179K88l967n376l161J029M286M872J365k304n156l357N14
3893e830M696N723J794l693o475m255J091N998O812K614l967o494m442J604N542
3908G18N964Q03m380n844l172K230N918N245J423l509o336m042R87M361N060J555
3924F981l003n633m038J520N239N591J758m339p068n442R77O114O361K141m290
$$ y = [909, 6266, 8498, 5546, -239, -4657, -5539, -1585, 4090, 6392, 4016, -2198, -7396, -7266, -1357, 5116, 7766, 3055, -4177, -9193, -7979, -1943, 4946, 6247, 2119, -4068, -7976, -6199, -543, 4528, 5684, 2173, -3478, -7620, -6237, -979, 4527, 6882, 4044, -1504, -6014, -5612, -99, 5754, 7653, 3918, -2549, -7292, -6147, 438, 6756, 8826, 4156, -3150, -7380, -6159, 176, 5503, 6559, 2097, -4644, -6923, -5017, 958, 5137, 5425, 1458, -3918, -7079, -6050, -1764, 3108, 4473, 2169, -2987, -6344, -5830, -1134, 4589, 6383, 2690, -3785, -8040, -6949, -951, 5861, 8475, 4508, -1986, -6428, -4824, 718, 6682, 7485, 3105, -2739, -5911, -3681, 2237, 7482, 8905, 5396, -940, -4982, -3995, 366, 5426, 6981, 3978, -1655, -5693, -4173, 1066, 6657, 8415, 4076, -2992, -8434, -7457, -1343, 5018, 7159, 2869]
3939B869o944l704J827O751N367k49n230o831l126K428O448N023J009l710n450
3954c522k448J687M520L861J31l115n520l293J684N912O194J426k801o165m288
3969e737J42N311M619J324l711n640l176K413O601N374J10m405o488l887J385
3984e765M777M510J205l215m705j985J252N487M023N02l781o136m349P81N603
3999a796O640J970l186n730m065J591N903N135M48m802o899l699K990O981O540
4014H021M68m065o385k861K418M532M152o60m085n161k125K616N808N175P28l697
4030D879o127l599K57M716M134J147l671n395k507K306N663N359J37m678p616
4045d995l870J788N774M905R31l579n199k134K499N347L443l00m549n524l135
$$ y = [2869, -4075, -7779, -5952, 799, 6166, 5917, 687, -6144, -9270, -6842, -394, 4629, 5638, 1928, -3522, -5970, -4283, 237, 4098, 4229, 1114, -4406, -7699, -6015, -103, 6091, 7517, 4716, -1449, -5737, -5595, -284, 4335, 5659, 1948, -3692, -6868, -4455, 2146, 7520, 7630, 3225, -3263, -7150, -5765, -988, 3522, 4727, 1512, -3193, -5178, -3926, 1561, 5584, 6086, 2305, -3831, -8180, -7399, -1796, 4844, 6814, 3628, -2102, -6167, -4576, 1327, 6462, 6910, 2108, -4791, -8490, -5500, 1481, 8021, 8489, 4424, -1961, -4822, -2404, 2128, 6280, 5620, 1535, -3626, -5751, -3135, 2673, 7848, 8576, 4879, -1248, -4847, -4590, 126, 4260, 5407, 1736, -3659, -6166, -3860, 1803, 7162, 7299, 2621, -4995, -8865, -7077, -1303, 3602, 4533, 954, -4245, -6379, -3880, 1467, 4910, 4610, 61, -5463, -8598]
4060h598J842N227N654J888l004n172l046O27M751M542J462m884n748l337K224
4075e572O956N471J696m537o534l664K054N252M662k07n245n386j625L146O114
4090B581M677j48m812o263k649J703M851L697O44l490m899j739K265N056M623
4105F097L55m944o250l138K134O257M992K42l478n422j750K465N546L730q71m557
4121A408n813j430K635N043M837L50l518m630j979R45L880L902k8l435m660k976
4137e469J704N699M807J063l781o413m210J758N250M836J82m636n820k474K781
4152d723O004M412o61n357n407k990L046N403M127N6l609n504k154K641N398L807
4168D489J07m065n219k868K253N467M966J326m145n712k632K047N659M345M45
$$ y = [-8598, -6756, -1529, 4125, 6013, 3009, -2163, -5209, -4582, 169, 4711, 6173, 1289, -4459, -7796, -5572, 1384, 6855, 8551, 4014, -2520, -6184, -4130, 1122, 5784, 5577, 332, -5054, -6679, -3533, 2581, 7258, 7110, 2298, -3965, -6614, -4911, -60, 3637, 4281, 791, -4108, -5847, -3582, 1474, 6097, 6452, 1508, -4742, -7880, -5746, 511, 5503, 5745, 2267, -3155, -4905, -2440, 3106, 6836, 5965, 1408, -4405, -5835, -3200, 1843, 6680, 7030, 3512, -1118, -3097, -2152, 1728, 5630, 5602, 2167, -2493, -5469, -3765, 1934, 6741, 7804, 4023, -2390, -6600, -4842, 408, 5244, 5426, 790, -5030, -7504, -4723, 1281, 5693, 5032, -325, -5732, -8722, -5676, -273, 3854, 3910, 301, -5203, -7357, -4716, 682, 4489, 4596, 531, -4688, -7556, -5303, 164, 5130, 6456, 2311, -3401, -6033, -3986, 1673, 6018, 6463]
4183F463m818n531k203K931O281L564k51m379m820k004K158M812L263j133l227
4198A106l945k134K458M118L206K42l184m978k809J112M438M643J038l508n429
4213c626l513K231N800L990Q78m685n442k864K907N747M897l41m786m868j948
4228e623K661N241L750o59l390n061j436K575M448M070K37l807n062k401J483
4243b974M933M327N48m086n755k605K025N982M365q95n119n779k356L090N604
4258A305M228j035n287m557j709K948M471K718o08l803m652j215K628M054L645
4273C131M1l112m142k646J167M701M383P58l114n085k569J865N932N051M99m678
4289B182n549l033K751O190M212K88m661m631j846K814M921L572j164m397m292
$$ y = [6463, 1645, -3886, -6089, -3158, 3123, 6687, 6436, 2057, -2763, -4767, -2609, 2203, 5466, 4333, 1106, -2839, -4973, -2515, 1603, 4809, 5051, 1867, -3111, -5920, -4808, -370, 4273, 5311, 1803, -3626, -7139, -4908, 892, 4882, 5760, 1075, -4367, -7231, -4324, 1423, 6320, 5979, 1193, -3675, -5623, -2962, 2279, 6029, 5370, 1980, -3081, -4517, -1942, 2506, 6576, 6813, 3006, -2056, -4457, -2974, 1959, 6286, 6834, 2748, -3007, -5612, -3587, 2395, 6760, 5865, 746, -5033, -7389, -4299, 1305, 5533, 4498, -789, -5346, -7055, -4107, 364, 3082, 2474, -1329, -5981, -7196, -4568, -514, 3131, 3172, 60, -4082, -6728, -5561, -860, 3523, 4281, 1167, -3918, -6487, -4622, 1310, 6361, 6860, 2182, -3367, -6400, -3649, 2541, 6753, 7041, 2380, -2251, -4097, -1283, 3638, 7210, 6046, 1649, -2643]
4304b643j993K245M582L898n8l163m631k775J460L698L984N79l747n867l202K810
4320d823N793M895j94m650o100k357K947N368L629r19m802m067q50L633N510K573
4336E586j095m110m015j595K282M780L155O6k978l628j940J924L992L870Ml664
4352B634n351k803K140N369M731o8l932n699k166K434M710L941j216n331m858
4367e465j824L280N397L003n11m514m189j599J325M186K684K30l051m587k092
4382g727K325M989M135K58l414n897k464J396O214M612M54l850n762j049L131
4397b649O015M384j400n183n201j078L450N182L658q63l885l984o40K578M052
4412D436K306j187l412m620j479J808M407L621K66l195m987l025J700M258L700
$$ y = [-2643, -4636, -2391, 2191, 6089, 6031, 2868, -1763, -4538, -3078, 620, 4604, 5183, 1436, -4431, -7633, -4823, 970, 5865, 5671, 1021, -5079, -7436, -4489, 879, 4508, 3589, -1213, -5280, -6130, -2497, 3013, 5586, 4491, 381, -3634, -5229, -2947, 1833, 4988, 5054, 2076, -1552, -3492, -1568, 2424, 6294, 6298, 2634, -2717, -5520, -3380, 1989, 6720, 6652, 2720, -2979, -5145, -2711, 1999, 5940, 4724, -607, -5465, -7289, -4009, 1388, 4391, 3880, -634, -4823, -6422, -5097, -911, 1773, 2003, -1048, -5635, -7727, -5402, -413, 3722, 3980, 566, -5331, -7795, -6399, -185, 4427, 4881, 1031, -4731, -5780, -2649, 3366, 7750, 6350, 1167, -4034, -5112, -1662, 3520, 7178, 6315, 2430, -1554, -2194, 384, 4436, 6742, 5555, 2143, -2477, -3956, -2148, 2259, 5880, 6146, 2951, -2036, -5061, -3361, 897, 4597]
4427D597l36m379n398k016K977N717L699p54m891m555j663K449N016K744j021
4442B186l726l434m69K414M411K793L49l073n020j268J177M531L777O77k587m531
4458a793k357J861N542L687l6m540n700j928K561N486M436o78n131n256j281K966
4474b161M374L022j335n307m043r64K818M189L228q67m090l775j898K035M057
4489g17L098j24l851m324j754K695N290L653K4m163n202j419L264N077L573n65
4505D555m262l950m74L186N205K857j552l599l918r88K751M409K519l20l132l846
4521e59j749J865M059L085q00l057m759k526J561M803M082l17m076n706j862K304
4537c652N022L141p41n279m704j328L441M886L105j036m664l587j392K901M003
$$ y = [4597, 4261, -118, -5516, -7532, -4555, 1162, 4861, 4107, -784, -5339, -7002, -4553, 463, 3207, 2186, -1540, -4974, -5443, -3029, 1382, 4175, 4524, 1451, -3569, -4837, -3660, 871, 4648, 5325, 2738, -1793, -4150, -2289, 3253, 6940, 6904, 2364, -3336, -5264, -2703, 2783, 7219, 6541, 1410, -3846, -5127, -2161, 2213, 5235, 3900, -1407, -5450, -6414, -3596, 593, 3821, 2954, -1136, -4911, -6809, -4774, -717, 2381, 2257, -1594, -5918, -7672, -4977, 313, 3966, 3990, -173, -5375, -6794, -3530, 1547, 5120, 4555, 293, -3657, -4131, -945, 4260, 7117, 5565, 1966, -1952, -2940, -189, 4220, 6739, 6419, 3287, -559, -2308, -443, 3616, 6701, 5901, 2844, -1915, -4441, -2880, 1923, 6005, 5688, 1612, -4094, -5956, -3652, 1370, 4511, 3770, -1509, -6213, -7541, -4100, 786, 3891, 2855, -1809, -5396, -6788, -3887, 116]
4552A16K863p30l498l298j183K636M627L217l26l443m636j588K900M510L650R3
4568E910m344m502j075K691N378K599j231m467m047j422L149M839K125j262l824
4583E17l783j046K397L536K353j086l835l496j096J709L960K698K86l655m285
4598d826j834J603M780L691m25l755m952j592L221N642L175q10l958m567r70L573
4614b004M750L119r86l975l693r73L243M723K820j211l490m300j146K243M783
4629C903L306n78l750n071j080K697M252K988j010m428n368p73K726M888K636
4644E338j486m474m393p68L383L812J970j246m481l240q43L186L780K397j086
4659A849k935l729j087K143M025K456J22l375l739j453K399N059L176m41l752
$$ y = [116, 2979, 2249, -1249, -4547, -5730, -3094, 1533, 4750, 4424, 981, -3655, -5243, -2343, 2167, 5817, 5910, 1566, -2936, -4011, -1320, 4058, 6657, 5426, 959, -3088, -4510, -1361, 3478, 5603, 4341, 517, -3266, -4312, -1915, 1621, 3974, 2888, -947, -4443, -5539, -3830, 130, 2828, 3114, -541, -4826, -6660, -5057, -277, 3414, 2989, -766, -5718, -7310, -4089, 1553, 4728, 3918, -40, -4607, -5577, -2004, 2746, 5865, 4879, 904, -2789, -3762, -519, 4204, 7024, 5813, 2323, -1977, -3123, -880, 3903, 7209, 6631, 2881, -2190, -3270, -573, 3679, 6667, 5657, 1229, -4139, -4912, -2186, 2702, 5338, 3852, -622, -5015, -5783, -2400, 1412, 3382, 2136, -2345, -5585, -6428, -3242, 538, 2935, 1849, -1086, -4815, -5902, -3759, 266, 2722, 2844, -531, -4270, -5723, -3324, 1735, 4911, 4470, 718]
4674G18m246j749L116M812L566j516l761m247o50L415L899K281r81l689m018o61
4690c711K204M045K543j091l613l328j233J996L717K705o39l429m999j475L025
4705c283N079K658j104l967m767r24L605M656K534j691m071m158r9L461M248K887
4721E064j166m380l323N2K757L909K242j355k991l214p46K360M200K513m34l782
4737A706l550j313K018M904K263j530l572l731j052K933M464K301j660m151l837
4752c807p70K568M254J609q84m254k904r35K693L493K061p66l976l484j203J939
4768d366M245L096o17l178m276j239K726M755L284r81m582m229o06L458N001K779
4784E270j834m125l508j58L490M318J776j511m391k054m02K628L397K880j829
$$ y = [718, -3528, -5277, -2161, 2651, 6217, 4701, 940, -3307, -3957, -542, 3357, 5638, 4657, 968, -3050, -3711, -1507, 2538, 5081, 3990, 377, -2951, -4184, -2188, 1529, 4234, 3595, 166, -4833, -6308, -3283, 1796, 4454, 3350, -617, -5384, -6308, -2703, 1953, 4487, 2796, -1275, -5433, -5532, -2071, 2177, 5064, 3898, -482, -3805, -3753, -996, 2913, 5155, 3800, 809, -2405, -3151, -791, 3409, 5922, 5488, 1706, -1844, -3157, -1139, 3765, 6028, 4498, 926, -2805, -3857, -924, 3540, 5841, 4181, 30, -3807, -4577, -2009, 2245, 3854, 2970, -1284, -4188, -5123, -2430, 1063, 3124, 2358, -1618, -5102, -6305, -4366, -121, 2975, 2358, -820, -5096, -6335, -3609, 1146, 4430, 3449, -1133, -5362, -5968, -2510, 2491, 5270, 3436, -689, -4197, -4355, -865, 3453, 5229, 3718, -673, -2727, -3129, -501, 2896, 5776, 3947]
4799C947l443k525j015J737M039J932j014l484l590p64J962M408K794p26m411
4814a53m070p17K632M653K230j660m188l620L45L198L713J857j757l640k401j20
4830c698J907L099K563j080k896k607q68J912L978K547l09l378l752j786K528
4845a840M591L531j223m186m235r88L934M696K009k126m461l886N61K551M754
4860C682Q36k031l428l000M17K068L579J567j796l742l001m00K703L363K163o73
4876B307l284l525j031K682L378K782j303m157l054o80L633M517K198j765l884
4891a186l341K66L278L625J257j454l556j645K53K327K999J690r49k422l182j129
4907c169J916L437K605o84k903l605r22J962L960L323j075m327m752p52L038M875
$$ y = [3947, 504, -2021, -3036, -1299, 2740, 4672, 3658, 174, -3416, -4180, -2218, 2190, 4984, 4258, -153, -4223, -4940, -2308, 2345, 4575, 2915, -1273, -4893, -4548, -1350, 2363, 4220, 2463, -1177, -3578, -3698, -1791, 1308, 3871, 2791, -105, -2712, -3580, -1668, 2310, 4857, 4548, 1170, -2582, -4368, -1840, 2751, 6282, 5059, 873, -3362, -4350, -416, 4280, 6289, 4163, -298, -4184, -3623, -1072, 3682, 4518, 2487, -941, -3941, -3524, -1456, 2123, 3690, 1894, -1848, -4849, -5249, -2546, 817, 2980, 2307, -977, -4502, -5533, -2851, 527, 3309, 2006, -2151, -5205, -5885, -2252, 2265, 4463, 2698, -1186, -4527, -4261, -983, 2642, 3899, 2445, -1111, -2756, -2503, -176, 2823, 4513, 3564, 1142, -2040, -3169, -1253, 2184, 4789, 4105, 1202, -2403, -3325, -1363, 2597, 5920, 4845, 518, -4234, -4986, -1948, 2927]
4923B927K061j448m835l034P0L559L931J804k790l622l215L7L371L140J909j250
4939B615l336k509K12J851L101J847p56l247l289p96K569M615K954j217l791m148
4955c325l64K659M099J891j852m028l209N44L513L797J591k663l755k565K71K131
4971a265K876J326j718k204k391l60J839L149J826o41k982m044p08J842L978K939
4987C462n44m096l207n56K536M357K696k197m222l377m07M169L842J985j634k948
5003a41l051J97K791L132R67j511l000k248lK576K970L067j158l866l463l84K052
5020a073L776K729j728l890l406m49L430M569J352j896m188l750L91L426L756
5035C049P23j446m205k030R78K723K759N84j321l277j966k98J924L244J909n71
$$ y = [2927, 4988, 3540, -1295, -4329, -4259, -700, 3231, 5035, 2245, -1377, -4592, -4555, -1184, 1956, 3865, 2615, -721, -3230, -3018, -1167, 1934, 3781, 3025, -222, -3511, -4307, -1738, 2877, 5831, 4614, 823, -3325, -3689, -1030, 3069, 4960, 3108, -920, -4129, -3585, -72, 3725, 5316, 2653, -1102, -3667, -3396, -1265, 1611, 2937, 1219, -985, -3376, -3736, -1897, 1252, 3078, 2437, -545, -4589, -5297, -3455, 523, 3462, 2918, -1178, -4385, -4941, -2405, 1952, 4648, 2451, -1771, -5148, -5555, -1386, 2456, 4441, 2807, -141, -3192, -2995, -204, 2928, 3895, 2384, -616, -2864, -2867, -291, 2679, 5746, 4588, 722, -2741, -3125, -1073, 2703, 5432, 3704, -186, -3592, -4041, -611, 3958, 5310, 3414, -774, -4524, -4133, -707, 3049, 3772, 2326, -1879, -3909, -2931, -208, 2551, 3135, 1814, -1463, -3429, -3727, -1803, 1441, 3350, 2779]
5051B779k537l266r38K623L255K437j102l615l848p8K872M362J874j170m197k657
5067c206m30L214L510R93k138l123k697J28L457K825J429j538k807l282l35K132
5083a868L550J085q31l146k828n03K388M187J936j145m337l472l79K938M535K050
5099D160j971l827k901L72L407L625J798k790l634k370R02L384L071Q94j516k905
5115c01k227M09K399K510J646j319k699k959m36K192L905J991j303k944l789k80
5131c205K591L631J869k089l206l295J82L095L403J849k722l554k211Q4K438K973
5147A833J362j383l125k697N18J951L048J809p53l389l122o60K501M145J801p50
5163C089l888l363K75K912M333J380k008m082l232M48M037L984J130l072k854
$$ y = [2779, 242, -3024, -3962, -1339, 1916, 4353, 3251, -364, -4212, -4290, -1418, 2944, 4818, 3648, -549, -3206, -3636, -422, 3088, 4081, 1943, -1180, -3877, -3749, -292, 2533, 3962, 2424, -383, -3665, -4000, -1868, 1682, 2767, 1936, -1210, -4038, -4541, -2153, 2034, 3970, 2825, -1512, -4984, -5363, -2425, 2110, 4160, 2189, -1638, -4539, -4167, -760, 2865, 4663, 1873, -1761, -4131, -3229, 155, 3226, 4120, 2604, -301, -2528, -2119, 280, 2790, 4436, 3117, 418, -2541, -2977, -785, 3120, 5111, 3808, 864, -2925, -3205, -614, 3017, 4886, 2797, -409, -3704, -3522, -427, 2976, 4825, 2103, -1451, -3662, -3578, -1140, 1833, 3195, 1812, -1313, -4010, -3492, -1541, 1507, 3316, 2563, -826, -3948, -4608, -2107, 2038, 3839, 3089, -799, -4162, -3887, -975, 3358, 4738, 2730, -1352, -4584, -4136, -99, 3885, 5015, 1943, -911]
5178i11k457O82K859K989R15k170l380k275N69K502L349N16j602l007k813K44
5194c990K469L229J376j284l484l060j37L325L355J815k005l266k733M43K843
5209a104L911R88k320l173k095P91K449L032J587j628k834j980K06K489K879J095
5225D293j033l337k298n37K850L565K245j875l333l034l66K443M152J605k101
5240C239m438k922M03L671L405Q75k101l912k287M70L411K580N54k068l185k198
5256d503Q23K936K747J194j310l891k200k16K689L451J465j826k666k830j84L603
5272g18L327J752k620l297k653P37L678K830J159k026l276j952J286K240L034
5287C501M40j799l079k662O23K689K917J325j559k947k877j76K242L239J992j933
$$ y = [-911, -3368, -2686, 173, 3162, 4077, 1907, -1473, -3748, -3179, -677, 2672, 3188, 1586, -1421, -4234, -3990, -1521, 1708, 3084, 1800, -1684, -4744, -4881, -1556, 1799, 3614, 1609, -1657, -4390, -3947, -1104, 2807, 3795, 1475, -1698, -3793, -3002, -553, 2479, 4066, 2438, -396, -2376, -2170, 319, 3198, 4293, 3260, -77, -2375, -2912, -62, 3503, 5748, 3873, 540, -2494, -2860, -417, 3735, 5340, 3239, -1199, -4121, -3718, -47, 3358, 4233, 2132, -1780, -4067, -3597, -186, 2394, 2948, 880, -2305, -4503, -3680, -744, 2003, 3197, 1887, -2004, -4204, -4420, -1731, 1720, 3185, 1359, -1307, -4137, -4321, -718, 2609, 4361, 1741, -1556, -4209, -3472, 206, 3036, 4195, 2169, -1107, -3059, -1773, 467, 3501, 3941, 2142, -937, -3599, -2976, -287, 2630, 3955, 2396, -551, -3428, -3604, -1362, 1877, 3869, 1936]
5303A936l586l417P02L306L594J361k759l526k135M24K965L367J197k203l591
5318b365j960R19L476K980R10j960l105k608J144K635K708J375j639k578k116
5333b184l5L271L252J358k448l446k735J6L391L978P77j908l429k441R43K707
5349A067K570N0k243l351j599Q42K522K162J160j799l160j900Q03J639K148J631
5365B542j750l030k071K30K343L690J207j640l712k570p3L180L759J232k049l832
5381b544j593J101L574L476L13k700l352j808J008K558L220K51j204k946j515
5396b161M79K679K460M40j825l059k436k92L301L121J488j543l746k928J002K722
5412b98K767Q65k526l674j738J084L574K687Q94k602l310j527M18L082K752k42
$$ y = [1936, -1650, -5067, -4365, -1059, 2535, 3896, 1137, -2389, -4524, -4100, -1135, 2232, 3429, 1226, -2365, -4325, -3406, 70, 3050, 3960, 2000, -1105, -3713, -2569, 66, 2774, 4149, 2510, -68, -2184, -2219, 1052, 4304, 5662, 3214, -232, -2967, -2951, 440, 4418, 5195, 3287, -142, -2583, -1640, 1067, 3637, 3687, 1444, -1907, -3506, -2664, -142, 2020, 3180, 1381, -1779, -3679, -2876, -1237, 911, 2542, 792, -2238, -4309, -4079, -1736, 1954, 3161, 1521, -2191, -4761, -4834, -1654, 2105, 3337, 1288, -2544, -4137, -3036, 538, 4014, 4327, 1627, -1725, -3533, -2525, 33, 3253, 3504, 2300, -646, -2161, -1682, 997, 3457, 3897, 2072, -987, -3423, -3715, -414, 2707, 4195, 2652, -1094, -4022, -3020, -298, 2469, 3334, 808, -2866, -4604, -3520, 54, 2741, 3635, 1033, -2277, -3804, -3386, -304, 2448, 2206]
5428B206j784k145j025Q02J855K723R73j724k413k501N15K357L176J277r92l426
5444a26k404O74K476L442Q53k084m013j942J291K478L241K75j978l021j902J251
5460a489K048K227k86j973k450j771R48K425K229R47j432k960k718M81J877L016
5476A119R74j531l380k320L90M111L094R82k636l686j991O51L719L050k68k122
5492A56k626o46R59L631J596k39j664k768j168R47J976K542M61m78k732k088M40
5509a701K225K733N17j317l255k393K57K757L715O24j485m099k161J047K939K848
5525C251k07k195l666j072J167L479J895L20j993k603j626N86K161K200P46j527
5541I16k544j230L61K313L315J008j338l791k436K65K821L663N06j765l455j392
$$ y = [2206, 422, -1723, -2748, -1946, -91, 2632, 3605, 1881, -532, -3033, -2518, -161, 3015, 4292, 3300, -126, -2530, -1856, 620, 4062, 4915, 2831, -1182, -3124, -1833, 645, 3886, 4161, 2183, -838, -2740, -1489, 559, 2786, 2500, 527, -1923, -3694, -2746, -321, 1908, 2855, 1423, -1537, -4255, -3774, -1897, 1119, 2093, 562, -2818, -5138, -4748, -637, 2457, 3439, 803, -2883, -4874, -4223, -504, 2546, 2278, 156, -2470, -3116, -2157, 1474, 3070, 2831, 1167, -1601, -2769, -1822, 154, 2696, 3157, 2679, -53, -2141, -1701, 524, 3257, 3774, 2457, -798, -3191, -2934, -177, 3538, 4162, 2677, -1422, -3583, -2536, 403, 3251, 3044, 849, -2817, -3889, -2722, 757, 2652, 2972, 979, -1624, -3250, -2664, -503, 1697, 2443, 916, -1628, -2858, -2497, -184, 3131, 4139, 2801, -990, -3426, -3161, -340, 3323, 3829, 2064, -1391, -2783]
5557b783J043L419L215o27k727l005j863J789K766K038K97k359k485r99P97J732
5573B48K055J43j658k597j670M78K198K977P17j676l226k176O55J958L137J229
5589B792k782l364j491J057L694K450O08k776k711j308J138K561J783P76k123
5604C04j719j466J376J974K362O76j279k895k378P27K379K610J319j357k992k118
5620b477M73K947L457O33k665m149j521J324L056L051n81k246l267j071J184L050
5636A198J882k81k417k928j014J321K354K241J77j677k521j619O30K180K433P81
5652B740j394l235j832L46L289L142M46j936l244k035J170L015K779k3k115l079
5668a966j254J509K902J928N0k373k057o50P88J554J337N72j382j821k307Q07
$$ y = [-2783, -1740, 1679, 4894, 4267, 1540, -1465, -3328, -1539, 1227, 3265, 3562, 1203, -1282, -2281, -1484, 248, 2303, 2446, 788, -1809, -3479, -3001, -803, 2174, 2891, 1215, -2011, -4187, -3532, -1574, 1563, 2792, 10, -3354, -4845, -3788, -94, 2356, 2964, 188, -2523, -3831, -2693, -132, 1651, 2427, 304, -1415, -2881, -1505, 469, 2831, 3507, 2228, -667, -3045, -2318, 61, 2671, 3990, 2633, -359, -2477, -2004, 943, 4400, 5033, 2368, -1781, -3302, -1978, 1078, 4129, 3548, 1302, -1965, -3036, -1852, 1198, 3080, 2799, 382, -2546, -3560, -2239, 115, 2356, 2533, 856, -1665, -3284, -2654, -474, 1959, 2740, 1346, -1889, -3721, -3375, -86, 3056, 3502, 1566, -1678, -3713, -2543, 472, 3251, 3228, 1113, -1966, -3220, -1711, 1191, 3119, 3169, 796, -1261, -1911, -1123, 431, 1768, 2340, 958, -863, -3170, -2363]
5684b363K411K312P60j653l356j391j45K472L237M15j880l803j710J461K922L068
5700B757J7k155l794p61R11L351J907K30k576j791j226J503K239K099p6j494k419
5717a278j230L67K113K462Q27j480k538j146L63L211K102M23k412l062j968J362
5733a884L194K646k52j907l048r74J225K550J500n66k092k425p18J115J901K212
5749B477M45j831k424j344J84J905K162O56j239k804j770O48L086K661P57k073
5765A496l740k045J220K810L149m12k081k653j191J642L092K163k03k723k836
5780b312j122J230K219K374L03j822j954j304Q90J786K574N16k398l083j914Q49
5796c168L305K250Q65j990l484o08R89K542J919n16k684k527q56J480L020K190
$$ y = [-2363, 48, 2360, 3120, 1467, -1889, -3280, -3425, -953, 2284, 2699, 819, -2984, -4694, -3233, -311, 2757, 2774, 619, -3175, -3936, -3025, 326, 2233, 2463, -113, -1904, -3130, -1627, 612, 2711, 2635, 1141, -1278, -2508, -2141, -28, 2434, 3261, 1781, -757, -1903, -1540, 1671, 3773, 4196, 1784, -1278, -3246, -1884, 1310, 3956, 3704, 1797, -1251, -2225, -1000, 1550, 3050, 2484, 392, -2033, -2751, -1636, 265, 2477, 2922, 1091, -1333, -2677, -2493, -588, 1574, 2230, 991, -1813, -3583, -2935, 151, 2812, 3569, 1496, -2244, -4289, -3069, -259, 2890, 2478, 397, -2256, -3447, -1805, 1287, 3450, 3247, 524, -2312, -3434, -2204, 15, 2389, 2692, 870, -1084, -2388, -1498, 288, 2862, 3378, 980, -2103, -4017, -3168, 137, 2387, 3252, 1262, -2222, -2830, -1841, 701, 2620, 2104, -580, -3107, -3963, -2483, 537, 2727]
5812B727j12j604k636j191P76K200J630j64j294k518k32O16K531J977N46j480
5828A772k843k138R88K895J892Q00j860k750j135J593K399K392k6k630l371j191
5844c213J409K429K854o15j610k384n97P97K429J474J29k460k586r09L78K699
5860B24K283M23j603k873j615R10K526K445m70k276l270r87J421L295K696k5k765
5877C39l287l90J508K014J862m17k113k178q07K046K365J543j76j309k809j138
5893b947P12K050K276K0j174k138j465Q51K313K634m9k423l022j568J111L332
5909E13K004R2j795k942q63J872K550J322m81k288k026r62R31K784J322L49j342
5926A040k201j425J039J833J868nr87k837j588Q29L266K544N66k702k888j377
$$ y = [2727, 2615, 1011, -1625, -2816, -2040, 160, 1790, 1626, 332, -2186, -2418, -1802, 729, 2706, 3252, 1772, -1071, -3209, -2221, 674, 2566, 3366, 1506, -1244, -2379, -786, 1613, 4005, 3979, 1349, -2022, -3213, -1804, 625, 3479, 2864, 1254, -1130, -1727, -930, 1499, 2973, 3102, 642, -1944, -2853, -2475, 224, 2507, 2930, 1327, -1546, -3161, -2251, 275, 2720, 2250, -26, -3296, -4283, -2862, 433, 3129, 3104, 339, -2948, -3338, -1830, 184, 2046, 1629, -484, -2662, -3469, -1423, 942, 2485, 2309, 1000, -1809, -2947, -2235, -185, 2091, 2111, 937, -1201, -2666, -1815, 498, 3132, 3083, 660, -2362, -3930, -2819, 513, 2517, 2609, 814, -2128, -2991, -1119, 1431, 2753, 2272, -16, -2042, -3004, -2073, 711, 2033, 2382, 1040, -1161, -2586, -1547, 286, 2154, 2149, 1162, -1675, -3263, -2434, 832, 3376, 3942, 1240, -1648, -3025]
5942c025J179L030J912l15j995l086j91J841K831J448k35k127k892q76J413K072
5958I84J251O3j763k017o17J108J590K325l32j406l129j468J197K371K255J23
5974B535k027k276j646K033K597J194qk964k570m95J552K392K197k74k216k308
5990b284l77J165J778J308k45j124k335j027J058K255K539j5j523k893j237O29
6006b328L100J816K82k462k855j219J872L258J702k38k604k737q87J972K853J434
6022B959j267j605j703m94J627J894Q87J96j862k319p42P30K539J689J05j407
6038A227k547j078J252K123K235J32k386l153j137J961K258K097n03j884k293
6053a696m95J691J944J393q54k469j488K20N23K170J494k97j643j894j089M96
$$ y = [-3025, -1846, 1184, 3096, 2781, 786, -2300, -2491, -650, 2181, 3629, 3394, 1267, -1625, -2501, -1088, 984, 2235, 2298, 535, -1482, -2099, -991, 599, 2924, 2592, 1186, -1943, -3411, -2214, 157, 2412, 2535, 508, -1768, -3414, -1381, 1216, 2410, 2402, -562, -3132, -3627, -2075, 317, 2514, 2240, 24, -2284, -2661, -1496, 282, 1590, 1345, 221, -2114, -3141, -2083, 172, 2711, 2696, 1173, -1720, -2957, -2328, 772, 2588, 2870, 408, -2447, -3666, -1794, 1464, 3166, 2928, 324, -2413, -3300, -1328, 1525, 2959, 1692, 87, -1616, -2110, -483, 1411, 2298, 2494, 632, -1687, -2429, -1699, 840, 2529, 2634, 1227, -1320, -2398, -1146, 977, 3212, 3344, 958, -2195, -3332, -1371, 887, 2984, 2481, 597, -1696, -2191, -500, 1444, 2837, 1983, -486, -1974, -1754, -1231, 939, 2433, 2136, 493, -1401, -2490, -1994]
6069a994J798K188L83j888k479q86N96K584K723k46k072l116j151J622K899J984
6085B945r84k471k303l52J657K912J064n59k166k189k74J764J839Q57j54j483
6101A03k003l89R18J814J621K76j847l005n78J043K542J916j56k200k714k21J369
6118a511K687K153r87k529k866L59J541K597J276r36k079j040m58R06K341M49
6134A903k56j539j528q09J078J627J977M20j717k239j175N67K843J772n3k267
6150F04k573j186J682L196J698m82k555k562k85J302K744Q55o40k448j471o1J450
6167g32K057J287r58j238k202m00L56K034K085l86j923k022o61J160K588J451
6183B496n35k348k237j021J533K757J760q91k059k233MK149J812P21l69k337j971
$$ y = [-1994, -196, 1992, 2375, 487, -1992, -2878, -2282, 302, 3025, 2779, 707, -2409, -3560, -1938, 961, 2945, 1961, -510, -2813, -3165, -1508, 1404, 2468, 1909, -257, -2446, -2720, -956, 883, 1740, 1586, 103, -1900, -2289, -1371, 443, 2064, 2340, 493, -2512, -3090, -2047, 495, 2411, 2255, 55, -2659, -2880, -1511, 1176, 3329, 2342, -187, -3053, -2694, -1153, 1444, 2720, 1784, -295, -1335, -1793, -887, 1454, 1903, 1647, 108, -1420, -2229, -1151, 476, 2453, 2873, 1156, -1083, -2258, -1691, 1152, 2924, 2871, 604, -1969, -3155, -1473, 1723, 3421, 2939, 384, -2178, -2463, -1161, 1583, 2438, 1798, -650, -2121, -2182, -732, 1325, 2612, 1654, 416, -1786, -2186, -1830, 204, 2289, 1903, -20, -2042, -2703, -1543, 1045, 2496, 1961, -387, -2624, -3645, -2112, 645, 2405, 1514, -545, -2778, -2774, -625, 1187, 1908, 1539, -798, -2769]
6200b769N57Q92K344J201j072q85j679q77J287J913J130k8j818k006p11N04K847
6217H30J815K47k062k281j455J446K690J265m91k133k357k35K042K406J086k54
6233B559k758k002L04J047J911J250m25j855j883L28O91J932J484l24j642k063
6249a446j188J330J850K342j79j915k338j034J790K467J702j076k809j978m0J702
6265h20K282J358n81k207j921j36J796J290M83q2j654j888J98N96J884J281j3
6282A866j271k179j176M37K445J539K13j755k457q17J462K627J527m86k198k442
6298b665m70J532K507J623j535j886j368l92K050J846L04J64k307j043j060J342
6314a358J790J396L1j493j496j258J597J876J413nk256k588m52J536L032J699
$$ y = [-2769, -2212, -1320, 1024, 2225, 1153, 268, -1411, -2288, -1001, 912, 2042, 2014, 196, -1810, -2521, -2017, 830, 2645, 2892, 830, -1451, -2906, -1460, 1230, 2495, 2004, -129, -2486, -2721, -679, 1727, 2813, 2559, -199, -2201, -1897, -850, 1061, 2311, 1886, 31, -1852, -1524, -833, 1099, 2583, 2259, 617, -1446, -2634, -1304, 546, 2888, 2709, 794, -1544, -2578, -788, 1679, 3381, 2305, -504, -2482, -2522, -820, 1462, 2820, 2239, 32, -1889, -2025, -229, 1061, 1544, 1462, -192, -2080, -1882, -1286, 598, 1879, 1866, 595, -1584, -2760, -2323, 122, 1661, 1874, 119, -2338, -3155, -1693, 934, 2461, 1975, -223, -2665, -3135, -1603, 904, 2527, 992, -894, -2262, -2654, -604, 1242, 1546, 1710, -597, -1640, -2700, -1358, 432, 1828, 1859, 366, -1130, -2388, -791, 1085, 2498, 2493, 237, -2351, -2803, -1267, 1765, 3464]
6330C464r11k631k081p04K441K109Q51j093k174j336l0J970J916L89n67j550j558
6347a495p57J213J873J197l62j371j782n20Q74J965J650l95j497k685o48J642
6363a098K173J524m02k347j746j44J389K554N31o20k313j694j31J215K058J617
6379B566o70j524j937l38J039J783J169m87j572j853q01R63K824J237l39k197
6395a37k147j096J162L137J454o62k464k098l91K331K366J097j466j773j897k54
6411b838J440K314J098j184j630j143m41J499K003J273m69j822k054k03J045K004
6427H92J461j30j808j907o38J096L091P64l58k579j891p0J655K592J003q77k203
6444I3j302n18J338K098M46p74j583j767M28J102J551J417j19k024k030m11N65
$$ y = [3464, 2553, -78, -2159, -2863, -422, 1687, 2538, 1445, -729, -2065, -2095, -125, 1791, 2180, 1613, 63, -1495, -2252, -1039, 834, 2031, 1669, 298, -1484, -2004, -1130, 835, 2485, 2090, 593, -2092, -2740, -1098, 1075, 2599, 2197, -150, -1896, -2040, -651, 1903, 2434, 1814, -499, -2193, -2324, -1109, 949, 2566, 1896, 372, -1565, -1903, -864, 919, 2088, 1601, 29, -1824, -2625, -1662, 1162, 2399, 2060, -137, -2284, -3380, -2218, 919, 2373, 1711, -753, -2851, -3242, -911, 1455, 2552, 1086, -687, -2584, -2838, -1398, 916, 2014, 830, -800, -1943, -2384, -885, 1118, 2391, 1922, 100, -1954, -2157, -1112, 892, 2353, 2223, 415, -1492, -2130, -1034, 2057, 2821, 2463, -116, -2007, -2077, -422, 2170, 3173, 2296, 93, -1209, -1727, -389, 1709, 2155, 1381, -202, -1969, -1541, -439, 1112, 2529, 2410, 386, -1644, -2055, -1490]
6461a490K250J617o57j711k421k98J721K203J663j195k581j566j23J604K439P27
6477B182r78j973j670O0K487J266R66o57k202j446n72J528K016J531j050j571
6493h3k032J61Q19K172J838q47k513j987o65K077K432J335j369j888j528r0J547
6510f21K152P85j083k352j538r6K281J624J170r80j192j797l59J437J397P34k02
6527A360j592j603k87P99K423J429N4k449k264o49K020K337J180o90j995j698
6543a625n8J712K199R57r59k622j153o4J631J542R72q42j506j644J43J378J658
6560A719M72l29j919j775k51Q44K806O42m70j620k221m76K126K137Q79j071k417
6577i24j653J64J896K182N13j260k243j128K66J587J465P92j088j886r61J7J276
$$ y = [-1490, 760, 2377, 1720, 9, -2412, -2710, -989, 1214, 2877, 1682, -899, -2465, -2588, -984, 1455, 2182, 1204, -769, -2439, -2379, 108, 1374, 2340, 1683, -519, -1965, -2537, -1009, 1007, 2538, 1488, -83, -2115, -1954, -1135, 1037, 2875, 2028, -485, -2472, -3137, -1060, 1372, 2707, 1338, -550, -2078, -2168, -621, 1531, 2316, 1233, -1119, -2657, -2753, -472, 1152, 2322, 1342, 150, -1647, -2006, -569, 828, 1562, 1360, -232, -1835, -2122, -1323, 1100, 2529, 2583, 134, -2130, -2779, -759, 1578, 2758, 2068, 73, -1625, -1683, 29, 2228, 3185, 2226, -396, -1549, -1613, 18, 1560, 2532, 1690, 184, -1460, -1317, 61, 1719, 2191, 1862, -57, -1832, -2083, -1239, 1567, 2209, 1739, 119, -2102, -2578, -452, 1685, 2564, 1493, -924, -2577, -2413, -517, 1665, 2178, 918, -1325, -2453, -2187, -600, 865, 1657, 569, -1317, -2278, -2261, -985]
6594i85J642J360k65k495q19j219J458K409J063q10j765j918k6J431K285J232
6610B578r86k157j491j99J944J694J170j132k667p47L70J688J756N58j097j982
6626g00r92j39P05K036J183n26j663j834j84J491K305J089p98k656j599l42J930
6643f94K104J172q94k209j582K49J903K121N21j664j603j599O84J579J519Q25
6659B432r17j159j849O06J068J435P19p13j698j191l81R91K157J262m70k207k044
6676a959k39J941J376Q83p45k324j053r8J895J883K89q01j956j471O13J201J482
6693I17L81r58j201q31l86J558J285Q52k31k022j394o05J547K118R42q63k006
6710h97j404RJ650K677M03j063k151j406QK061J702L59r60j753j072K9J791J807
$$ y = [-985, 657, 2017, 1752, -743, -1562, -2781, -1323, 1086, 2149, 1339, -426, -2344, -2370, -939, 1346, 2578, 1592, -565, -2056, -2255, -311, 1383, 2553, 1421, -1246, -1993, -1623, 65, 1821, 2379, 1282, -700, -1692, -1831, -1126, 910, 2093, 1567, -96, -1930, -2114, -623, 1682, 2771, 1973, -683, -2282, -2624, -694, 1410, 2582, 1688, -521, -2103, -1854, 49, 2170, 2691, 1027, -576, -2175, -1491, 88, 1607, 2432, 1515, 356, -1493, -887, 181, 1616, 2335, 1622, -76, -1267, -1648, -657, 1500, 2762, 2292, 85, -1959, -2198, -257, 1119, 2002, 1257, -1067, -2120, -2218, -323, 1560, 1849, 1048, -908, -2379, -1766, -565, 917, 1298, 340, -861, -1692, -2078, -520, 765, 1617, 1386, -636, -2030, -2635, -1088, 1030, 1972, 1109, -897, -2301, -2292, -642, 2035, 2438, 1375, -776, -2182, -2174, -113, 1589, 1948, 988, -765, -1837, -1808, -17, 1790]
6728A790nq86j529p73R4J239J536O04m24j923j409K00Q27J739J405j118j876j814
6746b323K31J511K311J189j020k132j868K32J589K088K67n32k467q89P02J352
6762B41J921M6j190j796n59m31J717R04J010o28j180j720k05J597J828R98p92
6779A761k521j832L85J625K252O92q76j945j935q7K501J931o9j470j517j190J05
6796b190J463J859L04j327j003p04J7P89J330N55l60j569j350L21J333J338P30
6813A536l41j958j594j84J758K128Q16r87k316j109P50J583K018N6j059k235o92
6830a830K16J947J159K45p56j132r14j21J345J195M95o10j158j516N5R51J719
6847A290J335n77j357k403J74R81K526O57j132k372j257J52J787K251L66j743
$$ y = [1790, 1785, 899, -630, -1403, -1309, -70, 1466, 2070, 1646, -277, -1686, -1486, -659, 1080, 2485, 1367, -509, -2323, -2092, -581, 1730, 2919, 1899, -233, -2101, -1869, -280, 1808, 2075, 1543, -924, -1813, -1111, 241, 2162, 2208, 1018, -778, -1337, -1768, -51, 853, 1863, 1235, 55, -1665, -1870, -273, 1555, 2553, 1761, -760, -2592, -2207, -582, 1670, 2362, 1486, -459, -2394, -2481, 20, 1951, 1882, 412, -1105, -2295, -2190, -727, 1132, 1436, 109, -894, -1598, -1581, -792, 538, 1093, 733, -836, -2186, -1865, -532, 806, 1536, 1195, -763, -2357, -2541, -783, 1345, 2161, 1174, -1142, -2251, -1501, 82, 2100, 2156, 1097, -1138, -1830, -1614, 333, 1492, 1737, 981, -151, -1065, -1186, 159, 1354, 1849, 1239, 81, -1435, -1380, -429, 1290, 2625, 2048, 691, -1712, -1538, -557, 1969, 2626, 1494, -878, -2135, -1983, -196, 2055, 2421, 678]
6863F78j615r69Q75J101J767k12r64j465j252R27J244J293L10q28j402j233k30
6880a975J358J535J178r00j471j444l31J451K437L52r20k186j535M23J665J996
6896A633J21j011k603n28J266O85K240m56l97k209o29M86P96J117J213q61j226
6913c63j659J75J109J633R52j082j549j566K98J330J847P15k91k514j175j08K028
6930b20K190K07j258k290p48P18J607J637K22p77j735r25L15J435J087P00j257
6947I08r47j078N7J391J600O95j246j732j052j88J533J854N80q46k124j269M76
6964a388J689K030L93j989k195o80J159J014K001m36r23j751l40L48J059Q08K47
6981A046k68j758j110M98Q35J780N55o73j824j266q0J481J823R18j032k037j449
$$ y = [678, -937, -1906, -1031, 70, 1837, 1625, 661, -804, -2056, -1129, 115, 1408, 1718, 890, -512, -1745, -1975, -617, 918, 2096, 1196, -275, -1719, -2050, -599, 1838, 2190, 1270, -916, -2451, -2028, -363, 1633, 1754, 743, -1860, -2388, -1122, -437, 1803, 1347, 950, -1259, -1888, -1402, -606, 511, 1724, 863, -363, -2022, -1847, -738, 895, 1847, 765, -784, -2350, -2052, -722, 1125, 1840, 1549, -965, -2140, -2248, -220, 1970, 2177, 919, -1371, -2119, -1401, 206, 1843, 2065, 1288, -447, -1372, -1057, 378, 1465, 2165, 908, -39, -1117, -1060, 331, 1931, 2626, 1380, -352, -1404, -1592, -59, 1795, 2375, 1529, -595, -1864, -1388, 301, 2331, 2724, 735, -1460, -2140, -981, 33, 2034, 1598, 675, -1076, -1416, -1068, -9, 799, 1046, 778, -980, -2090, -1592, -757, 1023, 1578, 905, -919, -2185, -2265, -784, 1039, 1957, 925, -1112, -2561]
6998b561N19J661K112N40k074j256j005K08K088J178O18j416j599q20K82J957
7014D32J043J01j055j282j365K81J538J643mj70k236p51k11J998J770N76j440
7031H68j908r12O6J673K277k79j113j684j299J245J621Q77L84j465j585m07N36
7048a105J150J105N81o75j405j018L03J212J301R26j089j619q62l90J489J753
7064A657J095j500j593j528N31J491J687O36k011j445p80K93J688J332R6q37j788
7081i76o95M04J035J343N55j049j667r66P3J618J072R76j270j616r85J38J700
7098c10J529R85j554j901j442M94K509J253K6p16k563n88R20J476J410k91m78
7115G59j667r06N36J730J166J60j022j381n68k10J297J408P38j124j190j237p0
$$ y = [-2561, -2042, -381, 1731, 2271, 197, -1059, -2064, -1856, 232, 1410, 2028, 612, -987, -1807, -1525, 432, 1475, 1576, 521, -761, -2126, -1845, -307, 1336, 1332, 1162, -1074, -1825, -2036, -38, 1732, 2308, 868, -1040, -1952, -1886, -213, 2064, 1785, 672, -1012, -2311, -1066, 555, 1432, 1816, 351, -1234, -1641, -1105, 45, 1150, 1731, 1056, -349, -1367, -1064, 148, 1449, 2375, 1286, -333, -1195, -1585, -96, 1657, 2752, 1252, -341, -1869, -1338, 153, 1840, 2476, 465, -980, -1760, -1467, 221, 1553, 1649, 812, -976, -1671, -1267, -232, 1111, 1666, 617, -1050, -2016, -1943, -325, 747, 1723, 453, -1163, -2148, -2010, -310, 1219, 2204, 650, -1251, -2693, -2199, 310, 1563, 1589, 873, -1690, -2278, -1358, 118, 1528, 1237, 759, -908, -1814, -1278, 452, 1618, 1778, 756, -625, -1193, -1403, -106, 1302, 2040, 916, -274, -1511, -1581]
7132a581J735J604M8j112j543j211Q96J367J457M78j381j346j135L09J829J666
7148B080m31r81j287r66O90J075J607k71l56j191j122nJ097J818N6m90j972r27
7166a576m5J596K026J65r90k012r26K35J891J610j84j452j260r84Q99J976M81
7183A450K83r31j739j092Q60J464P06L13j015j219p88J51J527R54K93k61j985
7200a029r82L1J636J652L08j439j599p39L40K004J010J82j586j275o20N32J326
7217b48J652J49j421j510m56Q39J106J234j93q81r02p58J88J326R56J022j043
7234A060k317l52P9J777J775J16j284j693j473J105K128J057j7j093j814l12K57
7251a001J735R78L47j668q88p75P13J116P32Q25j263j420m73q8J404J425M51j406
$$ y = [-1581, 154, 1758, 1806, 694, -849, -2060, -1164, 203, 1660, 2138, 757, -589, -1724, -1415, 414, 2080, 1649, 668, -619, -1585, -895, 180, 1787, 1516, 1160, -31, -1153, -1158, -61, 1757, 1813, 1323, -649, -1576, -1621, -25, 2001, 2166, 1176, -836, -1762, -1527, 364, 1974, 1790, 338, -922, -1906, -1007, 969, 1450, 1733, 802, -937, -2029, -1169, 295, 1001, 1314, 299, -920, -1708, -1557, -30, 924, 1217, 956, -1029, -2011, -1980, -344, 1308, 1616, 177, -1422, -2161, -1821, 183, 1193, 1375, -211, -1486, -2106, -1574, -248, 1404, 1553, 132, -1378, -1834, -995, 111, 1345, 1152, 271, -631, -1389, -1201, 125, 1081, 2103, 1060, -1257, -1609, -1530, 247, 2022, 2138, 854, -839, -2312, -1207, 921, 1978, 1961, 868, -946, -1258, -1001, 734, 1712, 2059, 391, -497, -1272, -559, 557, 1289, 2114, 851, -569, -1042, -1130, 274, 1699, 2150, 744]
7269G44j276j200N05J968R65L70j402j858o89L65K251J175k76j443j778k83N41
7286a321J826J051J09j688r22q19M70J445R23k42p01j114m81j09J116J340J89
7303A072o06j765q58N09J267J609M97q56j985j223J111J518J373J03j585k040
7319a859m33J098J443J481l66j325j315l82N14J517J485r52n42q35q85J80J187
7336A1J796J37j022j415r85L03J769J737j77j818j174j267J504J397J614n82j368
7353D60j464m19J089J188J369n09j598p09n45Q62Q05P02K97r24j303p2p6J420
7371E73M68N68p54j937q91P47J017K152J2j206j795j208R48J802J835q91j517
7388g7j497m80J270J729Q51k30j497j379n01Q29R62J123j2j166j194k00L91R79
$$ y = [744, -532, -1732, -1227, 741, 1706, 2076, 674, -1184, -1873, -1508, 743, 1918, 1642, 199, -1579, -1862, -1321, 505, 1556, 1665, -23, -945, -1764, -1294, 151, 1074, 832, 131, -983, -1464, -1573, -457, 883, 1072, 466, -1299, -2157, -1648, -381, 1228, 1725, 869, -1116, -2339, -1228, 290, 1663, 1766, 181, -1859, -2292, -1194, 249, 1730, 1364, 39, -1276, -1658, -1144, 373, 1858, 906, 364, -471, -1356, -1176, 11, 1807, 1944, 922, -493, -1478, -1175, 594, 2331, 2154, 336, -838, -2105, -601, 796, 2410, 1828, 460, -1004, -1423, -334, 854, 2223, 1714, 116, -593, -1138, -276, 529, 1231, 1528, 604, -699, -771, -847, 573, 1041, 1609, 855, -1082, -1973, -1226, -209, 1943, 1955, 749, -1046, -2254, -1306, 496, 2331, 1440, -77, -1574, -2054, -784, 945, 1796, 1566, 69, -1310, -1811, -982, -20, 1103, 1091, -75, -1269, -1469, -1078, -99]
7406i9J447J83j195j633n98M60J289J479P0j284j473o13O91J634J062m15j646
7423f41r00p15J155J586J264l80j382j168J73N68J013N86R5j250p20o49P95R18
7441C48R20P69r77j540j502R32J470J036l6m52k441l06R20J787J372l66j347j208
7459f21r97J111J385R66l44j612j099L96M90Q40J028l10o03j356m59M20O07J532
7477A374J29j071j175p62J92J532J489J00j520j633p69R19J489J624n52j098j593
7494a325n58J539J101J042j346o27j336l99J246J047O35r1j195l95n33K78Q56
7511f1Q93J01o72j083p96L82J273J486j04j053j858n23P43J758M74K94j149k028
7529a923M21Q60J519J123j216q77j475K21J276N79P43p6n90j271l26O22M76J298
$$ y = [-99, 1348, 1531, 336, -1297, -1895, -1435, -146, 1333, 1403, 119, -1354, -1967, -1276, 358, 1420, 1005, -641, -1541, -2256, -1101, 485, 1749, 1369, -13, -1181, -1008, -440, 573, 1159, 1254, 4, -716, -1365, -570, 348, 1268, 2037, 1060, -480, -1982, -1050, 420, 1456, 1420, 968, -1473, -1779, -859, 928, 2300, 1934, 587, -621, -1618, -507, 878, 1844, 1500, -112, -1211, -815, -325, 515, 1543, 1233, 630, -726, -1185, -765, -158, 1374, 1503, 432, -743, -1505, -1313, 219, 1708, 1808, 288, -1345, -2114, -1195, 294, 1918, 1366, 268, -1325, -1883, -344, 757, 1799, 453, -174, -1510, -1909, -663, 384, 1019, 928, -267, -662, -1195, -917, -61, 832, 933, 261, -822, -1618, -1236, 37, 1523, 1419, 366, -1492, -2015, -1272, 486, 960, 1254, 105, -1923, -1502, -642, 877, 2000, 784, -93, -1568, -1347, -71, 508, 1251, 1175, 585, -686, -1012, -390, 86, 1384]
7547A384K48m77j826o06m6J597J792J3j158j662n44N63J651J157l52j502j002
7564g70q52J017K136L53J40j663j459n7O81R92O99j04j068j187j9O99R10N31J95
7583A174q26j279p21N12J128J523p8j048j734r02J045J330J586n82j196j816k26
7600b110J164J902Q38j020q82j188m68J454P13J076l71j362r57j76O24J276P30
7617A243l4j653l90o75N19J352J136o0r51j807m62J000J519R53m45j417j375j14
7635a661R60J798O69n30j196j575k0Q75J493P28o53j052o64p78R14J502Q37j14
7653A533p93j469m01M71J532R10Pj076j199j381J310J537J358l82j273j704p9
7670a099R79J324O38m32p43j536QM34N08J459o95o45r35l15N60Q26J270l60j266
$$ y = [1384, 1632, 1155, -671, -1277, -1323, 274, 2066, 2079, 921, -741, -1285, -722, 929, 2086, 1734, 232, -770, -1622, -605, 1531, 1884, 2024, 361, -1098, -1155, -474, 518, 1217, 1113, 45, -1142, -1161, -462, 448, 979, 1174, 348, -931, -1652, -1140, -12, 1511, 1433, 385, -1349, -2251, -1206, 124, 1710, 1128, -68, -1884, -2110, -946, 956, 1794, 774, -108, -1296, -1764, -310, 403, 1479, 1108, -254, -1211, -1387, -763, 513, 1243, 1209, -444, -834, -1509, -990, 362, 1498, 1438, 487, -1320, -1782, -782, 737, 1690, 1245, -172, -1547, -1661, -701, 1097, 1766, 1236, 40, -1535, -1555, -680, 813, 1541, 888, -164, -828, -1606, -692, 810, 1647, 1533, 740, -729, -1130, -659, 873, 1783, 1790, 714, -485, -1866, -556, 981, 2339, 1957, 684, -1020, -1099, -120, 1204, 1842, 1410, 667, -869, -861, -427, 81, 1540, 845, 200, -735, -1050, -490, 336, 1606, 1246, -20]
7689b0p62r91O04J170J444n9j292j415o93L78K432Q70l30j617j426o91J825J337
7707G64N15J23j767p91k41P43J172R13n92p29j572n0N08J460J057j91p46j684
7725a108J44L95J344R61m07p76k360L68K43K017R10n01j445j157r8J000J601J48
7743A279o84r60j085M03O54J192L79n1q63j381J53L52J147Q28p3r72j225k63O55
7762e15Q64J413J55j125j973m40Q93J371J495l71j504p98m80R16J346J038r06
7779A379j223j320L05P45R84N80N4j276j036n86O79J628K19j67q15j686k60O93
7797a103J478R89J01j887j676M37J62J704Q56K69j931j272k77J426J527Q99j283
7814D19j000r35N6J043J098j5L50j066j018j03N70J226L79R8j031j375l35O55
$$ y = [-20, -782, -1773, -1169, 1, 1445, 1386, 94, -1321, -2014, -1636, 796, 1666, 1336, -281, -1707, -2398, -573, 764, 1279, 1402, -365, -1156, -1397, -654, 518, 1431, 839, 110, -1462, -1512, -1004, 456, 1513, 1322, 576, -1108, -964, -569, 775, 1736, 1329, 553, -1807, -1439, -1196, 821, 1731, 1230, -215, -1372, -1470, -470, 1131, 1279, 595, -365, -1450, -1047, -393, 799, 1178, 1127, 264, -1117, -964, -612, 535, 1363, 1290, 318, -907, -1170, -515, 349, 1762, 1917, 792, -1181, -1621, -728, 643, 2138, 1767, 263, -535, -1015, -99, 1247, 2285, 1379, 156, -1164, -859, -114, 870, 1450, 1504, 228, -808, -1394, -715, 913, 1132, 965, 150, -1536, -1796, -1103, 375, 1364, 1465, -422, -2098, -1661, -1499, 205, 1061, 1330, -601, -1873, -2150, -724, 803, 1702, 419, -581, -1516, -1460, -417, 681, 666, 1016, -50, -1068, -1171, -601, 625, 1004, 1102, 71, -1304, -1639, -984]
7832i84J291J730n05j055j309n84R30J320J148n71j782j164j79J079J413J208
7848A986r33r93j041n08J138J407J42k93j062o99j4Q30R45M11K40j275j652J50
7866a221O51Q83J410o6j841j104J07Q08J877J47Qj902r77j30Q18J857P47j018
7884A054j355r92N29P18Q65P27q08j171r85N93L68J187M18p16o49o74o08N80J110
7903A91J251k86j613j357n29J216K099L28n81j355j389L51R17J439K25k88j430
7920h11p75n4J471R81L40o30p47q78k50O65J227O63k39r30j049j20M74J573Q18
7939A729n39q08j708l47Q32J844J026n69j865p79p4R97J861M64j531o58j291M72
7957i44J314N69N37p79o69q47kO99P08M75L26j235j180m27N01J667R26n23j147
$$ y = [-984, 307, 2037, 1532, 477, -832, -1416, -486, 834, 1982, 1411, -371, -1535, -1714, -635, 778, 1986, 1053, 60, -981, -1489, -351, 1056, 1198, 905, -157, -856, -870, -40, 905, 1316, 1556, 281, -1371, -1221, -570, 313, 1723, 1657, -184, -1288, -1181, -373, 1504, 1651, 1659, -243, -1220, -1350, -532, 1325, 2072, 1054, -301, -1293, -764, -46, 819, 1546, 738, -433, -1418, -825, -457, 730, 1148, 432, -217, -891, -1499, -919, 191, 1442, 1156, -457, -1814, -2343, -1127, 972, 1300, 719, -636, -2025, -1674, -757, 682, 907, 619, -811, -1586, -1640, -169, 812, 1152, 522, -225, -1103, -1353, -688, 539, 1202, 963, 33, -1016, -1136, -662, 911, 1729, 1190, 382, -1326, -1673, -841, 1003, 2029, 1460, -405, -1184, -1258, -261, 1600, 2064, 533, -125, -1416, -944, 370, 939, 1476, 697, 28, -819, -821, -122, 586, 1061, 1387, 152, -1028, -1455, -954, 713, 1639, 1116, -31]
7976c1j296n69J271J599O12k57j709j130J79J204J638J75q60j361m49K04O37J076
7994I33P34n54j677p27Q1P30R90P93j33j195j029J4J39J164J163l23j399j475
8012a771m36J392J700M59n91j463j192j49J907J151L62j377r86l09M52K65J326
8029G40K75m17j028r18q2J171N43R98m70q85r95l4O56J491P14o63j069q98k47
8048a118Q64J233R06o88j372q67%J297J168N36j158j059m21J66P85N91L00J2j145
8067C0q76rQ88O79L71k66n73j214m67R34R58J430q78p96j156q45J137J652N82
8086A581q43j253j544M63J446J023Q52p75j373r08N49M75J072N3j68r33r78J57
8104a104N03J203N28m09m81j358j41L59J581N08l09r77j174j37P29J283J023n62
$$ y = [-31, -1327, -1896, -625, 974, 1586, 1329, -380, -1510, -1331, -127, 1511, 1686, 826, -535, -984, -780, -143, 933, 1667, 1113, -564, -1291, -1210, -480, 510, 1303, 1170, -25, -1054, -1040, -901, 263, 1426, 1103, -296, -1771, -2207, -815, 885, 1344, 753, -710, -1902, -2051, -144, 1007, 1369, -8, -994, -1303, -851, -586, 740, 1015, 598, -430, -1348, -1430, -259, 284, 1282, 812, -73, -1068, -1102, -446, 1045, 1759, 1096, 27, -871, -1118, -254, 979, 1885, 1197, -175, -1042, -1042, 255, 1423, 1959, 801, -258, -679, -513, 272, 863, 1163, 1175, 30, -846, -855, 33, 712, 1083, 817, 244, -970, -1437, -503, 455, 1885, 1007, 211, -945, -1790, -653, 999, 1581, 738, -515, -2059, -1596, -150, 873, 1725, 950, -423, -1331, -782, -307, 765, 818, 650, -283, -1261, -1104, -601, 602, 1130, 721, 240, -1118, -1259, -900, 681, 1189, 880, -97, -1271, -1408, -679, 604, 1627, 1065]
8122A065j925p30NJ353J258J77r04r17n17k61J258O13K77l99j131j23k45O35Q20
8141C09M08j73q63m60l80N44J411K30L48j367j096k18N54J778J019j072j641m82
8159a151J73J112J546N04j282j258p18M13J149J177J69m20j771o59K08J127Q29
8176A148K11p07r17n85m16R34Q18J202k70j628j228q0O68J723O12
8191A485
$$ y = [1065, -860, -1590, -1585, -232, 1026, 1203, 299, -618, -1135, -1396, -138, 475, 752, 353, -778, -901, -1146, -511, 309, 717, 544, -319, -779, -1159, -615, 796, 1026, 1374, 7, -1089, -1307, -753, 1025, 2044, 972, -669, -1151, -978, 134, 1680, 2184, 902, -356, -1074, -661, 488, 1665, 1834, 1414, -357, -1016, -808, 319, 1148, 1359, 652, -265, -850, -1266, -332, 486, 1688, 1418, -210, -1438, -1518, -850, 873, 1485]
$$ Imaginary data points
##PAGE= N=2
##DATA TABLE= (X++(I..I)), XYDATA
0@%%%%%%%%%%%%%%JrJ6j6J6j7K5l2L3m0M8n7O5p4Q7r8J12j29J47j66J88k11K36
37A25k67K99l33L71m13M59n08N63o21O85p57Q35r21J014j118J233j358J500j659
56h71J838k044K284k565K897l301L807m455N321o544Q391j1428J5543k57225j59254
71d07606N3704J30030J59413P7562J2253k4711R275L4664K8948m5560j24236j65357
83b61621j13720l909J18040J78359J61671Q2489q53n0678m8794k9015j7857l8826
95b4714o8821p5982k7528O3093J51385J81889J30229K2277q3767j32880j10939
106B4242n2562l653P321p093j3076J4444O6513J09487J04420M1150n3106j30297
118A07790j55083j17221m2162K7725O4691N9210L4063J7259K3217M0564L9429
$$ y = [0, 0, 0, 0, 0, 0, 0, 0, 0, 0, 0, 0, 0, 0, 0, 1, -8, 8, -8, 8, -9, 16, -16, 17, -23, 25, -32, 33, -41, 46, -52, 60, -69, 78, -88, 100, -111, 125, -142, 157, -176, 195, -218, 241, -267, 296, -325, 360, -397, 438, -483, 531, -587, 646, -712, 788, -871, 967, -1077, 1207, -1358, 1539, -1762, 2045, -2410, 2911, -3633, 4758, -6670, 8873, -248352, -407606, -353902, -223872, -64459, 13103, 25356, 645, 9920, 44584, 73532, 27972, -96264, -261621, -375341, -379250, -261210, -82851, 78820, 161309, 160456, 109778, 60984, 31969, 14112, -24714, -93535, -169517, -197045, -133952, 17433, 199322, 329551, 351828, 268061, 135181, 24242, -28320, -31973, -24652, -31745, -44821, -30377, 36136, 145623, 250043, 291193, 238087, 107790, -47293, -164514, -206676, -178951, -114260, -55050, -20987, -3728, 19489, 60053, 99482]
129I9482k425p5088j36387j40715p1835L6205J22465J37952Q3484P296l4988k3510
141A936J4835K9121o735p0556j08685p9675J0486J09752J56602J25356M1101m0014
153A83524p3620n3814j3501R174n459l7286n2509k4544L8600J01742J17347P0981
165B60635j6282r3578j17298q0597j3855L2531L0796n715l4737k3921K6150P4244
177C8373P8087K2765o0109j16767j11893n1314K3904O5926N8288J7992j6111j9712
189g0571P374L7534M0593R230m1639p7111p0227j9491M6894R1700Q5223L5483
201G4992k2904m8683k8444J8585M8455L4442j6845o2067n9760n662O4628R9921
213I6658P1338l8o5069p7182l5170K5005N4890L3466j7483n7042n2223o051M5282
$$ y = [99482, 97057, 21969, -114418, -255133, -326968, -290763, -168298, -30346, 53138, 60434, 25446, 1936, 16771, 45892, 39157, -31399, -140084, -219759, -209273, -99521, 57081, 182437, 223538, 183524, 109904, 56090, 42589, 51763, 46304, 9018, -43491, -68035, -29435, 72307, 189654, 260635, 244353, 150775, 33477, -47120, -60975, -28444, 2352, -3363, -38100, -62021, -35871, 38373, 116460, 139225, 79116, -37651, -149544, -200858, -176954, -111028, -52740, -34748, -50859, -70571, -63197, -25663, 14930, 24160, -17479, -94590, -164817, -184308, -137414, -45714, 39509, 74992, 52088, 3405, -25039, -6454, 42001, 76443, 59598, -2469, -62229, -67891, -3263, 96658, 167996, 167958, 102889, 25707, -9463, 15542, 70432, 103898, 86415, 29373, -22850, -28901, 16381]
226A6381O4081L3678k3432o9152p0872k9399K5600N5320L8271j1051n5439n9733
238h5747k1014L2185N8208L6878j5286n8019n5659j0153M4371O5363L7622j8316
250A0433n9670n3719q322M3999O5727M3510q36l4851l3220k527L3302M5302K3055
263G2183j6439m5981m2861o308M0098O7440N4799R849l7654n5512l4206O455L4415
276D6278K5500j3525m8325m7859o071M8214P3207M8380j4666o9659q2874m6932
288h8332N989L9268L0647m540l4401k8198Q259M8098N9031K6131l1993p7336q0486
301a27863l8804K2098O3302O1600K5188j3285k3551J022L5204M5490J4000m0743
313B3658p7477o7065r670N8844R3136P5593K2280k5158l8594j6919J2225J8171
$$ y = [16381, 80462, 114140, 90708, 21556, -49316, -78715, -53115, 2205, 40476, 29425, -26014, -85747, -106761, -74576, -16368, 20510, 5224, -52795, -108454, -118607, -74236, -8873, 28749, 10433, -49237, -102956, -111278, -67279, -1552, 41958, 41122, 6271, -26949, -29476, 3826, 49128, 72183, 55744, 9763, -33098, -39406, 692, 68132, 122931, 132780, 95126, 39614, 5408, 11863, 46278, 71778, 58253, 9928, -37931, -44002, 4212, 77419, 125799, 111133, 41474, -41400, -88332, -82343, -43075, -12428, -16968, -51369, -79567, -71308, -23210, 35821, 61952, 29959, -47377, -127863, -166667, -144569, -81267, -19667, 5521, -7764, -31315, -30293, 4911, 50401, 64401, 23658, -53819, -120884, -130554, -71710, 21426, 97019, 119299, 94141, 55547, 38628, 50853, 69024]
325F9024o572m2094n6487l1967J9275O7531Q3011N5026J371m8289o6085n0065
337f321j7513O289O367j1146k4864j3772K0422N8099O6681L4111k5807p7464r0140
350g5058n6063j311L7713M1426J7554n497n132K0287M5539M3803O786m5087q0812
363e5852p4059k7234L2005P1408P0087L8254J24j6591o459J4697K0122k169m1600
376B2733o7416n3869j267O1441R3981P6562K0786l4314n5938l8217l231J1485
388C2736l629l5127m9688k6776K4773P2326Q0508M3015j7523o6314p6317m8900
400g0916q733J5682J5172k557j5871m572K5521N3641N3940J9634l4279p5707p9087
413a08132m1051J4452N2333N3757K6002k871p940J1427L4922L5055K937m2787
$$ y = [69024, 62452, 20358, -36129, -68096, -48821, 18710, 101721, 156747, 158118, 109829, 43744, -6321, -23834, -17545, -11178, -22324, -47188, -60960, -40538, 17561, 84242, 118353, 92546, 15082, -75058, -131121, -132432, -94719, -53293, -35739, -41236, -46368, -26081, 19458, 63261, 70047, 24960, -55852, -129911, -157145, -125140, -53732, 16355, 54609, 54733, 38142, 31683, 46380, 66502, 64333, 22733, -44683, -98552, -99819, -38378, 55603, 132165, 152951, 118637, 62699, 24482, 21251, 32736, 29107, -6020, -55708, -82484, -57711, 14615, 95123, 138138, 120615, 54301, -22016, -70916, -79649, -63967, -48795, -51352, -67223, -71795, -46274, 7367, 61307, 80941, 46662, -29045, -108132, -149183, -134731, -82398, -28641, -2639, -5510, -13450, -2023, 32899, 67954, 70891, 28104]
425B8104p0612n7708r729M5641P4052O4629K6708j1265k6620j6382M387J0632
437F1837m126l1478m9149l6599M021N1379P4714N6553Q341m2606o2636m5524p855
450b3128J5668J0425j6547l5741k5715J5490N5594O4774L1915k4687o7354o9347
462f8653l6021R640L3416K6850J941j4570p246J8170M2011M0755J0386l0775n9188
475c3284n4388j7565K7266N3910M7984J8264j1415j8958j028K2539K9330O812
487F9467l0492n4114m3454q27M4696O3302M3799K107l2083l7416j6206R143J7455
500C5377J219k5562l9111k6475N799L9271M9742L0160q221m2914n1294l0149L452
513e8706K6557K1537l835k8029k7315J859L7977N1710K8726j8135n4776n4649
$$ y = [28104, -42508, -100216, -109945, -64304, 9748, 74377, 101085, 89820, 63200, 46818, 51205, 61837, 57711, 26233, -22916, -59515, -55494, -4115, 70599, 127152, 135493, 92887, 30251, -15273, -23128, -7460, 2965, -13582, -49323, -75038, -59548, -3954, 60820, 92735, 68048, 694, -68653, -104674, -95034, -61618, -34768, -32827, -47397, -54643, -36473, 5538, 46293, 56679, 25904, -33284, -87672, -105237, -77971, -24061, 23923, 42187, 30772, 11814, 10786, 33325, 62655, 69467, 38975, -15139, -58593, -59420, -14724, 48578, 92377, 94484, 62401, 24985, 8779, 17922, 35377, 36596, 11034, -28077, -54552, -48753, -9482, 40260, 70420, 62199, 19285, -32009, -62158, -58706, -32149, -10612, -14447, -42476, -69791, -67932, -29955, 21755, 50481, 32346, -22430, -77079]
525g7079j8661K7767M9491L5418j480k8433k2289P481L8207M1449J4024k5353
537D0542m7056l7811k157L5172M8981L1742j399k6665k8437o292J9925K9480J2249
550F8274j9111m1522l6866l991L3802M7049K7421j2055m2405m1880j2857K0443
562a3698L0445J1202k1334l8970k7791M060L3146L7708J4140j7821l8357l2560
574e9830p462K0042K9641J8777n659k3656k2303k690K4579L6363K3617p543l3102
587i226l4879q542K6786M3934L1944m628l2823l3579l841L0262M2557K1431j6839
600E2557m1358l3378j18L3407M1324J6663j8012l9262l1559l032K5768L2761J3589
613D9350j7789l6790l1637m383K4008L3432J6501j5892l9779l5552n236K8061
$$ y = [-77079, -95740, -67973, -18482, 16936, 15456, -12977, -35266, -27785, 10422, 51871, 65895, 40542, -6514, -44325, -46482, -11310, 37671, 69413, 68014, 41349, 12912, 6620, 26545, 56025, 68274, 49163, 7641, -29225, -33216, 586, 47635, 75056, 63001, 20596, -21284, -34141, -13698, 16747, 27949, 6615, -32355, -60146, -56086, -22940, 14768, 28908, 11087, -27270, -59830, -67292, -47250, -17609, 1168, -4491, -28147, -50450, -53140, -28561, 7802, 31419, 23876, -9226, -44105, -52647, -25861, 18073, 50017, 45389, 12566, -21013, -24854, 5408, 47965, 69396, 52557, 11199, -22179, -22297, 11110, 52434, 69097, 51085, 11823, -19736, -22768, 3000, 35761, 49350, 31561, -5229, -36866, -41249, -17241, 16191, 32692, 16800, -22979, -58531, -63767, -35706]
625c5706L9202K0288j5916l9689l3786j98L1795L9639J7011j8464l6886k5276
637e7986Q432L5777L8590J4503j6802l1869k2410M002K7923L2106J5765q379k4328
650A5324k0599j20K3395L0655J7388j0084l2950l1830q150K1930L7299K2678r520
663E5416l5524l5541p823K3369L3865J4198k1419m2529l3974k040L0168L7114
675A5280J5317j8349l7162k9640k433K3156K7915J1386j5174l0969k2894K713
687f0854K8680L6734J9515j0873l2854l0049l539K6720L7646K1301j0783l0587
699h943k3641O789L5797L9374J4348k1053l9082k7115N041L2055L3807J1347j6895
712D1829k9689j8096O285K4437K2614K586k0462l2433k3665j170K0718K7163J3999
$$ y = [-35706, 3496, 23784, 7868, -31821, -65607, -65805, -34010, 5629, 22640, 4176, -32710, -57986, -49554, -13777, 24813, 39316, 22514, -9355, -31765, -27763, 160, 32266, 48031, 39652, 15324, -5275, -5395, 18000, 48655, 66043, 55959, 23009, -8821, -16971, 4959, 42258, 64936, 55416, 19892, -15649, -23472, -103, 33762, 47960, 26541, -15988, -49962, -52002, -21834, 15280, 30597, 12248, -24914, -54554, -56987, -33831, -5916, 5470, -9704, -40673, -63567, -60854, -32174, 4560, 24075, 13202, -19652, -49701, -53240, -26520, 11126, 32427, 21644, -8943, -32584, -25795, 10002, 49376, 63724, 42671, 3589, -23526, -18485, 13570, 47377, 58724, 41829, 12140, -5956, 329, 24766, 47380, 49966, 29504, -2929, -26594, -27764, -7046, 20117, 34116]
725C4116j0505k8607k7088p590J6199K5973J2849j4260l4605k7943q50K8760L8400
738D849J8285j4097l4900k8359m02K7543L3388J3991j3985k9458j8746Q557L1615
751a719L4969J4961j3403l0516k4441j22K4995L2449J7989q851k8013k4202N59
764e345K6440L3959J4623j8298l9092l3212j227K8605L5873J3595k0271l7956
776b306k7751K918K7718K7507K645k5876l7738k2559O143K7649K6988O817j7514
789e359k8897j9499J586K1254K3321R192j2820k4985j8522L225K6438L1752J6958
802B3644j0143k7955k2561L26K6202L3692J5702j1395k7915j9463O390K9957L2014
815D8495J1571j6423l1336k2418L069K4816K7123J0317j3690k7498k2457j28K0145
$$ y = [34116, 23611, -4996, -32084, -39674, -23475, 2498, 15347, 1087, -33518, -61461, -62311, -33551, 4849, 23134, 9037, -25863, -54222, -54624, -27081, 6307, 20298, 6313, -23145, -41891, -33334, -1719, 33250, 48211, 34808, 4292, -20149, -20271, 4724, 37173, 55162, 46311, 18298, -5904, -5345, 21095, 55054, 69677, 51379, 12287, -20925, -22152, 6453, 42326, 55921, 35650, -2306, -30057, -27139, 579, 28086, 30731, 4855, -32883, -55442, -49299, -21650, 5338, 12155, -5359, -34256, -53755, -52169, -30915, -7594, 1598, -11222, -36207, -54729, -51504, -25066, 6686, 23644, 13501, -14454, -37015, -36689, -10487, 23205, 38907, 27512, -403, -19866, -13476, 16481, 48495, 60066, 43643, 12307, -10111, -7042, 17774, 44897, 55214, 41524, 14026, -8431, -8559, 11586]
828A1586K5051R212j6247l3109k8216l710K2262K9730J3995j5034l4829k9390
840d8699j965K5581L1596J0405k0288l5628k4394N743L2780L4062J0067j8793
852D67l2324j9263Q301K9690K9171R343j5098k5658j5059R278K8192K8073J1917
865D7030j3126k6104j9353K348K4424K9171J2599j2196k8106k2171J424K3973
877A9913K7942R005j7741l3441k4638P66K3219K6055P787j8426l1018k2296Q1
890c2792K0244K1858O532j6236k9024k2510l63K1521K6229J1791j1528k7663k3430
903e5371j286K2806L0013J5492j0982k8236k2887L287K9677L4885J6306j3830
915A9874l1500k1774O419L0478L2534J1596j6248k8861j7121Q200K9058K8578
$$ y = [11586, 36637, 45849, 29602, -3507, -31723, -35433, -13171, 16559, 30554, 15520, -19309, -48699, -50664, -25083, 6513, 16918, -3370, -38998, -63392, -57649, -24869, 9193, 19260, 467, -31857, -51120, -42819, -13129, 16042, 25385, 10287, -15371, -30430, -21152, 7040, 35113, 47030, 33904, 7800, -11553, -9205, 15219, 44390, 56989, 44793, 16687, -5484, -4060, 19913, 47855, 56860, 39119, 5678, -18960, -18194, 5025, 31080, 38867, 20441, -10577, -32873, -32792, -12548, 9310, 15842, -394, -29418, -51928, -52291, -30770, -4541, 7250, -4278, -31941, -55371, -56657, -33851, -3838, 11654, 672, -27564, -50451, -47164, -17487, 17398, 33704, 19874, -11626, -33400, -26981, 3497, 36031, 47627, 31379, 2518, -14603, -6403, 22655, 51233]
927E1233O804j8218k9884j9394M220K4418K4904P388j7243k8868k0437J519K1888
940H330K4166N590j8885l2804k3664K260K3543K6305P317j8343l0567k0531L579
953d3704K4410K4689M785j7932k7514j7188O670K5454K6575R477j2508k3381j7345
966c7512L828K1702K7090J1953r780k3378j8059L152K5098L1332J4725j1647k9311
979I193k3776J155K4890L0877J2291j5268l0685k2069L635K6549K8090O616k0568
992C0930l3740k3396K532K4249K5294O315j7758l0138k0912K152K2442K3529N778
1005A7277j8653l0676k1569L052K4666K8486R755j5988k8501j9214N471K5999
1017a9895K7101P683j7153k7816j4802R910K9231K8028Q169j4724k3846j4123
$$ y = [51233, 58037, 39819, 9935, -9459, -5239, 19179, 44083, 51471, 34228, 5360, -15077, -13558, 8330, 32496, 38086, 19201, -13603, -37267, -35007, -11464, 14841, 22158, 3815, -26752, -47283, -43704, -19294, 5395, 10180, -7752, -35266, -52454, -45784, -20330, 6245, 15722, 3214, -20167, -37512, -33684, -11982, 15108, 27061, 17281, -6097, -24156, -21004, 4094, 35426, 50151, 38504, 9193, -14583, -13428, 11462, 42339, 54630, 39362, 8677, -13392, -9757, 16792, 44882, 51498, 30930, -2810, -26206, -23674, 575, 25869, 32184, 14426, -15712, -36624, -34472, -12030, 11499, 17277, -1376, -32052, -53621, -50569, -25903, 2583, 12338, -3650, -32151, -51365, -45894, -19895, 7206, 14889, -2264, -30080, -44882, -34972, -5741, 22287, 30456, 15732, -8114, -22237]
1029b2237P379K3241K3436O524j2375k1493j3342N703K1915K4295R339j2449k5587
1042A4349k0936j282J8631K4640J0406j3176k7907k2105R81K2606K5525P280j9210
1055A9802l3409k4094K065K3179K6027P702j6910k9186j8751L474K3134K4135
1067G168N966j7111k8488j8464M576K5635K8670J1399j2776k6349j9197M538K5921
1080h512K8250J0070j5611k7757j7688Q899K9802L0119R024j7010k8864j7147
1092a6425P419K5527K4023L509j8006k5412j3105Q204K2448K0373L084j6973k5772
1105a106j7974J017J7204J8925O827j2955k3811j8243o9J8331K2089P178j5350
1118B063k8541k1395R16K2091K7015R855j3247k6497j7449M657K3907K4364O787
$$ y = [-22237, -14858, 8383, 31819, 38343, 25968, 4475, -8867, -3164, 18751, 43046, 52385, 39936, 14349, -6587, -7869, 10762, 35402, 45808, 32632, 4725, -17380, -16399, 6207, 31732, 39012, 19802, -13607, -37701, -35636, -12457, 13570, 21272, 4362, -24824, -43575, -40101, -16967, 7168, 13134, -3977, -32465, -50929, -46353, -20718, 7952, 19351, 6575, -19774, -38971, -34433, -8512, 19738, 29808, 14197, -13560, -31248, -22349, 7453, 37572, 46596, 29586, 722, -16425, -9006, 16521, 40544, 44053, 26047, 635, -12470, -4266, 18182, 38555, 41639, 24666, -1106, -19080, -18063, -859, 18066, 24893, 11938, -11873, -30116, -30185, -11854, 10235, 17413, 2063, -26478, -47873, -46957, -24866, 2149, 12004, -1243, -27740, -45189, -40532, -16625, 7739, 14526]
1131A4526j4558k4853j4710P618K5410K6169R977j1641k2620j5300M652K2232
1143F902K4754R378j2302k4140j6985M509K5318K7393R307j6193k8962k0781M470
1156g332K4446K4022M522k0084l0147j6719R141K4498K1461l81k2673k8768j5086
1169c3100O444K0453J7932O78j6690k2758j2154N523J8648J8626L530j3859k3429
1182c0156j6094L773K1453K5067J0075j0869k2686j6919M913K3611K5552Q904
1194B6624j4566k3755j5519Q130K6633K6010P800j4342k4666j4558N154K1646
1206A4591K2032O372j3998k3775j5945L038K0135K2230P757j4789k7596k1361
1218b1309p70J9910K3972Q014j6517l0116k1411L306K4504K5040N557j9997l1531
$$ y = [14526, -32, -24885, -39595, -31977, -6567, 19602, 29579, 17938, -4682, -19982, -15330, 6902, 31656, 41034, 28732, 4592, -12393, -7884, 17434, 44827, 54134, 37941, 8979, -11802, -7332, 17114, 41136, 45658, 25574, -4573, -21292, -12151, 12347, 33808, 33427, 10754, -18014, -33100, -26656, -6203, 11729, 12407, -4283, -27041, -39195, -33672, -15024, 3602, 7132, -6727, -30156, -46250, -42477, -21024, 4043, 14118, 3249, -19437, -36356, -31443, -7832, 17720, 26624, 12058, -11697, -27216, -19086, 7547, 33557, 41357, 27015, 2349, -12209, -7055, 14591, 36623, 42995, 28997, 5222, -10723, -7685, 12450, 34680, 42437, 27648, 52, -21309, -22079, -2169, 21803, 29817, 13300, -16816, -38227, -34921, -10417, 14623, 20180, 183, -31348]
1231c1348j8651P261K6305K3896L223j8367k4882j1887J1830K3883K0868K355
1243A4486j6172k0501j0049R262K2048K0661O444r148j8665j1712N566J9681K1289
1256C3190O342j2418k1751j4459N895K1931K2851N967j5246k5227j5604M443J9538
1269A5452J8368J307j6819k3674j3190N368J7938J6180J575j5558k3335j5000
1281c1388J712J5643J7667N226j2283k1689j6164K178J9204K2453Q007j2918k5480
1294b7832j7670M543K4820K6425Q364j4588k5705j3509R909K7765K4021L949j8686
1307A1806k4480j0981J1561K6087K0950L058j5961k1457j0239Q311J9811J7261
1319C5727J293j5903k2094j3073N731J9796J9330L939j6326k5124j6446L032J9982
$$ y = [-31348, -49999, -42738, -16433, 7463, 10686, -7681, -32563, -44450, -32620, -8737, 12131, 14486, -1686, -22187, -32236, -22974, -926, 19735, 26179, 17031, -1634, -13346, -7780, 11901, 33190, 39532, 27114, 5363, -9096, -3201, 18730, 41581, 47548, 32302, 7075, -8529, -4086, 15452, 33820, 35127, 18308, -5366, -18556, -13188, 4750, 20930, 22505, 6947, -16388, -31388, -29676, -14033, 3634, 8860, -3423, -25112, -41276, -39098, -19894, 2559, 10566, -2352, -27832, -45502, -40959, -16139, 10286, 18650, 4062, -21643, -35152, -25243, 2522, 26543, 30492, 11806, -12674, -23655, -12094, 13993, 34943, 38001, 22040, 583, -9656, -1345, 18466, 35727, 37020, 21117, -977, -14050, -8319, 11477, 30807, 34746, 18420, -6704, -23150, -20118, -136]
1332a36J8564K546j7994k4950j4087P960K2301J8526Q63j8228k3386j1842P886
1345c1977K0354J6999K759j2764j8312q674O838J9623J8001N147j0728j8265j2942
1358b3941M398J9667K1650R442j0063k0365j4657N433K1987K2525O295j6406k6092
1371a27j4757P160K3579K1978K760j7346k4903j2365O927K0045J6074j652j9213
1384H160k2839j1060P341J9178J6226J061j5162k2095j3692L824J7551J6064K413
1397F970j3733k0854j1442P255K2102J9675L413j6293k2713j1606R070K2011J9359
1410A3214K774j4402j8853o119J0931K0759J6130N32j3594j7808q003P338J7551
1423A0450J6448L816j0551j6782j0508L550J6072J5999L636j2796k1756j5129
$$ y = [-136, 18428, 20974, 2980, -21970, -36057, -28097, -5796, 12730, 13593, -4635, -28021, -39863, -31977, -11623, 5376, 8135, -4629, -22941, -31615, -24777, -5154, 12847, 17994, 7266, -10999, -23941, -19543, 124, 21774, 31216, 21153, 788, -13869, -8436, 13551, 36076, 42371, 25965, -127, -14884, -7724, 15855, 37833, 40593, 23247, -1656, -14021, -7094, 12951, 29025, 27373, 8160, -14679, -25739, -18398, 780, 17006, 18067, 2905, -19190, -32882, -29058, -11507, 4557, 6970, -6763, -27617, -39059, -31804, -9702, 9973, 13386, -2907, -25620, -37226, -28156, -6145, 13214, 15988, 1586, -17267, -23386, -12455, 8304, 24434, 24966, 11372, -6436, -14439, -7101, 10450, 26898, 30714, 20163, 3381, -7127, -3577, 12495, 28494, 32130, 19334, -2422, -17551]
1435a7551L367J9200J9371N027j5150k3807j4426M635J9313J7496M52j7494k3750
1448b3317j1348R092K1355J7940J166j5695k0274j0095O951J8147J5242K553j3184
1461a467j7234q297Q459K0729J8214L620j3775k0314j1432P227K0537J8933L001
1474B8201j4404j9344q552J0368K1242J6292j337j9105j9611q750R079J8987J3272
1487B6338j606j5111j6811o863P407J4375J1133k157j4355j7548r616M549J5510
1500d755J4571K578j1927j8126j1312M810J6682J5511J965j4481j9847j0162Q055
1513b6438K0795J8230K898j3903j9225q720P692J9129J6165Q13j3611j7191o967
1526b0333R174J9858J6992K078j3580j8599j0285N977J7471J7200K414j3687j9424
$$ y = [-17551, -14184, 5016, 24387, 29414, 14264, -9543, -23969, -19334, -21, 17475, 17927, 433, -23317, -34665, -25573, -4218, 13722, 14888, -807, -21081, -31176, -24225, -6078, 9164, 11717, -1467, -18701, -26998, -18539, 2190, 20404, 24024, 10249, -10065, -21497, -14270, 6267, 25200, 28201, 13797, -5547, -14099, -3731, 17511, 33803, 32466, 13361, -6250, -15000, -5921, 13066, 26338, 24732, 9621, -7190, -14053, -6646, 7729, 18862, 16705, 2350, -15198, -24814, -20265, -4755, 9816, 12394, 467, -17659, -28971, -24161, -7479, 8032, 9997, -4484, -24331, -34493, -26438, -5643, 12587, 15485, 1582, -17643, -26363, -18671, 458, 16623, 17436, 3825, -13366, -20333, -11159, 8699, 25691, 27769, 14189, -4410, -14695, -8718, 8753, 25953, 28367, 14680, -4744]
1539d744j0315P400K0291J6973K54j7170k2819j0968P927K0076J5679j876j6780
1552C928j9774p382J0287J7987J2547k713j6575j8115o584P862J6390J3421l21
1565A0958j2083j5156o275P035J5679J3597N60j2663j6810q026O995J7607J6461
1578A7879K643j1847j6330p899P106J7540J3388l37j3998j6696o643Q231J7499
1591A0536J3620M49j2102j6912q005N571J3575J1813j87j2425j6674q297N579
1604a3459J5615J4845J643j3360j9301j0701M744J6298J4896J8j4132j9182p352
1617b9428R258K0428J4175j016j6215j8756o185R213J7771J2353j444j2935j3885
1630a6666l401J0773J7345J2406j267j3758j5654o855P735J6170J3907J620j1428
$$ y = [-4744, -15059, -7659, 12632, 29605, 29859, 12689, -10130, -21098, -13171, 6905, 22584, 20708, 3928, -15846, -23228, -12941, 5046, 17593, 14880, -1695, -19810, -26394, -18532, -2142, 11279, 10958, -1125, -16281, -22556, -15521, 158, 13755, 14315, 1652, -15158, -23184, -16189, 1418, 17879, 20522, 8675, -7655, -15554, -8448, 9092, 22480, 22143, 8145, -8551, -15194, -6963, 10536, 24156, 24605, 12503, -4409, -12414, -6843, 6732, 18545, 18358, 5933, -10741, -19038, -13459, 2156, 17001, 18644, 5284, -14017, -24718, -19974, -3676, 11220, 11238, -2894, -22076, -29428, -20170, 258, 14433, 13417, -2798, -21554, -27739, -18526, -755, 11598, 10154, -2781, -16666, -20067, -9294, 8051, 20457, 19190, 5432, -10222, -17077, -9342, 6828, 20735, 22355, 10927]
1643A0927j5117o343Q291J6996J2249j728j6214j8350p869R160J7389J3368k19
1656B2540j3486j6512o304P487J4244R631l727j4759j5826o357P281J6124J3427
1669A3763J041j1441j6218r317M649J4108J2864R63j2705j6645p661R036J9877
1682B314J6877J570j4911j9379q577Q203J7681J3512p09j4196j5314l188J1884
1695d233J8492J2188l133j5423j6468o993P372J5111J1247%j1618j3298n062P467
1709d351J4719J0486k661j5701j8611q210P599J6322J3445J64j3087j5208n289
1722b0383Q538J4754Q413m512j5649j5037l769J0600J6469J1472j98j0746j2116
1735a2164m626O036J2271R059j072r935j2638n105Q037J7265J4854K755j1161
$$ y = [10927, -4190, -10533, -2242, 14754, 27003, 25275, 9061, -9289, -17158, -7998, 9391, 22759, 22540, 9054, -7458, -13762, -6275, 7969, 17600, 13873, -886, -16712, -23069, -15788, 336, 13763, 14804, 3363, -12855, -22172, -17523, -3415, 9449, 10412, -2293, -18938, -26599, -17563, 2314, 19191, 20761, 5850, -13529, -22106, -13903, 3778, 17290, 16581, 2385, -12929, -16117, -4233, 14259, 26447, 23314, 7891, -8577, -15570, -8198, 6913, 18160, 18160, 6542, -6756, -11818, -4351, 10368, 20854, 18193, 2492, -16119, -24329, -16730, -408, 13037, 13201, 114, -15094, -20383, -11845, 2909, 11322, 6810, -8839, -23876, -27645, -17045, -576, 10896, 10698, -48, -12164, -16790, -10754, 1517, 10576, 9504, -431, -13069, -18174, -10137, 7128, 21982, 24737, 13576]
1748A3576j6619r725M973J6048J2874P70j3812j6087n028J0664J9415J2916k833
1761B7132j7332j8980o802P822J5800R994k268j3653j3319l355Q545J5121R403
1774A8108m042j5708j6560p729P142J6203J3049O14j2252j5287n547Q722J6595
1787C308J1315l349j6517j7315m329J2203J9508J3103k278j3675j3854k385R563
1800d702J4450P625m152j3112j1297k411J0080J4653R921m66j0945j2693p130
1813a0179M244J1790J0122M2j0922j5128o829P407J6065J3312j024j5145j8094
1826a4339q214O422J6326J1419k463j4610j5030k926J0979J6167J0044m247j4440
1839d912j4598m387Q628J4698J0292j344j0267j1427l439Q747J5141J1489j325
$$ y = [13576, -3043, -12768, -7795, 8253, 21127, 21897, 8085, -8002, -13030, -2366, 17049, 29965, 27132, 9800, -9180, -15982, -8160, 7640, 17634, 15366, 1713, -11606, -14961, -6416, 8705, 18108, 14066, -1642, -18202, -25931, -18789, -2586, 10463, 11077, -1175, -16462, -22009, -13287, 3308, 14623, 11274, -5243, -22558, -26887, -14684, 4824, 17927, 15649, 1974, -11880, -14265, -4702, 9748, 17373, 13221, 109, -11188, -13599, -3519, 11134, 21055, 20589, 9644, -3049, -10179, -5935, 5855, 15977, 16019, 5097, -10031, -16860, -9453, 6612, 19924, 18900, 3755, -14339, -22553, -16131, 195, 11614, 9151, -5459, -20489, -23415, -12436, 3731, 13775, 9528, -4912, -19510, -23897, -15269, -571, 9721, 8377, -1890, -13317, -16756, -8009, 7132, 18621, 17296]
1852A7296j3250j5296n587Q461J7837J3299l79j3642j5281l461J0908J6802R497
1865B7204n548j7123j4587k659J1494J5403Q419m782j3049j2364j910P637J0866
1878I001N763m350j2858j1972m996O751J3422J0442l61j1063j4323p108N764J3869
1892b019J1233k027j3047j5993m395J0654J8518J2967k190j4834j5271l979J0128
1905a0255J5333R336l339j2868j1586j017J1526J5660R539k145j2981j3939n527
1918a2263O575J4390J0395j277j1608j3818m122Q649J5916J1233m448j6573j7721
1931a4672n873R013J7270J0246m249j5306j2897j754J1607J3990N981p810j5800
1944a0254j2962q34J1027J3703Q374k452j0075r688j748O567J1435P156k757j0880
$$ y = [17296, 4046, -11250, -16837, -8376, 9461, 22760, 22381, 8739, -6542, -10003, 905, 17707, 27204, 21656, 4533, -10054, -12713, -1219, 14184, 22603, 17821, 4772, -7592, -9502, -1865, 9001, 14764, 10414, -2444, -14416, -19412, -12661, 761, 11203, 10842, -221, -14544, -21652, -15888, -2019, 9214, 7187, -5860, -21853, -26248, -15594, 2924, 15891, 13701, -1133, -16404, -20383, -10255, 5078, 14414, 11075, -1793, -13379, -14396, -2870, 12790, 22329, 20184, 7203, -6736, -12263, -5688, 8702, 19097, 17820, 6212, -7606, -11728, -3079, 12837, 24070, 19622, 3049, -14672, -20545, -11532, 5738, 15984, 11735, -3571, -16468, -18222, -6615, 7375, 13356, 5546, -10254, -23216, -24050, -13023, 680, 9054, 6602, -3473, -13161, -14909, -8342, 3093, 10249, 7492, -3388]
1958c388j2269k234Q813J6579J2921N63j1691j4395n274P564J4502R437l300j3850
1972C978j2828j362J2281J7153Q630m747j4930j3850m402O975J1551P305l296
1985A2458j1754j0588k424P703J3920Q199l807j5184j6805o841O743J5231J1407
1998H258q01j2728j4512k733J0396J5954Q872o394j7169j5146j448J2884J8127
2011C560R488l231j2569j0478k20J1291J1727N258n224j2542r684L74J0648J4391
2025A2789R383j262j0956j2024m977N846J1565P833l262j2255j2374j995J0174
2038a515J5194R243m886j5447j5405m461P874J2598P206m403j2401j0211o64R868
2052g410J2846N562m710j3131j2623l939P656J3277J0135p2r213j1566l182Q478
$$ y = [-3388, -15657, -17891, -9078, 7501, 20422, 20985, 9294, -5101, -10375, -2811, 11691, 21128, 17828, 3978, -8850, -10212, 2069, 19222, 27852, 23105, 8175, -5675, -10077, -3102, 8449, 15754, 12458, 704, -9884, -12308, -4605, 9315, 17514, 13707, -1477, -18282, -25123, -18380, -3149, 8258, 7457, -5271, -19783, -22516, -12120, 3834, 12706, 6312, -10857, -26003, -27451, -14567, 3560, 13048, 9817, -2752, -13230, -13450, -2159, 9568, 14826, 9602, -2940, -12624, -12250, -1602, 12789, 22172, 20910, 9954, -2070, -7047, -1201, 10364, 18197, 14935, 2680, -9694, -11689, -1515, 13679, 22922, 18036, 2589, -12816, -17277, -9403, 3195, 10401, 5998, -6403, -16614, -17278, -7410, 5436, 10998, 6288, -6843, -19466, -23405, -15749, -2472, 7663, 7591, -1622, -13188, -16370, -7892]
2066g892J4774R130l164j3871j4444l117J1514J8723J1673k784j3960j3350j560
2079h328J1470J4904N810o725j5163j1824M37J1979J4886O919n529j4309j2003
2092g476k349Q102J0231N610n228j2494j1481j663Q802J3447P515m485j4072j4389
2106a9930l751Q862J3810P997m359j3040j1109l53J0960J4298P107n622j2804
2119g934j0978j003J0317J3961P455k386j0081r556j216Q243J3235P594k160j1277
2133D214j1819l328Q293J4992J0109k247j3015j3671l841R509J4319Q685m563
2146A7637j5574j3789j765R995J4565P229o231j4371j2433j297R508J3238N281
2159A1993n490j2918j1400j386R364J3099O828m413j1805j0887j728R714J3550
$$ y = [-7892, 6882, 16012, 12848, -1023, -15467, -18584, -7070, 11653, 23326, 20542, 6582, -6768, -8328, 3142, 18046, 23856, 17131, 1968, -9856, -9419, 2560, 17446, 24365, 18836, 4527, -7476, -9825, -1723, 8508, 14118, 8890, -3604, -15085, -16748, -7946, 5501, 13016, 8531, -5541, -19930, -23681, -14819, -1009, 6988, 2629, -10411, -21520, -21873, -10913, 3385, 10492, 4870, -7934, -18912, -19915, -9598, 4363, 11818, 9432, -649, -10205, -11421, -3178, 10057, 17651, 15491, 4214, -7605, -10933, -2640, 12352, 22461, 20214, 7199, -6472, -10313, -804, 13515, 22200, 17637, 2063, -11726, -13491, -3496, 11069, 18298, 12067, -2304, -14737, -16034, -6526, 6712, 11993, 6503, -6415, -17815, -19201, -9837, 3262, 10090, 5677, -6128, -17015, -18743, -9029, 4521]
2172D521P845l866j3082j1176q90J0653J4664Q165m266j2672j0378J6J0478J3515
2186A3527N334n304j2567r312o1R480J2392O099m055j1030r882k551P090J0710
2200I870O029l873j1282j1242l252P863J3569Q439l935j3668j4311m297R119J3489
2214B518P456m779j3776j1874k27J1439J4188P460o695j4100j2321j112J0494
2227a1329J3336P698l840j1175q992j32J0540J3339O379n487j3083j1330j652
2240a5728J1034J5138R016l333j2567j0749n57J0255J2788M460p363j4482r786
2253a1874J261J1743J4169O105o334j2744r647j054P610Q839L344n786j0471q067
2267a2906P89Q845J2196M873l434j1960j1913l582O044J1339P774l005r816j0529
$$ y = [4521, 12366, 8500, -4582, -15758, -16648, -5995, 8669, 16834, 12568, -104, -10482, -10466, 12, 13527, 18861, 13557, 990, -8322, -8383, 1097, 13489, 19588, 15533, 4503, -5379, -7930, -840, 9870, 15899, 12026, 744, -10498, -13750, -5887, 7682, 16121, 12186, -1482, -15793, -20090, -10971, 2518, 9974, 5195, -8581, -20455, -20682, -9243, 4945, 12405, 5710, -8390, -20711, -21823, -11329, 2007, 9705, 5865, -5310, -14302, -14434, -3894, 9445, 15824, 10337, -2746, -14076, -15728, -4694, 10444, 19460, 16127, 3560, -7189, -7746, 2509, 15297, 19757, 12394, -2088, -11874, -10613, 1130, 15299, 21404, 15070, 2326, -7321, -8375, -765, 8074, 11418, 5632, -4839, -12906, -12117, -3272, 8924, 13797, 10363, -1597, -13510, -17092, -11048, 291, 8065, 5060, -4756, -15285]
2281a5285l27J0248J3705P135o316j4191j1699j909R901J3863Q113l006j0534
2294c02q603K31R761J0883M933o030j2951j0559q70R771J3866Q679k477j1551
2308D781j1139k590Q032J1832N058o305j4526j1586N12J2353J5829O856o856j4860
2322b609j1752p57R213J0965K586p047j1712p038K991J1073J2171L498n656j2478
2336f552j0155j453O932J0802O527k094q388p778K02Q885J2281O037m772j3195
2350b721j1780j308J0351J3978Q331k597j1428q842R2R868J0795M020p038j2938
2364a217r170Q36R779J2995O329l912j0288j0544j932N727R883M955m706j2062
2378c327j0481o96R841J3394Q289n237j4157j3244k755R626J2470N483o255j2704
$$ y = [-15285, -15612, -5364, 8341, 15476, 9160, -5031, -16730, -18639, -8738, 5125, 13238, 10232, -302, -8905, -8674, 1087, 11970, 16903, 10873, -2078, -12637, -13507, -3736, 10130, 18809, 16332, 4781, -6358, -8948, -916, 10916, 15974, 9669, -4857, -16443, -15931, -3578, 12251, 19107, 12251, -2609, -14361, -15118, -5905, 5060, 7646, 599, -11113, -18151, -15160, -4087, 8084, 11582, 5926, -6552, -16707, -18160, -11228, -426, 6101, 4007, -4381, -12159, -11957, -3072, 9209, 15246, 10474, -2721, -14501, -15809, -5458, 8520, 16851, 14254, 2826, -6016, -5924, 3944, 14739, 18759, 11721, -1217, -10387, -9551, 228, 13223, 19552, 15640, 5352, -5192, -7124, -1397, 8486, 13441, 8735, -3327, -13808, -14504, -4663, 8731, 17020, 11783, -2374, -15618, -18373, -8747, 3723, 9206, 2951, -9753]
2392i753q929K756J2475J3475L020q043j3955q323J105J0472J0357M186l873q689
2406c719n647J797Q290R822L196m367j0857q571j176R108J1602P580l092j0832
2420C134r530j481Q313J1332M268p143j2430q953R29J0363J1896M132o093j2005
2434c268q642L03O872Q588L892n182j0062q263P07P943J0541N786l189j0919j1066
2449a5959k087Q266J2306P797l792j1630j0088R0J1251J4551O498o986j3360j0366
2463a3509J231J2384J3313N442o871j2261p021K374J0736R735K811p023j0713
2476F28p464J171Q882R995M092m691j0968r503r77P619J0054M815n469j1795r775
2491a3386m28R301J1364M625o562j2992r787J215J0263J1118L529o532j1048p193
$$ y = [-9753, -18682, -15926, -3451, 10024, 13044, 5001, -8954, -17277, -16172, -5700, 4657, 8843, 4970, -3719, -9366, -7569, 721, 10543, 13739, 9372, -1485, -10056, -11232, -2124, 9478, 17058, 13966, 3134, -6396, -7877, 436, 11768, 16036, 8893, -3537, -12490, -11561, -1198, 10698, 14830, 8737, -3268, -11910, -11607, -4735, 3853, 7745, 2563, -7499, -15762, -15055, -7112, 3429, 9215, 6026, -4893, -15959, -18046, -9780, 2526, 10323, 6531, -5099, -15187, -15097, -3846, 10705, 17203, 10217, -3143, -13509, -12278, 106, 13419, 18861, 11990, -271, -7292, -4918, 5818, 15553, 18364, 11341, 628, -6836, -5665, 3217, 13212, 17304, 12613, 1645, -7858, -8835, -1216, 8838, 13653, 8184, -3611, -13386, -13814, -4513, 6851, 11476, 4914, -8078, -17865, -16650, -6387, 4731, 8260, 1728, -9320, -16513]
2505a6513K068R110R526L023m941r116n804M84P640J0010N433l051q754q670j059
2520a0614P630J1536O796k916j0940j0566q53R730J3192N881o461j3155j0386
2533a1126J021J0431J2448M002p968j2870p637J316J0105R739K395p273j1072
2546f489p678J162Q555R405L801m732r680q673N7Q147J0781M258m827j1317q403
2561a5633P78J0684J2085N969o098j2081q633J980J0365J0729L752o671j0107
2574b881n948L337J0160R602J890o040r921o456Q06P393Q749M119l689q447p994
2589e320p24O830Q740M808m814j1298r729j370R006J1874N627o068j2269j0090
2603a4797M78R608J1282K794p279j2378p287K658J0513J0633K593o114j0613o629
$$ y = [-16513, -14445, -5335, 4191, 7214, 2273, -6843, -12647, -12163, -4523, 5487, 10920, 7869, -885, -9555, -10614, -2984, 8552, 15348, 12432, 1492, -9074, -9927, -197, 12995, 18876, 12415, -740, -11126, -10105, 326, 12774, 16776, 8808, -4062, -11699, -10383, -278, 9461, 11856, 4583, -6489, -14167, -13005, -4450, 4955, 8756, 4024, -5656, -14329, -14272, -6125, 4656, 8914, 4087, -7230, -15633, -14855, -4171, 7914, 13883, 7785, -4296, -12929, -10949, -584, 10145, 13897, 7226, -2881, -8829, -5492, 4668, 14270, 16160, 10120, 199, -6257, -5451, 1942, 10691, 14810, 11121, 2674, -5320, -6044, 786, 9526, 14334, 9520, -1778, -11507, -12877, -3871, 8003, 13630, 7562, -4707, -14797, -14319, -4711, 6571, 9365, 2086, -10292, -17579, -14921, -4408, 6225, 8818, 2704, -7909, -14538]
2617a4538J389Q754R191L302m833r138o838J438R567J0970M698n344j1244q578
2631a1204R54R836J1025M252o526j1384p807L475J1112J0450J603q381j2044o596
2645a1235L295R675Q526J507o368r365n072K088P355P010J425n376r552o136O51
2660a1572P611R689M646m557r767q721K35P976J0671N024n762j1351q286J707
2674a2457J0931J1703L612o801j0632p665K392R892R787K613o223j0284n962J817
2688g277R405R741K427m657j0223p629O05P855J0026L795n868j0598q088J499
2702h987R491J0580L353p516j2297q535K115J0198J0011J776p775j0811o037M055
2716a0379R840P721R49q136r639m557L497P479Q858O15m895p686n262J549Q103
$$ y = [-14538, -13149, -4395, 4796, 8098, 3265, -5873, -12711, -11273, -1706, 9264, 13962, 8618, -2626, -11204, -10250, -414, 10611, 14863, 8337, -3047, -10854, -7379, 3733, 14183, 15786, 7405, -4639, -11235, -7940, 1735, 10261, 11768, 5400, -3965, -9037, -6949, 406, 7416, 8841, 3465, -6087, -12223, -11572, -3961, 5728, 10374, 5817, -3950, -12671, -12436, -4460, 6211, 11235, 5473, -5878, -14164, -12457, -1526, 10177, 13789, 6988, -3644, -11309, -8917, 975, 10762, 13375, 7152, -3132, -9094, -7277, 2128, 11869, 14296, 9639, -584, -8213, -7608, 247, 10273, 14068, 8200, -2398, -10486, -8987, 504, 11084, 14437, 6921, -5376, -13911, -11796, -1598, 8413, 10189, 2414, -8397, -14434, -10379, -539, 7182, 8131, -5, -9644, -14201, -10704, -3225, 5633, 6248, 1353, -6333, -11595, -10046, -1943]
2731a943Q086K418m671q966o336J929Q165R475L439n060r746o345K383R007R163
2746A0998K233p449r525o130K775R331Q529K223o122r407n584K032P347P884J429
2761A0564n189r881o361J858Q489R787K918n291j0721q089R76R137J0035K211
2775A0443o472j1375o486L713J1349R893J360q283j1656n591L891J0064R049N21
2789A0420p004r204l735M303Q747P267N05o244r359n513K284Q579P759K994n429
2804F370r085n680K122Q038Q598J143o623j1383n726L005R087Q738K213p300r012
2819e495n356K761P671P196M25o799q734n069L163Q118Q625K059m656r201o142
2834a1434O34P341Q523K468m192r597o412K702J0051R688K591o753j0963p061
$$ y = [-1943, 6143, 8561, 3890, -5076, -11412, -9483, -1318, 8157, 11596, 6536, -3210, -9555, -7172, 1835, 10998, 13231, 5782, -3743, -9873, -7098, 2233, 10762, 12985, 6863, -2544, -8128, -6096, 1251, 9135, 10564, 5375, -4506, -10867, -9009, -520, 9267, 12185, 6894, -3827, -11916, -10940, -1803, 8232, 10443, 3971, -7404, -13890, -10177, 1172, 11065, 12425, 4142, -7514, -13105, -9214, 850, 9899, 10420, 3416, -5788, -9523, -5220, 3527, 10794, 11299, 5055, -4304, -9817, -7533, 1046, 8805, 11799, 6370, -2715, -8395, -6273, 1765, 10363, 11506, 4883, -6500, -12226, -9221, -134, 8604, 10817, 3517, -5495, -10851, -8090, -419, 6777, 7202, 403, -8331, -13400, -10237, -2119, 6506, 8565, 3909, -5292, -11434, -10800, -3459, 5064, 7532, 3340, -6257, -12669, -9967, 84, 9772, 12363, 5610, -5353, -12414]
2848a2414L119R736R493J409o894r265m179M139R554P633k62p953r033m380L688
2863e609P899P578Q10n638q185m681K493P701P189O22o143r844m975K942Q702
2878H61Q536J364o633r693n144L080Q859O836O95p335q749l587M468Q195O788
2893H541J04n523p877m037J965P862O716J241n071p672n593K618P699Q181K607
2908A1761n888r901o404J817R208R174K071o800j0869n292K907R646Q437P51p892
2923B726j0233m538M093R816P490o24p813r168l929L637P958P521P13o005q291
2938f647m588L021P913P399J419o942r650m523L226R817R027Q47o414r645m420
2953a0160L554R130O617n83p072q032k572M747Q750O857l38o431p616m053K561
$$ y = [-12414, -9295, 441, 9934, 11343, 4449, -4816, -8995, -4856, 4698, 12331, 12069, 4116, -4917, -9297, -5609, 2290, 9868, 10678, 5040, -3145, -7826, -5333, 2368, 9557, 10179, 4036, -5808, -10783, -7841, 861, 9397, 10761, 4128, -5565, -10709, -7629, 1230, 8066, 8761, 1426, -7323, -10910, -6442, 1753, 8541, 8645, 3122, -4755, -8792, -6827, 1035, 7751, 8992, 3921, -3751, -9344, -6726, 973, 9154, 11761, 5873, -4028, -10432, -8615, 593, 9767, 11838, 5038, -5831, -11123, -8216, 1430, 9867, 10618, 2726, -7507, -12045, -7952, 1864, 9354, 8730, 917, -8251, -12180, -8543, -585, 6936, 7649, 1644, -6647, -11235, -8214, -301, 7098, 8517, 1575, -8075, -12598, -9372, 445, 9472, 10319, 3905, -5740, -10160, -6606, 2524, 9141, 8558, 1486, -6546, -9118, -4371, 4379, 11236, 10898, 4467, -3149, -7202, -4641]
2968d641N962O210J068m320o902l908K470O527P581J981o329r906o479J265Q367
2983a054Q895K686n770r161n170L617R105P294q33q011j0644m428M450R709P659
2998H344J145n881q270l475K815O970O046j080n971q548l642L574R407Q770J981
3013A2185n995r795o492K584Q124P037P30p254r062l638N943J0686P920q74r018
3028C081j0299m683M033P887N873m14n867n849j757M254P513M925o79o801q687
3043g470n400K245P532P708L149l959p415n344L200O979P547j42p837r883n231
3058a4321M545J0833R129J831o476q799l946L820P147N487j772p172p686j838
3072i218N228Q822P665O05n867q198n448R19O147O398J471n809p673l795M432
$$ y = [-4641, 1321, 7531, 8599, 4279, -2623, -6531, -4061, 2466, 10047, 12028, 5699, -4207, -10686, -9421, -1054, 7841, 10527, 4757, -4404, -9574, -5957, 3148, 10442, 9609, 1598, -9046, -13474, -9024, 685, 8344, 9489, 3608, -4662, -8137, -5322, 1648, 7694, 6614, 643, -7905, -11547, -7973, 1434, 10204, 12185, 6190, -3605, -10097, -7513, 611, 7648, 8378, 1124, -7938, -11576, -5633, 5053, 12973, 12099, 3081, -7218, -11901, -7868, 19, 5892, 5478, -389, -6238, -7995, -3741, 3772, 8697, 8018, 1217, -7470, -12870, -10625, -3093, 4615, 7764, 3805, -3610, -8954, -5754, 1225, 8772, 8630, 793, -9090, -14321, -9776, 1057, 10186, 12017, 5541, -3258, -7204, -3384, 3763, 9250, 7478, 306, -7380, -9218, -3990, 4832, 12497, 13102, 7235, -963, -6411, -5492, 655, 7053, 8524, 2715, -4958, -8753, -4321]
3087d321R392Q528J77r039j1023o474L339J0249O935j53p386p786j501N589R408
3102E934M343l037q688q683l314M872P887N983R35m046n596l223K394N820N451
3117G032k81o441p966m692L449R505R160K443o126r404n245K779P876O866j171
3132G784p901q545k392O035J0246O856o88p940q618m311K978O486N480l54m854
3147B62o782k310L455P715O446K05o248j0064n627K227R048Q260J408o285q217
3162f507m082N416R182O688k074q866r512k683N558J0316O905n31o849o929j539
3177e507M425O864M213k275o147o370k505M521P383O642P41n705p995m492J699
3192d508O961O693n1o726q331l178M250Q567P097o36q428q960l862L807Q023N258
$$ y = [-4321, 5071, 13599, 13776, 4737, -6286, -12760, -9421, 828, 7763, 7610, 224, -7562, -9063, -3474, 5934, 10277, 7240, -1448, -10131, -13445, -8573, -686, 5297, 6232, 2186, -3410, -6633, -4239, 1581, 7032, 6751, 310, -7656, -12348, -8899, 606, 9766, 12209, 6083, -3321, -8566, -5787, 2089, 8955, 7784, -117, -8662, -11054, -5019, 5227, 12083, 11395, 3455, -5163, -9474, -6496, -10, 5470, 5116, 262, -6520, -8830, -5375, 2340, 8786, 8991, 2743, -7321, -12948, -10721, -1673, 6587, 7995, 1710, -6507, -10589, -5173, 4009, 10697, 8623, -243, -9755, -12438, -6880, 3436, 10341, 9810, 2961, -3968, -5507, -1082, 5782, 9995, 7720, 1573, -4797, -7302, -2781, 4602, 11244, 11985, 6280, -1715, -6207, -4508, 2453, 9146, 9095, 2369, -5962, -9140, -4890, 3677, 10774, 10138, 1710, -7250, -11112, -7305, 718, 5976]
3208E976o12o678o890j963M409O997N386j331o029p131l494L097P323O384J396
3223F840m804p864m100L069Q239P546K90p438q968l798M913R922P579l12q142
3238B972r377k518M928R331N713k627p608p405j423N521P785M665k099o917o731
3253e790l193L747P013N017m03n491p226l405K890P767O300j32p205q489l605
3268a2205N089R081O108o88p293q245k435N311Q711M806j666n815p121j261M505
3283c118P464N480q55n778o831k651K931P230N824R29n456p586l695K699P694
3298D281O683j8p063r396m254M739Q654P081q05p818q706l114M488Q704M518k288
3314E686q096p609j251N147P546N131j522o672o995k227L494P265N171q55n529
$$ y = [5976, 5364, -1314, -8204, -10167, -5758, 1239, 6625, 5294, -735, -7866, -11360, -8263, -940, 5444, 6840, 2036, -5828, -9928, -6859, 1380, 8926, 9216, 1778, -7190, -10988, -6075, 3847, 11426, 11114, 2972, -6405, -8923, -3995, 5336, 11049, 8422, 814, -6591, -8014, -2493, 5292, 9957, 7858, 941, -5790, -8983, -5236, 1777, 6794, 6391, 900, -6326, -9731, -6841, 926, 7226, 7094, -111, -8600, -12205, -7116, 1965, 8073, 7385, 92, -8153, -10588, -5277, 3434, 8240, 6574, 759, -6362, -7623, -3118, 4346, 9826, 8971, 3193, -3638, -6289, -3358, 3872, 9696, 10625, 5169, -2417, -6112, -3413, 4281, 10964, 10946, 3883, -5513, -9767, -5028, 3626, 10707, 9902, 2084, -6622, -9736, -5248, 3456, 7974, 5686, -2410, -10019, -11270, -6123, 1423, 6554, 5032, -1640, -8635, -10862, -7368, -103, 5068, 4213, -1316]
3329a316o824j989M498P893O300r32o957p888l659M421R023O360k06p372o945
3344e593j999O047P198M938k346p412o898k153N097P062N795j039n648o716k075
3359e742K602O329M824j042o104p568k825L263Q522P116m37o482q759m595M052
3374f846P869O164j125p717p579j437O100Q900O106k303p789p974j731M054Q238
3389B930M980j153n955n885j433M685P760M738j790o629p738l325M360Q393O258
3404A0196k37o849o963k000M000P448M522k432q581p316j721N741Q633N236k251
3419G426o691o606k060L960N736K816j963n625n937j763N125P434N203o3o586
3434D06p621l851K835P014N491L71n913o485j985N015Q627N956j831p394q640
$$ y = [-1316, -8140, -10129, -5631, 2262, 8562, 7630, 673, -7215, -10874, -6453, 2570, 8930, 8724, 1352, -5593, -7592, -1545, 5653, 10591, 8245, 833, -6065, -8218, -3121, 3941, 9736, 8697, 3049, -3667, -5742, -3140, 3189, 8013, 6971, 867, -6701, -9526, -6263, 2259, 9375, 8938, 2456, -6303, -10898, -6846, 1023, 7187, 6062, -1655, -9234, -10671, -4571, 4329, 10435, 8132, 343, -7631, -9362, -5308, 2930, 7910, 6757, 802, -5083, -6516, -1831, 5929, 10667, 8877, 2248, -5490, -8815, -4455, 3938, 10196, 9959, 3110, -3853, -5853, -1853, 5595, 10117, 7685, -896, -8212, -9933, -4192, 4441, 9677, 7426, 735, -5871, -7931, -3971, 1765, 4581, 2618, -3007, -8944, -10707, -5582, 1852, 7055, 6992, 406, -7215, -11066, -8231, -1217, 4274, 4645, -1268, -7753, -9738, -4723, 3904, 9860, 8029, 635, -8005]
3449h005k580M565Q331O182j504n816o035o20M442P366M145k076p756p277k214
3464h852M685Q395N369K61n598p212k966L696P005M701k187q195p708j560N797
3479d369R214O106k009p896p773j733M287O685L568k952o807n131M78N677P468
3494D813M137k615n987o438k500L487N423M686k43m893m802j240M133P532M626
3509A0119j369p498q052l066M533Q246N705m21o132o153j265N009O931K840l049
3524F378p226p162j539N049P284N536q79n676o370k666L349N847L783j876o854
3539c022o541j681M749R052N807q09p519q120l022M460P378M409j797p357n665
3554i678L70O631Q186L753k941p510o169o65M249O405L284p38m825m247nN049
$$ y = [-8005, -10585, -6020, 2311, 8493, 6989, 1173, -4862, -5482, -1040, 6326, 10471, 8395, 639, -6638, -8852, -4167, 4228, 9597, 9858, 4260, -2952, -5918, -2222, 4783, 9484, 7297, -898, -8606, -10166, -4369, 4845, 10951, 8942, 1046, -6727, -8460, -4173, 2512, 6080, 3128, -3679, -8810, -8332, -2655, 4813, 8950, 6335, 348, -6090, -8590, -5103, 320, 5006, 4763, -130, -4932, -6172, -2039, 5493, 10119, 8750, 1252, -6800, -9866, -5333, 2913, 8618, 8197, 2065, -4088, -5353, -344, 6587, 9427, 6378, -848, -8010, -9549, -4500, 2784, 8320, 7441, 1765, -4605, -7271, -3922, 1925, 5708, 3832, -3022, -9563, -11244, -6495, 2557, 8364, 7555, 36, -8084, -11106, -6646, 732, 5141, 3344, -4013, -9678, -9308, -2677, 5509, 9262, 6321, -1189, -7358, -8023, -3774, 2631, 5915, 5177, 352, -3895, -3900, 1149]
3570A149N155M031j922o803o424k513M241P285N744n57n818n914k110L579P005
3585F128L827l567p284o603j375N435P874M455j948o112n828j708K931N878K609
3600D712j687n834n056j044L947P160M922p68o116o927k820L034P502N154j369
3615D810o125n886j268N496Q460N172k905q148o950j301N488P984M180k764o491
3630b48m856O90N102N851K481l275o338n481j083M141O020L994r68n581n142j582
3646f275K618O342L143j962o726o075j345N507P224M400k099o625n882o56L849
3661d562O404K705k410n631m423O01M751O347L485j994n207n205j050K967N855
3676B633M387m46m402n137k074L780O959N132j578o971p148j757M439Q202N103
$$ y = [1149, 6304, 10335, 8413, 1610, -4814, -7327, -3086, 4199, 9943, 9386, 3568, -2346, -4456, -877, 6128, 9955, 6388, -896, -7499, -8874, -3439, 4435, 8890, 6942, 830, -4998, -6706, -3775, 2103, 4712, 3025, -2809, -7865, -8909, -4962, 2198, 7120, 6352, 236, -6691, -9511, -6477, 1025, 6179, 4810, -1315, -7201, -8469, -2973, 5487, 10659, 7754, -394, -7344, -8645, -3157, 4827, 9007, 6243, -248, -5104, -4414, 688, 6539, 9020, 5745, -593, -6074, -7157, -3016, 3004, 6998, 6030, 449, -4693, -6275, -3657, 2685, 5828, 3866, -2860, -8935, -10280, -4773, 2451, 6851, 4752, -1873, -7755, -8411, -4562, 1842, 4547, 2137, -3494, -7917, -7316, -2565, 3782, 7267, 5273, 66, -5139, -6189, -3222, 2633, 7020, 6574, 2172, -2965, -5039, -1259, 5700, 10832, 9254, 2283, -4865, -6622, -2183, 6019, 11122]
3691A1122k250p074o459j130N338P102K551l545p307n530o7N375O155K763k672
3706D372n913m749j043L275N281L677k011n474n677n58M307O338N068j964o556
3721a627o123j508M880O868M059k263o617m642K85N549O810K293k789o082n149
3736f056P6N058N361K642j594m962m042p18L545M390K985j424n035n296j968L594
3752c444O735M375j137o211o221k598M189O624M581k261o729o606k49O034O862
3767C944L368k659p436n560k83N441O287K233j893n157m477J30M467N712M154
3782H271k524n804n352r72M508P158L834j532n998n910l99M353P474K713k645
3797G175p593n353m96O180P074K486l666o365n006J59M625N225J485l134m991
$$ y = [11122, 8872, 1798, -4661, -5791, -453, 6649, 9200, 5655, -1652, -7182, -7249, -1874, 4281, 7044, 4372, -1541, -6290, -7333, -4058, 1223, 4900, 2889, -2585, -8262, -8820, -4513, 1825, 6893, 4929, -1627, -7750, -9258, -4378, 2490, 6549, 4286, -2331, -6973, -6688, -1139, 5671, 7964, 5175, -907, -6056, -5980, -922, 4439, 7081, 5487, 525, -3517, -4235, -690, 3700, 6685, 5261, 226, -5070, -7038, -3444, 3291, 7666, 6529, 318, -5903, -8501, -4312, 2312, 6893, 4632, -2097, -8703, -8952, -2918, 3944, 7312, 4653, -2783, -8343, -8626, -3185, 3102, 5335, 3442, -1715, -6192, -6062, -1595, 4117, 8271, 5747, -57, -5409, -6381, -1873, 5285, 9119, 7587, 1589, -4321, -4720, -367, 7107, 9820, 7175, -418, -5771, -6267, -87, 6987, 9473, 5807, -558, -5564, -5405, -780, 4445, 5930, 2796, -2195]
3812b195l865k7L738N228K720j578n275n501j173K798N470M335r06n169n598j314
3828h312L921P059L494k106o372o271k11N317P221L572k237o351n328N70N089
3843i45N832K385k678n674m473O8M574N465L213j915n349n281j226M200N425L542
3859G163j680n834n960p75N120O901L614l205p005o499l75N833O992K136l094
3874C332o472l635P61N173N214J960l717n634l931P46M799M939K884k065m201
3889A53m462k85L542M905L142k071m890n179p04M717P045L686j896o744o084r15
3905f040M892O019K566k471o386m292P68M852N985K268l501o541m936l47M027
3920c137N843K715j476n224m973o27M278N846K817k592o852o013k1N260P155M135
$$ y = [-2195, -6060, -6087, -2349, 2879, 5599, 4021, -1254, -6755, -7928, -5130, 340, 4675, 3769, -1400, -6998, -8312, -4391, 2668, 6162, 4056, -2316, -8587, -8798, -3481, 3740, 7312, 5075, -1276, -6604, -6034, -945, 4887, 7272, 4594, -1080, -5553, -5485, -911, 4554, 7767, 5852, 503, -4778, -6004, -1804, 3621, 7163, 5483, -351, -6311, -7086, -1966, 4935, 8549, 5344, -1661, -8160, -8535, -2702, 4290, 6426, 3332, -3140, -6775, -6014, -841, 4373, 6333, 2616, -3018, -6949, -6203, -1404, 3535, 6419, 4354, 153, -4309, -4594, -1052, 3853, 6995, 4924, 34, -5145, -5849, -1132, 5913, 9599, 7703, 959, -5125, -6040, -1148, 4871, 7437, 4966, -1420, -5712, -4944, -92, 5893, 8161, 4660, -1881, -6817, -7164, -3137, 2706, 5421, 3945, -1279, -6252, -6879, -2601, 3245, 6062, 3470, -3382, -9395, -9416, -4156, 2999, 7134]
3936G134k757o720n516N24N542O107J777l086p194m615J712O394O113K529l494
3951D450n889l995M75M670M481J470k599n062l592Q78N125N488K596k442o273
3966b19n094j181M086N750K867k520n573l815Q49N634N461J484m196o546m252
3981g265K1M800N891K389j802m984l769P45M057M288J580k647n533n125K39N200
3997a915O858L185j759n831n123m08M029N984K293l772n852m294P54O500O965
4012G614K032l514p176m549L38M979M884R62l561n284k889J547N314N597J004
4027G298m201o162m395k03M483M963K616k242n300l255O99M864N307J911m342
4042B041o992m369J137N083O666K124k884m621l734J093M568M493P15l592n399
$$ y = [7134, 4377, -2343, -7859, -7335, -1793, 4314, 6091, 3005, -4189, -8804, -7092, -698, 5415, 7944, 4450, -1439, -5434, -4959, -289, 4192, 5662, 3063, -1999, -5591, -4713, 412, 5900, 8496, 6054, -219, -5313, -6494, -2408, 3342, 6209, 3689, -1884, -5699, -4850, 784, 6245, 7729, 3533, -3013, -7265, -7244, -2444, 3447, 5836, 4034, -950, -4719, -3974, 83, 4371, 5951, 3304, -2229, -7354, -7115, -1915, 4943, 8128, 6369, 538, -4585, -4993, -964, 5020, 7313, 3541, -2311, -6605, -5851, 649, 7614, 9646, 6132, -1044, -5593, -5255, -276, 4608, 5570, 2009, -3275, -6164, -4617, 697, 6294, 7298, 3097, -3065, -7460, -7663, -3180, 1783, 4399, 2157, -3143, -6398, -5699, -835, 4472, 6383, 2041, -4951, -9320, -8183, -3100, 3566, 5690, 2806, -1815, -5549, -4456, 112, 4605, 5320, 1728, -3671]
$$ [...]
8191c20
##END NTUPLES=NMR FID
##END=
