##TITLE=1H_BAU-5.02
 CCl4+DMSO-d6, 8 sc, 
 5.2.2019
##JCAMPDX= 6.0         $$ Bruker NMR JCAMP-DX V2.0
##DATA TYPE= NMR FID
##DATA CLASS= NTUPLES
##ORIGIN= UXNMR, Bruker Analytische Messtechnik GmbH
##OWNER= root
$$ XWIN-NMR		Version 3.5
$$ Tue Feb  5 14:24:51 2019 Russian Standard Time (UT+4h)  she@DPX200
##.OBSERVE FREQUENCY= 200.1313
##.OBSERVE NUCLEUS= ^1H
##.DELAY= (6, 6)
##.ACQUISITION MODE= SIMULTANEOUS
##.ACQUISITION SCHEME= undefined
##.AVERAGES= 8
##.DIGITISER RES= 18
##SPECTROMETER/DATA SYSTEM= spect
##.PULSE SEQUENCE= zg30
##.SOLVENT NAME= CDCl3
##.SHIFT REFERENCE= (INTERNAL, CDCl3, 0, 15.7039)
##AUDIT TRAIL= $$ (NUMBER, WHEN, WHO, WHERE, WHAT)
$$ ##TITLE= Audit trail, XWIN-NMR		Version 3.5
$$ ##JCAMPDX= 5.01
$$ ##ORIGIN= Bruker BioSpin GmbH
$$ ##OWNER= she
$$ F:/spectra/data/she/nmr/H-F/1/audita.txt
$$ ##AUDIT TRAIL=  $$ (NUMBER, WHEN, WHO, WHERE, WHAT)
(   1,<2019-02-05 14:23:43.46 +0400>,<she>,<DPX200>,
      <created by zg, POWCHK disabled, PULCHK disabled
       configuration hash MD5:
       00 E9 B6 7A A2 85 ED C7 34 08 36 98 17 FE 4E 26
       data hash MD5: 16K
       41 B1 07 F9 4B B8 36 6E 74 C2 B4 6A 3A 08 C9 02>)
$$ ##END=
$$ 
$$ hash MD5
$$ BF 58 6F 3D 9C 29 C7 2E 4E 6D 2C AD 90 A4 8E F8
##$RELAX= 
##$RELAX= 
##$RELAX= 
##$RELAX= 
##$RELAX= 
##$RELAX= 
$$ Bruker specific parameters
$$ --------------------------
##$DU= <F:/spectra>
##$EXPNO= 1
##$NAME= <H-F>
##$PROCNO= 1
##$TYPE= <nmr>
##$USER= <she>
##$AMP= (0..31)
100 100 100 100 100 100 100 100 100 100 100 100 100 100 100 100 100 100 
100 100 100 100 100 100 100 100 100 100 100 100 100 100 
##$AQSEQ= 0
##$AQ_mod= 1
##$AUNM= <au_zg>
##$AUTOPOS= <>
##$BF1= 200.13
##$BF2= 200.13
##$BF3= 200.13
##$BF4= 200.13
##$BF5= 200.13
##$BF6= 200.13
##$BF7= 200.13
##$BF8= 200.13
##$BYTORDA= 1
##$CFDGTYP= 0
##$CFRGTYP= 5
##$CHEMSTR= <none>
##$CNST= (0..31)
1 1 145 1 1 1 1 1 1 1 1 1 1 1 1 1 1 1 1 1 1 1 1 1 1 1 1 1 1 1 1 1 
##$CPDPRG= <>
##$CPDPRG1= <>
##$CPDPRG2= <>
##$CPDPRG3= <>
##$CPDPRG4= <mlev>
##$CPDPRG5= <mlev>
##$CPDPRG6= <mlev>
##$CPDPRG7= <mlev>
##$CPDPRG8= <mlev>
##$CPDPRGB= <>
##$CPDPRGT= <>
##$D= (0..31)
0 1.2 0 0 0 0 0 0 0 0 0 0.03 0 0 0 0 0 0 0 0 0 0 0 0 0 0 0 0 0 0 0 0 
##$DATE= 1549362222
##$DBL= (0..7)
120 120 120 120 120 120 120 120 
##$DBP= (0..7)
150 150 150 150 150 150 150 150 
##$DBP07= 0
##$DBPNAM0= <>
##$DBPNAM1= <>
##$DBPNAM2= <>
##$DBPNAM3= <>
##$DBPNAM4= <>
##$DBPNAM5= <>
##$DBPNAM6= <>
##$DBPNAM7= <>
##$DBPOAL= (0..7)
0.5 0.5 0.5 0.5 0.5 0.5 0.5 0.5 
##$DBPOFFS= (0..7)
0 0 0 0 0 0 0 0 
##$DE= 6
##$DECBNUC= <off>
##$DECIM= 32
##$DECNUC= <off>
##$DECSTAT= 4
##$DIGMOD= 1
##$DIGTYP= 9
##$DL= (0..7)
0 120 120 120 120 120 120 120 
##$DP= (0..7)
150 150 150 150 150 150 150 150 
##$DP07= 0
##$DPNAME0= <>
##$DPNAME1= <>
##$DPNAME2= <>
##$DPNAME3= <>
##$DPNAME4= <>
##$DPNAME5= <>
##$DPNAME6= <>
##$DPNAME7= <>
##$DPOAL= (0..7)
0.5 0.5 0.5 0.5 0.5 0.5 0.5 0.5 
##$DPOFFS= (0..7)
0 0 0 0 0 0 0 0 
##$DQDMODE= 0
##$DR= 18
##$DS= 0
##$DSLIST= <SSSSSSSSSSSSSSS>
$$ [...]
##$SUBNAM2= <"">
##$SUBNAM3= <"">
##$SUBNAM4= <"">
##$SUBNAM5= <"">
##$SUBNAM6= <"">
##$SUBNAM7= <"">
##$SUBNAM8= <"">
##$SUBNAM9= <"">
##$SW= 20.0189088683792
##$SWIBOX= (0..15)
0 0 2 0 0 0 0 0 0 0 0 0 0 0 0 0 
##$SW_h= 4006.41025641026
##$TD= 16384
##$TD0= 1
##$TE= 0
##$TE2= 300
##$TE3= 300
##$TEG= 300
##$TL= (0..7)
0 120 120 120 120 120 120 120 
##$TP= (0..7)
150 150 150 150 150 150 150 150 
##$TP07= 0
##$TPNAME0= <>
##$TPNAME1= <>
##$TPNAME2= <>
##$TPNAME3= <>
##$TPNAME4= <>
##$TPNAME5= <>
##$TPNAME6= <>
##$TPNAME7= <>
##$TPOAL= (0..7)
0.5 0.5 0.5 0.5 0.5 0.5 0.5 0.5 
##$TPOFFS= (0..7)
0 0 0 0 0 0 0 0 
##$TUNHIN= 0
##$TUNHOUT= 0
##$TUNXOUT= 0
##$USERA1= <user>
##$USERA2= <user>
##$USERA3= <user>
##$USERA4= <user>
##$USERA5= <user>
##$V9= 5
##$VALIST= <valist>
##$VCLIST= <CCCCCCCCCCCCCCC>
##$VD= 0
##$VDLIST= <DDDDDDDDDDDDDDD>
##$VPLIST= <PPPPPPPPPPPPPPP>
##$VTLIST= <TTTTTTTTTTTTTTT>
##$WBST= 1024
##$WBSW= 4
##$XGAIN= (0..3)
0 0 0 0 
##$XL= 0
##$YL= 0
##$YMAX_a= 3389
##$YMIN_a= -4297
##$ZGOPTNS= <>
##$ZL1= 120
##$ZL2= 120
##$ZL3= 120
##$ZL4= 120
##$ABSF1= 10
##$ABSF2= 0
##$ABSG= 5
##$ABSL= 3
##$ALPHA= 0
##$AQORDER= 0
##$ASSFAC= 0
##$ASSFACI= 0
##$ASSFACX= 0
##$ASSWID= 0
##$AUNMP= <proc_1d>
##$AZFE= 0.1
##$AZFW= 0.1
##$BCFW= 1
##$BC_mod= 2
##$BYTORDP= 1
##$COROFFS= 0
##$CY= 11.3945322036743
##$DATMOD= 1
##$DC= 2
##$DFILT= <>
##$DTYPP= 0
##$F1P= 18.9103706918063
##$F2P= -1.10871071338519
##$FCOR= 0.5
##$FTSIZE= 0
##$FT_mod= 4
##$GAMMA= 1
##$GB= 0.15
##$INTBC= 1
##$INTSCL= 1
##$ISEN= 128
##$LB= 0.24
##$LEV0= 0
##$LPBIN= 0
##$MAXI= 10000
##$MC2= 0
##$MEAN= 0
##$ME_mod= 0
##$MI= 1.114404
##$NCOEF= 0
##$NC_proc= 0
##$NLEV= 6
##$NOISF1= 3.799351
##$NOISF2= 2.8
##$NSP= 1
##$NTH_PI= 0
##$NZP= 0
##$OFFSET= 15.70392
##$PC= 1
##$PHC0= -9193.855
##$PHC1= 6.600039
##$PH_mod= 1
##$PKNL= yes
##$PPARMOD= 0
##$PSCAL= 0
##$PSIGN= 0
##$REVERSE= no
##$SF= 200.130013532006
##$SI= 16384
##$SIGF1= 3
##$SIGF2= 2
##$SINO= 400
##$SIOLD= 16384
##$SREGLST= <1H.CDCl3>
##$SSB= 0
##$STSI= 0
##$STSR= 0
##$SW_p= 3612.71676300578
##$SYMM= 0
##$S_DEV= 0
##$TDeff= 0
##$TDoff= 0
##$TI= <>
##$TILT= no
##$TM1= 0
##$TM2= 0
##$TOPLEV= 0
##$USERP1= <user>
##$USERP2= <user>
##$USERP3= <user>
##$USERP4= <user>
##$USERP5= <user>
##$WDW= 1
##$XDIM= 8192
##$YMAX_p= 0
##$YMIN_p= 0
$$ End of Bruker specific parameters
$$ ---------------------------------
##NTUPLES= NMR FID
##VAR_NAME=  TIME,          FID/REAL,        FID/IMAG
##SYMBOL=    X,             R,               I
##VAR_TYPE=  INDEPENDENT,   DEPENDENT,       DEPENDENT
##VAR_FORM=  AFFN,          ASDF,            ASDF
##VAR_DIM=   8192,          8192,            8192
##UNITS=     SECONDS,       ARBITRARY UNITS, ARBITRARY UNITS
##FACTOR=    0.0002496,     1,               1
##FIRST=     0,             0,               0
##LAST=      2.0444736,     0,               0
##MIN=       0,             -4297,           0
##MAX=       2.0444736,     3389,            0
$$ Real data points
##PAGE= N=1
##DATA TABLE= (X++(R..R)), XYDATA
0@%%%%%%%%%%%%%%%%%%%%%%%%%%%%%%%kQj4J6j6J6j6J6j6J7k0K5l0L2l3L6m1M7
49B5n1N4o0O7p4Q2r1J01j12J25j40J57j78K05k42K91l55M55o37J058m977J699
71b598M559J28m47k143r88J21J156J91O74K73m1n76r95j146O45J811R09k31o52
90F50j340o45K56O55J071J297l85j687j493m19J255K382O96j343j446p04J74Q55
108a71M51n9N75L77r39j268p37M54J923J634p22j647j192m08Q34J395N32Q1k73
127H40j355j126K02J047J484Q06r35j769m08M44L98N86M77J15J84p13j541n85
145a849J119J767J254n98k386j237N89J334J006L84o75p65k12o28k61R23J039
162H04N73k09j502j292L23R96P71O02l8p57p31q49k70J250J653M31q63j639j276
$$ plain form
0 0 0 0 0 0 0 0 0 0 0 0 0 0 0 0 0 0 0 0 0 0 0 0 0 0 0 0 0 0 0 0 0 -2 6 -8 8 -8 8 -8 8 -8 9 -11 14 -16 16 -17 19 -22 25
49 25 -26 28 -32 35 -39 43 -48 53 -59 66 -74 83 -95 110 -132 159 -196 259 -378 680 -4297 -2598
71 -2598 1961 2089 1642 -501 -1489 -1368 -212 -21 653 926 885 309 -686 -1832 -1187 624 1533 1302 650
90 650 -690 -1335 -1079 -424 647 1944 1559 -128 -1621 -2040 -785 1597 2293 950 -496 -1200 -1026 -171
108 -171 280 221 796 1173 234 -1034 -1771 -1317 606 2240 1518 -129 -1321 -1729 -895 500 1032 1113 840
127 840 -515 -1641 -1439 -392 1092 1898 963 -806 -1214 -770 -372 214 691 806 990 277 -1264 -1849
145 -1849 -730 1037 2291 1693 -693 -1930 -1341 -7 999 1383 708 -57 -269 -897 -1158 -235 804
162 804 1377 1168 -334 -1626 -1303 -307 464 1066 1028 271 -460 -1309 -1579 -329 1324 1755 892 -747 -2023
181b023O62J696O86p5l76q34l60pk55M29J408O05n38j313j234OJ548J241m7k47
201I72r23r65q5K76P45J245M19j169j368o39L21J485J021l79o74m15n04k46K85
220e98L86R34Q52p31j691q93L05J441J579r7j344q65k84L5P10O62L27L07n17j328
240h10o20N24R80J161J63j120q86j25j35M31R46N64O9n49j373r31Q80J308R12
259A389Q5j280j206N2M35L46O74M24k34l60r36q95O19J183Q68M4r37j300k30N44
279g15N95O48N28k96q70o82n76N20J464P43l54r45j078k03Q89N89K71K38Jp08
299E9o62m60J77J311J095l10j009j131m54Q40J115L55j04k80q18n70k7L42R51
318D20Q82l09j103p54k56N20J069M21k58k80n95p64k4N19R11Q58k07j333r09K
$$ plain form
181 -2023 -1361 335 1021 946 570 -264 -624 -631 -886 -457 951 1556 1018 -295 -1529 -1523 25 1266 1219 972
201 972 49 -916 -1001 -725 20 1265 1684 515 -853 -1492 -1171 314 1335 956 282 -133 -637 -883 -598
220 -598 -212 722 1574 843 -848 -1741 -1436 5 1584 1487 143 -722 -1006 -971 -261 401 728 1035 518 -810
240 -810 -1430 -906 74 1235 1398 278 -608 -733 -868 -437 509 1073 1142 593 -780 -1711 -831 477 1389
259 1389 1474 194 -1012 -960 -525 -179 495 919 685 325 -611 -1506 -887 296 1164 1208 271 -1029 -1259 -715
279 -715 -120 528 1056 760 -110 -792 -1368 -848 616 1359 1005 60 -1018 -1221 -332 257 528 766 767 59
299 59 -603 -1063 -886 425 1520 1210 201 -930 -1384 -544 571 926 822 542 -276 -846 -873 -531 420
318 420 1302 993 -110 -864 -1120 -600 469 890 632 352 -243 -1007 -1031 -512 399 1257 1050 -283 -1192 -1190
338a190O70J058N46m41n49m16n22mP57O01N59j03j023r98O0O80Q35O25l11p95
358C9m22l95q2P70Q59L50k92j003j023J64R25P75L93m11q30m42J7l2M29Q27L56
379I72l05p76j071n6R78R49K59k38r40o82Q9L19N21P73J47n42p40o19k7Q88Q80
400G79J64l23p10o83j5M87M03O79K48n90q44m59l3P97J016J42n76p59n58m3P04
421a74O29K23J66n43q85l76K33N63R18K65p19o68m76q2O53P28J50R5l63r20n10
442a093L81P17P92K84p65q39l05J32O72O43Q2j91k97o87m34K94P83O01L10n46
462E34j043m97M41N56O54K14l85n52m36m11L46Q73M70ll84r77l94M53N28N47K57
483G91l12p64l64k05K64Q70N58r5n42p87m48M52P54M39J69l71o67m27K7K58P29
$$ plain form
338 -1190 -520 538 1084 643 94 -322 -844 -848 -91 510 1069 966 -57 -1055 -995 -315 520 1145 834 39
358 39 -383 -778 -860 -90 769 1119 827 -176 -1199 -1035 -110 665 1058 647 -183 -625 -608 -640 -211 616 972
379 972 667 -109 -1180 -1236 -258 691 950 712 -228 -910 -821 -502 19 792 939 397 -343 -962 -989 -101 779
400 779 943 620 -90 -773 -788 -301 102 781 1029 439 -405 -864 -897 -100 916 1058 482 -277 -835 -878 -174
421 -174 455 678 844 301 -584 -960 -727 -164 754 1019 300 -368 -844 -926 -273 455 605 700 337 -583 -1093
442 -1093 -712 5 797 1081 316 -523 -828 -696 -24 619 701 510 213 -474 -908 -614 169 770 1080 534
462 534 -509 -1006 -565 -9 645 859 474 -78 -514 -925 -579 294 764 761 377 -600 -994 -541 -13 534 791
483 791 479 -285 -649 -854 -590 280 838 743 201 -586 -1034 -582 172 611 780 409 -258 -685 -658 -400 329
504C29O30k28n85o77k91K68P93M69k6k63o48n19J61L21O32O06k03q00n98k60L42
525e47Q68N14k06m15n62m55K57M31M58L97j34o72o54r9K74P46O48k19n43n01l93
546h07J40P01M49K07j38o21o51jL87N58O32j29o74n17k11P9N88O87L6k15n47p01
568g48j1N60N36M27l5p00n97p0K10N13N85J0l56n37n42m7O67N98J89q4n54o82
590f68p7L52M37O01O6m82n42l59r7O05O94J72j85n67n87j05M59N44L30J31n00
611B22n88j95n3N16P09K13l71m68n70j84M90O37K54k9m55o17k46L12L77N49K88
632G91m39o19l39j51M62P05J78j13l30o33k28K79M89M54K29l97o58l40M7L54O66
653D07L67l14m08n25l25L83O12L64Q9k93p25l50K96L47M88M17m22n17l17k16K42
$$ plain form
504 329 959 731 146 -531 -822 -554 239 708 682 419 -229 -748 -587 -266 366 972 769 -31 -629 -889 -547
525 -547 321 835 629 214 -348 -803 -546 -115 343 740 606 -66 -720 -819 -545 201 849 630 87 -414 -807
546 -807 -667 34 483 690 552 -69 -720 -721 -334 224 856 727 53 -464 -675 -596 -8 679 715 500 -47 -748
568 -748 -759 -199 337 764 729 29 -568 -638 -428 85 670 680 324 -213 -755 -802 -135 463 652 568 14 -668
590 -668 -745 -393 44 645 711 229 -313 -672 -769 -164 530 702 517 -50 -637 -742 -283 261 591 722 222
611 222 -366 -561 -614 -98 611 824 453 -15 -585 -769 -279 358 612 583 128 -489 -735 -423 -46 503 791
632 791 352 -267 -606 -757 -295 410 588 475 145 -488 -716 -437 52 506 735 338 -320 -660 -613 -259 407
653 407 774 460 52 -473 -798 -415 197 561 650 357 -368 -718 -422 -75 413 830 408 -109 -426 -642 -400
674d00O64L16N3l31o66l70K39M82M22L18k87o38l07m9K33N34M41j31l54n43l74
695g48K37N36M77J35j92o64m94J69L34N06L93j90n07l81k77J93O09L82J33k78
715C73m65n54J02M80L87K70p1n29m23j02J81N14N12r6l54m16m16m9N89M21K16
736E70o2o13m77k2K64N38M79j18n50l38k73mO01L65J38q2m98m69q2L78L91M53
758E89k1n24m56j85O8N38N60l1k74l42m80J9M50L49L01o5l24n71j62J99L93N84
780F15J3l90m25k82j04M55N24J27j09l25n71j05K14M28M76P3m05n11k34J5L13
801b08O04R4j79k70m68j85L88L61K78J96m23m88k51N6M12N43J37k34m36l71j53
822e97L86M56K94l9k13n84k41K07L06M23K35k63m77l77l5K53N78K46j36l36m56
$$ plain form
674 -400 264 580 633 302 -364 -734 -495 -13 409 727 440 -198 -505 -554 -321 213 654 523 169 -374 -748
695 -748 -511 25 502 637 445 -219 -713 -544 -210 296 689 499 -8 -389 -666 -473 136 518 651 373
715 373 -92 -646 -544 -64 323 593 522 -7 -430 -532 -351 163 675 579 225 -191 -607 -656 -67 354 570
736 570 508 -105 -582 -604 -340 198 677 559 9 -329 -602 -606 -5 360 498 416 -82 -551 -633 -255 136 589
758 589 568 44 -412 -597 -529 9 569 538 264 -78 -558 -539 -89 260 561 496 172 -399 -561 -362 31 615
780 615 628 238 -187 -469 -573 -118 406 533 424 99 -472 -577 -363 65 541 614 209 -302 -536 -521 -208
801 -208 396 490 311 41 -427 -612 -224 137 415 611 188 -300 -551 -495 -83 460 597 363 -73 -444 -597
822 -597 -211 245 539 500 287 -297 -538 -331 -25 398 633 370 -107 -484 -519 -266 312 558 422 86 -370
843c70j71J54M69K60K39k81n74l12J07K68M75L17k04m05l35k66K97M97K53O3j68
864C13n67k84J69K31M52K72j66m28l35k01K15N77L30j41j99m32l31J73L86K78
884C12K21j42n28k08j23K11M04L75o7m36k48l43J52M64L07J61j60n82k72K2K60
905b20L70L42r3l89l10k11R0M07M41J6j73m21l50N3L53L11K26m6l53l47o6R1K76
928cM48P8k96l61l18k2M50L35J01K3l98m40m7J96L61L49K7l73l27k39MM04L67
951C19Q2r7l30n14k0L56K75L28O5l13m75j05M3L16M28J15k24k93m03r8M27L68
973B50J14N2k28n74o8J76K81L71J41l39k54k54p1K01N18J26o1k53m62k02K47L26
995C7K52J59l03l86j95L3K47M42Q8j41k53k61k24K01L92K33Q3k26m33j87J30K68
$$ plain form
843 -370 -541 -387 82 342 581 300 -274 -586 -479 -211 264 581 377 -28 -363 -629 -332 165 418 481 313
864 313 -254 -538 -369 -138 314 586 420 -8 -343 -544 -329 248 578 437 238 -194 -525 -352 34 312
884 312 533 391 -137 -345 -468 -257 147 522 455 19 -229 -572 -420 44 351 512 352 -230 -502 -480 -220
905 -220 150 492 399 10 -300 -511 -421 -14 427 443 270 -151 -501 -448 -95 216 442 396 43 -304 -370 -279 -3
928 -3 445 523 227 -134 -452 -474 -24 311 412 435 37 -403 -450 -254 107 456 483 110 -217 -456 -452 -48 319
951 319 401 304 -26 -540 -560 -204 71 399 464 151 -324 -429 -386 -70 358 473 249 -44 -447 -545 -118 250
973 250 364 416 188 -386 -454 -278 3 374 515 176 -78 -332 -403 -202 316 442 381 128 -334 -536 -289 37
995 37 289 448 145 -241 -436 -403 -156 286 374 233 -20 -281 -505 -304 88 321 404 178 -255 -442 -312 -44
1017d4L12K08k30k73k77j76K72L48K68m3j67l95k44J21K85K81J84j50l31k90m1
1038c82K48L48K65j50k23l48k28K35K66K24J30r7m62k33nJ79M04K70j17l86j84
1059b46j44J33L62K16K9j32l28l08M2K85K67L13j45l68k66n4J09L93K59j11k00
1080A06k09k81P0L53K05J65r2l42k47p5J68L19K51k1k68k83j92M2L88K38O4k5
1102C34m12l16K4K27K08K87m3l31k55j24J53K45K70Q0j54k59l35JL04K78K08k1
1124C69l14l20mK6K46L45O1k12l01k29K9K55L34M4o1k57k82n0J40K55K82J6l04
1147F8k15j87rL17K90M8j68j71l36j2K29K34J90N2k79k86o3M3J76L52J12k74k00
1170h9j85j00K18L10J42Lj53l72j03J60J87K36J23k08k56j57o3K00L08R3l3k25
$$ plain form
1017 -44 268 476 246 -27 -304 -480 -208 140 408 365 198 -197 -441 -320 -35 246 430 280 -51 -341 -382
1038 -382 -134 214 479 329 106 -242 -470 -235 31 255 385 288 -174 -407 -412 -233 171 441 324 -62 -246
1059 -246 -390 -257 105 321 350 218 -110 -418 -376 -91 176 489 344 -24 -290 -344 -235 158 417 306 106
1080 106 -103 -384 -314 39 244 409 317 -25 -272 -347 -179 140 391 370 102 -181 -373 -331 57 295 359 334
1102 334 -78 -394 -370 -143 65 352 309 -22 -277 -401 -248 -3 267 347 193 -66 -401 -400 -96 182 390 369
1124 369 55 -265 -269 -243 3 348 409 197 -104 -333 -304 -49 285 329 268 11 -271 -321 -181 74 356 372 68
1147 68 -147 -334 -343 -26 264 312 144 -27 -363 -375 -146 88 278 330 51 -235 -298 -255 -79 273 385 111 -89
1170 -89 -274 -374 -156 154 296 299 146 -226 -329 -169 18 254 377 169 -87 -244 -307 -107 201 294 261 36
1192C6k48j22J85J83K69O6j88m02q5R0O2K46J96p3k42k25j48J76K91K54k1j96
1214A04l47l3O4J57K47J22j12k64j55j26J64K83K41o6j49l58j11J14K17J95J53
1235C40j05l32q2o7J54K90J46j27r9k75k03J51K76J54P8o7l75j28J9J97J96J79
1257C20j24k32j41j01M7K65K59n7r0k50j87J2J68K22J66m1k79k08j0J43J32K27
1279B41m7j29j93j32N0J83K07M9m5j43k31l8J00K17K06n1l06p8j19L6K20K27j3
1302B11m5k09j78r6J92K24K02j3k82k00q3Q4K25J83j4j07j48k62M9J94K37P0j0
1325B24k35j99l4N9K16J89L6j76j94j46L4K19J33R6q8r7k60NQ2J48J89L3j19k77
1349a62m0kJ23L40M1j61j80j66j02K58J30O6J19k05j91j38J30Q5K24Q4q6k64j33
$$ plain form
1192 36 -212 -334 -149 34 303 369 181 -221 -306 -216 -154 92 288 215 -27 -252 -400 -224 67 321 300 104
1214 104 -243 -276 -212 -55 192 314 202 -62 -217 -343 -179 104 345 279 130 -228 -339 -225 -8 187 340
1235 340 235 -97 -179 -246 -92 198 344 217 118 -157 -360 -209 67 221 299 232 -143 -271 -252 -55 141 320
1257 320 196 -36 -177 -278 -231 34 293 236 146 -104 -291 -279 -111 111 277 236 -43 -251 -261 -118 14 241
1279 241 194 65 -128 -260 -210 -27 180 229 184 41 -190 -228 -128 89 295 244 -62 -140 -259 -223 -3 224 211
1302 211 166 -43 -221 -317 -125 99 301 288 6 -194 -277 -193 32 215 201 94 -54 -316 -267 -73 164 234 224
1325 224 -11 -210 -244 -185 31 220 256 80 -114 -260 -226 -7 126 222 134 37 -223 -218 -136 12 201 234 115 -162
1349 -162 -202 -204 -81 259 300 139 -41 -207 -309 -51 79 145 264 59 -132 -270 -140 -55 169 253 167 -97 -230
1372b30K6J27J83Q6l2j55k13j00J95J09J86M9j43j71j18j8J54K72O7m0k29j40
1394a35r7J44J90Q0N6j15k31j14Q4O8J74J46q0j63j14j57J65J69J35k3q9j32j36
1417a75K3J52J21Q3o1j93j31j1Q1K41P0o3j23j24j32K6K59R0L2J5k61j24k9J61
1441g3K05O3pj55j74j29J44J78J53K4j10j55j39K0J34J18J48j26m7j92l6L5J29
1464HJ90kq9j70j46K3K18J24ql5j66j37qP0J73J35K8j65j40j24J09O3J86R0j19
1489A08j50j73L9P7J42J46j4j75j19KqJ53J34L0q9j36j89M6J95RJ92n7j72j05
1513a14k3rJ73J78lj78j12j24rJ95J60k8Oj55j60N9k4J57J66k1j40n9r3k8J51
1538c5Q3R5K3j60j60m0J70N0O3N8q0j57r4R0R0J51J3r2o7j31l7Q1J80O2J5r3j94
$$ plain form
1372 -230 -204 -77 106 192 160 5 -208 -308 -113 -4 182 231 88 -83 -201 -219 -65 207 274 234 5 -135
1394 -135 -232 -88 102 182 238 123 -108 -222 -138 -70 104 250 170 7 -107 -264 -99 70 205 182 93 -39 -175
1417 -175 -152 0 121 204 143 -50 -181 -192 -111 130 200 137 14 -110 -242 -216 43 133 165 180 -81 -205 -234 -73
1441 -73 132 195 188 33 -141 -270 -126 52 205 229 119 -36 -175 -155 -21 97 245 119 72 -120 -156 -121 8
1464 8 198 196 107 -63 -209 -186 32 156 148 113 -53 -190 -198 -128 45 180 208 43 -97 -221 -112 -49 137 227 108
1489 108 -42 -215 -176 -99 43 189 175 0 -119 -117 -125 28 162 192 103 -33 -222 -176 19 28 220 163 -9 -114
1513 -114 -137 -146 27 205 202 24 -88 -212 -221 -26 134 106 112 -43 -203 -144 -168 -11 155 134 -6 -65 -158 -186 -35
1538 -35 48 143 166 6 -154 -194 -24 26 89 147 67 -90 -184 -94 -4 147 160 68 1 -130 -167 -86 94 156 171 78 -116
1565a16p5O6J77Q7K0j10r9n1j6M6J56Q3p7l3j59o6N3J17R8J9o0j63kp2Q5J59O2
1592A29l9n4j37jN8J27M8P5j06j73n6N3Q0J15Q3j07j11r4nL7J20J31l3k5j61j53
1618a99J23N9J01Q1l6j60j11N9J6J32L5O1j49j54j0J3J54M7J00r8j05j30N1O2
1642e8J43O2nj28r3k3L7Q4J11k3m8j09j1pN7P5O6Qj14j36rQ3J03J02or6j24l5
1670i4j0O1Q5P5k3j04j08Lj0J32R4l3p7p6j2J1J08M9N1m2q4j45P3O6N1P3o2K7
1698G9j62j7LJ10O2L9m7n5k1m3j5Q4J10J9j42o5mOR2M1L5m5j19n6NN4J08L5K5
1727A16r1j49j9O9J18J7M0o7j41Q1k3J2J08L7l5r6n3J5P1N8L1j7j9p9p1NJ0J65
1755I3R0r4q3r4l9P5J35m1N8m2j44PJ5R1L6M8n9j38J5k4J15L8N6q0J1q4p9L9P0
$$ plain form
1565 -116 -191 -125 52 139 159 49 -50 -101 -117 -71 85 168 91 58 -101 -167 -114 3 101 120 60 -103 -105 -177 -92 67 129
1592 129 90 36 -101 -102 -44 83 131 206 100 -73 -129 -76 4 119 202 95 -16 -110 -115 -78 42 173 140 115 -46 -199
1618 -199 -76 -17 84 165 129 -31 -142 -83 -67 65 100 161 12 -142 -152 -139 15 62 162 64 -41 -171 -120 -58
1642 -58 85 147 142 14 -79 -102 -65 19 130 107 59 -50 -61 -68 -11 64 130 138 24 -112 -121 -38 65 167 161 65 -59 -94
1670 -94 -104 -43 42 117 94 -10 -118 -115 -125 7 101 68 -9 -85 -97 -86 22 71 122 80 -4 -149 -76 -10 41 114 52 79
1698 79 -83 -100 -97 13 75 114 67 12 -9 -52 -67 17 127 146 4 -61 -65 -59 33 74 109 64 -55 -111 -106 -52 56 91 116
1727 116 25 -124 -143 -74 44 61 101 34 -107 -26 -49 -37 71 108 73 -23 -76 -61 10 68 99 82 63 -16 -87 -82 -72 93
1755 93 183 89 6 -88 -127 -52 83 42 100 58 -86 -79 -64 27 63 111 52 -86 -71 -95 20 58 114 34 45 -39 -118 -79 -9
1784iN0Q9q3j04j1M3kM9O0m3rq5j7J7J49p4P6n2j33L0nP4P1P5q3j23l5L4P6j0
1814A5M3k7no7l4J8O5O5J4l4o6n5r3J03J07J7J5j06q9K5M5M6O0m4L4r4l7O8J6
1843EJ8O7lq1m7m0L9K4R6l1k3n1j4L9p7J42j2rm1k9k0M0j8J54o8k3m8o3j3P9K2
1874A4N3p6m6j9qQ6j4P4m7j5n8Mj6N6P8J4j5k2q4l5M9K1L6jJ5j15NM7P6k1L0j4
1906E2j00l7j5J15J4J8n1O4j48M8J3K1Q4Jp3q8Q6K0r6N8P6p3j2Nj00O3M7L7Rm0
1936bJn2J9M5P0mm9Jm8JJ5N6L4q7M0j13J5M2M1K7mj7kj19K2J4J31o1R7j22n4M7
1968a6l4R7L4m7m0L8r7N7m8Q3Q0Kj18jk5J4M7J1j0l2M9q9P6k1M9J1o0nm5N0J2
1999B2J2j7qk0Lo3J1N4Q7m1L2q6l4J8M9K3J9n2m5J5l1RQJ0O6p3K5mL8LmRj9k8
$$ plain form
1784 -9 41 130 47 -57 -68 -25 -27 22 82 39 30 -55 -72 -55 94 20 96 44 -89 -59 -64 10 81 156 73 -50 -85 -51 25 15
1814 15 58 31 26 -41 -75 -57 8 73 87 53 -13 -68 -161 -58 49 66 81 -25 -114 -89 -44 2 62 18 52 -42 -79 -11 5
1843 5 23 90 87 6 -41 -81 -42 -18 78 47 24 -27 -41 -2 -79 63 51 42 1 -28 -48 -8 -26 128 60 37 -11 -74 -87 -8 14
1874 14 67 -9 -55 -74 -82 4 -10 64 17 2 -56 -52 -68 -12 66 80 65 43 -41 -76 -27 -6 30 29 44 -71 -66 -19 57 36 66 52
1906 52 -48 -85 -100 15 29 47 -4 60 -88 -40 -27 -6 78 79 6 -82 4 24 -72 -14 62 -11 -23 -18 -118 -55 -8 29 38 -2
1936 -2 -1 -53 -34 11 81 77 28 29 -19 -18 -3 53 87 0 40 -73 -58 -16 25 52 48 31 29 -90 -68 -54 77 16 113 -9 -63 -16
1968 -16 -50 47 81 34 -6 32 -65 -8 -56 27 107 109 -9 -10 -35 -21 26 37 27 -5 44 -45 31 10 59 70 10 5 -40 10 22
1999 22 34 17 9 -11 -8 -71 -60 -6 81 40 72 -14 -48 -30 19 42 61 9 -36 -21 -52 -43 -35 -25 41 -32 -7 -11 27 30 26 35 16 -12
2033a2L0Pr0R3RK0J9r0J7n8MQ7m6M2l4ok9M1JK8j2j1k8K5j3jN5nm3jq6K5L2L6
2067FnJ0j5j0k8J4O8k0L8K3j06MK2j5J9K3M0o3ln3K8J9N9l9K9o5J5K8j14J52K7
2098H8m6p3j7j2J5M6J8N1q1k3P6o6M7K6K3m6J1K2j12NL7J4J8K0p2L8k2j1R5k7
2128D2l4j0no9P0l3O9k3m2NM5l3j6P3m0OJ8K2p4JM3N8m0j6p8J8N1k3Q9p2M4j29
2160h3J3K5j6R2J9l2m2N4o8RL2N4o5Pm7P9q3K7J22j06N4m7j3k0J9O9j2j3qM2j7
2191D5n5L5J3k7M9j23L9K9l5L7Pk0k3K8JnK3K7m4NRn1L5Rk0O2m7M0Qq6K5N9n1
2224bL9l2N7n5n3P3LJ1k7M2l6mK1K8j7k1%l2J4k7k0P2N2j44L0o6R0M4k1j9NpK9
2257B7p1K9K1k2L7n2J0k1K9P0O0r3n6O4j1pl3O5m8M2q6j9M2L1RK4m2K9j6o3J1
$$ plain form
2033 -12 18 25 -65 28 37 57 76 -14 3 -55 -51 36 -10 32 -2 -8 -37 4 5 33 21 10 -18 7 -6 -7 48 43 0 -1 -87 -62 -30 6
2067 6 1 11 -4 -14 -42 -28 40 20 58 81 -25 -21 1 -14 5 28 68 5 2 -51 -23 -4 55 16 45 -20 -5 23 -91 61 88
2098 88 42 -31 -48 -60 -45 1 19 70 -11 -34 42 -24 23 49 72 26 37 59 -53 -48 -11 3 21 41 -31 7 -15 -26 69 42
2128 42 8 -2 -7 -76 -6 -39 30 7 -35 -30 15 -18 -34 39 -1 5 23 45 -29 -28 15 73 33 17 -61 -43 8 -15 74 2 46 -83
2160 -83 -70 -45 -61 31 50 18 -24 30 -38 -29 3 57 -8 -1 -48 31 -52 -25 97 -9 45 -2 -15 -35 -16 53 41 28 20 62 45
2191 45 -10 25 38 11 60 -63 -24 5 -30 7 14 -6 -29 -1 0 -5 18 45 1 6 15 -36 -1 8 -12 50 3 43 51 -35 -10 49 -2
2224 -2 37 5 62 7 -46 27 30 41 14 56 20 16 37 65 48 27 27 -5 9 -18 -38 34 86 -58 -28 -94 -4 40 19 0 5 -2 27
2257 27 -44 -15 6 -16 21 -31 -21 -42 -13 57 117 24 -32 32 21 14 -19 46 -2 40 -46 -65 -23 8 17 41 -1 28 12 -51 -40
2288d0K7nM6J4m1n4K6Q8k0l9l1M0p6K1kM4j9j2O7r4J01r6L0rL6nk1j1K0L4M8r7
2320c0N2n2P5o0pL2J8l3p8P5m2Q3k2k0K6oj5rq4J64r1K1K0J3j01J8O7l6K6M6o1
2351a1M3j7Mj6k4PL0M5j38O0M6pKL1l9m8O1q0M8J1J6J9l7j4N4m0J0j7O0ll3k8
2383em0kO1l9K3L5j13JJ5J00l2Qk4n4NL7j8K3j1L5o2O6k7M3j4J2k6K7ll9L0K7
2415C9J7o3M4j7k9L0j6j8L5PrM0m9K4J1o1N9o8K0K9k8k2N3o1L9MOj4k2K0k5O2
2447C7l2p0N9K1n2K6M7q2K5j5P9m0lk7O4Pj9l7J1J6j7N3m7k7K9MrO5m3l4MnQK9
2481B5N6m4q1L8J2j0k2j6Q0j3m1J7J3Lk0J6j8m8P4m5k5RJ1M2Kl4M0l6N8o0K1n
2513ak2R4p0o9P3J1Jn9K7jJ7LJ4o1N4L5n0j2K3M8q4O9j3l6k9J9j9M9J6k8j0j9
$$ plain form
2288 -40 -13 -18 28 42 1 -53 -27 61 41 2 -29 11 -65 -44 -46 -2 -21 -33 34 -60 41 -55 -25 -34 2 -3 -24 -35 -15 19 67 -30
2320 -30 22 -30 45 -15 -22 10 28 -5 -83 -8 -50 33 11 -9 17 11 -4 -13 -97 67 -24 -3 17 30 -71 -53 14 -22 4 50 -11
2351 -11 32 15 19 3 -21 -14 16 61 -77 -17 29 22 24 55 16 -32 29 -51 -3 8 24 43 6 -8 46 6 16 -1 59 56 23 -5
2383 -5 -45 -47 14 -25 -2 33 -80 -79 -64 36 4 12 -12 -66 -61 -24 -42 -19 -30 5 -57 9 -18 25 11 23 -3 24 21 -18 12 39
2415 39 56 -7 37 20 -9 21 5 -13 22 29 20 60 11 35 46 -15 44 -24 -4 25 -3 -25 28 -33 6 10 16 2 -20 0 -25 37
2447 37 5 -65 -6 15 -37 -11 36 -46 -21 -36 43 3 0 -27 37 44 25 -12 -1 15 -2 51 4 -23 6 10 1 66 23 -11 -7 -12 -4 25
2481 25 81 37 -44 -6 6 -4 -26 -42 38 25 -16 1 14 17 -3 13 -5 -53 21 -24 -49 -40 -29 13 15 -19 21 -15 43 -17 4 -1
2513 -1 -23 71 1 -68 5 16 17 -42 -15 -16 1 4 18 -43 11 46 -4 -16 7 55 -29 40 27 -9 -38 -19 -38 11 27 -1 -11 -30
2545c0mj1N9K5Jl0m1P2o8KP3l2k6K3k3MoL0n1J07l7j9o9P6K8n7K7KKj0l2n1K9
2578c7O2N4o1j4j4oj3N0k7N8j23M9l0N1N3k8k0j2L7n1l8K1K5O4j6l0k9qL1L1o
2609B3k7j1K8%l1N0j2n8J45j23K7j1mK0j1J7Prk6k1N3r2O7k9N1k3k5L1jM4p7N9
2641C1k9Ql5M0L9m9l1N3k8l7lO1l9J3Kj3%K8k9J7L5Po7K1nM0n2J2JLm0M0J7k1
2675a0J2jm1N0j15N8N0n2N1o5N9jJ3l6M6n1k1O4m5J2M8rl5O0jn7qnK1j8M3omJ
2709Gk7K6J0k0nK8k3o8J5J11n0P6j02k3M3j0K6orl0K7l8O0p4P9j2LNk0nOko5N7
2743a0OL6m9M0K0j1n6L1j3j7N9j9p3P5k4LKKj7K4k9Q2j0l8k1l7O2J6m2K4L4k2
2775B8n4QL1Ok9J6n6M8j2l6J9oO6l5Kn0Q1k6j2L4l4L2j8lj4j3L5l6L0L3n0nnQ5
$$ plain form
2545 -30 -34 -45 14 39 40 10 -31 41 -27 -25 48 16 -10 13 -10 -6 -12 18 -33 74 37 18 -51 25 53 -4 23 25 27 17 -15 -66 -37
2578 -37 25 79 18 4 -10 -16 -29 21 -6 52 -71 -22 -52 -1 52 24 4 -8 29 -22 -60 -39 -14 50 34 4 -25 -33 -2 29 23
2609 23 -4 -15 13 13 -18 32 20 -38 107 -16 11 0 -4 16 5 22 29 20 -6 -27 26 -66 1 -28 23 0 -25 6 5 49 -28 31
2641 31 2 10 -25 15 54 5 -26 27 -1 -38 -41 20 -19 -6 -4 -17 -17 11 -18 -1 34 41 -26 -5 -10 30 -22 -10 -9 -6 -46 -6 11 -10
2675 -10 2 1 -40 10 -105 -47 3 -49 2 -63 -4 -5 8 -28 18 -33 -54 10 -35 -23 25 16 -19 41 40 -17 -25 -30 -9 -27 16 10 6 7
2709 7 -20 6 16 -4 -9 19 -4 -72 -57 54 4 80 -22 -45 -2 -12 14 8 -1 -31 -4 -42 18 -56 23 11 14 19 -1 -6 0 -2 -67 -10
2743 -10 -4 32 -17 23 43 32 -24 7 -6 -23 36 17 -56 19 -5 -2 0 2 -15 9 -20 62 52 14 -7 -44 18 34 -8 16 50 28
2775 28 -26 -18 13 19 -10 6 -50 -2 -14 -50 -31 -37 29 -6 -4 -54 27 1 -11 23 -11 21 3 0 -14 -27 8 -28 2 35 -15 -20 -25 60
2809F0m7n2R0m0j3QJ3k2l2J6rK1m1O2k8Q2m7o2l3N7Q1q8N3n7PRL3l9P9n9M2m6
2841bl4M6k7jM5k6J4k9lN1m6M7l3M1j5m3J5K4m1M0Ok1%j6Nj7M4k7j1N1J8p0L3
2874A8p4J8K9j1M3kl5N4o8M0m0J2n6L6L5PK5q1N6m3M1K1k2m3K8L0k2jnj2K0L6
2906C4l1L2K5l6l5Rm3Q8or6K6P2q8J7l8QP2M6kr5J5J6J9K2J1l2o7O5J2l6J4J2
2938A0M7o9K4rlL9k9K5k8M7n2j5N0l5K8l1o1M6N6l2RJ5jpl8J8JN4o9M7l1k0k1
2971c5L2k6J2KmM0l2k1K8M4p4k4M5j8L6n4M6J8l3L3j9JLl9N3j6M8p2M0L6k1k5
3003DK7n6K5%J2j2J9j2j4J1n5K7Lj4LN2K8n3Oj7m4O8LPj8K9k3J8l2M4k9nNl7k8
3038e8R3k2K3k9k7NJ3N4n7rj0J3L9k4J7K0mn3PM7q0M1Mrl0mO5l2p4J15n0Lk4j
$$ plain form
2809 60 13 -39 51 11 -2 6 19 -3 -35 -19 -28 -7 -48 14 -14 68 21 -41 -74 -17 64 -24 29 -28 -21 -12 21 -18 61 2 44 -2
2841 -2 -36 10 -17 -18 27 1 15 -14 -17 34 -12 35 2 43 28 -15 0 24 -17 23 29 8 8 -8 -3 -20 24 -3 -14 37 55 -15 18
2874 18 -56 -38 -9 -20 23 21 -14 40 -28 12 -28 -16 -72 -36 -1 6 31 -50 6 -37 4 25 3 -40 -12 18 -4 -5 -10 -22 -2 34
2906 34 3 35 60 24 -11 -2 -45 43 37 -59 -33 39 -49 -32 -70 -62 10 56 54 -41 -26 -10 9 31 42 10 -57 8 20 -16 -2 10
2938 10 57 -12 12 3 0 39 10 35 7 54 2 -13 37 2 30 -1 -62 -16 40 8 17 32 31 24 -14 4 5 59 -10 37 6 -14 -35
2971 -35 -3 -29 -17 -15 -19 21 -11 -32 -4 40 -34 -58 -13 -31 5 -49 -3 15 -18 15 -4 -3 0 -39 14 -2 46 -26 14 50 29 4
3003 4 31 -25 0 0 12 0 19 7 -7 4 -51 -24 -21 -35 -32 20 48 -5 1 -16 -60 8 11 18 0 29 6 24 -8 36 7 2 7 -30 -58
3038 -58 35 13 36 7 -20 -15 -2 52 -5 -14 -24 -11 28 4 21 41 37 -16 -9 38 -42 -1 3 -6 -36 -40 25 -7 -81 34 -16 -13 -37 -38
3072c8P1Jk0l3j2P2m5j7M7Rq6M9lmM9l4L4o3m2O2J2Rm3M0Kk3K9L0m3Mk4J3NL4
3106D2k9k7nRL2p4J04j18N2O9m4l4KK0KK5m9L6K7j5Lj5K8l9pj2J2QO5p4nK9Pp2
3140d7Q8j8m9N1K0K6j11N5l7NN8pj2k4L3o8O0k3%K6r9K9O4p9R1n4N1j7m4jK2k0
3172c1J10n1J0n5M1k8PJ7j3M0o9K3K8k6K8l8K5rMK4m4M4j9K7k6J1m1KJMjj0Nl8
3206d8M3Ok0J4K7Ol4M5o0JN0n2L7Mk9jK5L5p6P3oN6r3rJ6l6M9oj3J7k0OL4n8N4
3241C7q6L2L1k9J4j1J5L8p6l3J43p0j2J0K7l2%L9OJ4m7%Jk6lj7K4J6n9L6j1J8
3273a1J9L6Pm9oJ8M5l4k8kK7pmJ4n9jk2Q7Oo1P8p0k3J1P0l4m5N8l5m7M4m3R5k4
3307A0pkj6k4rK9L5mm6lQ5l6L5n5K6l1L9M0o7M6k0kk1Nk9M1m7Q2q1K8K3j7K0K0
$$ plain form
3072 -38 33 34 14 -19 -31 41 -4 -21 26 35 -51 -2 -5 -9 40 6 40 -23 -65 -3 9 18 -25 15 17 -6 23 53 10 14 -10 3 8 42
3106 42 13 -14 -19 -10 22 -52 52 -66 -14 55 11 -23 -21 -1 1 26 -23 13 40 25 28 13 41 2 -5 -17 -5 3 68 -6 -11 18 25 -47
3140 -47 41 23 -26 25 45 71 -40 15 -22 -17 41 34 22 -2 31 -37 23 0 0 26 -73 -44 20 -59 32 -22 29 12 -32 -33 -11 -31
3172 -31 79 28 38 -17 24 -4 3 20 7 47 -22 1 29 3 31 -7 18 9 13 37 -7 37 18 45 19 30 -11 -9 -8 -4 -5 -15 -10 -48
3206 -48 -5 1 -19 -5 22 28 -6 39 -21 -20 30 -22 15 19 -10 -11 14 49 -27 46 40 96 3 -6 10 -26 23 17 4 21 1 7 41 -17 37
3241 37 -49 -17 14 -15 -1 -12 3 41 -35 -68 75 5 -7 3 30 -2 -2 37 43 57 10 10 11 -15 -18 -35 -11 5 -54 -18 -29 -11
3273 -11 8 44 51 2 -4 14 59 25 -3 -5 22 15 11 25 -34 -35 -57 30 36 -25 53 -17 -40 -29 41 7 -38 20 -15 -62 -18 -61 34 10
3307 10 3 1 -15 -39 -48 -19 16 12 -34 -37 48 12 47 -8 18 -13 26 66 -1 45 25 23 2 7 -22 19 -28 54 -27 1 24 7 27 47
3341D7j8j6j12Q6mk9M7K6l8npj0J4p9P0N1o9Q6n2L8k4j6J5J4l4K6j3k5K2l1QM
3373b8J7m3N4Nl9Q0rm6J6j0j2ML7n5O3j2Oj1K5n6L0K1l7N7p6k4J1J9L0j5K5m5
3405a8L1l6L6j1j7M0k7Mk5RlM5n7K9Pm3J9nJ9Lm9R2k2rj1j5K2J6j8L0j4n8L0M2
3439C6J6o8jJ8k1L3l9J8KpL7K5n6l%Ql2j1R1q4J2N0k1j4K2L1q2O2rK6qm3K0M0
3473D8q9O6J0lRl3j1J7j4M8m5J3Jo1nN5J7kj7k9lM4J0qo9O6N2n0m7K2j4mM1j4
3507Ak2j5l1O2L4k9M2k8J6k6J0Lk8K3J7L0p4K3j9K4Kl1K1RJ1m9L0n1N8L9l5j4
3539Cok5L5j4Pj6k1L2N0q3pO3o8K5K1j7M8j4k4Kk6O7n6J3K0k8Q5o2k1j1K5jL7
3572C3oJ5m2Ko6jR4J0nn4%%K1L5n8P0o6K6n0j2O6J0J1o7N7K3n3pJ8J6j2j8J7j0
$$ plain form
3341 47 29 13 -99 -13 -17 -46 1 27 -11 -16 -23 -33 -19 -98 -28 23 -46 40 -12 26 2 -14 1 15 -19 7 -6 -31 -9 -40 -32 -28
3373 -28 -11 -54 0 5 -34 46 37 -9 7 -3 -15 -11 26 -29 34 22 28 17 42 -14 16 37 0 57 -19 -43 -32 -13 17 2 27 -18
3405 -18 13 -23 13 2 -15 25 -2 2 -23 -14 -17 28 -29 0 7 -36 -17 -22 -3 0 -49 43 21 12 1 -14 8 24 6 36 22 -36 -6 36
3439 36 52 -16 -17 1 -20 13 -26 -8 -6 -13 24 49 -7 -10 -10 -2 -34 -45 46 -38 -26 24 3 -11 11 42 -40 22 13 39 31 -12 8 48
3473 48 -41 25 35 32 41 8 -3 14 0 48 3 16 17 -44 -49 6 23 21 4 -25 -28 16 26 18 -51 15 67 17 -30 -8 -22 -26 15 1
3507 1 -21 -36 -67 -5 29 0 42 14 30 4 14 17 -11 12 29 59 -15 8 -11 13 15 -16 5 14 25 -24 6 -45 13 52 17 3
3539 3 -3 -28 7 -7 0 -16 -37 -5 45 -38 -45 18 -50 -25 -4 -21 27 13 -11 -9 -35 32 -24 -11 9 -19 66 4 -17 -28 -3 -4 33
3572 33 27 42 0 2 -64 -65 29 39 34 -20 -20 -20 1 36 -22 48 -18 8 -42 -54 12 22 33 -34 23 46 -7 -14 4 20 8 -10 7 -3
3606cL5n0J8k1K5j4lk4L8l5Q5o5J5mjk8K8K8m9J3PoK7ml8QO1n8L0m5M3j4j4J3
3640bk4N3l3Lm8L4K6K7q3%P9l6JNm8P2Rm4mlJ1J5k9k4P2pl2l1M8j4J2k2Rk1O1
3675C2l5J7l7J05o0L8q6L6K2oJ2k6m3l9Q2jm4J8j8O8m8J3K9l6n1Q9LKo8O3o7M0
3707Dk0N9l7p9J01l9J2%L0l4jrk1K5M7m1N2o2L6ml3m8M7oP4o0OJ8j0kk3k4O4l0
3741honLjO0n8On6P2Oj7rok8j8M0O3m3j2N6n8O6p1O5m5N7l1k6P9n0n0k7P7nl3
3776a3j6j7M4l2P8n2L1k5p2Q7l5j9N2l7J4Kkk7N9J6m4j7O4j1q2P8o4N0jNj0M1
3808D5n6j0N4l7O0m4nk4J7QMJ7o3L7n0N1jj3M0j4n6K2m4J17k9j0o5M3k2P8o6J9
3840CJ0Lon1K1l8L4L5m1L7M8l2k9j1O5m6kJ5Mp7M9M9k5o1P5l7RK6o9M7p3J12j1
$$ plain form
3606 -3 32 -18 0 -21 4 -10 -13 -37 1 -34 51 -14 1 -3 -4 -32 -4 24 -25 -12 -5 -11 16 12 -26 -18 43 -15 15 -30 13 -1 -15 -2
3640 -2 -26 27 -6 -3 -51 -17 9 36 -47 -47 32 -4 -3 2 -46 26 35 -9 -13 -16 -5 10 -19 -43 29 22 -10 -41 7 -7 5 -17 -8 -29 32
3675 32 -3 14 -23 82 22 60 -26 10 32 26 38 12 -31 -70 12 11 -33 -15 -33 35 -13 0 29 -7 -58 31 34 36 -32 31 -36 4
3707 4 -16 43 6 -73 28 -11 1 1 31 -3 -4 -13 -34 -9 38 -3 49 -13 23 19 -14 -62 -15 -21 53 -7 -1 17 7 5 -18 -42 22 -8
3741 -8 -14 -19 -16 -17 43 -15 -9 -65 7 13 -4 -13 -19 -47 -65 -25 38 -5 -17 39 -19 47 -24 41 -4 53 22 -4 75 25 -25 -52 25 20 -13
3776 -13 -29 -46 -2 -34 44 -8 23 -2 -74 13 -22 -41 11 -26 -12 -10 -12 -39 20 36 -8 -25 39 28 -54 24 -40 10 9 14 4 45
3808 45 -11 -21 33 -4 56 12 7 -17 0 8 12 29 -34 3 -47 4 3 -10 30 16 -40 -18 -62 55 26 16 -49 -6 -28 50 -16 3
3840 3 13 16 10 -41 -20 -58 -24 11 -30 7 55 23 -6 -17 48 2 0 15 19 -58 -9 40 15 -46 29 -8 1 27 -42 5 -68 44 33
3873C3k1J7p2L3l8M6J2m0j5J9K2m0K3R2o5nm6M5K5l3jNl0O7l4J1k4J0L7m7j2k5
3905e1Q6m9jQ7m3m5l4JN1j5L9j3L6l4k9nK6M0m1LL2p7k8P4J9k4N0n7l8K1K3k3
3937a9Jj8L9Lk8%N4m3L0k8%L6J2l5j7L7l0j5J7J5j8j0n5J03l1j3l1N0l5O8m2L6
3969C3l4j5MpK1%k7M6q1O3n9M7PO7q0K9n6kK0L2o2O1L5q5K8N1m2lJ14j17M4k5
4001Gj8%M2o2J01l7l6K9rk0j8K5Rj3k4JRJ7K9j9j1l1MO7n1N9k2k0J1k5L0k6MJ9
4035B1O3j16N5n2M5j5j1J3j3K9l6n4N5j7N3kr8J11m6L8l6P6l1lq2J5N8j5L8J9
4065F2Jm2q7N1L3m7L9Kj1qk2Ll1P9n3m4P2l0j8rO9k0K6m1k0L3j7L3J7p5M8K4J4
4098C1k7K7p6P0pn9J01r5M3j2%Mokl8J9KPL4j6k9L4j8j7krN2K8l0J7Rn8k5M6j1
$$ plain form
3873 33 12 29 -43 -10 -48 -2 10 -30 -45 -26 -4 -44 -21 71 6 1 -45 0 25 -8 -9 -4 -34 33 -1 10 -14 -4 33 -14 -26 -51
3905 -51 35 -14 -15 72 29 -16 -50 -49 2 -13 26 13 49 15 -14 -19 7 47 6 9 41 -36 -64 10 29 5 55 -2 -40 -19 4 -19
3937 -19 -18 -36 3 6 -22 -22 32 -11 19 -9 -9 27 39 4 -13 24 -6 -21 -4 11 -7 -17 -72 31 0 -13 -44 6 -29 39 -3 33
3969 33 -1 -16 -12 -19 2 2 -25 21 -60 3 -56 -9 -2 65 -15 14 -42 -44 -24 8 -54 7 42 -43 -15 36 -6 -9 105 -12 32 7
4001 7 -11 -11 31 -31 70 33 -3 26 17 -3 -21 4 13 0 -24 -23 -14 3 32 13 2 -29 -25 42 -9 50 28 8 19 -6 24 -2 2 21
4035 21 84 -32 23 -29 16 1 -10 3 -10 19 -17 -71 -16 -33 20 18 -80 31 -15 23 -13 63 32 29 -53 -38 20 5 43 62
4065 62 63 21 -66 -15 18 -29 10 12 1 -7 -29 -26 -57 22 -31 -75 -3 -33 -51 -60 9 -11 15 -26 -46 -13 -30 3 20 -55 -7 17 31
4098 31 4 31 -45 25 18 -41 60 -35 8 -4 -4 0 -6 -8 -46 -27 -25 -18 16 0 -29 5 -13 -30 -32 -41 11 39 9 26 35 -23 -48 -2 -13
4133a3J3qk7N4NKJ8nn4j9JL2mN8j8l7K4rRLMK1l6LNJ6j5o8Q4J8p0jrL9l3L1KK1
4171C7q2J09j03MR3n3K1J1q0K4K1o1M7K1K6m4k8J1KM8n5L3KJ3L0oj6m3RJ4N5o7
4203gN4k4l8j5L9o5M6N5k1oK8l2j7qrQ3p8K9no2j1M3M8M6p1o5R8pj3k1NL0K5j34
4237h0R4j5k0J0L3k2L0Kj5k0%KK0K8n1J01p1J0j02M0J6J0%J8k8k1J4KK9k5K4l8
4269b5L5Pj3PPj6k6l8N9j5K6Ql9M7Qj3nO8p8N5j16L2J2n8J01l2l7L3LkNk3L3l0
4303b0Q6p8J5K1J5l1J7rm3M9l5J4k5O0p3M6k3j4J1J1j7N1k4m3J5k3O3m0k7J17
4333F6k7Qq8O3J4j0k5l4K3m8J00m4L1k3K6k2MjlL1k4m5P3n7On3O1L1k6j6N3l6
4365Hpm0M0qoP9o8Jk7L2l1L4k1KL5k4j5LJ4k0M5J7k1Qk2m3L4n3J33o1k5jP8q5
$$ plain form
4133 -13 0 -8 -35 19 24 26 44 39 -15 -34 -33 -1 -5 53 35 -2 22 13 22 25 29 50 14 17 22 38 23 -45 39 57 -13 -14 -23 16 -17 14 16 37
4171 37 -45 64 -39 -35 58 5 26 37 -43 -19 2 -59 -12 9 35 -9 -37 -26 -24 24 -31 2 4 17 47 41 25 -18 -9 5 60 -7
4203 -7 47 23 -15 -30 9 -56 -10 45 24 18 46 14 -3 -11 -20 63 -15 14 9 -53 -64 -21 27 73 2 -63 35 28 15 -6 -1 29 54 -80
4237 -80 14 -1 -21 -11 22 0 30 32 17 -3 -3 -1 19 47 -4 97 26 36 -66 -26 -10 0 0 18 -10 -31 -17 -15 14 -11 13 -25
4269 -25 10 17 4 11 18 2 -24 -62 -3 -18 8 16 -23 24 32 19 14 82 4 59 -57 -25 -13 -71 30 -2 -39 -6 -3 -5 0 -23 10 -20
4303 -20 66 -12 3 24 39 8 25 16 -27 22 -13 1 -24 36 -37 9 -14 -28 -17 -6 -23 28 4 -39 -24 -47 16 -24 -51 66
4333 66 39 47 -41 22 36 26 1 -33 -10 -58 42 -2 29 6 32 10 14 13 10 41 17 -28 45 -12 -6 -59 2 33 7 -9 44 8
4365 8 1 -39 1 -7 -13 66 -2 -1 -28 4 -27 7 -14 -12 23 -1 -16 -13 1 -19 26 43 22 30 8 -35 -1 -54 79 18 -7 -8 70 -15
4399a5N7k6l1L6Pj9n2L6M6J0l4k3k2P3Qm8l%p6N7rM0l6J2l8K5l5P4J5kk0K2J1
4432D0J1p1L7M9o8M7RK8q2k6N9o0J6K1K0l8k5L3J7l9m6P9l0M8K6m8M5m7j9l0N4
4463A0K1j8k4j3K1O3j02k6M1k8K5mK4m6N0jL1j9N6j02M4j8OJ6L0np6J0O6%q4Q7
4495C5l5lM4p9N9J6m0j6J1mN3q6Q8j0k8K5o7K4k6j7M7J5n0N0l0l3N2k3M0m0J1
4526a7K6m9P2p6Q1j9m6QO0o1pL3OLl1j7L2N8q9L4l5L7j0J9N1l5%n5L2kok3qL0
4560dj2M2l4M0k8l0K8j9qN2j7J9k3J1q1N8k8O5oJ1J7j06O8l2Rm0N3M4J6l5q4L6
4592a8K4j6j4j9O8l5J6k9L1l8j0M3m0N0l9ol4P2rL3j9Pk1l7M4k6J6j4J7L6K3q3
4624b7J2j4P9l4m2l2O2j1j1O5oJK3n3k9J2n5oM9L6l6J6n1N7Ol5k4O2n7N3J8k0
$$ plain form
4399 -15 42 16 -15 21 28 9 -43 -7 39 49 15 -8 -30 43 51 3 0 0 -76 -19 -28 12 -24 -12 -50 -25 -60 14 29 27 7 29 40
4432 40 51 -20 17 66 -2 45 54 82 0 -26 33 -27 -11 10 30 -8 -33 0 17 -22 -68 11 -19 29 55 7 52 5 -14 -44 10
4463 10 31 13 -11 -24 -3 60 -42 -68 -27 -55 -30 -34 -10 -56 -6 -7 24 5 61 -41 3 -15 -9 7 37 32 -44 -34 32 32 -52 35
4495 35 0 -3 41 -38 21 37 -3 -19 -8 -12 41 -45 43 33 5 30 -37 -13 -39 -56 -9 6 -44 6 -24 -57 -5 -28 12 -28 -17
4526 -17 9 -40 32 -44 37 18 -28 -20 40 -21 -28 5 11 14 -17 -34 -2 56 -33 1 -34 3 -7 12 63 28 28 -27 5 3 -3 -26 -34 -4
4560 -4 -16 26 -8 32 4 -26 2 -17 -25 27 10 29 6 17 -64 -6 -34 31 25 36 53 -53 15 -17 -8 -48 5 49 65 30 -54 -18
4592 -18 6 -10 -24 -43 25 -10 6 -23 8 -30 -40 3 -37 13 -26 -32 -66 6 -3 30 11 18 -3 -40 4 -22 -6 -20 -3 33 56 -27
4624 -27 -15 -29 50 16 -26 -58 4 -7 -18 47 41 42 65 12 -17 -5 -60 -66 -17 19 -17 -1 -52 5 11 -24 -48 14 -43 10 28 8
4656Hr4P6K0k7J9j2K2mo9R1q0N4l3M6l3kL3j0M9j0%n7M3j3m6L8M0q0K6j17O7L8
4688a7OJ1lL3p8J1N5rn3nJ6J4j6N9m6j3L6L0m2jnJ1N7r0M4Kj6l5J5jK8j4O0k4
4722B0l7J4L8j8K6l5L0j7j1pRK6J5o1l3L5K3JJ9J9o0O6j11K3K0nk3J9l0J5O1k9
4754BJ7Lp2K7K8J3J1n8P9p9P3l0j3K1k6L8j0n4qP9m7rl0N4J8k1P%KJM1o2%K4K9
4789D8n8m8R4k8m2l9R8K0k0k6Qj3l0K2J7L1j2q0O1lL8n7M0j8L3l3jLo4J37j02
4820b4K6j1n1O5j3L5l4m9L6J3R3o7om8K5%N0k1Jj2m6pK3OK6j0o1N6L5L6p3j8L2
4853Gj7J5L5j8n1L7%J2m4k8O4j0m8J09o7l7O5nj2lk2J8lj5RK0k0RJj1M9l5oj0
4887a2N3m1j0L7j7p5N8n2MR5l2Rj9Nj7jlJ8k3k9N4k4N8m2L9%Nj5m0k3M2Q0o8J3
$$ plain form
4656 8 -86 -10 10 -17 2 -10 12 8 -61 30 -50 4 -29 17 -16 -18 15 5 54 44 44 -13 30 17 -29 9 49 -31 -5 -122 -55 -17
4688 -17 -11 0 -3 30 -48 -37 18 9 -44 -49 -33 -19 -35 24 -22 -35 1 31 -11 -12 -17 -6 51 -39 5 7 -9 -44 -29 -30 -2 -16 44 20
4722 20 -17 -3 35 17 43 8 38 21 10 3 12 38 53 -8 -41 -6 17 18 37 56 -4 62 -49 -26 -6 -11 -34 -15 -45 -30 31 2
4754 2 19 22 -50 -23 5 18 29 -29 50 -29 44 14 1 22 -4 34 24 -30 -38 41 -6 -15 -45 9 27 6 13 13 15 16 57 -5 -5 19 48
4789 48 -10 -58 36 8 -34 -73 25 45 25 -1 7 -6 -36 -14 3 34 22 -58 3 0 38 -19 21 3 36 3 2 5 -59 78 -24
4820 -24 2 -9 -60 5 -8 27 -7 -56 -20 -7 86 19 13 -35 -10 -10 40 19 20 8 -38 -45 -22 -16 10 0 -61 -5 30 66 -7 -25 7
4853 7 -10 5 40 22 -29 8 8 20 -24 -52 12 2 -46 63 -4 -41 24 19 7 4 -18 0 -3 -18 -9 11 -9 0 1 -10 39 4 -2 -12
4887 -12 41 0 -10 27 10 -65 -7 -59 -55 40 8 17 -2 3 -14 -15 -18 0 -23 -52 2 -22 36 -6 33 33 38 23 -17 -40 2 82 14 27
4921B7n9O1L0n3k1N4l5k3JjqM4m2N9j7mpp0O0K0JLn9Q1Kr3J9O7m9K6m2L5r4O0
4955b7%K2J5j5j9L1JK7K0j00N3j6J9%M6o4j8pl1N1j1M3K0l7J6o1N2o4jO3J1n0
4987c1J9M0p3K9J01j5o7N0q7M2pmj6JJ6L1o3L3K5J2j9k6L2k1oPN7n0M2o5pR4j21
5020d7N8j5M6n6m1N9j5j0L2%n2J0Q4q4j2M8n1O4rL2q4J7J8k1N0nk5k1K8J9mRL9
5053F1n2l6K2j6QO0k3n6QJ1nM5M5j6n9OK7Nm2oN2m4N0K7o9k9l3O4k6j5J1M1m7
5086c1JJ2m5L4O3j2m8N1l6K9k0J2lJ3o1L8L5Mk5m6J9J7lJ2J5l2l1O4r2O9j0JJ4
5119HM4oo7K8qj5K9j2l7N3k9QjK3jn9J8oM7Nm5K5n3L7L0k8M4lK8k9k7j6L1k4q
5154a6N1m7K0l2R6p5J1L1l8N3o5J8j3N2j1K2p3n9R0j9q2Q8J4m1M0k2j4K7j9kM8
$$ plain form
4921 27 -32 29 59 6 -15 39 4 -19 -18 -19 -27 17 -25 34 17 13 6 -64 -4 16 17 20 -39 42 44 -49 -30 37 -12 14 -28 7 -87 -27
4955 -27 -27 -5 10 -5 -24 7 8 35 55 -45 8 -8 11 11 57 -7 -25 -32 -63 -12 -23 20 40 3 19 -42 10 -54 -55 8 19 -31
4987 -31 -12 28 -45 -16 85 70 3 53 -34 8 1 -3 -19 -18 -2 29 -34 -1 24 36 17 -9 23 2 -4 3 60 10 52 -13 -20 74 -47
5020 -47 11 -4 42 -14 -55 4 -11 -21 11 11 -41 -31 53 -31 -43 5 -46 18 9 41 -43 -26 -8 -29 21 16 -9 -30 -2 17 13 22 61
5053 61 9 -27 -5 -21 -13 47 24 -32 -24 -13 -18 27 72 56 -3 3 30 35 -7 -13 39 -5 45 72 3 -26 -59 5 -21 -36 -25 16 -31
5086 -31 -30 -18 -63 -29 34 22 -26 25 -11 18 -2 10 7 20 -41 -3 32 36 11 -35 -16 1 -2 10 25 -7 -38 26 -66 3 -7 -6 8
5119 8 52 46 -21 7 -1 -16 13 1 -36 17 -12 -4 -5 18 17 -42 -24 -30 17 22 -23 2 -51 -14 16 -12 32 29 57 28 1 -15 16 -8 -16
5154 -16 35 -12 8 -24 72 -3 8 39 1 54 -11 7 -6 46 35 57 -16 -75 15 -4 -86 2 16 -25 15 -7 -21 6 -13 -15 33
5185C3k5l6oPL5j2k3l5Q3l4PN3o0nK5j3kM6l2l8m%L6K0l4J9J7k8K0K0m5K1j4M6
5219D2k5Mn2O0kn1K8J7l6j1K7j%K0ql3J0kN4m6L2lqj2j9M1n9M7k8N1Jq7Q4n1l
5254a9P8k5jp1N7Mj7l1M4mj3K6n2M1n1K7nK2j06Q0P4k9J0n6j6L6Jl5l6O5K5n5
5286c2M9k1m4K1M7m7j0J4J3j0N4l6M7nmk5L3k0N5l0om6M4m1J7k9O0nm8P2p4O3
5318E6k0j4j0qJ8JNn1LN3m3Kkk7K0Nk7J1j2Rj3K3PN5j2m8oPj2K6L2N5p5l2N1p2
5354d5O6K5k7j4M4ln1L8qk3qL8k3J7K1o6j0K9k2L5K2q9R8j03R6n1k9J5N8j6o7
5385e3Q7l6jK5j4nn7O1lN5n6J4k0j7M8%K6o0J5Mj0J1j8J5pl5N5j01J01lm1J7K3
5418B0Lm0m7K4N0LM4l8OJ6m2K0n1N3noL0m3%l7P6k9n1K6J4P1l3K8o9j6J5M2o7
$$ plain form
5185 33 8 -28 -34 -27 8 -4 -27 -62 21 -13 -6 47 -13 -18 7 -6 -8 38 6 -32 -36 -36 0 20 -14 5 22 -6 14 34 -11 10 -4 42
5219 42 17 21 -31 29 27 -24 4 21 -15 -26 1 0 0 20 12 -21 -11 -13 41 -5 27 24 16 4 -15 26 -33 14 -14 37 38 -49 35 -16 -19
5254 -19 59 34 33 -38 19 23 6 -25 19 15 2 28 -24 17 -34 -7 -12 10 -96 -16 58 29 39 -17 -33 3 4 -31 -67 -2 23 -32
5286 -32 17 -4 -48 -27 20 -27 -37 -23 -10 -20 34 -2 45 40 36 11 44 24 79 49 43 -3 41 0 17 -12 48 43 -5 67 -7 56
5318 56 36 22 12 4 22 23 28 -23 -20 33 -10 -8 -10 -37 -17 -12 -39 -28 -40 -31 -44 -21 -14 41 29 -19 -25 -18 -30 -4 28 83 8 -24 27 -45
5354 -45 21 46 19 5 49 46 -5 33 25 2 -6 32 9 26 47 -19 -29 0 -22 13 35 -54 44 -59 37 -14 -43 -28 30 14 -53
5385 -53 34 -2 -3 22 8 3 -54 7 4 59 3 17 -3 -20 28 28 54 -6 9 13 3 14 -4 11 4 -31 24 -77 24 21 -20 -3 20
5418 20 23 -17 -64 -40 10 13 57 19 25 41 -1 19 -32 21 16 10 40 -3 -3 -40 36 7 -44 -18 -4 67 34 62 -7 -23 -8 34 -33
5451c3N4L1m3l2nMk7Q4n0Ml2K4m1MP8Jk7O0o7j9M9j7L6r0Q3%l0k8oN3oj5j9K6
5485Dm7P3KL4k4l4rQm0OK9jK5K6m1K5j5rKJ7o4O3k0m2O7J9p1j2O7k5lj0l9O3n0
5520b6kK8J7j0k8L6l6N3o2Q0p0k2O8J6m1k7M4J6n6L8l2K4mL5qk5K4m9k3JM2o5
5552f4P6J5m3O9p0L5Ll0N3j4n3K8n4J5K6rk1N7k6L6l6q3J15m8K8mK4ol3J7N0p3
5584b0lQJl4N5K7Nl3N4r9M4l2N8J4o9L2MJ9k9m1P4j3j9J0k7M4l9j5M7J0o3NN3
5617B8J2l2L5l1p0R7mk9m2N5k2K0l8L7l8P0r4N3l2J7mP4m2L1n6n5P5j0j9M3q2
5648e3M0K1rKj8KN9j6j9J1k5P1J0l0K4j07K8J6k0k5P7o2K2k8Q7j00kJ6Q9l1Jk6
5680En5P8j7mm1M9M1o5J7j4L1pJ5p2Q0m2l9jM4K4Ll7J4jJl8jM0KJ3rN1o5K6m3
$$ plain form
5451 -33 21 52 9 -23 -28 -24 -51 33 -17 -13 -45 -21 -62 -58 20 21 -6 54 -13 -32 17 0 36 -54 29 29 -1 -29 -35 18 12 -3 -22 4
5485 4 -43 30 32 66 42 8 -1 7 -33 -27 2 1 26 52 11 36 21 12 14 31 -33 30 10 -32 35 54 -17 -29 38 13 10 0 -39 24 -26
5520 -26 -28 0 17 7 -21 15 -21 32 -30 50 -20 -42 26 42 1 -26 18 34 -22 16 -16 8 4 39 31 6 30 -19 -42 -41 1 -64
5552 -64 12 27 -16 53 -17 18 21 -9 44 30 -23 5 -49 -34 -8 -17 -38 19 -7 29 -7 -90 25 -23 5 1 25 19 -14 3 53 -20
5584 -20 -23 -15 -14 -48 7 34 39 6 60 -39 5 -27 31 45 -24 8 12 31 2 -39 35 22 3 13 -14 30 -9 -24 23 33 -30 -25 28
5617 28 40 8 43 12 -58 39 35 6 -36 19 -3 17 -21 16 -22 48 -46 7 -25 -8 -12 62 20 51 -5 -60 15 5 -14 29 -53
5648 -53 -13 8 -1 1 -17 -15 44 28 9 20 -5 66 76 46 70 -37 -9 7 -13 -38 39 -23 -1 -29 58 -42 -44 -28 61 30 31 5
5680 5 -50 28 11 7 -34 15 56 -9 8 -6 25 18 33 -39 41 -1 -40 -41 3 27 30 -7 7 6 7 -31 -32 8 10 23 14 65 0 26 -17
5715a7m1L4Nk5M4j2L0J2l0Rm9P8o7R0k9j7k0kJ2jlJ4m2N9m3J5lj2N2l2J8pJ3n1
5749a8l7K1N1k3l3P9p8P9l7m9M0M4n4mL7m4K6L6k5ol7K4l4L1J2qML8m9j0OP8m5
5782A5n5N0j1J6k2N7m8ml0OK6l6L2o8P5l5PQm6O0M9o0o9N7O8m3J1o1M0JL1n8J1
5815b6O3l1L4q4O6pl9j5O6m9O0ol6k4J9MKo1R2J7jm8lj3L2l4L9Ll2L0jl9M9k8
5849ak6M2l1pL5mMj4L7m5LL9mqm7L9j2K4l5J6l8N7J3j8n2Q8n9M3p9N0j5j8L0k4
5883a7k1M8j2L4l9O0n6m1M8l8N5k5Jm7N4n2Q4k7L3o0l2N6mL1qOk8NJ4m1K0J2K0
5916C3p2L6K6l5l9P5j4L1k7o1P3o8L2Knj5L2k1L0Kj5L1n6L3Lo3J9K5K1r1J06k9
5948aj8l1K5M0JK8Qj8j9k9K8K2N7q0kl9k4O8mo0K3O0n4J9k4L8lm8J7JM0j1jM5
$$ plain form
5715 -17 -58 -24 -19 -44 0 -12 18 30 0 9 -40 38 -29 61 32 15 -5 -7 5 4 1 15 -27 32 -11 4 1 -11 41 9 27 20 33 -18
5749 -18 -55 -34 17 -6 -39 40 -38 41 4 -45 -5 39 -15 -19 18 -26 0 36 11 5 -32 -8 -42 -11 1 -7 -3 35 -14 -24 -18 60 15
5782 15 -40 10 -1 15 -7 50 2 -2 -32 -26 0 -36 -4 -72 3 -32 -25 -17 -63 -3 46 -14 -83 -26 42 -1 10 -51 -11 -10 21 -37 -26
5815 -26 37 6 40 -44 22 15 -24 -39 27 -22 38 32 -4 -28 -9 -5 -3 -64 28 45 44 -4 -7 -20 12 -22 17 20 -12 18 17 -22 27 -1
5849 -1 -27 15 -16 -23 12 8 12 -2 35 -10 -7 32 28 20 -27 12 0 24 -11 5 -33 24 37 19 -33 55 -4 39 -40 10 -5 -23 7 -17
5883 -17 -38 10 -2 32 -7 53 -3 -44 4 -34 21 -4 -3 -50 4 -48 36 9 42 -18 -50 6 2 33 25 31 3 8 22 -19 1 13 33
5916 33 -39 -3 23 -12 -51 24 10 41 14 -47 26 -42 -10 -8 -13 -28 4 -17 13 15 0 31 -25 8 11 -52 -33 -8 13 -78 28 -1
5948 -1 -19 -50 -25 15 16 44 52 34 15 -14 14 36 93 13 11 -28 -52 16 12 -48 -25 35 -19 0 -24 14 11 -37 -20 -19 21 10 9 54
5982E4r1L8L5k5RK9m9j6K8l8J7ppk2P4q0N0JJ7m3Q0j09MJ9k9L0l3Q2k9M1l8J5
6014GO6j00K3J3k2Q4p2K9m9L4J2n7L5j4pJ7rM7k2k4j2J13r7J0j2MM5rj2k0rL2
6046B4n5M7j3j0P2j04RL6m3K1j2LK9jn2P8j9o4O9m8K4L1Pm4J5qoL8j1j0mK6k2
6079CRl6L3K7k3Nl9M9J6j2j0l3J2Ql9Q4n3j3K2J1o5N1lk5L9o4O9m5j2L3J9J2j1
6112A9J6k3j0nL8o4J6l5P4m5K7j3K8Ok2k4L4m9j7O4k0J6n5N7qmn3K0L7J5l9l2
6144e1lO3Pn8kK8L1N3j6K6j01M5k2j1P1r9L8QJ0k8M2pL8n1Nm6K6jN1l2K1Jm2n6
6178f2M3J5k4J4L9k9JNoN0o3l8N5j1n6Q8n1O3l6mO1o6j5K9J7j3j0j7J1K4n9O5
6210B0K5r7O9o2J04n7J3k0L7kk9N1m4O%j2N8l2J5p9J4J9pK2n0kP3j9k0K6j0j7
$$ plain form
5982 54 -37 1 36 11 20 49 0 -16 12 -26 -9 -16 -23 -45 29 -51 -1 0 17 -26 54 -55 -51 -32 -61 -31 -64 18 -11 30 -8 7
6014 7 73 -27 -4 9 -13 71 -1 28 -21 13 25 -32 3 -11 -18 -1 -10 37 15 -9 -21 92 -5 5 -7 -3 42 33 21 1 -8 24
6046 24 -31 16 3 -7 65 -39 -30 6 -37 -16 -28 -25 4 3 -49 29 10 -54 15 -33 -9 22 29 -15 0 -8 -14 24 13 3 -1 25 3
6079 3 12 -24 9 36 13 18 -21 28 44 32 22 -11 1 9 -30 54 1 -12 10 21 -44 7 4 -21 18 -46 23 -22 -34 -1 18 30 19
6112 19 35 12 2 -3 35 -29 -13 -48 26 -19 8 -5 23 29 7 -17 17 -32 -49 15 -5 11 -44 13 5 1 -52 -32 5 20 -19 -51
6144 -51 -54 9 16 -42 -44 -16 15 68 52 78 -23 22 0 -11 60 -39 -1 7 17 -11 31 24 62 11 16 -30 -4 -5 46 14 35 36 -6 -62
6178 -62 -19 -4 -28 -14 25 -4 -3 2 -4 46 -17 -55 0 -11 -67 21 -30 33 -3 -7 54 -12 -27 2 19 6 -4 -21 -10 14 -45 20
6210 20 45 -52 17 -45 59 2 15 -5 32 30 1 52 8 14 14 2 60 28 43 -36 -22 -3 -10 12 -38 -40 33 14 -6 20 10 -7
6242gL2p4l4J22j9K5o3L5l6n1Q4K9o1K6Oj6M7q6M8l5N2j9j3pK9l0P9q2LP7l0P
6274C8%n1K1pN0n5L3N4j26pN1Kl8K2J4J2r9J18k9kk8J5jRNj2M7k8m4K3J0J9j2
6307DM0o5K8j0J9j8M3Pq6%L6n3O5l4P3n7Qk6K9m3L8KJPLk1rqJL8JQk2J9m3J5N0
6344D0j6n5OkL5J2n9N5qjJ5qK5m7M1o5N0j3l1mK6j4NJ3m1N9k3mj3K0klK2k3qM
6380a2Rl6j7l5J09qm2N1n2M2k6K5Jk7J3j8J0m5R3k1n5N8RnK0k4l4K8PK0n3M4r
6413B0l3K0k6NL5j9k8lj4OM0K3Jj7J0K9j04O2L9Jq0O4n2j2K7%j7J8Kk6nJ10r6
6446b0k3P7J%p7O1m6K9JlO2j8l8j4pK6rL2K7n8J6J9o0O1l9l4N6k1k1J9jl8N0m6
6480c6j9K3m2Q6q0PO6L7p9J1Rk7Q4j3m9N0l5N2l5j8k6N7n0M4p3N6m2N1QkL8o5
$$ plain form
6242 -7 25 -49 -83 39 20 45 -18 17 -19 -70 14 43 -18 8 14 -2 45 -41 7 -28 24 5 -8 -15 14 -16 63 -19 -16 61 31 38
6274 38 38 -13 8 1 51 -4 29 83 -43 -50 1 3 -35 -13 1 13 -86 32 3 1 -27 -12 -13 -4 1 -11 36 8 -36 -13 -3 16 4
6307 4 44 -21 7 -3 16 -2 41 48 -38 -38 -2 -55 10 -24 49 -8 0 -26 3 -40 -2 0 1 8 11 -10 -19 -27 -26 12 13 21 -1 18 -25 -10 40
6344 40 24 -31 -25 -27 8 20 -39 16 8 7 22 14 39 -8 33 -32 18 5 -26 -30 -4 -18 -13 0 -41 18 -5 -9 -22 -2 -4 -7 15 -8 -16 -12
6380 -12 -3 -39 -56 -91 18 10 -32 19 -33 9 -17 8 9 -18 -5 -23 -13 -58 35 14 -41 17 26 21 41 17 -17 11 18 38 -15 29 20
6413 20 -13 7 -19 -14 21 2 -26 -29 -43 -37 3 26 27 10 20 49 -55 7 46 47 -33 31 -21 -33 -6 -6 -23 -5 -3 -29 -34 76 -20
6446 -20 -43 34 35 35 -42 19 -27 2 3 0 62 44 6 -8 -15 11 2 34 61 3 19 38 -22 39 0 -34 22 1 -20 -1 -2 -40 10 -36
6480 -36 -55 -32 -74 12 -68 -61 5 42 -37 -26 -17 -44 40 27 -22 28 -7 45 10 -8 -34 23 -27 17 -56 0 -42 9 17 15 53 -12
6512a2k7N4pj8K8M0l4J4p6J8L0J8J4Mq9J7P5o9J0Qo9K2J4L8j1J1J1JK3l2n8M8
6544dM7p9L3l0L6J3k6k7M1K4k2K9j7M5p4O5k0o7M5L9o4O0j0j06O0N6j6n2K0k7
6574b8Rj1K8M4J4q4K1OQoo5R4Mo8M6o8P1L6K1k1o8J1kJ1l7K3K7L2j7q1j2Q3l6
6607a5K7j3KP0q6j3j1Q4p5L1K0o5R0m1K0QKOlql9J6k4N4o0k1O4j01O2Q1k7l1N
6640In6Q3j4J3q5K4k0L2J8lkknlL6K1m2j2N6o4Q7l3Mkr9NO5J3m9J2MK0Nl3j9Q8
6676E2l0m8M8j4NLr3Q5N0o5J1n0L2l0R5n8K4rj3J1k8NN1Jn0K0l8N2Ll4P8q8N2
6709C0l7L0Ln0K2M5o7P8kl4l1PJ6l5N4nl8mM5k9RJ6l6L5j5K7m5k2N7jOr1L8k4
6743d8K7J9k5j7L7Rn3N3K5k3l1KOL1j5lK3k0j2J7J6oJ0l4J9k0O8o1%K3p1K0O0
$$ plain form
6512 -12 -39 15 8 -10 18 58 24 38 -38 -20 10 28 42 46 -43 -26 49 -20 -10 -2 -71 -49 -35 3 -8 3 14 15 38 6 -52 -4
6544 -4 43 -36 -3 -33 3 16 -10 -37 4 28 6 35 18 63 -11 54 34 -33 12 51 -13 47 37 -69 -9 47 31 -21 -1 -28
6574 -28 -19 -30 -2 42 56 -28 -7 -1 7 1 -64 30 34 -34 12 -56 15 51 72 51 -17 -6 -8 3 -34 -11 16 48 31 -50 -62 21 -15
6607 -15 12 -1 1 71 -15 -28 -39 45 -30 1 21 -44 46 5 25 33 35 41 38 30 -9 7 -17 37 -23 -44 20 -81 -19 62 35 4 9
6640 9 -47 36 22 35 -50 -26 -46 -14 4 1 -1 -3 -8 -11 25 46 4 -8 48 -16 71 38 42 40 -59 -54 11 24 -25 -13 -9 11 16 -17 -36 52
6676 52 22 -26 22 8 13 16 -77 8 58 -7 4 -46 -14 -44 51 -7 17 8 -5 6 -22 -17 34 35 -15 5 -33 19 22 -12 66 -22 30
6709 30 -7 23 26 -24 -2 43 -24 54 52 18 -13 -6 10 -25 29 24 -14 -18 27 -2 7 23 -13 22 7 34 -11 -33 24 23 29 -62 -24 -48
6743 -48 -21 -2 -27 -44 -7 2 -51 2 27 4 -27 -25 -19 12 -3 -6 17 -3 -15 2 18 12 22 -12 7 -13 55 -6 -6 17 -54 -34 26
6776B6m7M6mn1N1K6j0o1jJMPL9p2L8K1j7pK6NJ3J8q4O0L3k3pm8j3N9Kp2M2jM7
6811D6j3n1l0N7jk3N7Mj4l4L5p9M4n1M6J9JK5k1l0KrK3k2M4K0k4MJ3j6Qk8J7n2
6845c3M4j6j0o8O9M5J0%qJo7OK9O3j06k6P3j4l6M1J3K0l7j1K7oJ0n7L5L6r0N5
6877hM8n4N5q4L7LJ7mlK2L2n2Oj6n1jP9m8K9n5MK4K8k3K6j8LK4n9J2kRn%rJ1J7
6914fN1m0K1k5j4M1k2m4Q7l3l5j4L5j0rM1Pm6J1K3n1J3K4L0l1LlJ7M8q7K0K5p
6947B0Nl0j1K4j6pL2l4L8Kp0K5J8J4Kj8L6n7j6J5%J9J6jj9l0RP4o3l9R4l7K8k1
6981BJ5J0n3pJN6J3n6LK5M4m8Qk4k3K7l1N3Mj4k8J2j0MRK3l0m1L1K1k7N4k9o6
7015g2J19p9J0K2n0M9r1R3lk9LK9J7j1Rm2j4N2kk4m5N7okk9J8QO1k7J3k7j2n0
$$ plain form
6776 26 -21 25 21 -30 21 47 37 -24 -25 -24 -20 -13 26 -46 -8 13 -4 -11 15 20 33 51 -33 27 60 37 30 -18 -31 28 30 -42 0 -1 46
6811 46 33 -18 -48 9 8 -15 42 46 32 -2 33 -46 -2 -53 -7 12 13 38 17 -13 -11 -20 3 -19 25 45 21 25 38 22 30 2 19 -33
6845 -33 11 -5 -15 -83 -14 31 41 41 33 34 -33 -27 2 65 -41 -67 6 -8 -44 -3 10 30 -7 -18 9 3 13 -44 -9 27 -63 -8
6877 -8 40 -14 41 -43 -6 -3 14 10 7 29 61 9 15 -1 -52 -53 26 -22 7 -48 -44 -20 8 -15 11 -7 -4 20 -39 -27 -29 -20 -25 -25 -34 -23 -6
6914 -6 45 5 26 1 -13 28 6 -38 49 16 -19 -33 2 -8 -17 24 31 -15 -4 19 -32 -19 5 35 4 7 4 21 69 -18 2 27 20
6947 20 25 -5 -16 8 -8 -15 17 -17 21 23 -47 -22 -4 10 12 -6 30 -27 -43 -28 -28 -9 7 6 -13 -43 -34 40 -23 -62 32 -5 23 2
6981 2 17 27 -26 -33 -32 24 37 -19 -16 9 53 5 13 -11 -34 -7 -38 15 19 5 -23 -11 -21 -17 -8 15 -15 -56 -25 -4 -31 23 -6 -72
7015 -72 47 -32 -22 0 -50 -1 -92 1 -2 -31 -28 1 18 7 16 -26 -40 12 10 -14 -59 -2 -8 -10 -39 -21 -13 48 21 34 7 -5 -55
7048e5L6L2q1O5l5K9NK8m2J4k8J5M1m9%PmL7j7k2m1P0nK0j7M2k7l1O7l9j5J8K8
7081D6l8mPj1rN6n3n4M7p2J31n1K6n6O9o8K2K9l3L9m1L1K5p4M4m8O6L8l4m4MM2
7113C2j9j7Pj8Ll8P4Rm5L7j8L1n8M1J5o7P7J9n6l2K0oM1l8lj4N3l3N8q1J3mL8
7146B1k3m3L9%k5P3j04M2O1o1j4m0J18n6k7L1P9l0j6ko2qL2L0n6M1qj9M6j5k3
7177a9M9m0M3l4L1m6L1%RQj6lm5LK8j6lM5n0N6m8J7J3J6j9l7K5J2PM8q7ooK7k4
7212c1QJ4m7K6M3q1P6k2l3L3Jjo3P4L8n6j3NM3Mm0j3NqJ1rP0n0K7j2K3p3J2L2
7246gk4K2N5q2M4k5M7j2p1J5M4n0O3p2Q6m0L2Kl8m6O3po0J49q8j7M9o1P8o7K2
7277Dj2L5m2L5m4L8m5j8K9%J5j9J5Kl5L2N4o0J0l2N9o7P1J0J3o0RpJ5j8J9j8k2
$$ plain form
7048 -55 -19 13 -68 -3 -38 -9 -4 24 -18 -4 -32 -17 24 -25 -25 -18 -22 15 -2 -24 -65 5 0 20 3 45 18 -13 54 15 0 18 46
7081 46 8 4 11 0 -9 47 -6 -60 -13 -85 46 -5 21 -35 34 -34 -12 17 -16 23 -18 13 38 -36 8 -40 26 64 30 -14 -10 32
7113 32 13 -4 3 -15 -12 -50 24 33 -12 25 7 38 -20 21 36 -31 46 65 9 -23 -3 -9 32 -6 -9 -23 30 -3 55 -26 -13 -17 21
7146 21 -2 -45 -6 -6 -31 42 -62 -20 41 -20 -34 -74 44 -12 -39 -8 71 41 25 23 -39 -47 -15 15 -41 0 -8 -27 19 4 -19
7177 -19 30 -10 33 -1 30 -16 15 15 24 32 16 13 -32 -29 -1 -17 -20 25 -25 31 -17 0 13 29 10 -27 -2 10 17 65 -22 -28 -34 -7 -31
7212 -31 -23 -9 -56 -30 13 -68 8 -14 -47 -14 -13 -14 -77 -3 35 -21 -34 -29 14 18 -22 -35 -30 -38 -27 -36 34 -16 11 -1 22 -51 -39 -7
7246 -7 -31 -9 46 -36 8 -17 30 18 -53 -38 6 -44 19 -53 33 -7 25 27 -11 -57 6 -1 -61 88 0 -17 32 -29 49 -18 4
7277 4 -8 27 -15 20 -24 14 -31 -49 -20 -20 -5 -24 -9 -7 -42 -10 44 -16 -6 -38 21 -46 25 35 48 -12 -3 -10 5 -13 6 -12 -34
7310c4OO4o8N5n5pN5Nm3MJ0rK4j8M7m4N5l3pj1k6L0K5rJ8Oo6O8m8m6M3K3p0Q5
7344B9k4O0qo5K9n1J0L5j1L9l0nm8L1K5o3Q6l1L1K9p5O3p0MQ0j15rK8J2P5n6n1
7376d6L7Mkm2O3k5nK4r6J21p4O1Ok7J9L3m1K7k7k3m0P8k4j6JN8l3K5r1J15o1l4
7408c5N2k6RK0NLn7J1k5L6j1K7L4m9j0j8N6k6OL4n4Jk7O3n5j1Q7r4J5K0J7j0Q
7441dN2J0p8Nk6N9k1j1K3m1O8j6m6MN9l0j2Lj2L6q1L0l4M4k8R2o4J3l1J9L5jO9
7474H5r0l5M7j6J7k3M5o1j4M6j9QJN6Nj11N7J0J4j9k1o8Q4l3N6l4N4m0jl0KL4
7506Fj6L0o4P1k4%j0J7k3K8j7k8K3L2j8k6lm3M6K8J1k3rpL5k3k3K7n1L6M0k9M0
7539C3p0L8lK3Qn2J7L6n7N5pMl3QJ4nKK3o0M5km1L3lJ0j6K1Jr9J12Rq5O0M3p5
$$ plain form
7310 -34 -28 36 -32 23 -32 -39 16 21 -22 -18 -8 -17 7 -11 36 -8 47 14 7 -4 -30 0 25 16 34 40 -26 42 -6 -52 -9 14 -56 29
7344 29 5 65 57 -8 21 -30 -20 15 4 43 13 8 -40 -9 16 -47 39 8 39 68 -7 56 -14 -10 70 -45 -54 -26 -14 61 5 -46
7376 -46 -9 -5 -7 -49 14 -11 -16 8 -88 33 -41 20 26 -1 18 51 10 37 10 -13 -53 25 1 -15 -14 44 11 36 -55 60 -1 -35
7408 -35 17 -9 0 20 25 28 -29 -18 -43 -7 -18 9 43 -6 -16 -34 22 -4 2 36 -18 -17 -44 19 -36 -47 40 -54 -39 -19 -2 -12 -4
7441 -4 48 58 -20 -15 -41 18 -3 -14 9 -32 36 20 -26 -22 37 7 -5 -2 -14 22 -59 -29 -63 -19 -47 45 -19 -6 -37 -18 17 16 85
7474 85 -5 -40 7 -9 8 -15 30 -31 -45 1 -18 -10 -9 47 52 -59 -2 8 22 3 -18 -86 -2 -35 21 -13 41 1 0 -30 -28 6
7506 6 -10 20 -44 27 3 3 -7 10 -13 15 -2 -30 -7 25 7 -19 -22 -65 -19 9 20 -3 -12 -19 16 -7 -30 -3 -54 -18 22 -7 33
7539 33 -37 1 -2 21 29 -23 -6 30 -27 28 21 25 -8 0 14 9 11 34 -26 19 17 -24 9 6 16 0 21 22 -77 35 44 -41 19 62 -13
7574a3K4J5j5o3J08p3O9j47P9LJ4R2n1l3l1LK5k6N9k7k8POJ8lJ0J2N9r5K4o5N1
7606HJ0J0l9K3l8oK8k6M8k5jRL7m0M3p7L5L8o2Q2l6m0LM8j8k9M2n5P1j3p6N1J2
7639A7K5j2jm1L7mq9N4K5o8L9M1k1j2m3L0RJ8mK7m6M9Qj6Nrl3J7j9L3l4L6n1J5
7673a8M5ll7J7rM8k3n6O8l2L0J6m9Ml6N8l4L5k2l9N8k5k4j6M6m0O5o1M7kp0O0
7705ArNJ5j7KL1k1N9q6k9L3N8o1N4l5J8k6Qj1K7j7LKm1N9J3o1J1OQjl6N2l2L2
7740A4o7M6M6k1j09J09o6Q4l9j9N1l0J9L9k6j3p1O5Ool7J9ll1O4k0k7N9j6m1L3
7771A2K8m8J4J3m4R4p3l3M4m5L4j2PN6n1L8l8m9M9PLj6L1j4o0JM8l4O0k5kJ7k3
7804a1J2L3n4J7l1L0J2J3l9j8l3Q8l6O1k4r9K6L6M6j4J4l8K3LK1n6J2%oK3J7k4
$$ plain form
7574 -13 11 26 11 -52 56 -17 52 -95 -16 -13 1 93 42 9 -22 -19 6 -20 39 12 -16 -9 -3 15 12 22 34 93 -2 22 -43 8
7606 8 18 28 -11 12 -26 -32 -4 -30 18 -7 -8 1 38 -2 41 -36 -1 37 -25 57 21 -19 -16 32 14 -15 27 -28 43 30 -46 5 17
7639 17 42 30 29 -12 25 21 -68 -14 11 -57 -18 23 2 -10 -53 -23 -14 4 0 27 -19 30 38 22 27 18 -15 2 -17 16 -18 18 -33 -18
7673 -18 27 24 -13 4 -5 43 20 -36 32 0 30 46 -3 1 -35 23 -11 24 2 -37 21 -4 -28 -44 2 -38 27 -34 13 11 -59 1
7705 1 -8 -3 12 -5 -3 28 7 66 -20 -49 -16 42 -19 35 0 18 -8 0 -11 16 -1 2 4 -37 22 35 -26 -15 -9 -1 -2 -38 14 -18 14
7740 14 -53 -7 39 18 -91 18 -48 36 -3 -22 29 -1 18 57 31 18 -53 12 18 12 -25 -6 -9 -40 24 4 -23 36 20 -21 12
7771 12 40 -8 6 19 -25 69 -4 -37 7 -38 -4 -16 -9 47 -4 34 -4 -53 -4 3 6 -10 21 7 -53 -52 -4 -38 22 -3 -5 12 -11
7804 -11 1 34 -20 -3 -34 -4 8 21 -18 -36 -69 19 -17 44 20 -79 -53 -17 29 15 29 -9 14 17 38 -18 -6 -6 -12 11 28 4
7836DK3r6J01j3qK9n4M6%m8J4k3N2Oo4l2M7J3L1l1k9lM7l9l7Q4l5P5j30M4L1o8
7868f3M6R1o8j9%k4M1K5qJ4m7K9mK0k9j8K3K3Kj1k4l5O4Mq5N3K2K2m6Jkj0M0M
7902C1m2K7Qk4M5l0ko7M2O4k1k3J4Ro3P6n1k6K5M9o4j0nP8k9M0k5k2j4J6n8L2
7934b0M7n7P4j26M6N5m8J6k4K0O0J5o9P1m3J2j5p5J37q6k2J7M0j2K3M4o2K2p8
7963c8L0J7m7K2k0O5J2m5Jk6K0nRml0R5k8J4J9p4JL2m5NK4N1o6J8j7J4LJ2jq5
7997f7K2J20Po4K4m4On7L8l8N8k2PLkj4J0N1n8K3J5k8LqL3K4o9O4Ql3n2N6Nj3
8031Hn6JK2Rj2J0N6l9M8o4pK2mj5J1L4l0j5J6L4k1M9p0J9j9p3J51k5o4J2P5m7
8063A6k5K4l8o7J23j8m7OP1j8o3O5o7J7k6N7J6K9q5L1K5j1k0K6K1m1KK1Ln8J02
$$ plain form
7836 4 27 -69 32 19 11 40 -14 32 32 -16 -2 -25 27 33 -31 -63 -16 -3 28 -3 -32 -35 12 -27 -64 20 -15 60 -70 -26 5 -63
7868 -63 -17 74 6 -13 -13 -37 4 29 21 35 -12 17 13 33 4 -14 9 32 34 23 -1 -36 28 32 -53 0 22 44 -2 -1 -3 -13 27 31
7902 31 -11 16 24 0 45 15 13 -54 -12 52 31 8 22 31 -32 44 -7 -33 -8 41 -23 -33 -38 40 11 51 26 4 -10 6 -52 -20
7934 -20 27 -30 44 -82 -36 19 -29 -13 -37 -17 43 58 -11 60 17 29 14 -61 76 -10 -32 -15 25 13 36 80 18 40 -38
7963 -38 -8 9 -38 -16 -36 29 41 -4 -3 -29 -9 -14 -5 -9 -39 56 28 42 61 -13 -12 20 -25 -20 4 55 -11 7 -10 4 7 19 18 -67
7997 -67 -45 75 82 18 42 -2 4 -53 -15 -53 5 -17 -10 -7 -9 -23 -13 38 -20 3 18 -10 -7 -15 18 42 -27 37 45 12 -40 16 21 8
8031 8 -48 -47 -25 -16 -28 -18 38 -1 47 -17 -24 -2 -6 -21 -10 24 -6 -21 -5 29 8 57 -13 6 -13 -86 65 40 -24 -12 63 16
8063 16 -9 15 -23 -90 33 15 -32 -26 45 27 -36 29 -38 -21 -47 10 26 55 -30 1 26 15 -5 21 42 1 3 24 27 -31 71
8094G1q8L1k5L0KL9q6QrM1k5N8r2On5J08m6L2O5n9jJ9o7L4L6n4K7J2p0N2pl1L9
8127eJ8mk7J2J1PjoJ7j4Jjj6lM4k4n0K1j6KRK4qk1K7L2j6Lk3M6n7J0lPL6l9N1
8164D4j7l5mN2l7o8N0M1m3n0O1K9mkm5pJ9L3oM1l3k4pk2J9J2m6
$$ plain form
8094 71 -17 14 -11 19 21 60 -26 -18 -27 14 -11 47 -45 -39 -94 14 -32 0 65 6 5 24 -43 -9 27 -27 0 12 -58 -6 -13 -44 -5
8127 -5 13 9 -18 -6 5 12 11 5 22 8 9 8 -8 -11 33 9 -41 -20 -36 -34 -25 -1 -9 -30 -3 29 13 16 -7 39 -18 -8 -11 -4 32 -7 44
8164 44 27 -8 -12 40 3 -65 -15 26 -17 -67 -6 23 19 17 -28 -35 -16 17 11 52 19 -5 -12 -34 -15 -3 -49
8191d9
$$ Imaginary data points
##PAGE= N=2
##DATA TABLE= (X++(I..I)), XYDATA
0@%%%%%%%%%%%%%%%%%%%%%%%%%%%%%%%%%%%%%%%%%%jKkKlMmMmMoRj0J0j1J3j6
59iJ8j8K2k7L0l8N1o8J03k01R31K595r53k330j856l24J147J548K64j01q7o19o78
82f00m93k83J043J830J37j177j086q26M5J071J024M85L37j028j869o60Q82J705
100E37J695k71k217j392K88R62J048L07l74j6M3j094r83L10J119J613O24j610
118E89k025l82Q34J228J240l4r15p89q99m95J006J431P47j21j500j584K03J270
136a96N97L02J21m41l62n77j022K26J787J380jj408k179m29J677J655L46l66j112
155bp93L7N1K96J058Q20l61q39j158p80J107J454K94j91n30j059n08L8M87J268
175F89J214n92j655j230k82J359J893J49j119p31m76j83M56K94M91R82j18j254
$$ plain form
0 0 0 0 0 0 0 0 0 0 0 0 0 0 0 0 0 0 0 0 0 0 0 0 0 0 0 0 0 0 0 0 0 0 0 0 0 0 0 0 0 0 0 0 -1 1 -1 1 -2 2 -2 2 -2 2 -4 5 -5 5 -6 7 -9
59 -9 9 -9 13 -14 16 -22 29 -39 64 -137 794 3389 2436 106 -1750 -2074 -927 621 885 784 697 78 -600
82 -600 -1093 -1376 -333 1497 1634 457 -629 -1455 -1410 -339 685 1170 1507 479 -1390 -2050 -1168 537
100 537 2232 1961 -256 -1648 -1360 -398 650 957 583 567 610 -484 -1467 -1157 -38 1575 2199 589
118 589 -1436 -1818 -984 244 1484 1450 535 -254 -1153 -1648 -642 789 1536 1415 -85 -1669 -1466 -196
136 -196 401 703 824 383 21 -556 -1578 -1352 435 1815 1814 406 -1773 -2202 -525 1130 1476 1110 -2
155 -2 -795 -758 -707 -411 647 1467 1106 267 -891 -1671 -564 890 1184 993 463 -596 -1104 -1066 -579 689
175 689 1903 1311 -344 -1574 -1856 -497 1396 1545 426 -305 -781 -964 -508 -214 277 1259 1141 -113
193a13j197k88P92J740P37q67r71o39m77N28R69O69M42k64j537j091L38J017J364
212A152M80j058j080j75P0J43N99N57L28Q8j094j509l9J154J475P99q97j769o14
231a390M61O22Q10M51k68l18p19r72J7J194R97L89m39j387p86N06N41N71O39Q4
251A003o32p63r35l4J398J312J12p56j341q66P70J007L86K05q7o50n74l82j96
270a023R09J341J96p98j097q74K76J174O70J22p6p52r68k21K13R90J221Q4j168
289B19j110m55L95J227O25l00k50k67p49k11J67N78J096N22r41j384n28M01J227
308B62R95k35o97m79n77j32N43O88N76L11q56j291k74N29Q15Q71J1p98n79l45
328f62k61M30R20N41J14p14j383l98O63J079P10K2r43p87o5n5M14Q71L43j46n01
$$ plain form
193 -113 -1310 -1598 -806 934 1671 804 -167 -806 -1283 -755 214 883 1325 1061 -476 -1567 -1229 -212 1152
212 1152 1632 574 -506 -681 -611 -468 131 688 1016 1104 10 -1499 -1538 -384 1091 1890 993 -776 -1390
231 -1390 -929 -307 503 954 686 368 -351 -1323 -1306 -112 885 1274 835 -552 -1338 -832 -291 280 919 1003
251 1003 371 -392 -1327 -1361 37 1349 1461 705 -636 -1502 -732 275 661 866 779 129 -445 -827 -1023
270 -1023 -114 1227 1423 625 -472 -1346 -1070 104 774 896 820 68 -900 -1121 -908 82 1303 1387 219
289 219 -891 -1346 -951 276 901 601 351 84 -665 -876 -709 -131 965 1487 546 -838 -1366 -965 262
308 262 1257 1022 325 -154 -731 -863 -320 368 944 1255 399 -892 -1166 -637 178 1049 1060 262 -317 -662
328 -662 -923 -493 427 968 1082 368 -1015 -1413 -750 329 1039 1061 118 -669 -734 -789 -375 496 839 693 192
349A92j050m66O67J131M98K9p44r46o9J41L27Q41N69l15p26q99m22P63J243L79
369A143k81p16q31j21N40K75M38M78j83p36p07m68N46J244O21m19p69q50k95O22
389d69P00L46J75k51q27n65n8N22R42O12m79p52n97l07M85Q60K52Q3q2q45o75
410i30R4N99Q30O53m22j143n53N4M42Q27L87k16k39o10o90J86P31N88M84l47j009
431b84o33J42L67P04N64k25n10m31o19J8R12P09K41l19r68p37K09P17N37M31k37
452E88o35l44l10j8O25Q46R0k71p84q40J38Q41O06L39j11p80n75rR8N31Q50K9
474I04n12o61n89%Q79O88J10k11o25o85kK96N06O12J85o59p11l84J4Q15P59J13
496H42m41m98o39q4M92N12M21K04n88p99k50K16O05P58O5m82n42m87p8N22N89
$$ plain form
349 192 -858 -1324 -657 474 972 1001 257 -689 -758 -617 -290 551 1120 805 79 -820 -1242 -479 764 1143
369 1143 862 146 -685 -806 -266 9 447 925 742 6 -701 -1169 -623 621 1242 823 54 -796 -1091 -469
389 -469 231 577 752 501 -326 -891 -949 -427 515 1127 648 -104 -701 -1008 -523 337 589 672 590 -255 -930
410 -930 -836 -237 593 1246 824 -319 -872 -818 -376 451 838 622 383 -227 -917 -731 0 588 1072 725 -284
431 -284 -917 -775 -408 296 860 635 125 -306 -925 -907 5 714 955 636 -332 -1069 -860 -143 394 825 588
452 588 -47 -391 -701 -719 -94 752 842 571 -213 -1053 -915 -74 532 871 760 -20 -595 -604 -506 25 875 904
474 904 392 -269 -858 -858 21 709 819 608 -17 -702 -704 -408 98 710 895 236 -475 -859 -845 -30 729 842
496 842 401 -97 -736 -820 -328 184 605 809 221 -578 -828 -612 -7 751 816 334 -208 -695 -773 -251 338
517C38L58J51n40q91l70M24O07P79O1o45o60k44o7N04O38K35j37k77p96l66M24
538d74N85N30K59o12q65j36N2M60O99K67l08m34o09l35N04O57L71J06m81p44l15
559h23L21M21O13K76l66n45l61l20L61P79M25p7m46p29l50L70N38M50K96l08p37
580b12l35j47L27P96M54k73m72o32l23L23O89M23P5k66o79m43K7L59O04N59k04
601F50o79n25k64L39P48L84j37k08o42l75J49L93M89M09j50o72m91r5K51O60N43
622G77j23m62m80m22J64N66M34K06l4p78m67J5L42M79N78j31n74m22l66K01N53
643E6N42J01k53n88n71Q7M30M78L37Kn78m64k88P1O09O29L7l30m86m83ON26M95
666C65K35m8o00m19j08K17L65O50R3n38l98m07j05O34O17P1n6n38o43J3L84M21
$$ plain form
517 338 696 847 307 -584 -954 -530 77 856 917 272 -388 -632 -699 -195 443 678 541 264 -532 -898 -474
538 -474 111 641 900 288 -577 -713 -661 -201 498 765 457 23 -586 -921 -417 240 611 717 236 -508 -823
559 -823 -502 -81 532 808 442 -103 -464 -784 -423 356 781 704 258 -471 -821 -451 87 537 833 525 -212
580 -212 -547 -694 -367 429 883 610 138 -494 -817 -494 195 618 693 427 -252 -695 -668 -309 295 854 650
601 650 -29 -554 -818 -479 269 653 516 308 -334 -709 -560 -167 322 731 581 -91 -582 -677 -426 234 777
622 777 654 192 -288 -710 -546 20 454 660 626 -152 -619 -604 -262 217 795 664 90 -332 -698 -497 56
643 56 598 699 446 -142 -713 -626 -196 282 619 621 43 -421 -709 -638 -29 600 637 307 -179 -662 -656 -130 365
666 365 600 552 -48 -467 -575 -358 7 657 750 212 -186 -593 -698 -64 553 624 568 30 -613 -600 -216 205
688B05M02Q1m41n29k71LM51O31J41l04m39n60q0N35M24K93J07n03n54k31J42L89
710a08N82J94m52l92l38k47M84N97K27j0m13n85k07K96L80M31J85k89n18k70p5
731e28L37O10K97k47l37n01l26L77N05L38K11m71n78k63J74K07N63L02k33m56
751a9l75l43L11O41K84M1l13o05k93K04M25L72L18l21n45k60j01K31N54L38l4
772E10l22n01l08J79M84L53K67k38o44k94L8K70N01L28j32l75m22l11J95N22L46
793D46J34j93m96m66R3L32M28L47j80n46l53q7Q6N31M06o8j65l95m65P6L75M34
815B74K89j43n14l80K2O3M95L91j0l56l11l24M3M67L73J42j00m06n07L9K48L54
837A49M67n1m92l48k11L6M82M43k3j49k96m97l1L10M14L56k2m38m68j90K12L56
$$ plain form
688 205 607 688 247 -282 -553 -550 -99 532 673 369 -70 -630 -710 -175 249 542 649 146 -408 -639 -497 -108
710 -108 474 668 216 -176 -514 -761 -277 320 547 537 124 -461 -668 -372 8 439 624 335 -183 -453 -528
731 -528 -191 419 716 469 132 -369 -695 -318 187 525 736 265 -313 -576 -402 -195 368 670 437 -19
751 -19 -394 -737 -426 215 499 540 227 -378 -671 -467 -42 330 648 327 -218 -478 -579 -348 206 544 510
772 510 188 -313 -621 -442 42 395 662 424 -220 -514 -476 -206 295 623 491 116 -306 -617 -422 100 446
793 446 580 387 -109 -575 -482 -150 278 625 445 -101 -454 -541 -455 76 482 414 249 -146 -611 -535 -160 274
815 274 563 420 -94 -474 -452 -389 106 497 487 131 -180 -504 -461 6 379 521 421 15 -492 -453 -205 149
837 149 616 565 73 -275 -486 -450 32 475 452 303 7 -490 -521 -211 203 559 537 99 -369 -559 -347 9
859IM05N5k71l29l94n5M28M15J88J4l51n23r4J46L82L98J61m36l84j87r1L82N47
882D15O6j05l37l97j35K95L08L43J46l22n06k31P7L14M52J65k21l35l62j83L57
903a96L86K66k1k89m52j45J31J65M60K01k15m53k41j21K42M71K67p5l05m22k33
924e79K68L04L67J26k16m25k57l4K03N95K69k63k60l84j76K25L50K90O7j56m73
945a59k93J04K34L63L36k36l26k83k63K37M39K75o0j87m51l01J32L98K47K80k28
966B58l22l26n0J17M08M01j09k31l36k57P6L67L31J71j88m17k32O5P1L50L22p1
988C98k58l00k82Q2M73L08L2j50l53m01Q8L13K40K76r0l82l55mn0M14M01mj89
1011B07l20l70K1L84K78K23j08l48k90o8J29K96L22P2k95l46k21K9L33L79J10
$$ plain form
859 9 414 469 198 -131 -525 -580 -152 263 451 465 114 -409 -503 -357 25 423 584 148 -236 -423 -514 -132 415
882 415 481 376 39 -358 -493 -198 110 453 599 277 -229 -460 -383 -69 383 548 327 -8 -370 -553 -196
903 -196 190 456 435 146 -306 -451 -320 -155 305 506 291 -162 -403 -524 -282 189 456 381 76 -346 -579
924 -579 -311 -7 360 486 270 -155 -412 -446 -243 352 621 358 98 -286 -462 -237 113 403 470 314 -159
945 -159 -452 -348 -114 249 585 349 23 -260 -523 -286 153 428 368 181 -270 -571 -439 -41 206 486 258
966 258 -64 -390 -440 -323 85 486 377 146 -190 -447 -371 -4 327 498 310 -107 -339 -274 -203 147 469 398
988 398 140 -160 -442 -360 113 421 453 303 -50 -451 -363 -50 190 466 376 -6 -361 -365 -415 -1 400 396 207
1011 207 -113 -483 -462 -78 200 423 315 -33 -323 -391 -262 34 356 428 133 -213 -434 -405 -72 307 417
1032D17n3l48l96kK46K41K96P9l38l68p8m3K78M47K3j06k73l08j44K98K60K98
1054D26Pl70l74q2J18K51M14Rk24k86k20q1K38L89J47q7k23l49j80K61K70K55
1076C09J29k82k76j94mJ67L80J36j05k00l34j32K18K96K00J01k13m04j76O1K44
1097g9L32K14k38k22k71j21J84L15K51o2r1m56j29J43K14K81K02k41l61j46q3
1118c64J59M35P9j29p2l47j91J72K63J90J89j05l61k11l0J65L30K61j92j79k53
1139a91j68J44L07J85J05j52l95j43L2J91L48J49j31l35k21n9J22L04J77L9j72
1160A36k24k70J13J99K32J21j5l32k05p4J18L01J99N0k58k33j85N4K92J89P9K3
1182C10l38k65M0P9L25J69Mk54j87j68L5K47K34O1j06k88j93M4K12J99Q9O1k77
$$ plain form
1032 417 364 16 -380 -382 -136 105 401 480 142 -226 -304 -347 -69 378 401 295 22 -286 -430 -132 128 426
1054 426 433 63 -311 -393 -275 -24 390 399 175 -111 -331 -412 -174 215 362 275 52 -297 -477 -216 54 309
1076 309 438 156 -120 -314 -318 -151 229 365 260 60 -274 -406 -188 108 308 409 196 -208 -384 -323 -79
1097 -79 253 467 229 7 -264 -385 -201 114 365 303 212 -244 -373 -230 -16 265 467 226 -135 -281 -364
1118 -364 -205 230 309 180 108 -239 -430 -258 5 195 384 279 -82 -293 -323 -158 172 433 241 62 -191
1139 -191 -359 -215 92 277 382 230 -165 -308 -276 -85 263 412 281 -54 -275 -334 -212 92 269 308 136
1160 136 -88 -358 -245 -46 186 307 292 -40 -245 -319 -201 100 299 349 91 -142 -327 -273 19 208 287 310
1182 310 -28 -293 -253 -174 151 320 324 70 -117 -285 -250 -3 231 292 186 -102 -295 -251 -39 160 249 310 33
1205C3k15j00O4K19L25%j36k71k04j9K34K64Q0m7k66j84n0J40J34K52R6k66k04
1228a21j87RK99K09N0n0k28k65K7J26J93J89J14k04k80j20%K05K99N3j29k24k78
1251c13qL07J75Q1%j85k68l0R7J03K99M8j73k12j17j02K13L43O4o3k18k67j35
1274c61J62K49J86J2j65j97r4r1J79K48J51m3k77j72o8J26K53J25R1k24l00KL4
1297a74J34K22J33j48j58j93j09J68K53J17L3j79k30j31J02J82J94P5j45k03j48
1318b05k1J04K81J54j74r4j72j64O0K99N3J46j11k85r7k7J94J44K03j68j42j29
1340a51j54J15K86J65J6j35j92k57J17J25J70K24j42k64j11j2P5K02J34J2p2l04
1362a53j2m7K28J43N2Lk12k62M4R9K05J44j3j81j25j69N0K28J99j0p8j89j57q
$$ plain form
1205 33 -182 -282 -218 1 326 326 190 -81 -285 -304 -70 194 274 227 -39 -223 -273 -133 1 253 349 83 -121
1228 -121 -308 -299 0 209 259 209 -19 -284 -257 -131 62 251 365 161 -119 -239 -239 -34 265 318 189 -35 -313
1251 -313 -321 -14 161 242 242 57 -211 -241 -144 -41 258 306 133 -79 -196 -298 -85 258 322 259 41 -226 -361
1274 -361 -199 50 236 248 83 -114 -208 -299 -120 128 279 236 -41 -213 -281 -155 98 223 314 90 -210 -208 -174
1297 -174 -40 182 315 167 9 -184 -293 -125 128 245 278 99 -131 -262 -160 22 216 291 146 -57 -205
1318 -205 -226 -122 159 313 139 45 -127 -291 -231 68 121 267 156 -129 -226 -253 -59 85 288 120 -22 -151
1340 -151 -305 -190 96 261 277 142 -50 -307 -190 -65 105 329 187 -77 -188 -200 -125 77 211 223 151 -153
1362 -153 -165 -212 16 159 211 214 2 -260 -216 -117 88 232 219 38 -87 -256 -206 22 221 211 133 -56 -213 -221
1386b21J23J64J60j2k04j83QmJ45K10J6o8j91j72K1J45J86J25Jk97r7jm5K61J61
1411B31K8j48j51j49k9K46R6M3K7j73j92J5J28M1J66jj19j79m5o3K07J49R5j55
1435F8p2j62j07J84O6J64J7j00k14n8L8J55J82R0j33j58r7l2P6K35N3Qj62j76
1459a35l8O5J34J38J08j77j02j50NJ08K33K6p5j47j57p0J39J34R7L1r8j60q9K9
1483a51O0J58Q3p3l7k21m4J48J53P1%o0j92j09J04J01J09P7qj94j15l9J07J69
1507I7R3m9p7j48j18J21J13J20Q0j20j61l7n3J21Q5J38p6j24j28m2M1J67J06p3
1531G6J1j15j42L6R0J16Q9n7p7j30m3O2J50J04m6k0j67j25P3J19M4J04j4j53j18
1556a33kM0J72J30Mj40j26j04J5J59J32K7mj92r9K0N0O5J67m5p8j37m2n6J89J23
$$ plain form
1386 -221 -98 66 226 214 10 -173 -165 -169 -24 186 202 134 -57 -229 -208 -63 123 248 249 -48 -145 -146 -191 70 231
1411 231 259 111 -40 -189 -218 28 124 167 194 21 -171 -156 -28 13 179 178 59 -120 -165 -228 -21 128 223 68
1435 68 -4 -166 -273 -89 -23 141 158 58 -156 -214 -176 -21 161 251 118 -40 -137 -169 -93 142 195 203 41 -135
1459 -135 -173 -108 26 164 272 95 -7 -157 -152 -44 189 215 140 -7 -164 -234 -95 39 136 167 69 -91 -180 -151
1483 -151 -91 67 150 77 40 -181 -225 -77 76 147 147 87 -105 -214 -110 -9 100 177 169 -25 -140 -179 -72 97
1507 97 190 141 64 -84 -202 -81 32 152 232 112 -49 -86 -139 -18 67 205 129 5 -123 -165 -124 43 149 76
1531 76 87 -28 -170 -134 -44 72 161 104 27 -103 -146 -84 66 170 124 104 -63 -188 -115 4 48 152 138 -15 -133
1556 -133 -135 -95 77 207 211 71 -55 -159 -144 15 147 174 170 -22 -121 -101 -51 14 181 136 58 -79 -121 -177 12 135
1582A35rj01l6j89J07K4J01O7N6j82j27O1m4J59J42n5q2p2r0MJ11J41M3nj72r0
1608a03J8MM7J68P3r5j87m4k5K18L0O0k8o4k07J0R5J17R4j6j18j15j7n5J25J34
1634A19Jp4o9q5r8J73R5N6J2o6j57o8K4J23J57J5r2j05n3J4O6J32o3R4j06j16
1660g1l6K1J47M1J34j71j35Mk6L4J67P9j35n2j12k2M0J05J26l5j01p0j0l7L1J47
1686F3J09j21j14m9l7K5J67J8K5L2j77r8J08N4N6M7n4n5q4J7oJ21J12j10Lj41
1712h9o2J74j6P6M9m3j39k7qL9P8Q7m9k4m7j19K0J17K2J02r6r0r1KJ48K6N7l4
1740F3p6r9J0j2J72K0NL2k03l2N4Q2K5M9K5p5j42L7PQ9J09j08L3j07p5M7M4J10
1768H4K6j3j19l7k1J6J08O8k5p0r6PM1L0P3k2l0p2l0J8L8P1O9m5m9j36P5J6JJ14
$$ plain form
1582 135 126 25 -11 -200 -93 -69 32 99 155 -27 -154 -93 -137 22 164 109 27 -45 -135 -131 -20 121 164 159 -13 -103
1608 -103 -85 -81 -34 134 207 112 -75 -119 -144 74 104 164 136 72 -135 -125 -30 87 181 165 47 -68 -85 -140 -15 119
1634 119 120 46 -23 -108 -206 -33 62 118 130 64 -93 -161 -137 -14 143 158 66 -39 -92 -78 -12 120 57 151 45 -71
1660 -71 -107 -86 61 102 236 65 -70 -66 -92 -58 109 188 53 1 -111 -133 -93 12 138 103 2 -68 -78 -115 -84 63
1686 63 172 51 -63 -112 -149 -124 43 61 86 118 -59 -157 -49 5 61 108 54 -1 -85 -68 -74 47 159 49 52 -89
1712 -89 -151 23 7 83 132 89 -50 -77 -85 -46 32 119 70 46 -1 -120 -100 17 39 141 45 -45 -136 -134 14 40 97 63
1740 63 -13 -112 -102 -114 58 78 83 115 -88 -120 -66 16 41 90 115 40 -102 -65 -58 31 140 32 65 -42 -117 -70 -26 84
1768 84 110 97 -22 -59 -80 -64 44 112 87 17 -79 -72 -31 -1 72 50 20 -52 -82 -64 -26 45 114 69 20 -116 -41 -25 -24 90
1798I0M1r6l7j9o9N2J28Op2m0j07N7P2j8N5L1l9q4l5mN1N9Q8Pp9j02j0K6Q2P5
1828A09m6j6p2p6lJ18j5R1m1m3j20L4P1L6K9m3Jj05J9K2P0j4J40j16k6%o0N5N3
1857E2L8j0l8q6q0P6N9O0K4l0o0j5r4Q2O5L0n1j0k7p6J6J65m6k9p5ml8L7P7J3
1887B5J24j27m9n8Q8Oj3K9m9Q2j39L1K0K7L3N5p9o2OjN8O7m9M2k9j38K4J6O3O7
1917G0L0n2o8l6J1K4MP2l6l0m0k9Q6O2Kpj0l9o2k6M4J0J6J03j27L3q9L4JJ05m
1948E2n5mm9M5M2jL6jo0o1m8J35oM1m4q3N8k2j1L2O8j3j1m6n0J4J2KN4Qm9k4p
1981d6JO2J7L8j8j07j0n0Q4O2R3k9j33l9L5Q4oM1lj27L9j2k5OK3M3On8o8R4M1
2012C8n2R1m5l8mo3jR3PpJ8nj32L2M9P4n4O1o2o1O7k6O1k2O0j0j04k4M3j3L3P8
$$ plain form
1798 90 131 35 -2 -21 -90 -38 90 96 24 -16 -123 -66 6 -12 43 74 35 -49 -84 -88 -37 22 110 117 38 -64 -74 -48 34 109
1828 109 63 47 -25 -101 -104 14 -1 90 49 6 -114 -80 -9 27 56 13 14 -91 -72 -50 20 6 146 30 4 4 -56 -1 52
1857 52 90 80 42 -44 -124 -48 11 71 95 65 5 -10 -104 -22 43 73 22 12 -15 -91 -75 90 44 15 -60 -64 -102 -65 12 25
1887 25 149 22 -27 -85 3 9 -4 25 -24 58 -81 -50 -30 -3 30 85 6 -56 -50 -51 7 74 25 67 38 -100 -76 -60 3 70
1917 70 100 48 -20 -56 -45 -21 -17 55 19 -11 -51 -80 6 68 70 63 53 14 -48 -74 -30 -20 -4 99 -28 5 -84 -50 -49 56 52
1948 52 -3 -7 -56 -11 31 30 66 65 5 -56 -104 31 25 66 22 -61 -3 -25 -36 -4 64 51 40 -6 -56 -42 -30 -28 26 34 -15 -39 -46
1981 -46 -45 17 34 72 54 -53 -63 -113 -29 33 126 97 -36 -75 -40 44 38 79 76 -51 -12 -24 -49 -43 -20 23 29 -29 -97 -3 38
2012 38 -14 77 32 -6 -10 -73 -74 19 26 19 37 32 -100 -68 -19 55 1 62 0 -61 6 -20 41 19 79 69 -35 -59 -16 -29 4 82
2044H2m1m3k2mO4nl6QPQo8n5R2Q6n5mo1P1o8K9K7K6L9o1j2j0Ok6O8l5Nj4po7O1
2079a5M7L3L3l7p4m1K3MN5ll1K3l5l0J01j1N5n4k1k2k5M9J9RQm2k4o8O0j5M0q
2111Ck6L8l7n4K9P6K1j0j6q3RL8M6n9J02k5m5k2k2N5Loj0j5Jm8Q0M5J4qm2p6M6
2144Bk4L8l9O0J0k5Rn1MK9L0l1K5Rr6L4n1J05L1n8M9r4L4l2K4M3k5k3K1o1mM4
2176a3O5l0L8l9j4m8M6j4O5k3j0Jn8M6mj8M0%J5m8M1j5J7k8%K1j6m0j3M8J1n0
2208b7M2m2m0Q1m1O2n5K3K4j10O7k6N7P1k8n2j02K8O4l3Q5Om4o4L9J6j1Q5l4j1
2238C0nm0N9o1J2L2j4j%o1NJ3L5JK7j4k6j3m4R9o9N0m2j3K7l7K0O0M4n8j0KJ1
2271A9p5Q7k2K1K0o5K4K9m5J05m7o9Nk0L9J9l0M2l9j9o3Q1Q6k5k3k1Qm5R8m4m7
$$ plain form
2044 82 41 -2 -24 -28 36 31 -5 3 10 18 -50 -105 -13 73 18 14 -47 24 -44 -15 12 38 77 16 4 -6 0 -26 42 7 12 -2 -9 -76 -15
2079 -15 32 65 98 61 -13 -54 -31 -27 28 25 -6 17 -18 -48 53 42 97 43 22 0 -25 24 43 52 60 18 -6 -74 -14 -29 11 3
2111 3 -23 15 -22 -76 -47 29 50 40 24 -59 -50 -12 34 -25 77 52 7 -15 -37 18 21 15 5 -10 -9 -57 23 68 82 74 32 -44 2
2144 2 -22 16 -23 37 47 22 31 -20 -16 13 43 12 37 46 -50 -16 -67 38 69 11 60 -34 0 -32 -8 35 10 -13 8 -53 -57 -13
2176 -13 52 22 60 21 7 -41 5 -9 56 33 23 24 -34 12 8 -10 30 30 45 -3 38 23 40 12 12 33 17 -23 -36 12 23 -27
2208 -27 15 -27 -67 14 -27 35 -20 3 27 -83 -16 -42 15 86 58 6 -96 -68 -4 -37 48 54 10 -54 -15 1 -10 75 41 30
2238 30 25 -15 44 -17 -5 27 13 12 12 -49 -44 -31 4 5 32 18 -8 -21 -65 34 -35 15 -27 -40 -13 -50 -30 30 74 16 6 8 19
2271 19 -56 31 9 30 50 -15 9 38 -7 98 51 -18 -13 -33 6 25 -5 37 -2 -21 -84 -3 83 58 35 14 22 -23 75 31 -16
2302a6PM0J6l7n5L0j2K9m8L2m5K2K8%L9l5j4J7pj2m6M0Q1l6L6n7J1j2NKR6p6o8
2335d5O1m1M4m8O5l8pk0N5j22J21n1nK6J6j1l9L5L4M0j01O8J0n0O2j5n0O4np6
2365b3P5l7k8M3j0j6qK3Mm0RoJ9K4j6J0j9j0M6rJ0k2J2l4J8n5K3L9Qk6j7Mj3M8
2399B6K6o1Jj9K6L1kk7mok1L5j2K2J8o9M9m7L4j4rN3P6q8m3l0J9O6j7k1L0k8J8
2432A2J1m0J4Pk6Q2l3k2rM1n3PK1L5n5n2K7k0J09qpr1J2K9K2m1N2K2o3L2j8k9
2464c2M8k6N9m1Oj2j2l1K5O2l3K9n2J1lJ8llj8P6m0l5M0m2QP4j26N1j4m3O4l8
2496c3MM2k3k1J2L2J4KL6n4Km6M0j5j6K9J0rJ6nL2J8p3oK3l1K5J0lL9pm8LlK7
2531B3ql5J0J2K6q8M5nM2m%m5M4Rl0qM1l6K1K8o9K4J5k0jK2NJ6n5L0k4jm0O3j1
$$ plain form
2302 -16 -9 31 47 10 -45 -15 -27 2 -46 -14 -59 -37 -9 -9 30 -5 -19 -2 -9 -21 -67 -27 54 18 54 -3 8 -4 1 3 99 23 -45
2335 -45 16 -25 19 -29 36 -2 -9 -29 26 -96 25 -26 -31 -5 11 0 -39 -4 30 70 -31 37 47 -3 59 44 -6 58 53 -23
2365 -23 52 15 -13 30 20 4 -4 19 23 -17 -8 -14 5 29 13 23 4 -6 40 31 41 19 31 -3 15 -40 -17 22 30 4 -13 -9 -22 26
2399 26 52 -9 -8 -27 -1 30 28 1 -3 -9 -30 5 -7 15 33 -36 13 -34 0 -14 -23 30 106 18 -25 -55 -36 30 13 -8 22 -6 12
2432 12 23 -17 -3 4 -22 60 27 5 -4 37 -16 -9 12 47 -8 -60 -33 -53 56 48 41 -50 -38 -9 13 -28 24 46 -17 15 -3 -32
2464 -32 16 -10 49 8 14 2 -10 -41 -16 46 13 42 -10 1 -2 16 13 10 -8 68 28 -7 33 -9 -1 73 -53 -2 -16 -59 5 -33
2496 -33 -29 13 -10 -31 -19 13 27 29 65 11 13 -33 7 -8 -24 5 15 6 22 17 49 67 -6 -12 11 -20 5 15 12 51 44 -4 -1 -4 23
2531 23 15 -20 -10 2 28 -60 -15 -20 22 18 18 -27 17 26 -4 -12 29 -7 14 42 -27 -3 12 -8 -9 13 18 34 -21 9 -15 -16 -56 7 -4
2566dN0k7q2O2N9q7K4K7M6o6J2j9M6k3l2K0m3N7k1K2lj8j1K1j8l8K3K5KRk4m7
2598e8L6J7PJ0m4K7l9j3O4P7p6j3j1Q7o5kj4j0j5j3K6N7n8R0o1K1n1PL2R6r1K3
2630D3k4J8j01N5N2o1N0m4qJ9qPpk0L7k1qk3K2L8m2j4J6K9Ll9N9m3J0j1J11q7
2662Hk6o2J09J3l3J6J0m1M4m4L9k8L5n0NK4pj9lJ4L6n3J5J7mj1K9o3M7M2p4Po
2695a4L8m5O4n2qP6o2M3nk1l4M1l1%M6Qo3N5m9K4%k7L5n7Q2m0J0K1m2J3R6j12
2727a0L0j3J8q2N1N3m0J8Ql5Ln4M5M2rJ0k7np6R5j05R5Jj7rj6P5o2M3J9k8l7n0
2760f9O6K9j8L9n7K8Pj0l3O8M2r8nK2l6L1j9oLL6l9j8J2L0NJ7p6L1K4l9M7L2n9
2793a3N2Qj07lJ7N3Rk8M2n6LL4m3N9j2M4k6no4L0J4j7J1k3K2pL5m8M7L6l7q4M3
$$ plain form
2566 -4 46 19 -63 -1 58 -29 -5 22 68 2 14 -5 41 18 -14 6 -37 20 -1 21 18 0 -11 10 -8 -46 -23 2 4 13 -11 -58
2598 -58 -22 -5 2 12 -32 -5 -44 -57 7 84 8 -5 -16 71 6 4 -10 -20 -35 -48 -22 35 -23 67 6 27 -24 -17 15 111 20 43
2630 43 19 37 -64 -9 43 -18 32 -12 -20 -1 -9 -2 -9 -29 8 -13 -21 -44 -22 16 -26 -40 -24 5 8 -31 28 -15 -5 -16 95 8
2662 8 -18 -80 29 42 9 25 35 -6 38 -6 33 5 40 -10 -5 19 12 -7 -10 4 40 -13 2 19 15 4 33 -30 17 59 -15 -8 -14
2695 -14 24 -21 43 -9 -17 59 -3 40 35 14 -20 21 -10 -10 36 44 -19 36 -13 11 11 -16 19 -38 44 4 14 35 -7 6 102 -10
2727 -10 20 7 25 -57 -6 47 7 25 33 -2 1 -53 -8 34 25 35 8 3 -73 22 -83 12 13 -4 -13 -29 46 -16 27 46 18 -19 -69
2760 -69 -3 26 8 47 -10 18 25 15 -18 50 92 -6 -11 11 -25 6 -13 -19 -16 20 -19 -37 -25 5 10 27 -49 -18 6 -33 14 46 -13
2793 -13 39 47 -60 -63 -46 7 16 -12 30 -26 -23 11 -32 27 15 59 33 28 -36 -6 8 -9 2 -21 1 -6 29 -19 28 64 27 -57 -14
2826a4jj7QM9J5j1n7P9p8L8l6K8OoK0K0j03N9K6p2K5K8l9j6P9lm1j0J5J0J4n1
2858c6J8N7j0m4J3jl2J6jO1k9Qk1j5k1M8K9k7J0m7M1J7Lk2j8k9MN3j6n1L8%m5
2891d9L3K8K4j2m0L4K8n6j8k5RR9n4k4N7rLn3J6M5OJ5r4M8k8J5l5j8P7j4K0l2
2923dJ0qK6j3j5L3j6m5L5nJ5j7m2J9kl2Q1L0rj9l6J4K7k4lL2K9ln6j2K9l3N0l3
2957CP0p7k7J8MN1ol6N3ooK7j8n3l6L9jJ3m6O4l5QL3k4l4L7Lp3L7M8mn3N5m7N2
2992C3j2k4L0p1J6N0q5R5Ql5n1L0O2k9M1j3mjk0qj5RkJ4L5j35R7%oj7L9n8nO1
3026B9k4j0N2m2o0N4J3o9K7N3J8j0k7k1L4J6j4j8m6L1qN8l6l4j1L0P8p7L3K2k9
3057A2K4k8jQPk6O5q0N6m8L2KNo0K2J1Rl7l6P7L6p8P5k3Pklk4j1M5k7J1m8Q4m0
$$ plain form
2826 -14 -15 -32 -24 25 40 29 -28 51 -27 11 -25 3 9 3 23 43 -60 -1 25 -47 -22 6 -33 -49 30 27 -14 -24 -9 1 15 -36
2858 -36 -18 39 29 -15 -2 -3 -35 -19 -20 41 12 20 -1 -16 -37 11 40 13 23 -24 17 34 37 15 -3 -32 -28 25 9 -42 -4 -4 -49
2891 -49 -16 12 36 24 -16 18 46 -10 -28 -53 -44 55 1 -23 34 25 28 -25 -9 36 42 57 -37 11 -17 -2 -37 -55 22 8 28 -4
2923 -4 6 -2 24 11 -4 29 13 -32 3 -2 13 -4 -46 -27 -29 -61 20 50 41 22 -14 0 27 3 0 32 61 58 2 -10 19 -14 36 3
2957 3 73 -4 -31 -13 -9 42 36 0 53 47 41 68 50 -3 -39 0 -1 12 -34 30 -5 3 36 12 -22 15 18 -55 -18 30 26 -27 28 -19 33
2992 33 21 -3 27 -44 -28 22 -63 32 40 5 -46 -16 46 17 58 45 41 40 20 12 -3 6 4 18 53 -82 15 15 9 -8 31 -27 -32 29
3026 29 5 -5 47 5 -55 -1 12 -57 -30 23 41 31 4 -17 17 33 19 1 -45 -14 -22 36 0 -34 -45 -15 63 -14 19 41 12
3057 12 36 8 7 15 22 -4 61 -19 37 -11 21 23 28 -32 -10 1 10 -27 -63 14 50 -28 47 24 31 29 26 2 -9 36 9 20 -28 56 16
3092A6km3RJ0L3l3PL2k9N1Jn2N8o7J5k7N0o0K1n3J41p6L4j3l0L9l6j3K4lJ9kn0
3125b9j3M9K0q7R8k3l4om5Q2q2P0J1K5Pl7J4m0k1Q0k6J2k8J6M0o8K8P9m3o6M7
3156C0j5j0%j1k6M6j8K9l9K8l2L0j7pP0l9k0lPK0k4K6rj1m3oJPQ6p0kO4l4m6N1
3191A3Mk8lM8k1N1l0%l0ON3n2j1L0jo7L4K0m7Q0r4L0NoJ7J2n6L4j8L5l7M9k5J
3225dJ9m7K1k1P0k6K6j15Q3J4L3n2J9Oj6n1N9l4P0k3o6O0Jj2L1%p3O5j3k9Q0m3
3257C2n2N7p5O7l6L4n6M4lk8J7Rl6kK2K0Lo6L6L9p7L7Kp0J04j1m1K3n9O3PnOM
3291IJ1l6L1l2jN3m4N0m8%K3K2o6O3k1L6p9L2mJ3n3L0J8k6J0RM0l8K9j5jJ6n8
3324b7K0nL8k6j7K9K1o3M5n5P3l1K1p7M3K7L8o5PJ3J1m5L4k0L7j03M1N3om6M5
$$ plain form
3092 16 14 -29 -20 -10 23 -10 -3 29 0 51 52 0 58 -9 6 -21 29 -31 -10 -63 78 2 36 23 -7 32 -4 -17 7 4 23 21 -29
3125 -29 -42 7 27 -60 38 15 -19 -25 -70 12 -70 0 11 36 43 6 20 -20 -41 39 13 25 -3 13 53 -15 13 92 49 -17 30
3156 30 15 5 5 -6 -32 14 -4 25 -14 14 -18 12 -5 -12 58 19 -1 -4 3 23 -1 25 16 5 -38 -44 -43 -36 50 -20 -22 42 8 -38 13
3191 13 17 -11 -14 34 13 64 34 34 4 10 63 11 0 30 29 -38 -4 16 -31 49 -45 -15 -10 -16 1 13 -43 -9 -27 8 -29 20 -5 -4
3225 -4 15 -32 -11 -32 38 12 38 -77 6 20 53 1 20 26 10 -41 18 -16 54 31 -35 25 26 14 45 45 -28 37 24 -5 75 32
3257 32 -20 37 -38 29 -7 27 -29 15 12 -16 1 10 -26 -28 -6 14 17 -49 -13 26 -51 -14 -12 -82 22 11 -30 -7 -66 -3 4 -1 5 9
3291 9 20 -16 15 -17 -18 35 -9 41 -7 -7 16 38 -28 35 14 50 -29 3 -1 12 -41 -11 7 -19 -9 0 40 2 31 16 15 31 -27
3324 -27 -7 -12 26 0 -17 12 33 -30 15 -40 33 2 23 -54 -11 16 54 -11 -4 9 20 -25 9 -11 26 -77 -36 17 11 -35 10
3355A0L0l8P5j15J8k0QO0m8k0L8j1K0k6J9nJ2M6J1p2J8l9N1l7k8K7K2k3JJ6L8
3386C8o1L4N8p9L1K7n9l4N2Mp8J03m1K9n3J3M4n3NM2l4l3M2n6N3nM3k9K1mk9P
3418blL8j8rL2l9qj5K9Rk1L0nL4l2j3P1l7Pm5J6k5l8M5j8rK6Qj3N8k5j1j6K6J
3453B8L1n0l2j2N3K6l1nM4o1P1o6Oj6k8K6O0o6n1P0J1M8q8L5k4M3L9o5k5O5k8
3484Hm1K8nM2o1P6p5j6M9N3p7J7LLM2l8Mk6K4j6J5L1j01Q7o7K8L4r5J16l8npl5
3517d3L2M7k7k1KMK2K3n9L8j3K9np8M2KJ4J8K3m5l9R8l9K1Kn8J6l4M3j5J9l3N4
3550D0j5nm0k6O3oo8P9q2J1M3n5O7K6m2k8L6l4L4K0Ml7JO4m2l6J9Kn8J26m1j5
3582Eo6J2Q5m8J5l0O0pK2Qp4N8m3j3K1j3k5Q3j00K6L0K0J3o1nL3Pm2RL7K2j03
$$ plain form
3355 10 40 2 77 -38 -20 -40 -32 28 -20 -40 -2 -13 7 -19 0 -5 7 53 64 -8 10 -29 22 -15 -43 -16 6 -17 -16 0 38
3386 38 -23 11 69 -10 21 48 -11 -45 7 11 -67 36 -5 24 -29 -16 28 -25 -20 22 -12 -45 -3 -59 -6 -11 32 3 24 20 -9 -2
3418 -2 -5 33 15 6 38 -1 -9 -24 5 14 -7 23 18 52 20 7 78 41 48 3 19 -6 -44 1 -17 -26 0 8 -5 53 28 17 1 27 28
3453 28 59 9 -23 -35 18 44 13 8 52 -9 62 -4 2 -14 -42 -16 44 -22 -73 -3 8 56 -32 3 -21 22 61 -4 -29 36 8
3484 8 -33 -5 -10 32 -29 47 -28 -44 5 58 -19 -2 1 4 46 8 12 -14 10 -6 9 40 -61 26 -41 -13 21 -74 42 4 -1 -8 -43
3517 -43 -11 36 9 -12 -10 -6 16 39 -20 18 5 34 29 -49 -7 -5 9 27 50 5 -34 64 25 46 48 -10 6 -28 15 0 19 -14 40
3550 40 25 20 -20 -46 17 11 -57 22 -60 -49 -6 -61 6 32 -10 -38 -2 -36 -2 18 22 -15 -14 50 8 -28 -9 -7 -65 61 20 5
3582 5 -61 -49 36 -12 3 -27 33 26 48 56 -18 40 -3 -16 5 -8 -33 50 -50 -24 6 26 39 -22 -27 6 13 -29 -20 17 39 -64
3614f4M6J1K3jj7kK4K1n4J2kM1j0l6M1L3l0J9m3k8K2K1Ql9K1nl4o8R8o2R3nl8
3647dn3K6P4m2L1kj4j9J3m0JJ5K6L5l7jn7P3l7K0M2n6K0rrJ3m4M5k0o5R6Qj5j9
3681eJ4LM1K3p2OJ2l9Q9n8K3k6Pm5N0Ko3J05m8o0J8jL0K4pm8rrO8k9K5q9OL7P5
3716E0l1qn6QO6l8J0Ol7L1M5j5J6o0M5k9O9r4M1qK3o0K6L2%l6J9k4RM8o9J9QK8
3750C4q1R4o9K1j4J3N6j1mp3OK4J3nQM3Lj18Q7o9L5O0k6K4mJn0jk7M9P4q4pM7
3784D9j3j2%j1j5mKj7rK7N8r8M9K1m7kj1M6m8J2Rk3L6KK7n3J1k6N8J9K7p8O9k2
3818C3o0J7k7POR9n7J6j5j6k4L3p2J44j00N5m1pP0m5k4N0j5n6M3m5m0J14k7lm8
3849c5J2k8P5m2J9L5K3n6k9L8JJ4n5M3j5l4O1L4o6L2K8k0o9Q4l1J2L7q7N1nRq6
$$ plain form
3614 -64 -18 -7 16 15 -2 -4 20 41 -13 -1 -3 38 28 -8 33 66 36 55 12 -16 6 27 35 -4 17 12 -22 -90 8 -54 39 34 -4
3647 -4 -57 -31 43 1 32 30 16 -3 10 -30 -29 -14 12 47 10 9 -48 25 -12 8 50 -6 14 5 -4 9 -35 10 -10 -75 21 29 14 -5
3681 -5 9 12 53 76 4 10 22 -17 72 14 37 11 18 -27 23 25 -38 67 19 -41 -23 -24 6 30 23 -25 -34 -43 25 -4 21 -68 -62 -25 50
3716 50 19 11 -45 -37 29 -9 1 7 -30 1 46 31 47 -13 32 3 72 -22 19 11 34 -26 0 32 32 -4 15 -9 0 48 -21 -2 6 34
3750 34 -47 47 -22 -1 -15 -2 54 43 39 -34 -28 -4 9 4 12 55 58 -60 27 -42 -7 53 27 51 47 48 -2 -3 -30 19 93 9 2 49
3784 49 36 24 24 13 -2 -6 -4 -21 -30 -3 55 -43 6 27 -20 -22 -33 13 -35 -23 -14 -37 -1 1 28 -25 -14 -40 18 37 64 -14 55 33
3818 33 -27 -10 -37 -30 -24 75 18 34 19 3 -21 12 -60 84 -16 39 -2 -9 61 16 -8 42 27 -29 14 -31 -71 43 16 13 -35
3849 -35 -23 -51 24 -18 1 36 59 3 -26 12 13 27 -28 15 0 -34 27 61 -5 27 55 35 -34 50 19 31 68 -19 32 27 36 -50
3881e0NK3L0N0n0jm4m5K3L9Qj1L5Pl8K7j0L4o3Pk3R3o0lJ4K4K2l1j7rlJ4k5N6
3915B8j5nj7M7k1J8k8j1l8P3qk8K2j5k7O2j3n5KN8k2k5K0l9kj8J28o5PO5p9k0
3947b1Rk6P2j9k7j5O1n3K9j5K1P0n2Ok9j%LrO1m1l6nO1j2m0N4l8JJ5n2M3j8K9
3981B6Mk8l6L9k1M5l5K4j6j8J6j2l5j9J04n2kJ8MnjK2l1k6j0L0jk5L8N5m3J3m6
4014b4M9MJ9n6N0n2M8nn0K7J7k3kJ3m0K2qk1M6L4n7K3K2j7j9l9K5K8J8j7rK7k3
4047A0K4m2J8k9L8j3k6M8J8l0j2J8J1j6K9k7J0m1K4j6J1PJ7n2m4P3k2j8M2qNj5
4079hl6R6m8o4j2L6qK3j7K9J0J5l3J4l5J11j38O7l6J2M8K7m8p1N5%m1K1M1j7n
4110a2m3M0O3J9l4l6M3j7l5K1j4O5j24L7JK1j2J1j2K6J9Lk9n2O9m9OJ9k4N2J3
$$ plain form
3881 -50 -45 -22 8 58 8 7 -37 -82 -59 -20 -12 -23 12 19 -19 8 -2 32 -31 -24 -47 46 -14 -17 -3 21 43 12 -5 -14 -17 -3 -28 28
3915 28 13 8 -9 38 17 35 7 -4 -42 31 23 -5 17 2 -25 37 24 -31 -29 29 7 -18 2 -37 -39 -57 71 6 13 78 -1 -21
3947 -21 -12 -38 34 15 -12 -27 34 -19 10 -5 16 86 34 40 11 10 10 13 4 65 24 -12 -17 44 32 -8 46 8 9 24 -28 15 -3 26
3981 26 30 2 -34 5 -16 29 -6 18 2 -16 0 -12 -47 -66 38 -14 -16 2 6 1 0 22 -9 -35 -45 -15 -16 -41 -3 52 9 22 -24
4014 -24 25 29 48 -8 42 -10 38 33 -17 10 27 4 2 15 -25 -3 -11 -32 14 48 -9 14 36 19 0 -39 -14 14 32 15 6 33 10
4047 10 34 -8 10 -19 19 6 -20 28 46 16 4 22 33 17 46 19 29 -12 12 -4 7 14 31 -21 -65 8 -14 -32 10 2 7 -8
4079 -8 -44 52 4 -60 -72 -36 -44 -21 -38 -9 1 16 -17 -3 -38 73 -65 2 -34 -22 26 53 5 -66 -11 -11 -52 -31 10 -7 -12
4110 -12 -55 -15 48 67 33 -3 40 23 -12 9 -5 60 -64 -27 -26 -5 -17 -6 -18 8 27 30 1 -51 18 -31 -25 -6 -30 22 35
4141C5j2n4QL3oJ5O4r3Jj4K9Km1N7j4L9q1P7kp0O6l3K5o8j4M1L4k8km2N4j3rj
4175a7l9N8j3nK5n8J2N5j3r4J17j8k0N2j8Jm0k0J1M0j8L2j1o4P2o7L0JqR7m6o5
4207c1lJ9M5Jm0MrJ4j1kj6M9K4Po0k2oOn4P6O2j00P7l4k6oK2l1MK3m5K4KM5o1
4242e3L6N9o0nkN5J3m8k4O9j3o4J14p2pK9on1J3QqR2r6k1P5n3M1m4M7j1%j1k4
4275b2n8Q4J4n1N4k1Pn3M4kM8m2L0m6l2M3%M3n0j4J6N6p7P3n0%M6j1k0p9N0O5
4307D5j8k1O5p7J9J2oK7o4L6o0K8j4k2R8k2K4p1Oj3l0O8Nj9J6K2p7J7OM1j4k4
4339a7j2N0m6O3o5J6j7k8J00k9m8R4m7j0Rm1K6K1l4P3k6n6L0Nk2J2Mk2N8rm0N5
4371D7J9j8m5l8Kl3J11o7K2j4K6j3jK4k6%K4l6K1Jrj5J7OJ5K2k1M5j08PkM4jj4
$$ plain form
4141 35 23 -31 -23 10 4 19 83 -10 -9 -23 6 8 -33 24 10 49 -32 45 43 -27 39 6 31 -37 -51 -10 24 -4 -6 -48 6 -7 -16 -17
4175 -17 -56 2 -11 -16 9 -49 -37 18 5 -89 28 10 -10 42 24 25 -15 -35 -24 16 -2 30 19 -45 27 -40 -10 -9 -17 80 34 -31
4207 -31 -34 -15 30 31 -9 -5 -14 0 -11 -13 -29 20 44 51 -9 -31 -37 -31 -85 -9 53 -47 30 -4 -30 -36 -14 -45 -41 -18 -63 -39 -37 8 -53
4242 -53 -17 42 -18 -23 -25 30 43 -5 -29 40 27 -37 77 5 -2 27 21 -30 -17 -9 -17 75 -21 -42 33 -20 21 -23 24 13 13 2 -22
4275 -22 -80 4 18 -33 21 0 7 -46 -2 -4 44 2 32 -14 -46 -3 -3 40 -10 -24 -8 48 -29 44 -6 -6 40 29 9 -70 -20 45
4307 45 27 6 71 -6 13 25 19 46 -18 18 -42 -14 -28 -50 48 26 50 -21 -15 -28 -58 10 15 -4 12 34 -43 -26 -20 21 7 -17
4339 -17 -29 21 -25 38 -27 -11 -28 -56 44 15 -33 61 14 4 13 -28 -2 19 -15 58 32 -24 6 11 -11 1 5 -17 41 32 -8 47
4371 47 66 48 3 -35 -33 -66 45 -22 0 -14 12 -1 -2 22 -4 -4 20 -16 5 6 -3 -18 -1 5 20 42 21 66 -42 -35 -37 7 6 -8
4405hMM1l9l4Q7k9Nj9j6j3R1q1QJ7n6K8NoL3l1K0nn7R4l5ml5k8M8N4n1rQ0r7K2
4440a6j8M9M8m1J3j1m5lK6k2N5n0LK5k6M0j9M3q3rN4JJ3m4N4J2p1l2P4o1M5l2
4472b8O5k3qPl4JMK8o8J24m4mn4O8n6J4Nj2k8N1j4l0N2MJ5J0mJ4J1o2M9o1K4Q
4506B4j2Lqm5M3nk1OL4m1J05r9oK8O6j14K4L7Mn7K1J5k6M7k3J1Kj6l3Rj1M4j3
4539gj6L2OkK5m7Om9P5l8L8p8P4Ol0P6p2k8J1O1j3j6Nn2pK1j6O9k7k6KQ8o3n5
4573d7J5K8J6k0n8L7Qk2O3m4P2l2l0L2p2J19k2o6L0l2M4N7o1N0k5o1N4l9J4j8
4603a0pK2k3j3K9k5K1j7nN4m4K1n5K2k0LJ5o1M5K7J4K3j7O2k2j1m7Rk4QM0M1l2
4636B3L8q8O0k9m0O4m7K1l6J05p9L0n4Q2nmmj3Mj4L0m1L7k0j9l1Qk2JM2j8K8k3
$$ plain form
4405 -8 -4 37 -2 -36 51 22 27 8 -8 -21 70 -11 -3 14 -42 -14 -9 -15 18 -13 7 2 -55 39 4 0 -35 -63 -15 39 -12 -21 59 -38 -16
4440 -16 -34 15 63 22 35 24 -21 -24 2 -20 35 -15 -12 13 -13 27 8 51 -32 -41 13 14 27 -17 37 49 -22 -54 20 -41 4 -28
4472 -28 37 14 6 13 -21 -20 -16 12 -56 68 24 20 -34 34 -22 -8 -3 -15 -43 8 -6 -36 16 20 35 45 41 55 66 4 53 -8 16 24
4506 24 12 15 7 -38 5 0 -21 -15 19 -22 83 -16 -22 6 72 -42 -18 19 23 -34 -13 2 -24 23 0 11 13 -3 -36 -27 -38 6 -7
4539 -7 -23 9 15 13 38 -9 -3 -52 23 -15 23 -55 19 25 -5 71 -1 -29 -18 43 30 14 19 -33 -40 -19 -35 34 7 -19 -17 71 8 -47
4573 -47 -32 -4 12 -8 -66 -29 -21 -43 20 -24 48 16 -14 18 -54 65 43 -23 7 -25 19 76 15 65 40 -21 33 -6 8 -10
4603 -10 -17 5 -18 -31 -2 -27 -6 -23 -28 26 -18 3 -52 -30 -50 -47 -32 -93 -48 -21 -7 16 -1 61 39 28 -19 -10 -34 -26 14 55 23
4636 23 61 -27 33 4 -36 28 -19 2 -34 71 -8 22 -32 50 45 41 37 24 28 14 44 3 40 20 1 -30 -22 -44 -43 -1 -19 9 -14
4669a4L2lo6M0j9L7l5L0l8K6O1k9m2Qj3K8J1k0KoK5L4n9KL4l9N3K0m0j2Kljl2
4703b6J6L6m4L8k0J5l5j6J5NLm9N1j0KN6n4k0mN6m6L8K0j24Q9%jO7j5l8K8j6J6
4736C3%m1L6l0N4m9M1qo3PM3J1m4qJ1l0kO2m9M6k7N2p9O0l5q5Q0M3l7k0j0RK5
4769dRrN4k0p9O3Qp4K0P5o4P5n4jpJ5k2PL6p0P1%k4J9k9l9O4%Ml1O9n9nk3k4K8
4805b1OL6Nl4K4r1J13m8k4M6j5l8m4J01j0J5n3j2M7L4m5J9l0K5k0K8Mp0J03m4
4835GJ2ML0m7J1j5L0m2oN7k9r1M5L4k7J2O5r4j8M4pN1l5M7q7M1kRK0n7M5M5Qn5
4869EK2n9N4J2j25J27j7p5J11n1j6K9o3R8k4qPMl8m7P7j7j3N1o1J9jol2P6l3J0
4901A6l0K2m8jK3J1K4n3Q1j9p5R6o6J2J6o1J9R5j19mL1K8l8L2j0M2j2k8K8RJj8
$$ plain form
4669 -14 18 15 -51 -11 -30 7 -28 2 -36 -10 51 22 -20 -12 -25 3 14 -6 -4 -10 15 49 -10 -8 26 -13 40 60 20 8 10 7 6 -26
4703 -26 -10 26 -18 20 0 15 -20 -36 -21 -16 -13 -62 -11 -21 -19 37 -17 -37 -41 15 -31 7 27 -97 -8 -8 -9 58 43 5 33 17 33
4736 33 33 -8 28 -2 52 3 44 36 -27 -20 23 34 -10 -18 -7 -37 -39 23 -26 20 -7 45 -34 26 -9 -94 -14 29 -8 -28 -38 -29 -4
4769 -4 5 -4 50 30 -49 14 22 -52 -32 43 -21 54 0 -1 -8 7 -15 -8 28 -42 29 29 5 24 -5 -44 20 20 24 -7 62 3 -2 -25 -49 -21
4805 -21 -15 21 26 -8 16 -75 38 -10 -34 12 -3 -41 -85 16 6 21 -32 -44 3 37 -8 11 -19 6 -14 14 18 -52 51 7
4835 7 19 23 53 6 17 2 32 -10 -16 41 12 -79 -34 0 -27 -15 50 -44 -62 -18 -25 26 -9 38 -49 -8 -10 -1 19 -38 7 52 60 5
4869 5 27 -32 22 34 -91 36 19 -56 55 4 -12 17 -46 52 28 20 27 31 -7 -54 23 6 -7 44 -17 2 1 -5 -37 39 6 16
4901 16 -14 8 -40 -41 -18 -7 17 -36 45 26 -49 47 -19 -7 9 -52 -33 62 -57 -61 -30 -2 -40 -8 -18 24 12 -16 12 21 22 4
4933DL6j8n5J9j9K1K3Rlo3J2N1k7L7j6k9M7n1N3j2k6K2L3l0j4L4m3%OMl7%N7l9
4967a4J9K2%m6N8m3L1m1J9L7l9L6lm6N4j5l4KN9p3J3Oj4j0N7k1l2Ll4N8n2MP9
5000D0rk4l8JM3k5K1lnjK2q4L8L8pl8L0Rk5O8p1JN2L2o7K4nL2n0M6m0RK3l7l5
5035c5K0O0n8L1j7L0l4j6M6o8N4m7M1k7K5L9n2J1m2L9o3P3o3K9K1mk3JR0n7J7
5066B1M0o6J7L1k5lM9k9k0P8p5p2P0m3K6N9q7K7j6K8j9QpjLj8M3j0j9L3m1L7q4
5099f5P6p2N6N5q1L4n0PO5LOJ3pl4K3n6N8l7jL6N4n1Pk1mL6m6N4k8M0p3j4K2J8
5133B3p1O7mk0j%j7L2o4P8n7kL8L2n6lM4N6q2o9O8M4j8j3j7L5L3n5Mk6K3rpOl6
5168d4J05m8lJm8O0k0ql8M9j6j6L3k8J5Mn9N4K1j7oK3j8l5M2p4J20l1o1%K9l5
$$ plain form
4933 4 40 22 -33 -14 -33 -12 11 20 17 -46 -34 17 -10 27 11 -18 29 -22 31 19 -7 15 48 18 4 38 -5 -5 1 5 -32 -32 25 -14
4967 -14 5 27 27 -19 39 -4 27 -14 5 42 3 39 36 -10 44 29 -5 -3 56 -17 -4 2 -12 -22 35 14 -18 -15 -49 9 -43 -39 40
5000 40 31 7 -31 -30 13 -12 9 6 1 0 22 -62 -24 14 7 -31 -1 8 -17 51 -20 -19 33 65 -2 22 17 49 -1 45 5 14 37 0 -35
5035 -35 -15 45 -13 18 1 31 -3 -19 27 -41 13 -34 7 -20 5 44 -8 3 -39 0 -63 10 -53 -24 -3 -7 -30 -29 61 4 21
5066 21 61 -5 12 43 18 15 64 35 15 93 18 -54 16 -27 -1 58 -29 -2 -18 10 -9 -1 -8 -9 -6 -24 19 9 -10 23 -18 19 -65
5099 -65 11 -61 -5 50 -31 3 -47 -40 25 28 34 47 40 6 29 -27 31 -6 -7 29 83 32 39 18 14 50 4 58 30 70 -3 -17 5 23
5133 23 -48 19 15 -5 -6 -6 -23 9 -55 23 -34 -36 2 34 -22 -25 19 75 -7 -76 -8 36 18 5 -12 23 56 1 5 -21 2 -7 -14 -8 -44
5168 -44 61 13 10 11 -37 23 3 -5 -43 6 -10 -26 7 -21 -6 -2 -61 -7 14 -3 -9 14 -4 -39 3 -71 49 18 -43 -43 -14 -49
5200d9M8mk7M5J3o3K3J5K8n7O8n7L0lJ8m3Oj8Q0l0m4L0J7jrn8K5O4m2l2J1j5L9
5233HL8m8L7n3K9JJl7K4pM4o3M2JJ0k9K2o7M7J9o2M7oK8J9k4L6m0m6M3J1M7j02
5266c0J31o3k9J9l3N8n9O5q5J9L5m5J08p8mk5J0K2K6m2l5Q5q0oj3P1l3k3jM9l5
5297b1K0RK6jk3J6m4%J4J7n3Q9p9K9L0m9MQ2m7kNrJ4qk1l6mLNQ2qp6J2RO3j07
5333e9mO9QK0J0k8qn8N3L7l4lm8N8K3l4jJ3j9K3m2R6j10K7j9K5N6r7M5N1l6m2
5365b8L1m9L1M4k3PJ6r%K0o5L1Nk2O3p1kl4L6j7L4l2O6n5L8oj7P0j00J5pNM0L7
5399E2J0q5O3n6kJ7qk5J8pM9l3K6l6JN4J2k9J2k2LJ0k3j4M1Mj7l4L7J8j8%p4N9
5433Cm7N3n6L6jNK6J1j2j8j2J6qL2k4k0J4J3J3k9k3K2J1%K9plQL2p8K0j9K4J6
$$ plain form
5200 -49 -1 -5 -32 13 26 -37 -14 1 29 -28 40 -17 13 10 28 -15 -9 -27 53 23 -21 9 26 25 16 -42 -17 47 5 -27 -16 -31 8
5233 8 46 -2 35 -18 11 12 13 -24 0 -7 37 -26 16 17 27 -2 20 -47 0 19 -43 4 -2 26 45 21 57 17 -29 14 25 72 -30
5266 -30 101 38 9 28 -5 53 -6 59 -26 -7 28 -17 91 13 9 -16 -6 16 42 0 -35 50 -30 -36 -49 22 -11 -34 -35 14 -21
5297 -21 -1 8 34 33 10 26 -18 -18 -4 13 -40 49 -30 -1 29 -20 -16 66 19 17 22 13 27 19 -2 -38 -42 -39 -34 48 40 -36 -24 -15 48 -59
5333 -59 -63 6 14 34 44 16 8 -50 3 40 6 3 -45 13 36 2 1 14 -5 18 -24 72 -38 -11 -30 -5 51 -46 -1 50 14 -28
5365 -28 3 -46 -15 29 6 13 29 20 20 40 -25 6 11 -11 52 -19 -21 -55 -19 -36 -2 -34 32 -23 15 9 -8 62 -38 -23 -30 -25 15 52
5399 52 62 -23 40 -16 -18 -1 -9 -34 -16 -23 26 -7 19 -17 -16 38 50 21 33 11 14 24 1 -13 28 32 15 -19 18 36 18 18 -56 3
5433 3 -44 9 -47 -11 -12 -7 19 30 18 0 -12 4 -4 28 4 -16 -2 11 24 -5 -28 -6 5 5 34 27 24 32 64 -14 6 -13 11 27
5467B7l1O7p7K5j3j7N3J8n0K8o0j1K4M2j3k1P1o2k9N3J9n2M9m5N9l5j3L5m2j9
5497b0N1K3l7J8k7mj9R0j14Pk4L7Pk4O4k5k9J3kJ0J6K8%n3oN6m6pL5k9J7o2N6
5530@j2J0k4J6L6n7pPj3j4L8O1m5NQo0O1l0j7L6L8o6K4k6N3Rpk9J6j2J3O0l4k9
5564Ij8O1n0qj2oK4Ml5j3k4N3jJ5J3k6L7j4k1n0P7L5j08J4L3jO0m3k5K2j4P8l8
5597B8lm9K7K3k1J3l8L8rn4R5k8nk5KO5o4K3JL5n2%pO0o8PL5l7j4R7r1mnOR5m4
5633C2J1m2m7RM3kpL2k7J7k7K6J7p6L0K6lJ6N1m8k3J5%l4K5K1k9l0L3l0nL8j5
5666cm6N0mL9n0LlM1q4O6L3o6L8m5J0N7l7kk7J9PJ7j5M3o1qO8k1M8p8O6k1n6j
5700b3L2m4M3oL5l0L1n1P4q1kjk6L8K0jqk6j8K4M5p0K8K4l5Rk0J3N7rPm6N1m9
$$ plain form
5467 27 -4 63 -14 11 -2 -19 34 52 2 30 -30 -41 -17 25 12 -9 62 0 -29 24 43 -9 40 -5 54 19 6 41 -1 -20
5497 -20 31 54 17 35 8 4 -15 75 -39 -32 -56 -19 -12 -36 28 3 -26 -13 -15 -5 11 39 39 -14 -20 36 -10 -17 18 -11 6 -56 0
5530 0 -12 -2 -26 -10 26 -31 -38 -31 -44 -58 -20 41 -4 1 9 -51 10 -20 -37 -1 37 -29 -5 -31 22 31 24 -5 11 -1 12 72 38 9
5564 9 -9 52 2 -6 -18 -24 0 4 -31 -44 -68 -15 -16 -1 12 -14 23 9 -12 -62 15 50 -58 -44 -11 -12 48 5 -20 2 -12 66 28
5597 28 25 -24 3 26 5 18 -20 18 9 -45 50 22 17 -8 -6 59 -5 18 19 54 2 2 -5 55 -13 -6 29 -8 -22 75 -16 -20 -25 -19 76 32
5633 32 43 1 -46 -37 6 4 -3 29 2 19 -8 18 35 -41 -11 15 12 28 79 31 8 23 23 -11 14 35 6 -24 9 -21 -26 12 -3
5666 -3 -49 1 -3 36 -14 -11 -14 27 -57 9 42 -24 14 -31 -21 36 -1 -3 -30 -11 -4 13 -2 41 -20 -28 40 19 67 -11 55 34 -22 -23
5700 -23 9 -35 8 2 37 7 38 -13 61 -20 -22 -23 -49 -11 9 8 0 -26 -44 -20 25 -45 -17 7 -28 -19 -39 -26 31 22 29 -17 34 -15
5734a5N9ln6Pk8OM4k6K1j0Mk7K1J0k8M6Jqm8J0Q2p1l0Q7r2L0lPL7p8N8MLJ6j7
5769A3m7k0O0k9pM7j0j5kNj7J5KJ7k1K0j9J3m3Q3lOm3k2K4J2K5n7J1M9l0jJ6K
5803C4j4J1j1J0k6Nj3KNl9L0K5l0M0n2LK2l7L6K3m2L4rk5P4j7l1l2rK0O6n3N0
5836E0j4r1K9rL5j2L0L5k4k2k1P4o3M3l0kj9M4rl5J2L0rl0MM1k9NPk7j2J8qk3
5870c2kN4j7M6o6O2k0n6M1Qn8L3M6K5j16j2P6k0%K2mm0O2n5K9m8L7j0K5m6L6j0
5902a0j0N8j2pm8K2k1O4p1N2l5j0J8j4N4k6K5j1m6L9KL8Jn0o4L7O9%n8JO1l7j3
5935bJ7oN2j9p0R6m3k2n7P8J6n2rK7L0k5K8p5K7l9Q5p6K3N6k1Ljl2%M8l0o1N6
5968BJ7m3K5l1P1o0MM8m4Mk2N7m0L8M3m2o8Q8Oq3M7K0l1J0J4j4K0j2j4L0Rq0O5
$$ plain form
5734 -15 44 41 -15 -8 -36 -30 14 -12 9 -1 3 -24 -3 7 -21 25 26 18 -30 -20 62 -9 -39 48 -44 -14 -17 -10 27 -51 7 11 14 30 13
5769 13 -34 -54 6 -23 -30 17 7 -8 -10 -5 -22 -7 -5 12 -9 11 -8 5 -38 45 42 48 5 -17 7 19 44 -13 -2 47 17 16 32 34
5803 34 20 31 20 30 4 9 -4 -2 3 -36 -6 19 -11 29 -23 -20 2 -35 1 24 -18 16 7 -18 56 39 8 -24 -33 -13 53 0 50
5836 50 36 -55 -26 -35 0 -12 18 53 29 7 -14 60 -3 40 10 8 -11 33 24 -11 1 31 22 -8 -4 37 8 13 20 -7 -19 -1 -9 -32
5870 -32 -34 20 3 49 -17 45 25 -31 10 18 -40 -7 39 64 -52 -64 12 -8 -8 14 10 -30 32 -23 6 -42 -5 -15 10 -36 0 -10
5902 -10 -20 38 26 19 -29 -7 -28 36 -35 17 -18 -28 -10 -24 30 4 29 18 -28 11 13 51 52 2 -62 -25 44 44 -14 -13 48 11 -2
5935 -2 15 9 61 42 -28 68 25 3 -54 24 40 -12 -21 6 36 11 39 -36 -9 -48 37 -39 -16 40 19 22 21 -11 -11 37 7 -54 2
5968 2 19 -24 1 -30 41 -19 -15 33 -11 -7 -29 28 -12 26 69 27 -41 47 53 -30 17 37 6 16 30 16 36 24 10 40 49 -31 34
6001C4j7J8l2jL8l4j6KoJ2K3m3k0N1k3J5J5q1N4j3J5O4r1K0Q5j34OJ7M2K0K0l1
6033IQK4k9J6j3N9r5L4J0k1j8j6M5p8lM4O9l5o5M9J6l5J9k3L2j4o5O1oL8o3L8
6065hK4K6k7k7P2r3K7J9Oj4J0k2L5j1l5m3P4j7K9l9%rK5P0k6n2M7jl2Q7p3k8N9
6098E3n8L0l3j7J2J8ol6j1O9k8K6k1LLKK2r3O8k2M4l7O2K2j11K5K2M0o0L0MK8
6130E0p2MM2LK4m5j5m0J08p3J4Pl5L5L0o4M7lM4o3l1K8j4qL5l3N0pm4P1k3n6j0
6163d4N4jN2o4K1K7p1k1Q0NKj4j6L8o4RJ4j1J2K7p2Q9J8j03P9q3O2Rj9k0J8rL3
6196C7l8l3Q9r4M4N7p7%J9j8M7n0K1l7N7j4ko6Q7n0L4j7KJ1j1L5op1K1J7J6j4
6228dm6Q4j7mPkj5m8Q0J3m7PQl1K7r3J04l7k8O8j3k8L4o8M2j6l9R8r4P0L4k5L
$$ plain form
6001 34 17 35 3 2 40 6 -10 -8 -14 -2 21 -22 -42 9 -14 1 16 -65 -11 -24 -9 55 -36 -16 69 -65 -59 -42 0 20 40 9
6033 9 17 41 12 28 15 74 -21 13 23 2 -16 -32 13 -65 -68 -24 45 10 -55 -6 10 -25 -6 -29 3 -11 -76 -15 -21 17 -46 -8
6065 -8 16 42 15 -12 60 -33 -6 13 19 5 15 -7 28 17 -18 -61 13 -4 25 -14 -14 -23 2 72 46 -6 41 40 8 95 22 -6 53
6098 53 -5 25 -8 -25 -13 5 -1 -37 -48 21 -7 19 -2 1 4 6 28 -65 3 -19 25 -12 50 72 -39 -14 8 48 -12 18 22 50
6130 50 -22 -18 24 27 51 6 -9 -49 59 -14 0 7 -28 7 37 -27 20 17 61 -2 -33 -5 -19 -27 8 -25 25 18 -26 45 22 -34 -44
6163 -44 10 9 61 -3 18 45 -26 -47 33 38 40 26 10 48 -16 -7 7 -4 8 35 -37 52 70 -33 46 -37 25 34 15 -5 13 4 37
6196 37 -1 -34 55 -39 5 62 -15 -15 4 -14 33 -17 4 -33 24 10 8 -58 29 -21 13 -4 -2 9 -2 33 27 -44 -23 -6 10 -4
6228 -4 -50 34 17 13 20 18 3 -45 35 48 1 8 16 -15 12 -81 23 -14 -42 26 13 -15 19 -49 -7 -23 -62 36 -58 12 46 21 24
6261B4l3N0m7PJ7Pl5n0J6R5p5K5LK9K7l1Kl5k4k9N7k0P9o3j1K9pj6O1m7k2KJ2
6294cJ7J3m5N7q2J8K8O3m0Ol0L8o3l2J03k9j8l8K0l1N4l9JL4N6p1K8j8L0po8M6
6326bl6M8JqO6l6K5n1on2KO7jK1j8j4j8j2M8q1PN9j8k9L9K4o2M9mk3L2n3J8Q7
6360F9j8o6M6o2N5k7k%L4pm0j7Nk4P6NKj8J2j1k1J8K7q4P4oj7mm3L7n8R1k8L8
6394C6p5J3L2n3K6J1j8M1o1M7k8M8L3j01J9L9K7n8N7j3m9J4l0jN3l4L3K4k4k5
6424a7k4O5nMl4L3J2o6J0N1J9jp2ll4N9k6N1J1m8j5%J6JM4k9l5M9k0Nj8L6Ol6
6458a1JOpL0%n4N9l1m3O1J2J1K9p0%m0P7Rj2n5M5k8qL6k6MK3N9r7L2n5N6j0J6
6492A9l5N1p0j1N6k2j2O3n0nN2rM5j01P9p8P5K8q0N6o7L3n6J5K9J0j2K0k7J3J0
$$ plain form
6261 24 -9 41 -6 1 18 25 -10 -60 -44 51 -24 1 4 33 60 29 31 -4 -28 -57 0 -20 59 -4 -15 14 7 -9 52 5 -17 -15 -3
6294 -3 14 27 -18 39 -43 -25 3 66 26 32 2 40 -23 -55 48 19 1 -37 -17 -48 6 -33 -32 2 58 -13 15 -3 27 20 -48 -2
6326 -2 -38 10 11 3 69 33 58 7 1 -51 -49 18 17 38 20 6 -12 -24 24 -57 -50 9 -9 -38 1 25 -37 12 8 -15 17 -36 -18 69
6360 69 51 -15 31 -31 24 -3 -5 -5 29 22 -18 -35 -30 -54 22 27 29 11 23 12 -9 9 36 -48 26 20 3 -1 -44 -7 -65 26 -2 36
6394 36 -39 -26 6 -47 -21 -10 -28 13 -48 -1 -29 19 52 -49 -30 9 36 -22 35 22 -27 -13 -43 -44 9 -25 8 32 8 -17
6424 -17 -41 24 19 23 -11 22 34 -32 -22 29 48 47 -25 -28 -62 -3 -29 22 33 -15 -30 -30 -14 -13 31 2 -33 16 -4 1 -17 19 25 -11
6458 -11 -10 -4 -11 19 19 -35 24 -7 -50 11 23 34 63 -7 -7 -47 30 39 27 -28 17 -11 -19 17 -9 -5 18 77 -20 12 -43 13 3 19
6492 19 -16 35 -35 -46 10 -12 -24 39 -11 -16 36 27 72 -29 50 -28 47 75 -5 51 -16 17 -39 -24 5 15 3 23 -4 9 19
6523A9K1n0L2K5m6K4l8K1m%m2J3M1j2Ml1K9J7lk5K9j4Qk0K6o7K5Qk2L7j1j4L2
6556A2j6qML3j17Q9k6L9j9O4j5n3J3j9N4k3Qn8M6n6P8m7J9O0r2J16j03M9m9j7
6586c4L6l6M5J1p5K5M3l7nL6K5m0kJ3L7on7J1M6K2m5K0m7P2k2J0m0k6M5m1l6L3
6618a9P3q8M7QJ3m4J1K1lK4m5M7J4j7l8Oj0R4j68O3k4k1O8r4J06n3K0K0N1p3j0
6649b1M6m8J3K7K1j4n5P9o5j8N8k0j3N1n4O8j9n2K5j3J7j0j3K0%l4Q1n5J%K4o
6681B1l1rK5PJ5k3p0O0j2J7K4k7jk8L5o0P0l7L7Nn8L1LNj5R5p1P9%o6n7N5O1m8
6715C2q1R1J0q7J6LL8M0j9k9m9J5O7n1k1L9K3Ro1L9p1P7m3J5k3J4Rk0k5R9l9j3
6747Dj1M7l6rJ7Kj0L4n4L5k3PL2Jo5O6k6k1O1m5K9Mj8j6l0P2m5k0K6n0M3l6N7
$$ plain form
6523 19 40 -10 22 47 1 25 -13 8 4 4 -38 -25 16 4 8 -23 6 23 20 -5 24 10 18 -2 24 -43 -18 -10 -32 5 -6 -20 12
6556 12 -4 -12 -8 25 -92 -3 -29 10 -9 55 40 -13 0 -19 35 12 20 -38 8 -48 30 -17 2 62 -30 86 -17 32 -17 -34
6586 -34 2 -34 11 22 -53 -28 15 -22 -27 9 34 -6 -8 5 42 36 -21 -10 36 58 13 33 -14 58 36 46 6 -20 25 -16 -52 -19
6618 -19 54 -34 13 21 34 -10 1 22 19 43 -2 45 59 42 4 10 0 94 -74 -11 -35 -56 12 -82 24 -29 -9 11 62 -11 -21
6649 -21 25 -23 -10 17 38 24 -31 48 -17 -35 23 3 -10 41 -13 55 36 -16 9 -4 13 3 -10 10 10 -24 57 2 3 3 27 21
6681 21 -10 -19 6 13 28 5 -65 -5 -17 0 24 -3 -4 -32 3 -57 13 -24 13 18 -40 -9 -6 -1 -16 79 8 87 87 21 -36 19 80 32
6715 32 -49 42 52 -35 -19 -16 22 62 43 14 -35 -20 47 -4 -25 14 37 46 -15 24 -47 30 -13 2 -21 -7 2 -18 -43 56 17 4
6747 4 -7 40 4 -5 12 14 4 38 -16 19 -4 3 35 36 -29 37 11 -10 51 6 35 39 21 5 -25 47 2 -18 8 -42 1 -35 22
6780B2pm6L2k3Q9q4m5J26r2M5l2J2j1j9R3j12Q0j5j8L6n8L3j9K4pk1J1L7L4q2
6810a7J0Kk1M1nk6N8k3Oj3m2N5j9p3jP7Kl5J2J7n6M2K5o9n4Q7P8j34O0J5J2K6
6842C7l5jL7ol9N4j5o7J6N3l4MK0Nk7L7jq2J07k7j3n6J8kj4L9kL9p0RP1l3n7K3
6876a2J6k9M1J5Lk8K2k4n2N6M4j03O1o0Q2j04N8J7J2lk4mRK8ML3m9j2L0k4K3k3
6908CQJ0K4l0k8N6n2L2m1j5O0j3n0L0l4P6q6N3RL3k0Lo9J9Ok7O0l8L4K0n8J9l
6941in9P3k0j4P3m1qoL1m3NnN2n8K1k1P7k8m1N0l9O5n2n9O6J0n5J4RJ2l5J5N9
6974C9k8l1K1k3M6K4Rm8nq6P5PN0p2Q8p3J7k0l7O1KJ0M9n6K0l3m2N9K6j6J0Po8
7007a8J1O0k3J8rok8k0jk0J8L3k8K2l4O0p0J6J0j9M6Om3k5qM2j9M2K3j1k4l5J02
$$ plain form
6780 22 15 -31 1 -22 67 -17 -62 64 -28 17 -15 -3 -14 -33 60 -52 28 13 -5 31 -27 6 -13 11 4 -17 -6 31 65 -17
6810 -17 -7 -5 -26 15 10 -16 42 19 25 12 -30 25 6 -67 -68 9 11 -24 -12 5 -51 -9 16 -53 -107 -20 58 -76 -16 -1 11 37
6842 37 2 1 38 32 -7 47 32 -35 -19 34 0 4 24 29 2 39 38 -44 63 36 23 -33 -15 -17 -31 8 6 45 -25 -16 55 22 -35 -12
6876 -12 4 -25 16 31 34 6 28 4 -48 8 52 -51 10 -50 32 -72 -14 3 15 12 -12 -16 -7 21 25 58 9 -3 27 3 26 3
6908 3 11 21 45 15 -13 43 -9 23 -18 -33 27 14 -36 -6 -40 36 -50 3 12 45 25 28 -41 -22 -16 -43 17 -21 13 33 -25 -6 -9
6941 -9 -68 5 -15 -29 44 3 -5 -11 20 -23 -18 -23 29 -29 -8 -29 48 20 -21 29 -10 55 3 -56 10 20 -35 -21 -12 0 -35 -20 39
6974 39 11 -20 1 -22 24 48 57 9 4 -82 -7 0 50 -22 66 -7 10 -10 -47 14 16 26 75 19 39 6 -36 23 49 33 43 50 -18
7007 -18 -7 53 30 48 39 33 5 -15 -16 -36 -18 15 -13 9 -25 35 -35 -19 -9 -28 18 24 -19 -44 -52 -10 -29 13 36 25 1 -34 68
7040F8l7k0llJ5O9q2K0J5lm8LN1n2J1J1kj1M5k1k5pJ0j6j0M5j8Kl9M7LJ1j0l0
7074a1K9Qo1R1m9L0k6K4k8j6J8NJ5l0M7p1M4Lm3O1k0m3N9m0R0r5k5J6J2K8m8Q6
7106F0o6k9j6JQ1m8J2j1N2p8M2j1J5L7l9q1R4k5L0o1l5J18n6O2l9j9K5m6lR8m8
7137A6Om3J7KK0k8L8n1j4N0om0J2N3m8n7R3n6M8n0L0L4j4m5L8QLl3L1m1j1J18
7169H0j10O7k3k2j0mM8o5L0J3J7n2N6L9l6m9N1k1M2op5L2QL8j0k8L4o3J7N9o2
7200eL1k3qQ8j06%J9j5L5qOn2N6j8l5j7L1l0L5N4o1N1O4j21M4J1p5O4N5j38qO2
7232a4ML0k3L7m4JkqJ9K5m4lMkRM7Mj4o0j2lN5K0j5l8rP1k8J0p3O1l5kk8M8PJ
7269dnJ4K9j6nj5P0r5K6k2Q0m3n9P8mmj7OK2mKNo1k4J7L3O7n1l7rL4M5m0l0L0
$$ plain form
7040 68 31 11 8 5 20 89 7 27 42 39 -9 -6 45 -7 4 15 13 2 47 26 1 -6 4 -12 -22 23 5 7 -32 15 18 29 19 -11
7074 -11 18 26 -35 56 7 37 11 35 7 -9 9 14 29 -1 46 -25 19 22 -21 40 20 -23 36 -4 86 -9 -34 -18 -6 22 -26 60
7106 60 -6 -35 -51 -50 31 -17 -5 -16 36 -42 0 -11 4 41 2 -79 15 -10 20 -41 -76 42 -14 48 9 -10 15 -31 -34 64 16
7137 16 22 -21 -4 -2 18 -10 28 -23 -37 13 7 -33 -21 32 -16 -73 20 -36 12 -38 -8 26 12 -33 5 13 16 -17 14 -27 -38 80
7169 80 -30 37 14 -8 -18 -22 26 -39 -9 4 21 -31 25 64 28 -21 30 9 51 45 -30 2 10 48 38 10 44 -19 -2 57 -5
7200 -5 26 3 -5 83 -23 -23 -4 -19 16 8 14 -38 18 0 -35 -52 -21 -51 -16 38 -23 28 92 -29 15 26 -49 15 70 -68 -76 -14
7232 -14 -10 20 -3 34 -10 -9 -11 -19 0 25 -19 -22 -18 -20 -11 36 40 26 -34 -46 -49 6 26 11 -27 -36 35 7 17 -56 5 -30 -32 -60 -12 -5 -4
7269 -4 -9 5 34 18 13 -2 68 -27 -1 -23 57 14 -45 33 29 25 8 14 36 32 34 39 -22 -46 -29 4 71 20 -17 -26 8 53 13 -17 13
7304A3ok2L1l4Qk2P1k2m9L3j5Ll3P5p4N8j1nK4k0K5L1o2Pj9K6m6K6L2k3k0M2l1
7337iL0m5O2l0jk7P1n7K4j9l9K4L4j4o5P2l6K1Qo5K6jK4j3N4j4rM2m1K5l0K3m9
$$ plain form
7304 13 7 -15 16 -18 -10 -32 39 17 -32 1 -14 -11 -44 31 -43 15 4 -1 23 3 28 59 -3 4 -15 11 -35 -9 23 0 -20 22 -9
7337 -9 21 -24 38 8 7 -20 51 -6 18 -1 -40 -16 18 4 -61 11 -25 -4 4 -61 -35 -36 -12 -25 29 15 6 48 7 32 2 25 -24
$$ [...]
8191E8
##END NTUPLES=NMR FID
##END=
