##TITLE=1H_BAU-3.04HB
 CDCl3, 8 sc, 
 4.3.2019
##JCAMPDX= 6.0         $$ Bruker NMR JCAMP-DX V2.0
##DATA TYPE= NMR FID
##DATA CLASS= NTUPLES
##ORIGIN= UXNMR, Bruker Analytische Messtechnik GmbH
##OWNER= root
$$ XWIN-NMR		Version 3.5
$$ Mon Mar  4 15:54:46 2019 Russian Standard Time (UT+4h)  she@DPX200
##.OBSERVE FREQUENCY= 200.1316
##.OBSERVE NUCLEUS= ^1H
##.DELAY= (6, 6)
##.ACQUISITION MODE= SIMULTANEOUS
##.ACQUISITION SCHEME= undefined
##.AVERAGES= 8
##.DIGITISER RES= 18
##SPECTROMETER/DATA SYSTEM= spect
##.PULSE SEQUENCE= zg30
##.SOLVENT NAME= CDCl3
##.SHIFT REFERENCE= (INTERNAL, CDCl3, 0, 15.7039)
##AUDIT TRAIL= $$ (NUMBER, WHEN, WHO, WHERE, WHAT)
$$ ##TITLE= Audit trail, XWIN-NMR		Version 3.5
$$ ##JCAMPDX= 5.01
$$ ##ORIGIN= Bruker BioSpin GmbH
$$ ##OWNER= she
$$ F:/spectra/data/she/nmr/H-F/1/audita.txt
$$ ##AUDIT TRAIL=  $$ (NUMBER, WHEN, WHO, WHERE, WHAT)
(   1,<2019-03-04 15:53:04.93 +0400>,<she>,<DPX200>,
      <created by zg, POWCHK disabled, PULCHK disabled
       configuration hash MD5:
       00 E9 B6 7A A2 85 ED C7 34 08 36 98 17 FE 4E 26
       data hash MD5: 16K
       C4 2B E1 97 D7 E2 1F 92 31 31 15 30 96 9E 9E 1B>)
$$ ##END=
$$ 
$$ hash MD5
$$ D7 14 21 C8 AE F9 C5 C8 E5 4A 59 74 8F C9 0C 52
##$RELAX= 
##$RELAX= 
##$RELAX= 
##$RELAX= 
##$RELAX= 
##$RELAX= 
$$ Bruker specific parameters
$$ --------------------------
##$DU= <F:/spectra>
##$EXPNO= 1
##$NAME= <H-F>
##$PROCNO= 1
##$TYPE= <nmr>
##$USER= <she>
##$AMP= (0..31)
100 100 100 100 100 100 100 100 100 100 100 100 100 100 100 100 100 100 
100 100 100 100 100 100 100 100 100 100 100 100 100 100 
##$AQSEQ= 0
##$AQ_mod= 1
##$AUNM= <au_zg>
##$AUTOPOS= <>
##$BF1= 200.13
##$BF2= 200.13
##$BF3= 200.13
##$BF4= 200.13
##$BF5= 200.13
##$BF6= 200.13
##$BF7= 200.13
##$BF8= 200.13
##$BYTORDA= 1
##$CFDGTYP= 0
##$CFRGTYP= 5
##$CHEMSTR= <none>
##$CNST= (0..31)
1 1 145 1 1 1 1 1 1 1 1 1 1 1 1 1 1 1 1 1 1 1 1 1 1 1 1 1 1 1 1 1 
##$CPDPRG= <>
##$CPDPRG1= <>
##$CPDPRG2= <>
##$CPDPRG3= <>
##$CPDPRG4= <mlev>
##$CPDPRG5= <mlev>
##$CPDPRG6= <mlev>
##$CPDPRG7= <mlev>
##$CPDPRG8= <mlev>
##$CPDPRGB= <>
##$CPDPRGT= <>
##$D= (0..31)
0 1.2 0 0 0 0 0 0 0 0 0 0.03 0 0 0 0 0 0 0 0 0 0 0 0 0 0 0 0 0 0 0 0 
##$DATE= 1551700384
##$DBL= (0..7)
120 120 120 120 120 120 120 120 
##$DBP= (0..7)
150 150 150 150 150 150 150 150 
##$DBP07= 0
##$DBPNAM0= <>
##$DBPNAM1= <>
##$DBPNAM2= <>
##$DBPNAM3= <>
##$DBPNAM4= <>
##$DBPNAM5= <>
##$DBPNAM6= <>
##$DBPNAM7= <>
##$DBPOAL= (0..7)
0.5 0.5 0.5 0.5 0.5 0.5 0.5 0.5 
##$DBPOFFS= (0..7)
0 0 0 0 0 0 0 0 
##$DE= 6
##$DECBNUC= <off>
##$DECIM= 24
##$DECNUC= <off>
##$DECSTAT= 4
##$DIGMOD= 1
##$DIGTYP= 9
##$DL= (0..7)
0 120 120 120 120 120 120 120 
##$DP= (0..7)
150 150 150 150 150 150 150 150 
##$DP07= 0
##$DPNAME0= <>
##$DPNAME1= <>
##$DPNAME2= <>
##$DPNAME3= <>
##$DPNAME4= <>
##$DPNAME5= <>
##$DPNAME6= <>
##$DPNAME7= <>
##$DPOAL= (0..7)
0.5 0.5 0.5 0.5 0.5 0.5 0.5 0.5 
##$DPOFFS= (0..7)
0 0 0 0 0 0 0 0 
##$DQDMODE= 0
##$DR= 18
##$DS= 0
##$DSLIST= <SSSSSSSSSSSSSSS>
##$DSPFIRM= 0
$$ [...]
##$SUBNAM2= <"">
##$SUBNAM3= <"">
##$SUBNAM4= <"">
##$SUBNAM5= <"">
##$SUBNAM6= <"">
##$SUBNAM7= <"">
##$SUBNAM8= <"">
##$SUBNAM9= <"">
##$SW= 24.9336934301222
##$SWIBOX= (0..15)
0 0 2 0 0 0 0 0 0 0 0 0 0 0 0 0 
##$SW_h= 4990.01996007984
##$TD= 16384
##$TD0= 1
##$TE= 0
##$TE2= 300
##$TE3= 300
##$TEG= 300
##$TL= (0..7)
0 120 120 120 120 120 120 120 
##$TP= (0..7)
150 150 150 150 150 150 150 150 
##$TP07= 0
##$TPNAME0= <>
##$TPNAME1= <>
##$TPNAME2= <>
##$TPNAME3= <>
##$TPNAME4= <>
##$TPNAME5= <>
##$TPNAME6= <>
##$TPNAME7= <>
##$TPOAL= (0..7)
0.5 0.5 0.5 0.5 0.5 0.5 0.5 0.5 
##$TPOFFS= (0..7)
0 0 0 0 0 0 0 0 
##$TUNHIN= 0
##$TUNHOUT= 0
##$TUNXOUT= 0
##$USERA1= <user>
##$USERA2= <user>
##$USERA3= <user>
##$USERA4= <user>
##$USERA5= <user>
##$V9= 5
##$VALIST= <valist>
##$VCLIST= <CCCCCCCCCCCCCCC>
##$VD= 0
##$VDLIST= <DDDDDDDDDDDDDDD>
##$VPLIST= <PPPPPPPPPPPPPPP>
##$VTLIST= <TTTTTTTTTTTTTTT>
##$WBST= 1024
##$WBSW= 4
##$XGAIN= (0..3)
0 0 0 0 
##$XL= 0
##$YL= 0
##$YMAX_a= 654869
##$YMIN_a= -855958
##$ZGOPTNS= <>
##$ZL1= 120
##$ZL2= 120
##$ZL3= 120
##$ZL4= 120
##$ABSF1= 10
##$ABSF2= 0
##$ABSG= 5
##$ABSL= 3
##$ALPHA= 0
##$AQORDER= 0
##$ASSFAC= 0
##$ASSFACI= 0
##$ASSFACX= 0
##$ASSWID= 0
##$AUNMP= <proc_1d>
##$AZFE= 0.1
##$AZFW= 0.1
##$BCFW= 1
##$BC_mod= 2
##$BYTORDP= 1
##$COROFFS= 0
##$CY= 11.3945322036743
##$DATMOD= 1
##$DC= 2
##$DFILT= <>
##$DTYPP= 0
##$F1P= 18.9103706918063
##$F2P= -1.10871071338519
##$FCOR= 0.5
##$FTSIZE= 0
##$FT_mod= 4
##$GAMMA= 1
##$GB= 0.15
##$INTBC= 1
##$INTSCL= 1
##$ISEN= 128
##$LB= 0.24
##$LEV0= 0
##$LPBIN= 0
##$MAXI= 10000
##$MC2= 0
##$MEAN= 0
##$ME_mod= 0
##$MI= 1.114404
##$NCOEF= 0
##$NC_proc= 0
##$NLEV= 6
##$NOISF1= 3.799351
##$NOISF2= 2.8
##$NSP= 1
##$NTH_PI= 0
##$NZP= 0
##$OFFSET= 15.70392
##$PC= 1
##$PHC0= -8864.911
##$PHC1= 19.80014
##$PH_mod= 1
##$PKNL= yes
##$PPARMOD= 0
##$PSCAL= 0
##$PSIGN= 0
##$REVERSE= no
##$SF= 200.130013532006
##$SI= 16384
##$SIGF1= 3
##$SIGF2= 2
##$SINO= 400
##$SIOLD= 16384
##$SREGLST= <1H.CDCl3>
##$SSB= 0
##$STSI= 0
##$STSR= 0
##$SW_p= 3612.71676300578
##$SYMM= 0
##$S_DEV= 0
##$TDeff= 0
##$TDoff= 0
##$TI= <>
##$TILT= no
##$TM1= 0
##$TM2= 0
##$TOPLEV= 0
##$USERP1= <user>
##$USERP2= <user>
##$USERP3= <user>
##$USERP4= <user>
##$USERP5= <user>
##$WDW= 1
##$XDIM= 8192
##$YMAX_p= 0
##$YMIN_p= 0
$$ End of Bruker specific parameters
$$ ---------------------------------
##NTUPLES= NMR FID
##VAR_NAME=  TIME,          FID/REAL,        FID/IMAG
##SYMBOL=    X,             R,               I
##VAR_TYPE=  INDEPENDENT,   DEPENDENT,       DEPENDENT
##VAR_FORM=  AFFN,          ASDF,            ASDF
##VAR_DIM=   8192,          8192,            8192
##UNITS=     SECONDS,       ARBITRARY UNITS, ARBITRARY UNITS
##FACTOR=    0.0002004,     1,               1
##FIRST=     0,             0,               0
##LAST=      1.6414764,     0,               0
##MIN=       0,             -855958,         0
##MAX=       1.6414764,     654869,          0
$$ Real data points
##PAGE= N=1
##DATA TABLE= (X++(R..R)), XYDATA
0 0 0 0 0 -8 8 -8 8 -16 24 -32 40 -48 64 -80 94 -112 136 -166 198 -230 264 -316 366 -415 479 -551 631
27 631 -718 811 -917 1038 -1162 1302 -1460 1629 -1817 2019 -2242 2493 -2766 3058 -3387 3748
43 3748 -4153 4601 -5099 5664 -6311 7045 -7896 8901 -10105 11571 -13411 15795 -19032
56 -19032 23693 -31013 44279 -75967 307448 27986 -578711 21039 124393 -152941 80351
67 80351 502051 -124442 -827089 -429501 293304 120567 -150420 113507 77368 -524855
77 -524855 -386641 493724 642640 -29543 -153679 166616 -23005 -241842 301065 654869
87 654869 18920 -546751 -191815 139371 -117428 -110478 289366 44668 -620128 -428722
97 -428722 297223 259994 -156781 43693 241753 -216498 -338098 343904 594143 399
107 399 -237215 136485 103021 -250124 17054 444105 41737 -511792 -212188 200828 -85265
118 -85265 -256247 160197 179085 -369067 -333326 276811 288962 -162354 -50908 298050 32610
129 32610 -272483 126974 442163 -2466 -295080 106432 233916 -213694 -208823 257210
139 257210 114284 -375898 -165936 267081 -7865 -338982 21345 277183 -116120 -257524
149 -257524 188769 251022 -205210 -163936 305131 190952 -238428 -51101 281924 -20146
159 -20146 -277824 115392 309104 -140353 -304831 98634 164628 -188553 -110426 249753
169 249753 51695 -354261 -113546 296923 76032 -208424 67226 200783 -195472 -234629
179 -234629 273073 315118 -166777 -184683 165068 41582 -224779 77126 357736 -48413
189 -48413 -386393 -34404 220833 -77302 -136140 207177 83616 -378176 -205687 299250
199 299250 178681 -179384 -10762 172167 -137205 -227904 235587 377272 -80829 -242159
209 -242159 89215 112305 -159532 11770 323745 12729 -400083 -130029 223890 -1795
219 -1795 -172815 109342 111301 -299773 -249955 248583 259643 -138523 -97868 174956 -11010
230 -11010 -216214 145886 391578 -24617 -290876 45704 173001 -132754 -82230 248377
240 248377 52020 -362327 -171620 214991 56763 -190110 27497 154689 -168942 -234405
250 -234405 196922 295706 -95776 -147210 165759 88163 -181367 37524 313871 11765
260 11765 -293196 -27890 186582 -76109 -173413 123015 108231 -263722 -205818 198194 136464
271 136464 -193394 -50576 207888 -29565 -213016 134521 299676 -67688 -188314 141927
281 141927 161071 -149407 -69791 225101 46291 -274308 -74894 203654 -23532 -228782
291 -228782 38786 154956 -165184 -199319 171575 171499 -173204 -106889 201207 72426 -177061
302 -177061 36408 256395 -17283 -217387 72238 214874 -93158 -165814 144041 110532
312 110532 -227305 -119890 213448 50556 -239343 -28979 190664 -62606 -195138 116941
322 116941 200100 -130176 -162558 163077 141845 -152147 -52127 211660 25293 -223623
332 -223623 11881 220566 -44524 -193645 76179 134266 -153902 -137726 165730 103715
342 103715 -189065 -88558 172123 29701 -177816 35070 208200 -59497 -193989 103845
352 103845 186393 -111182 -115066 171938 85252 -198628 -50328 211076 18532 -203032 15718
363 15718 169190 -90670 -181889 114930 152355 -160391 -141773 159125 78023 -186286 -26387
374 -26387 206442 -8650 -197568 53139 195190 -63896 -140554 127319 139064 -141313
384 -141313 -102094 175395 84179 -178499 -42072 178286 -21676 -201093 43829 172447
394 172447 -101409 -172746 107184 114071 -155248 -91507 173749 61371 -177888 -16620 193231
405 193231 -4908 -161883 78760 180899 -93372 -142350 136472 118483 -153421 -78443
415 -78443 159919 19048 -194635 -15317 161194 -44388 -174405 54392 137961 -103578
425 -103578 -126441 140598 122760 -135490 -60383 181817 53922 -154612 26176 190992
435 190992 -36774 -169599 67421 139022 -116695 -139956 111640 68933 -187877 -93722 154418
446 154418 19313 -186599 6886 175716 -48581 -147647 119987 175573 -90369 -85146 167066
457 167066 101489 -134664 -24660 175735 7949 -182605 -575 136925 -81876 -177556
467 -177556 58659 95829 -153634 -130555 128368 70523 -150447 -27934 175629 23941
477 23941 -131342 66910 193885 -26751 -117752 108026 136869 -111970 -99209 134139 47341
488 47341 -192082 -68055 131853 -38189 -191244 18909 128534 -92414 -136419 112972
498 112972 129958 -96646 -52035 172879 86941 -116972 14558 188119 5660 -149411
508 -149411 42567 130561 -98920 -150388 74127 61278 -168440 -113675 107063 22777 -161426
519 -161426 -21322 152366 -6193 -129018 81129 181815 -39861 -87188 143334 128913
529 128913 -108710 -50044 157861 30952 -170975 -26080 121572 -64582 -176178 27853
539 27853 94644 -121567 -135310 101022 86179 -123974 -43384 163874 48237 -120398 43819
550 43819 181518 -10196 -112780 81445 124511 -89899 -102096 99239 56208 -153492 -83161
561 -83161 107584 -847 -163296 -8413 130603 -48625 -136161 80751 137536 -73828
571 -73828 -71127 140400 90201 -109504 -18861 156855 21887 -138455 11407 124192 -63125
582 -63125 -142470 59196 88418 -126192 -109466 102299 45866 -136996 -27741 137236 1464
593 1464 -124060 43691 143831 -33391 -94296 92571 110380 -87853 -69883 123741 58574
604 58574 -132377 -34466 125358 -16221 -145925 24984 115321 -75795 -124814 75822 86157
615 86157 -107839 -70389 121645 46919 -128383 -12132 144726 -2217 -123133 52734
625 52734 130605 -65780 -99829 101340 88032 -108572 -57570 116756 24780 -131258 -11749
636 -11749 117524 -27846 -130707 33535 102603 -74342 -100796 89646 79734 -104801 -49340
647 -49340 126469 38334 -110117 13895 134520 -16288 -108751 54759 109019 -71084 -94676
658 -94676 82952 58328 -124848 -64313 106198 6516 -139724 -3686 113122 -42049 -110185
669 -110185 71153 109753 -67061 -61693 114749 77293 -85922 -14768 130332 20290 -116293
680 -116293 10272 109168 -48908 -122581 42658 69018 -109356 -97858 80319 39642 -117432
691 -117432 -36018 113018 12426 -102039 36937 136765 -16367 -83615 83849 110726 -69690
702 -69690 -61589 108009 45839 -125672 -39459 98833 -23104 -134801 6543 84061 -69515
713 -69515 -107279 63744 81946 -77038 -50399 111587 58501 -84892 7266 133710 10869
724 10869 -96037 36979 100811 -54609 -93260 56841 51810 -107041 -78438 72229 18119
735 18119 -115810 -25764 98705 -10271 -102020 44568 119243 -34276 -67298 94997 89119
746 89119 -72917 -32132 113422 31471 -108409 -13896 92731 -31440 -116781 21422 72770
757 72770 -80061 -98722 65315 58211 -91875 -39983 104623 26248 -91360 20447 119787
768 119787 -7029 -81040 51064 89910 -54390 -68351 74886 52258 -98526 -54308 84117
779 84117 8915 -110038 -2969 93170 -35407 -99213 50256 90042 -56571 -58619 85661
790 85661 55051 -81768 -21241 104940 16618 -97826 5893 90355 -36634 -91977 48783
801 48783 69726 -79324 -70257 74932 39489 -86710 -19334 90962 1589 -89376 20193
812 20193 96148 -23489 -75890 50416 71256 -64545 -54480 83606 42900 -90782 -26339
823 -26339 88160 -1298 -90315 21590 85887 -41885 -82769 52061 68297 -65482 -51920
834 -51920 77561 30456 -93538 -17001 94275 -4933 -92863 23620 80471 -46678 -68683
845 -68683 66694 62289 -69492 -40238 82219 31012 -76644 -2285 88342 -10130 -87082
856 -87082 25634 78239 -47041 -73706 53498 47055 -79403 -43598 77451 19732 -85523
867 -85523 -5966 84369 -9041 -75480 36431 81717 -41156 -62173 66087 58693 -70507
878 -70507 -36313 79987 12965 -90444 -2467 77995 -27451 -84801 29559 63612 -51821
889 -51821 -56549 63304 47123 -67278 -24167 85731 23993 -71572 10821 84113 -19322
900 -19322 -71536 40935 64570 -57128 -61461 52622 30335 -77834 -31610 68390 1101
911 1101 -86312 2502 79340 -19418 -67093 47879 69730 -51305 -41488 81260 46500 -68125
923 -68125 -13778 78512 -1107 -77142 16737 70350 -39353 -78317 33370 48492 -62393
934 -62393 -47786 64256 24220 -79828 -14473 81456 4964 -65991 26569 72838 -30662
945 -30662 -55563 54099 60319 -52259 -42881 58944 22171 -74937 -14492 72425 -10857 -85138
957 -85138 11562 64791 -37427 -58222 53540 49397 -61000 -33126 74240 31451 -60438
968 -60438 1497 75330 -8460 -69595 27786 69249 -39097 -61552 43116 34246 -70052 -34412
980 -34412 64202 9498 -76752 -7621 63423 -13604 -60116 33686 65326 -36021 -50058 56278
992 56278 51732 -50446 -20895 72462 13415 -73927 1733 71838 -17991 -68834 25061 48086
1004 48086 -54317 -54184 53092 36958 -65229 -29510 63655 8880 -66595 14402 77293 -18841
1016 -18841 -63473 37686 58770 -41471 -36234 59102 27977 -67478 -23209 62393 6139 -64971
1028 -64971 3828 56173 -29241 -64141 36112 57706 -43007 -42803 53499 28870 -58692 -7094
1040 -7094 74081 5848 -65100 9539 60643 -22183 -52078 39450 46377 -55980 -47488 53272
1052 53272 26511 -62771 -12907 61076 -11563 -69595 19817 64570 -25871 -49376 39915 40550
1064 40550 -47102 -25173 64271 27289 -58623 -10902 61061 -2853 -57416 22992 57584 -36835
1076 -36835 -57581 37814 39509 -50320 -30057 52218 10349 -66435 -8110 62958 -4149 -58564
1088 -58564 19408 54897 -33383 -45770 52406 46521 -50462 -25459 59446 13315 -58396 5464
1100 5464 61973 -16348 -61312 19293 46464 -37150 -44476 41790 29275 -57487 -26974 57332
1112 57332 13626 -54840 6692 60630 -14238 -51140 33490 55134 -30473 -36944 43672 27639
1124 27639 -53375 -22390 54229 5740 -65599 -5922 49616 -23052 -57553 29646 47815 -41972
1136 -41972 -38980 50816 32859 -43569 -4230 64043 8493 -52130 12630 60312 -14357 -48766
1148 -48766 27500 36263 -50400 -43113 42839 18277 -61087 -21757 45274 -6652 -54847 15504
1160 15504 56816 -17317 -43982 35544 49342 -27998 -21631 56917 27734 -53998 -12909 56833
1172 56833 -1690 -58792 8613 42411 -38474 -55573 30928 35302 -46012 -31952 46569 17970
1184 17970 -48487 1819 66157 4042 -48301 21943 55992 -21964 -37731 40936 31848 -51715
1196 -51715 -32209 41862 7173 -57117 -11061 41763 -15443 -55764 15421 49828 -22605 -37506
1208 -37506 41213 39983 -36755 -14245 60568 20735 -47425 1466 52589 -10605 -50393 17573
1220 17573 39062 -37783 -47800 29993 24446 -50022 -25189 47373 7514 -53523 4355 56573
1232 56573 -8564 -41779 30689 46620 -28736 -29748 43610 28792 -43346 -18333 44676 3613
1244 3613 -54108 -1166 46592 -17414 -51401 21019 40101 -34742 -32797 43928 27425 -43624
1256 -43624 -12471 51575 8211 -45377 8837 50011 -16298 -47289 24072 39588 -35835 -34498
1268 -34498 39614 19054 -51409 -13602 49126 643 -48528 9247 44349 -18889 -38630 29931
1280 29931 37650 -32475 -28459 39780 21400 -42159 -8342 48499 313 -48149 10205 45691
1292 45691 -18319 -38370 27983 31602 -37121 -26866 39703 17520 -45661 -12249 43050 -4511
1304 -4511 -49112 11145 44215 -23984 -40937 31873 33252 -35739 -18190 47192 15828 -42240
1316 -42240 270 48898 -2737 -41607 15217 39239 -26202 -38833 28929 25918 -42852 -26049
1328 -26049 38040 6973 -47007 -1510 44609 -7810 -40086 20512 42895 -18773 -27818 35695
1340 35695 30861 -34596 -17972 42818 9795 -48030 -4233 40321 -15936 -48372 14738 32192
1352 32192 -32285 -33228 33301 24184 -35492 -10934 46863 12771 -35472 9846 49323 -6071
1364 -6071 -36626 22919 35934 -30413 -31831 29739 13762 -46508 -19514 33014 -3012 -46241
1376 -46241 -60 37139 -13069 -35888 24470 39732 -21573 -21642 42591 27963 -33194 -5090
1388 -5090 46534 2909 -42995 5966 36315 -21659 -41839 16585 23304 -37283 -29998 31714
1400 31714 15050 -40661 -7923 44046 3125 -35459 17041 45286 -13592 -28420 30110 30477
1412 30477 -29498 -20808 32375 9601 -42437 -12228 32933 -7120 -45002 4787 34367 -20717
1424 -20717 -34022 28156 31320 -28829 -15201 43023 18363 -32672 2208 43858 -1563 -36736
1436 -36736 12744 34853 -22815 -35814 22368 20268 -39010 -23999 33299 5392 -42931 -1948
1448 -1948 38687 -7316 -34186 19250 35863 -18124 -23164 31989 26321 -28522 -13589 36951
1460 36951 8734 -38658 -1404 36182 -11246 -39635 13447 29239 -26065 -29021 27568 19338
1472 19338 -32981 -12610 36958 7910 -35237 3540 39685 -7626 -33892 19443 32452 -25307
1484 -25307 -25819 31040 17197 -36600 -11818 34786 29 -37500 4094 33225 -13199 -33006
1496 -33006 18622 29407 -23648 -22332 31254 18291 -32711 -7361 38780 3160 -34639 7162
1508 7162 34219 -13159 -30624 19644 25834 -26812 -24112 27836 14851 -34817 -10557 33503
1520 33503 -2013 -38872 7366 35333 -15214 -30156 22597 25086 -26032 -15402 34274 14145
1532 14145 -31522 -3976 34985 92 -31223 10186 31256 -18213 -30964 21151 22839 -29070
1544 -29070 -19301 28074 6324 -34517 -2470 34130 -3151 -32489 9588 30230 -13759 -23179
1556 -23179 25803 24789 -28097 -17370 32918 11519 -33014 -1695 32076 -10641 -35577 12754
1568 12754 29231 -20192 -27120 21386 17355 -28007 -10988 35194 9367 -33426 560 35393
1580 35393 -3514 -26975 18107 28079 -23062 -24474 25338 17971 -28366 -13816 24852 -351
1592 -351 -34505 598 32202 -8637 -33323 11274 26574 -18630 -18037 31055 18928 -30395 -9108
1605 -9108 35083 7570 -27053 6612 29396 -13708 -30366 17051 26540 -22620 -24251 20976
1617 20976 9915 -32379 -6837 33533 -865 -34949 3871 29961 -9625 -21345 21493 22438
1629 22438 -23639 -17810 28811 17377 -25786 -7523 27518 -3453 -32554 7451 31413 -14473
1641 -14473 -31305 14807 19700 -23701 -14011 29633 10599 -31612 -5869 32777 3503 -25264
1653 -25264 10404 28150 -16203 -26086 22899 24620 -24643 -18187 23847 4322 -31510 -1173
1665 -1173 29733 -6509 -32408 5361 24621 -12611 -19424 21969 19335 -25286 -13922 31195
1677 31195 13708 -25344 -298 29156 -6636 -28242 13539 27621 -16853 -25183 16696 14649
1689 14649 -25260 -11976 27196 4789 -33170 -2903 30449 -3799 -26717 14094 24958 -20062
1701 -20062 -20014 26299 18346 -24345 -9976 26081 2573 -27627 3119 28278 -8768 -28855 11198
1714 11198 23556 -17739 -19098 23313 13181 -27906 -8202 29579 4183 -27240 3088 26251
1726 26251 -9224 -24406 15685 23463 -19340 -20418 22234 14356 -26109 -7624 28275 -220
1738 -220 -30988 5363 28512 -10854 -25105 15506 18666 -21523 -15136 24928 11600 -26788 -6993
1751 -6993 27422 1596 -25617 8270 27285 -12706 -23445 19320 21706 -19375 -14008 22849
1763 22849 6965 -26795 -3791 26717 -2371 -29493 2392 22257 -13258 -22759 17973 18269
1775 18269 -24325 -15163 26810 11698 -23331 878 28285 -3828 -24084 12680 27011 -12138
1787 -12138 -21413 15324 14026 -23330 -12314 24094 3553 -31519 -4964 24326 -5214 -23447
1799 -23447 12300 21831 -16620 -17784 22785 20372 -16775 -8152 24328 5148 -24758 1598 27784
1812 27784 -6793 -29578 5739 18077 -19230 -20165 19335 10941 -27874 -11236 25948 6990
1824 6990 -21062 5803 27487 -5636 -20306 17778 27828 -13220 -16875 19522 10050 -25760
1836 -25760 -7552 23718 -2918 -32074 -2842 18487 -11366 -21959 12554 17597 -18208 -15607
1848 -15607 23581 17787 -16828 -2299 27701 3588 -22222 8536 27537 -8785 -23602 10576
1860 10576 13654 -21615 -16693 18463 5468 -28743 -9822 22509 860 -22861 7730 25314
1872 25314 -9768 -18650 20973 23134 -14763 -9546 23056 7051 -23407 -1880 23355 -4502
1884 -4502 -27741 1147 17137 -14664 -21988 13784 14358 -22116 -13608 23877 10521 -19676 1908
1897 1908 27354 -1221 -19985 12397 25409 -9690 -18146 14808 13465 -21430 -13035 19948 2992
1910 2992 -28871 -5589 21135 -6583 -24147 9424 19891 -14843 -16256 20162 15929 -16577
1922 -16577 -6018 23205 6115 -20521 2441 24632 -4269 -22516 8351 18004 -15560 -17300
1934 -17300 16550 10033 -23081 -10022 20125 2868 -21738 1793 22027 -5370 -19792 12089
1946 12089 21396 -12530 -15064 19442 13034 -20601 -6106 23688 1061 -24227 2026 20187
1958 20187 -9702 -21046 10630 15302 -17415 -15317 17902 10464 -19853 -5507 22473 1978
1970 1978 -20881 6243 23585 -6892 -17165 14140 16851 -14969 -11336 18509 7934 -21368
1982 -21368 -6924 18996 -1421 -23326 1841 18413 -11407 -21355 12315 15862 -16936 -11216
1994 -11216 20880 8849 -18906 180 24392 1159 -18469 7711 20960 -8882 -17015 13882
2006 13882 13847 -19472 -13630 17202 3569 -23388 -3508 19006 -5104 -21130 7405 18684 -9343
2019 -9343 -13597 16046 15418 -14440 -7254 21922 8225 -18967 -1211 20528 -4811 -21872 6744
2032 6744 16000 -15447 -19095 12384 9269 -19515 -8657 19305 4128 -19505 1907 23594 -948
2045 -948 -15745 12464 20110 -11245 -12821 18101 11381 -19003 -8173 16701 -1565 -22757 -713
2058 -713 16039 -8869 -21044 6442 14627 -12412 -12221 17699 12425 -16524 -4027 23154 5873
2071 5873 -16355 5623 20368 -6450 -17705 10261 14898 -14938 -15310 12312 5849 -20707 -6870
2084 -6870 18732 -580 -21586 2954 19720 -6344 -14339 14922 16208 -13490 -8997 18844 9398
2097 9398 -16027 -2831 17353 -1963 -20270 2436 16381 -9721 -18732 9049 11305 -16396
2109 -16396 -10005 17943 7148 -17831 -1352 19679 854 -15321 8006 18914 -8070 -15124
2121 -15124 13185 13506 -15306 -10527 16150 3445 -21912 -3020 17863 -4778 -19425 5681
2133 5681 15057 -11408 -13291 14479 12356 -14388 -6746 18368 5692 -16694 770 19555 -2961
2146 -2961 -18067 7317 15900 -11748 -13780 13436 9302 -17145 -8133 16225 3230 -17733 -19
2159 -19 17903 -4090 -17406 8600 16838 -10331 -12790 15172 9469 -17174 -5274 18527 2097
2172 2097 -18270 1093 16024 -6745 -15697 9342 14747 -12188 -12791 13927 8889 -15388 -3903
2185 -3903 18493 786 -18693 2675 17543 -5090 -14014 9593 12231 -13176 -10827 15090 8973
2198 8973 -15689 -5869 15592 -113 -18006 4361 18330 -7591 -17488 9271 12795 -12618 -8462
2211 -8462 16259 5460 -18662 -4001 17955 1498 -15426 4468 15370 -9012 -14758 12977
2223 12977 14840 -12772 -9443 14636 4439 -16191 -123 18327 -2273 -18172 2384 13615
2235 13615 -7613 -12634 10543 9894 -15747 -10566 16018 7436 -15159 -1085 16446 -3258 -16115
2248 -16115 8736 17616 -7226 -12973 10353 9298 -13149 -5966 16562 3769 -18763 -3072 15769
2261 15769 -2655 -15660 7279 13706 -12311 -13359 13781 11380 -12609 -5143 15190 2124 -15461
2274 -15461 2127 17934 -2615 -16454 4729 12611 -10215 -11860 12540 8044 -17303 -8430 15080
2287 15080 2418 -15314 2203 15786 -5036 -14689 9488 16023 -7858 -9819 13679 8855 -14671
2300 -14671 -3955 17604 1401 -18447 681 13547 -7644 -14964 7913 10247 -13760 -11293
2312 -11293 12554 7121 -13487 -2849 16172 1443 -14749 4616 17742 -4031 -12698 10062
2324 10062 12253 -11983 -8776 13580 5044 -16411 -4906 13433 -1643 -16602 2233 14252
2336 14252 -7194 -14041 10030 12550 -11146 -7590 16222 6872 -14508 -442 17042 -1218 -14837
2349 -14837 4695 13252 -8497 -13410 8667 8557 -13876 -9237 13006 3532 -16089 -1734 16109
2362 16109 -1540 -13897 7311 14867 -7114 -9946 12467 10942 -10865 -6095 14122 4015 -15463
2375 -15463 -1310 14285 -3823 -16966 4100 12022 -10883 -12712 11034 7679 -14356 -5957 14819
2388 14819 3391 -13433 2046 15727 -2488 -13042 7989 14197 -8166 -10460 11554 7822
2400 7822 -14089 -5409 14241 549 -16500 -45 13191 -5046 -13562 6424 11134 -9304 -10281
2413 -10281 12128 9064 -12213 -3692 15745 2752 -14290 2695 15804 -4939 -14002 7262
2425 7262 10396 -11263 -9914 11207 5069 -14857 -5283 13078 181 -14729 2703 14257 -5530
2438 -5530 -12136 10289 12914 -9256 -6559 14133 6524 -12411 -1659 14528 -184 -14536 1559
2451 1559 11627 -7219 -13753 6611 8857 -12810 -10037 11936 4999 -13970 -1587 15169 -74
2464 -74 -12223 6039 15590 -4641 -9826 10418 10634 -10315 -7174 12549 4307 -15565 -3640 12591
2478 12591 -3964 -15602 3252 10722 -9169 -11321 9642 9176 -10262 -4701 14196 5294 -11366
2491 -11366 898 15505 -324 -12532 5020 12034 -8493 -11894 8730 6343 -14099 -7834 10998
2504 10998 975 -14276 -720 13006 -2479 -11778 7092 14097 -5800 -7926 12873 9994 -11152
2517 -11152 -3660 14556 2050 -14137 -85 11325 -6280 -14202 4192 8192 -10666 -11101 8154
2530 8154 5704 -12089 -3695 13971 2850 -11588 3193 15417 -2039 -9754 8952 11372 -8736
2543 -8736 -8186 10493 5546 -12874 -5423 10713 -969 -14964 419 11999 -5542 -12730 6975
2556 6975 11019 -8915 -6213 13515 6703 -10931 -971 14103 317 -11658 3011 11295 -6129
2569 -6129 -12368 6076 8148 -11217 -9059 9831 3398 -13227 -2103 13218 -544 -11553 4336
2582 4336 12632 -4366 -8527 9270 9924 -8709 -6350 11703 4815 -12681 -2480 12390 -2531
2595 -2531 -14242 2856 10557 -8088 -11156 7854 7119 -10882 -5707 12105 4053 -11437 21
2608 21 13270 -997 -11054 5919 12166 -6207 -9283 9439 7616 -10914 -5144 11334 1734
2621 1734 -12796 -864 11025 -2791 -11542 4394 10434 -6934 -9319 9327 8112 -10142 -4619
2634 -4619 12443 2399 -12641 841 12194 -3389 -11201 5565 9470 -8065 -8936 8855 6372
2647 6372 -11042 -4672 11288 1486 -12356 1690 12594 -3373 -10662 6470 9870 -7665 -6761
2660 -6761 10520 5950 -10463 -3219 10992 1172 -11502 995 10978 -4684 -11830 5697 9250
2673 9250 -8667 -7964 9172 4308 -11433 -2178 12187 509 -11117 2343 11420 -3801 -9277
2686 -9277 7717 9420 -8439 -7143 10687 5068 -10954 -1751 11326 -1337 -12540 2978 10526
2699 10526 -5422 -9548 6299 6971 -8828 -6151 10185 4714 -10874 -2645 11172 -309 -10751
2712 -10751 4088 11134 -5821 -9884 7244 7345 -8778 -5258 9856 2677 -11628 -1993 11393
2725 11393 -625 -10883 3395 10390 -6072 -9082 9171 8514 -9707 -5162 10510 2140 -10316
2738 -10316 980 11456 -2462 -11321 3139 9344 -6292 -8243 7623 5914 -10683 -5205 10708
2751 10708 2718 -10908 344 10683 -3231 -9926 5666 10174 -5962 -7524 8009 5940 -8819
2764 -8819 -3033 11463 1990 -11741 88 10973 -3170 -10250 5682 8313 -8947 -8211 8490
2777 8490 5096 -9462 -2777 9664 93 -10555 1874 11271 -2678 -9888 4987 7983 -7469
2790 -7469 -5854 10133 5067 -10265 -2792 10124 593 -9337 2283 9658 -4394 -9975 5267
2803 5267 8614 -6993 -6354 9000 4490 -10961 -2287 11919 485 -10320 2334 9234 -4945
2816 -4945 -8354 7171 7549 -8246 -6614 8149 3263 -9778 -1464 10356 -785 -11307 2833
2829 2833 10089 -4629 -7754 7374 6681 -8537 -4539 10086 4105 -8675 -1011 9952 -1054
2842 -1054 -9910 3174 9874 -5458 -9401 6238 6229 -9267 -5070 9778 1980 -11144 -1139 10091
2856 10091 -1189 -9208 4281 8834 -5171 -7666 7992 7558 -7856 -4365 9809 2207 -10518
2869 -10518 392 10960 -2438 -9864 3626 7555 -6528 -7024 7287 5399 -8903 -4791 9322
2882 9322 2531 -9388 1076 10777 -2412 -9888 5156 9107 -6356 -6914 7965 4420 -9942
2895 -9942 -3784 9112 982 -10387 -299 9137 -3307 -9588 5532 8874 -6631 -6994 8770
2908 8770 5277 -8717 -1118 11029 693 -9866 1746 9238 -3016 -8047 4807 6430 -8336
2921 -8336 -7540 7643 3969 -9973 -3290 8925 -707 -10402 2731 10212 -3311 -7843 6269 7451
2935 7451 -6076 -4033 9666 4488 -9139 -2122 9792 -148 -9663 2234 8507 -6120 -9469
2948 -9469 5860 6152 -8318 -5236 8398 2302 -8950 -407 10452 160 -8501 2848 8728
2961 8728 -4164 -7376 7029 6468 -8686 -5467 8154 2216 -9384 -860 8450 -2577 -9967 2872
2975 2872 8388 -4225 -6965 6536 6631 -6977 -3313 10749 4186 -8926 -28 9950 -1641 -8974
2989 -8974 4033 7748 -6968 -8124 5639 4439 -8893 -4631 8002 1088 -10021 -181 9983
3002 9983 -1711 -8306 4908 8834 -5717 -5336 8481 5455 -7588 -2657 8542 1020 -8875 -17
3016 -17 8503 -3063 -9555 3508 7322 -6679 -6974 7364 4745 -8743 -2736 9803 1070 -8579
3030 -8579 1542 9361 -2550 -7669 4570 7517 -6146 -6220 7199 4042 -9377 -3253 8584 85
3044 85 -9783 1463 8740 -3481 -7902 5609 7050 -5778 -4654 7807 4521 -7698 -1452 9510
3058 9510 686 -8889 1793 8769 -3929 -8786 5249 6062 -8227 -5679 7392 2490 -9029 -1681
3072 -1681 8720 -385 -8832 2418 8966 -3295 -6808 6352 6766 -7006 -4327 9173 3413 -9044
3086 -9044 -881 8575 -1199 -8412 2652 7261 -4843 -7374 5075 5770 -7236 -4526 7929 2683
3100 2683 -9098 -748 9279 -891 -8441 3361 7955 -4838 -6523 6127 5329 -7519 -4265
3113 -4265 7839 2424 -8742 -964 8579 -1688 -8804 3141 8055 -5279 -6163 7293 5464 -7134
3127 -7134 -2813 8664 2060 -7946 586 8812 -1716 -8312 3117 6851 -5453 -6723 6003
3140 6003 4397 -8785 -4031 8202 988 -8925 735 8257 -2551 -7733 4395 7686 -4468 -5276
3154 -5276 7178 5044 -7452 -2410 9604 1401 -9132 816 8092 -3492 -7790 4856 5921
3167 5921 -6782 -5794 6612 4063 -7026 -2179 7724 431 -8404 1568 9112 -2310 -7443 4872
3181 4872 5895 -6492 -5063 7880 3791 -8375 -2676 7345 -281 -8019 1715 7769 -3597 -8228
3195 -8228 4811 7250 -5541 -4428 8206 3335 -8528 -1014 9550 264 -8016 1702 7023 -4121
3209 -4121 -7016 5097 5572 -7195 -6034 6673 2736 -8080 -767 8276 -1483 -8545 2887 8425
3223 8425 -3512 -5746 5964 5239 -6415 -3527 8303 3365 -7688 -1482 7886 -1020 -8073 3064
3237 3064 7794 -5030 -7256 5674 5103 -6813 -2906 7889 1200 -8478 -540 8057 -1088 -7395
3251 -7395 2740 6909 -4703 -6226 6276 5531 -7135 -3581 7887 1330 -8180 790 7923 -2190
3265 -2190 -7330 3577 6650 -4697 -5534 6139 5031 -6834 -2959 7953 1900 -8254 187 8371
3279 8371 -2423 -7657 3848 6283 -5481 -5631 6139 3788 -7253 -3253 7525 1018 -7982 213
3293 213 8141 -2623 -7529 4743 6918 -5465 -4754 7137 3481 -7105 -1324 8246 663 -7356
3307 -7356 725 7054 -2478 -6968 4486 6389 -6392 -6011 6457 3702 -7508 -1584 7884 -836
3321 -836 -8588 1599 7942 -2586 -6430 4191 5296 -5866 -4347 7598 3549 -7828 -2282 7808
3335 7808 97 -7727 2771 7703 -4266 -7260 4945 5374 -5481 -3342 6631 1966 -7602 -1127
3349 -1127 8176 421 -7545 1455 6984 -4506 -6255 5830 5121 -6962 -4393 6138 1922 -7013
3363 -7013 -302 7560 -1309 -8100 2015 7360 -2927 -5709 5487 4630 -6784 -3214 8625 2802
3377 2802 -7609 -253 7167 -1978 -6761 3459 6740 -4768 -6320 4974 4253 -6485 -2937 7043
3391 7043 964 -8821 93 8136 -1556 -7053 3455 6322 -5099 -5148 6505 4589 -6412 -2968
3405 -2968 6904 1508 -7270 691 7796 -1981 -7877 3268 6996 -4825 -5090 6484 3440 -7563
3419 -7563 -2337 7520 990 -7550 701 6930 -2525 -6701 3621 6414 -5371 -5557 6259 3406
3433 3406 -7588 -2158 7558 -75 -8008 1300 7374 -2570 -6482 3991 6025 -5066 -4430 6671
3447 6671 3971 -6970 -2121 8157 721 -7643 1690 7348 -3581 -6825 4577 4926 -5787 -4359
3461 -4359 6077 2426 -7257 -1329 7039 -440 -7632 1458 7325 -3307 -6293 5144 5340 -6105
3475 -6105 -3593 6944 2746 -7025 -625 7217 -779 -7262 2284 6986 -3507 -6242 4571 5050
3489 5050 -6079 -4013 6935 2024 -7608 -901 7669 -1069 -6888 2544 6307 -4294 -5860 5299
3503 5299 4764 -5800 -3713 6612 2114 -7970 -330 7897 -1672 -7531 2965 6288 -4392 -4781
3517 -4781 6295 4422 -6363 -2683 7127 2108 -6629 201 7247 -1450 -6948 3499 6789 -4618
3531 -4618 -5817 5734 3523 -7250 -2723 7025 540 -8036 149 7016 -1874 -6642 3394 6279
3545 6279 -4983 -5638 6238 4509 -6714 -1938 7885 517 -7257 1512 7548 -2963 -6567 3972
3559 3972 5475 -4968 -4716 5476 3513 -7009 -2398 7095 460 -7455 741 6957 -2835 -6583
3573 -6583 4563 5317 -5414 -4434 6184 3041 -6388 -1458 7225 130 -7478 1046 7316 -2793
3587 -2793 -6908 4674 5651 -5755 -3905 7155 2650 -7144 -1233 7542 -338 -6847 2341 7011
3601 7011 -3295 -6123 4425 5521 -6069 -4190 6395 2140 -7865 -1048 7417 -1065 -7551 2064
3615 2064 6126 -3642 -5291 5232 5393 -5720 -3525 7013 2676 -6551 40 8101 -824 -7257
3629 -7257 2686 7004 -4050 -5792 5332 3644 -6626 -3227 6784 1645 -7140 -479 6934 -1349
3643 -1349 -7087 2979 6558 -4311 -5964 5922 4299 -6454 -2395 7041 649 -7287 249 7001
3657 7001 -1464 -6721 2920 6045 -4337 -5433 5776 4250 -6298 -2744 7317 992 -6800 1129
3671 1129 7499 -2341 -6585 3733 5717 -4869 -4853 5318 3312 -6845 -2589 6820 587 -7572
3685 -7572 649 6957 -2948 -6848 4272 5523 -4949 -4043 6371 3282 -6156 -1335 7083 796
3699 796 -6710 1133 6833 -2138 -6639 3983 5641 -5690 -4346 6307 2843 -7254 -1506 6665
3713 6665 -678 -6993 1540 6718 -3182 -6248 4347 5619 -5041 -3973 6559 2733 -7417 -964
3727 -964 7596 -538 -7542 2160 6572 -3394 -5496 4429 4595 -5663 -3557 6515 2532 -6657 -613
3742 -613 7533 -549 -6919 2551 7037 -4115 -5588 5130 4234 -5992 -3306 6237 1217 -7495 -705
3757 -705 6869 -1398 -7232 2073 6526 -4130 -5518 5864 4797 -6179 -2617 7322 1378 -6571
3771 -6571 1165 7236 -1471 -6542 2654 5683 -4145 -5063 5029 3607 -7148 -3544 6913 1388
3785 1388 -7227 82 6455 -2677 -6432 3659 6065 -4668 -4759 5435 3917 -5821 -2230 7215 817
3800 817 -7764 353 7240 -2226 -6958 3843 5571 -5579 -4417 6497 3514 -6273 -1436 6772
3814 6772 572 -6275 1831 7211 -2302 -6599 3817 5203 -5259 -4435 5966 2488 -7367 -1688
3828 -1688 6503 -247 -6920 1632 5893 -3292 -5885 4569 5788 -4812 -4007 6613 3241 -6578
3842 -6578 -696 8122 -301 -7218 2144 6700 -3482 -5690 4315 4356 -6081 -4161 5981 2530
3856 2530 -6751 -1546 6970 -894 -7442 2555 6897 -3886 -5638 5067 4279 -5463 -2924 6793 1665
3871 1665 -6865 -734 6473 -826 -6816 1925 6094 -3919 -5834 5184 4955 -6290 -3008 6789
3885 6789 1923 -6644 372 7341 -1410 -6454 2798 5752 -4182 -5177 4708 3598 -6671 -3280 6329
3900 6329 1140 -7454 35 6740 -2276 -6539 3556 5778 -4452 -4392 5267 4326 -5290 -1773 6883
3915 6883 1212 -7184 685 6849 -1882 -7013 3161 5564 -5084 -4799 5862 2943 -6786 -2511
3929 -2511 6388 640 -6677 1190 6758 -2454 -6432 3966 6098 -4754 -4100 5844 2653 -7132 -1502
3944 -1502 6905 -248 -6923 1217 5883 -2903 -5088 4409 4977 -4672 -4060 6143 3293 -6103 -918
3959 -918 7094 -354 -6998 2162 6633 -3294 -5762 3774 4112 -5370 -3616 5684 2368 -7031 -1919
3974 -1919 6589 -461 -7184 2211 6607 -3881 -5638 5441 5286 -5413 -2583 6507 1945 -6654
3988 -6654 -135 6931 -891 -6655 2125 6108 -3735 -5275 4612 3982 -6512 -3191 6467 1447 -6611
4003 -6611 49 6547 -1991 -6261 3036 6242 -3597 -5211 5053 3929 -5732 -2885 6906 1029 -7442
4018 -7442 173 7107 -1945 -5994 3695 5412 -4631 -4103 5820 3688 -5318 -1969 6522 798 -6612
4033 -6612 677 7075 -2093 -6631 2839 5114 -5204 -4714 5168 2562 -6968 -1781 6439 481 -6432
4048 -6432 997 6433 -2068 -5870 4052 6191 -4277 -4467 6181 3169 -6543 -1262 6891 -118 -7115
4063 -7115 1404 6336 -2916 -5437 4125 4089 -4965 -4245 6102 2875 -6704 -1328 6684 -445 -6680
4078 -6680 2239 6333 -3572 -5681 4360 4490 -5178 -3085 5710 1854 -6501 -1137 6831 88 -6391
4093 -6391 1765 6170 -3068 -5154 5551 4873 -5505 -3118 6141 1765 -6362 -153 6615 -1042 -7040
4108 -7040 1841 5678 -3259 -5416 4339 3743 -6372 -3217 6642 1364 -6912 241 6489 -1286 -5948
4123 -5948 3224 5880 -3532 -4567 4588 4046 -5447 -2604 6386 1373 -7072 16 7081 -1797 -6309
4138 -6309 3076 4955 -5169 -4357 5439 2986 -5895 -2392 6219 751 -6338 729 6501 -2248 -6321
4153 -6321 3088 5362 -4834 -4265 5500 2746 -6715 -1395 6563 546 -6176 1160 6284 -1862 -5262
4168 -5262 3874 5611 -4356 -4148 5578 3144 -6240 -1639 6659 -203 -6985 1370 5969 -3029 -5658
4183 -5658 3475 4476 -4517 -4019 5607 2807 -6202 -1490 6859 -225 -6724 2158 6700 -3114 -5116
4198 -5116 4823 4498 -5109 -3049 6160 1946 -5921 -744 6081 -327 -6236 1676 6014 -3201 -5437
4213 -5437 4745 4027 -5675 -2938 5882 1624 -6444 -416 6115 -1204 -6502 2043 5780 -3472 -5513
4228 -5513 4169 4019 -5570 -2713 6333 1584 -6450 576 6932 -1265 -5769 3159 5438 -3625 -4284
4243 -4284 5058 3848 -5503 -2529 5845 1277 -6835 -173 6251 -2278 -6163 3178 5255 -3954 -4296
4258 -4296 5025 3241 -5570 -1585 6134 888 -6043 494 6544 -1657 -5937 3336 5422 -4376 -4421
4273 -4421 5432 3038 -6024 -1510 6465 109 -6059 1172 6147 -2229 -5631 3417 5117 -4397 -3989
4288 -3989 5696 3221 -6328 -1801 6391 -743 -6458 1574 5760 -3430 -5783 3566 4427 -4461 -3763
4303 -3763 5408 2546 -5684 -883 6784 259 -5732 1997 6399 -2899 -5193 4663 4407 -5158 -3007
4318 -3007 5323 1628 -6165 -1075 5735 -687 -6276 1565 5894 -2905 -5436 4628 4189 -5330 -2497
4333 -2497 6468 1851 -6067 162 5927 -919 -5655 2093 5153 -3190 -5189 4237 3788 -5315 -2765
4348 -2765 6085 1530 -6425 62 6588 -1450 -5587 3135 5233 -3397 -4139 4742 3453 -5250 -2531
4363 -2531 5876 855 -7063 -378 5968 -2237 -6250 2929 5110 -4360 -3929 5181 3156 -5019 -1225
4378 -1225 6081 1137 -5442 887 6326 -1133 -5635 3020 5120 -4410 -4370 4797 2521 -6493 -1878
4393 -1878 5602 63 -6257 851 5597 -2491 -5495 3164 4748 -4060 -3541 5332 3261 -6013 -1102
4408 -1102 6786 -91 -6376 1265 5840 -3071 -5250 3723 3839 -4536 -3330 5087 2282 -5581 -884
4423 -884 6335 374 -6166 1785 6328 -2829 -5001 4231 4461 -4762 -3122 5131 1760 -6018 -1134
4438 -1134 5322 -690 -6120 1001 5430 -3118 -5576 3987 4282 -5175 -2473 6490 1793 -5803 344
4453 344 6506 -1021 -5432 2394 5109 -3240 -4913 4013 3432 -5807 -3312 5282 1042 -6732 -115
4468 -115 6027 -1497 -5886 2890 5157 -3426 -3868 4423 3352 -4972 -1947 5798 1194 -6287 -277
4483 -277 5961 -1620 -6100 2594 5021 -4377 -4469 4768 2970 -5425 -1397 5634 992 -5427 892 6151
4499 6151 -1301 -5366 2725 4882 -4105 -4208 4546 2625 -5918 -1757 5620 -128 -6246 600 4976
4514 4976 -2060 -5017 3218 4989 -3433 -3874 5322 3433 -5034 -1153 6682 417 -6313 1564 5717
4529 5717 -2314 -5198 3360 3741 -4628 -3550 4697 2252 -6124 -1585 5598 -236 -5661 1607 5873
4544 5873 -2646 -4838 4311 4372 -4458 -2897 5371 1478 -5907 -700 5482 -432 -5956 1374 4971
4559 4971 -2898 -4884 4272 4378 -4905 -2928 5622 1585 -5628 216 6199 -684 -5529 2139 5085
4574 5085 -2693 -4387 3797 3291 -5112 -3149 5506 1192 -6471 -549 5498 -1682 -5632 3014 4963
4589 4963 -3364 -3882 4365 3385 -4563 -1801 5620 1350 -5217 160 5979 -826 -5221 2645 4885
4604 4885 -4575 -3873 4792 2643 -5416 -1920 5419 281 -5264 296 5543 -1402 -5349 2827 5003
4619 5003 -3733 -3790 5070 2902 -5685 -1979 5948 -39 -5895 924 5179 -2183 -4956 3121 4399
4634 4399 -3852 -3422 4971 2649 -4946 -1292 6011 275 -5531 1272 5490 -2388 -4435 3550 3771
4649 3771 -4488 -3455 4692 1927 -5180 -1346 4922 -78 -6126 1269 5606 -2603 -4871 3648 3880
4664 3880 -4535 -2407 5823 1883 -5353 -335 5671 -517 -5136 1550 5016 -2662 -4753 3730 3501
4679 3501 -4998 -2891 5124 1100 -6290 -391 5459 -1150 -5201 2242 4711 -3085 -4049 3896 3502
4694 3502 -4479 -2571 5039 1333 -5754 -265 5946 -1342 -5762 2543 4901 -3529 -3705 4519 3185
4709 3185 -4945 -2117 5542 994 -5255 202 5341 -1583 -5495 2775 4806 -3538 -4140 4466 2513
4724 2513 -5684 -1752 5048 14 -5581 418 5083 -1677 -4699 2472 4605 -3540 -3699 5060 3159
4739 3159 -5148 -1167 5981 -23 -5334 959 5453 -2342 -4818 2661 3959 -3823 -3267 4283 2186
4754 2186 -5316 -1516 6054 -122 -5755 1437 5413 -2885 -4570 3889 3953 -4386 -3003 4701 1684
4769 1684 -4975 -986 5404 -249 -5342 1014 5259 -2447 -4329 3750 4033 -4199 -2535 5166 1800
4784 1800 -5254 -373 5247 -810 -4937 1600 4452 -2392 -4611 2988 3274 -4603 -2745 5161 1440
4799 1440 -5806 -17 5508 -1218 -4639 2271 4724 -2951 -3603 3695 2976 -4547 -2486 5128 1666
4814 1666 -5463 -328 5313 -1088 -5335 2368 4526 -3521 -3821 4604 3056 -4723 -1841 4973 844
4829 844 -5224 230 5118 -1350 -5445 2041 4468 -3757 -3934 4550 2549 -5400 -1522 5114 680
4844 680 -5092 1009 5199 -1675 -4433 3196 4792 -3241 -3416 4269 2874 -5250 -1663 5497 -390
4859 -390 -5746 778 4860 -2319 -4311 2654 3623 -3906 -3563 4302 2724 -4535 -1168 5446 190 -5413
4875 -5413 1081 5477 -2355 -4552 2956 3293 -4569 -2713 4515 1668 -5214 -1183 4971 -51 -4790
4890 -4790 1600 5286 -2608 -4494 3498 3862 -3986 -2488 4903 1335 -5095 -462 5141 -836 -4983
4905 -4983 771 3870 -2594 -4109 3326 3367 -4661 -2709 4847 1500 -5058 412 5774 -860 -4934
4920 -4934 2259 4636 -2558 -3461 3796 2807 -4635 -2574 4543 1207 -5859 -534 4939 -1533 -4923
4935 -4923 2752 4491 -3262 -3804 3929 2613 -4122 -1301 4948 567 -4923 450 4993 -865 -4642
4950 -4642 1999 4050 -3269 -3627 4040 2642 -4713 -1522 4991 325 -4697 1097 5045 -1391 -4250
4965 -4250 2672 4268 -2681 -2987 4460 2296 -4942 -1482 5048 79 -5438 664 4346 -2656 -4375
4980 -4375 2855 3466 -3882 -2911 4092 2104 -4048 -744 5297 564 -5002 990 5098 -2011 -3970
4995 -3970 3373 3574 -3938 -2699 4428 1781 -4537 -751 4224 -572 -4935 1296 4942 -2578 -4365
5010 -4365 3069 3714 -3931 -2445 4908 1483 -5015 21 4871 -980 -4572 1603 4338 -2601 -4074
5025 -4074 3238 2887 -3941 -2410 4849 1291 -5004 -268 5047 -633 -4611 2310 4807 -2592 -3042
5040 -3042 3610 3100 -4092 -2359 4644 1109 -5004 -185 4674 -1174 -5308 1796 4187 -3405 -3505
5055 -3505 4033 2656 -4814 -1478 4605 950 -4040 252 4881 -1165 -4347 2401 4483 -3058 -3324
5070 -3324 4076 2334 -4667 -1673 4822 164 -4992 380 4347 -1934 -3905 2265 3851 -3230 -3312
5085 -3312 3776 2704 -4548 -1587 5333 206 -4966 811 5035 -1615 -4046 2892 3149 -3799 -2661
5100 -2661 3834 1867 -4595 -1212 4793 442 -4364 1303 4966 -1988 -4054 3349 3851 -3811 -1938
5115 -1938 4154 1305 -4798 -606 4245 -480 -4674 494 3647 -2349 -4153 2936 3609 -3976 -2785
5130 -2785 4550 1622 -4550 147 5048 -529 -4171 1880 4042 -2097 -3172 2898 2841 -3884 -2708
5145 -2708 4261 984 -5102 -472 4541 -981 -4781 2066 4037 -2681 -3617 3605 2658 -3539 -1722
5160 -1722 4402 1147 -4550 -84 4873 -704 -4295 1877 3855 -3342 -3419 3560 2456 -4479 -1607
5175 -1607 4621 728 -4106 470 4753 -1131 -3885 2480 4198 -2773 -3392 3699 2358 -4897 -1565
5190 -1565 4557 154 -4977 725 3801 -1959 -4174 2296 3559 -3057 -2721 3742 2543 -3926 -940
5205 -940 4748 265 -4964 1226 4631 -1981 -3818 2835 3219 -3515 -2268 4019 1648 -4256 -1165
5220 -1165 4340 34 -4694 921 4179 -1967 -4261 2985 3075 -3950 -2199 4001 991 -4356 -677
5235 -677 4459 57 -4150 1020 3983 -1929 -3655 2946 3438 -3923 -2265 4217 1365 -4529 85
5250 85 4677 -542 -4278 1702 3744 -2447 -3207 2887 2575 -3752 -2135 4254 877 -4768 -165 4650
5266 4650 -1059 -4515 1937 4045 -2456 -3164 3207 2248 -3551 -1454 4084 983 -4492 -213 4479
5281 4479 -864 -3994 2122 4066 -3025 -3148 3504 1966 -4133 -1190 4283 176 -4319 504 4036
5296 4036 -1128 -3749 1827 3785 -3166 -3196 3594 2166 -4301 -1458 4540 415 -4422 895 4116
5311 4116 -1676 -3797 2585 3263 -2754 -2579 3774 1850 -4133 -960 4506 146 -4142 839 4087
5326 4087 -1798 -3611 2845 3135 -3299 -2305 3483 1416 -3740 -679 4185 92 -4237 518 3838
5341 3838 -1735 -3822 2992 3034 -3614 -2533 3886 1379 -4104 -363 4212 -426 -3905 1248 4059
5356 4059 -1869 -3594 2980 3091 -3399 -2185 4202 1122 -4319 158 4306 -985 -4074 1449 3395
5371 3395 -2731 -3216 2654 2440 -3475 -1861 3738 924 -4202 18 4460 -952 -3955 2109 3464
5386 3464 -2865 -2969 3213 2456 -3658 -1119 3881 772 -4163 120 4319 -793 -4331 1725 3650
5401 3650 -2670 -2987 3568 1970 -4208 -1074 3964 174 -4230 571 3530 -1376 -3809 2065 3483
5416 3483 -2825 -2946 3145 2099 -4184 -1368 4451 506 -4053 528 4031 -1454 -3400 2746 2918
5431 2918 -2660 -2696 3335 2138 -3597 -1016 4103 -100 -4336 631 3926 -1665 -3655 2416 2737 -3656
5447 -3656 -2225 3593 1315 -3770 -670 3989 -49 -3840 1218 3852 -1513 -3468 2475 2796 -3273
5462 -3273 -1882 3929 1128 -3864 -248 4045 -387 -3670 1132 3172 -1991 -3175 2692 2834 -3225
5477 -3225 -2267 3668 1124 -4078 -550 4265 -894 -3976 1628 3680 -2376 -2880 2763 2377 -3217 -1781
5493 -1781 3637 983 -3660 -165 4048 -858 -3561 1956 3707 -2482 -2519 3157 1950 -3408 -1114
5508 -1114 3769 501 -3752 -73 3577 -527 -3991 1823 3123 -2662 -3072 2761 1989 -3827 -1372
5523 -1372 3849 490 -3802 545 3659 -1020 -3118 2275 3248 -2470 -2711 3109 2473 -3472 -1020 3987
5539 3987 -23 -4135 957 3897 -1433 -3164 1988 2385 -2843 -2195 3301 1442 -3583 -836 3835
5554 3835 88 -3632 943 3494 -1800 -3388 2398 2555 -2774 -1924 3328 1152 -3560 -798 3801
5569 3801 116 -3509 1008 3455 -1969 -3185 2661 2731 -3151 -1945 3687 1293 -3612 -60 3719
5584 3719 -742 -3626 1383 3073 -1837 -3074 2255 2079 -3392 -1734 3462 1182 -3870 -283 3802
5599 3802 -451 -3599 1884 3426 -2055 -2383 2758 2229 -2846 -1374 3438 801 -3657 -88 3614
5614 3614 -507 -3856 1328 3203 -2624 -2663 3181 1917 -3114 -1148 3393 861 -3253 -43 3590
5629 3590 -1068 -3607 1518 3138 -1866 -2982 2718 1837 -3470 -1141 3208 140 -3746 331 3339
5644 3339 -943 -2834 1776 2955 -2051 -2166 2847 1620 -3244 -1309 3440 14 -3849 554 3506
5659 3506 -1655 -3132 1901 2194 -2605 -2052 2637 1232 -3362 -975 3583 280 -3380 531 3147
5674 3147 -1168 -3214 2542 2765 -2926 -1950 3082 1139 -3161 -446 3341 -239 -3426 646 3289
5689 3289 -1402 -2900 2303 2561 -3059 -1892 3045 1176 -3524 -341 3417 -398 -3375 1217 3065
5704 3065 -1519 -2567 2144 2205 -2552 -1561 3014 1083 -3505 -357 3450 -609 -3123 1370 2699 -2296
5720 -2296 -2215 2652 1841 -3004 -1464 3176 730 -3297 -251 3387 -491 -3617 1240 2956 -2203 -2579
5736 -2579 2636 1809 -3235 -1167 3245 311 -3300 111 2967 -731 -3051 1484 3005 -2066 -2548
5751 -2548 2835 2270 -2912 -963 3713 -53 -3071 598 3315 -1207 -3002 1469 2347 -2300 -2313 2600
5767 2600 1513 -3260 -1014 3150 228 -3398 570 3391 -1397 -2634 2065 2502 -2320 -1829 2840
5782 2840 1392 -2763 -836 3256 318 -3497 578 2965 -1282 -2696 2338 2667 -2611 -1926 2973
5797 2973 1148 -3178 -289 3083 69 -3014 826 2894 -1243 -2983 1913 2169 -2609 -2211 3030
5812 3030 1115 -3513 -343 3052 -24 -2862 1307 2748 -1327 -2232 2064 1970 -1756 -1455 3055 1045
5828 1045 -2994 -233 3310 -439 -3403 861 2760 -1841 -2504 2150 1647 -2534 -1542 2664 806 -2857
5844 -2857 -77 3149 -624 -2910 1205 3027 -2038 -2493 2272 1655 -2989 -1107 2797 645 -2854
5859 -2854 419 3223 -661 -2785 1073 2422 -2003 -2109 2314 2145 -2856 -1039 3380 323 -2942
5874 -2942 405 2808 -1201 -2843 1296 2421 -2147 -2084 2142 1198 -2657 -1240 3152 397 -3391 291
5890 291 3326 -1008 -2756 2145 2363 -2195 -1375 2597 1542 -2633 -890 3100 211 -3005 344 3097
5906 3097 -1012 -2501 1653 2289 -2214 -1650 2837 1105 -2829 -452 2859 -126 -2635 574 2454
5921 2454 -1160 -2496 1655 2407 -2315 -1786 2798 888 -3151 -294 3334 -515 -3044 945 2670
5936 2670 -1418 -2547 1869 1924 -2186 -1315 2567 1023 -3067 -518 2993 -375 -2684 1224 2512 -1984
5952 -1984 -1904 1652 1438 -2551 -1331 2419 724 -2595 -50 2730 -408 -2580 926 2985 -1589 -2378
5968 -2378 2531 2081 -2546 -1001 3052 530 -2735 131 2670 -1050 -2809 996 2328 -1599 -2345
5983 -2345 1946 1626 -2640 -1383 2801 469 -3078 648 2739 -764 -2295 1156 2354 -1719 -1786 2071
5999 2071 1209 -2366 -1048 2789 493 -2884 47 2707 -1249 -2791 1809 2496 -2277 -1581 2503 1051
6015 1051 -2268 -558 2352 124 -2705 335 2529 -759 -2794 1457 1987 -2277 -1830 2262 965
6030 965 -2741 -365 2507 -146 -2447 456 2463 -935 -1893 1632 1936 -1783 -1606 2771 1048 -2745
6046 -2745 -182 2972 -520 -2692 1323 2569 -1304 -1904 1466 1614 -1883 -1286 2004 1275 -2319 -313
6062 -313 2810 -18 -2785 959 2558 -1568 -2130 2020 1810 -2148 -981 2410 399 -2426 -134 2815
6078 2815 -238 -2659 867 2682 -1139 -2096 1944 1717 -2743 -925 2734 644 -2655 114 2571
6093 2571 -954 -2295 1019 2118 -1251 -2121 1914 1441 -2414 -895 2355 360 -2661 86 2728
6108 2728 -908 -2042 1488 2143 -1399 -1555 2121 1404 -2048 -718 2693 233 -2850 -44 2771 -707
6124 -707 -2657 1338 1756 -2049 -1542 2005 720 -2306 -480 2605 19 -2472 221 2477 -809 -2084
6140 -2084 1364 2298 -1689 -1354 2278 904 -2468 -270 2539 81 -2270 794 2576 -848 -1980
6155 -1980 1446 1824 -1745 -1499 2222 1076 -2487 -558 2695 -296 -2905 550 2245 -1159 -1957 1712
6171 1712 1455 -1744 -1128 2111 1051 -2573 -500 2548 -112 -2665 910 2448 -1258 -1986 2189 1572
6187 1572 -1930 -1078 2183 615 -2425 47 2349 -330 -2560 401 2268 -1236 -2062 1862 1413 -2107
6203 -2107 -1403 2326 281 -2633 -67 2261 -1089 -1917 891 1949 -1374 -1673 1767 1313 -2158 -1040
6219 -1040 2605 625 -2718 -112 2626 -647 -2267 1105 1750 -1699 -1653 1653 933 -2130 -882 1793
6235 1793 440 -2501 -247 2256 -603 -2385 1264 2078 -1887 -1261 1969 1106 -2060 -497 2098 198
6251 198 -2085 423 2351 -687 -2340 1040 1890 -1936 -1594 2205 1209 -2335 -92 2331 122 -2216
6267 -2216 598 1871 -1020 -1861 1027 1809 -1728 -1680 1562 896 -2419 -688 2320 -252 -2229 540
6283 540 1844 -1224 -1673 1770 1371 -1396 -990 2179 1125 -2197 -172 2418 -87 -2263 665 2270
6299 2270 -974 -2000 1792 1256 -2151 -943 1739 264 -2272 -142 2148 -280 -2025 767 2008
6314 2008 -1100 -1629 1532 1799 -2174 -1245 2370 260 -2078 314 2113 -485 -2059 732 1573 -1276
6330 -1276 -1473 1503 1770 -1605 -933 2282 873 -2272 189 2419 -433 -2282 1152 1795 -1537 -1441
6346 -1441 1716 985 -2024 -970 2104 231 -2358 -29 2329 -407 -2154 1428 1747 -1258 -1360 1945
6362 1945 1230 -2038 -250 2143 167 -2209 48 1949 -454 -2361 1013 1858 -1494 -1486 1583 878
6378 878 -2116 -1093 2194 54 -2221 477 1911 -923 -1736 1095 1153 -1230 -1277 2107 1064 -1982
6394 -1982 -431 2635 149 -2175 584 2144 -1281 -1442 1267 1564 -1400 -1316 1815 1076 -1868 -342
6410 -342 2341 -168 -2074 566 1942 -984 -2170 1315 1392 -1657 -1270 1417 479 -2081 -364 1764
6426 1764 -412 -1949 615 1743 -746 -1746 1570 1578 -1749 -1019 2195 599 -1944 571 2361 -513
6442 -513 -2000 830 1763 -1282 -1777 1184 1426 -1875 -1053 2102 310 -2334 -295 2055 -335 -2200
6458 -2200 1045 1752 -1209 -1409 1721 1097 -1666 -967 1720 606 -2015 -146 1947 -507 -2254 954
6474 954 1664 -1297 -1638 1521 895 -1643 -407 1871 329 -1939 362 2197 -347 -1547 1124 1509
6490 1509 -1291 -1667 1409 1098 -2154 -1168 1737 -207 -2155 -55 1717 -744 -1462 891 1606 -946
6506 -946 -900 1704 1222 -1448 -416 2495 513 -2035 38 2190 -1031 -2138 1042 1219 -1684 -1397
6522 -1397 1323 631 -1847 -392 1780 23 -2267 64 1951 -588 -1717 1148 1817 -1404 -1038 1678
6538 1678 598 -1732 -246 1893 -276 -1873 567 1995 -926 -1863 1107 1493 -1595 -811 2174 810
6554 810 -2012 129 2076 -640 -1712 579 1833 -1042 -1654 863 1037 -1475 -1040 1622 435 -2061
6570 -2061 -297 1771 -431 -2034 721 1910 -1231 -1300 1322 1326 -1269 -259 1862 726 -1722 -197
6586 -197 1767 -2 -2165 932 1568 -1328 -1674 1365 989 -1870 -734 1611 317 -1959 -112 1739
6602 1739 -554 -1708 714 1482 -968 -1355 1685 895 -1663 -862 1897 300 -1808 143 1677 -775
6618 -775 -1825 744 1339 -1128 -1432 1325 945 -1820 -530 2057 367 -2142 206 2026 -656 -1741
6634 -1741 1016 1201 -1599 -1035 1443 783 -1780 -559 1528 160 -1864 269 2018 -693 -1717 1028
6650 1028 1742 -1215 -1059 1712 621 -1587 -374 1657 32 -1453 370 1482 -814 -1512 1126 1389
6666 1389 -1466 -1278 1437 637 -2042 -503 1887 -203 -1790 514 1314 -890 -1370 1106 1351 -1523
6682 -1523 -1017 1459 1014 -1585 -349 1810 152 -1856 549 2141 -881 -1348 1443 1011 -1378 -947
6698 -947 1375 282 -1533 -167 1460 -269 -1710 508 1635 -897 -1608 1533 1160 -1950 -1084 1816
6714 1816 291 -1631 -8 1575 -418 -1589 463 1446 -747 -1508 1296 1234 -1317 -635 1984 595
6730 595 -1883 411 1853 -608 -1400 453 1421 -1193 -1263 1166 711 -1718 -696 1713 361 -2086
6746 -2086 -168 1932 -817 -2023 894 1235 -1241 -883 1513 911 -1275 -392 1812 492 -1785 164
6762 164 1613 -582 -1766 1082 1464 -1415 -1320 1556 629 -1599 -363 1512 -382 -1606 427 1519
6778 1519 -776 -1528 1015 1225 -1110 -1280 1730 1111 -1722 -412 1696 -125 -1544 258 1486 -769
6794 -769 -1404 997 1306 -1191 -1037 1297 624 -1569 -140 2043 -26 -1674 519 1641 -825 -1392
6810 -1392 1202 886 -1635 -1002 1647 253 -1652 -52 1495 -388 -1877 219 1404 -791 -1578 1461
6826 1461 954 -1604 -301 1882 715 -1772 248 1612 -439 -1255 646 1528 -781 -1291 1242 1031
6842 1031 -1423 -821 1470 209 -2118 72 1661 -518 -1466 684 1333 -1302 -1241 1316 747 -1127
6858 -1127 -385 1490 407 -1438 301 1932 -429 -1504 884 1315 -995 -1148 1660 808 -1567 -787
6874 -787 1468 125 -1833 157 1697 -194 -1762 804 1342 -1131 -998 1467 664 -1831 -442 1572
6890 1572 -8 -1374 101 1282 -677 -1479 650 1266 -1048 -997 1596 1020 -1689 -347 2086 -26
6906 -26 -1739 389 1826 -579 -1218 1059 1342 -1069 -1087 1076 361 -1552 -602 1569 56 -2017 266
6923 266 1509 -998 -1321 1065 1329 -1274 -546 1626 330 -1294 24 1809 -267 -1723 511 1468
6939 1468 -648 -1375 1203 1529 -1031 -819 1567 448 -1707 -103 1563 -161 -1555 384 1495 -693
6955 -693 -1038 1082 1285 -1340 -1102 1153 239 -2072 -324 1365 -392 -1587 819 1584 -936 -1082 770
6972 770 746 -981 -513 1656 661 -1605 200 1649 -352 -1509 658 1641 -1065 -1094 1502 691 -1786
6989 -1786 -774 1079 222 -1624 -44 1648 -396 -1680 891 1146 -1011 -1268 1402 814 -1599 -445
7005 -445 1858 262 -1415 127 1554 -422 -1214 720 1128 -819 -1007 1088 1303 -1487 -422 2037
7021 2037 144 -1677 148 1425 -471 -1125 846 1043 -914 -776 1210 536 -1497 -647 1401 -216
7037 -216 -1512 92 1590 -690 -1432 1003 981 -1366 -982 1465 942 -1123 -212 1861 124 -1521 422
7054 422 1703 -578 -1336 762 1365 -1272 -1278 1225 351 -1947 -688 1524 -319 -1574 443 1153 -801
7071 -801 -1348 1130 1123 -1188 -928 1504 438 -1818 -216 1999 -193 -1517 756 1310 -1121 -1105 1074
7088 1074 738 -1253 -1056 1171 515 -1409 -130 1787 -139 -1523 511 1301 -1020 -1172 1109 917
7104 917 -1390 -365 1311 534 -1412 117 1540 -254 -1631 740 1171 -983 -1161 978 841 -1437
7120 -1437 -692 1511 544 -1312 321 1498 -183 -1112 840 1290 -830 -988 980 682 -1237 -735 1189
7137 1189 47 -1702 117 1072 -734 -1742 802 1038 -810 -895 1262 733 -1058 -370 1704 96
7153 96 -1329 491 1704 -253 -1377 938 1318 -1007 -672 1282 656 -1217 -133 1157 -210 -1632
7169 -1632 179 1409 -375 -1350 888 1218 -1183 -629 1406 403 -1629 -366 1538 -203 -1660 381
7185 381 1563 -612 -1185 911 1389 -970 -962 1073 753 -1468 -161 1627 -109 -1548 663 1307 -800
7202 -800 -932 1044 879 -1153 -739 1120 573 -1633 -304 1403 -24 -1512 351 1485 -1012 -1100 1143
7219 1143 990 -1349 -670 1322 346 -1485 51 1511 -354 -994 663 1394 -850 -1159 1059 1020 -1664
7236 -1664 -483 1383 3 -1713 157 1450 -520 -1253 477 1133 -1000 -1074 1150 903 -1261 -920
7252 -920 1249 477 -1671 83 1582 -382 -1250 490 1468 -923 -1082 1062 534 -1092 -414 1290 309
7269 309 -1151 483 1259 -734 -1459 845 1189 -1313 -956 1324 491 -1570 -320 1283 -97 -1522
7285 -1522 235 1073 -407 -1476 623 1059 -1282 -761 1398 715 -1190 -367 1434 -112 -1264 516
7301 516 1522 -626 -950 883 943 -950 -884 1258 595 -1517 -91 1526 -151 -1628 477 1357 -1119
7318 -1119 -1446 1173 678 -1020 -677 1213 510 -1324 -269 1491 -169 -1333 627 1413 -807 -884 1152
7335 1152 660 -1084 -527 1104 530 -1179 -17 1415 -360 -1213 709 1347 -777 -987 1054 1210 -1427
7352 -1427 -912 1589 436 -1569 -223 1208 -406 -1021 398 1107 -953 -832 1305 676 -1226 -614
7368 -614 1652 207 -1346 -23 1681 -191 -907 994 1073 -930 -818 1522 505 -1448 -487 1212
7384 1212 210 -1706 39 1266 -461 -1509 799 1002 -1079 -835 1427 690 -1244 -31 1215 -166
7400 -166 -1400 219 1290 -525 -1484 885 1454 -1157 -1018 1307 625 -1422 164 1415 19 -1352
7416 -1352 480 1157 -551 -1200 623 969 -872 -537 1042 959 -1487 -402 1476 -211 -1610 138
7432 138 1293 -916 -1248 785 1128 -1179 -583 1149 720 -1100 -226 1453 275 -1333 673 1373 -437
7449 -437 -839 1113 892 -1585 -410 1353 305 -1259 178 1103 -514 -1755 77 1136 -878 -1336
7465 -1336 676 842 -1291 -743 1393 195 -1520 51 1456 -251 -1103 1023 1038 -700 -959 1083
7481 1083 703 -1217 -649 1361 448 -1296 300 1209 -102 -1257 631 1093 -1054 -1262 1100 699 -1131
7498 -1131 -265 1010 81 -1558 -159 1394 -623 -1414 735 1252 -959 -848 1247 598 -1381 -109
7514 -109 1582 40 -1292 408 1396 -265 -1302 819 1230 -660 -1057 1244 875 -1366 -299 1408
7530 1408 -17 -1613 226 917 -897 -1362 581 1126 -963 -802 1117 868 -1122 -528 1430 -17
7546 -17 -1070 578 1800 -405 -1165 695 1087 -1180 -938 1378 881 -1103 -421 1259 -39 -1662 171
7563 171 1331 -716 -1442 727 1054 -1540 -779 1325 597 -1716 -118 1191 -2 -1284 458 1360
7579 1360 -734 -1413 986 1130 -1079 -676 1332 627 -1277 391 1532 -281 -995 739 1302 -951
7595 -951 -806 951 858 -1046 -788 1381 386 -1653 -110 1369 -389 -1588 573 1126 -1049 -1203 1331
7612 1331 830 -1212 -669 1308 137 -1297 97 1312 -218 -1423 623 1337 -1176 -848 1409 704
7628 704 -1222 -345 1411 65 -1364 81 1365 -148 -1210 446 941 -1061 -957 1051 605 -1464
7644 -1464 -562 1555 192 -1573 265 1068 -373 -1226 703 956 -964 -1142 814 901 -1200 -591 1388
7661 1388 167 -1519 72 1568 -666 -901 949 850 -1034 -525 1307 431 -1352 -281 1078 -49
7677 -49 -1344 -25 1417 -554 -1426 674 951 -1298 -755 1440 314 -1223 -241 1360 -194 -1288
7693 -1288 534 1287 -508 -1208 941 1081 -945 -825 1336 510 -1441 -427 1299 -292 -1283 538
7709 538 882 -691 -967 1024 1178 -1173 -604 763 573 -1306 -145 1274 -321 -1348 737 1515 -980
7726 -980 -898 1204 486 -1431 -693 1097 107 -936 -9 1402 -196 -1362 781 1489 -925 -910 1296
7743 1296 900 -1505 -659 1251 3 -1377 26 1290 -374 -1112 415 1109 -1086 -851 1109 599
7759 599 -1304 -363 1541 8 -1091 425 1499 -454 -873 739 1039 -653 -907 1215 898 -1203
7775 -1203 -622 1136 41 -1572 -98 1637 -421 -1167 915 1166 -1078 -516 1164 286 -1205 -282
7791 -282 1267 -147 -1194 152 1170 -404 -1187 950 1042 -1196 -619 1225 430 -1327 70 1229
7807 1229 -46 -1215 270 1050 -562 -1038 844 1252 -754 -837 1090 222 -1540 -302 1376 -199
7823 -199 -1454 522 1199 -1003 -1025 985 724 -1071 -536 1202 594 -1258 -210 1711 -23 -1448 745
7840 745 1374 -796 -1057 1187 780 -1099 -172 1405 152 -1128 -147 1156 -190 -1142 480 1112 -977
7857 -977 -1219 1077 680 -1400 -668 1207 60 -1261 215 1462 -214 -1068 808 972 -713 -921 934
7874 934 831 -945 -626 1375 393 -1326 147 1108 -547 -976 929 1416 -663 -1091 780 604 -1211
7891 -1211 -499 1304 54 -1340 8 1666 -507 -1050 985 860 -1106 -615 1209 285 -1071 -153
7907 -153 1166 170 -732 294 1462 -501 -1395 717 1242 -1055 -413 1699 646 -1410 -59 1396
7923 1396 -254 -1268 70 954 -452 -1234 783 1048 -1248 -1022 951 515 -1192 -193 1608 -207
7939 -207 -1374 557 1201 -556 -763 1003 824 -1131 -803 995 374 -1107 -83 1709 -426 -1334 531
7956 531 1273 -581 -938 1245 669 -1226 -410 1108 236 -1329 -155 1236 -85 -1310 222 974 -564
7973 -564 -1314 886 843 -1197 -407 1234 -22 -1073 178 1342 -415 -1188 785 1187 -750 -755 956
7990 956 785 -1258 -612 1423 132 -1419 36 1188 -404 -1429 435 990 -882 -764 825 541
8006 541 -1198 -479 1224 202 -1487 44 1257 -366 -1327 817 981 -912 -814 1360 605 -1164 13
8023 13 1158 239 -1341 486 1170 -570 -1241 664 1078 -934 -1102 1264 466 -1248 -274 1265 86
8040 86 -1299 376 1229 -754 -1199 624 904 -1230 -748 1229 427 -1178 -86 1506 -154 -1359 771
8057 771 1466 -695 -885 927 982 -894 -775 890 607 -1570 -409 1428 -111 -1804 535 1110 -833
8074 -833 -1350 1023 731 -1171 -568 1063 178 -1341 140 1296 -241 -954 417 1502 -778 -1116 1298
8091 1298 938 -1032 -405 1331 -21 -1666 340 1384 -646 -1370 521 973 -727 -962 1039 634
8107 634 -1381 -593 1234 175 -1606 -58 1330 -644 -1164 670 1218 -819 -642 1067 598 -1021
8123 -1021 -319 1337 287 -1422 313 1412 -331 -1370 728 1167 -978 -692 1307 266 -1258 -154
8139 -154 1004 -120 -1153 303 1061 -680 -1290 631 950 -1052 -1034 1382 541 -1271 11 1150 -201
8156 -201 -1209 224 1220 -942 -862 985 807 -1071 -541 1208 439 -1148 -429 1592 -176 -1528 478
8173 478 1422 -998 -1171 975 657 -1134 -490 1302 127 -1333 -131 1385 -183 -1691 235 1213
8189 1213 -884 -1236
8191 -1236
$$ Imaginary data points
##PAGE= N=2
##DATA TABLE= (X++(I..I)), XYDATA
0 0 0 0 0 8 -8 0 -8 9 -16 18 -24 32 -40 45 -53 66 -80 96 -111 128 -153 181 -201 236 -269 309 -350 395 -449
29 -449 510 -571 637 -717 801 -893 993 -1102 1224 -1361 1504 -1662 1844 -2042 2260 -2505
45 -2505 2781 -3096 3454 -3865 4350 -4930 5629 -6495 7609 -9093 11176 -14307 19536 -29871
59 -29871 57963 -290011 -855958 -87048 244748 -112049 -76224 260338 -226430 -764143 -198142
70 -198142 608116 358588 -137188 39298 145489 -272420 -127904 649039 645423 -198922
80 -198922 -397844 66830 46848 -201984 170005 414162 -234354 -732010 -220856 275323
90 275323 15785 -135577 177087 32565 -489142 -224655 531129 445551 -139670 -52909
100 -52909 232987 -96110 -234842 352369 520601 -167076 -457951 5289 114436 -231926
110 -231926 -75106 301516 -58745 -562008 -191706 331796 70484 -208089 142487 232689
120 232689 -246222 -214909 391703 387254 -157515 -129517 252609 55647 -271309 59961 358601
131 358601 -86102 -411943 4207 219023 -200717 -257147 204306 130366 -346868 -158242
141 -158242 320554 88012 -287002 38249 336393 -39948 -238221 182597 282018 -174768
151 -174768 -188328 272194 186275 -276732 -134243 245146 -76 -294555 55122 275366
161 275366 -155346 -335054 102069 229803 -140443 -133447 218533 75073 -304164 -70968
171 -70968 352525 124083 -235723 197 205430 -126311 -201641 258959 290280 -227280
181 -227280 -271792 145008 103160 -194590 19151 279031 -93730 -409862 -16449 303369
191 303369 -10214 -171580 137486 96674 -301254 -130617 376585 233022 -214847 -87101
201 -87101 177614 -54002 -174884 219002 321017 -167100 -339355 54911 160737 -129398
211 -129398 -57979 219001 -40955 -409185 -100631 310303 76047 -189556 55031 135996
221 135996 -202831 -155902 320545 302304 -162977 -167207 162057 54524 -175516 100332 312145
232 312145 -103373 -378930 -768 209416 -103376 -142072 167597 32470 -339790 -126995
242 -126995 297332 135079 -183313 -2456 181442 -82704 -164960 223441 302118 -127252
252 -127252 -220197 126109 114884 -174012 -27302 234867 -43472 -343667 -53643 218851
262 218851 -36210 -189756 88088 127792 -200728 -149683 255208 202427 -169202 -73101 220263
273 220263 31490 -186974 107184 274351 -99437 -254904 90972 160614 -160999 -133365
283 -133365 163892 27751 -280073 -83506 227001 19986 -220630 29134 194918 -93421
293 -93421 -160424 193672 211136 -152556 -122194 204388 105468 -175453 -8129 218680 -33997
304 -33997 -249291 32348 205167 -96280 -208355 100149 120963 -200732 -123472 219894
314 219894 85759 -227499 -37658 223004 -5868 -178581 105755 209999 -116320 -175549
324 -175549 153974 160045 -154018 -98376 176580 29121 -229089 -14340 217335 -36412
334 -36412 -218433 50692 156831 -119160 -134573 164970 124564 -175379 -92699 188289 70205
345 70205 -163618 12627 200336 -43867 -199844 85198 195549 -106574 -154760 135675
355 135675 91748 -194885 -74356 200295 27425 -217257 -11202 178952 -57183 -177169
365 -177169 104020 169465 -137150 -145937 165819 119228 -163854 -42158 206536 15510 -196958
376 -196958 37879 204060 -54019 -166020 94827 135946 -140370 -126611 152442 86446
386 86446 -187266 -74719 168362 1671 -197298 28699 185340 -75061 -173765 107640
396 107640 149709 -123818 -93386 175793 86300 -167989 -30722 194365 12652 -174440
406 -174440 42808 170066 -91967 -170079 107584 122389 -155998 -110004 147379 38990
416 38990 -185103 -19852 178749 -11898 -163505 56117 165814 -67376 -119131 136095
426 136095 137805 -129162 -85938 163668 58738 -171490 -20100 163091 -46324 -198315
436 -198315 35631 139126 -106933 -152710 103804 97955 -152712 -78336 181462 70750 -155041
447 -155041 11974 202531 -7409 -142759 103601 176770 -97533 -128416 126683 85327
457 85327 -164183 -80225 134586 -7982 -205100 -27649 140938 -56006 -168536 65324
467 65324 138108 -99810 -100612 161396 124342 -115647 -24957 187163 46340 -137163 33828
478 33828 168939 -49089 -165424 52508 108688 -132763 -143088 98960 50069 -185164 -74054
489 -74054 153908 12988 -158118 39917 177079 -35252 -108274 129983 160249 -81862
499 -81862 -72548 148435 76717 -145336 -42987 139418 -24483 -195079 -9561 112945 -97309
510 -97309 -164636 67951 92624 -128568 -85893 148368 85500 -112222 4203 185671 36619
521 36619 -113684 68176 175474 -48154 -131181 88646 98943 -143278 -111554 108587 12254
532 12254 -194164 -55049 124782 -36331 -160058 42441 138549 -65862 -99940 132734
542 132734 135956 -87248 -40761 167234 65041 -128222 7364 154733 -31781 -158557
552 -158557 30389 99784 -107125 -135279 73536 60154 -142603 -81429 125912 42732 -129522
563 -129522 6668 162488 -3031 -115457 85153 156705 -62006 -93423 114953 83256
573 83256 -128090 -60809 123127 6028 -165378 -23670 114558 -52793 -147086 51263
583 51263 109431 -95780 -97793 121125 88405 -107950 -22956 153184 28657 -117614 33847
594 33847 144874 -31896 -116498 62660 99309 -96596 -99065 96410 53245 -140907 -58536
605 -58536 119093 363 -143073 16500 128753 -51542 -118979 80184 112213 -84794
615 -84794 -70801 123197 66698 -118376 -22973 143508 10232 -131712 28533 127250 -61917
626 -61917 -119096 80106 89198 -111998 -79951 105998 34443 -130327 -22954 121340 -10445
637 -10445 -125519 31529 120030 -49175 -96043 89842 98648 -90222 -57538 123263 49786
648 49786 -115098 -10645 121812 -18939 -128107 28279 100673 -73218 -112919 66507
658 66507 67677 -111693 -66456 114634 37210 -119374 2136 136858 -7312 -98532 71490
669 71490 124247 -58023 -77197 97389 72650 -101982 -51019 99711 5105 -138823 -21118
680 -21118 97142 -45253 -130459 34634 88577 -80054 -82983 101118 79135 -86328 -22404
691 -22404 133026 41470 -90841 27533 131644 -19476 -108064 48533 91991 -86547 -99930
702 -99930 73384 36779 -135350 -59017 99840 -1358 -122847 13438 112516 -31166 -84796
713 -84796 81250 111284 -54344 -51388 108262 65796 -91032 -22034 108812 -4110 -125530
724 -125530 324 83974 -62143 -113218 41552 60051 -92259 -71194 89653 52596 -86287
735 -86287 -10918 121435 23176 -84752 43831 126446 -27867 -86890 68523 78495 -88993
746 -88993 -69140 82373 17872 -127625 -38420 86526 -21348 -114863 19718 91635 -50614
757 -50614 -82077 81469 89995 -66747 -36660 111597 45283 -88298 5749 111742 -12108
768 -12108 -102645 24858 79300 -61526 -88656 55016 50818 -96403 -60818 86982 29868
779 29868 -96888 -3563 105715 -11197 -89813 51136 102750 -46931 -69649 74591 58848
790 58848 -84178 -39228 91178 14589 -108080 -12371 88207 -26699 -95621 39661 79256
801 79256 -65659 -70034 80106 58872 -76410 -24504 93373 14230 -86515 13585 95980
812 95980 -20199 -86450 35763 72029 -59836 -65163 72220 46279 -91148 -37801 88333
823 88333 11228 -90450 11406 87612 -33046 -84787 47155 76428 -58340 -60819 71314
834 71314 40885 -86214 -23149 95858 7887 -92928 15851 89494 -32646 -71953 60177
845 60177 68245 -66963 -50717 76777 35555 -80739 -18691 79192 -7854 -92051 13740
856 13740 78937 -39386 -79624 47650 59424 -66960 -44419 81775 35265 -78450 -8835
867 -8835 89824 3167 -75961 26231 81046 -38322 -73338 52276 58191 -72366 -52104 71018
879 71018 20041 -89606 -10637 83048 -13608 -81720 30726 77708 -36626 -55598 62878
890 62878 57121 -60294 -31471 80092 26184 -79475 -8513 75088 -19548 -83733 24325
901 24325 61750 -56074 -69194 50067 42750 -66496 -30970 74929 19687 -73067 6640
912 6640 90520 -3246 -66779 39731 73866 -45998 -53568 67997 43615 -78255 -35261 67353
924 67353 21 -84648 2932 67857 -33876 -79660 33508 63346 -46939 -45779 67118
935 67118 40243 -67674 -13467 87589 15268 -69806 13818 70908 -28643 -64892 41368
946 41368 55237 -57487 -57585 50105 28029 -71107 -21414 71899 418 -80268 12053 78465
958 78465 -20366 -57079 50692 58413 -53431 -37450 71962 35146 -66286 -15962 65334
969 65334 -8559 -76781 14260 65217 -38488 -71483 35906 44387 -59218 -34933 68344
980 68344 23170 -68933 -5261 75038 3074 -55248 29536 67749 -31052 -54990 48593 52692
992 52692 -53379 -38254 58145 12619 -78659 -10393 69215 -14188 -75388 17490 55617 -41574
1004 -41574 -51052 55462 48245 -56855 -30634 68025 23701 -60519 7090 75396 -15274 -70714
1016 -70714 28355 61135 -40455 -49165 47957 28009 -67766 -28550 63373 13229 -64746 -2498
1028 -2498 59956 -16012 -58174 35741 64682 -36800 -48601 50991 38316 -54531 -16160 67733
1040 67733 5831 -72073 -942 60908 -17894 -58604 28055 45953 -51302 -49840 54162 37571
1052 37571 -57913 -19329 62966 1748 -63574 19470 71858 -19539 -54990 34879 46855 -41901
1064 -41901 -31225 57002 26190 -63178 -21429 57933 2159 -61545 10671 54926 -33556 -61361
1076 -61361 35458 47831 -44623 -35359 51017 19875 -59064 -7148 67845 5194 -58381 13816
1088 13816 59315 -23988 -48102 45593 47913 -51876 -37493 53868 18160 -61387 -5683 57679
1100 57679 -14447 -65257 15333 52673 -29104 -45823 39771 37777 -48461 -25686 61091 24042
1112 24042 -53138 -597 60060 -9589 -55152 24537 52709 -33868 -48955 33309 28368 -52872
1124 -52872 -28825 50766 11427 -62708 -7455 58069 -6581 -50465 30883 57515 -31644 -38621
1136 -38621 52010 41287 -43235 -15760 54891 5443 -60919 -1095 52460 -18410 -61000 13939
1148 13939 35735 -44855 -43912 44624 29940 -52539 -18679 56944 12333 -44187 18338 62939
1160 62939 -10198 -45585 30659 50042 -30135 -35420 40651 20564 -61191 -25942 50173 175
1172 175 -63645 -310 46566 -25885 -49604 37043 48668 -34612 -29246 51348 31061 -41429
1184 -41429 -2537 61931 3528 -57111 8015 50228 -25601 -51750 26214 28594 -53132 -38247
1196 -38247 42640 16865 -51023 -9508 50948 817 -44823 21418 59914 -12389 -37953 37102
1208 37102 43760 -36025 -25409 49020 15949 -58352 -14827 44597 -12037 -57818 8450 39412
1220 39412 -32141 -46670 32532 36749 -38043 -22013 53140 21003 -45986 3535 60398 -2471
1232 -2471 -46590 21427 44910 -30481 -39803 33889 26435 -47160 -27387 40411 7889 -51970
1244 -51970 -4111 49941 -8285 -48687 20807 47938 -25511 -33611 42475 32622 -42874 -18588
1256 -18588 48654 10485 -49564 -895 46062 -14882 -51366 18120 41795 -31596 -38750 36990
1268 36990 26356 -46015 -15523 51975 8538 -47576 5871 48149 -12415 -39963 25823 39301
1280 39301 -30808 -33124 36226 25385 -40838 -15066 45474 3303 -49272 4385 46854 -15176
1292 -15176 -43234 21881 33269 -33943 -30411 37457 21214 -43967 -15968 44359 4225 -45057
1304 -45057 9570 49114 -15832 -40875 30341 40159 -31899 -23700 43193 17659 -44927 -8142
1316 -8142 44772 -3408 -47897 6026 37237 -23989 -41960 25276 30846 -36965 -26094 41229
1328 41229 17876 -40563 -1005 49517 208 -39276 16904 43791 -18174 -34626 26896 28052
1340 28052 -37782 -27885 35641 10361 -49677 -10746 41736 -7436 -45550 15866 42138 -21248
1352 -21248 -29487 37171 33420 -30084 -12809 45084 14995 -39534 -1248 41818 -10362 -46561
1364 -46561 10392 30906 -32352 -39105 25616 18517 -41446 -18254 39931 9615 -37286 5746
1376 5746 46551 -629 -30976 24609 43290 -19318 -28054 33824 25176 -39541 -19538 36224
1388 36224 -718 -50557 -3740 35017 -18378 -42884 16686 31654 -26562 -25093 37649 26783
1400 26783 -31556 -6866 47198 10112 -36565 9631 41953 -15499 -38351 19510 26452 -34108
1412 -34108 -30129 26783 10953 -41143 -13749 36224 2190 -38554 7995 42875 -8527 -30182
1424 -30182 29284 37205 -24753 -19751 38739 18311 -37968 -8985 36174 -5099 -44332 3005
1436 3005 31558 -22229 -39769 19335 26014 -32606 -22715 37627 16555 -35797 -432 44801
1448 44801 1282 -33085 16700 38081 -16308 -28464 25618 24406 -31601 -21930 30498 8750
1460 8750 -40839 -8094 35016 -6724 -39445 11479 34233 -19760 -28241 28571 25910 -28218
1472 -28218 -14220 36835 12306 -34779 -1335 38340 -5308 -37642 13009 32377 -24071 -30876
1484 -30876 26806 20113 -35551 -15376 35020 5588 -36102 2434 36460 -7880 -32023 17677
1496 17677 32910 -19562 -24646 28826 21738 -31763 -12702 35940 4929 -37707 1168 33750
1508 33750 -11536 -33941 15194 26812 -25071 -26537 26548 18823 -31938 -12800 34697 5040
1520 5040 -35469 6090 38916 -9455 -31385 20848 29615 -22912 -19042 31450 14746 -33291
1532 -33291 -9884 32907 1379 -34616 3485 29689 -16544 -32915 18535 25929 -25838 -21618
1544 -21618 28428 13126 -30653 -2925 36470 1059 -31777 7534 32730 -10306 -26134 20190
1556 20190 24014 -27952 -22108 29860 13541 -34526 -8316 30915 -5589 -34513 12004 32920
1568 32920 -15933 -27868 21718 23821 -22721 -12147 33582 11409 -33440 -3961 35111 -1615
1580 -1615 -31721 9785 25956 -23308 -28544 22773 19845 -28916 -17768 25106 5885 -29822
1592 -29822 1442 35119 -3325 -31252 11363 32635 -12424 -20055 26791 19830 -30013 -13448
1604 -13448 33032 8520 -32498 -2208 26117 -12620 -32000 14076 26856 -21454 -27454 20484
1616 20484 16867 -26286 -7337 34660 4014 -33548 4013 34650 -5044 -23777 16645 22186
1628 22186 -23246 -20393 26375 17143 -28431 -14301 24628 325 -31344 4771 32170 -11730
1640 -11730 -32029 14619 26103 -17855 -14782 28425 13165 -30171 -7345 33319 5598 -28682
1652 -28682 2651 25889 -14718 -29150 18688 24463 -25694 -23341 22512 9792 -28365 -2659
1664 -2659 31259 -2383 -30891 6917 30662 -7089 -20461 19221 20736 -22604 -15939 29443
1676 29443 14791 -28752 -8168 25974 -4573 -30087 8930 26424 -17262 -28307 15757 19064
1688 19064 -21201 -13480 26794 8750 -29952 -3276 33285 756 -27377 10010 26423 -16607
1700 -16607 -21929 24010 19243 -26139 -14911 24745 5560 -27461 -269 27331 -6426 -29189
1712 -29189 9905 26705 -14263 -20613 20607 16237 -25345 -10309 29634 6609 -28408 -548
1724 -548 26132 -6564 -25330 11989 23274 -18323 -22638 20583 17032 -24266 -11235 27022 3039
1737 3039 -29901 3210 30214 -8005 -26720 13489 22418 -18491 -16397 24151 13893 -25663
1749 -25663 -8697 27847 5324 -25834 3774 26256 -11126 -25651 16256 22435 -20351 -19178
1761 -19178 19647 9095 -26152 -6477 25963 -224 -28941 1844 26460 -7018 -21709 16974
1773 16974 22000 -19714 -15303 27868 15912 -23755 -4440 26199 -2436 -26695 7792 24619
1785 24619 -14484 -26986 11437 15827 -21184 -14442 22710 7281 -28772 -4131 29400 1936
1797 1936 -21746 10898 24340 -12895 -18042 21495 19658 -19455 -14741 19237 4905 -26188 -3924
1810 -3924 24039 -6663 -31556 4037 22728 -12624 -18397 20586 16924 -21811 -8550 30403
1822 30403 12421 -20201 1735 25905 -4685 -23543 11709 23259 -17632 -25442 12816 9869
1834 9869 -26130 -11821 22323 -28 -29668 -676 26094 -2237 -17782 14761 22901 -12224
1846 -12224 -13051 24458 19614 -18237 -9001 22306 2056 -26593 739 22697 -11800 -29403 6161
1859 6161 16153 -18290 -16530 19188 10921 -22900 -6462 27904 8337 -19420 6497 26569 -6568
1872 -6568 -20222 17110 21870 -18647 -18235 17126 5881 -26377 -7239 20879 -3942 -27899 1222
1885 1222 21634 -7450 -18503 16091 20219 -15477 -11147 26074 15262 -19213 -2374 24793
1897 24793 -832 -23415 6165 21190 -13528 -24566 9239 12691 -20947 -15934 19079 6585
1909 6585 -25814 -4695 25754 920 -20813 10593 24060 -9955 -15810 19905 18266 -16770
1921 -16770 -9930 19983 5845 -22523 -2821 21360 -4979 -25486 4449 18522 -13590 -19030
1933 -19030 15620 13302 -19830 -9568 22711 7350 -19937 810 23170 -2264 -19663 9779
1945 9779 21560 -11859 -18163 15897 13412 -21268 -10627 21161 2554 -25386 -920 21726
1957 21726 -6523 -20998 10018 18022 -13579 -14807 18661 14102 -17779 -6795 22758 4754
1969 4754 -20886 3297 22847 -6686 -20795 9868 16221 -16066 -15498 15230 7915 -21669 -9195
1982 -9195 18909 1379 -22030 1208 21285 -6222 -18792 13700 20240 -12674 -11304 20809
1994 20809 11909 -18731 -3005 22569 804 -21731 2329 18021 -9820 -20980 9174 13432
2006 13432 -18717 -15451 16841 8099 -20842 -3102 22013 345 -18514 8023 22116 -6624
2018 -6624 -14502 14356 15395 -14645 -11464 17416 6855 -21890 -6853 18066 -3921 -23412 3731
2031 3731 17649 -11997 -18179 14128 15114 -14539 -7082 21792 8546 -17473 1086 23707 293
2044 293 -18525 6992 17789 -13424 -17960 12834 9644 -21440 -12369 15466 1496 -21144 -550
2057 -550 19039 -3670 -17766 9230 20128 -6798 -10751 17410 14871 -15478 -6721 21018 5290
2070 5290 -20212 -1228 16968 -8069 -21242 6625 14259 -14822 -16893 12411 9559 -16816 -6136
2083 -6136 21007 4443 -18630 3286 22380 -2430 -15398 12132 15836 -13875 -12787 15595
2095 15595 8118 -18772 -7432 15000 -1343 -20376 1236 17962 -6921 -17700 9845 16060
2107 16060 -11698 -8981 18720 10007 -16523 -2728 20247 2053 -17409 3859 16275 -8847
2119 -8847 -18624 8791 13064 -15459 -13682 14539 5913 -19855 -3613 20013 -657 -18573 6165
2132 6165 18363 -7356 -12933 14360 14186 -13168 -8828 16739 6615 -17457 -3013 17688 -2894
2145 -2894 -19951 4257 16019 -10271 -15412 12036 11161 -15552 -8610 16941 5945 -16830 -1059
2158 -1059 18349 -1616 -17180 6438 18116 -9182 -14929 12449 11255 -16729 -7776 18006 3669
2171 3669 -19078 -648 16838 -4315 -15963 8318 15572 -10741 -13589 13359 11570 -14417 -5977
2184 -5977 17362 2221 -18832 1046 18469 -3725 -16112 7070 12424 -12068 -11844 14383 9839
2197 9839 -15538 -8127 15116 2952 -16636 2464 18208 -6362 -18252 8237 15533 -10361
2209 -10361 -10291 14848 7312 -17466 -4445 18887 3414 -16496 1539 15356 -6719 -14619 11349
2222 11349 15309 -13057 -12763 12688 6504 -15905 -2542 16678 -2122 -19308 2067 15749 -4854
2235 -4854 -12980 9530 11199 -13282 -9721 16750 10094 -14708 -3742 16242 -1172 -15810 6642
2248 6642 17447 -8358 -16040 8286 10251 -12295 -8012 14538 4133 -18370 -3782 17506 574
2261 574 -15131 5262 14672 -9637 -13141 13816 13177 -12754 -8050 13655 3431 -15515 -172
2274 -172 16493 -2697 -17948 2527 13590 -8338 -12638 11215 9761 -15257 -7827 16824 6141
2287 6141 -14151 787 16651 -3147 -14182 8229 15952 -8482 -13006 10369 8651 -15366 -7415
2300 -7415 15165 1134 -19474 -1849 15365 -4742 -14934 7888 12957 -10145 -9831 14017 10459
2313 10459 -11581 -3484 16256 3274 -14718 2264 16549 -4313 -15894 6238 11330 -12195
2325 -12195 -11622 11682 6006 -16124 -5613 14347 1398 -14736 2597 16078 -3728 -13238 9742
2338 9742 14286 -10070 -9237 14159 7568 -15160 -3805 14925 -1207 -16809 2046 13162 -7867
2351 -7867 -14782 7788 10473 -11391 -9202 14076 7274 -13651 -1720 17507 1375 -14133 5597
2364 5597 15359 -6478 -12046 9945 10226 -12326 -9567 11388 3442 -16374 -3822 14031 -2058
2377 -2058 -16847 3401 14388 -7263 -11744 11677 11277 -11898 -5766 15968 5765 -13120 42
2390 42 15080 -1977 -14211 4898 13328 -8539 -13196 9318 7928 -13682 -7570 13583 2616
2403 2616 -15911 -661 14604 -2356 -12469 6501 13198 -7370 -9835 11932 10612 -11399 -6189
2416 -6189 13985 3153 -15131 -276 14472 -4721 -15982 5345 11450 -10267 -10728 11098 7333
2429 7333 -13400 -4850 14855 3672 -12713 2099 15752 -2883 -12096 8571 13202 -9435 -9548
2442 -9548 11547 5637 -13965 -5201 12170 -876 -15976 -404 11839 -5485 -13387 6319 11710
2455 11710 -9493 -8724 13375 9265 -11669 -1625 16188 2092 -12270 3889 14494 -4820
2467 -4820 -12888 6837 9466 -11518 -10368 10163 4266 -15437 -5348 13130 -798 -14178 3961
2480 3961 13987 -5590 -10286 10909 11732 -8317 -5580 13097 5993 -12204 -2080 13059 -1474
2493 -1474 -15264 1303 10839 -8154 -13414 7644 8112 -12078 -7207 12701 5252 -11585 588
2506 588 15235 323 -11150 6383 14426 -4944 -10429 9559 8562 -12884 -7899 10916 1019
2519 1019 -16280 -3018 10712 -4665 -13807 4715 10840 -7170 -8747 10883 10256 -8468 -3370
2532 -3370 14628 4962 -11776 991 14371 -2026 -12792 4743 9661 -9852 -11180 7964 5342
2545 5342 -13280 -6757 10830 1604 -13074 651 14301 -2131 -11334 7771 13242 -7040 -7876
2558 -7876 12110 7010 -12078 -4186 11965 -71 -13981 -19 10398 -5816 -12790 5351 9524
2571 9524 -8998 -8446 10706 6753 -10669 -1875 14550 1991 -11250 3485 12895 -3567 -10315
2584 -10315 7115 8855 -9699 -9129 8993 4418 -13186 -4946 11285 -842 -14131 2180 12285
2597 12285 -5275 -10731 8944 9716 -8490 -5313 12464 5753 -10611 -1381 13125 -106 -12164
2610 -12164 2916 11510 -6419 -11502 7427 7956 -10789 -6706 10947 2847 -12340 -1430 12007
2623 12007 -977 -11126 3732 11280 -5091 -9698 8389 8823 -9774 -6258 11509 3269 -12778
2636 -12778 -851 12208 -2308 -12322 4190 10136 -7008 -9218 8721 7686 -10042 -5223 11432
2649 11432 3388 -11752 497 13001 -2240 -11374 5449 10655 -6907 -8207 8997 5856 -10883
2662 -10883 -4799 10608 2003 -11816 -784 10619 -3288 -11723 5112 10555 -6968 -8658 9503
2675 9503 6631 -10327 -2617 12819 1845 -11504 1447 11440 -2340 -9870 5875 9347 -8614
2688 -8614 -8982 9447 5795 -11310 -3798 10894 -467 -12079 2176 11303 -4127 -9838 5942
2701 5942 8603 -7503 -6430 10099 5524 -10288 -3442 11216 1203 -10730 2188 10802 -5232
2714 -5232 -10758 6337 8426 -7998 -6497 9106 3809 -10743 -1879 11827 1074 -10701 1997
2727 1997 10878 -4476 -9544 8028 8772 -9353 -6542 9937 3415 -10691 -770 10375 -2182
2740 -2182 -11480 2904 10188 -4710 -8553 6990 6992 -9142 -5341 11196 4371 -10338 -349 11129
2754 11129 -1730 -9819 4851 10308 -5902 -8786 6769 6584 -8708 -4891 9905 2298 -12199
2767 -12199 -1374 11086 -1521 -10859 4189 8945 -7820 -8137 8742 6844 -8866 -3758 9382
2780 9382 1894 -9712 1196 11303 -1939 -10377 3804 9240 -6168 -7066 8847 5475 -10389
2793 -10389 -4480 10109 1609 -10168 798 9694 -3405 -10000 4805 9486 -5943 -7749 8040
2806 8040 5460 -9989 -2869 11686 1155 -11397 973 9715 -3846 -9066 6067 7525 -8096
2819 -8096 -7154 8248 5061 -9025 -2520 10323 408 -10616 2180 11409 -3147 -8567 6479
2832 6479 7566 -7829 -5497 9459 4237 -9704 -2975 8891 -470 -10189 1802 9305 -4899
2845 -4899 -10164 5400 7872 -7590 -5559 9448 3510 -10192 -928 10816 502 -9088 3072
2858 3072 9445 -4438 -7974 7030 7840 -7895 -6273 8821 2791 -10607 -845 10464 -1681
2871 -1681 -10611 2970 8594 -5402 -7199 7323 6678 -8114 -4677 9002 3887 -8937 -549 10468
2885 10468 -1673 -10623 3694 9373 -5872 -8150 6613 5343 -9532 -4391 9554 2078 -9568
2898 -9568 -565 9792 -1239 -8676 4961 9921 -5652 -7534 8365 6349 -8546 -3041 9847
2911 9847 630 -10737 -379 9022 -3168 -9406 3541 6891 -7175 -7200 8170 5936 -8380 -3372
2925 -3372 9875 1835 -9085 2388 10987 -2513 -8464 5204 8059 -5815 -5781 7657 3737 -9845
2939 -9845 -4236 8810 776 -10308 702 8505 -4784 -9355 6354 8065 -7005 -5336 8518
2952 8518 4290 -8248 -748 10110 743 -9314 1438 8708 -3500 -8274 5231 6515 -8562
2965 -8562 -6853 8061 3562 -9115 -1837 9330 -731 -8517 3233 10142 -2914 -7020 5969
2978 5969 7310 -6384 -4623 8934 3358 -10241 -2534 8707 -1617 -10197 2438 7657 -6300
2991 -6300 -8563 6033 5965 -7151 -4248 8838 3425 -8387 -162 10485 103 -8338 3873 8845
3005 8845 -4907 -7142 7233 5392 -8618 -4782 7574 1290 -9579 -734 8577 -1938 -9131
3018 -9131 3228 8484 -4928 -7111 7350 6270 -7635 -3315 9665 2057 -9161 452 9154
3031 9154 -2519 -8962 3228 7181 -5871 -7317 6292 5049 -8262 -3892 9101 1764 -9051
3044 -9051 1011 9711 -2074 -7368 5490 7879 -5477 -5807 7022 4412 -7630 -3101 8053
3057 8053 771 -9980 -185 8401 -3142 -9191 4486 6998 -6832 -6179 8129 4761 -7906 -1702
3071 -1702 9209 825 -8212 2066 9555 -2566 -8082 5185 7113 -6220 -5300 7919 3495 -9457
3085 -9457 -2310 8433 -707 -9078 1979 7579 -4076 -7310 4858 6757 -5962 -5031 7589 4041
3099 4041 -8220 -1209 9453 -95 -9143 2054 8356 -4189 -7403 5154 5866 -6977 -4998 7376
3113 7376 2974 -8474 -1540 9017 437 -8602 2596 9015 -3863 -7064 6690 6307 -6959 -4219
3127 -4219 7753 2146 -8444 -602 8224 -1438 -9012 1821 7223 -4749 -7466 5876 5760 -7487
3141 -7487 -4052 8643 2754 -8016 582 9173 -1271 -7557 4261 8397 -4163 -6359 5778
3154 5778 4963 -7502 -4040 8138 1252 -9751 -571 8217 -2246 -8098 4031 6689 -5962 -5702
3168 -5702 6862 5212 -6602 -2696 7935 1466 -8190 919 9093 -1618 -8753 3468 6356 -5880
3182 -5880 -5494 7362 4086 -7778 -3388 7839 1480 -7431 1375 8203 -2556 -7863 4234 8153
3196 8153 -5063 -5690 6604 3774 -8594 -1965 8765 126 -9152 516 6989 -3679 -7062 4391
3210 4391 6249 -6394 -5635 6771 4431 -6809 -1445 8511 312 -8276 2133 8863 -2780 -6897
3224 -6897 4891 5147 -6018 -4522 7611 3255 -8217 -2862 7495 0 -8032 1912 7900 -4174
3238 -4174 -7660 5312 6201 -6408 -3924 7687 2267 -8252 -779 8390 -236 -7862 1885 7172
3252 7172 -4075 -6693 5800 5911 -6946 -4370 7672 2392 -7854 -135 8254 -1255 -7856 2543
3266 2543 7010 -3978 -5991 5198 5041 -6747 -4080 7390 2321 -8357 -641 8177 -1653 -8466
3280 -8466 3069 7026 -4946 -6140 5676 4508 -6998 -3311 7782 2253 -7711 345 8155 -1283
3294 -1283 -7598 3951 7717 -4981 -5902 6149 4088 -7179 -2659 7642 1017 -8167 103 6907
3308 6907 -2003 -7210 3172 5973 -5494 -6628 6283 4958 -6986 -2445 7745 530 -7863 1265
3322 1265 8348 -2005 -7150 3582 6045 -5000 -4645 7125 3999 -7780 -3213 7890 851 -7776
3336 -7776 1686 7755 -3600 -7553 4912 6309 -5264 -4519 5937 2717 -7353 -1878 8039 556
3350 556 -8085 484 6909 -3073 -6642 5199 5955 -6700 -5091 6906 3312 -6386 -962 7745 -269
3365 -269 -7924 2238 8310 -2300 -6704 4541 5561 -5991 -4025 7949 2607 -8505 -1739 7397
3379 7397 -1053 -7500 2476 6772 -4300 -6823 4460 5025 -5677 -3838 6780 2132 -8275 -718
3393 -718 8591 -375 -7620 2569 6781 -4225 -5338 5795 5040 -6376 -3527 6624 2244 -6894
3407 -6894 -517 7844 -1415 -7950 2399 7184 -3968 -5955 5467 4291 -7051 -2776 7876 1349
3421 1349 -7781 -175 6849 -1847 -6806 3080 6538 -4698 -6047 5598 4669 -6655 -2737 7539
3435 7539 1105 -7534 933 7844 -1895 -6675 3391 6277 -4182 -4826 5875 4151 -6848 -3188
3449 -3188 7143 1451 -7784 568 7242 -2859 -7558 3991 5900 -5618 -5214 5891 3383 -6717
3463 -6717 -1650 7433 1008 -7438 989 7907 -2173 -6277 4572 5978 -5531 -4408 7115 3305
3477 3305 -7171 -1594 7237 -8 -7371 1352 6865 -2820 -6836 3860 5962 -5427 -4485 6646
3491 6646 2971 -7904 -1302 7721 -33 -7743 1701 7044 -3771 -5998 4500 5569 -5624 -4351
3505 -4351 6573 2870 -7224 -1049 8037 -564 -7593 2358 7283 -3616 -5815 5396 4652 -6048
3519 -6048 -3489 6697 2346 -7133 -776 6684 -925 -7534 1997 6614 -4523 -6570 5242 4592
3533 4592 -6412 -3511 7154 1536 -7309 -76 7338 -866 -6529 2901 6532 -3757 -5446 5755
3547 5755 5086 -6599 -3544 7565 1361 -7561 494 7152 -2319 -7186 3322 5884 -4762 -5152
3561 -5152 5045 4023 -6540 -2612 7280 1219 -7433 328 7659 -1892 -7064 3812 6198 -5271
3575 -5271 -4779 6124 3713 -6210 -2307 6742 730 -7331 926 7544 -2014 -6834 3773 6345 -4982
3590 -4982 -4771 6761 3309 -7462 -1971 7201 270 -7117 1188 6580 -2985 -6986 3559 5747
3604 5747 -5334 -5164 5955 3220 -7101 -1570 7504 -71 -7300 1809 7045 -2811 -5508 4652
3618 4652 5172 -5189 -4140 6438 3402 -6841 -1427 7199 -535 -7945 1631 7017 -3993 -6748
3632 -6748 4299 4279 -5958 -3755 6393 2158 -7159 -1177 7156 29 -6788 2385 7056 -3764
3646 -3764 -6091 5175 4956 -6008 -3384 6790 1527 -7518 -309 6917 -1181 -6507 1853 6127
3660 6127 -3424 -5846 5009 4930 -6432 -3618 7115 2023 -7352 153 6932 -1792 -7408 2850
3674 2850 6181 -4177 -5455 4682 4131 -6300 -2588 7054 1583 -7718 359 7943 -1505 -6592
3688 -6592 3821 6232 -4473 -4545 6118 3853 -5835 -2041 6683 811 -7032 58 6655 -2241 -7311
3703 -7311 2990 5598 -5240 -4968 5832 3650 -6726 -1964 7398 752 -7076 1127 6961 -2233
3717 -2233 -6051 3988 6186 -4488 -4370 6023 3482 -7107 -2216 7422 125 -7547 1506 6926
3731 6926 -2870 -5850 4385 5015 -5006 -4135 6044 3355 -6502 -1665 7192 55 -7172 1363 6677
3746 6677 -3649 -6639 4285 4807 -5904 -4139 5969 2120 -6999 -1080 7121 193 -6624 1875
3760 1875 6866 -2791 -5860 5469 5470 -5910 -3445 6721 2039 -6864 -200 6730 -1561 -7394 2058
3775 2058 5789 -4029 -5826 4115 4188 -6323 -3799 6815 2149 -7228 -28 7047 -1166 -6645 3678
3790 3678 6215 -4291 -5346 4836 4063 -5536 -2962 6458 1400 -7628 -235 7409 -1261 -6610 3117
3805 3117 5989 -4484 -5012 6318 4035 -6401 -2279 6537 1009 -6629 490 6732 -2155 -7176
3819 -7176 2533 5763 -4899 -4830 5748 3351 -7146 -2047 7377 931 -6803 1127 6761 -1954 -5486
3834 -5486 3907 6174 -4231 -4799 5537 3895 -6436 -2122 7053 -141 -8236 607 6732 -3031
3848 -3031 -6092 3612 4645 -5622 -4139 6332 3279 -6574 -1750 7251 208 -6586 1933 7292
3862 7292 -2992 -6158 4584 5075 -5563 -3567 5908 2089 -6872 -1235 6797 188 -6578 1357
3876 1357 6534 -3002 -6027 4638 5722 -5678 -4053 6388 2431 -7036 -467 6836 -1178 -7043
3890 -7043 1869 5874 -3354 -5884 4043 4385 -5957 -3769 6944 2155 -6951 -255 7228 -625 -6056
3905 -6056 3370 6405 -3755 -5159 5244 4549 -5539 -2792 6055 1385 -7008 -819 6879 -1538
3919 -1538 -7452 2301 5633 -4624 -4756 5532 3608 -6177 -2761 6620 1468 -6407 514 6667 -1552
3934 -1552 -6210 3295 6449 -4265 -5278 5403 3817 -6615 -2023 7351 620 -7092 637 6424
3948 6424 -2006 -5534 3618 5354 -4513 -4657 5662 4025 -6118 -1878 6649 53 -7040 846 6396
3963 6396 -2965 -6473 3444 4791 -4770 -3957 5647 3014 -6385 -1535 7072 925 -6383 1196 6862
3978 6862 -2585 -5858 4743 5796 -5290 -3880 5657 1903 -6861 -1057 6581 -656 -6892 1108
3992 1108 6214 -3298 -5791 4299 5026 -5616 -3661 6791 2715 -6625 -331 6785 -1134 -6150
4006 -6150 2658 6084 -3319 -5255 4089 4496 -5217 -3336 6172 2104 -7218 -386 7360 -794 -6448
4021 -6448 3107 6349 -3984 -4789 5428 3980 -5702 -2954 5771 1382 -6902 -434 6688 -1913 -6775
4036 -6775 2578 5874 -4490 -4896 4993 3616 -6273 -2151 6833 1619 -6136 566 6659 -1314 -5748
4051 -5748 3311 6156 -4378 -5155 5042 3853 -6687 -2406 6857 114 -7274 540 6417 -2386
4065 -2386 -6165 3012 4620 -4512 -4380 5912 3686 -6168 -1888 6742 665 -6990 1134 6491 -3045
4080 -3045 -6113 3911 5090 -4563 -3776 5445 2796 -5808 -1420 6876 862 -6725 1191 6327 -2611
4095 -2611 -5649 4483 5057 -5502 -4044 5499 2515 -6305 -1146 6107 -896 -6773 1096 6193 -2774
4110 -2774 -5773 3866 5091 -5525 -3025 6989 2550 -6638 -629 6718 -673 -5788 2635 5996
4124 5996 -3575 -5247 4297 4411 -4972 -3351 5586 1841 -7089 -888 7003 -842 -6872 2584 5538
4139 5538 -4005 -4996 5041 3869 -5641 -2895 5967 1775 -6089 -88 6485 -1613 -6571 2768 5827
4154 5827 -3897 -4975 5147 3744 -6128 -1997 6602 1480 -6098 663 6383 -1258 -5804 3038 5467
4169 5467 -3985 -4939 4752 3794 -6386 -2383 6252 341 -6703 586 6093 -1822 -5835 3340 5107
4184 5107 -3902 -3929 5254 3685 -5610 -2098 6844 832 -6768 1046 6736 -2467 -6030 3873 4828 -5056
4200 -5056 -3680 5353 2297 -5992 -1682 6158 -33 -6346 1130 6382 -2461 -6075 4143 5041 -5149
4215 -5149 -3886 5761 1994 -6310 -946 6181 -584 -6046 1582 5889 -2659 -5162 3919 5124 -4866
4230 -4866 -3391 6425 2618 -6252 -526 7161 -596 -6474 2075 5602 -3209 -5003 3974 3984 -5415
4245 -5415 -3420 5265 1786 -6456 -821 6499 -1240 -6402 2764 6198 -3545 -4309 4880 3993 -5266
4260 -5266 -2350 6116 1226 -6051 -415 6350 -1226 -6378 2567 5735 -4118 -5004 5077 3650 -5858
4275 -5858 -2065 6031 711 -6250 615 6162 -1711 -5759 2587 5053 -3932 -4394 4845 3240 -5818
4290 -5818 -2385 6117 705 -6605 950 6120 -2082 -5416 3341 5022 -3534 -3803 5197 3661 -5456
4305 -5456 -1603 6383 659 -6726 823 6056 -2279 -6006 3655 4506 -5285 -4014 5042 2352 -6018
4320 -6018 -1362 6087 -12 -6180 1374 6215 -1960 -5449 4219 4907 -5057 -3338 6179 2165 -6313
4335 -6313 -959 5896 -729 -5977 1683 5200 -2980 -4984 3783 4108 -4493 -3249 5860 2282 -6231
4350 -6231 -513 6615 -940 -6055 2351 5184 -3373 -4915 3766 3430 -5106 -3469 5206 1829 -6502
4365 -6502 -708 6241 -910 -6169 2352 5761 -3618 -4218 5250 4190 -5105 -1943 5752 1384 -5987
4380 -5987 -226 5932 -1198 -6250 1907 4633 -4103 -5440 4475 3229 -5860 -2358 5451 800 -6126
4395 -6126 702 5934 -1342 -5211 3110 5219 -3602 -4177 4628 3639 -5290 -2267 6101 555 -6856
4410 -6856 387 5891 -2159 -5519 3205 4560 -4016 -3745 4917 3121 -5225 -1225 6006 1169 -6188
4425 -6188 1001 5985 -2539 -5475 3305 4017 -4858 -3682 4922 1926 -5992 -1813 5514 -48 -5708
4440 -5708 1163 6213 -2088 -4898 3883 5397 -4411 -3071 6226 2563 -5739 -930 6053 -763 -6240
4455 -6240 1193 5234 -3368 -5371 3289 3831 -4905 -3638 5360 2014 -5661 -554 6355 -145 -5831
4470 -5831 2698 5732 -2790 -4315 4050 3832 -4782 -3028 4953 1374 -6169 -751 5835 -949 -6333
4485 -6333 2142 5709 -3201 -4383 4983 4050 -5009 -1871 5926 1424 -5408 237 5649 -967 -5765
4500 -5765 1843 5273 -3689 -5203 4328 3212 -6165 -2316 5834 672 -6093 871 5989 -1024 -4513
4515 -4513 3262 5231 -3135 -3673 4760 3875 -4992 -2213 5697 673 -6699 273 5832 -2170 -6000
4530 -6000 2508 3998 -4590 -3718 4846 2752 -5271 -1936 5793 995 -5572 1087 6218 -2221 -5368
4545 -5368 3407 4704 -4398 -3506 5163 2018 -5471 -1075 5607 13 -5624 735 5194 -2021 -5074
4560 -5074 3817 4945 -4051 -3364 5531 2599 -5343 -840 5789 -542 -6154 1671 5148 -2715 -4994
4575 -4994 3382 3609 -4941 -3463 5417 2027 -5737 -895 6461 -233 -5274 2946 5472 -2955 -4281
4590 -4281 4243 4187 -4140 -2438 5076 1533 -5606 -522 5403 -844 -5902 1610 5081 -3497 -4367 4244
4606 4244 3284 -5224 -2145 5485 1040 -5380 293 5817 -956 -5663 2176 5533 -3118 -4218 4349
4621 4349 3428 -5377 -2481 5678 776 -5843 406 5441 -1839 -4962 2938 4488 -3534 -3894 4426
4636 4426 3592 -4885 -1941 5840 605 -6020 514 5448 -1907 -5409 3162 4334 -4455 -3662 4284
4651 4284 2276 -4974 -1618 5155 945 -5584 1102 5796 -1699 -4971 3810 4829 -4160 -3065 5215
4666 5215 2403 -5175 -988 5394 -71 -5491 1021 5072 -2616 -5391 2950 4161 -4364 -2998 5226
4681 5226 2329 -5627 -645 5773 -610 -5439 1627 4771 -2550 -4289 3208 3955 -4309 -3223 4841
4696 4841 1974 -5477 -892 6007 -536 -5783 1855 5313 -3026 -4272 3774 3420 -4329 -2356 5093
4711 5093 1571 -5620 -741 5641 -1004 -5725 1852 5039 -3343 -4908 3964 3240 -5249 -1924 5554
4726 5554 606 -5154 466 5307 -660 -4845 2381 4593 -3240 -3951 4263 3526 -5200 -2412 5522
4741 5522 833 -6004 672 5561 -1690 -5362 2402 4175 -3470 -3899 4291 3092 -4757 -2093 5618
4756 5618 602 -5922 752 5690 -1819 -5174 3146 4285 -3942 -3246 4319 2479 -4997 -1208 5379
4771 5379 595 -5459 789 5243 -1703 -4572 3296 4472 -4074 -3306 4923 1864 -5342 -1244 4961
4786 4961 -339 -5611 1135 4969 -2167 -4471 3093 4134 -4053 -3303 4963 2092 -5585 -804 5872
4801 5872 -231 -5274 1836 4769 -2593 -3977 3532 3519 -4138 -2934 4712 1580 -4997 -696 5387
4816 5387 -541 -5477 2222 4972 -2843 -4329 3789 3239 -4510 -2478 4591 1100 -5032 -730 4799
4831 4799 -637 -5297 1714 4713 -3006 -4041 4442 3324 -4786 -1962 5961 1201 -4833 421 5242
4846 5242 -1207 -4787 2420 4610 -3116 -4403 3874 2821 -4976 -2215 4858 635 -5443 313 4943
4861 4943 -1803 -4562 2675 3999 -3524 -3238 4099 3066 -4240 -1720 5302 875 -5478 478 5665
4876 5665 -1985 -5298 2776 4085 -3676 -3055 4713 1948 -4916 -1141 4901 689 -4746 934 4970
4891 4970 -2039 -4743 3168 4466 -3963 -3291 4639 1752 -5606 -785 5097 -357 -5067 988 4452
4906 4452 -1921 -3918 3373 4260 -3790 -3194 4944 2927 -4612 -428 5462 -791 -5460 1806 4584
4921 4584 -2760 -4168 2964 2726 -4538 -2441 3980 1688 -5495 -885 5239 -626 -4319 2277 4746
4936 4746 -2894 -3893 4137 3277 -3996 -2017 4717 1013 -4732 -322 4725 -438 -4851 1278 4395
4951 4395 -2791 -4161 3857 3598 -4544 -1961 5043 879 -4845 640 5095 -1698 -4840 2148 4109
4966 4109 -2878 -4158 3719 2717 -4934 -2639 5195 670 -5550 71 4882 -1766 -4292 3104 4247
4981 4247 -3125 -3053 3980 2932 -3594 -1242 4939 861 -4888 193 4942 -2023 -4700 2512 3464 -4048
4997 -4048 -3184 3797 1972 -4826 -1552 4550 319 -4740 855 4841 -1764 -4554 2916 4258 -3417
5012 -3417 -3085 4720 1649 -5181 -671 4979 -438 -4743 1141 4358 -2245 -4177 2854 3912 -3667
5027 -3667 -2909 4586 2280 -4668 -791 5280 -345 -4912 1571 4381 -2442 -3913 3158 2947 -4070
5042 -4070 -2667 4173 1738 -5247 -880 4830 -407 -5001 1708 4497 -2623 -3574 4022 3563 -3678
5057 -3678 -1599 4990 1378 -4161 -55 4795 -646 -4882 1516 4163 -2822 -4042 3322 2557 -4618
5072 -4618 -2269 4449 588 -4970 -183 4730 -1277 -4174 2397 3963 -2639 -3469 3570 3011 -3973
5087 -3973 -1847 4960 716 -5366 392 4898 -1451 -4489 2095 3948 -3085 -3112 3807 2817 -4093 -1612
5103 -1612 4515 739 -4570 679 4889 -1694 -4357 2524 3768 -3804 -3108 3804 1592 -4627 -1509
5118 -1509 4416 74 -4852 410 4439 -1357 -4408 2687 3861 -3269 -2821 4427 2357 -4039 -551
5133 -551 4819 -438 -4880 1281 4340 -1886 -4283 2247 3053 -3779 -3052 4008 1792 -4616 -1130 4894
5149 4894 -284 -4758 1505 4387 -2295 -3709 3136 3133 -3489 -2101 3927 1192 -4394 -258 4855 -474
5165 -474 -4976 1204 4450 -2386 -3687 3481 2773 -4263 -2384 4454 1387 -4199 189 4563 -829
5180 -829 -4439 1859 3986 -2550 -4204 2933 2520 -4309 -2263 4418 325 -4890 169 4175 -1254
5195 -1254 -3748 2248 3689 -2657 -3089 3345 3022 -3622 -1812 4454 663 -4545 322 4656 -1506
5210 -1506 -4518 2175 3218 -3301 -2880 3517 2004 -4391 -1546 4221 500 -4401 378 4676 -1638
5225 -1638 -4350 2526 3767 -3081 -2909 4220 1730 -4576 -857 4432 103 -4330 932 4239 -1605
5240 -1605 -3883 2594 3747 -3374 -2792 3888 1654 -4739 -534 4488 -494 -4423 1074 4289 -2173
5255 -2173 -3340 2473 2913 -3370 -2854 3788 1669 -4319 -925 4568 -367 -4541 1528 4484 -2062
5270 -2062 -3253 2966 3120 -3393 -1759 3929 1239 -4104 -568 4388 -356 -4331 1491 4116 -2436
5285 -2436 -3792 3233 3038 -3852 -1676 3787 657 -4348 -129 3983 -627 -4064 1569 3667 -2366
5300 -2366 -3123 3355 2873 -3751 -1819 4556 811 -4671 713 4692 -1691 -3877 1949 3288 -2820
5315 -2820 -3024 3731 1950 -3859 -1656 4160 704 -4432 318 4116 -1350 -4090 2468 3088 -3002
5330 -3002 -2623 3537 1709 -3957 -1368 4154 349 -4124 641 4516 -1288 -3852 2576 3492 -2978
5345 -2978 -2699 3754 2017 -3889 -639 4358 -35 -3827 1165 4009 -1301 -3466 2038 3242 -3501
5360 -3501 -2615 3885 1761 -4345 -1201 3982 -544 -4458 1362 3835 -2309 -3058 2411 2583 -3050 -2046
5376 -2046 3672 1434 -3691 -630 4402 -205 -4119 1453 3916 -2554 -3662 3347 2273 -3504 -2105
5391 -2105 3542 1106 -4099 -533 4145 -479 -4000 1512 3803 -2152 -3301 3214 2569 -3776 -1810
5406 -1810 4098 618 -3902 35 3895 -1134 -3874 1716 3547 -2155 -2937 2979 2420 -3301 -1551
5421 -1551 4104 876 -4168 542 3893 -1184 -3495 2284 2969 -2705 -2762 3090 1968 -3656 -1454 3572
5437 3572 649 -4313 117 4416 -1421 -3994 2316 3463 -2885 -2529 3847 1910 -3461 -1017 3695
5452 3695 357 -3715 857 4105 -1166 -3540 2392 3390 -2655 -2416 3390 1312 -3993 -657 3819
5467 3819 -502 -3657 876 3358 -1409 -3373 2243 3067 -2810 -2522 3358 1924 -4221 -814 4155
5482 4155 -438 -4105 1494 3632 -1948 -3183 2444 2370 -2990 -1503 3391 1245 -3725 -519 4023
5497 4023 -15 -3664 1363 3797 -1949 -3256 3024 2248 -3129 -1717 3442 717 -3729 -472 3385
5512 3385 -496 -3688 1363 3296 -2076 -3238 2763 2565 -3323 -1526 3732 829 -4180 340 3978
5527 3978 -631 -3474 1437 3360 -1991 -2712 2782 2592 -3319 -1653 3610 271 -4037 218 4137
5542 4137 -1506 -3404 1662 2848 -2077 -2427 3042 2069 -2871 -1687 3771 807 -3587 343 3888
5557 3888 -1112 -3358 2004 3471 -3049 -2619 2989 1936 -3305 -665 3859 243 -3672 406 3433
5572 3433 -950 -3296 2293 3136 -2942 -2374 3311 1598 -3900 -824 3337 -385 -3633 496 3216
5587 3216 -1801 -3311 2057 2665 -2617 -1911 3279 1916 -3732 -790 4109 -143 -3726 1544 3522
5602 3522 -1790 -2963 2572 2342 -2956 -2138 2963 1316 -3449 -620 3872 -243 -3830 1075 3438
5617 3438 -2040 -2947 2928 2556 -3440 -1340 3504 1000 -3608 -111 3357 -668 -3343 1092 3171
5632 3171 -1844 -3068 2588 2064 -3021 -1314 3510 524 -3480 127 3599 -592 -3110 1476 2648
5647 2648 -1987 -2420 2627 1935 -3059 -1998 3202 727 -3848 166 3794 -1100 -3319 1927 2907 -2182
5663 -2182 -1921 2946 1745 -2903 -1133 3555 903 -3268 216 3688 -793 -3326 2021 2843 -2694
5678 -2694 -2206 2966 1484 -3305 -790 3120 83 -3547 585 3377 -1112 -3321 1699 2929 -2656
5693 -2656 -2387 3281 1636 -3216 -853 3590 50 -3344 1039 3138 -1218 -2803 1800 2347 -2352
5708 -2352 -1794 3050 1386 -3315 -597 3845 -89 -3619 1075 2939 -2150 -2757 2456 2166 -2618 -1631
5724 -1631 2859 1127 -3069 -534 3159 -317 -3567 1137 3414 -1569 -2776 2585 2281 -3029 -1337
5739 -1337 3444 697 -3460 113 3320 -318 -2987 1292 2995 -1792 -2725 2421 2062 -2914 -1692
5754 -1692 3173 280 -3603 33 3076 -1090 -3337 1292 2585 -1959 -2299 2323 1735 -2679 -1093
5769 -1093 3220 953 -3329 319 3682 -967 -3269 2151 2834 -2206 -2249 2587 1498 -2785 -1137 2637
5785 2637 690 -3222 39 3147 -772 -3341 1812 2608 -2382 -2413 2777 1593 -3176 -1015 3051 77
5801 77 -3178 94 2918 -1128 -2843 1578 2550 -1959 -2427 3086 1585 -3140 -659 3546 -14 -2783
5817 -2783 947 3040 -1342 -2539 1578 2428 -2132 -1918 2367 1191 -2953 -932 2909 -193 -3807
5832 -3807 572 2866 -1663 -2704 2128 2323 -2388 -1401 2887 1426 -2820 -604 2888 138 -3014
5847 -3014 985 2972 -1730 -2850 2111 2161 -2635 -1735 2773 792 -2730 76 3170 -310 -3111 911
5863 911 2620 -1526 -2386 2294 2067 -2340 -1583 2994 370 -3400 93 3029 -735 -2814 1479 2145
5879 2145 -1685 -2151 2004 1491 -2447 -1053 3211 886 -2853 7 3385 -773 -3041 1801 2743 -1869
5895 -1869 -2228 2249 1508 -2609 -1131 2607 375 -3113 -129 2632 -893 -2877 1506 2800 -2212
5910 -2212 -1816 2753 1509 -2908 -905 3091 -114 -3023 510 2559 -1063 -2923 1384 2390 -2174
5925 -2174 -2213 2486 1328 -3115 -678 3316 187 -2995 733 2571 -1408 -2357 1684 2297 -2067 -1717
5941 -1717 2327 1240 -2800 -874 2916 -22 -3176 391 2880 -1651 -2600 2161 2208 -2282 -1585 2488
5957 2488 792 -2330 -498 3270 276 -2635 990 2590 -1415 -2631 2241 1867 -2628 -1693 2625
5972 2625 306 -3116 -324 2602 -580 -2990 438 2471 -1434 -2269 1843 2044 -2495 -1594 2734 687
5988 687 -2807 25 3107 -698 -2554 1256 2247 -1676 -2057 1813 1462 -2229 -902 2625 793 -2806
6004 -2806 47 3081 -841 -2783 1216 2440 -1958 -1790 2481 1532 -2161 -868 2744 203 -2893
6019 -2893 220 2748 -464 -2727 1327 2471 -1795 -1917 2699 1414 -2435 -475 2662 242 -2616
6034 -2616 178 2747 -687 -2349 1690 2016 -1852 -2135 2094 1104 -2897 -696 2726 -1 -3025 441
6050 441 2469 -1196 -2497 1624 1942 -1864 -1677 2013 1158 -2040 -247 2744 169 -2804 716 2752
6066 2752 -1165 -2236 1817 1654 -2134 -1371 2310 629 -2604 -678 2231 -362 -2520 691 2462
6081 2462 -1115 -2495 1797 1742 -2044 -1400 2625 868 -2924 -170 2219 -432 -2336 670 2088 -1247
6097 -1247 -2194 1464 1752 -1959 -1317 2715 708 -2519 25 2988 -326 -2123 1246 2003 -1454 -1898
6113 -1898 1740 1375 -2407 -1303 2250 705 -2560 -379 2629 -553 -2841 882 2294 -1887 -1804 2114
6129 2114 1468 -2205 -853 2662 392 -2520 421 2529 -329 -2173 898 2218 -1763 -1842 2387 1205
6145 1205 -2775 -793 2383 -6 -2436 422 2334 -690 -2178 1130 2111 -1667 -1886 1974 1234 -2681
6161 -2681 -917 2443 -6 -2708 523 2234 -1177 -2031 1703 1798 -1596 -1426 2186 1197 -2447 -665
6177 -665 2614 400 -2174 426 2695 -1207 -2333 1033 1939 -1918 -1295 2125 362 -2334 -422 2230
6193 2230 -40 -2262 336 2189 -1018 -2043 1160 1882 -1925 -1562 2646 627 -2133 -145 2851
6208 2851 -23 -2174 854 2245 -733 -1767 1673 1498 -2021 -1154 2298 779 -2539 -259 2604
6223 2604 -808 -2738 860 2069 -1497 -1533 1553 1368 -1936 -1083 2278 523 -2306 -270 2488 -261
6239 -261 -2499 966 2158 -1681 -1699 1847 1412 -1949 -640 2334 374 -2241 137 2349 -435 -2118
6255 -2118 768 2126 -1325 -1489 1885 1352 -2341 -655 2168 224 -2472 -4 2129 -682 -2019
6270 -2019 911 1636 -1469 -1728 1577 1165 -2252 -783 2620 260 -2421 429 2372 -1010 -1782 1570
6286 1570 1868 -1646 -1294 2222 963 -1995 -655 2250 79 -2476 133 2428 -1132 -2037 1261 1787
$$ [...]
8191I00
##END NTUPLES=NMR FID
##END=
