##TITLE=1H_BAU-2.08
 CDCl3, 32 sc, 
 8.2.2019
##JCAMPDX= 6.0         $$ Bruker NMR JCAMP-DX V2.0
##DATA TYPE= NMR FID
##DATA CLASS= NTUPLES
##ORIGIN= UXNMR, Bruker Analytische Messtechnik GmbH
##OWNER= root
$$ XWIN-NMR		Version 3.5
$$ Fri Feb  8 14:42:22 2019 Russian Standard Time (UT+4h)  she@DPX200
##.OBSERVE FREQUENCY= 200.1313
##.OBSERVE NUCLEUS= ^1H
##.DELAY= (6, 6)
##.ACQUISITION MODE= SIMULTANEOUS
##.ACQUISITION SCHEME= undefined
##.AVERAGES= 8
##.DIGITISER RES= 18
##SPECTROMETER/DATA SYSTEM= spect
##.PULSE SEQUENCE= zg30
##.SOLVENT NAME= CDCl3
##.SHIFT REFERENCE= (INTERNAL, CDCl3, 0, 15.7039)
##AUDIT TRAIL= $$ (NUMBER, WHEN, WHO, WHERE, WHAT)
$$ ##TITLE= Audit trail, XWIN-NMR		Version 3.5
$$ ##JCAMPDX= 5.01
$$ ##ORIGIN= Bruker BioSpin GmbH
$$ ##OWNER= she
$$ F:/spectra/data/she/nmr/H-F/1/audita.txt
$$ ##AUDIT TRAIL=  $$ (NUMBER, WHEN, WHO, WHERE, WHAT)
(   1,<2019-02-08 14:41:17.31 +0400>,<she>,<DPX200>,
      <created by zg, POWCHK disabled, PULCHK disabled
       terminated by command 'halt'
       configuration hash MD5:
       00 E9 B6 7A A2 85 ED C7 34 08 36 98 17 FE 4E 26
       data hash MD5: 16K
       35 3D 20 51 0D 96 BD 1B 61 17 DB 41 7B 09 A9 43>)
$$ ##END=
$$ 
$$ hash MD5
$$ 0F 89 AB 71 65 B4 D4 76 14 5D 80 9E BE 33 DA 1B
##$RELAX= 
##$RELAX= 
##$RELAX= 
##$RELAX= 
##$RELAX= 
##$RELAX= 
$$ Bruker specific parameters
$$ --------------------------
##$DU= <F:/spectra>
##$EXPNO= 1
##$NAME= <H-F>
##$PROCNO= 1
##$TYPE= <nmr>
##$USER= <she>
##$AMP= (0..31)
100 100 100 100 100 100 100 100 100 100 100 100 100 100 100 100 100 100 
100 100 100 100 100 100 100 100 100 100 100 100 100 100 
##$AQSEQ= 0
##$AQ_mod= 1
##$AUNM= <au_zg>
##$AUTOPOS= <>
##$BF1= 200.13
##$BF2= 200.13
##$BF3= 200.13
##$BF4= 200.13
##$BF5= 200.13
##$BF6= 200.13
##$BF7= 200.13
##$BF8= 200.13
##$BYTORDA= 1
##$CFDGTYP= 0
##$CFRGTYP= 5
##$CHEMSTR= <none>
##$CNST= (0..31)
1 1 145 1 1 1 1 1 1 1 1 1 1 1 1 1 1 1 1 1 1 1 1 1 1 1 1 1 1 1 1 1 
##$CPDPRG= <>
##$CPDPRG1= <>
##$CPDPRG2= <>
##$CPDPRG3= <>
##$CPDPRG4= <mlev>
##$CPDPRG5= <mlev>
##$CPDPRG6= <mlev>
##$CPDPRG7= <mlev>
##$CPDPRG8= <mlev>
##$CPDPRGB= <>
##$CPDPRGT= <>
##$D= (0..31)
0 1.2 0 0 0 0 0 0 0 0 0 0.03 0 0 0 0 0 0 0 0 0 0 0 0 0 0 0 0 0 0 0 0 
##$DATE= 1549622477
##$DBL= (0..7)
120 120 120 120 120 120 120 120 
##$DBP= (0..7)
150 150 150 150 150 150 150 150 
##$DBP07= 0
##$DBPNAM0= <>
##$DBPNAM1= <>
##$DBPNAM2= <>
##$DBPNAM3= <>
##$DBPNAM4= <>
##$DBPNAM5= <>
##$DBPNAM6= <>
##$DBPNAM7= <>
##$DBPOAL= (0..7)
0.5 0.5 0.5 0.5 0.5 0.5 0.5 0.5 
##$DBPOFFS= (0..7)
0 0 0 0 0 0 0 0 
##$DE= 6
##$DECBNUC= <off>
##$DECIM= 32
##$DECNUC= <off>
##$DECSTAT= 4
##$DIGMOD= 1
##$DIGTYP= 9
##$DL= (0..7)
0 120 120 120 120 120 120 120 
##$DP= (0..7)
150 150 150 150 150 150 150 150 
##$DP07= 0
##$DPNAME0= <>
##$DPNAME1= <>
##$DPNAME2= <>
##$DPNAME3= <>
##$DPNAME4= <>
##$DPNAME5= <>
##$DPNAME6= <>
##$DPNAME7= <>
##$DPOAL= (0..7)
0.5 0.5 0.5 0.5 0.5 0.5 0.5 0.5 
##$DPOFFS= (0..7)
0 0 0 0 0 0 0 0 
##$DQDMODE= 0
##$DR= 18
##$DS= 0
$$ [...]
##$SUBNAM2= <"">
##$SUBNAM3= <"">
##$SUBNAM4= <"">
##$SUBNAM5= <"">
##$SUBNAM6= <"">
##$SUBNAM7= <"">
##$SUBNAM8= <"">
##$SUBNAM9= <"">
##$SW= 20.0189088683792
##$SWIBOX= (0..15)
0 0 2 0 0 0 0 0 0 0 0 0 0 0 0 0 
##$SW_h= 4006.41025641026
##$TD= 16384
##$TD0= 1
##$TE= 0
##$TE2= 300
##$TE3= 300
##$TEG= 300
##$TL= (0..7)
0 120 120 120 120 120 120 120 
##$TP= (0..7)
150 150 150 150 150 150 150 150 
##$TP07= 0
##$TPNAME0= <>
##$TPNAME1= <>
##$TPNAME2= <>
##$TPNAME3= <>
##$TPNAME4= <>
##$TPNAME5= <>
##$TPNAME6= <>
##$TPNAME7= <>
##$TPOAL= (0..7)
0.5 0.5 0.5 0.5 0.5 0.5 0.5 0.5 
##$TPOFFS= (0..7)
0 0 0 0 0 0 0 0 
##$TUNHIN= 0
##$TUNHOUT= 0
##$TUNXOUT= 0
##$USERA1= <user>
##$USERA2= <user>
##$USERA3= <user>
##$USERA4= <user>
##$USERA5= <user>
##$V9= 5
##$VALIST= <valist>
##$VCLIST= <CCCCCCCCCCCCCCC>
##$VD= 0
##$VDLIST= <DDDDDDDDDDDDDDD>
##$VPLIST= <PPPPPPPPPPPPPPP>
##$VTLIST= <TTTTTTTTTTTTTTT>
##$WBST= 1024
##$WBSW= 4
##$XGAIN= (0..3)
0 0 0 0 
##$XL= 0
##$YL= 0
##$YMAX_a= 823964
##$YMIN_a= -946845
##$ZGOPTNS= <>
##$ZL1= 120
##$ZL2= 120
##$ZL3= 120
##$ZL4= 120
##$ABSF1= 10
##$ABSF2= 0
##$ABSG= 5
##$ABSL= 3
##$ALPHA= 0
##$AQORDER= 0
##$ASSFAC= 0
##$ASSFACI= 0
##$ASSFACX= 0
##$ASSWID= 0
##$AUNMP= <proc_1d>
##$AZFE= 0.1
##$AZFW= 0.1
##$BCFW= 1
##$BC_mod= 2
##$BYTORDP= 1
##$COROFFS= 0
##$CY= 11.3945322036743
##$DATMOD= 1
##$DC= 2
##$DFILT= <>
##$DTYPP= 0
##$F1P= 18.9103706918063
##$F2P= -1.10871071338519
##$FCOR= 0.5
##$FTSIZE= 0
##$FT_mod= 4
##$GAMMA= 1
##$GB= 0.15
##$INTBC= 1
##$INTSCL= 1
##$ISEN= 128
##$LB= 0.24
##$LEV0= 0
##$LPBIN= 0
##$MAXI= 10000
##$MC2= 0
##$MEAN= 0
##$ME_mod= 0
##$MI= 1.114404
##$NCOEF= 0
##$NC_proc= 0
##$NLEV= 6
##$NOISF1= 3.799351
##$NOISF2= 2.8
##$NSP= 1
##$NTH_PI= 0
##$NZP= 0
##$OFFSET= 15.70392
##$PC= 1
##$PHC0= -8682.182
##$PHC1= 9.800191
##$PH_mod= 1
##$PKNL= yes
##$PPARMOD= 0
##$PSCAL= 0
##$PSIGN= 0
##$REVERSE= no
##$SF= 200.130013532006
##$SI= 16384
##$SIGF1= 3
##$SIGF2= 2
##$SINO= 400
##$SIOLD= 16384
##$SREGLST= <1H.CDCl3>
##$SSB= 0
##$STSI= 0
##$STSR= 0
##$SW_p= 3612.71676300578
##$SYMM= 0
##$S_DEV= 0
##$TDeff= 0
##$TDoff= 0
##$TI= <>
##$TILT= no
##$TM1= 0
##$TM2= 0
##$TOPLEV= 0
##$USERP1= <user>
##$USERP2= <user>
##$USERP3= <user>
##$USERP4= <user>
##$USERP5= <user>
##$WDW= 1
##$XDIM= 8192
##$YMAX_p= 0
##$YMIN_p= 0
$$ End of Bruker specific parameters
$$ ---------------------------------
##NTUPLES= NMR FID
##VAR_NAME=  TIME,          FID/REAL,        FID/IMAG
##SYMBOL=    X,             R,               I
##VAR_TYPE=  INDEPENDENT,   DEPENDENT,       DEPENDENT
##VAR_FORM=  AFFN,          ASDF,            ASDF
##VAR_DIM=   8192,          8192,            8192
##UNITS=     SECONDS,       ARBITRARY UNITS, ARBITRARY UNITS
##FACTOR=    0.0002496,     1,               1
##FIRST=     0,             0,               0
##LAST=      2.0444736,     0,               0
##MIN=       0,             -946845,         0
##MAX=       2.0444736,     823964,          0
$$ Real data points
##PAGE= N=1
##DATA TABLE= (X++(R..R)), XYDATA
$$ [...]
1785a97Q70q95n91J124J93q28K69N56j29l64N74j57m51k97J83j49j72k93R28R9
$$ -197 673 -222 -813 311 504 -324 -55 501 372 8 582 425 -26 -323 -140 -289 -461 -754 174 273
1805B73p94M73M16l04l60Q44l87M6K56k07k72J27O4m55n3L60p9J9n4l43L87m07
$$ 273 -521 -48 368 64 -296 548 161 207 463 256 -16 111 175 -280 -333 27 -52 -33 -87 -430 -43 -450
1827d50J48q5K23Q4O12p00j94M95M29o42J68M41k06q0J25m98l28K28M25n53l63
$$ -450 -302 -387 -164 -80 532 -168 -362 133 562 -80 88 529 323 243 368 -130 -458 -230 195 -358 -721
1848g21N34L70m86l44P05J2k00J79M29j46j48K46k99l92K51M61n05l93M33L12
$$ -721 -187 183 -303 -647 58 70 -130 49 478 332 184 430 131 -261 -10 451 -54 -447 -14 298
1868B98k77k24j54L04p7l9K03j22p5L89j88l92R2P67l81k68K64Q4k6k02l3j16
$$ 298 21 -203 -357 -53 -130 -169 34 -88 -163 226 38 -354 -262 505 124 -144 120 204 178 -24 -57 -173
1890a73L14m1k29K3K08r2j29n35M96M53k33j31L67k2k24L0l14m5M59J42m27m6
$$ -173 141 100 -129 -106 102 10 -119 -654 -158 295 62 -69 298 276 52 82 -232 -277 182 324 -103 -149
1912a49M64o0m32j59L87K59j16j51j36N8P3j0k27o64N91L68k65k50M30K09k18
$$ -149 315 255 -177 -336 51 310 194 43 -93 -35 38 28 -199 -863 -272 96 -169 -419 11 220 2
1933Bj66K48M2J01J4l14J81m8J20k22k48L21N37n51j22N3J82N8m72O0J68K27M7
$$ 2 -164 84 126 227 241 -73 108 60 180 -42 -290 31 568 17 -105 -52 130 188 -284 -224 -56 171 218
1956B18m20j95N73L6k64J33n5M17r7k18j34k8J15n3m51j13K48K68j44k00L83Q6
$$ 218 -202 -397 176 212 -52 81 26 443 346 128 -6 -34 81 28 -423 -536 -288 -20 -164 -364 19 105
1978A05r1K00m7J62q8r0r7j53RM02o3o71K81P02o99k13L35L09k62j83K25o3R1
$$ 105 14 214 167 329 241 151 54 -99 -90 312 249 -422 -141 561 -138 -351 -16 293 31 -152 73 10 101
2001A01J83j27k13j74K17K32n22L26M11N3n99J55J76J33k63k04j09N09P0o20l4
$$ 101 284 157 -56 -230 -13 219 -303 23 434 487 -112 43 219 352 89 -115 -224 285 355 -265 -299
2022b99K13Q8J41j60j62K57K79r8k18j27K80K35m59n11M19L85l14l29M89M9k1
$$ -299 -86 2 143 -17 -179 78 357 259 41 -86 194 429 -30 -541 -122 263 -51 -380 109 158 137
2043A37K03j55k16K14K25l33n73L27M27k96m43K23O94l08m30J84K54N6Nj13j73
$$ 137 340 185 -31 183 408 75 -498 -171 256 -40 -483 -260 434 126 -304 -120 134 190 195 82 -91
2064i1K03L19m37k66J5M94p5n83k0N26J52k77l92M27M9j35q9n6J42K58n6k84K89
$$ -91 112 431 -6 -272 -257 237 162 -421 -441 85 237 -40 -432 -5 44 -91 -180 -236 -94 164 108 -176 113
2087A13l3K93k42m38J99L77K93p76j05O06J14n13l18K39J25k02J38K99j37k2N89
$$ 113 80 373 131 -307 -108 269 562 -214 -319 287 401 -112 -430 -191 -66 -268 -130 169 32 10 599
2108E99k57o18K45O48m71m06K68O26n22m47J79R8j8j45L6L10j63J77L19q10J49
$$ 599 342 -276 -31 617 146 -260 8 634 112 -335 -156 -58 -76 -221 -185 125 -38 139 458 -352 -203
2129b03O25k26o58K25N18J42m76r8J98M03k42l02J22R1k64K04l01n3K90K49l82
$$ -203 422 196 -462 -237 281 423 -53 -151 47 450 208 -94 28 119 -145 59 -242 -295 -5 244 -138
2150a38J57K73L3Nm25J7M54K41p91j36P39k16l40Q0R3j57L60l07J8j83r6P23j87
$$ -138 19 292 325 330 -95 -78 376 617 -174 -310 429 213 -127 -47 46 -111 249 -58 -40 -223 -319 404 217
2173B17j009Q51N96l24p78M68O04n33l24J42K09m9p6P1m4m16N54L2l35n54Q94
$$ 217 -792 59 655 331 -447 21 625 92 -232 -90 119 70 -6 65 21 -395 159 191 -144 -698 196
2194A96J64o24j6N37K14n83M3j2N6n6m9j75K02N8J95k10j85L79K87j82n43K76
$$ 196 360 -264 -280 257 471 -112 -69 -81 -25 -81 -130 -305 -103 -45 150 -60 -245 134 421 239 -304 -28
2216b8M17k35l79k81N61J48o20J09J58L10n06L22p0j81M78j09q8m27K65O34j03
$$ -28 389 154 -225 -506 55 203 -417 -308 -150 160 -346 -24 -94 -275 203 94 6 -421 -156 478 375
2237C75p42L14O69l20n43Q5P28m42l98K75k9j57J43K09o47j78O80N28p62m51R07
$$ 375 -367 -53 616 296 -247 -162 566 124 -274 1 -28 -185 -42 167 -480 -658 22 550 -212 -663 244
2258B44M84p73l76O29J60m61J83q4k20J87r5j83j78j4P07J5m19K05K84L55j018
$$ 244 728 -45 -421 208 368 -93 90 6 -214 -27 -122 -305 -483 -497 210 225 -194 11 295 650 -368
2279c68K08M28j27m0j50q2K27m7m06Q6M94l63j51L91n31L65N01l00l80J5P55q7
$$ -368 -160 268 141 101 -49 -131 96 49 -357 -271 223 -140 -291 100 -431 -66 435 135 -245 -230 525 438
2301D38o79j16L78M28p97J76L79k01k54L77l09j66M53J99n41p3P22Nl68l76L88
$$ 438 -241 -357 21 449 -348 -172 207 6 -248 129 -180 -346 107 306 -235 -308 414 419 51 -325 63
2322F3L23j82l43LK02k36K31j00j10N3L61l89k05K03M52l03k2r5O47L9n29l80
$$ 63 386 204 -139 -136 66 -170 61 -39 -149 -96 265 -124 -329 -126 326 23 1 -94 553 592 63 -317
2344c17M21J71j46l80R2J13J61k27l30L97p0J8J85k49j18O22J69o17o2O67Q1n75
$$ -317 104 275 129 -251 -159 -46 115 -112 -442 -45 -115 -97 88 -161 -279 343 512 -105 -167 500 581 6
2366Fj37J82J56j47k59N8J03k74K92k46q0K93Q83p53l31O51L69n40o17K62K43
$$ 6 -131 51 207 60 -199 -141 -38 -312 -20 -266 -346 -53 830 77 -254 397 766 226 -391 -129 114
2387A14q5m8k19O3J01N9K5j70j2M54j15n68L17M20N1n03J17J6L17q1n51Q3O55
$$ 114 29 -19 -238 -175 -74 -15 10 -160 -172 282 167 -401 -84 336 387 -116 1 17 334 253 -298 -215 440
2410D40M8o98j21O0K08J49j75k80N79K1l27J60m38M43M99o12j13L93M17o32k69
$$ 440 488 -210 -331 -271 -63 86 -89 -369 210 231 -96 64 -374 69 568 -44 -157 236 653 21 -248
2431b48P3J23N9J08l59k13O58r6l08o22M06J074r8j138M64P90n66m00j2M02l32
$$ -248 -175 -52 7 115 -244 -457 201 105 -203 -825 -419 655 557 -581 -117 673 107 -293 -305 97 -235
2452b35L53j95k09M58k8k72p1q7N35K2l10j59L01J55l35J34k24K30L98m65l10
$$ -235 118 -77 -286 172 144 -128 -199 -286 249 271 -39 -198 103 258 -77 57 -167 63 461 -4 -314
2473c14K56K70j11l80L6M73Q9Q2p11K08L69j35j04k87K8M98k52l25K08M98l96
$$ -314 -58 212 101 -279 -243 230 319 401 -310 -102 267 132 28 -259 -231 267 15 -310 -102 396 0
2494@k38L66j79j4N18m00l70L79L26k04n80M00K90k8l95k27O80Mk92O3k32N1K63
$$ 0 -238 128 -51 -65 453 53 -317 62 388 184 -396 4 294 266 -129 -356 324 328 36 99 -133 -82 181
2517A81P4q15J60O74jn16K99J52K31K7r44N50L25j61k94j52L00j71K24m45m8N76
$$ 181 255 -560 -400 274 273 -243 56 208 439 466 -478 72 397 236 -58 -210 90 -81 143 -302 -350 226
2539B26k82k46K95k80Q29j61m32k17N04K44m34m61L90K50j15k72k02L17M0J84
$$ 226 -56 -302 -7 -287 542 381 -51 -268 236 480 46 -415 -25 225 110 -162 -364 -47 -7 177
2559A77ok22k09N61j97m63J07M93j62o78O90N01k67n51j65M89l5K40j46q0o70
$$ 177 171 -51 -260 301 104 -359 -252 241 79 -599 91 592 325 -226 -391 98 63 303 157 77 -593
2580e93R52J03q36j71O76q6l24J0O14K04r0j36k21L20k86q1j06r5j67K77q6n40
$$ -593 359 462 -374 -545 131 45 -279 -269 345 549 459 323 102 422 136 55 -51 -146 -313 -36 -122 -662
2602f62K90O71j73k27o9L25J47j30m62O25K02l34n71M86p0l42L34j39l09L81K68
$$ -662 -372 299 126 -101 -170 155 302 172 -290 335 537 203 -368 118 48 -294 40 -99 -408 -27 241
2623B41Q6o75J51P77k86p21j03J014l07n25J09O20m80q6K18k3RK21k23Q1o24M64
$$ 241 327 -348 -197 580 294 -427 -530 484 177 -348 -239 381 -99 -185 33 10 19 240 17 98 -526 -62
2645f2J41j95o98R01M52n69l19O42k0k00j24J61J25j41L4j52k13j46L82L33r46
$$ -62 79 -116 -814 87 539 -30 -349 293 273 73 -51 110 235 94 128 -24 -237 -383 -1 332 -614
2666f14o8R98n4m82m1M25L28m3o55P9O72p22j39M92k63k97N78J83p51L30M59j89
$$ -614 -682 316 262 -220 -261 164 492 449 -206 -127 545 -177 -316 176 -87 -384 194 377 -374 -44 415 226
2688B26m98J14M86j6l76m50P64K63q21J01M77l20LM66m63l89N38J74m11o04M42
$$ 226 -272 -158 328 312 -64 -514 250 513 -308 -207 270 -50 -47 419 -44 -433 105 279 -132 -736 -294
2709b94O31k94l54J43P61m71n24L71M48l48J17k4m08R1K77r0j70l9K54J16m55
$$ -294 337 43 -311 -168 593 122 -402 -31 417 69 186 162 -246 -155 122 32 -138 -177 77 193 -262
2730b62l95O55O84q18k14M77J66k61j71L4J80J03m1k1k88NL42R8o79k9O64K05
$$ -262 -657 -2 682 -136 -350 127 293 32 -139 -105 75 178 137 116 -172 -167 175 273 -406 -435 229 434
2752D34o28j27O23q2m11N8L81k23k2k03K58k37L5O51k48p18N56J71m24m00M72
$$ 434 -194 -321 302 220 -191 -133 248 25 3 -200 58 -179 -144 507 259 -459 97 268 -156 -556 -84
2773h4K34k14j09j13K13K43k43p5K21j08O2K73n80l3N87J0m88L4K80L69n18m18
$$ -84 150 -64 -173 -286 -73 170 -73 -148 73 -35 27 300 -280 -313 274 284 -204 -170 110 479 -39 -457
2795d57M45J54j27m30L11J40j18J80m2k80L65L16n15J59l17N92Ll74j86K60K24
$$ -457 -12 142 15 -415 -104 36 -82 98 56 -224 141 457 -58 101 -216 376 379 5 -181 79 303
2816C03m95j41L33N7j44j94o6M14N3J88l91j08J51J28m6j85q5N71p9o28L2N36
$$ 303 -192 -333 0 57 -87 -281 -347 67 120 308 -83 -191 -40 88 42 -143 -228 343 264 -364 -332 204
2838B04j58m57L42R3R2m3j9l6p1J40J14J75j034Q55L07p69K1L82J68k39p6l88
$$ 204 46 -411 -69 24 116 73 54 18 -53 87 201 376 -658 197 504 -265 -244 138 306 67 -9 -397
2860c97K25K89n1k01J15Q6QJ17o96K76N75p5n78K62L23o4k68j53k0L77k12k15
$$ -397 -172 117 66 -135 -20 66 74 191 -505 -229 346 271 -307 -45 278 214 -54 -207 -227 150 -62 -277
2882b77L44j87J00j47M57m63L01K49m44J05n2J03p6k55LM50m0k18p8K57j8l2J1
$$ -277 67 -120 -20 -167 290 -173 128 377 -67 38 -14 89 13 -242 -239 211 171 -47 -125 132 114 82 93
2905I3j88q0K50K36m17J91M4L2k28k99K73M51l08l45K03K45k59J05j26q3N32l35
$$ 93 -95 -175 75 311 -106 85 129 161 -67 -366 -93 358 50 -295 -92 153 -106 -1 -127 -210 322 -13
2927a3k8k07K2J69K98j41o67O73N1k2j39p6M55l94K52l82R1K35k96j43M74j29
$$ -13 -41 -248 -226 -57 241 100 -567 106 157 135 -4 -80 375 -19 233 -149 -58 177 -119 -262 212 83
2949H3k93K37k37r0N66n7o00L34N8p7J31j05O3k6j58j57J99L64k34l1K3q4M38
$$ 83 -210 27 -210 -300 266 209 -391 -57 1 -76 55 -50 13 -13 -171 -328 -129 235 1 -30 -7 -91 347
2972C47j34j29l37L99q5j07k08jL18kj92j17K92K10l40J97j97N0K02j83J31k00
$$ 347 213 84 -253 146 61 -46 -254 -255 63 61 -131 -248 44 254 -86 111 -86 -36 166 -17 114 -86
2994h6K84l46K62j99j1L45j4l83K01O28o56m0j03nL14j39k73N7J8pM44m69m3L03
$$ -86 198 -148 114 -85 -96 249 235 -148 53 681 25 -15 -118 -123 191 52 -221 -164 -146 -153 291 -178 -221 82
3018H2L22m41p2L8J93k76K70k20K8K21k18k68J21N6L67q4l66J18K05J02m91J27
$$ 82 404 -37 -109 -71 122 -154 116 -104 -76 145 -73 -341 -220 -164 203 119 -247 -129 76 178 -313 -186
3040a86M02k28k53R4J09J74k1l36J74J08n9P0j26k23M35J84m97n5L37J3j16j41
$$ -186 216 -12 -265 -171 -62 112 91 -245 -71 37 -22 48 -78 -301 134 318 -179 -234 103 116 0 -141
3062a41l8M15k11p5n9L01k35j01L99m78K91k3q7k71K7O01k62J60m85K03L74l08
$$ -141 -179 236 25 -50 -109 192 -43 -144 255 -223 68 45 -42 -313 -286 315 53 213 -272 -69 305 -3
3084cp3NK93m05l5L38j91L45J72m47m09N93j89L58j77n55K77K49k53m6J25k19
$$ -3 -76 -71 222 -183 -218 120 -71 274 446 -1 -410 183 -6 352 175 -380 -103 146 -107 -153 -28 -247
3106b47J92j87L91j53j12K29k74Q3q1J56K01k31j94L32j77j73J53K66k03j01J2
$$ -247 -55 -242 149 -4 -116 113 -161 -78 -159 -3 198 -33 -227 105 -72 -245 -92 174 -29 -130 -118
3127a18k2K51p9J37j28n0j6l0J46l12K42J50l99M2L28k25k19ML14J96k94MJ63
$$ -118 -140 111 32 169 41 -9 -25 -55 91 -221 21 171 -228 -186 142 -83 -302 -298 16 212 -82 -78 85
3150H5r7oj25J20R4l3k7J20l16QJ78L5n8k94K95M49n13K50l9O9k88L31j04k89
$$ 85 -12 -18 -143 -23 71 38 11 131 -185 -177 1 36 -22 -316 -21 428 -85 165 126 195 -93 238 134 -155
3174a55K53Q5J15l82L6J95J4k89O6J96L7m64O5N18l75k3L51j56j66P0L66k88J7
$$ -155 98 183 298 -84 -48 147 161 -128 -62 134 171 -293 -228 290 -85 -108 243 87 -79 -9 357 69 86
3197H6J6K13k49n7JN08m85m0O5o9j59n1J24J75P2J30p3k79o3m8L47J9k36N6L10
$$ 86 102 315 66 9 10 518 33 -7 58 -11 -170 -221 -97 78 150 280 207 -72 -135 -183 164 183 -53 3 313
3222C13l48j11J99R8r1l07K95J61j58k3J3ok7J03k44l72L02J42K06j28n3L37q2
$$ 313 -35 -146 53 151 60 -247 48 209 51 28 41 35 8 111 -133 -505 -203 -61 145 17 -36 301 219
3245B19m39J39J47J2k54k21K56K66k90K23m6j00K21m3L2j41q8K02Q1k41MK44m5
$$ 219 -220 -81 66 78 -176 -397 -141 125 -165 58 12 -88 133 90 122 -19 -107 95 176 -65 -61 183 138
3268A38l85L07n2o2j2K46j83J61r9l4j38J45k3N5j47l15M70P7j67l9lK05k04K37
$$ 138 -247 60 8 -54 -66 180 -3 158 59 25 -113 32 9 64 -83 -398 72 149 -18 -57 -60 145 -59 178
3292A78k9q2j88J03J85k06O4j72L27j72l10L57K57m74J99J54j62k32L34Q6n84
$$ 178 149 67 -121 -18 167 -39 25 -147 180 8 -302 55 312 -162 37 191 29 -203 131 217 -367
3313c67K86K55r5k16K11J43O1k48q3J80r1l0l70K89K91m16J24j14R1J42k02J58
$$ -367 -81 174 79 -137 74 217 278 30 -53 127 36 6 -364 -75 216 -200 -76 -190 -99 43 -159 -1
3335aj3j32K73m4k38K04J18j72k34J39K55l19p1K96o2o2J54k08K36J80l23J17
$$ -1 -14 -146 127 83 -155 49 167 -5 -239 -100 155 -164 -235 61 -1 -63 91 -117 119 299 -24 93
3357I3j38l2Lj67kl5L33q6q1j19K72J19j85k28K70J07Lo8p5k4N7N5J1o8k16M56
$$ 93 -45 -77 -74 -241 -243 -278 55 -31 -112 -231 41 160 -25 -253 17 124 127 59 -16 -40 17 72 83 15 -201 255
3383B55k63pr5K17J56m54j4K91m5k33J96o9J03M1O5k11n6J34M5l6j40J26Q3M1
$$ 255 -8 -15 -110 107 263 -191 -205 86 41 -192 4 -65 38 79 144 -67 -123 11 56 20 -120 6 89 130
3407A30l72N54j08k34K01k64J99j64P9P3p1J39n6j21N3j1r7L71l21Pj2J34q0j62
$$ 130 -242 312 204 -30 171 -93 106 -58 21 94 23 162 106 -15 38 27 -70 301 -20 -13 -25 109 29 -133
3431a33N8o7J52j97j14M82p7j29K31k1q8o6J67k96R7O6P1q4j71q9L45l01M7J85
$$ -133 -75 -142 10 -187 -301 181 104 -25 206 185 97 31 198 -98 -1 65 136 52 -119 -208 137 -164 -117 68
3455F8R8j57j49K1J91J08j60j22N2J61o7k37L78k52J33J05j2l89K64Q8j88R5l14
$$ 68 166 9 -140 -119 72 180 20 -102 -50 111 44 -193 185 -67 66 171 159 -230 34 122 -66 29 -285
3478b85K56J85%k75Np7L97k57K4m1L10J81m84Q7M9M3k88J21Q8o5j6J8k28J86Q3
$$ -285 -29 156 156 -119 -114 -191 206 -51 -27 -68 242 423 -61 26 75 118 -170 -49 39 -26 -42 -24 -252 -66 17
3503A7j12J51o0P1Q9j72p4N07l44j89N2n0j5J49m5L3Nj17j96N48m35J77m6L21
$$ 17 -95 56 -4 67 156 -16 -90 417 73 -116 -64 -114 -129 20 -25 8 13 -104 -300 248 -187 -10 -56 265
3527B65m75J59J41r0O2j30K18M0j22k29L50j12N4j69R1j46Q0J52k9j87J3L08j86
$$ 265 -210 -51 90 0 62 -68 150 190 68 -161 189 77 131 -38 53 -93 -13 139 110 -77 -64 244 58
3550E8k26L7M8K26k70j35J12K27k60Q9j22l1K89N4j58J22J26n3k99j05M71l56
$$ 58 -168 -131 -83 143 -127 -262 -150 77 -183 -94 -216 -247 42 96 -62 60 186 133 -166 -271 200 -156
3572a56K27Q0m68N73k15j48J89k35K19qPj39M9m8K13j88L2M4Q6k7Lp7O8N0l00
$$ -156 71 151 -317 256 41 -107 82 -153 66 58 65 -74 -25 -73 140 -48 -16 28 114 87 90 13 81 131 -169
3597a69J4R8L3q7J30n5K59r3m26M08m2j4MJ4j99J32j39K25k00M1K53N9m30J59
$$ -169 -155 -57 -24 -111 19 -36 223 130 -296 112 70 56 60 74 -125 7 -132 93 -107 -66 187 246 -184 -25
3621b5lM2j57j19P8K49O1j92j2O8m1M7j77q0L84P4k85r3J89m7J62j32j1K45j66
$$ -25 -28 14 -143 -262 -184 65 126 -66 -78 -10 -51 -4 -181 -261 123 197 -88 -181 8 -39 123 -9 -20 225 59
3646E9o1J8j14L09j65P7n2k38J50j18N0L1j8J63l06K4J47J94j54l9J30j60K66
$$ 59 -2 16 -98 211 46 123 71 -167 -17 -135 -85 -54 -72 91 -215 -191 -44 150 -4 -43 87 -73 193
3669A93J45l47J26m9N8l10J74j08J84K62k65j34K82j04o7j03J60r3n1j1K27P8
$$ 193 338 -9 117 68 126 -184 -10 -118 66 328 63 -71 211 107 40 -63 97 4 -47 -58 169 247
3691B47j08ll22J56K30K8m75J29J65O0N1j66k44L58k7n9j15n3L50n1l13J85M9
$$ 247 139 136 -186 -30 200 228 -247 -118 47 107 158 -8 -252 106 79 20 -95 -148 202 151 -162 23 72
3714G2j5m8l2J0J95j77j27L1N4K18n8k88J4K48J9j01J3R2j44O4J9o9J81L6j40
$$ 72 57 9 -23 -13 182 5 -122 -91 -37 181 123 -165 -151 97 116 15 28 120 -24 40 59 -10 171 207 67
3739F7j77K50k39J3l5K6jN9K01k62m5K25j70QL9q6M5K2kQ0K7KJ42Q5m13P9K08
$$ 67 -110 140 -99 -86 -121 -95 -96 -37 164 -98 -143 82 -88 -80 -41 -127 -82 -60 -62 18 45 47 189 274 -139 -60 148
3766A48j8k18J60Q5n3r0j62L70p3j07j14j27K23Q0j08l1k52M33j98J03j45R2O9
$$ 148 130 -88 72 157 104 14 -148 222 149 42 -72 -199 24 104 -4 -35 -287 146 -52 51 -94 -2 67
3789F7o3K0k51L16j22l0k0OK22j24P5k23J65K6r0o5k40M33k9r2lJ5j14L4l7o7
$$ 67 4 24 -227 89 -33 -63 -83 -77 145 21 96 -127 38 64 -26 -91 -331 102 73 -19 -22 -7 -121 -87 -124 -191
3815a91M55j55l16K95k7o0J81j81m0j25K71K6l81J79L01k23o2L56k63J05j23K9
$$ -191 264 109 -207 88 61 1 182 1 -39 -164 107 133 -248 -69 232 9 -53 303 40 145 22 51
3837E1J07r7j34p1Q9K34o8r7j91J3K03LjR9J43j72J50l55J16J26N3k05N6p1k8
$$ 51 158 61 -73 -144 -55 179 111 14 -177 -164 39 42 41 140 283 111 261 -94 22 148 201 -4 52 -19 -47
3862d7K53k83j09L82o7m04K79L9l1o5N7l88M08J1p5M8O8j17P1j41J30k46K40o6
$$ -47 206 -77 -186 196 129 -275 4 43 12 -53 4 -384 24 35 -40 8 76 -41 30 -111 19 -227 13 -53
3886e3j09J99J2M1L7l77K59J11M2k74Q8J37j34J26j13j10J14N4q3l5q5J73m1o9
$$ -53 -162 37 49 90 127 -250 9 120 162 -112 -24 113 -21 105 -8 -118 -4 50 -33 -68 -153 20 -21 -90
3910i0k9J86K19j53k48m7K67j5q7j36j2N04l87j4O0J12M4k94J27l7J02k0o9J3
$$ -90 -119 67 286 133 -115 -162 105 90 3 -133 -145 359 -28 -42 18 130 174 -120 7 -30 72 52 -17 -4
3934d%l1K4J18k53J81K1j64J23P9q4K46k03l08K10j2k65L21J83k18J99k64J06
$$ -4 -4 -35 -11 107 -146 35 56 -108 15 94 10 256 53 -255 -45 -57 -322 -1 182 -36 163 -101 5
3957EL31k68j49R6n3j16J28j09J36l6J05J24k40P0L6j57J83k71L31k15K03j93
$$ 5 336 68 -81 15 -38 -154 -26 -135 1 -35 70 194 -46 24 60 -97 86 -185 146 -69 134 -59
3979e9P1q4K8Q9k73n7L33Mj05J41k6m1K44m40J30L2P9M4l01J99j31K34k10K76
$$ -59 12 -72 -44 45 -228 -285 48 52 -53 88 62 21 265 -175 -45 -13 66 110 -191 8 -123 111 -99 177
4003A77J79j59L3o09L61K82j28j05k39K30Q4Q8l46Q5kN3k44K50j81K36p8m9l8
$$ 177 356 197 230 -379 -18 264 136 31 -208 22 106 194 -152 -67 -69 -16 -260 -10 -191 45 -33 -82 -120
4026a20L14j1q1k00j54J41K83j84j5j26J83J21k86l3N7L36o8l33j0M10k57O3j68
$$ -120 194 183 102 -98 -252 -111 172 -12 -27 -153 30 151 -135 -168 -111 225 157 -176 -186 224 -33 30 -138
4049a38K72j84K24k53M9k9K66k73J93j80J13Nk48M46p5l17L09r2k60J76L3K3l41
$$ -138 134 -50 174 -79 -30 -59 207 -66 127 -53 60 65 -183 263 188 -129 180 88 -172 4 37 60 -281
4072b81N52k41J76j88J5J51j09N2K4p9o0k21K82k47K03Q7K5n4p7J72M9j34r0l5
$$ -281 271 30 206 18 33 184 75 127 151 72 12 -209 73 -174 29 116 141 87 10 182 231 97 7 -28
4096b8J88k11l5J28q4J65j88L1p0M0P2r1J25k2N8N9n04K52J50N2j71K39j07P4
$$ -28 160 -51 -86 42 -42 123 -65 -34 -104 -64 8 -83 42 20 78 137 -367 -115 35 87 -84 155 48 122
4120A22k89K06j76J59J21l03J34o9k8K10k35J06J68J18k03j14J25L0j5j81j05
$$ 122 -167 39 -137 22 143 -160 -26 -95 -123 87 -148 -42 126 244 41 -73 52 82 67 -114 -219
4141b19L13J8J11j18o5M2j43P6L9jp4K1p5K5k6k14L17m3l0J15l0q7J13J04r9j02
$$ -219 94 112 223 105 40 82 -61 15 54 53 -21 0 -75 -50 -76 -290 27 -16 -46 69 39 -48 65 169 70 -32
4167c2J03q1m6J98r4q2k5K89k28l0K3J31P2m1m17J41J90j08J8j00N4K80q5k74
$$ -32 71 -10 -56 142 48 -34 -59 230 2 -28 -5 126 198 157 -260 -119 71 -37 -19 -119 -65 215 130 -144
4191a44K10r3N8J85jj78j92K52j44lJ15K80k86j58J58j8O2j38J02%k47K28j39
$$ -144 66 -27 31 216 215 37 -155 97 -47 -50 65 345 59 -99 59 41 103 -35 67 67 -180 48 -91
4214i1k38M10J6m41L0L60J45j0k59r5J01N02m12k44K31J16l6K2j59K05j95L07
$$ -91 -329 81 97 -344 -314 46 191 181 -78 -173 -72 430 18 -226 5 121 85 107 -52 153 -42 265
4236B65l52J91J1j87j46R4J98J05p2k86Q3K67j64o2Q7k27J59K38k99L6j41K05
$$ 265 -87 104 115 -72 -218 -124 74 179 107 -179 -96 171 7 -55 32 -195 -36 202 -97 -61 -202 3
4258CjQ8j47K77K5j43k51J0L07k03j42J96Q7K33j98j90l2L94k95J47j20r0J92
$$ 3 2 90 -57 220 245 102 -149 -139 168 -35 -177 19 106 339 141 -49 -81 313 18 165 45 -45 147
4281A47P7o04L84L20j95l19m7M30o4M5j20l2j7m5J50m6l87K21L19k21j83K67l5
$$ 147 224 -380 4 324 129 -190 -237 193 129 174 54 22 5 -40 110 64 -323 -102 217 -4 -187 80 45
4304D5k86K50O0j25J65j01j68K78j16k1Q1J55k72J32q9o7J06l7m7k2P2J13p7j17
$$ 45 -241 9 69 -56 109 8 -160 118 2 -19 62 217 -55 77 -12 -79 27 -10 -57 -79 -7 106 29 -88
4328h8j15K9J22j1M4J9j31R9Lo4K6P5J8J70j14j56J46k06m9R5K37L1l73J77J7
$$ -88 -203 -174 -52 -63 -19 0 -131 -32 -29 -93 -67 8 26 196 82 -74 72 -134 -183 -88 149 180 -193 -16 1
4353AK29k53R4j55OJ62J4j48O1k3O9j8j77P3K70o7k70J26m2K87l26J09l5l2M7
$$ 1 230 -23 71 -84 -78 84 98 -50 11 -12 57 39 -138 -65 205 138 -132 -6 -48 239 -87 22 -13 -45 2
4378Bj91K30k77M35k2m44K51J23n4j37Q7Q1J4j8o7j37J20LK10k19k15J80j57J65
$$ 2 -189 41 -236 199 177 -267 -16 107 53 -84 3 84 98 80 13 -124 -4 -1 209 -10 -225 -45 -202 -37
4402c7rJ91j37lk4Q5R0l1j43m0j21J99Qk94M08r9p5N7r0j13L88j30j31k56M23
$$ -37 -46 145 8 5 -19 66 156 125 -18 -58 -179 20 28 -266 142 43 -32 25 -65 -178 210 80 -51 -307 116
4427A16m9q6Nj1O8J2j05L4J23j87K03j39M1K27k36j21q3K64l5J68l9l91M19l79
$$ 116 67 -19 -14 -25 43 55 -50 -16 107 -80 123 -16 25 252 16 -105 -188 76 41 209 170 -221 198 -181
4451a81L79l20RJ55q4J70m08N84n01O7J59J01k37J75o0Q7j33J10N7k37P0K16j06
$$ -181 198 -122 -113 42 -42 128 -280 304 -197 -130 29 130 -107 68 8 95 -38 72 129 -108 -38 178 72
4474G2p4J07j66J42k6P4l83K04P9K2j88o2J58J74j59j18L0K90k23k6m5O0Q7m6
$$ 72 -2 105 -61 81 55 129 -254 -50 29 51 -137 -199 -41 133 -26 -144 -114 176 -47 -73 -118 -58 29 -17
4498a7M4j98L63n3k42Q0Q0j59O7J66k37P2K67k54m3j16L3K74j15K03k20J32L5
$$ -17 27 -171 192 139 -103 -23 57 -102 -35 131 -106 -34 233 -21 -64 -180 -147 127 12 215 -5 127 162
4521A62k82R5P7K2K7l64K84Qj59J39j35J78J94l43q8J53J27j95J49j65J90n6j4
$$ 162 -120 -25 52 74 101 -263 21 29 -130 9 -126 52 246 -97 -185 -32 95 -100 49 -116 74 18 4
4544Dj14J0K68k45Q1k22pK30J90m92L21M4j30O0q9k5L06j93jj89K15k13J90j04
$$ 4 -110 -100 168 -77 4 -218 -225 5 195 -297 24 68 -62 -2 -91 -116 190 -3 -4 -193 22 -191 -1 -105
4568a05j54R8K17J8L3j92K21k21K39j0m49K24O4q6M86j95k35M7Rk39P2K55Pp2
$$ -105 -259 -161 56 74 107 -85 136 -85 154 144 -305 -81 -17 -103 383 188 -47 0 9 -230 -158 97 104 32
4592C2K62m44N1k2J20J46m8j05j04M19j73lk00P0j76L51k24l40N79j14N5j83k05
$$ 32 294 -150 -99 -121 -1 145 97 -8 -112 307 134 131 -69 1 -175 176 -48 -388 191 77 132 -51 -256
4615b56J53K14l18rM12o4p6M9k4o7r0K28k39R8K99j38J04l91K72J6j82n4N7m0
$$ -256 -103 111 -207 -216 196 132 56 105 81 14 -76 152 -87 11 310 172 276 -115 157 173 -9 -63 -6 -46
4639d6kj13K32n3Q5j57jK1O5j78K2K76k71J65K8k22N5R7L3J28l68K54j17O5j5
$$ -46 -48 -161 71 18 103 -54 -55 -34 31 -147 -125 151 -120 45 73 -149 -94 3 36 164 -204 50 -67 -2 -17
4664a7j41l8L10j39k6oK6K0J48k19j05L50j50m2J14J37n1m1l29r2L98j0j16L4
$$ -17 -158 -196 114 -25 -51 -57 -31 -11 137 -82 -187 163 13 -29 85 222 171 130 -199 -291 107 97 -19 15
4688A5k48L31q1K69l27Q3O9j29p7J36j53K35m9n3j03N0mn9K90k08J02j77p7n3
$$ 15 -233 98 17 286 -41 42 111 -18 -95 41 -112 123 74 21 -82 -32 -36 -95 195 -13 89 -88 -165 -218
4712b18J20K14j36o9J22n4j03J75j22M09k89K9p3p9O2j86J96j41J81J58q6L3k52
$$ -218 -98 116 -20 -89 33 -21 -124 51 -71 338 49 78 5 -74 -12 -198 -2 -143 38 196 110 143 -109
4735a09J12O5j05j23K02K79j51q4k46L39j25k0m8j39J16p8K04j78Q4p2n3k0J19
$$ -109 3 68 -37 -160 42 321 170 86 -160 179 54 34 -14 -153 -37 -115 89 -89 -5 -77 -130 -150 -31
4758c1K73k22j18r7O8J43J65k41N4p1J27k77J98J46m34L29l9j45L11J56k35N2
$$ -31 242 20 -98 -195 -127 16 181 -60 -6 -77 50 -227 -29 117 -317 12 -27 -172 139 295 60 112
4780A12l88N01o5l7k28K46L4j36j60jk7R7O6j8K41k74J84O2l37L30R9l44J55j09
$$ 112 -276 225 160 123 -105 141 175 39 -121 -122 -149 -52 14 -4 237 -37 147 209 -128 202 301 -43 112 3
4804CK10j64j37K03o9k55K74r3k29M27k64j5J13K02k0k10P0k09K60M6rl20J93
$$ 3 213 49 -88 115 46 -209 65 -28 -257 170 -94 -109 4 206 186 -24 46 -163 97 143 134 -186 7
4827GJ54m42L2J38K11R1M8m73J06M1K64k46m9J5K29p3j37J33K3oj83j7J5L00j25
$$ 7 161 -281 -249 -111 100 191 239 -234 -128 -87 177 -69 -118 -103 126 53 -84 49 72 66 -117 -134 -119 181 56
4852E6m22L96k87L22m3o3n7L66j70j65r6L08j90R4j84K15Q3j40o3J25RK2Oj09
$$ 56 -366 30 -257 65 22 -41 -98 268 98 -67 -163 145 -45 49 -135 80 163 23 -40 85 94 116 122 13
4876A3j86J90n1L01m96J52K77j75J14j92J3J98j49j02J17J92j63j04j5j60L42
$$ 13 -173 17 -34 267 -229 -77 200 25 139 -53 -40 158 9 -93 24 216 53 -51 -66 -226 116
4897A16n1j31L01k21r4M19k57k30J85mk99L58l5J54J2k66K4J00J2jl56K45O9L0
$$ 116 65 -66 235 14 -80 339 82 -148 37 33 -266 92 57 211 223 -43 -19 81 93 92 -264 -19 50 80
4921H0J01k76K77k24R1p0O8o4J39j91K01k77L03k30L1O6p2L10P3m57r2L84pk57
$$ 80 181 -95 182 -42 49 -21 47 -17 122 -69 132 -145 158 -72 -41 25 -47 263 336 -121 -213 171 164 -93
4945i3K48Jj37o7k6j17K28n0J20jq8M6K07k73K27k97J60j58N4j03K3L01m12J69
$$ -93 155 156 19 -48 -74 -191 37 -13 107 106 18 64 271 -2 225 -72 88 -70 -16 -119 -96 205 -207 -38
4969c8J59Ll16R3M0J73k3l39J68R1P5j48K8k02J11K11j73q0k6K49m4k19M61K4
$$ -38 121 124 -192 -99 -59 114 91 -248 -80 11 86 -62 -34 -236 -125 86 -87 -167 -193 56 12 -207 254 278
4993B78l18K05r5j18Q5J77J22m81q3J13K03r0p3J09K32j41m14K45J52j81M%K51
$$ 278 -40 165 70 -48 37 214 336 -145 -228 -115 88 -2 -75 34 266 125 -289 -44 108 -73 -69 -69 182
5016A82l18l9m2J50O3n0m5J28l68M06R9k09P5m6J55j30L3J28R8k73j74J34l7R1
$$ 182 -136 -175 -217 -67 -4 -54 -99 29 -339 67 166 -43 32 -14 141 11 44 172 270 -3 -177 -43 -80 11
5040A1J10j35ROJ20j37k18Q4K32j62K54l53L31P2k83j85M28j51o8P0o3k5K04j13
$$ 11 121 -14 -5 1 121 -16 -234 -150 82 -80 174 -179 152 224 -59 -244 184 33 -35 35 -28 -53 151 38
5064C8J19l19L83l38l1LJ95J10j64k00K25L00k72N1q4J17J2k33Q0J69l50L9K31
$$ 38 157 -162 221 -117 -148 -145 50 160 -4 -204 21 321 49 100 16 133 145 -88 -8 161 -189 -150 81
5087H1j35j19J36p2l3R6L7p3q1J89l1K3R0k97K83k00K92l80O3M4j94L50j14l8
$$ 81 -54 -173 -37 -109 -142 -46 -9 -82 -163 26 -5 18 108 -189 94 -106 186 -194 -131 -87 -281 69 -45 -83
5111h3k3L02Q0j23L4j44Q0j01J79l40R0j01K70l5j27R9N2l69J54L9j27L62j08
$$ -83 -106 196 276 153 187 43 123 22 201 -139 -49 -150 120 85 -42 57 109 -260 -106 -67 -194 168 60
5134F0r2j20L90m15k6L6L98k7j7k25K17m13L24Q3j37j1J91j91j09K73l30P6L6
$$ 60 -32 -152 238 -177 -203 -167 231 204 187 -38 179 -234 90 173 36 25 216 25 -84 189 -141 -65 -29
5157b9M5J72j83J4n5L3k5J98p6j41l1K66k99m2K5j67J02J53M1O9j71L9l4K27L4
$$ -29 16 188 5 19 -36 -3 -28 170 94 -47 -78 188 -111 -153 -128 -295 -193 -40 1 70 -101 -62 -96 131 165
5182A65l12R0J78j58K15m58K65J9p8J61o5j71P5J82k58j56L41j68M1nj29L81r6
$$ 165 -147 -57 121 -37 178 -280 -15 4 -74 87 22 -149 -74 108 -150 -306 35 -133 -92 -97 -226 155 59
5205E9M1k60P3K55P7j25P5k54P7K33l19k6J37P0O7q8j78j00J11P5j57N7r0M26
$$ 59 100 -160 -87 168 245 120 195 -59 18 251 -68 -94 43 113 180 92 -86 -186 -75 0 -157 -100 -190 236
5229B36k03k55J16J02J99j43j06kJ29j56k02J81P1j10J9M8r8K82r7p6j14K17l3
$$ 236 33 -222 -106 -4 195 52 -54 -56 73 -83 -285 -104 -33 -143 -124 -76 -174 108 11 -65 -179 38 5
5252EM3J54k73L50j80l28L39k0j47J0J37K9J15j65j75M7M7J05K0j75P1LL0L7K0
$$ 5 48 202 -71 279 99 -229 110 90 -57 -47 90 119 234 69 -106 -59 -12 93 113 -62 9 12 42 79 99
5277I9jl2k44K55p7K8RK01m14N9J23j15o7L5J61j12J47j37K23J48m83K14O1j87
$$ 99 98 66 -178 77 0 28 37 238 -176 -117 6 -109 -176 -141 20 -92 55 -82 141 289 -194 20 81 -106
5301a06K18j20K04m16K5J90p5k5R3k7K61r9k63J75J09j70r8J90P5lk36L1O0j85
$$ -106 112 -8 196 -220 -195 -5 -80 -105 -12 -39 222 123 -140 35 144 -26 -124 66 141 138 -98 -67 -7 -192
5325a92L25j13j00m2L07p6k41L53L3rl04P4L8j95J75j44L1K37Lk7k32J82o6qo9
$$ -192 133 20 -80 -122 185 109 -132 221 254 245 -59 15 53 -142 33 -111 -80 157 160 133 -99 83 17 9 -60
5350f0R5J1J1J8o7J17L9j25j22n0K54j19K15k99O1Q1j14L1rJ64L0n6j35p9K2J94
$$ -60 35 46 57 75 8 125 164 39 -83 -133 121 2 217 -82 -21 60 -54 -23 -32 132 162 106 -29 -108 -86 108
5376A08L8k91J15K45j51j74M44k73L2j13j46J45K2J3k48K59KJ60q1j4k37j1J76
$$ 108 146 -145 -30 215 64 -110 334 61 93 -20 -166 -21 1 14 -234 25 27 187 106 92 -145 -156 20
5399B0l1N8m0nn4o9r2L28J01o2m02K50k26R8J37o6J33r8J87j38j01K85k4j69j23
$$ 20 -11 47 7 2 -52 -121 -213 115 216 154 -248 2 -224 -126 11 -55 78 -20 167 29 -72 213 189 20 -103
5424a03N1O5k29J79R0M0j81J87j18j76L90k18J05j57J60j65J23l72K67K03O2l27
$$ -103 -52 13 -216 -37 53 93 -88 99 -19 -195 195 -23 82 -75 85 -80 43 -329 -62 141 203 -124
5446a24j21L05J92nk61j79L42Lk51K84l08J10J20k21j3K10j33R0j26J55J45j50
$$ -124 -245 60 252 247 -14 -193 149 152 -99 185 -123 -13 107 -114 -127 83 -50 40 -86 69 214 64
5468F4j87J53K1J77k45k64K51Q8O0j40Km4K57k66M1J21j09J47j79j04L7J41J75
$$ 64 -123 30 51 228 -17 -281 -30 58 118 -22 -20 -64 193 -73 -32 89 -20 127 -52 -156 -119 22 197
5491A97j18j46J5l1J04k10J22L2l5J73L6j79OJ24l01j63N97l21J79M2k99K87o8
$$ 197 79 -67 -52 -83 21 -189 -67 -35 -70 103 139 -40 -34 90 -211 -374 223 -98 81 123 -176 111 43
5514D3l3k81J40L58k14L7n4k7J84l28n3P0J50L0j77J35r1K73k78K15j55J23Q2
$$ 43 10 -271 -131 227 13 50 -4 -31 153 -175 -228 -158 -8 22 -155 -20 -111 162 -116 99 -56 67 149
5537A49j48r8k7K25r5j4j78L10j05p4J52j83J52p0N2j47J5O1o4n2j56O53m05K6
$$ 149 1 -97 -124 101 6 -8 -186 124 19 -55 97 -86 66 -4 48 -99 -84 -23 -87 -139 -295 358 -47 -21
5561b1k1K84j54k28l7l5M55l06K88k49l9J93q7j87J48N9O8j91j3o1R9P8o4j97
$$ -21 -42 242 88 -140 -177 -212 243 -63 225 -24 -63 130 43 -144 4 63 131 -60 -73 -134 -35 43 -21 -218
5585b18K20P2j2j09K32j13O8n4p7J13n9L4j97J16K9J92j55m25L07L2L12k53Rj83
$$ -218 2 74 62 -47 185 72 140 86 9 122 63 97 -100 16 45 237 82 -343 -36 -4 308 55 64 -119
5609a19K19j2l85K05J04k1p7K76j49JJ25lj93K0o7N9J01J68o1k80P5j35kL20k35
$$ -119 100 88 -297 -92 12 -9 -86 190 41 42 167 164 -29 -9 -76 -17 84 252 191 -89 -14 -149 -151 169 -66
5634f6J05K0k49L40k40%J46j02J15j95J39m6lP3n4j3Q5l6P2j57m0J51r4K27m05
$$ -66 39 59 -190 150 -90 -90 56 -46 69 -126 13 -33 -36 37 -17 -30 55 19 91 -66 -106 45 -49 178 -227
5659b27L14J87j14k95L9J57j16L6L4J19n4N7k45N9j83L09k45J56J00l28L72p3
$$ -227 87 274 160 -135 -96 61 -55 -19 15 134 80 137 -108 -49 -232 77 -168 -12 88 -240 132 59
5681E9k50J73K57j33p3k6n6Q4j1o5J78K7j51j19P2J74L8l09n5rJL11k52kJ33J51
$$ 59 -191 -18 239 106 33 7 -49 35 24 -41 137 164 13 -106 -34 140 178 -131 -186 -195 -194 117 -135 -137 -4 147
5707A47j48r0J08PQj24K55l04J22R9k09j71J51L12j95J0O4Q8j33l7J33q3K97l43
$$ 147 -1 -91 17 24 32 -92 163 -141 -19 80 -129 -300 -149 163 -32 -22 42 130 -3 -40 93 10 307 -36
5731c6m6p6K41k0lj45M7Q7j41k27J44J37m7j7J10l6M8Q4j55r6O8J62k16J27J29
$$ -36 -82 -158 83 63 60 -85 -38 49 -92 -319 -175 -38 -85 -102 8 -28 20 104 -51 -147 -79 83 -133 -6 123
5756A23Mo9k37J93M6J46k46o9K96Q3l93J39k56M21m9L2j03m4J51P0k26j13L08
$$ 123 127 58 -179 14 60 206 -40 -109 187 270 -123 16 -240 181 132 164 61 17 168 238 12 -101 207
5779B07o7Nk04P5J2n2K4l0k1J28l4J27J8k37J33J26l19n2K0J11j42J50J64j76
$$ 207 140 145 -59 16 28 -24 0 -30 -51 77 43 170 188 -49 84 210 -109 -161 -141 -30 -172 -22 142 -34
5803c4K19j38k49L76j14r7P1j78K56j37j9J39J67j83j80M4K09j26M3mN1k31J79
$$ -34 185 47 -202 174 60 -37 34 -144 112 -25 -44 95 262 79 -101 -57 152 26 69 65 116 -115 64
5826F4j74P8J97l33J88J23o26N40N6P8l29R7K79l84L9J15l42L83K67l69rlj01
$$ 64 -110 -32 165 -168 20 143 -483 57 113 191 -138 -41 238 -146 -107 8 -334 49 316 -53 -62 -65 -166
5849a66K47j59n6K42Q1k04l1k2R1J16k0k68J86nJ10r2J25j32Q8k37M5o6K91k45
$$ -166 81 -78 -134 108 189 -15 -46 -68 23 139 119 -149 37 32 142 50 175 43 131 -106 -61 -127 164 -81
5873h1K9l8J58M1rj88j12J37J51p7R6q7m0K08k03o8J9J05q7kK2P7n4J58j71J58
$$ -81 -52 -90 68 109 100 -88 -200 -63 88 11 107 20 -20 188 -15 -83 -64 41 -46 -48 -26 51 -3 155 -16 142
5899A42j30k21J22K16k21J13j91R7o3J55j15j38P2Q4r8P2K21nM8k24N2J63k31
$$ 142 12 -209 -87 129 -92 21 -170 -73 -136 19 -96 -234 -162 -78 -176 -104 117 112 160 -64 -12 151 -80
5922h0K59j12k2j80K19J15k43k31K18K54k26M0j08P4J27Mj60N0L3q6m6p1K82j02
$$ -80 179 67 45 -135 84 199 -44 -275 -57 197 -29 11 -97 -23 104 108 -52 -2 31 -55 -101 -172 110 8
5946Hq4J24l0o2K63j77k01J69K55j99l33K40O6r9J50k39L59r8q5R3j6j1M4k55
$$ 8 -76 48 18 -44 219 42 -159 10 265 66 -267 -27 39 -60 90 -149 210 112 27 120 104 93 137 -118
5970a18n3J18J41R9k22j51j62L32k9J1L0K0j40J79kj17q8K26M6j75K16k75J44
$$ -118 -171 -53 88 187 -35 -186 -348 -16 -45 -34 -4 16 -124 55 53 -64 -152 74 120 -55 161 -114 30
5993C0k60J29n7o3K83j2qJ05r9qQ7l1L5k78j17L12j46R3q1K50p3R2k68j04J65
$$ 30 -230 -101 -158 -221 62 50 42 147 48 40 127 96 131 -147 -264 48 -98 -5 -86 164 91 183 -85 -189 -24
6018b4K90q9j82J58l9P2n7J95n05P8J19j6J42k12O1N2m63J70K40R2R3j41j85K70
$$ -24 266 177 -5 153 114 186 129 324 -181 -103 16 0 142 -70 -9 43 -420 -250 -10 82 175 34 -151 119
6042A19N5k80O3j51K11o8j40N3K51r6o9q6J48M9o6N1k10K54k0M4j57r7M9J7P5
$$ 119 174 -106 -43 -194 17 -51 -191 -138 113 17 -52 -138 10 59 -7 44 -166 88 68 112 -45 -142 -93 -76 -1
6067aj2K83j43j15J21k34J98J02j65p7J49qp5K02k92J39pj11l8j04K38J25l84
$$ -1 -13 270 127 12 133 -101 97 199 34 -43 106 98 23 225 -67 72 65 -46 -84 -188 50 175 -209
6090b09K24OJ22r8j46N9J91j62j02J13j36K23r8j15M1J05M7R9m29J22L09j09l7
$$ -209 15 21 143 45 -101 -42 149 -13 -115 -2 -138 85 -13 -128 -87 18 65 164 -265 -143 166 57 20
6113B0P7j32L5nJ21l51K44K38k93Q2j51j26L03r4N6J51j52j01j14J03Q8J03r9
$$ 20 97 -35 0 -5 116 -235 9 247 -46 36 -115 -241 62 -32 24 175 23 -78 -192 -89 -1 102 3
6136Ck4j8J21k2k4j03J23M6J23k66J7m2j70K21j15K91j9Kj37k3Q9j8K9j58n8J2
$$ 3 -21 -39 82 60 36 -67 56 102 225 -41 -24 -66 -236 -15 -130 161 142 144 7 -16 73 55 84 -74 -132 -120
6162a20Q8j02L7K94j58M7j9K17l96L38j15k8j5M1j90k37Q4K8K15K54k90J54k42
$$ -120 -32 -134 -97 197 39 86 67 284 -112 226 111 83 68 109 -81 -318 -234 -206 9 263 -27 127 -115
6185a15J48pl2p1K90j22j28k7P3Pj41J52R9r9k02j85L28Q7m6p1j22L14j01%J18
$$ -115 33 26 -6 -77 213 91 -37 -64 9 16 -125 27 126 27 -175 -360 -32 55 9 -62 -184 130 29 29 147
6210A47k11j0j54K54M0k5l3J06j05J25l7j82K02j90J20J34K5n7o3L1Jn0l16J60
$$ 147 -64 -74 -228 26 66 41 8 114 9 134 97 -85 117 -73 47 181 206 149 86 117 118 68 -248 -88
6234h8J20jM1k44M6J21K66k58j47J77J11k0l29Q8L41k09p9n8L11k35NJ46k45j35
$$ -88 32 31 72 -172 -126 -5 261 3 -144 33 144 124 -205 -117 224 15 -64 -122 189 -46 -41 105 -140 -275
6258b75M54k21k71M57j00k8L4l72M71j09j34L2k56K27j4J49j89Q1O9K13m53J99
$$ -275 179 -42 -313 144 44 16 50 -322 149 40 -94 -62 -318 -91 -105 44 -145 -64 5 218 -235 -36
6280c6pP1R0m86L13K56o7q2q4J79j11l62L32q1J21KO7J03j37R1k90K27l13K2K49
$$ -36 -43 28 118 -368 -55 201 134 52 -32 147 36 -326 6 -75 46 48 115 218 81 172 -118 109 -204 -182 67
6305F7r2R9q2K04j97Ooq1K16j82J48j05K41j01m3j16J4K06l14N3m8L18r5j74J55
$$ 67 -25 74 -8 196 -1 5 -1 -82 134 -48 100 -5 236 135 92 -24 -10 196 -118 -65 -113 205 110 -64 91
6330I1j87p1J51NQ7l46K72m7N6j08k4K99O4j89l0J26l30K4K25N7k07J99j27k5
$$ 91 -96 -167 -16 -11 76 -270 2 -45 11 -97 -121 178 242 53 23 149 -181 -157 68 125 -82 117 -10 -35
6354c5J15P3O9j17oj05m4j60M4J54o1J25m7j29K85k09k37L51m0J22j44j48K70
$$ -35 80 153 222 105 99 -6 -50 -210 -166 -12 -73 52 5 -124 161 -48 -285 66 26 148 4 -144 126
6377A26j06J08J97n49J95J16Jk62J93q9J59j50j54J34K11j77j63K09RNP2l2L7
$$ 126 20 128 325 -224 -29 87 88 -174 19 -70 89 -61 -215 -81 130 -47 -210 -1 8 13 85 53 90
6400I0N3n7K4Qk14R8J19k8j27R6k69k7J02J08J3J02m4m42M38L2J2r2q8J6K09k84
$$ 90 143 86 110 118 -96 2 121 93 -34 62 -207 -234 -132 -24 -11 91 47 -395 43 75 87 -5 -93 -77 132 -152
6426a52J58J46j55Q9P5Lj61K27k23l10J84K21j68J01j68j68J85J03k7lJ25n9O0
$$ -152 6 152 -3 86 161 164 3 230 7 -303 -119 102 -66 35 -133 -301 -116 -13 -40 -43 82 23 83
6449H3l10J75J71P7l03K19r0n1J0P0O7j45L07k62Q4j65J10J3j20J33j35K33o4
$$ 83 -227 -52 119 196 -107 112 22 -29 -19 51 118 -27 280 18 102 -63 47 60 -60 73 -62 171 107
6472A07j13o6k4L12j81l5O5j25Q0J70k75M54k98r9J52j63J72M3l53K1L12l31K50
$$ 107 -6 -72 -96 216 35 0 65 -60 20 190 -85 369 71 -28 124 -39 133 176 -177 -156 156 -175 75
6495G5o0J29l70M33j06j18j73J71Q8L24m02l45L47J45o5j86R3O1k43O1KJ43L41
$$ 75 15 144 -226 207 101 -17 -190 -19 69 393 -9 -354 -7 138 73 -113 -20 41 -202 -141 -139 4 345
6518C45m35o5M39j89j34K22j49l3j08Q1p4M9K27l78K95j12L2N2k77kJ09J12J05
$$ 345 -90 -155 284 95 -39 183 34 1 -107 -26 -100 -51 176 -202 93 -19 13 65 -212 -214 -105 7 112
6541A12q0qj59J32J26j45L4K52k41l13L10P0J62k99N8k13J42Q2Mp8K08l27R2n9
$$ 112 32 24 -135 -3 123 -22 12 264 23 -290 20 90 252 -47 11 -202 -60 22 26 -52 156 -171 -79 -138
6565a38L31l15J92j73J15j60J48o7%J96r4J38k68j8L1K35j95M7J27j13Q7p0k62
$$ -138 193 -122 70 -103 12 -148 0 -67 -67 129 35 173 -95 -113 -82 153 -42 5 132 19 106 36 -226
6588b26L25k07J07L03l93O8o8O9j35J84j7j6j04J94j59N5Oj15J41o8j04N0o6K28
$$ -226 99 -108 -1 302 -91 -23 -91 -22 -157 27 10 -6 -110 84 -75 -20 -14 -129 12 -56 -160 -110 -176 52
6612E2J36k50Q0J5J9J07k31j05K11q4J4MJ99R5j53j84J15O6k23K0Oq7K0J80o5
$$ 52 188 -62 18 33 52 159 -72 -177 34 -50 -36 -32 167 262 109 -75 40 106 -117 -97 -91 -178 -158 22 -43
6637d3p4j18K55l1P6k90L28j91k3j2p3K28K75l48p1N6J4r0M20j81j25Q8l38J18
$$ -43 -117 -235 20 -11 65 -225 103 -88 -111 -123 -196 32 307 -41 -112 -56 -42 -132 288 107 -18 70 -268 -150
6661a50p5N05n7l79P5L08l99K93k49K59l7k22Q9o0P2n9R5O0k91n1M99l25R5N8
$$ -150 -225 280 223 -156 -81 227 -172 121 -128 131 94 -128 -39 -99 -27 -86 9 69 -222 -273 226 -99 -4 54
6685E4J28k40N4j40Q9j32K08m39N34j61N7k64J18L46l60J34J11l52J87N0j41J12
$$ 54 182 -58 -4 -144 -55 -187 21 -418 116 -45 12 -252 -134 212 -148 -14 97 -255 -68 -18 -159 -47
6707d7J65j72K34l82J08K49k12J74k68L15l67R9K74r0L3k8p4j69J75j7K20J56
$$ -47 118 -54 180 -202 -94 155 -57 117 -151 164 -203 -104 170 80 113 85 11 -158 17 0 220 376
6729C76l37l43K08O2J30k50K4o6J0L39k69j06K11P2P1k57K5K03N1q5j21J14m6
$$ 376 39 -304 -96 -34 96 -154 -130 -196 -186 153 -116 -222 -11 61 132 -125 -100 103 154 69 -52 62 16
6752A6J18j82pK19k38J77q2J04l79J66K01K3j05j37L07l19J59K2k43L20j0j88
$$ 16 134 -48 -55 164 -74 103 21 125 -254 -88 113 136 31 -106 201 -118 41 63 -180 140 130 -58
6774e8N2n6J05j92P1N0j06J92k7R6j21j59J95j74O7r6K29k66R6N0j1n8K00r0o6
$$ -58 -6 -62 43 -149 -78 -28 -134 58 31 127 6 -153 42 -132 -65 -161 68 -198 -102 -52 -63 -121 79 -11 -77
6799g7pJ38J78m08K90k93Rn8R7J03q0L10j22L9M8j34k14K09j16M5Q7j41J29j89
$$ -77 -84 54 232 -176 114 -179 -170 -228 -131 -28 -108 202 80 119 167 33 -181 28 -88 -43 44 -97 32 -157
6823a57P6O8j14o0m9J2L04J11k85M4j1j69J77j19L13j17J27l47lJ58L68p3m31
$$ -157 -81 -13 -127 -187 -236 -224 80 191 -94 -50 -61 -230 -53 -172 141 24 151 -196 -199 -41 327 254 -177
6846a77L90j35ML0O9j17l15L54j73n4K85j2j49L3J16k07j3K85Nj94N0j73K38j36
$$ -177 213 78 82 112 181 64 -251 103 -70 -124 161 149 0 33 149 -58 -71 214 219 25 75 -98 140 4
6870DJ46k81K28Q3P7L5j99k88J58k9rk9J27j24k19M30J3j67K10k24O5p3J9K14
$$ 4 150 -131 97 180 257 292 93 -195 -37 -66 -75 -104 23 -101 -320 110 123 -44 166 -58 7 -66 -47 167
6894A67k73J33j12J21j74J80J21k38n9J43L05l95P3N3R5o9j28j64J47k16K92O3
$$ 167 -106 27 -85 36 -138 42 163 -75 -134 9 314 -81 -8 45 140 71 -57 -221 -74 -290 2 65
6916F5k31J30O7q2J48j27m5k13J51L02j46j99L00k71J77k18R9M9nj00k5K7K94
$$ 65 -166 -36 31 -51 97 -30 -75 -288 -137 165 19 -180 120 -151 26 -192 -93 -44 -49 -149 -174 -147 147
6939A47J5j45j33K89k6j09k1l29L57%k93K56MP5j15K25m0j17Q1k67K21j36K85
$$ 147 162 17 -116 173 147 38 17 -312 45 45 -248 8 12 87 -28 197 157 40 121 -146 75 -61 224
6962B24j77m6KM4o7R5k27K9J58J21j14j08r6Q2L2J0J03k44K56j08P7n1r5K7L6
$$ 224 47 1 3 47 -20 75 -152 -123 35 156 42 -66 -162 -80 -48 -38 65 -179 77 -31 46 -5 -100 -73 -37
6987c7O7q5r4J29K14n2j82J70j59P2p9J65m04J92K76j53Q8O1k05L4M2o8R7k77
$$ -37 30 -55 -149 -20 194 142 -40 130 -29 43 -36 129 -275 -83 193 40 128 189 -16 18 60 -8 89 -188
7011a88K23l7J31k60K26j10Qj65K57k57L31j37l7J8Q4r3M0j35K21Pl14J86l6J02
$$ -188 35 -2 129 -131 95 -15 -7 -172 85 -172 159 22 -15 3 87 -6 34 -101 120 127 -187 -1 -37 65
7035F5l10L73m9Oj30k1K3p5N5J53j20K3J32q9O1ql56R9K93l50J89j11J54j27J11
$$ 65 -245 128 79 85 -45 -66 -43 -118 -63 90 -30 -7 125 36 97 89 -267 -168 125 -225 -36 -147 7 -120 -9
7060ij9J36K9l3j53j58J50NK1O1l0J77o4k07J22j02k01M07j01q4k31M10j52j39
$$ -9 -28 108 137 104 -49 -207 -57 -52 -31 30 0 177 113 -94 28 -74 -275 132 31 -53 -284 126 -26 -165
7084a65J90M4j45m4J65l2n0K35l49K07r5p6k4K15Q8o9j5j7o8j13L12k90n2j7r4
$$ -165 25 69 -76 -120 45 13 -37 198 -151 56 -39 -115 -139 76 164 95 80 63 -5 -118 194 -96 -148 -165 -259
7109b59L31j13M2j87r7K31Pm1K54k6j73j57L53j66R4j77q3M8J60k7L8J34j70K9
$$ -259 72 -41 1 -186 -283 -52 -45 -86 168 142 -31 -188 165 -1 93 -84 -167 -119 41 14 52 186 16 45
7133D5P4k75J06J39m6J07j38j12J10p1O7L0J25p2N2j87L0J4j43K15N6j09%J45
$$ 45 119 -156 -50 89 43 150 12 -100 10 -61 6 36 161 89 141 -46 -16 -2 -145 70 126 17 17 162
7157A62l06K14j14k6l8L02q5q1o7K40k38O1J24j52J08j64J54j55k02K56J61L2
$$ 162 -144 70 -44 -70 -108 194 109 28 -39 201 -37 24 148 -4 104 -60 94 -61 -263 -7 154 186
7179A86Nj58n5K48k57K3q4J59l6l2j06K10J7j15j81P5o2L59l05K00R6j14j05R3
$$ 186 191 33 -22 226 -31 -8 -92 67 31 -1 -107 103 120 5 -176 -101 -163 196 -109 91 187 73 -32 61
7203F1p0j53Jj6qK25J72k89J63n5j01J58k12J69J67l07J79o2j39K36J01k07j23
$$ 61 -9 -162 -161 -177 -185 40 212 -77 86 31 -70 88 -124 45 212 -95 84 22 -117 119 220 13 -110
7226a10J47r2l0K39j03J76j23l38M44j65k20K72q4j33J83n1j6J08Q3q3j10j18
$$ -110 37 -55 -85 154 51 227 104 -234 210 45 -175 97 13 -120 63 12 -4 104 187 104 -6 -124
7248a24K58K1K4Lk68J33J31q8j38n6Q9j01P2N9k74K39J95O3k18j26J39lJ21L2
$$ -124 134 155 179 182 -86 47 178 90 -48 -104 -15 -116 -44 15 -259 -20 175 238 20 -106 33 30 151 183
7272A83k70J97j16j42N0K39k85O7p8K01P2j34J22j38K97m38rN9m9J08m9K08l9
$$ 183 -87 110 -6 -148 -98 141 -144 -77 -155 46 118 -16 106 -32 265 -173 -182 -123 -172 -64 -113 95 56
7295E6J25Q7j41j71J36p0J9j77j5K33j71P5rl00J44R8K24k04K24J3k63j57L23
$$ 56 181 268 127 -44 92 22 41 -136 -151 82 -89 -14 -23 -323 -179 -81 143 -61 163 176 -87 -244 79
7318G9J06J8o1j36J92n6j18m8J30j33m2m1K24Mj50Q1LL3j7j13J51k04p1K51k45
$$ 79 185 203 142 6 198 142 24 -24 106 -27 -69 -110 114 118 -32 49 52 85 68 -45 106 -98 -169 82 -163
7343a63L5J18n4J49j11J46l50n2L80L4j60L2l1N2Jm0j98K13Q1j32n5q0J75N5J0
$$ -163 -128 -10 -64 85 -26 120 -230 -282 98 132 -28 4 -27 25 26 -14 -212 1 82 -50 -105 -185 -10 45 55
7368E5n7p0O7J84l72L30qp2j13J51RR5j78R6j10kP9j44Q5j19j2J58j28J3P8m6
$$ 55 -2 -72 -5 179 -193 137 129 57 -56 95 104 199 21 117 7 5 84 -60 25 -94 -106 52 -76 -63 15 -31
7394c1J33j84J44K10k64N5k77L04r2j37J75m8j04N1Q2j22K14l5j19J22j81J77
$$ -31 102 -82 62 272 8 63 -214 90 -2 -139 36 -12 -116 -65 17 -105 109 74 -45 77 -104 73
7416G3l58M35l1j78J1J6L3J8l1MM2%J0J5j03Q6j24K11k15R6o7J99q9J9j16l5L01
$$ 73 -285 150 119 -59 -48 -32 1 19 -12 -8 34 34 44 59 -44 42 -82 129 -86 10 -57 142 53 72 -44 -79 222
7443B22k96J33pK5j81J99n8k97L22j30J92P3j07j7k39K05j53J12n0N6K47m42J30
$$ 222 -74 59 52 77 -104 95 37 -260 62 -68 124 197 90 73 -166 39 -114 -2 -52 4 251 -191 -61
7466f1r5J36J46L5j09K20l13R5q6pQ2q7J08k42K75j87%M9O5q3J72k10l2L24j13
$$ -61 -156 -20 126 161 52 272 -41 54 -32 -39 43 -44 64 -178 97 -90 -90 -41 24 -59 113 -97 -129 195 82
7491H2M1k76J15ok8J74j69p3P7M2J97j83oJ00J9p5J31m03K47m7J10j95O2J52k63
$$ 82 123 -153 -38 -44 -72 102 -67 -140 -63 -21 176 -7 -13 87 106 31 162 -241 6 -41 69 -126 -64 88 -175
7516a75N9K79N2l46L01l27J23j09L18l23K42k46J63Q5j52O0k3J02K68l94n7q6
$$ -175 -116 163 215 -131 170 -157 -34 -143 175 -148 94 -152 11 96 -56 4 -19 83 351 -43 -100 -186
7538a86L74m8p7k00J22O8k03L96k93j85L34k22K77k48j34M79p9j41N5j73K30k39
$$ -186 188 140 63 -137 -15 53 -150 246 -47 -232 102 -120 157 -91 -225 254 175 34 89 -84 146 -93
7560i3K01k9J1J7o3k14K01K43l02q6K00j5J8l43K11l3J32N0j7k90K39J93k96j07
$$ -93 108 79 90 107 44 -170 31 274 -28 -114 86 71 89 -254 -43 -76 56 106 89 -201 38 231 -65 -172
7584a72N3O3j27J53j3N6J38r1j53J66l24J51K45k5k77J55j02k8K23j77L26j31
$$ -172 -119 -56 -183 -30 -43 13 151 60 -93 73 -251 -100 145 120 -157 -2 -104 -132 91 -86 240 109
7606A09k90K10j66K36p4J8j74Q6O2R7k83N5M7J59o6k14Q5N7M9r0O9J09j30J97
$$ 109 -181 29 -137 99 25 43 -131 -45 17 114 -169 -114 -67 92 26 -188 -103 -46 3 -87 -18 91 -39 158
7630A58k08M4M0Q1j66J40k01K11J43k73Lr3K01j26j8J59j87L20l96L1j15J62L9
$$ 158 -50 -6 34 115 -51 89 -112 99 242 -31 -28 -121 80 -46 -64 95 -92 228 -168 -137 -252 -90 -51
7653e1O6n3Q2j43j14K00J04k18K08Mk43L56j48n7j03R6J56n8k32J98ro0n9m9K41
$$ -51 15 -38 44 -99 -213 -13 91 -127 81 85 -158 198 50 -7 -110 -14 142 84 -148 50 41 -19 -78 -127 114
7678A14k1J80m06J20J30j80M07m97J29L64m69K20k29R1O6Mj90K74J51k7k82Mm1
$$ 114 93 273 -133 -13 117 -63 344 -153 -24 340 -129 91 -138 -47 19 23 -167 107 258 231 -51 -47 -88
7701h8m4o2O5M3J00K50j70j22P7L9j62j7J62j88Q0n9K38j92L50l74m9J62K31k43
$$ -88 -132 -194 -129 -86 14 264 94 -28 49 88 -74 -91 71 -117 -37 -96 142 -50 300 -74 -123 39 270 27
7725B7J12p3j4K30k48j24J1l9J48j53Q5j31j8K91j71M2J05rj28K09l9m4Qj78J6
$$ 27 139 66 52 282 34 -90 -79 -118 30 -123 -38 -169 -187 104 -67 -25 80 71 -57 152 113 69 77 -101 -85
7750h5J89o0L1K1j24k02J94J67q7m58M30n3MP9QJ8m8Q3j26k9K25k93N2K1p6L34
$$ -85 104 44 75 96 -28 -230 -36 131 44 -414 16 -37 -33 46 54 72 24 107 -19 -48 177 -116 -64 -43 -119 215
7776B15l62J00OJ04J35k07j83L05k97J65J05k31M20k17o6J73j50L2j58K58k11
$$ 215 -147 -47 -41 63 198 -9 -192 113 -184 -19 86 -145 275 58 -8 165 15 47 -111 147 -64
7797f4J18J7j6L2j25J74k19K10k05K8J55N4j95Q0lNjO8l77J80nJ32k43L47j62
$$ -64 54 71 55 87 -38 136 -83 127 -78 -50 105 159 -36 44 41 46 45 113 -264 -84 -89 43 -200 147 -15
7822a5j32O3Q0j56Q7J32J09m6p6k7j33K45j38L52k81k42J99O9m5k49J38P0J83
$$ -15 -147 -84 -4 -160 -73 59 168 122 46 19 -114 131 -7 345 64 -178 21 90 45 -204 -66 4 187
7845A87q8j72J40k0J33k12P9o7J35j68N6j25K24k93l3K33m2r6M53l48q8K23N0
$$ 187 99 -73 67 47 180 -32 47 -20 115 -53 3 -122 102 -191 -224 9 -33 -129 324 -24 -112 111 161
7868A61j63q3j3k1K57k85K00n2L7k4o9J62j5J01k20K92l12l2J32K9J08J10k20
$$ 161 -2 -85 -98 -119 138 -147 53 1 38 14 -55 107 92 193 -27 265 -47 -79 53 82 190 300 80
7891H0p0o9M7J5J03j35Q0j3N3j27M4j40K61j98Q5q7J08J33p1j95l3j2J89m3K3
$$ 80 10 -59 -12 3 106 -29 51 38 91 -36 8 -132 129 -69 16 -71 37 170 99 -96 -129 -141 48 5 28
7916B8K6J5j07M9j45M6j27J17j69J15J09K37k35P5j30J66j02pQ8rJ66k21J49k72
$$ 28 54 69 -38 11 -134 -88 -215 -98 -267 -152 -43 194 -41 34 -96 70 -32 -39 49 40 206 -15 134 -138
7940a38K26J04k4k35m8N17l33j86Q2P8J5J0r0m8J69j19q0K04n4J5j7j99P1q1J37
$$ -138 88 192 168 -67 -115 402 69 -117 -35 43 58 68 -22 -70 99 -20 -100 104 50 65 48 -151 -80 -161 -24
7965b4L3k76J95PJ3l28L88o2j4k5Q5J43L0k29N9j04K39j63l7J05k07J25q6K25
$$ -24 9 -267 -72 -65 -52 -380 8 -54 -68 -93 -8 135 165 -64 -5 -109 130 -33 -70 35 -172 -47 -133 92
7989I2j62J67j23j2l3J3l5L9J44k12K7P3P4p8O2qL0j48KO0p7P6j63L0K83j06J9
$$ 92 -70 97 -26 -38 -71 -58 -93 -54 90 -122 -95 -22 52 -26 36 28 58 -90 -88 -28 -105 -29 -192 -162 121 15 34
8016C4p4J52j40j23K07L8l27K09L8j54K01j17O5mk29P4J69P2l46K31L72k69p5
$$ 34 -40 112 -28 -151 56 94 -233 -24 14 -140 61 -56 9 5 -224 -150 19 91 -255 -24 348 79 4
8039Dk91L64j01R8o1kJ24N4k63mp8L23l66Q0MQ4J26j33j8j08J65m8J74j58j55
$$ 4 -287 77 -24 74 13 11 135 189 -74 -78 -156 167 -199 -119 -115 -31 95 -38 -56 -164 1 -47 127 -31 -186
8064a86M07k06J05j19M8j61M5j21J63j1Q4j19k33K76r6J24n9l6n7k6Q7m4K64k54
$$ -186 221 15 120 1 49 -112 -67 -188 -25 -36 48 -71 -304 -28 -124 0 -59 -95 -152 -178 -91 -135 129 -125
8088a25M9j7m2M6J62m8k29J51L31j30k35K59l54K59k27L8qK02q5l0l3Q4j39K74
$$ -125 -76 -93 -135 -89 73 25 -204 -53 278 148 -87 172 -182 77 -150 -112 -120 82 -3 -33 -66 18 -121 153
8112A53l8j21J52l95j0K49j00J84p8JR5k75J68j51K34j50L22k74M8O2m9l6j10
$$ 153 115 -6 146 -249 -259 -10 -110 74 -4 -3 92 -183 -15 -166 68 -82 240 -34 14 76 27 -9 -119
8135a19J27j35M60j90l3k71K37m1n5M6K8j1J77k55L0J19l8O2j42rl0N8J55J1q1
$$ -119 8 -127 333 143 110 -161 76 35 -20 26 54 43 220 -35 -5 114 76 138 -4 -13 -43 15 170 181 100
8160A00O0p3O6k22NK9J46O4j63K06k72Q2o8J88j7l14M34j63r8M9j05Q7P7jM8j06
$$ 100 160 87 153 -69 -64 -35 111 175 12 218 -54 28 -40 148 131 -183 251 88 -10 39 -66 21 98 97 145 39
8186C9j98J57j28M1J95
$$ 39 -159 -2 -130 -89 106
8191A06
$$ Imaginary data points
##PAGE= N=2
##DATA TABLE= (X++(I..I)), XYDATA
0@%%%%%%Qq%qJ6k4L2l2M0n6O8p6R6j20J44j69K01k40K80l28L80m41N09n82O64
$$ 0 0 0 0 0 0 0 8 0 0 -8 8 -16 16 -16 24 -32 36 -40 56 -64 80 -89 112 -128 152 -176 204 -237 272 -310 354
31C54p58Q63r75J098j238J392j557J738j940K161k401K662k947L259l599L970
$$ 354 -404 459 -516 582 -656 736 -821 917 -1023 1138 -1263 1399 -1548 1711 -1888 2082
47B082m377M826n317N856o452P114p852Q675r604J0663j1884J3302j4973J6984
$$ 2082 -2295 2531 -2786 3070 -3382 3732 -4120 4555 -5049 5614 -6270 7032 -7941 9043
61I043j9454K2570k6641L2211m0322N3243p7003J34463n17877n17078J404080
$$ 9043 -10411 12159 -14482 17729 -22593 30650 -46353 88110 -429767 -946845 457235
72D57235K16885r31158J24381R56621l87885q06987M82694O31828p92975o68150
$$ 457235 674120 -257038 -132657 823964 436079 -370908 111786 743614 -49361 -717511
82g17511P10255N08441p55391l48098O98013J84876o59993N768O72766K0047n16124
$$ -717511 -7256 501185 -254206 -602304 95709 280585 -379408 -373640 299126 319173 -196951
93a96951J11081M84982j63060n34949J31431N06132j38221m79204J88394M57279
$$ -196951 -85870 399112 236052 -298897 -167466 338666 200445 -278759 -90365 366914
103C66914k10324l92786K43698K47553m20421k66729M92617K41233n68478k30185
$$ 366914 156590 -236196 7502 255055 -165366 -432095 60522 301755 -266723 -496908
113d96908N64698J04421n65630J10964O78147j37771n29463L49458N02578m18168
$$ -496908 67790 172211 -393419 -282455 395692 257921 -271542 77916 580494 162326
123A62326m10297L85873J32740n49803n0693N75210q3448o31256J15028N54870
$$ 162326 -247971 137902 270642 -279161 -329854 245356 161908 -469348 -354320 200550
133B00550j61683l55955L58256L25432l40216j29272M22289M5144m61121q6029
$$ 200550 38867 -317088 41168 366600 26384 -102888 319401 364545 -96576 -182605
143a82605L15890o569k72886L3503K05738r6479j98108J09914J70524j15489j13607
$$ -182605 133285 126716 -146170 -112667 93071 -3408 -201516 -91602 78922 -36567 -150174
154a50174J88985J77614j56988k14626J09091K17097j22085k59638J15528K53318
$$ -150174 38811 216425 59437 -155189 -46098 170999 48914 -210724 -95196 158122
164A58122j17077j54281K06796O1035l41559n0047L90684L1536l86047J5486L59872
$$ 158122 41045 -113236 93560 154595 -186964 -237011 153673 185209 -200838 -185352 174520
175A74520r0562l34267J76249K99431k60865k27548L92979K45218l71054j59730
$$ 174520 83958 -250309 -74060 225371 -35494 -263042 129937 375155 4101 -155629
185a55629L25112J2396l44435L6127K88019j02999k54128J30250J95636j80173
$$ -155629 169483 181879 -162556 -126429 161590 58591 -195537 -65287 130349 -49824
195d9824j72020K04713J54997j78670o6512K30634Q1969j92762q7174J16262L9027
$$ -49824 -221844 -17131 137866 -40804 -107316 123318 205287 12525 -74649 41613 80640
206H0640j15199m2561J20206N0494j44093o9580J26642J3194j58489K6484J87680
$$ 80640 -34559 -77120 43086 93580 -50513 -120093 6549 19743 -138746 -112262 75418
217G5418l5912j60735J00725J86012j30248k08103J40987K02629j44622j30149
$$ 75418 39506 -121229 -20504 165508 35260 -172843 -31856 170773 26151 -103998
227a03998K13797Q0891k73141o0557K48566k2766k46731P0226K20670r2651j62872
$$ -103998 109799 190690 -82451 -143008 105558 82792 -163939 -93713 126957 34306 -128566
238a28566J33763J14395j89753r7808K30645J05589k06527m5257K10012o797k14556
$$ -128566 5197 119592 -70161 -167969 62676 168265 -38262 -83519 126493 119696 -94860
249i4860R827J56307l9936j11011O8611J02014o8311r9893N5255P2661q7464p2039
$$ -94860 -85033 71274 31338 -79673 -11062 90952 22641 -77252 -21997 50664 -36800 -108839
261a08839J21355R0317j12559o7381J09034L2843j31868l4093J46403N6556j28955
$$ -108839 12516 102833 -9726 -77107 31927 64770 -67098 -101191 45212 101768 -27187
272b7187l0935J47412K010j78679M731J52206n3986j22805J16234J15701j39019
$$ -27187 -58122 89290 91300 -87379 -82648 69558 15572 -107233 9001 124702 -14317
283a4317r8385J39795O1248j56163l1284J91049L5731j84902p163J68475n6176
$$ -14317 -112702 27093 88341 -67822 -99106 91943 127674 -57228 -64391 104084 47908
294D7908j84117O9226J51431q1912r2028J13652O6410j23458n3375J16646L5614
$$ 47908 -136209 -66983 84448 2536 -89492 24160 90570 -32888 -86263 30383 65997
305F5997j12099R89J46001n161j54635O276J20526n3870j23059O0753J15552m3721
$$ 65997 -46102 -45113 100888 95727 -58908 -52632 67894 14024 -109035 -48282 67270 23549
317B3549q4332M6655O8337o2272p1158P6989P3587p4975l1793J11188Q760j38530
$$ 23549 -60783 -14128 54209 -8063 -79221 -2232 71355 -3620 -35413 75775 84535 -53995
329e3995j1930J15824j7083j10994L8423J24471l4941j25853L4981J07153o7574
$$ -53995 -65925 49899 32816 -78178 -39755 84716 49775 -76078 -41097 66056 -1518
340a518j00078R6941R3931r4426m8115J02523J270j24030O886J17660j2868r7653
$$ -1518 -101596 -4655 89276 -5150 -53265 49258 50528 -73502 -66616 51044 38176 -59477
352e9477M5485J14934n7110j25442N6443J00600q0135p8679R9569O2822r5081
$$ -59477 -13992 100942 43832 -81610 -25167 75433 -4702 -83381 16188 79010 -16071
363a6071m3234P2496N708p7953Q071R4225O895p3518K4119Q2066n3429j01761
$$ -16071 -59305 13191 18899 -59054 -50983 43242 50137 -23381 738 82804 29375 -72386
375g2386N2575Q3042o5177o6687P3274N7656p5260o2841N9782N1989n5579k1239
$$ -72386 -19811 63231 -1946 -68633 4641 62297 -12963 -75804 -16022 35967 -19612 -40851
387d0851R1601K7631q9502n528P5343m6006r5240N1212Q4092n7562o9821O9109
$$ -40851 50750 78381 -11121 -16649 58694 12688 -82552 -31340 52752 -4810 -74631 -5522
399e522O5026q0489o6547Q9788O9160p6831k5058R9953M750j05034J206O9061
$$ -5522 59504 -20985 -87532 2256 71416 -5415 -30473 69480 74230 -30804 -29598 39463
411C9463m3529o7099N7375O7854n2317n4593N9473M4641p9259m3364R3197M3138
$$ 39463 -4066 -71165 -13790 54064 1747 -52846 6627 51268 -27991 -71355 21842 64980
423F4980q4079j9607P8996m975q3187Q06O4331k135m0986L1513O1844k9301o2295
$$ 64980 -19099 -38706 40290 35315 -47872 -47066 17265 15130 -25856 5657 67501 38200 -24095
436b4095L2423L9262o9302m0509Q2161K9386r2659k9246Q0490J4358p9348o536
$$ -24095 8328 47590 -21712 -62221 19940 49326 -43333 -72579 7911 22269 -57079 -63615
448f3615Q8552K2099n3165K4369O4838n0421p2806N2611M2183p7368k9987P8277
$$ -63615 24937 47036 -6129 18240 83078 32657 -40149 12462 54645 -22723 -52710 25567
460B5567J1448q1853r988O5722o978o3262K6338Q1545j5897o4262L3904N2319
$$ 25567 37015 -44838 -54826 10896 3918 -59344 -33006 48539 32642 -31620 2284 54603
472E4603n2522n1123M1396L0628k5081M255L2358j5128m4770R068M8366j0917
$$ 54603 2081 -49042 -7646 22982 -2099 2156 34514 19386 -25384 -16316 32050 21133
484B1133o2482R433O9993o793o4475J922L4918k0484k3084L7103L8197j8340j9493
$$ 21133 -41349 -31916 38077 31284 -33191 -31269 3649 -16835 -39919 -2816 35381 17041 -2452
497b452L1582J5426m9785j8795N2765R92o1609J3960N7206l4568n8789K9852L6416
$$ -2452 29130 44556 -5229 -24024 28741 29733 -31876 -17916 39290 4722 -54067 -24215 12201
510A2201l6550j7972N7788L5473m3273k8893L5591Q349m1829M920L4810k2502
$$ 12201 -24349 -42321 15467 50940 7667 -21226 14365 22714 -19115 -14195 20615 -1887
522a887k1612L9158R318n0920j3239L7601J0404k2297k418K8947J8875j9366k7600
$$ -1887 -23499 15659 24977 -25943 -39182 -1581 8823 -13474 -15892 13055 31930 12564 -15036
535a5036O04J2486R756R877n818j4413N559J3011k081j3314k2698r457K9734K4661
$$ -15036 -14432 -1946 7810 17687 11869 -2544 3015 16026 13945 631 -22067 -31524 -1790 22871
549B2871j7801j0837R147j3527q961K7591J3439k2702o026K7557J5748k1098k7921
$$ 22871 5070 -5767 3380 -10147 -19108 8483 21922 -780 -6806 20751 36499 15401 -12520
562a2520j714P202k310M926K141j7691N038L0285j4957m3870J0622L9204O703
$$ -12520 -14234 -7032 -9342 -4416 -2275 -19966 -14928 15357 400 -43470 -32848 6356 13059
575A3059l730l11j2035J914K1297j369k8212p253K5192J5539j2681p772N491j9382
$$ 13059 9329 9018 -3017 -1103 20194 18825 -9387 -16640 8552 24091 11410 3638 9129 -10253
589a0253k2915K1144J8393k1935P86K8622r096j8975K2760J0732k4100L668L2840
$$ -10253 -33168 -12024 6369 -15566 -14780 13842 4746 -14229 8531 19263 -4837 -1169 31671
602C1671j165k4714N999J8221k3856m1523P860L1684o780j3561J2600n115j6228
$$ 31671 30506 5792 11791 30012 6156 -35367 -27507 4177 -2603 -16164 -3564 -8679 -24907
615b4907K3128J8896k9956j4669L5205K3944j6329k1427n37R459l868j3446K588
$$ -24907 -1779 17117 -12839 -27508 7697 31641 15312 -6115 -6652 2807 -1061 -14507 -11919
628a1919J3460N388L247L91j1722j0591K445J0883O857j1280j3947J6508J8546
$$ -11919 1541 6929 10176 10567 -1155 -11746 -9301 1582 8439 -2841 -16788 -280 18266
641A8266k0266j3332J8725n026j8060L4800L7866l3174m1650K2832K9390k5989
$$ 18266 -2000 -15332 3393 -1633 -19693 15107 52973 19799 -21851 981 30371 4382
653D382k9701J8223J4164k1092O398L0655k5225l9712L7802L9525l9901k3074
$$ 4382 -25319 -7096 7068 -14024 -7626 23029 -2196 -41908 -4106 35419 -4482 -27556
665b7556M8745J7064m5361j7171K3935j793k4307J0981K7795j1366j9715K4283
$$ -27556 21189 38253 -7108 -24279 -344 -2137 -26444 -15463 12332 966 -18749 5534
677E534K0139k8520j4388K7694O085k0105O006J5897j3859k5119k398J7841O742
$$ 5534 25673 -2847 -17235 10459 16544 -3561 2445 18342 4483 -20636 -23034 -5193 1549
690A549j4970j30K8924Q173k2180k933J6550m568j4561N723J1120p645j0830J1008
$$ 1549 -13421 -13551 15373 23546 1366 -1567 14983 10415 -4146 1577 12697 5052 -5778 5230
704E230L749l0830j1139M3448J6442m0409l682M3098m210l9349O071K0708j7910
$$ 5230 8979 -21851 -32990 10458 26900 -13509 -17191 25907 21697 -17652 -11581 9127 -8783
717h783j3580K6103J3888k6162r952K8710K040l2089R430L7780j2756k8314K0822
$$ -8783 -22363 3740 17628 -8534 -18486 10224 12264 -19825 -10395 27385 14629 -13685 7137
730G137J5959l2310j8979K2015J0144j3722k383J5303P568q496l127O841m352
$$ 7137 23096 -9214 -28193 -6178 3966 -9756 -12139 3164 10732 2236 -891 5950 1598
743A598o619J5418J0697j7341j1550R711K909j2454j0903N587J8947L793j4531
$$ 1598 -5021 10397 21094 3753 -7797 1914 4823 -7631 -18534 -12947 6000 9793 -4738
756d738L769J6168j0281j5419J0518P009j0471J735J1729o048j5219K153J1800
$$ -4738 -969 15199 4918 -10501 17 7026 -3445 -1710 10019 3971 -11248 -9095 2705
769B705o430j3887J6437K2984j5468j8297J9408Q666k5834n609K0614J077j0288
$$ 2705 -3725 -17612 -1175 21809 6341 -11956 7452 16118 -9716 -15325 5289 6366 -3922
782c922N553N013q508n746O466L332q800O18J8736L269k1031l956J3278l729j1204
$$ -3922 1631 6644 -1864 -7610 -1144 2188 -6612 -5994 12742 16011 -5020 -8976 4302 573 -10631
797a0631M503P004K121K217l469l409L268j781n121M158M215M70L108k967j0356
$$ -10631 -6128 876 2997 5214 1745 -1664 1604 -177 -5298 -1140 3075 3545 6653 3686 -6670
812f670j121N191R12l078j506Q094J0616p813j2791Q089P571j1391j241J2345
$$ -6670 -7791 -2600 -1688 -4766 -6272 1822 12438 4625 -8166 -77 7494 -3897 -5138 7207
826G207N25m465K058m073p984R68O423M51m049J063R408j37j4486j093J1968k949
$$ 7207 7732 3267 5325 1252 -6732 -5764 659 1110 -2939 -1876 7532 7395 -7091 -8184 3784 835
842H35p990O470O717j095n61n196p795K872O450l17j149L29J672K838l779p569
$$ 835 -7155 -685 6032 4937 4376 -820 -8615 -5743 707 390 -759 -430 1242 4080 301 -7268
858g268K337M494j395P45L267J759J808n264r698M005J0133k629l593N185J271
$$ -7268 -4931 -437 -1832 -1087 2180 3939 5747 483 -9215 -5210 4923 2294 -1299 3886 5157
873E157j718j6n068l614N458L768j449j116P72K790j044r867k977J0019L018m473
$$ 5157 3439 3423 -1645 -5259 199 3967 2518 1402 2174 4964 3920 -5947 -8924 1095 4113 -360
889c60J894J811l457K44k626m766M025N944k486j673K636J358j189n483n197N564
$$ -360 1534 3345 -112 132 -2494 -7260 -3235 2709 223 -1450 1186 2544 1355 -4128 -9325 -3761
905c761P907r91k598r34j534J951K21p098J160R040M68m188K646J667l357k289
$$ -3761 4146 3155 557 -377 -1911 40 261 -6837 -5677 3363 3831 -357 2289 3956 599 -1690
921a690j692J210O090J903k147r85j963L56K257n562l563Q944N134p145l024K906
$$ -1690 -3382 -2172 3918 5821 3674 2689 726 1082 3339 -2223 -5786 3158 8292 1147 -1877 1029
937A029l55k972l716p76P104M260k658j239n08k787K161K359n466J99P874M22
$$ 1029 674 -2298 -6014 -6790 314 4574 1916 677 169 -2618 -457 1902 -3564 -3365 4509 4931
953D931o316k737J136J754k577m468N738Q965l362n928M262k04m786K271K773
$$ 4931 -1385 -4122 -2986 -1232 -3809 -8277 -2539 6426 3064 -2864 1398 1194 -3592 -1321 1452
968A452j984J891L974j737m367k038M047K943o221k031J2193L360j2704l432O285
$$ 1452 -532 1359 5333 3596 -771 -2809 1238 4181 -2040 -4071 8122 11482 -1222 -4654 1631
983A631k020m118J613J798L34K294J301j954m441o56P929K495q991J237J1255
$$ 1631 -389 -4507 -2894 -1096 -762 1532 2833 879 -3562 -4218 3711 6206 -2785 -1548 9707
998I707l988j2028Q48M546k809k200L046L619o7k955J483K915m935j144Q487k63
$$ 9707 5719 -6309 -5461 -915 -3724 -5924 -2878 741 674 -2281 -798 2117 -2818 -3962 4525 4262
1014D262o835N627N061j0005o580P264N887m805n031N438Q744l626r268J958L359
$$ 4262 -2573 3054 8115 -1890 -8470 -1206 4681 -124 -5155 283 9027 5401 -3867 -1909 1450
1029A450m265K164O276o355m805Q706L276j0500m705Q480P881l854o340M921N070
$$ 1450 -2815 -651 5625 -730 -5535 3171 6447 -4053 -8758 -278 7603 3749 -2591 2330 7400
1044G400q171m798O501j675p194N635P112n494m362M340J108l209M38O312J973
$$ 7400 -771 -5569 932 -743 -7937 -2302 4810 -684 -5046 -706 402 -2807 -2369 3943 5916
1059E916o953j307R919j213j5160l83J2191r18o211L158L022k447k65K296j505
$$ 5916 -1037 -2344 7575 6362 -8798 -9181 3010 2092 -4119 -961 2061 -386 -651 1645 140
1074A40l361K408Q867n80j2110N00J1571m519j1729M545Q497l071k318L452k43
$$ 140 -3221 -813 8054 7474 -4636 -4136 7435 2916 -8813 -4268 4229 1158 -1160 2292 2049
1089B049m953j267M659J961n592O65Q305k270q082M178N544p967l288J0198L004
$$ 2049 -2904 -4171 488 2449 -3143 -2478 5827 3557 -4525 -347 5197 -2770 -6058 4140 7144
1104G144p469k941N100K163p000m971N546M638l710P43L301n671j972R634R66
$$ 7144 -325 -3266 1834 3997 -3003 -7974 -2428 2210 -1500 -757 2544 -3127 -5099 4535 5501
1119E501r947o4J1185L516q095o147L880L082n354j371N752k138m862O058K932
$$ 5501 -4446 -4510 6675 10191 2096 -4051 -171 2911 -2443 -3814 1938 -200 -5062 996 3928
1134C928q494k019P794J022m259J744N430j159o295J054O373l713p846N923Q743
$$ 3928 -4566 -6585 1209 2231 -2028 -284 5146 3987 -2308 -1254 5119 1406 -6440 -517 8226
1149H226n788o598L473N99l358J777J935l217q80N227M452n506p144N041Q558
$$ 8226 2438 -4160 -687 -88 -3446 -1669 266 -2951 -3831 1396 5848 342 -6802 -1761 6797
1164F797m700n728O209L616n287j982J562j960j857K353J927j617k618K559L865
$$ 6797 2097 -3631 2578 6194 907 -1075 487 -1473 -3330 -977 950 -667 -3285 -726 3139
1179C139m479m814N768M915n387l01O475j046o815K14M119P1l851m34M505J80
$$ 3139 -1340 -6154 -386 4529 -858 -1159 5316 4270 -2545 -2331 1788 1859 -1992 -2426 2079 2259
1195B259m171J681J244n671L82Q810j373p965L458P573l448p233J184N493R85
$$ 2259 -1912 -231 1013 -4658 -4276 4534 3161 -4804 -1346 6227 2779 -4454 -3270 2223 3208
1210C208l928R15K927k924k372M170j658o682L869O602l613l977L395K343l163
$$ 3208 -720 195 3122 198 -2174 1996 338 -6344 -2475 4127 514 -3463 -68 2275 -888
1225h88k334L227L798j851l396M010K166n144k571K813p48j800K824O03l161J62
$$ -888 -3222 5 3803 1952 -1444 2566 4732 -412 -2983 -170 -918 -2718 106 709 -2452 -2290
1241b290K489L63k434j707M713N336m190m434M510K101n331j410K578j34r22J258
$$ -2290 199 562 -1872 -3579 1134 6470 2280 -2154 2356 4457 -874 -2284 294 160 -762 496
1257D96P5k011j728K007K471l293k216O340K640o549o50N624j813m566K473L533
$$ 496 571 -1440 -3168 -1161 1310 -1983 -4199 2141 4781 -1768 -2418 3206 1393 -3173 -700 2833
1273B833r62j364N75P85j532j674J298M68l399J563M605l224n027L356L271l016
$$ 2833 1871 507 1082 1867 335 -1339 -41 427 -2972 -1409 3196 -28 -5055 -1699 1572 -1444
1289a444j191K855K193Q98j401j227R14j38j573K84J08j784J679P61l259j537
$$ -1444 -2635 220 2413 3311 1910 683 1597 1459 -114 170 278 -1506 173 934 -2325 -3862
1305c862K129P26j34l84R43L423K05m554J34L819j545k563K173R47j673J044L86
$$ -3862 -1733 -1007 -1141 -1525 -582 2841 3046 -1508 -1374 2445 900 -1663 510 1457 -216 828 1214
1322A214k514n24J486J442q95j505K144K318l953l444M157J633l263K33K994n04
$$ 1214 -1300 -1824 -338 1104 209 -1296 848 3166 -787 -4231 -74 1559 -1704 -1471 1523 1019
1338A019k53Q99j234j416J518Q71N6j467m14J677m99l844J28L281p71j179J402
$$ 1019 766 1665 431 -985 533 1404 1460 -7 -421 1256 757 -3087 -2959 322 -449 -1628 -226
1355b26M70L72M35j705j191K292L88j638P67O06q43J63p44j412J630J655K30q05
$$ -226 244 616 1051 -654 -1845 447 835 -803 -36 570 -273 -110 -854 -2266 -636 1019 1249 444
1373D44p27R31J674k076k688K245J943k579K22J732j243q87J280p41p37J751J256
$$ 444 -283 648 2322 246 -2442 -197 1746 -833 -611 1121 -122 -1009 271 -470 -1207 544 1800
1390A800p85r06P4J829r85l172Q49K803j020j049J221k84j184R47o35j499J537
$$ 1800 1015 109 183 2012 1027 -2145 -1296 1507 487 -562 659 375 -809 138 -497 -1996 -459
1407d59J805j179j024L1M12O49j490n02J787J107m96j51j9n56O73n16j964J917
$$ -459 1346 167 -857 -826 -414 235 -1255 -1757 30 1137 641 490 471 -85 588 72 -1892 25
1425B5J897j532j207R77l74j23P27r94k83K118N56j197o06k12P98J41j727O39
$$ 25 1922 390 -817 160 -214 -337 390 -604 -887 1231 1787 590 -16 -228 570 711 -1016 -377
1443c77K291r14j378O84k14r06J180m6j798J583J804j554j615L71L78O0j045M29
$$ -377 1914 1000 -378 306 92 -814 366 320 -1478 105 1909 355 -1260 -889 -511 -451 -1496 -1067
1461a067J513jr23m2L42r76J118R58j883L66K849j081k236J054R04j050O1L4O58
$$ -1067 446 445 -478 -520 -178 -1154 -36 922 -961 -595 2254 1173 -1063 -9 895 -155 -94 -60 598
1480E98O69n63q13l91o49Q78J079j667p00K561O19k090k8R73j21N35L34q13R78
$$ 598 1267 704 -109 -500 -1149 -271 808 -859 -1559 1002 1621 -469 -497 476 355 890 1224 411 1389
1499A389nj381m61j82k93J9N88p83K18J001q75k57QK93J086P30j550Q53J860j892
$$ 1389 1384 3 -458 -640 -933 -914 -326 -1109 -891 110 -765 -1022 -1014 -721 365 1095 -455 398 2258 366
1519C66j710J666N81j251M64M67l11j83L69l28j249l31J518J286k512p94L145
$$ 366 -1344 322 903 -348 116 583 272 89 458 130 -1119 -1450 68 1354 -1158 -1952 1193
1536A193K25l011O03K641q39m65J374L7j089k91P03o30j467j71J726m80k193R90
$$ 1193 1418 -1593 -990 1651 812 347 1721 1758 669 378 1081 451 -1016 -1187 539 59 -2134 -1144
1554a144J586j663j424K448J185j102O4R56J84n97o22k20M96l14o3J203j139j367
$$ -1144 442 -1221 -2645 -197 988 -114 -50 906 1090 493 -129 -349 147 -167 -230 973 -166 -1533
1572a533J326R84j371r41J602J463q26j723P04J172j075j366J842P83j483O58
$$ -1533 -207 777 -594 -1535 67 1530 704 -1019 -315 857 -218 -1584 258 1041 -442 216
1588B16J809j480j626J645J199j844r92J672P28j998j159K202J98k546L11L022
$$ 216 2025 545 -1081 564 1763 -81 -1073 599 1327 -671 -1830 372 570 -1976 -1665 1357
1604A357l64j970J468J165k023j52J553n14j565M77J732r07k065M2K545m26k035
$$ 1357 993 -977 491 1656 -367 -519 1034 520 -1045 -568 1164 257 -1808 -1766 779 353 -1682
1621a682J340J608r63m85Q55k11r61J89N29n6p21j59R97Q4j398l7K046m61j689
$$ -1682 -342 1266 303 -182 673 462 -499 -310 219 163 -558 -717 280 364 -1034 -1071 975 514 -1175
1640a175J659J182j409j190P49Q76j127j033J442J491j786k96J906o16j959J355
$$ -1175 484 1666 257 -933 -184 692 -435 -1468 -26 1465 -321 -617 1289 673 -1286 69
1656F9J583k288j001K098O08k088j183K072Q37j402k01K061j52j440J253R51j964
$$ 69 1652 -636 -1637 461 1069 -1019 -2202 -130 707 -695 -896 1165 1013 -427 826 1777 -187
1673a87p62K153j51j802k78J427o04j059K30J317j72r08Q22J310q63j067Q18K46
$$ -187 -949 1204 1053 -749 -1027 400 -204 -1263 -1033 284 112 -796 26 1336 473 -594 224 470
1691D70n44J36L16j09l95L47Jj20o10j12J444k44j783O95J210p01j005L74O87
$$ 470 -74 62 378 269 -126 221 222 102 -508 -620 824 580 -1203 -508 702 1 -1004 -630 57
1710E7k52j74P33L39n54j67J258n15j526O87J639j225j539J396M38j701q3J043
$$ 57 -195 -369 364 703 149 -18 1240 725 -801 -114 1525 300 -1239 157 595 -1106 -1189 -146
1728a46L06p55J89J305l56q55M40P54j022l78J522j69j596K25R95l16p76N27K34
$$ -146 160 -595 -406 899 543 -312 128 882 -140 -518 1004 835 -761 -536 459 143 -633 -106 128
1747A28J69j78l18L88J17n01M4M17n42K95L83k14n05J75L50k6k2l05N41q5n03
$$ 128 297 119 -199 189 306 -195 -151 266 -276 19 402 188 -317 -142 208 182 160 -145 396 311 -192
1768a92j70P51k98q19N81M81k09l42O82j24k95N5N14m92k45J1R99j000q32Q83
$$ -192 -362 389 91 -728 -147 334 125 -217 465 341 46 101 615 123 -122 -111 888 -112 -944 -61
1788f1M13j015K8Q19O3n09O68jm18P7N62l68j58k48N32J49j103K11M73k53o54
$$ -61 352 -663 -635 184 247 -262 406 405 -13 64 626 258 100 -148 384 533 -570 -359 114 -139 -793
1809g93Q84Q3k33K54k97k61M43K07k70j50M48K98l68k2j97J42l8k03J01k56K58
$$ -793 91 174 -59 195 -102 -363 80 287 17 -133 315 613 245 223 26 168 130 -73 28 -228 30
1830C0L61n38l28L19L06l91k73P88lk35J38J95j04K4K14m26Q4R1J63n01o97P35
$$ 30 391 -147 -475 -156 150 -241 -514 274 271 36 174 369 265 289 503 77 161 252 415 -86 -783 -48
1852d8J12l69k60Q52l88l2L44M4o65L46M90k95l34N05Q7m03o4j36K28r0oJ85J27
$$ -48 64 -305 -565 287 -101 -133 211 255 -410 -64 426 131 -203 302 389 -14 -78 -214 14 -76 -82 103 230
1875B30n52M68R2o38K07O89o38k28L63K93k66j47P3J75M29j65n25K51q5N1j67
$$ 230 -322 146 238 -400 -193 496 -142 -370 -7 286 20 -127 -54 121 550 385 -140 111 26 77 -90
1896i0j86J46L70o2m14K11j24J50j30L22m25L41J69l92m31O01j76l27J2K29L84
$$ -90 -276 -130 240 178 -236 -25 -149 1 -129 193 -232 109 278 -114 -545 56 -120 -447 -435 -206 178
1917A78q6k91L81r5M5J01j92l01K65M79q06k94M16K45l96r6K09M35O9l52K06M0
$$ 178 92 -199 182 87 132 233 41 -260 5 484 -322 -616 -200 45 -351 -447 -238 197 266 -86 120 160
1939A60j53K22Lk58l2M53j75n26K56L28k62J25l28P8L41K3m35o9K55N1l02j57
$$ 160 7 229 232 -26 -58 395 220 -306 -50 278 16 141 -187 -109 232 255 -180 -249 6 57 -245 -402
1961d02M28r7J12k68L17K22j25K35j4n38N00J92q06k37K65K35m51J04K66p2Q2
$$ -402 26 -71 41 -227 90 312 187 422 408 -130 370 562 -244 -481 -216 19 -432 -328 -62 -134 -52
1982e2NK5p4K26J47mo28P05K94p60k84J15M70j33j19p9M08L7l94j03q8J62J42
$$ -52 -47 -22 -96 130 277 273 -355 350 644 -116 -400 -285 185 52 -67 -146 262 299 -95 -198 -286 -124 18
2005A8K2l00l86R00m3n97K4O21K59m88J30o0O9K81n07m44M49Mr1k18J46K96J08
$$ 18 40 -260 -646 254 211 -386 -362 259 518 30 160 100 169 450 -57 -501 -52 -48 -139 -357 -211 85 193
2028A93k74p4k5M86L1J1n29K98N13q46j98N96o9j42k01J35k2K83O0k64q1K16K70
$$ 193 -81 -155 -180 306 337 348 -181 117 630 -216 -414 182 113 -29 -230 -95 -117 166 226 -38 -119 97 367
2051C67l00k34p5R14m62q08N04M24l74j98K15j47J30M12j15m45l7O10l37j00k2
$$ 367 67 -167 -242 672 210 -598 -94 330 -44 -242 -27 -174 -44 368 253 -192 -229 381 44 -56 -78
2072g8K87J98n00l96M24L85o6m47K56J05j29m3j37j50K57j7K48m65L07%J33m86
$$ -78 209 407 -93 -489 -65 320 254 -193 63 168 39 -4 -141 -291 -34 -51 197 -268 39 39 172 -314
2094c14L08L94N9n21L3L5J97k47l02K76K22j34m65N13l92N19J31l09m35N52O26
$$ -314 -6 388 447 -74 -41 -6 191 -56 -358 -82 140 6 -459 54 -338 181 312 3 -432 120 746
2115G46n23n22K84N06k54o45L12K07j80R2p0k67j93O69R0p25J08P13Nn46m60O55
$$ 746 223 -299 -15 491 237 -408 -96 111 -69 23 -47 -314 -507 162 252 -473 -365 348 353 -193 -653 2
2137BN09q38R0L20k2J68k78O1l1r2L13m26k8K87K51m84p6p0O53K11p69l3M36J68
$$ 2 511 -327 -237 83 61 229 -49 12 -19 -111 202 -224 -252 35 286 -198 -274 -344 309 520 -249 -282 154 322
2161C22m86J6K79r3M9j45L4kk0M57l44o66L15P48k43r05O20O95q72j67L37J39
$$ 322 -164 -148 131 38 87 -58 -24 -26 -46 411 67 -599 -284 464 221 -684 -64 631 -241 -408 -71 68
2183F8L7R9m09J14J08L24k33l68k68Q44K34j108j35J020O4l27k71M23Mq4j08k55
$$ 68 105 204 -205 -91 17 341 108 -260 -528 316 550 -558 -693 327 391 64 -207 216 220 136 28 -227
2205b27O7PK15k93k67N81L56m78m73M43M46l51N3m40M74O23o01o93N81K81m16
$$ -227 -160 -153 62 -231 -498 83 439 -39 -512 -69 377 26 79 -361 113 736 135 -558 23 304 -112
2226a12k7K14m68L32L56l52o83O33M22l42l78K35Q21l49q09K42P04kn49J84R5
$$ -112 -139 75 -393 -61 295 -57 -740 -107 315 -27 -405 -170 651 302 -507 -265 439 437 -112 72 167
2247A67j20J03J90q70j06Q03O4n62l97Q74L20p42n21Q35K71k18k8M9q5K12J29
$$ 167 47 150 340 -530 -636 167 231 -331 -728 146 466 -276 -797 38 309 91 63 112 27 239 368
2268C68m89l9J09L05m53r0j27N08j7o25K34O20P8l42k3K01K64j81m10k17M82n1
$$ 368 -121 -160 -51 254 -199 -289 -416 92 75 -550 -316 304 382 40 17 218 482 301 -109 -326 156 105
2290A05k18K22k13j85N70l53m29M19P20m12n19J19L37L51o10r7L68j01o1K83j31
$$ 105 -113 109 -104 -289 281 -72 -501 -82 638 226 -293 -174 163 514 -96 -193 175 74 13 296 165
2311A65l73K69K01n62j33P16J61n59l84O40K34l19k93M10j3j78J95j60j08l3L85
$$ 165 -208 61 262 -300 -433 283 444 -115 -499 141 375 56 -237 173 160 -18 177 17 -91 -124 261
2332B61l40m04L20M04l94l82J81K93L41m06j19K83K02k20P3P8J11L0j73l28j7
$$ 261 -79 -483 -163 241 -153 -535 -354 -61 280 -126 -245 38 240 20 93 171 282 312 139 -189 -206
2353b06M46j85j83k34j91N47K28o74p3R80n0m52j44L73K99j22n42L12L9j18j09
$$ -206 240 55 -128 -362 -553 -6 222 -452 -525 455 405 -47 -191 182 481 359 -183 129 168 50 -59
2374e9J3o95N50M73j88n94M84N39o90k29P44l44L80k93k14K54j04J45j22m87J49
$$ -59 -46 -741 -191 282 94 -500 -16 523 -167 -396 348 4 384 91 -123 131 27 172 50 -437 -288
2395b88R17m53q48L66N32k84k17K29j34N10m4o73J40M54J39m65lN00j47j36k54
$$ -288 629 176 -672 -306 226 -58 -275 -46 -180 330 286 -387 -247 207 346 -119 -122 378 231 95 -159
2416a59J64P8O2j96m49K9M80M91o36j89L59M16l24j69L63j21m3J2l00K15o6r8
$$ -159 5 83 145 -51 -500 -471 9 500 -136 -325 34 450 126 -43 320 199 156 168 -132 83 17 -81
2438h1j37j17L6M69O7p26L70N44l17n19N29k1J92J56o08q9K46K88k46o31N90J39
$$ -81 -218 -335 -299 170 237 -489 -119 425 108 -411 118 97 289 445 -163 -252 -6 282 36 -595 -5 134
2460A34L36q59k0Q86j16n53o5L04N6R0j47l38M88K14m95k95K28K85j31J49n54
$$ 134 470 -389 -409 477 361 -192 -257 47 103 193 46 -292 196 410 -85 -380 -152 133 2 151 -403
2481d03R6L28P9l27n2J88L02j74o98L80J097q99k2M14j12p0J50l79l40O07K00
$$ -403 -307 21 100 -227 -279 -91 211 37 -661 -281 816 -83 -105 309 197 127 277 -102 -442 165 365
2502C65m72k62L45M60j72o68J66N61N7n79K16PL1L39k91m76K69M17m30j13k20
$$ 365 -107 -369 -24 436 264 -404 -238 323 380 -199 17 24 55 394 103 -373 -104 313 -117 -230 -450
2523d50L39K35j04n68M65K96O1m75J10J25J22K02n82L5M87o0n13J07j24K59J15
$$ -450 -111 124 20 -548 -83 213 274 -201 -91 34 156 358 -224 -189 298 238 -275 -168 -292 -33 82
2544H2k36m84Q25M22p05j07K37R6J63j69j40J13J43k69j67J05J06K01Q2q41Q7
$$ 82 -154 -638 187 609 -96 -203 34 130 293 124 -16 97 240 -29 -196 -91 15 216 298 -543 -456
2565d56R90l11q33N27L78j88q2l76K60L77m41K64O7L9k17N87o15n25R33j89p18
$$ -456 534 223 -610 -83 295 107 25 -351 -91 286 -155 109 176 215 -2 585 -30 -555 378 189 -529
2586e29J21N90j27j7l39K00K87K0j37K61q0j30O2n6l11J27N48l79m53M9J36K01
$$ -529 -408 182 55 38 -301 -101 186 206 69 330 250 120 182 126 -185 -58 490 111 -342 -293 -157 44
2608D4j22o50P73P48q24j26N94rm86K29k08j80M09R2j51j25p7J88J31n11j37P23
$$ 44 -78 -728 45 793 -31 -157 437 428 -58 171 -37 -217 192 284 133 8 -69 119 250 -261 -398 325
2630C25Q7r16J75P12k49l40K15j66j35N14k15K7P8j1M33n42n17O23M72p90m98
$$ 325 412 -504 -329 383 134 -206 9 -157 -292 222 7 34 112 101 534 -8 -525 98 570 -220 -718
2651g18O19L90n47p8N54njJ0j56P5l5R5K56p40l40R97l26n39J45J41K67p0k62
$$ -718 -99 291 -256 -334 220 215 214 224 68 143 108 203 459 -281 -621 376 50 -489 -344 -203 64 -6 -268
2674b68L5P85l20m58N01j70l63L65J60p76L76M49k10m44M3P01n9n45j90M58L84
$$ -268 -233 552 232 -226 275 105 -258 107 267 -509 -133 316 106 -338 -295 406 347 -198 -388 70 454
2695D54p33k25P40m40p0N42l99K16J69M02l75n30J57M06j76n85P1P56l13o70L00
$$ 454 -279 -504 236 -204 -274 268 -131 85 254 656 281 -249 -92 314 138 -447 -376 380 67 -603 -303
2716c03N29k49q9L63o5r5J94j44l31J09K27P6o60k02N30M19m32m89O94j24J27
$$ -303 226 -23 -112 251 186 91 285 141 -190 -81 146 222 -438 -640 -110 309 -123 -612 82 -42 85
2737H5k73L66rr0j2k7Q6j20J77J00j89l52M83K94q28j63Q02k44j93k05M28N2j49
$$ 85 -188 178 169 79 67 40 126 6 183 283 94 -258 225 519 -309 -472 330 86 -107 -312 116 168 19
2760A9j78K71j46k39N18j59m32K98O65n03o68O04L48l10m17M8M37k03j29q0M16
$$ 19 -159 112 -34 -273 245 86 -346 -48 617 114 -554 50 398 88 -329 -281 156 -47 -176 -256 160
2781A60k78K2P5j89p1J89K74m11j38N48lj48j40J60M07m50m91N17K14l11k32N67
$$ 160 -118 -96 -21 -210 -281 -92 182 -229 -367 181 178 30 -110 50 457 7 -484 33 247 -64 -296 271
2803B71k68M5J93k07l45L99K17k8l12l18M44L89n77k76O77n5l67J29K06k90J5
$$ 271 3 48 241 34 -311 88 305 277 -35 -353 91 480 -97 -373 304 249 -118 11 217 -73 -58
2824e8n2j0Qj11J58K09m36J65N73K5o27J66K31J92k08l24K29l55J37k12N4J04
$$ -58 -110 -120 -112 -223 -65 144 -292 -127 446 471 -156 10 241 433 225 -99 130 -225 -88 -300 -246 -142
2846a42M7J58N4m58L05O13n59k26M30J72j32j34r3O2N4k54N3K29l4k6j86J58n54
$$ -142 -95 63 117 -341 -36 577 18 -208 222 394 262 128 35 97 151 -103 -50 179 145 119 -67 91 -463
2869d63O55Jn70K01M60j25n7k23M1K93K3k17K6P9m2j73K57k31M5J70l70j57M83
$$ -463 192 193 -377 -176 284 159 102 -121 -80 213 236 19 45 124 82 -91 166 -65 -20 150 -220 -377 106
2892A06N5k19n4l8K24K82j48l78N03j21m31L38p9k63J59M59o76J3J78m0L75k97
$$ 106 161 -58 -112 -150 74 356 208 -170 333 212 -219 119 40 -223 -64 395 -281 -268 -90 -130 245 -52
2914e2l7L97j43l10Q8L11m12q5NK92J37j48k25R3J27lK02k83k52K78N08q21j35
$$ -52 -89 308 165 -145 -57 254 -158 -243 -238 54 191 43 -182 -89 38 35 237 -46 -298 -20 488 -333 -468
2937d68O39j30p6p7P9J50m5o7n8J82Pj97K10k79j60K82K24n73J61N15m03O9m0
$$ -468 171 41 -35 -112 -33 117 72 5 -53 129 136 -61 149 -130 -290 -8 216 -357 -196 319 -84 -15 -55
2960e5NJ77j63k95K31M35k95q8R9j71K81N5k00j80K14M2j47P0p7J21j48j34j8
$$ -55 -50 127 -36 -331 -100 335 40 -48 51 -120 161 216 16 -164 50 92 -55 15 -62 59 -89 -223 -241
2983b41K95J99l50J55j5o2J66k9l35K36J95j08M3r3k7J3J07o02K07M24j66%N8
$$ -241 54 253 -97 58 43 -19 147 118 -217 19 214 106 149 56 29 42 149 -453 -246 178 12 12 70
3006G0R5o3L94n70L7P5m1k57J36k17K24L51k54k46K45K31l75L09m9J4O1l17k83
$$ 70 165 102 496 -74 -37 38 -3 -260 -124 -341 -117 234 -20 -266 -21 210 -165 144 95 109 170 -147 -430
3029d30N28m6j72J91J24n21O38l03j91J17M02m04P1m9m8K18j63k11J25K07nj96
$$ -430 98 52 -120 71 195 -326 312 9 -182 -65 337 -67 4 -45 -93 125 -38 -249 -124 83 78 -118
3051a18J05m2LM90n67j05L99P7k41k93K67K6K2l62J20L33r0J00J1l42j15M77M9
$$ -118 -13 -55 -52 438 -129 -234 165 242 1 -292 -25 1 23 -339 -219 114 24 124 135 -207 -322 155 204
3074B04j75r4J72O2k06q0J32J55j50j85K87N7k94P8MJ3J27n4r5K3K17j66r7j4
$$ 204 29 -65 107 169 -37 -117 15 170 20 -165 122 179 -115 -37 -33 -20 107 53 -42 -19 198 32 -65 -79
3098g9J66O8k38l0k36L67J36j98k05M01m0P4j74k4J19o9R3q0k8j34K89M8k67J11
$$ -79 87 155 -83 -113 -349 18 154 -44 -249 152 112 186 12 -12 107 38 131 51 23 -111 178 226 -41 70
3122G0M84n36k51J80K63J06k81j80P4J85k57J53l6j07J68J94k98l27N35J6k17
$$ 70 554 18 -233 -53 210 316 35 -145 -71 114 -143 10 -26 -133 35 229 -69 -396 139 155 -62
3143f2kJ2J89k86M7j01J52m4J13L77m10K2Q7Rj86J64K3J78l82kJ9J50j14k83L09
$$ -62 -64 -52 137 -149 -102 -203 -51 -95 18 395 -15 7 94 103 -83 81 104 282 -100 -102 -83 67 -47 -330 -21
3168b1m4jJ25J41L8j46K23k09j56M8O7q7j94K42J56j40j76j12L77L3l02N0L05
$$ -21 -65 -66 59 200 238 92 315 106 -50 -2 65 -22 -216 26 182 42 -134 -246 131 164 -138 -88 217
3191B17l86Q1K56l59J14K55p3j07j93L9M93n6m04R0K48k42r6J66J05r5J71j02
$$ 217 -169 -88 168 -191 -77 178 105 -2 -195 -156 337 281 -123 -33 215 -27 -123 43 148 53 224 122
3213A22Q4m68K57r5K40l76J91L95m62j34M99L8m61L19l46M05j17j06j1J00J3k33
$$ 122 206 -262 -5 -100 140 -236 -45 350 -112 -246 253 291 -170 149 -197 208 91 -15 -26 74 87 -146
3235a46L04Pk40J59J78o14L32r0M4j48P4L28J0k84l0K82j1q4k7k3k70L4M51O2
$$ -146 158 165 -75 84 262 -352 -20 -110 -66 -214 -140 188 198 -86 -116 166 155 71 44 21 -249 -215 236 298
3259B98n90L38j40R8j88K13K25j92j40J24M61m96k35K29O7j33K24n4k36j88L10
$$ 298 -292 46 -94 4 -184 29 254 62 -78 46 507 11 -224 5 72 -61 163 109 -127 -315 -5
3280eJ24l34k7M26M2n2l22l4K97J50l52M0M6p3Q5j21r9J34OR9J40m09M77R9m25
$$ -5 119 -215 -242 184 226 174 -148 -182 115 265 -87 -47 -1 -74 11 -110 -209 -75 -69 30 170 -239 238 337 -88
3305h8m7J63K22m42K84J03k56J15l36L98J1p2o8K12k96L3L53r6l15J06J15Rj15
$$ -88 -135 28 250 -192 92 195 -61 54 -282 116 127 55 -13 199 -97 -64 289 193 -122 -16 99 108 -7
3328gq7m4k1O1O3O1p9J17l21K18k8k01K70L19m69K0K60k52R3k68K75K06k42N3
$$ -7 -94 -138 -159 -98 -35 26 -53 64 -257 -39 -67 -268 2 321 -148 -128 132 -120 -27 -295 -20 186 -56 -3
3352cP6j35K8J75k0j70L5k7k11L27J5o1k7P9j50K39M2m4j43R1J54m37L08m04M53
$$ -3 73 -62 -34 141 121 -49 -14 -41 -252 75 90 29 2 81 -69 170 212 168 25 116 270 -167 141 -263 190
3377A90N0l67L6O3J19K5k39o9L5M73m09lL29k68r0J51L1j42N2Np9p7J50K11k33
$$ 190 240 -127 -91 -28 91 116 -123 -192 -157 316 -93 -96 233 -35 -125 26 57 -85 -33 -28 -107 -184 -34 177 -56
3402e6l7K65j19J41j71N8L4r6n9L4J58M5n9k23N1k7L7O6J24j78J51p7k8j5m6J71
$$ -56 -93 172 53 194 23 81 115 19 -40 -6 152 197 138 -85 -34 -61 -24 42 166 -12 139 62 34 19 -27 144
3428A44j38k61K29pR3j31q1Q5r0K81k28J41j02r8Q9J22N3K8j5l00J10J62L2k49
$$ 144 6 -255 -26 -33 60 -71 -152 -67 -157 124 -104 37 -65 -163 -74 48 101 129 114 -186 -76 86 118 -131
3452a31J32n8J51J35j23q0n5j07J54J24j17J23n5o5Po5k8L51l73Q6K42o4k30J65
$$ -131 1 -57 94 229 106 26 -29 -136 18 142 25 148 93 28 35 -30 -58 293 -80 6 248 184 -46 119
3476A19j87R4J54N4m08J63n9K49j17k80J14K88J0j46L4J23j47r5j02J23r6K08
$$ 119 -68 26 180 234 -174 -11 -70 179 62 -218 -104 184 194 48 82 205 58 -37 -139 -16 -112 96
3498I6j45q4k4J62R7N0p9k2K08j69l45L86l9j05J92k55l3P9K05j36m6J64k1j2
$$ 96 -49 -133 -157 5 102 152 73 51 259 90 -255 131 92 -13 179 -76 -109 -30 175 39 -7 157 136 124
3522A24l05K89j16N0j62J70k39L32j68j72L01j8j45qJ7J05j33O3j92R1L22j37
$$ 124 -181 108 -8 42 -120 50 -189 143 -25 -197 104 86 -59 -67 -50 55 -78 -15 -207 -116 206 69
3544F9K7j76K77o3m9j57J92J56j90Qm9l9L31l88l3K5N0q9K08l87J22J11nR0r4
$$ 69 96 -80 197 134 85 -72 120 276 86 94 45 6 337 -51 -84 -59 -9 -98 110 -277 -155 -44 -49 41 -53
3569e3J50J9l2k94J50J87j25j81J18M5M1n3L3k33K18K79k98j19l7m7J68RJ14P
$$ -53 97 116 84 -210 -60 127 2 -179 -61 -16 25 -28 5 -228 -10 269 -29 -148 -185 -232 -64 -55 59 66
3593F6k21j6P8J76L1j62J23r9O2p3p2J75P3k7L2m3j49J31k7j0j45j51K77O4j73
$$ 66 -155 -171 -93 83 114 -48 75 -24 38 -35 -107 68 141 114 146 103 -46 85 58 48 -97 -248 29 93 -80
3618h0l95N81J16j65J15k39J31j48J76r4j13J34J4P7j94P0J95k35N8j65M27j59
$$ -80 -475 106 222 57 172 -67 64 -84 92 -2 -115 19 33 110 -84 -14 181 -54 4 -161 266 107
3640A07K55n82m1J87P0nRJ66Knj91P7KJ12k59k2K8L23j76j20l03M65j67J66o0
$$ 107 362 -220 -261 -74 -4 -9 0 166 168 163 -28 49 51 163 -96 -118 -90 233 57 -63 -366 99 -68 98 38
3665C8k00J82J2O7k25J07K62l38L5j34L40oO8j55m1J72j25n2j51K73p6j08j65
$$ 38 -162 20 32 99 -126 -19 243 -95 -60 -194 146 140 208 53 12 184 59 7 -144 129 53 -55 -220
3688b20K30J88j64k34M17l17N8J26j34j15J63Q8p4O4k38L98k5j72j19J08R6k6
$$ -220 10 198 34 -200 217 -100 -42 84 -50 -165 -2 86 12 76 -162 236 211 39 -80 28 124 98
3710I8o7j6jJ69j87P8k00R9N0J18o7j14L14k72P2Rm9R4j89j97K16J48j34q2j32
$$ 98 31 15 14 183 -4 74 -126 -27 23 141 74 -40 274 2 74 83 34 128 -61 -258 -42 106 -28 -110 -242
3735b42M53k24l6n7Q9J69o5k13l7M5L40o1l37P8M21k21j95J82M7m6p0j53MJ61
$$ -242 211 -13 -49 -106 -17 152 87 -126 -163 -118 222 161 -176 -98 323 102 -93 89 136 90 20 -133 -129 32
3759C2J22j63nj42P8k3N3O0O8k15p7K4M01r2k8J58j20l06K53j3k54R2L25o6j5
$$ 32 154 -9 -14 -156 -78 -101 -48 12 80 -135 -212 -188 213 121 93 251 131 -175 78 65 -189 -97 228 162 147
3784A47m61J51L21n1j54L4j95L92n1j82J22l2p0J1KJ90J50k69J50r2r7N3J43n26
$$ 147 -314 -163 158 107 -47 -13 -208 184 133 -49 73 41 -29 -18 -16 174 324 55 205 113 16 69 212 -314
3808c14L54J12j38J7j77J85K32l88M9L3j06K89j59p2j10L21j31m0r7R2M0O1q1
$$ -314 40 152 14 31 -146 39 271 -117 -68 -35 -141 148 -11 -83 -193 128 -3 -43 -140 -48 -8 53 -28
3831b8r2K23j65M6j4p7J17Q6k93l5L30n2q8M0l1J89J58m33o5K90j85L00m32R5
$$ -28 -120 103 -62 -16 -30 -107 10 96 -197 -232 98 46 -42 -2 -33 156 314 -119 -184 106 -79 221 -211 -116
3855a16J83J0k4l58J08L10J75m47K57k13L55l39M2m6L66j97K7j07J05J97m76J41
$$ -116 67 77 53 -305 -197 113 288 -159 98 -115 240 -99 -57 -103 263 66 93 -14 91 288 -188 -47
3877d7j6J19pj03J3J53k8j1k52P3K12Qr5J9j26K10J31l99R6K68k59J93j82R1J0
$$ -47 -63 56 49 -54 -41 112 84 73 -179 -106 106 114 19 38 -88 122 253 -146 -50 218 -41 152 -30 61 71
3902G1J5k36q2J75K70rl59m5J3M29l61O0n1K13m8k53K46j3N1j30l1lK22j97L3
$$ 71 86 -150 -232 -57 213 204 -155 -200 -187 242 -119 -59 -110 103 55 -198 48 35 86 -44 -75 -78 144 -53 -20
3927b0j9R7q7Q7N2k5P4k32J45m2q0J3K33j20j47J78k4l05J49M1K09Oj95J97j67
$$ -20 -39 58 -29 58 110 85 159 -73 72 30 -50 -37 196 76 -71 107 83 -222 -73 -32 177 183 -12 185 18
3952A8J28J06l70P3K25k13j33K7k78M31M7j35r3MK00J09j25J24R2N6m33J66P0
$$ 18 146 252 -118 -45 180 -33 -166 -139 -417 14 61 -74 -167 -163 37 146 21 145 237 293 -140 26 96
3975I6j77O5k52R1M27k11l3k2n1K44N5k47k39K26J21M8k67J67J66k17R4o0j87
$$ 96 -81 -16 -268 -177 250 39 6 -16 -67 177 232 -15 -254 -28 93 141 -126 41 207 -10 84 24 -163
3998a63K04p5q7o9J63J24k4r7J57k25K00j11k08J15K95k39L2j07p2M86k37k26
$$ -163 41 -34 -121 -190 -27 97 73 -24 133 -92 108 -3 -211 -96 199 -40 -8 -115 -187 299 62 -164
4020a64J08P2k0J23j91j8J41j0r0N1J28L5j55l29K54K75k49N9j90K12n1o3R3J59
$$ -164 -56 16 -4 119 -72 -90 51 41 -49 2 130 165 10 -319 -65 210 -39 20 -170 42 -9 -72 21 180
4044A80k04P5Pj64k6K42l57J3K67J24m5k06J57k41K52K0k40L36l04O3j6m2N5K01
$$ 180 -24 51 58 -106 -132 110 -247 -234 33 157 112 -94 63 -178 74 94 -146 190 -114 -51 -67 -109 -54 147
4068A47J3j40j15L67k43j9J59k58L49n34K52k07L19K19n32K07J7K55j34J42k28
$$ 147 160 20 -95 272 29 10 169 -89 260 -274 -22 -229 90 309 -223 -16 1 256 122 264 36
4089C6j03J36r5RL8Q3nl62J84L3r8Jp9J79J20l9p0j4j47J28J59j83j9J95Q2K38
$$ 36 -67 69 -26 -17 21 104 99 -263 -79 -46 -144 -143 -222 -43 77 38 -32 -46 -193 -65 94 -89 -108 87 169 407
4115D07l84k47L16kk80N3N9J31M7l4l13K49K12K8l20p0N9J60k3j53J29j68L38
$$ 407 23 -224 92 90 -190 -137 -78 53 100 66 -247 2 214 242 -78 -148 -89 71 48 -105 24 -144 194
4138A94k62K7L8k5R1j43M9M4J07l07K68l8PJ08M3k22K18k28j28R7j27LK86m24
$$ 194 -68 -41 -3 -28 63 -80 -31 13 120 -187 81 43 50 158 201 -21 197 -31 -159 -62 -189 -186 100 -324
4162c24K85K40J05l73n8J64q3m6L05j89l1K10J03k56j18J15j6Q2j48J54R0n5k05
$$ -324 -39 201 306 -67 -125 39 -44 -90 215 26 -5 205 308 52 -66 49 33 115 -33 121 211 156 -49
4185d9j59K77P0j80j74j00N39k67J62j63J10Q0j66k63k8O17k10J35l75J47l0K3
$$ -49 -208 69 139 -41 -215 -315 224 -43 119 -44 66 146 -20 -283 -311 306 96 231 -144 3 -27 -4
4207dL6l16J35L02j26q7j05j6M31j67j43Q2J88l8j77m3K77p7j26p4M9N5J07k49
$$ -4 32 -284 -149 153 27 -60 -165 -181 250 83 -60 22 210 172 -5 -48 229 152 26 -48 1 56 163 -86
4231h6J28r0Q7K67l03l28L16Q3qq4K7J50J21m32K31k9q7j44M10k58k1R6J3j79
$$ -86 42 -48 39 306 3 -325 -9 74 66 -18 9 159 280 -152 79 50 -37 -181 229 -29 -50 46 59 -120
4255a20K15J35J4l38n6K09L7P5l06R5K56j49l0n5O7K59m28j04K73M0J03j86O8
$$ -120 95 230 244 -94 -150 59 96 171 -135 -40 216 67 37 -18 49 308 -120 -224 49 89 192 6 74
4278G4J13m91L45k31l5O6K46l51K32O9k07J13j11K05l6j40K11j44L8K56J1k3k05
$$ 74 187 -304 41 -190 -225 -159 87 -264 -32 37 -170 -57 -168 37 1 -139 72 -72 -34 222 233 210 5
4301EL3P3k3j26J33J12q3k70J43j46K04p6k5N1P8m3K15k83m4J34J97l17J08j66
$$ 5 38 111 88 -38 95 207 124 -146 -3 -149 55 -21 -46 5 83 40 255 -28 -72 62 259 -58 50 -116
4325a16K93k36J6J85k41J80p6J6k20J09J99j11m1J80o0k76K91k69L28n5j70l1
$$ -116 177 -59 -43 142 -99 81 5 21 -199 -90 109 -2 -43 137 77 -199 92 -177 151 96 -74 -105
4347a05J54J75l60mK3J88o5J4j16j96M35Nm6q5j12J52K87p16K83M23j65k97K73
$$ -105 49 224 -136 -140 -117 71 6 20 -96 -292 143 148 102 17 -95 57 344 -372 -89 334 169 -128 145
4370A45o4l7R2j07J39J08m13R2O4j69J54k4OL0j26J28J66j25J75l71J77lk33J51
$$ 145 81 44 136 29 168 276 -137 -45 19 -150 4 -20 -14 16 -110 18 184 59 234 -137 40 37 -196 -45
4394d5j03J2L90n12K44j43L85m51M77k79J08k25O6K56q0J43k33q0K10K57n22K
$$ -45 -148 -136 254 -258 -14 -157 228 -223 254 -25 83 -142 -76 180 100 243 10 -70 140 397 -125 -123
4416a23J39j26K01mk57J07K12j36l27K92P4n2j40pL97j87j6K3o1J82k08n8J13
$$ -123 16 -110 91 87 -170 -63 149 13 -314 -22 52 0 -140 -147 250 63 47 70 9 191 -17 -75 38
4439C8J5Nj59R4ORO6J15l72K11L81j76l03J08L5K9k16J01j61K02K29k84O2k9M7
$$ 38 53 58 -101 -7 -1 8 74 189 -183 28 409 233 -70 38 73 102 -114 -13 -174 28 257 -27 35 6 53
4464E3J89j75j03J0N6R3m18L10J72j38k00K34QJ08J1k38K7J8m3j80J4O6K66k92
$$ 53 242 67 -36 -26 30 123 -295 15 187 49 -151 83 91 199 210 -28 -1 17 -26 -206 -192 -126 140 -152
4488a52M7P8O1j96p3J12L32p6n3N0k10%J72lk42k8K72o2m6j15J94M8p2O3pN7J16
$$ -152 -105 -27 34 -162 -235 -123 209 133 80 130 -80 -80 92 89 -153 -181 91 29 -17 -132 62 110 38 101 94 151 267
4515B67l65m0L30j46J13j18j03J87l5j16n7J62j17J2l5m2J33K13j60m04J46L37
$$ 267 -98 -138 192 46 159 41 -62 125 90 -26 -83 79 -38 -26 -61 -103 30 243 83 -321 -175 162
4537A62j05%j76J71j22R5N4k58L03J21k13p0J56N3l1l49O0R3O9k8l8l9L49j83
$$ 162 57 57 -119 52 -70 25 79 -179 124 245 32 -38 118 171 140 -209 -149 -56 13 -15 -53 -92 257 74
4561G4k88L15jJ9j89J12Pj44K22l11J66m7K5J63m2j75J23l7m9J35L1j8Q6l56K04
$$ 74 -214 101 100 119 -70 42 49 -95 127 -184 -18 -65 -40 123 81 -94 29 -8 -57 78 109 91 177 -179 25
4586B5j09K7J03N9j04L2J28NN8m08Q2J98k27j28J93K66k2j97j92J92o7J63k50
$$ 25 -84 -57 46 105 1 33 161 166 224 -184 -102 96 -131 -259 -66 200 178 -19 -211 -19 -86 77 -173
4609a73K17M6K6k47J06j32K12k32N7N4N9j10K4N4j7Q5r6O2k28L24j26j18Q9l6
$$ -173 44 90 116 -131 -25 -157 55 -177 -120 -66 -7 -117 -93 -39 -56 29 -67 -5 -233 91 -35 -153 -64 -100
4633a00K37j5l63j79N95j19L5R3k35J10NR9j78m5K03K36n07J91n3R8o5k27J77
$$ -100 137 122 -241 -420 175 56 91 184 -51 59 64 163 -15 -60 143 379 -128 63 10 108 43 -184 -7
4656gK46q5m12L71j56K10l50J08j0K72k42N8J58k62J7J20K7j04J1J24o5L9l28
$$ -7 239 154 -258 113 -43 167 -183 -75 -85 187 -55 3 161 -101 -84 36 63 -41 -30 94 29 68 -260
4679b60J30K04k07K6J33k0j11O4p2J20L3J00Nj35K1m1j11J43J30p0P2q4O3Q4j40
$$ -260 -130 74 -133 -107 26 6 -105 -41 -113 7 40 140 145 10 31 -10 -121 22 152 82 154 70 133 217 77
4704G7J08R6k59nJ87l76L5j14L64J9k79m2J63n0j26K89j9j45K0N2K29j70N4j91
$$ 77 185 281 22 17 204 -172 -137 -251 113 132 -147 -189 -26 -76 -202 87 68 -77 -57 -5 224 54 108 -83
4728h3J24K01m29L47j74j05p6K04j8q3J05J63k94R7nK6l3n4Kp2M02l39R4n8j87
$$ -83 41 242 -187 160 -14 -119 -195 9 -9 -92 13 176 -118 -21 -26 0 -33 -87 -85 -157 245 -94 0 -58 -245
4753b45N16j15k92Q5L38k62p7pK15rj72k47L14J73k76O7L6N0L4M0k80J76J49l26
$$ -245 271 156 -136 -51 287 25 -52 -59 156 147 -25 -272 42 215 -61 6 42 92 126 166 -114 62 211 -115
4777a15r0p5J03K54j05p6Q7R3K39n38J43%J18j18K06k07j07L49m68L06j04J48
$$ -115 -205 -280 -177 77 -28 -104 -17 76 315 -223 -80 -80 38 -80 126 -81 -188 161 -307 -1 -105 43
4799D3j83K27R7o6j42l4N5J12j68p4K38q9P2N2j00MJ20k56J65M7l33J16N46k11
$$ 43 -140 87 184 118 -24 -58 -3 109 -59 -133 105 16 88 140 40 44 164 -92 73 120 -213 -97 449 238
4823B38l35m6K99j8k07O8k4O2m9l5J39j49j70J43K20j34pJ62o4j07Q6r6J18j06
$$ 238 -97 -143 156 138 -69 -1 -25 37 -12 -47 92 -57 -227 -84 136 2 -5 157 93 -14 72 -24 94 -12
4847a2l55K71L22k89M2j08N6o1J70Mj43J46J0r7Rk3P5Q9k3j85L12k52J29j14J27
$$ -12 -367 -96 226 -63 -21 -129 -73 -134 36 40 -103 43 53 -44 -35 -58 17 106 83 -102 210 -42 87 -27 100
4872A00J88m55J04n4J40J82l16P2k6M44m24J07j47R8L70j38j01j30N6r1J03l3
$$ 100 288 -167 -63 -117 23 205 -111 -39 -65 379 -45 62 -85 13 383 245 144 14 70 -21 82 49
4894D9l10J45J7J58l7l2J39n5p2O4J22k8j77j23K95k0l75J17k9o5N84l45l9l4
$$ 49 -261 -116 -99 59 22 -10 129 74 2 66 188 160 -17 -140 155 135 -240 -123 -152 -217 367 22 -17 -51
4918e1J89k73K75k74K25J25m57K68K35j73J4k83K29J46j44j63J33j18L37k31J13
$$ -51 138 -135 140 -134 91 216 -241 27 262 89 103 -180 49 195 51 -112 21 -97 240 9 122
4939A22k61J95K16k69k14R5L50r9l89K56J11k85K86p1j07J64j37J26j76j36K04
$$ 122 -139 56 272 3 -211 -116 234 135 -254 2 113 -172 114 43 -64 100 -37 89 -87 -223 -19
4960a9K91l26j85K36L6m2m27J58M58k0nj17n6j37J22mj97J67J80k03O3j3r9L4
$$ -19 272 -54 -239 -3 33 -9 -436 -278 180 160 155 38 -18 -155 -33 -37 -234 -67 113 -90 -27 -40 -139 -105
4984a05J43j46J53j72M18j34j23J87j17j04J04N7k05o5J08M5j21J35k90Q8J01
$$ -105 38 -108 45 -127 291 157 34 221 104 0 104 161 -44 -109 -1 44 -77 58 -232 -144 -43
5005d3J16J13k64J55j6o0j63J63J43j89J32Noj52J03q4Rk8J71J64Rn46L20k21
$$ -43 73 186 -78 77 61 1 -162 1 144 -45 87 92 86 -66 37 -47 -38 -66 105 269 278 -268 52 -169
5029a69J45j14q0J79K21Qj16j56J46O0l42J88j69K66oo6l0okj4J25qR7q8k66J71
$$ -169 -24 -138 -218 -39 182 190 74 -82 64 124 -218 -30 -199 67 61 -5 -35 -41 -43 -57 68 60 157 69 -197 -26
5055b6J31j13J9k59J09l1K10n7j59L09J82m78Q7j2J41O9lj45k2M17l68j16O9j02
$$ -26 105 -8 11 -248 -139 -170 40 -17 -176 133 315 -163 -76 -88 53 122 119 -26 -48 369 1 -115 -46 -148
5079a48J58J20k87M2j15K90o7L4m4J12J45k47j67M93l71N1J80m50L50J21k79R6
$$ -148 10 130 -157 -115 -230 60 -7 27 -17 95 240 -7 -174 319 -52 -1 179 -271 79 200 -79 17
5101A7N6l3J78k43J5k5J04K11l80K24m9j8q4P8Kr9j51K12J33J06n6j03p5N9j1
$$ 17 73 40 218 -25 -10 -35 69 280 -100 124 75 57 -27 51 53 -46 -197 15 148 254 198 95 20 79 68
5126F8J51m38K43K49n9p1j92L35k34O3j87r0K05J35j90Q8k5k0j03j63N0J05N3
$$ 68 219 -219 24 273 214 143 -49 286 52 115 -72 -162 43 178 -12 76 51 31 -72 -235 -185 -80 -27
5149b7K85k37k12J30K16j42M0k50J83J5kN1j42N5K82l72jL22k00k8O1O0j74%J40
$$ -27 258 21 -191 -61 155 13 53 -197 -14 1 -1 50 -92 -37 245 -127 -128 194 -6 -34 27 87 -87 -87 53
5174E3j32M1k6L9K7l26L03P4j20R7k14L10R1k99L8J89j24j28k4J76J46q5k46q
$$ 53 -79 -38 -64 -25 2 -324 -21 53 -67 30 -184 126 217 -82 -44 145 21 -107 -131 45 191 106 -140 -148
5198a48O2K93k85N3J64j94O4r6m6O0L27r7k82Pj0K35k01K89j42j35K9j13J10J56
$$ -148 -86 207 -78 -25 139 -55 9 -87 -133 -73 254 157 -125 -118 -128 107 -94 195 53 -82 -53 -166 -56 100
5222A00j94J85j34K23o8r8nj06L02k72K04j79j15J39K5p8rK0J26j43J66Kp1k3
$$ 100 -94 91 -43 180 112 14 9 -97 205 -67 137 -42 -157 -18 7 -71 -80 -60 66 -77 89 91 20 -3
5246cJ25k19Q6J87k20j17N3J91K16m17J71j43J72R6j63J7N4Nk3p0j90L13j14K7
$$ -3 122 -97 -11 176 -44 -161 -108 83 299 -118 53 -90 82 178 15 32 86 91 68 -2 -192 121 7 34
5270C4l29J08K73L6j14m1J02j5j04J87k27J32Qk19K9N7K15j27k46k3K01J29r5
$$ 34 -295 -187 86 122 8 -33 69 54 -50 137 -90 42 50 -169 -140 -83 132 5 -241 -264 -63 66 -29
5293b9j40M1J08J51k86K38J04k72J20o1N5K58k62rq0K37l0j45J4r2J77n8j48K13
$$ -29 -169 -128 -20 131 -155 83 187 -85 35 -26 29 287 25 16 -64 173 143 -2 12 -80 97 39 -109 104
5317A04l1J26j02j61K15N1k38N1N1j61Pn7K39o2j54J66o2r3j63L81J0k62P1P1
$$ 104 73 199 97 -64 151 202 -36 15 66 -95 -88 -145 94 32 -122 44 -18 -111 -274 107 117 -145 -74 -3
5341cL12k81j15N1N8N5j05J47J0K8l7p9j73K92j45rj41j55N06j09l24J59J08J19
$$ -3 309 28 -87 -36 22 77 -28 119 129 157 120 41 -132 160 15 6 -135 -290 216 107 -217 -58 50 169
5365A69n2p1l63K16J83r3M1l15L35J5j10m6k68M97p1k13J38j98M22j68J52k05
$$ 169 117 46 -317 -101 82 -11 30 -285 50 65 -45 -91 -359 138 67 -146 -8 -206 216 48 200 -5
5387eL58j68k75p0K37M3J10m65K47m8R6o0k9J25j18N7k2j55K22j07M8K2o4J53
$$ -5 353 185 -90 -160 77 120 230 -235 12 -36 60 0 -29 96 -22 35 13 -142 80 -27 21 43 -21 132
5411A32k03J6J76l36K72n7k34O20m25J79j91j12J88j44J85k76J32K20J07j94j38
$$ 132 -71 -55 121 -215 57 0 -234 386 -39 140 -51 -163 25 -119 66 -210 -78 142 249 55 -83
5432h3p9K14M5o8QQ6j47k6o3K21k18J34o7n8J34j09P5j08P0Q1J42j76J09M2k2
$$ -83 -162 52 97 29 37 123 -24 -50 -113 108 -110 24 -43 -101 33 -76 -1 -109 -39 42 184 8 117 159 137
5457A37j37P3k81K89K4j54j7k8L8o3l3O0J69j46n0J61k65J44L9k08O5l09N08Q0
$$ 137 0 73 -208 81 105 -49 -66 -94 -56 -119 -152 -92 77 -69 -119 42 -223 -79 -40 -248 -183 -492 16 96
5481I6j18R1j10J30qj21J35K3J33m86K85J7pK30k44l34L36N7k34K45j50K78k50
$$ 96 -22 69 -41 89 81 -40 95 118 251 -235 50 67 60 290 46 -288 48 105 -129 116 -34 244 -6
5504fp1P9K16l14P8pK3J63j27J55k45K08k92P3k5Q0Q3j68J27j10j21K04J28l65
$$ -6 -77 2 218 -96 -18 -25 -2 161 34 189 -56 152 -140 -67 -92 -12 71 -97 30 -80 -201 3 131 -234
5528b34J10L22r1l36K76j53R0K08Jj29k31J12l7l9k4J12OQ2j59L07n8j42j52M8
$$ -234 -124 198 107 -229 47 -106 -16 192 193 64 -167 -55 -92 -131 -155 -43 -37 45 -114 193 135 -7 -159 -111
5552a11Q7K05j05j27rK12m1N6j54k04K97P2l52J07K51Jj39j48j1N8Ko7j59L64
$$ -111 -24 181 76 -51 -60 152 111 167 13 -191 106 178 -174 -67 184 185 46 -102 -113 -55 -53 -120 -279 85
5576H5R3j18l21L96k37J56O8p9k9J12K9k18J6N4J79o4k98K59O3j53o5J27k14L52
$$ 85 178 60 -261 135 -102 54 122 43 14 126 155 -63 -47 7 186 122 -176 83 146 -7 -72 55 -159 193
$$ [...]
8191h3
##END NTUPLES=NMR FID
##END=
