##TITLE=1H_BAU-29P(II)
 CDCl3, 8 sc, 
 29.1.2020
##JCAMPDX= 6.0         $$ Bruker NMR JCAMP-DX V2.0
##DATA TYPE= NMR FID
##DATA CLASS= NTUPLES
##ORIGIN= UXNMR, Bruker Analytische Messtechnik GmbH
##OWNER= root
$$ XWIN-NMR		Version 3.5
$$ Wed Jan 29 14:27:52 2020 Russian Standard Time (UT+4h)  she@DPX200
##.OBSERVE FREQUENCY= 200.1315
##.OBSERVE NUCLEUS= ^1H
##.DELAY= (6, 6)
##.ACQUISITION MODE= SIMULTANEOUS
##.ACQUISITION SCHEME= undefined
##.AVERAGES= 8
##.DIGITISER RES= 18
##SPECTROMETER/DATA SYSTEM= spect
##.PULSE SEQUENCE= zg30
##.SOLVENT NAME= CDCl3
##.SHIFT REFERENCE= (INTERNAL, CDCl3, 0, 15.7039)
##AUDIT TRAIL= $$ (NUMBER, WHEN, WHO, WHERE, WHAT)
$$ ##TITLE= Audit trail, XWIN-NMR		Version 3.5
$$ ##JCAMPDX= 5.01
$$ ##ORIGIN= Bruker BioSpin GmbH
$$ ##OWNER= she
$$ F:/spectra/data/she/nmr/H-F/1/audita.txt
$$ ##AUDIT TRAIL=  $$ (NUMBER, WHEN, WHO, WHERE, WHAT)
(   1,<2020-01-29 14:26:49.70 +0400>,<she>,<DPX200>,
      <created by zg, POWCHK disabled, PULCHK disabled
       configuration hash MD5:
       00 E9 B6 7A A2 85 ED C7 34 08 36 98 17 FE 4E 26
       data hash MD5: 16K
       55 DA 4B CC F1 19 3C 56 6B 9D 51 B3 24 17 74 27>)
$$ ##END=
$$ 
$$ hash MD5
$$ 4C 81 00 5E D7 12 C2 12 73 A6 EE 29 C6 C5 1F 4D
##$RELAX= 
##$RELAX= 
##$RELAX= 
##$RELAX= 
##$RELAX= 
##$RELAX= 
$$ Bruker specific parameters
$$ --------------------------
##$DU= <F:/spectra>
##$EXPNO= 1
##$NAME= <H-F>
##$PROCNO= 1
##$TYPE= <nmr>
##$USER= <she>
##$AMP= (0..31)
100 100 100 100 100 100 100 100 100 100 100 100 100 100 100 100 100 100 
100 100 100 100 100 100 100 100 100 100 100 100 100 100 
##$AQSEQ= 0
##$AQ_mod= 1
##$AUNM= <au_zg>
##$AUTOPOS= <>
##$BF1= 200.13
##$BF2= 200.13
##$BF3= 200.13
##$BF4= 200.13
##$BF5= 200.13
##$BF6= 200.13
##$BF7= 200.13
##$BF8= 200.13
##$BYTORDA= 1
##$CFDGTYP= 0
##$CFRGTYP= 5
##$CHEMSTR= <none>
##$CNST= (0..31)
1 1 145 1 1 1 1 1 1 1 1 1 1 1 1 1 1 1 1 1 1 1 1 1 1 1 1 1 1 1 1 1 
##$CPDPRG= <>
##$CPDPRG1= <>
##$CPDPRG2= <>
##$CPDPRG3= <>
##$CPDPRG4= <mlev>
##$CPDPRG5= <mlev>
##$CPDPRG6= <mlev>
##$CPDPRG7= <mlev>
##$CPDPRG8= <mlev>
##$CPDPRGB= <>
##$CPDPRGT= <>
##$D= (0..31)
0 1.2 0 0 0 0 0 0 0 0.06 0 0.03 0 0 0 0 0.0002 0 0 0 0 0 0 0 0 0 0 0 0 
0 0 0 
##$DATE= 1580293608
##$DBL= (0..7)
120 120 120 120 120 120 120 120 
##$DBP= (0..7)
150 150 150 150 150 150 150 150 
##$DBP07= 0
##$DBPNAM0= <>
##$DBPNAM1= <>
##$DBPNAM2= <>
##$DBPNAM3= <>
##$DBPNAM4= <>
##$DBPNAM5= <>
##$DBPNAM6= <>
##$DBPNAM7= <>
##$DBPOAL= (0..7)
0.5 0.5 0.5 0.5 0.5 0.5 0.5 0.5 
##$DBPOFFS= (0..7)
0 0 0 0 0 0 0 0 
##$DE= 6
##$DECBNUC= <off>
##$DECIM= 24
##$DECNUC= <off>
##$DECSTAT= 4
##$DIGMOD= 1
##$DIGTYP= 9
##$DL= (0..7)
0 120 120 120 120 120 120 120 
##$DP= (0..7)
150 150 150 150 150 150 150 150 
##$DP07= 0
##$DPNAME0= <>
##$DPNAME1= <>
##$DPNAME2= <>
##$DPNAME3= <>
##$DPNAME4= <>
##$DPNAME5= <>
##$DPNAME6= <>
##$DPNAME7= <>
##$DPOAL= (0..7)
0.5 0.5 0.5 0.5 0.5 0.5 0.5 0.5 
##$DPOFFS= (0..7)
0 0 0 0 0 0 0 0 
##$DQDMODE= 0
##$DR= 18
##$DS= 0
##$DSLIST= <SSSSSSSSSSSSSSS>
$$ [...]
##$SUBNAM2= <"">
##$SUBNAM3= <"">
##$SUBNAM4= <"">
##$SUBNAM5= <"">
##$SUBNAM6= <"">
##$SUBNAM7= <"">
##$SUBNAM8= <"">
##$SUBNAM9= <"">
##$SW= 24.9337058887773
##$SWIBOX= (0..15)
0 0 2 0 0 0 0 0 0 0 0 0 0 0 0 0 
##$SW_h= 4990.01996007984
##$TD= 16384
##$TD0= 1
##$TE= 0
##$TE2= 300
##$TE3= 300
##$TEG= 300
##$TL= (0..7)
0 120 120 120 120 120 120 120 
##$TP= (0..7)
150 150 150 150 150 150 150 150 
##$TP07= 0
##$TPNAME0= <>
##$TPNAME1= <>
##$TPNAME2= <>
##$TPNAME3= <>
##$TPNAME4= <>
##$TPNAME5= <>
##$TPNAME6= <>
##$TPNAME7= <>
##$TPOAL= (0..7)
0.5 0.5 0.5 0.5 0.5 0.5 0.5 0.5 
##$TPOFFS= (0..7)
0 0 0 0 0 0 0 0 
##$TUNHIN= 0
##$TUNHOUT= 0
##$TUNXOUT= 0
##$USERA1= <user>
##$USERA2= <user>
##$USERA3= <user>
##$USERA4= <user>
##$USERA5= <user>
##$V9= 5
##$VALIST= <valist>
##$VCLIST= <CCCCCCCCCCCCCCC>
##$VD= 0
##$VDLIST= <DDDDDDDDDDDDDDD>
##$VPLIST= <PPPPPPPPPPPPPPP>
##$VTLIST= <TTTTTTTTTTTTTTT>
##$WBST= 1024
##$WBSW= 4
##$XGAIN= (0..3)
0 0 0 0 
##$XL= 0
##$YL= 0
##$YMAX_a= 403575
##$YMIN_a= -300202
##$ZGOPTNS= <>
##$ZL1= 120
##$ZL2= 120
##$ZL3= 120
##$ZL4= 120
##$ABSF1= 10
##$ABSF2= 0
##$ABSG= 5
##$ABSL= 3
##$ALPHA= 0
##$AQORDER= 0
##$ASSFAC= 0
##$ASSFACI= 0
##$ASSFACX= 0
##$ASSWID= 0
##$AUNMP= <proc_1d>
##$AZFE= 0.1
##$AZFW= 0.1
##$BCFW= 1
##$BC_mod= 2
##$BYTORDP= 1
##$COROFFS= 0
##$CY= 11.3945322036743
##$DATMOD= 1
##$DC= 2
##$DFILT= <>
##$DTYPP= 0
##$F1P= 16.9975609425685
##$F2P= -3.02152046262296
##$FCOR= 0.5
##$FTSIZE= 0
##$FT_mod= 4
##$GAMMA= 1
##$GB= 0.15
##$INTBC= 1
##$INTSCL= 1
##$ISEN= 128
##$LB= 0.24
##$LEV0= 0
##$LPBIN= 0
##$MAXI= 10000
##$MC2= 0
##$MEAN= 0
##$ME_mod= 0
##$MI= 1.114404
##$NCOEF= 0
##$NC_proc= 0
##$NLEV= 6
##$NOISF1= 3.799351
##$NOISF2= 2.8
##$NSP= 1
##$NTH_PI= 0
##$NZP= 0
##$OFFSET= 15.70392
##$PC= 1
##$PHC0= -9783.606
##$PHC1= 8.600814
##$PH_mod= 1
##$PKNL= yes
##$PPARMOD= 0
##$PSCAL= 0
##$PSIGN= 0
##$REVERSE= no
##$SF= 200.130013532006
##$SI= 16384
##$SIGF1= 3
##$SIGF2= 2
##$SINO= 400
##$SIOLD= 16384
##$SREGLST= <1H.CDCl3>
##$SSB= 0
##$STSI= 0
##$STSR= 0
##$SW_p= 3612.71676300578
##$SYMM= 0
##$S_DEV= 0
##$TDeff= 0
##$TDoff= 0
##$TI= <>
##$TILT= no
##$TM1= 0
##$TM2= 0
##$TOPLEV= 0
##$USERP1= <user>
##$USERP2= <user>
##$USERP3= <user>
##$USERP4= <user>
##$USERP5= <user>
##$WDW= 1
##$XDIM= 8192
##$YMAX_p= 0
##$YMIN_p= 0
$$ End of Bruker specific parameters
$$ ---------------------------------
##NTUPLES= NMR FID
##VAR_NAME=  TIME,          FID/REAL,        FID/IMAG
##SYMBOL=    X,             R,               I
##VAR_TYPE=  INDEPENDENT,   DEPENDENT,       DEPENDENT
##VAR_FORM=  AFFN,          ASDF,            ASDF
##VAR_DIM=   8192,          8192,            8192
##UNITS=     SECONDS,       ARBITRARY UNITS, ARBITRARY UNITS
##FACTOR=    0.0002004,     1,               1
##FIRST=     0,             0,               0
##LAST=      1.6414764,     0,               0
##MIN=       0,             -300202,         0
##MAX=       1.6414764,     403575,          0
$$ Real data points
##PAGE= N=1
##DATA TABLE= (X++(R..R)), XYDATA
0@%%%%%%%Qj6J6j6J8k6L5m3N4o5P5q8J05j24J47j72J97k27K61k98L40l86M37m94
31b62N56o24P00p83Q72r71J081j199J328j470J627j803J997k212K452k721L028
48A596l378L779m250M811n488O331p413Q853j0887J4006j9451L1738j12281J8479
62g3555J63360p1565j52063j56450r929J00027J51485N4500o6782j38376p0746
73b70094L8664J15339Q2962l981r3501r2704o122J04824J17430K2660r4388j14059
85a92970k7712Q9494J30240O8134n0426j19654q5853K5447J15270J11411K2493
96H5874p4435j05616n2177M3573J06310Q1805j1331r0416q1343L51P3201P1950
108D7746Q086n6251o5184j4595M7326O2071J2893m9634o4722k3615L2407N8588
$$ plain form
0 0 0 0 0 0 0 0 0 8 -8 8 -8 10 -16 19 -24 30 -35 40 -48 57 -67 80 -92 105 -122 139 -159 181 -205 232 -262
31 -262 294 -330 370 -413 459 -512 569 -630 698 -772 855 -948 1049 -1163 1289 -1432 1596
48 1596 -1782 1997 -2253 2558 -2930 3401 -4012 4841 -6046 7960 -11491 20247 -92034 -73555
62 -73555 89805 18240 -133823 -290273 -300202 -200175 -48690 5810 -60972 -199348 -270094
73 -270094 -231430 -116091 -33129 -37110 -130611 -223315 -229437 -124613 -7183 15477 -78911 -192970
85 -192970 -220682 -131188 -948 67186 16760 -102894 -188747 -163300 -48030 63381 85874
96 85874 11439 -94177 -146354 -102781 3529 85334 74003 -16413 -97756 -97405 -24204 47746
108 47746 55832 -419 -65603 -80198 -32872 29199 42092 -7542 -72264 -95879 -63472 -4884
120d884L8833j5544o8070o9958q285O1559P4285K0439m9498p6204m1816K3252
132a15891O4634M6562j2289n2812l9970L324L2076K7477K874j7849k3409n984
144i1257K0730K9208P806k3848l2680q788K8664M4922K3606k0807m9051l2083
156a03578J8160N3612M0703m310l8370l5724m431K5279L4206J7960j0200k7288
168c3981j9138O932K4919J8923l909k2385j9513M080K8464K5265o672l7731l1139
181f5885O664L8285L4072K83l2008l9506j5974K0573L9942K5884r256l5290l2784
194f5000o267K4642L6148J7938j8737l8665j9973J6994L4894J8461j3675k9740
206d2980j6550J1562K9867K0157p368k7056k1918K758K5732K8382J0954j6561
$$ plain form
120 -4884 33949 18405 -49665 -119623 -127908 -66349 7936 28375 -21123 -97327 -139143 -115891
132 -115891 -51257 -4695 -16984 -69796 -109766 -106442 -74366 -46889 -44015 -61864 -85273 -91257
144 -91257 -70527 -41319 -33513 -57361 -90041 -98829 -70165 -25243 -1637 -22444 -71495 -103578
156 -103578 -85418 -31806 8897 4587 -33783 -69507 -73938 -48659 -14453 3507 -6693 -33981
168 -33981 -53119 -46187 -21268 -2345 -6254 -28639 -48152 -44072 -15608 9657 2985 -34746 -65885
181 -65885 -59221 -20936 13136 13419 -18589 -58095 -74069 -53496 -13554 12330 3074 -32216 -65000
194 -65000 -71267 -46625 -10477 7461 -11276 -49941 -69914 -52920 -18026 435 -13240 -42980
206 -42980 -59530 -47968 -18101 2056 -5312 -32368 -54286 -51528 -25796 2586 13540 -3021
218c021l2411k1309J1198L7930L2616j823l3116l3366m243K7108L3124J3843j6642
231I888k7955j4906R820K2777J6295j494j5461j6206m415J3131K0320P852j3325
244F321k2615r667J3380K3843J2385j0833k4310j6991N974K3226J8471j639j7812
257b67j7993o347Q317J6275J3331o62j5527j7916m004J1956J7181O440q887j4786
271a2889p837O637J3027M897n876r626k614N090N331J847j019l575m919k576M494
286i608P256M947l553q900p229J209R489Q743M37q476q152n10M888L934O68M72
302d385j55j936l792k318J652M348L665m44l349l716k01K000K111m39j84K029
318e114R53k871l485O53M739K979j349l222n93K069L133J61l026k581J974N066
$$ plain form
218 -3021 -35432 -56741 -45543 -7613 25003 23180 -9936 -43302 -47545 -20437 12687 26530 9888
231 9888 -18067 -32973 -23153 -376 15919 14425 -1036 -17242 -21657 -8526 11794 19646 6321
244 6321 -16294 -25961 -12581 11262 23647 12814 -11496 -28487 -22513 713 19184 17545 -267
257 -267 -18260 -24607 -16290 -15 13316 12654 -2873 -20789 -24793 -12837 4344 10784 1897 -12889
271 -12889 -20726 -14089 -1062 3835 -2041 -11667 -14281 -9191 -3860 -2013 -3032 -6607 -11526 -14102 -9608
286 -9608 -2352 2595 -958 -9858 -17087 -15878 -6389 2354 2791 -5685 -13837 -14347 -9459 -5525 -4857 -4385
302 -4385 -4540 -6476 -10268 -12586 -10934 -6586 -2921 -3365 -6714 -10430 -10631 -8631 -6520 -6959 -7143 -5114
318 -5114 -4161 -7032 -10517 -9864 -5125 -2146 -3495 -6717 -7310 -5241 -2108 -1947 -4973 -7554 -5580 -514
334e14L478j830m388j988J227J851K394L805J900k544o573l616K997P674O502
349A0375j214p412o914n6O872O286l19m447k873L94Q55L92J247J087r25k911r45
366e08J722L210N89l181m757j263M425N876J672n952p533j272N303N571P96j915
382B783l251l211j514J938L388K676K16l609l393j623K494M218J161l745l827
397e299J451M225J265l309l163J0K572K463P96j526k517j509N44J333J331J292
413d1J066j420l793k120K316M882Q29k998k663M53K386J093j338j961l4K088K140
430H85L19k550k319O08K414R95M8N86N66j676k673l5L737L455p03k696k640N04
448a175L341K576j201k958j675K272L493K09k582j908q6J441M12J227J163r81
$$ plain form
334 -514 2964 1134 -3254 -5242 -4015 -2164 230 4035 5935 3391 -3182 -6798 -3801 3873 10375
349 10375 9161 1749 -5165 -5221 1651 7937 7618 3171 298 692 1547 1939 3186 4273 3348 437 -508
366 -508 1214 4424 5013 1832 -2925 -4188 237 6113 7785 1833 -5700 -6972 -1669 3902 4698 2783
382 2783 -468 -3679 -5193 -3255 133 2809 3025 -584 -3977 -5600 -3106 1112 2273 -1472 -5299
397 -5299 -3848 377 1642 -1667 -4830 -4820 -2248 215 1011 -515 -3032 -4541 -3997 -2664 -1333 -41
413 -41 1025 -395 -4188 -6308 -3992 890 1719 -1279 -3942 -3489 -1103 -10 -1348 -3309 -3343 -1255 885
430 885 1204 -1346 -3665 -3057 -643 352 400 986 1552 -124 -2797 -2832 905 4360 3657 961 -1679 -1175
448 -1175 2166 4742 3541 583 -1092 1180 4673 4882 2300 392 306 1747 2159 3386 4549 3568
464C568k739k111N31K727K894J4l280m037q72L937M149p37m825k767J475K848
480G75J664j391k167j810J37J313K359J091r97k360k842m88L313M544J885l458
496A568n593j407M748N002Q37l563k942n5K923L153Q08j728k098n70J598K761
512E442J844L12k284l530j384L878N916K885m235o708k701L443O024L189j725
527A0366n596l661P01L712K598o61k734k325j217R67K387K015k780n165l041K487
543a947N473K833l080p373n186J232O798O042j096o787o198j450L718M717L406
558A102r14m492n299r42M566N142J254l563m627q80M223N673J499m967n919J16
574h028O784O653J744m450o238k565K337P449O708J088n785p239k832M437Q588
$$ plain form
464 3568 829 -1282 -751 1976 4870 4884 1604 -2433 -3305 632 4781 4044 -781 -3548 -2073 775
480 775 2439 1048 -1119 -2929 -2792 -1479 880 1971 974 -1386 -4228 -4716 -1403 3141 5026 1568
496 1568 -4025 -5432 -684 4318 5155 1592 -1350 -1405 1518 4671 5479 3751 1653 1083 2681 5442
512 5442 7286 7598 5314 1784 400 4278 10194 13079 8844 2136 -565 2878 8902 12091 10366
527 10366 4770 1109 1810 5522 8120 7459 4725 2400 1183 2150 4537 6552 3772 -1393 -4434 -1947
543 -1947 3526 6359 3279 -4094 -9280 -8048 -1250 4792 3696 -3091 -9289 -10739 -7021 -2304 1102
558 1102 188 -4304 -9603 -10545 -5979 -837 417 -3146 -7773 -8653 -4430 1243 2742 -2225 -8144 -8028
574 -8028 -1244 5409 7153 2703 -3535 -6100 -3763 3686 10394 11482 5697 -1542 -4374 63 8651
589H651N435j355p557o112J015P210N814j194n565l595R89M465K996m42m449n013
605A293n76M886N563J843m157p695n654J736Q818Q051n98r302r914k123O273Q679
621G123L985l865p941n401J368N268M692m75l789m473l40L280M192J056m220o206
637e746j414O055Q369K144o089r284m272M768R726P287j277q808q638j438O167
652b450Q520N054k220p506p022o47P224P191N87n386n578p68N147M584L19n257
668A792n789l57N920O614M92n674p422l670K935P944P230M5q716j0040k898N748
684e846R789O065l104r034p412M79O850O468M63m502m575q65K414L570Q81k371
700g30m214j237L964N676J802l935o932m162K649Q481P547o50q262r322j623O747
$$ plain form
589 8651 14086 12731 5174 -938 77 7287 13101 11907 6342 2747 3736 8201 11197 10755 6306 1293
605 1293 717 5603 11166 13009 8852 1157 -4497 -2761 6057 14108 13510 4208 -5706 -7829 -1556 7123
621 7123 11108 7243 -698 -6099 -4731 537 5229 4754 965 -3508 -3848 -568 3624 4680 460 -5746
637 -5746 -7160 -1105 7264 9408 3319 -5965 -10237 -5469 4257 11544 10267 1459 -7179 -8617 -2450
652 -2450 6070 11124 8904 1398 -5624 -6271 953 8144 8731 3345 -2233 -3001 2146 6730 7049 1792
668 1792 -3997 -4354 1566 8180 8672 2998 -4424 -8094 -5159 2785 10015 10060 1344 -8696 -11594 -5846
684 -5846 3943 10008 6904 -2130 -9542 -9063 -2213 4255 4718 216 -4359 -5224 -2810 760 1641 -730
700 -730 -4944 -6181 -2217 3459 5261 1326 -5606 -9768 -7119 1362 8909 8259 -3 -9325 -10948 -4201
716d201Q595L995k148o684o783l26N046O297K081k749m756k327J141L439K755
731C375j580m085j846L862M776J139m513n898j944L212O532N135r50o584o934
746f303j501M255P302M869j033o104o931k036N280O741K491k319m513k643J069
761a376K571J654l80k032p24K271K116R3l028l074j167J700M222L948R1n781o577
778e473j751M168O149M130j518o324n827j161L947M728K227j881k911k963r33
793e393R70J718J070j051j171J38R95k71j855k571j36J975L574K544j526m645
809e635m241q9L791M465K878j045l640m474j813K875M740L353k33k866k614j099
825e647J127K351J753K23l36L57Q9r72j179l19J188K299K095N27j028k684k729
$$ plain form
716 -4201 4394 8389 6241 -443 -7226 -7552 -2506 3791 5872 3123 -1633 -3960 -2819 620 3375
731 3375 1795 -2290 -4136 -274 4502 5641 1128 -4770 -6714 -3502 3030 8165 7215 631 -6303
746 -6303 -7804 -3549 3753 8622 7589 1485 -5446 -7482 -2202 4539 7030 4711 198 -2445 -1376
761 -1376 1195 2849 2469 437 -287 1984 4100 4193 1165 -1909 -3076 -1376 2846 6794 6885 1104 -5473
778 -5473 -7224 -3056 3093 7223 5705 -619 -6446 -7607 -3660 1068 3295 1414 -1497 -4460 -5393
793 -5393 -4423 -2705 -1635 -2686 -3857 -3719 -2724 -2995 -4850 -7421 -7557 -5582 -2008 536 -990 -5635
809 -5635 -9876 -9965 -6174 -1709 1169 124 -3516 -7990 -9803 -6928 -2188 1165 932 -1934 -4548 -5647
825 -5647 -4520 -2169 -416 -193 -529 -172 -83 -1055 -2234 -2553 -1365 934 3029 3556 2528 -156 -2885
842b885J0L005L674K009q45l058m028j424K352L877K092l41k120k579j750p2J622
859d61K105J001J6q05j814k002o46Q47J228J053J092J74j734k084k203O37K440
876a156K621Q43j178k341k325q58J415K330K138P07j077k116k376m14J725L031
892I69J489l8j396j359j221m53R95K276J736l17o05j945j549j36J239K021J255
909B961P3j114q55j784j137Q62K047J775M99j080k467j863o98J542J940J611l38
926A974j354j914k267m44K095K406J260j391j652j726l13J83R64Q63P39j76q35
943a588n72j099p63O53J615J046M07n69o57k159q95J162K759K203k77j669k343
960b746j434R13K599K306M28j117j665j194Q8J073J510R91k23l62p71j92L56o79
$$ plain form
842 -2885 -2875 130 3804 5813 4968 1910 -2118 -3542 -1190 2687 4779 4438 2318 -261 -2011 -2083 -461
859 -461 1644 2645 2661 1856 42 -1960 -2606 -1759 -531 522 1614 1788 54 -2030 -4233 -3596 -1156
876 -1156 1465 2308 1130 -1211 -3536 -4394 -2979 -649 1489 2196 1119 -997 -3373 -3787 -2062 969
892 969 2458 2420 1024 -335 -1556 -2009 -1014 1262 2998 2681 2076 131 -1418 -1554 -315 1706 2961
909 2961 3034 1920 1065 -719 -1856 -994 1053 2828 3327 2247 -220 -2083 -2781 -1239 701 2312 1974
926 1974 620 -1294 -3561 -4005 -1910 496 1756 365 -1287 -3013 -3326 -3143 -2179 -1316 -577 -753 -1588
943 -1588 -2160 -3259 -4022 -3369 -1754 -708 -301 -870 -1527 -3686 -4581 -3419 -660 1543 1266 -403 -2746
960 -2746 -4180 -3267 -668 1638 2066 949 -716 -1910 -1822 -749 761 1752 1529 1167 396 204 560 -119
978a19k96J291J128O79m08j043j517j163J090K529J777J60k339k025j126N66K091
995A275K517O04k002k504j281P00J658J546Rj220j006k70Q79M78l68m76k74O36
1013I01R40J93p90j544j284M63K120J817N20k008k334j345O30K728K036j7j816
1030A210k269j149J266J574J500j91q91k055j04Q59Q46M58r38k49k92M87M84j2
1048E34j178q38j32J317J537j77o08j661j527N62J710J890Mj548j640r35P92J542
1066c56R99K94j056j422q68Q54J168M24k70r2q82Q8k3N95J02o12K22J63Q25k44
1086i1l33p40k40m9J016R11K88n44j115m08M27M75P83R54o11q84p97J25P08O40
1106E15N2M28k21r68k50J39L70L12N27j16o1q45l75N87N87N47j93k54k51m28j5
$$ plain form
978 -119 -415 876 2004 2683 2275 1232 -285 -1448 -358 2171 3948 4108 1769 -256 -1382 -816 1275
995 1275 3792 4396 2394 -110 -1391 -691 967 2513 2522 1302 296 26 905 1383 1015 539 265 901
1013 901 1841 2034 1244 -300 -1584 -1121 999 2816 3336 1328 -1006 -2351 -1721 1007 3043 3026 1210
1030 1210 -1059 -2208 -942 632 2132 1941 1050 -1005 -1109 -250 596 1054 116 -133 -425 62 546 534
1048 534 -644 -1482 -1614 -297 1240 1063 455 -1206 -2733 -2171 -461 1429 1433 -115 -1755 -2690 -1898 -356
1066 -356 643 937 -119 -1541 -2409 -1555 -387 37 -233 -325 -1207 -1119 -1142 -547 -445 -1057 -835 -672 153 -91
1086 -91 -424 -1164 -1404 -1453 -437 474 762 218 -897 -1305 -878 -403 380 1334 723 -161 -958 -833 -125 515
1106 515 567 995 774 -194 -444 -305 65 377 904 788 727 -118 -493 94 681 1228 1035 781 530 102 87
1127H7P43M42q24J44J04N1K21j05k01l53k09M26R71L11m53r73q18R0R63R56O20
1148B193m75j876r49N96J390J005O0j026j045j332P84J698P58m21j420q91J85
1165g66J141O41K67j034j419j34J347P54N9o09j094q49L67J703J074k14j669j500
1183a935j17J423J678L01q10j908q57J53J820J533k14j347j204o31R47J384Q44
1200A060o14j505q84L34J574J106o11j186j172q9J571J138K10r84j388m09P76
1217a073J433R40p80r76j446J08J268J318L70j228j055m56O89J223N35j88j226
1234e44n67L40R11P35j02m70j141J83N53J069L05m83r01k31K21J038L33K11j059
1253D01p02J59J237N54Rr08p67M26M29N13K90n35p45k14M30J049O6l17p15n29
$$ plain form
1127 87 830 1272 448 592 696 747 968 863 662 309 100 526 1497 1808 1355 382 -436 -346 617 1573 2193
1148 2193 1718 -158 -1107 -511 879 1884 1944 918 -127 -1459 -675 1023 1781 1360 -60 -951 -766
1165 -766 375 1016 1283 249 -1170 -1304 43 797 856 247 -847 -1696 -1329 374 1448 1234 -435 -1935
1183 -1935 -2052 -629 1049 1350 540 -1368 -2225 -2072 -252 1281 1067 -280 -1484 -2115 -1168 216 1060
1200 1060 446 -1059 -1943 -1609 -35 1071 460 -726 -1898 -1987 -416 722 932 -52 -1440 -1849 -1073
1217 -1073 360 1300 520 -456 -1902 -1794 -526 792 1162 -66 -1121 -1577 -888 335 870 682 -544
1234 -544 -1111 -771 140 875 773 303 -838 -655 -102 967 1272 789 -112 -343 -122 916 1249 1460 401
1253 401 -301 -142 1095 1649 1658 750 -17 409 838 1351 1641 1106 361 147 577 1626 1692 1375 660 131
1273A31J19O80J005j16j050o23k09J049O60k93n05q74j99M21J004K6m61j016l80
1292f31M11Q29K19P2r83j105J73Q13J296L47p90j729m93O14R89J059l18j058j423
1311a708J87R20J245J69p29j130o30R14R64O62o35j308r93R30J511J033m74j359
1329d31j484J61P35K030O55p05j537j295J67J572J268O03j292j475q07R04J381
1346D50J093k59j378r85nJ176J427m27j234r21K82P21J208J91n90j501p54L96
1364a110J883J120k71j306j744J8R00K132R61p88j971r89k9J397J468J84p73j032
1382E0m37L29R25P36m67m34o55K86O55M36k14r19n14N41J013N06J96j143q38n20
1402d68N79J184J207l67j413j326r7N99J266R44k94j038j325K36M36J107j03k48
$$ plain form
1273 131 250 930 1935 1819 769 146 -63 986 1646 1353 848 -26 -225 196 1200 1226 765 -251 -631
1292 -631 -220 609 828 900 -83 -1188 -1015 -202 1094 1441 651 -1078 -1571 -957 32 1091 773 -285 -1708
1311 -1708 -1521 -601 644 813 84 -1046 -1676 -762 202 864 229 -1079 -2072 -1142 369 1402 928 -431
1329 -431 -1915 -1754 -1019 1011 1666 961 -576 -1871 -1704 -132 1136 1739 447 -1028 -1835 -931 450
1346 450 1543 1284 -94 -1079 -1084 92 1519 1092 -142 -1063 -781 -60 1148 1339 749 -752 -1506 -1110
1364 -1110 773 1893 1622 316 -1428 -1410 -510 1622 2583 1795 -176 -1165 -1194 203 1671 1855 1082 50
1382 50 -387 -58 867 1603 1136 702 47 333 988 1424 1210 291 -223 318 1331 1837 2033 890 52 -468
1402 -468 111 1295 2502 2135 722 -604 -701 -102 1164 2108 1814 776 -549 -313 123 1230 1127 879
1420H79n31l6J57n9j2k23k38K26L44K70kn19p14m35M07R51R37J9j349j328j24
1441a380N34J085P19j94q20n36k57M3R21L03N2r0q39K49k13J27k40J14j03O67
1461A42M85k45o14n27nM78R85O64n42j397l05k29R18N93O57K95j360p57k48O81
1481c31P79K20L17p14l03k50M51K13p2j93K42M42L61o06o2q35l9L88R99R47j47
1502A807j164j310k29J007J242Q62k63j335j084n12J256J141L36k29p97o73r4
1519c9K96O34J84j0m02j51O1M18m0p00m65J67Q16J130k31q77j008q02N07J622
1539A110J011k46j048j270r64R23J323J131j72q88j498m52N62J038N07k43r56
1556a32m1J40O0K17j42K9k31K52M79P5n82o35n26J33J250R86R2q82j661q28P13
$$ plain form
1420 879 348 312 469 410 398 175 -63 163 507 777 775 256 -458 -893 -486 465 1402 1421 72 -1256 -1380
1441 -1380 -846 239 958 764 -56 -592 -849 -806 115 418 470 380 -459 -210 -423 -296 -536 -422 -525 142
1461 142 627 382 -232 -759 -764 -286 699 1363 821 -576 -881 -1110 -192 401 1058 1353 -7 -764 -1012 -331
1481 -331 448 668 985 271 -32 -282 169 382 310 117 359 801 1162 556 494 -341 -380 8 1007 1954 1807
1502 1807 643 -667 -896 111 1353 2215 1952 617 -467 -979 277 1418 1754 1525 728 55 -39
1519 -39 257 891 1075 1065 663 512 573 991 951 251 -214 -47 769 1899 1668 791 -217 -1019 -512 1110
1539 1110 2121 1875 827 -443 -1407 -484 839 1970 1798 910 -588 -1040 -478 560 1067 824 -132
1556 -132 -173 -33 27 244 102 131 -100 152 631 706 124 -511 -1037 -904 346 1332 1424 542 -1119 -1947 -1234
1577a234J551R93q3j130o81q95O27O77Q14l2p73Q3l86l59L53L83j14j24Q0N10
1597B60K23m90p19k85M3J653N06k84o43j334r1L67J033Q10j06o73p09o47L56J164
1617D34M57K49o58m73J10J74Jj27J95J00L59M07l12q37o12J78P06P24O03l98p69
1638E11j022k65J049R80O52l77j132o39l51J178M90J77l55m42p6N3R2o1l8j26
1658B98qK95Q58l13p57r24N0M46J029Q82m76j259j291m33J461J614K78n97j331
1677a78r82J8J249O72K16k45j186k78J02P80K84k7r39J0J7M84O43m79j019m49
1697a307M93R30R65l75j145j053o8Q44J199O66l89r90j178m46J286J035L74k41
1715F00j504k63K52N00P84o93J18q29L62L72K64p8l18o11j24J008N18J26n51j122
$$ plain form
1577 -1234 317 1310 1227 97 -584 -1479 -852 -175 639 607 -166 -83 -469 -828 -475 -92 -206 -330 -250 260
1597 260 483 -7 -726 -1011 -968 685 1191 907 264 -1070 -1161 -794 239 1049 943 270 -439 -1086 -730 434
1617 434 891 1140 482 9 119 293 294 167 362 462 821 1228 916 79 -533 -355 351 1075 1678 1280 511
1638 511 -511 -776 273 1253 1905 1528 396 -243 -594 584 1074 1251 896 454 378 431 523 462 424 298
1658 298 290 585 1443 1130 373 -551 -501 -55 974 1856 1380 121 -1170 -1603 -142 1472 1750 1153 -178
1677 -178 -1160 -1142 107 779 995 750 -436 -714 -612 168 452 425 -514 -504 -487 -3 640 161 -858 -1307
1697 -1307 -814 116 1081 706 -439 -1492 -1560 -716 483 1149 760 -230 -1408 -1854 -568 467 841 600
1715 600 -904 -1167 -915 -415 369 -324 -206 -1035 -673 -301 -37 -115 -433 -1044 -1168 -160 358 484 -67 -1189
1735a189l14O26J250P00o96l99j359k8R89R17J83k53n91l43j78M07P92R3k14n52
1755a59k35P2O26J1l57j50M6O39J05K99p37n68j90P37P35P8n1q27m76n9M75P61
1777G75L97m71n87o44N54M20L3K03n99l06Q6M29N02k98r06l2M21N18O3j61o63
1798b66m48J24N89N78N07p29q90l75j8P99Q22k07j082k75k30P25O37q2l44n43
1818g08l42N9R01J29j20n17p54L29P08K47k44j99o80l38P99P73J57l56q01n18
1838a475L93P59Q03m38p76n68k58P34J092K33l61p84o73k34J469J90J61p20o42
1857a095j16O27Q28J03o87o97M1K00R30M97l38r14o27M34P30R04K04r59j034m56
1877a425R98J011J43m8j202m58K12P04R85J02q99p60j80L91O46L92n1n63o40j54
$$ plain form
1735 -1189 -1503 -877 373 1073 377 -22 -1381 -1409 -420 497 680 427 -164 -507 -685 -278 514 607 393 -159
1755 -159 -394 -322 304 315 -42 -192 -146 493 598 897 160 -408 -598 139 874 952 901 74 -402 -461 14 775
1777 775 1172 701 114 -530 24 444 477 680 81 -225 -139 290 792 494 -412 -444 -23 495 558 397 -266
1798 -266 -714 -590 -1 577 1084 355 -535 -910 -928 -129 693 486 -596 -871 -1101 -376 261 179 -165 -708
1818 -708 -1050 -991 -90 39 -81 -598 -1352 -1023 -315 -68 -312 -511 -1191 -1529 -730 43 200 -156 -957 -1475
1838 -1475 -1082 -323 480 42 -734 -1302 -1560 -826 266 499 138 -646 -1319 -1553 -84 106 267 -453 -1095
1857 -1095 -1211 -584 244 347 -340 -1037 -996 -796 134 631 293 -621 -1248 -814 -84 820 1024 65 -969 -1425
1877 -1425 -427 584 727 679 -523 -981 -769 -65 920 1022 123 -637 -817 -426 220 612 561 -2 -642 -796
1897g96P90P31J8n95q59L0O69Q96m8n54p52m88M88R21K65K02q17q08L5N74N63
1918D65L85l63q62r1j99R22L38N0q48l93L81N3O98k10p35N0L8J01O67K50o17n17
1940d37n64L20R41K34L7o28q10j91N64P84L17l62p65m64R1N80N73k60k08n41J70
1961f19K58L33l96P0l88N2j9M35K90l72l49o35O55M27M41J0p67n25J85P0N21L22
1983ak0l22m51J91N21Q6Q5m93l93M89O5M03k74k62l90K18N30M16k56n20k03n9
2005f40M43J85M45j56n35l17m4J39P39L32l70l24m10lM77M19Mo66k9J39J81M19
2027D28j5n39K6j02K49K23K81j01p66k94M12M49L22k91k08p60p2O72O08J74l15
2048C81o80k41K09K43Q02n79k10k37k84N70M03m2m38m71j40K03N83N39l49o01
$$ plain form
1897 -796 -6 725 743 148 -711 -681 -12 884 836 282 -470 -958 -470 451 716 918 101 -707 -672 -98 465
1918 465 850 487 -375 -466 -665 257 595 645 -203 -596 -215 -162 536 326 -409 -359 -321 -220 447 697 80 -437
1940 -437 -1001 -681 260 494 531 -97 -907 -1098 -534 250 567 205 -560 -1024 -933 -353 220 -40 -248 -789 -619
1961 -619 -361 -28 -424 -354 -742 -690 -709 -274 16 -356 -705 -1340 -685 -258 183 193 -574 -1099 -914 -844 -323 -1
1983 -1 -21 -343 -794 -603 -82 4 89 -404 -797 -308 -243 160 -114 -376 -766 -548 -18 398 142 -378 -581 -640
2005 -640 -197 -12 433 277 -258 -575 -619 -480 259 591 221 -103 -513 -516 -39 380 384 -282 -311 -172 9 428
2027 428 413 -126 -100 -202 47 270 551 450 -316 -610 -198 251 573 282 74 -686 -758 -86 522 696 381
2048 381 -299 -540 -331 -88 714 135 -75 -312 -596 -26 377 335 -103 -574 -714 -511 72 611 262 -339
2068c39n12L96K75L36J8q5k79j130N58P10K58k85k14l53j42N21J71Q1n36k74j17
2089i42M76N44j30n4n99l42J18M34Q52n07k55o56K66K17N49J06j65l37n57J03
2109h79M06Q07k44l10l29m36M96M74M24m51n50O0J36L26L79J21p92q0k04O9J261
2130F84Q2n13o57l45L31M11O71j4n79o07p3M07L73P8p0k66l26K45K11L94k54o89
2152e06M8q3N58M22k7n24m61j1k38J225L04l95p52j35k54N25P55Q3k66n49n60
2173h41K60P58Q8k98n6n06K70K00L26K6l20n64L16J11N91J2o06r3m78K73Q84L47
2195G00j82o30q21l8P36M96LL08r16k54K5M95L8L50j85m96m9o4N20M5l8p93R9
2218f51M59Q3K94n39m61k66O13K13O23l00p58m11nP69M86K92k68n25p64M23K60
$$ plain form
2068 -339 -851 -455 -180 156 174 89 -190 -1320 -762 -52 206 -79 -293 -646 -788 -267 -96 -15 -551 -825 -942
2089 -942 -466 78 -52 -106 -705 -1047 -929 -495 357 -150 -405 -1061 -795 -578 -29 77 -88 -425 -982 -879
2109 -879 -473 334 90 -220 -549 -985 -489 -15 409 -42 -592 -532 -396 -70 309 430 -362 -442 -646 -577 684
2130 684 766 253 -404 -749 -418 -7 664 650 71 -536 -609 -202 171 249 179 -87 -413 -168 43 437 183 -506
2152 -506 -458 -541 17 439 412 -112 -573 -584 -822 403 707 312 -440 -575 -829 -304 451 534 268 -281 -841
2173 -841 -581 177 265 -33 -89 -595 -325 -125 201 227 -93 -657 -341 -230 361 373 -233 -326 -804 -531 353 700
2195 700 518 -112 -933 -971 -235 261 264 572 -344 -598 -573 -78 -40 310 125 -371 -420 -484 36 81 43 -750 -651
2218 -651 -192 -109 185 -354 -815 -1081 -468 -255 368 68 -690 -1101 -1106 -337 149 441 173 -352 -1116 -693 -433
2239d33M15N7M0o08M8L20j29L23k20o25L24O23L29k10o33j21J12L06M83L19m50
2260B70o83l35K58N00N56O4M4p47p20M14O43K95m1l04l76OK29K99k67j25J50j17
2282A3j26P32m1m97r0k43J68P73M03l49p59m88K47N47L79J24l31n25n80L54P42
2303D53L35l04m40l56J29K77R7J21lm43L5K87K37R7l14n61J25J35L76P09p25m38
2325a71p12J97O91L16K97m37q54k13R1Q50M91jl81n42l47M71K64J39L0l40k74
2346d35J61N13K57l43l16n00K48Q06J05L5o54k56k62M00J146l03l23l11n65j57
2366g54J055L21k5l52k61k73J60N21p3r0l26j96K56K95L3M1l41k17P5N37M88k17
2388F57m50l78R6K62M26K42n55j87k08j69O29M55j10l22m59j56N23J54N3q8j09
$$ plain form
2239 -433 -18 39 79 -529 -481 -161 -290 33 -187 -812 -488 135 464 254 -379 -500 -388 -82 401 720 270
2260 270 -413 -748 -490 10 566 630 674 -73 -793 -379 264 559 518 214 -162 -156 73 372 105 -20 130 13
2282 13 -113 619 578 81 -9 -252 -84 689 1092 743 -16 -504 -257 290 669 793 462 -63 -643 -289 453
2303 453 788 484 44 -312 -183 94 191 312 309 -134 -99 188 425 522 208 -353 -228 -93 283 992 267 -171
2325 -171 -883 -686 5 321 618 181 -673 -886 -795 55 546 545 164 -378 -725 -254 10 149 179 -161 -435
2346 -435 -274 239 496 153 -163 -663 -415 391 496 531 -123 -379 -641 -241 905 602 279 -32 -597 -754
2366 -754 301 622 597 245 -16 -289 -129 392 319 229 -97 -293 -37 258 291 332 -9 -226 -151 386 874 657
2388 657 207 -171 -75 187 613 855 300 113 -95 -264 365 820 710 388 -71 -227 296 450 503 415 306
2409C06l26M19k6L30k20n36P8%M37j7J1o65M61k70K07K67L32k63n67l21J59Q17
2431F13L62k90k60n92j22M43K52L13j51m68k66J05M63q8k55K4l53J86L59J29o8
2452C36l73l5q5L06K88k1n90j17M7J52M47Jm6k54R9o50M34L25Qk10j36J03K2K33
2476B84n3l00kJ2o3K27j13M6l58K04p7O4M59j14k75k02k79L53K00L98k46m30r1
2499c56k9K52M42j76k1l56l6L04p7L00J00k64K2k29J47j89L60k18L6j21L16M05
2521F12p8m45j43j21K4M68J84l91l7l57J93L01K03J79n08O0j01j54K83L21ml70
2543A19j53J22K7N51m30k30oK70l7J59j40k19k14lL08oK67j32n04J89j94J58O14
2566E16k02k40l13k25K57pM21l70K15k47k32J70Q8J29jl16m2L84l5j20o3l8j62
$$ plain form
2409 306 -20 399 373 703 483 -53 25 25 462 445 456 -209 252 -18 189 456 788 525 -42 -363 -204 613
2431 613 975 685 425 -167 -289 154 406 719 568 100 -166 -61 402 314 59 83 -270 -84 275 404 336
2452 336 -37 -72 -157 149 437 416 -174 -291 -244 -92 355 356 310 56 155 -495 -61 264 272 62 -74 29 51 284
2476 284 231 -69 -71 -59 -122 105 -8 38 -320 -116 -193 -129 330 216 -59 -261 -540 -187 13 411 165 -265 -356
2499 -356 -385 -133 309 133 112 -244 -280 24 -53 247 347 83 105 -124 23 -166 194 -24 12 -109 207 612
2521 612 534 89 -54 -175 -151 317 501 110 73 -284 -91 210 413 592 84 144 43 -111 172 493 489 119
2543 119 -34 88 115 666 236 6 0 270 233 392 252 33 -181 -184 124 118 385 253 -251 -62 -256 -98 516
2566 516 314 74 -239 -464 -207 -214 207 -163 52 -195 -427 -257 -169 -40 -41 -357 -399 -15 -50 -170 -233 -271 -433
2589d33L0K58K27k3l68R7r5J25L56m6J56m66j0J51k0K6N28n19r3R3j11M7N9O8
2613C7J85o55N82m35L80j34j11K05k43N41p6k69R9l77K6o4L97M03k38l72j90j61
2635d70O57o6J93l43n22N5J31L89Q1n5l90LJ22j20J30n9p6j65L65n2J65J1l4j09
2659a59k75J54P8M97l94n2K45j95J46o9N6J7m7k54K78Q7Mlp8M0j59Q7l2J00J8
2684I0N6P0J2q6j83N4J4j49L83o3K39m37j97l1J25j02K39J63k26j10r1j72K32
2707a70K1K04j37N0j16k05j01K78L18n2o6l98j68K83N3p3J12l27N33m88L12r3
2729b30j81J23q4K11j43O7j49P1K18j57J46o6j16Q8k53L89j39K68q8k84m8K64
2751i3J70j94O2p0m1j27L1L05j93j18o0J41K69J66k57K17l63o6K1J11j91Q2p0
$$ plain form
2589 -433 -403 -145 82 59 -309 -212 -307 -182 174 128 284 -182 -192 -41 -61 -35 493 -26 -119 -26 -137 -90 -31 37
2613 37 222 -433 149 -286 94 -40 -151 54 -189 352 276 7 106 -271 -245 -309 88 491 253 -119 -309 -470
2635 -470 187 121 314 -29 -551 -496 -365 24 105 50 -340 -337 -215 -335 -205 -264 -340 -505 -140 -192 -27 -16 -50 -159
2659 -159 -434 -280 -202 295 -99 -151 94 -101 45 -24 32 49 2 -252 26 113 117 114 36 76 -83 4 -28 72 90
2684 90 146 216 228 142 -41 13 27 -122 261 198 437 0 -197 -228 -103 -205 34 197 -29 -139 -230 -402 -170
2707 -170 -149 55 -82 -32 -148 -353 -454 -176 142 90 24 -374 -542 -259 -206 -279 -167 -494 39 -449 -137 -230
2729 -230 -411 -288 -372 -161 -304 -237 -386 -315 -97 -254 -108 -174 -290 -202 -455 -66 -205 63 -25 -309 -357 -93
2751 -93 77 -117 -55 -125 -166 -293 -262 43 -150 -268 -328 -187 82 248 -9 208 -155 -221 -200 -89 -280 -198 -268
2774b68k99K79j3Q4Q3J93m0q3k0k30J75L0j62K28l19J3M63k06mK69k35M7J75l40
2798a80K95k84J42k57N60j82k19L82l01K33j24M4J22k02L1n82M93m21K70J68m3
2819e5l6K7J6Q5O1Q5r4q3Mj36J54L7J73m95l9K84J89m10M14m16l2K42N7m1%L3
2845B4k91M03m06O0J66J20l24j4J82L18j95P3r3j52l9J45K2K66k89m8n0J6P5l
2869c4Ok91L77m4J34k47J88M8j64OJ17k54J88k30J97j12J53j03P4l31L70J67k96
2892h1j93K20J36p9j55J46N3k00j62K59j9j34M21k88K13J18j89k42K39o0RK59
2914B71Q7n34R2K17o4O5J99l79O5r7J42J14o7J25j24j46j20K93K39j08o6j37q8
2937b1j00MQ3Q5J16l74L24j26J89m5j61P9m4Q0J80k15p7O6J56k27J59q2K17k85
$$ plain form
2774 -268 -567 -288 -301 -217 -134 59 19 -64 -84 -314 -139 -109 -271 -43 -362 -349 114 -92 -96 173 -62 -15 160 -180
2798 -180 115 -169 -27 -284 276 94 -125 257 -44 189 65 109 231 29 60 -522 -29 -450 -180 -12 -55
2819 -55 -91 -64 -48 37 98 183 89 6 10 -126 28 65 238 -257 -296 -12 177 -233 181 -235 -267 -25 32 -9 -9 24
2845 24 -267 136 -270 -210 -44 76 -248 -262 -80 238 43 116 23 -129 -168 -23 -1 265 -24 -72 -122 -106 -31 -34
2869 -34 -28 -319 58 14 148 -99 89 137 -27 -21 96 -158 30 -200 -3 -115 38 -65 9 -322 48 215 -81
2892 -81 -274 -54 82 3 -152 -6 47 -153 -315 -56 -75 -209 212 -76 137 255 66 -176 63 3 12 271
2914 271 358 -176 -84 133 69 134 333 -46 19 -78 64 178 111 236 112 -34 -154 139 378 270 204 67 -21
2937 -21 -121 -117 -34 51 167 -207 117 -9 180 135 -26 53 9 89 269 54 -23 43 199 -28 131 49 266 -19
2961a9j05J21pK15o2r7j42J92K23l28K62k47m6j79J30J79j17K5m2l4k08K14J89
2984A17j79k16L62m23K63j89M92l01J34j88K71j81j14M90k75Lj88j6O8JK31jm0
3007A21k91l5M09k28l1L03m76J01L14k72J13j0j27N2j21N33p6m02K68r5n9n7J53
3030H7m4R0J66k01m16J93K35j4j52J59R3P6pl90R5PJ45M2J7q7n3J86j63k37J52
3055b1J23O5m2o2k52J34O2K09j80k35K90k24L49j77j32O9K98l43j25L40j42K6
3077C0p6R6J0O4k62L4J20N2P8J02j88r2J55nK80n94K61M3j23J14j48j42M42l01
3101e0J52p5O6L9l39K39r7j44J11J0m5M06K4j54k29P8K03l35K55J02j84k96J48
3124a15K62j14n4M4q6j32M26o1p8j02M0P5J62j85P0l64L58l59O2L80j96J45j12
$$ plain form
2961 -19 -124 -3 -10 205 143 46 -96 96 319 -9 253 6 -40 -219 -89 90 -27 -2 -44 -78 -286 -72 117
2984 117 -62 -278 84 -339 -76 -265 227 -74 60 -128 143 -38 -152 338 63 66 -122 -138 -70 -69 162 161 121
3007 121 -170 -205 204 -24 -55 248 -228 -127 187 -85 28 18 -109 -57 -178 355 279 -123 145 50 -9 -66 87
3030 87 43 133 299 98 -318 -125 110 96 -56 103 196 272 265 -125 -30 -23 122 164 181 94 41 227 64 -173 -21
3055 -21 102 167 125 63 -189 -55 7 216 36 -199 91 -133 216 39 -93 -24 274 -69 -194 146 4 30
3077 30 -46 50 60 124 -138 -104 16 68 146 248 60 -32 123 118 398 -196 65 108 -15 99 -49 -191 251 -50
3101 -50 102 27 93 132 -207 32 -65 -209 -98 -88 -133 273 297 143 -86 -8 195 -140 115 217 33 -263 -115
3124 -115 147 33 -21 23 -63 -195 231 170 92 -10 30 105 267 82 152 -212 146 -213 -151 229 33 178 66
3147F6n7R8p9K04L7l73J6k0J02m8j67K31N3j48l1K5K76q5J7P7j93k3J3J47J27
3172B65k58Q3J15m67M52J37l05M2k52L96j69q4J55p4l22J17J01qJ20k78J54L25
3194B45l51O8J74n5j37n2J70j03R3n6k57M26k76K19j7J39j64k63L57k26o9K80
3216A45K1m31L35OPJ5j93J32j59L79m07P7L86l85O3j18J08R4N7j31m5n3n1qL4
3241a22P6R7K2j01O9r1k27K74k25J02M88m53K15k49j21L27k17m3N8J71m1j85K24
3264D8J07k71j80Q7M16l18K95j55pJ19J8l4j70M0n5K91k17k21P8K49p6J49l51
3287a58J25LJ11k00K68k82L85K1n23L28o1k9j90K64K4j17Q8lk95K32j49J65Q0
3310H7K5J64l91P9n3J66K1j78j93N04k23j02r4K45k79J80O5RM2l78K51J20Q2k20
$$ plain form
3147 66 9 107 28 232 269 -104 -88 -108 -6 -54 -221 10 63 -85 -116 -91 185 100 117 194 1 -22 -9 138 265
3172 265 7 90 205 -262 190 327 22 64 -188 208 39 -45 110 36 -286 -169 -68 -76 44 -234 -80 245
3194 245 -106 -38 136 81 -56 -108 62 -41 52 -4 -261 165 -111 108 91 230 66 -197 160 -66 -135 145
3216 145 166 -265 70 76 83 98 -95 37 -122 257 -150 -73 313 -72 -9 -127 -19 75 132 1 -44 -97 -148 -156 -122
3241 -122 -46 51 73 -28 41 -50 -277 -3 -228 -126 362 -91 124 -125 -246 81 -136 -179 -121 50 9 -176 48
3264 48 155 -116 -296 -209 207 -111 184 29 22 141 159 125 -45 -5 -60 231 14 -207 -129 120 44 193 -158
3287 -158 -33 -30 81 -119 149 -133 252 273 -250 78 17 -12 -202 62 86 -31 57 54 -241 -9 -158 7 87
3310 87 112 276 -115 -36 -89 77 98 -80 -273 231 8 -94 -188 57 -222 -42 23 32 74 -304 -53 67 149 -71
3334g1L32k66J39m39K05P8j10J40j85J79M8J06l56L90k66N0k15K18q0L27j65R
3356F8Km9J05k13K37P8j21j24j00L3K0N3L5o8L8k03k9K57J13k68L4K84J1k10R7
3381H0O0k14M9K11j09K42k24j81K5J83n3j05K2J56l61J40R9R6J17k48n5J26J0
3404F6j05K70m76J64j09J00J39L9k05J16j91J39J6J41j23J32m7q3k58J21L53j83
3426A6J33l25J81j21L47q6J2k26j11J45j57J98KL67n74J98J62j70R5j07P9R2j69
3449a9l9O2rj42K20j75L03k88k57J44k2%K18j30K57j02o0K1N1j56J61j75M5qJ04
3474DQ5P4rk41N6K39q0o8J44q4k31N6R9K73r8j77j84q3K57J40j24R5k26q6J67
3499bj75K37J02j30J20j75K3K5pRJ52k77J24K56l27K28o9m58K07j49N50n5j90
$$ plain form
3334 -71 261 -5 134 -305 -100 -22 -132 8 -177 2 50 156 -200 190 -76 -26 -241 -23 -103 224 59 68
3356 68 70 21 126 -87 150 228 107 -17 -117 -84 -64 -11 24 -44 -6 -209 -238 19 132 -136 -102 182 193 -17 80
3381 80 140 -74 -25 186 77 319 95 -86 -61 122 69 -36 -14 142 -219 -79 20 116 233 -15 -70 56 66
3404 66 -39 231 -245 -81 -190 -90 49 88 -117 -1 -192 -53 -37 104 -19 113 66 -17 -275 -154 199 16
3426 16 149 -176 5 -116 231 145 157 -69 -180 -35 -192 6 8 375 -199 -1 161 -9 86 -21 58 150 -19
3449 -19 -58 4 -5 -147 73 -102 201 -87 -344 -200 -222 -222 -4 -134 123 21 -39 -18 33 -123 38 -137 -92 -100 4
3474 4 89 163 154 -87 -31 208 128 60 204 120 -111 -55 44 317 219 42 -142 -225 32 172 48 143 -83 -169 -2
3499 -2 -177 60 162 32 152 -23 0 25 18 27 179 -98 26 282 -45 183 114 -344 -137 -286 264 209 19
3522A9k9K27n1r7pO4K41j80m0k06k0j32L58k66k8r1K35j20L37k80o8J79l4J38
3546A49k15P5k85M39m56L59j14J21n6j83Mj22K41O61p82j33K49q4R3J23J39k7
3568A96m48L34r0Q6P3k48M6J27k48M5M6J55k69K46j2L2M1j05J23j82k00N5nK90
3592H8j75L3j57M4L93l60R5J01J50j27k41J10jK83j76j30J02p9K7M6p1q2K44o6
3616E1r6n1O5K23p3k76KJ56q1K85j77n9J40K58j46k87L82l80M1J72j43j4J15J0
3640A17k13K08J20l05P0OK60k16j4k4j84R1L1J07P8J62m38Q3o4r6L65K9l11o2
3664b00K36j66k00L35Lj18k61L63M9%p6l88R4J47M1K18k21J55k62L22j03Q8m3
3687A3M19m13Q4l71q0J89L08M0k35Mn0M4j15K15k09J88L4mk10N3K17j88q9N0J97
$$ plain form
3522 19 -10 217 166 69 62 126 367 187 147 -59 -79 -211 147 -119 -147 -238 -3 -123 214 -66 -134 45 11 149
3546 149 -66 9 -276 163 -293 66 -48 73 17 -166 -162 -284 -43 618 -164 -297 -48 -132 -39 84 223 196
3568 196 -252 82 -8 78 151 -97 -51 76 -172 -127 -81 74 -195 51 39 71 112 7 130 -52 -252 -197 -202 88
3592 88 -87 -54 -211 -167 226 -134 -39 62 212 85 -156 -46 -47 236 60 -70 32 -47 -20 26 -45 -127 117 51
3616 51 -45 -96 -31 192 119 -157 -155 1 -80 205 28 -31 109 367 221 -66 316 -64 -23 149 6 -8 107 117
3640 117 -96 112 232 -73 -3 3 263 47 33 9 -175 -84 -53 54 132 294 -144 -61 -125 -221 144 173 -138 -200
3664 -200 36 -130 -330 5 8 -110 -371 -8 41 41 -35 -423 -329 -182 -141 77 -144 11 -251 71 -32 56 13
3687 13 432 19 103 -268 -348 -159 149 189 -46 -42 -92 -48 -163 52 -157 31 65 61 -149 -96 121 -67 -156 -106 91
3712I1k23K10j96L18k28J1J05pOoQk53M12l63L13m09m7L58k26R8j69J24J49k30
3736a54J82k60L04M17l17l97l7L27N7o0j49K33k73J49l3L27l6l31j5J89j92L07
3758B38k61L8K4m41K38L05j40J96J32l30J94k20J83k68R1N5j67J99j37L47j40
3779A36O2l05k19r5M61K05k22Q8%Q1kp9r2m6j02q2L53J3k63O1J2J13J66p2J76
3804C48k31k28k57L46K01O4j52N3p4k4n6O5K24n50J16R5j03j79N97m59P7J00J31
3827A04j60K19l59l7K49j03J9K2K8j38j58n7N38j24k5j89M1o0j05K36Q7L05o68
3850c35J67K60%p0j5J85k72k57L88M3j39J66k35K29m27K40L33j91m9j32l0J7K52
3873A28n3L5j48k07J29J51J66J32o24J42M9J56M14l6k49k07J69l43L45k89K68
$$ plain form
3712 91 -132 78 -118 200 -28 -17 88 81 87 81 89 -164 248 -115 198 -211 -258 100 -126 -28 -197 -73 76 -154
3736 -154 28 -232 72 489 172 -225 -262 65 122 62 -87 146 -127 22 -11 316 280 -51 -66 123 -69 238
3758 238 -23 15 39 -402 -164 141 1 197 329 -1 193 -27 156 -112 -21 34 -133 66 -71 276 136
3779 136 198 -107 -326 -421 40 245 23 111 111 192 190 111 19 -27 -129 -211 142 155 -108 -47 -35 78 244 172 348
3804 348 117 -111 -368 -22 179 243 91 144 70 46 -10 55 279 -271 -155 -60 -163 -342 255 -204 -127 -27 104
3827 104 -56 163 -196 -233 16 -87 -68 -46 -18 -156 -314 -371 167 43 18 -171 -130 -190 -295 -59 28 333 -335
3850 -335 -168 92 92 22 7 192 -80 -337 51 94 -45 121 -114 115 -312 -72 261 70 21 -111 -141 -124 128
3873 128 75 110 -38 -245 -116 35 201 333 -291 -149 -100 56 470 434 185 -22 147 -196 149 -140 128
3894A28j22j57K44k02N64j84l15ok8%K14J63m33p9K09o2K3K95k89m4l9J74j33
3917g9Q1J56J73j00n38P3J79J74J96m93J4K3o8N05l22m2l34K49K05j13K86l68
3939a43p1l1P9J25L07r9j28J92l88oM47K1l09J38l43K40P6k2l19J08N8j74J68
3962g4RJ5M3r1lLk41M29q5O0m11J05L63M7j15k78j77Q5J10M6M38l63L5j85K61
3987B6J13J05l08J04O9m33L26k37K67M3j43n0R8L49p5m7m78K89j50L15R7m34J83
4010B9j22J26N5k4K56j47j47k42L51n8R5m3k96J18k58K00K01K30l73J75m8J22
4032B00K7N0k76J81k70J45R8J13k96P9k23L9K54J55LJ17o87L39J00p8j18J57o6
4055D3J19j01r1L33j85k93K92j98l9J04J76k59k18L36j44L41Q7p3k79qk55J45
$$ plain form
3894 128 6 -151 93 -109 455 271 -44 -50 -78 -78 136 299 -134 -213 -4 -66 -43 252 -37 -81 -120 54 -79
3917 -79 2 158 331 231 -307 -234 -55 119 315 -178 -164 -141 -209 296 -26 -68 -402 -153 52 -61 225 -143
3939 -143 -214 -245 -166 -41 266 167 39 231 -157 -163 284 305 -4 134 -209 31 107 85 -234 -126 -68 -242 -74
3962 -74 -65 -50 -7 -98 -101 -98 -339 90 5 65 -346 -241 122 169 54 -224 -401 -316 -206 -160 278 -85 -50 -235 26
3987 26 139 244 -64 40 109 -324 2 -235 32 75 -68 -118 -20 329 254 207 -271 18 -132 183 280 -154 29
4010 29 -93 33 88 64 320 173 26 -216 135 77 172 129 -167 -49 -307 -107 94 324 -49 126 78 200
4032 200 227 277 1 182 -88 57 155 268 -28 51 -172 -133 121 276 279 396 -291 48 148 70 -48 109 43
4055 43 162 61 -30 303 118 -175 117 -81 -120 -16 160 -99 -317 19 -125 216 303 230 -49 -57 -312 -167
4077a67J38K01k37p9K0O0K10j76J66k07j41k8K2JPL00R4l51P3L19k33j10j6l29
4101d63K10K74LJ27k04o4N8l32N10Mk80J35k71M0K6L19K01m40M3p8R3PoK31kl79
4127b38N73m39Q8q7J58o7L18j99k4J05m29K89j73J1o0L80p8j37j24L3k22L96M92
4150E66m09J41j90j82r8L95r1P6P2k69K7j31K54J82l41r9J3J08J87l3k9k29Q6
4173Fp2j79N22m1k78k02J79J28K55m11L8Q5o0L6j48J37J25J56l44K02k89L08k64
4196a11L07k10J35j73J86n3N9l45J56K78l57M20k81l55K52k85M91J36k37j05R6
4217DK05o75O21L0n6l39K36Om64R8K04J22q5Q5J8l65K73J5M8p3j79K85K05o0k95
4242a36p6m9JM5K57J6o5J10l08M16j40l5P8r8k41K46k5K72j78j33L4p5O8k58L59
$$ plain form
4077 -167 -29 172 -65 -144 -124 -64 146 -30 136 -71 -212 -240 -218 -217 -210 90 184 -167 -94 225 -8 -118 -134 -463
4101 -463 -253 21 24 151 -53 -117 -59 -391 119 123 -157 -22 -293 -253 -227 92 293 -147 -104 -182 -89 -82 -88 143 141 -238
4127 -238 335 -104 -16 -103 55 -12 306 107 83 188 -241 48 -125 -114 -174 206 128 -9 -133 -100 -322 74 566
4150 566 157 298 108 -74 -172 223 132 208 280 11 38 -93 161 343 2 -97 -84 24 211 178 149 -80 6
4173 6 -66 -245 277 236 -42 -244 -65 63 318 -93 -55 30 -30 6 -142 -5 120 276 -68 134 -155 153 -111
4196 -111 196 -14 121 -52 134 81 140 -205 -49 229 -128 292 11 -344 -92 -377 114 250 13 -92 4
4217 4 209 -466 155 185 129 -210 26 32 -432 -334 -130 -8 -93 -8 10 -355 -82 -67 -19 -92 -271 14 219 159 -136
4242 -136 -212 -261 -260 -215 42 58 -7 103 -205 211 71 36 114 16 -225 21 -4 268 90 -43 -9 -84 -16 -274 85
4267H5lj6L4n7J30J6k69j98N8K86J85J80l75J26j30L5j19J02K13k36K50k74o6
4290d3N4J57K6M2k22j55L68Q6j54Q0l23n3J51O30o45J0K18m19J41L46M8m2kk76
4314B3j13J68L39j14k23j43J07j74L0K54Q4m41j0L99l22J05J75o6m02O9r2N24
4336A77k28L3k55j6R2M71l14J42n7k48P0J06L01m23P1j66M8J31J81J8k71L02o9
4359I6k72L14J65k82R4k35m5L4Q9P9P1k36O0kK01J6K60j61m01m4J33K60oj40J15
4384A63l41J61K06k22J59j87j00K20Q9N7j3k16k00J5R0L01j4J8j71L0j92K99j34
4407A8j31J33k14mK0N74j00k6o39K48N51k35N5J99k09R7n17L78p6M0J34m72K54
4430G8j22K94J83j06j82k43K15M5q1K11K05k46k97K16J05j2k7J3m52K41p2J19
$$ plain form
4267 85 82 66 100 43 173 189 -80 -278 -220 66 251 431 56 182 52 87 -32 70 283 47 297 23 -43
4290 -43 11 168 194 236 14 -141 227 313 159 239 -84 -137 14 644 -1 9 227 -192 -51 295 343 301 299 23
4314 23 -90 78 417 303 80 -63 44 -130 -100 154 238 -203 -213 186 -136 -31 144 78 -324 -255 -347 177
4336 177 -51 -18 -273 -289 -197 274 -40 102 45 -203 -133 -27 274 -149 -78 -244 -196 -65 116 134 -137 165 96
4359 96 -176 138 303 21 115 -120 -165 -131 -42 37 108 -128 -68 -70 131 147 407 246 -155 -199 -66 194 188 48 163
4384 163 -178 -17 189 -33 126 -61 -161 59 148 205 192 -24 -224 -209 -119 182 168 186 15 45 -147 152 18
4407 18 -113 20 -194 -198 -178 396 296 270 -369 -121 430 195 250 449 240 337 -180 198 122 162 296 -176 78
4430 78 -44 250 433 327 145 -98 117 162 81 292 497 251 -46 170 275 263 236 249 -203 38 -34 85
4452H5J1O9k44PP9J52k5qn58K08q1K14J57k91P2%J58l57L43J40m0k52k25K99K76
4477A89k58k5k76j30K80q8N28m0j24k4m00M27J98J0j18m04J80J36k32K22k5j70
4499a44K7j59L44J43M2l0k92n7m3L26l0j03j4l79O37m36J76L7p4j01O7J3J16J25
4523A91mm34L17j54J65L57k98j39J68j55N1q7L39k49K06n13L12j22J41K9l12L52
4545A61k41rK95k23M3J7N0J75P8k99K18j42j30K56J87n1j32j64m6N1n9J79j42
4568G2L18n31J86J1J38l11J35j50j2K10K10j98k75M92j28N5j70K15l37K62k10
4589a8k11L8J66p0K26l8k60O9N12n58K12m3N6j97jR1J1R7p7j8k65K69L6j50k10
4614c33L43j46J22k9n8r1L47j88k10J58K01K9l77J16K23k21J85n3m7k4K02l20
$$ plain form
4452 85 96 165 -79 -72 7 159 134 126 -432 -224 -305 -91 66 -225 -153 -153 5 -352 -9 131 91 -161 -386 -87 189
4477 189 -69 -94 -370 -500 -220 -308 220 180 56 32 -368 59 257 267 149 -255 -75 61 -171 51 26 -144
4499 -144 -117 -276 68 211 253 223 -69 -126 -169 157 127 24 10 -369 268 -168 8 45 -29 -130 -63 -50 66 191
4523 191 187 -247 70 -84 81 438 140 1 169 14 65 -22 317 68 274 -239 73 -49 92 121 -191 161
4545 161 -80 -89 206 -17 26 43 93 268 346 47 265 123 -7 249 436 385 253 89 43 94 35 214 72
4568 72 390 -141 45 56 194 -117 18 -132 -144 66 276 78 -197 295 167 222 52 267 -70 192 -18
4589 -18 -229 -191 -25 -95 131 93 -167 -98 414 -144 68 25 81 -116 -117 -26 -15 82 5 -13 -278 -9 27 -123 -333
4614 -333 10 -136 -14 -43 -101 -192 155 -33 -243 -85 116 145 -232 -116 107 -114 71 18 -29 -53 149 -171
4636a71J79M7M20m75j00N5k18L66J2r2j93J5L81j94RJ11j20J49k82K17r3j42j4
4659a33o4K56J40J24O7m77J16L57l57j76M61k50k8K95o61J95L62R5j35j52q2K32
4681A85k03L13j67l45J57qL92l69j74K87j7o7o1K2J25K53j97l04J73p1M79k99
4703A04j7N2j2l26L9K02K30j63J59j05l2j98L33l53K12L5j64n7J15r0l00K33Q1
4726b2j66N2p2L37P1j96o5J02r0K5R5k36J25JL4M3j36Q4p4j90J11J64K3j5k29
4751b24O4P0k6J32l45K11p8K63j71o2J09L17m74J47n2K72l24j08Q3k50K62O9K74
4774A59n7K27m33J87Kk2J92l00k49N31l40k9PK20K2l5k19K02K75j09n7j38Q4k53
4798a33N9j2K17j47L9R4K65j97K85m70l65O17j59m8J65j40lk16K68j47J66N9k96
$$ plain form
4636 -171 8 55 475 0 -100 -45 -263 103 115 23 -170 -155 226 32 41 152 32 181 -101 116 23 -119 -133
4659 -133 -197 59 199 323 390 -87 29 386 29 -147 314 64 36 331 -330 -135 227 322 187 35 -47 185
4681 185 -18 295 128 -217 -60 -68 324 -45 -219 68 51 -16 -77 -55 70 323 126 -178 -5 -76 403 104
4703 104 87 139 127 -199 -160 42 272 109 268 163 131 -67 266 -87 125 160 -4 -61 54 -36 -336 -103 -22
4726 -22 -188 -136 -208 129 200 4 -61 41 -49 -24 71 -165 -40 -39 -5 38 -98 -14 -88 -278 -167 -3 20 5 -224
4751 -224 -160 -90 -116 16 -329 -118 -196 67 -104 -166 -57 260 -214 -67 -119 153 -171 -279 -196 -446 -184 -115 159
4774 159 102 329 -104 83 85 63 255 -45 -294 237 -103 -132 -125 95 117 82 -137 65 340 231 174 36 120 -133
4798 -133 -74 -86 131 -16 23 117 382 185 470 0 -365 252 93 45 210 70 67 -149 119 -28 138 197 -99
4821i9J96n3K13k71J27j82p6kJ65j52K15N6O7j63l8J30j35Q1q6k12N2L48m74O76
4845C83j15n02j10J30J88k7K12j47Kl64n8K02J83k91rR1N40k15Q8m53l5J97K72
4868A62k98K52M1k07j7J00j84M05k85j1M5rJj39L74k05m5J1Q3l2R9m48J20J90
4892Ck59M67N5l12j42J53l32L36J46j11L41n35r6R5N41m4j73j78j8k12j9K42q7
4915a39L60j06k34J57j95K17L9j37r2M29k70K94k91K1j35K01j77J53J69k32J34
4936A66j59N7j80K95J42j96p9j65N1K90k45L14r1j58j35K92n7j19p2L6J66j69
4958a6J56oq5j35k35L67J93L1l9m27J86k02J59J73J90j65k77j56L6N08o7m4p7
4981F8l72K11r6N0J34p1L2rJ69k33J6J03j66L3j51N17j40J1k79j89J43J50k1M37
$$ plain form
4821 -99 97 44 257 -14 113 -69 -145 -147 18 -134 81 137 204 41 3 133 -2 79 -7 -219 -167 181 -293 383
4845 383 268 -234 -344 -214 -26 -53 159 12 14 -350 -408 -206 -23 -314 -323 -232 308 93 181 -272 -307 -110 162
4868 162 -136 116 157 -50 -67 33 -151 254 -31 -42 3 -6 -5 -144 230 25 -20 -9 74 42 141 -307 -187 3
4892 3 -256 211 266 -46 -188 -35 -367 -31 115 4 345 -190 -286 -191 350 306 133 -45 -63 -275 -294 -52 -139
4915 -139 221 115 -119 38 -157 60 99 -38 -130 299 29 323 32 53 -82 119 -58 95 264 32 166
4936 166 7 64 -116 179 321 125 46 -119 -68 222 -23 291 200 42 -93 199 142 23 -49 -13 153 -16
4958 -16 140 134 49 -86 -321 46 239 270 231 -196 -10 -212 -53 120 310 145 -132 -288 -252 256 189 145 68
4981 68 -304 -93 -189 -139 -5 -76 -44 -53 116 -117 -101 2 -164 -131 -282 235 95 106 -173 -362 -219 -69 -90 347
5005C47o29J07k5K5K06l05P2k9L78j25j28R9j32RN5o1J86j31m6K3j78J06O6N3
5029e7K87l19K39m34K47j16K04J20l50L57l62j3k5J38K80n86L12r0M18j18J0p8
5051F4J68m13L95j40J71m5k85r2K61o7K21M2l05m6j21J94J70O9q9j70K74k02L80
5074D34k60l21L37j96J3n6L2M17l69R9j93K12N7j85k22K51J4j60K55j83k35n5
5096c14N87l33j46L39k32j02j29K9K50p0L70k72p5J12k9J17m61J05K35J07j09
5117b1j51J82j2l07J94N0j04N14n08Q2k15R2N0j25J47K71o5j3j42O4J85p7k02
5140a11j3J40R5j46R4K13l25M5J82p1N9l55j72M14k10M7L05j23J37k66P7j80J40
5163b4m3K68k27J98j26k81O9L16J22l16K16m09K25J94K31m20K2J08N2J03l73M7
$$ plain form
5005 347 -282 -175 -200 -175 31 -274 -202 -231 147 22 -106 -7 -139 -130 -75 -136 50 -81 -127 -104 -282 -176 -110 -57
5029 -57 230 -89 150 -284 -37 -153 51 171 -179 178 -184 -197 -222 -84 196 -390 -78 -168 250 132 142 64
5051 64 232 -181 214 74 245 200 -85 -177 84 17 238 280 -25 -71 -192 2 172 241 152 -18 256 54 434
5074 434 174 -147 190 -6 7 -49 -17 400 31 130 -63 149 206 21 -201 50 64 -96 159 -24 -259 -314
5096 -314 273 -60 -206 133 -99 -201 -330 -301 -51 -121 249 -23 -98 14 -15 102 -359 -254 -19 88 -21
5117 -21 -172 10 -2 -309 -115 -65 -169 345 -163 -81 -296 -204 -154 -279 -132 139 74 61 -81 -17 168 91 -111
5140 -111 -124 16 111 -35 59 272 -53 -8 174 103 162 -193 -365 49 -161 -114 191 68 205 -61 16 -164 -24
5163 -24 -67 201 -26 172 46 -235 -166 150 272 -44 172 -237 -12 182 413 -7 15 123 175 278 -95 -48
5185d8q0K66m1k4J72k40j27L47n7K0J91m74L2K2r9K19j13J04j45J7J74k46J08
5208b2J72J06R1l55L27j47k83L43l78J16J48m20K50j28L59j19j90L35l65K8K50
5229A18j28l17J07P9K28J30l57R0M3K7R3O6j40k06L36j74J33J43m08o5J70l7J43
5252G4R5l78M33j17m4j68J88k54K39m7m24K87j8j90L39P4ok10J85l05M6M40k23
5275A6j12r9L68l35M46k2m33J78j25P4j82j00M95j08L4k12Q4j01L54l65Q5j9O
5298g3N3J66j90j08P3L05L7l21M34j90Q3j78N4l8j40J11j2p7Ok5L07j69q7l3J3
5323Al67M62q2J6l2k36Q6K12J71j71J74k17K64k40k76K81J34k07O2J03J13l11
5345f0K30l25m7J93L30o9k5n6p5k38N94m0l82k8l8j28J23M9J64l39P2l7J53L68
$$ plain form
5185 -48 -128 138 97 73 245 5 -122 225 168 188 379 -95 -63 -41 -140 79 -34 70 -75 -58 116 -130 -22
5208 -22 150 256 347 -8 319 172 -111 232 -146 -30 118 -302 -52 -180 179 60 -130 205 -160 -132 118
5229 118 -10 -327 -220 -141 87 217 -140 -50 -7 20 113 179 39 -167 169 -5 128 271 -137 -202 -32 -69 74
5252 74 169 -209 224 107 63 -105 83 -171 68 21 -403 -116 -134 -324 15 89 83 -127 58 -247 -201 239 16
5275 16 -96 -195 173 -162 284 262 -171 7 -118 -44 -226 -326 169 61 95 -117 -33 -134 220 -145 -60 -79 -73
5298 -73 -20 146 -44 -152 -79 226 263 -58 376 186 269 91 145 107 -33 78 66 -11 -5 -30 277 108 21 -12 1
5323 1 -366 96 14 30 -2 -238 -152 60 231 60 234 17 281 41 -235 46 180 -27 35 138 251 -60
5345 -60 170 -155 -202 -9 321 252 227 171 96 -142 452 412 30 2 -36 -164 -41 8 172 -167 -95 -132 21 389
5369C89k79P%k08q1J72ROj73J27M3j03J85k11K40l75Q4r3Q0M8m9J21J3k21J36
5394a33O8M2M0k33J16p9J26J43j10j35J49j15j21J98P5j45j27M27j74l46N91r3
5416A64j07k10j5Q6l41M12o7Q6k45J66M6N26l16j18k32M21k12l48M23L7j90kj44
5439a80L4J41k23K15J03j40MJ09J29m1j17k75J41M27n44J83k41L49J75j66kk43
5461a62N8n0J97K50l61L40j73o5j69J31K89k44j89K37j29j05n5M09k61j02P2L25
5483B43m83K99k0N0j51q8J26k96N17l41J24J4k76J95l3j9K34k53J38k47L15k60
5505b12M19k57J54l00l7J46L5j73k47L67j90J09K01j40n0j80L46O9j66j32L91
5526A53k30P5n4j44O3J32k99J84j47K00K8j52RJ9j46L83j28K88k92O2l2j91J73
$$ plain form
5369 389 110 117 117 -91 -172 0 9 15 -158 -31 12 -91 94 -117 123 -252 -168 -261 -181 -133 -182 -61 -48 -269 -133
5394 -133 -65 -23 17 -216 -100 -179 -53 90 -20 -155 -6 -121 -242 -44 31 -114 -241 186 12 -334 257 164
5416 164 57 -153 -168 -82 -423 -11 -78 8 -237 -71 -25 501 185 67 -165 256 44 -304 119 156 -34 -36 -180
5439 -180 -146 -5 -228 -13 90 -50 -46 63 192 151 34 -241 -100 327 -217 -34 -275 74 249 83 81 -162
5461 -162 -104 -154 43 293 -68 272 99 34 -135 -4 285 41 -148 89 -40 -145 -200 209 -52 -154 -82 243
5483 243 -240 59 39 89 -62 -150 -24 -320 197 -144 -20 -6 -282 -87 -120 -139 95 -158 -20 -267 48 -212
5505 -212 207 -50 104 -196 -233 -87 -52 -225 -472 -105 -295 -186 15 -125 -175 -355 -9 60 -106 -238 153
5526 153 -77 -2 -56 -200 -137 -5 -304 -120 -267 -67 -39 -191 -182 -163 -309 74 -54 234 -58 4 -28 -219 -46
5549d6K11l74K23k48J44q4J73J07o9l05L87o9k2j6j13K74k22o8j4J82Rj77J10
5572gN8k8j44M32l12k29K15r4L36n11K41M6j88J52j63R5K32j2k71J41m0J22LQ1
5596A55k05j63P9R4J36J0j09m2k16J56K25j57l3K38r9J0l32J01J61j46Q0q9J66
5619B0J27q8j81j70K91j41J48M4l58L58j22J48n5K62m37R7l9j6K24j34p9q1K79
5642I7o9r5J1m04K79J46j09p2M0J22m27K62P7j36J05L27k25J76l39N11l67j9K06
5665I7m84L75j75J5p0M13k7J1k9j90J88j59K1j04k01O27n98N55k16j5q2M1q0K51
5689A64j97K58j68o5M3j80M15k56M8L7J90l48K88q5j72J77k5k6J16m34K76J97
5711B53j32M1n65M87nMK69k60k6J33j83r0K2j84P4Q6m62N91M9j15j11L2L89j15
$$ plain form
5549 -46 165 -209 14 -234 -90 -174 -1 106 37 -268 119 50 28 12 -101 173 -49 -117 -131 51 60 -117 -7
5572 -7 51 23 -121 311 -1 -230 -15 -109 227 -284 -43 3 -185 -33 -196 -101 131 119 -152 -11 -51 71 74 155
5596 155 -50 -213 -134 -40 96 106 -3 -45 -261 -105 120 -37 -70 168 69 79 -253 -152 9 -137 -57 -146 20
5619 20 147 59 -122 -292 -1 -142 6 50 -308 50 -72 76 21 283 -154 -57 -96 -112 112 -22 -101 -182 97
5642 97 28 -67 -56 -460 -181 -35 -144 -216 -176 -54 -481 -219 -142 -278 -173 154 -71 105 -234 277 -90 -109 97
5665 97 -387 -12 -187 -172 -242 171 144 155 126 -64 124 -35 -14 -118 -319 308 -290 265 49 34 -48 -7 -87 164
5689 164 -33 225 57 -8 35 -145 270 14 62 99 289 -59 229 144 -28 149 124 98 214 -220 56 253
5711 253 121 162 -403 84 79 83 352 92 66 199 16 -74 -52 -236 -162 -76 -538 53 102 -13 -124 -92 297 182
5735A82l80L04j5n5m6P3k73O79o70J09K47m04O15k46l55l7J48L19j44j30J61l57
5757b75J49nMK02pN8n9r8k27L31n8k16L31j85m5L40l79J75q7j87L09j17J16J7
5781H7n8j54M9k35L27n7l2R9j04P3J58p7J47n2l30L0Q9J82r9m1p1K35k91J98k90
5806b17J03J9Q0L5J67o5K5K7J30J3m22J53M2N5l8J13l00L33k77R1J48l38K04k9
5830E2j03L99l05K22k37J93P6k61k05r9K49N4k85M07j46k77L18j84K57j45j3L35
5852C02l46j08J39K6M17j18m14o0J73j9K40m0l11j4J88k9M7k6k82L54r3J32o6
5875I2k7mk09K46k74L20j57J14J16j59J50m29J32o6K47p8L6J4J82l17N9O1o8m2
5899f1O9J20k87K68l59K14j65J41k01M33J07p6J90m74J12K32n41K56j00J16M8
$$ plain form
5735 182 -198 106 91 36 -10 63 -210 469 -201 -92 155 -249 366 120 -235 -272 -124 195 51 -79 82 -275
5757 -275 -126 -131 -127 75 68 126 67 -31 -258 73 15 -201 130 -55 -100 240 -139 36 -51 -238 71 -46 70 87
5781 87 29 -125 -76 -311 16 -41 -73 26 -78 -5 153 76 223 171 -159 -129 -40 142 43 2 -69 166 -125 73 -217
5806 -217 -114 -95 -15 20 187 122 147 174 304 317 -105 48 90 145 107 220 -80 253 -24 67 215 -123 81 52
5830 52 -51 348 43 265 28 221 297 36 -169 -268 -19 35 -250 157 11 -266 52 -132 125 -20 -33 302
5852 302 -44 -152 -13 13 430 312 -102 -162 11 -8 232 192 -119 -133 55 26 73 47 -235 119 26 158 92
5875 92 65 61 -148 98 -176 144 -13 101 217 58 208 -221 -89 -155 92 14 50 64 246 -71 -12 49 -19 -61
5899 -61 8 128 -159 109 -250 -36 -201 -60 -261 172 279 203 393 -81 31 263 -278 -22 -122 -6 42
5920D2j31L02j35j27J47n8J12k24K30k2l16j71L45l1L01j52k14K21J18k44L84
5941C77m71o1K74r6k11K98N9O3l28n3M8K15J58j25j63k19L49k35K97j9k19J02
5963D0j44o8j15N33j63kJ39k33J63Q4p8L9j23N0j03K30R2j55L5m26J43K94l38
5986a06K07K73n28J26j05J38J28k00l0k9j8K6J11K74j81m0Q0p%k90J20k31R2K73
6010H3J0pk3m6l6L18l72n3K02k94J73O2k24Q0J47j34K56j44k37q5J55L9Q5j8l18
6035c81J0K45K30m01L65p8k8j35K06j36m8K01n1O1p3j04J04K1K9N9j77K39j43
6058A5N0p8j2K30j76N2J96l67K05l7k4P4o1j77K55l0l04N06j99m1Pl08K27J88
6082A91J6n9l03K43K1j26K63l44K16o7J56j65J23L4K1n38J09K00M62k79k76J91
$$ plain form
5920 42 -89 213 78 -49 98 40 152 -72 158 136 -180 -351 -6 -37 264 112 -102 119 237 -7 377
5941 377 -94 -155 119 23 -188 110 169 232 -96 -149 -101 114 272 147 -16 -235 114 -121 176 157 -62 40
5963 40 -104 -172 -287 246 83 81 220 -13 150 234 156 195 72 122 19 249 341 186 221 -205 -62 232 -106
5986 -106 101 374 -154 -28 -133 5 133 -67 -97 -126 -144 -118 -7 267 86 46 126 119 119 -171 -51 -282 -190 83
6010 83 93 86 63 17 -19 299 -73 -126 76 -218 -45 17 -207 -127 20 -114 142 -2 -239 -324 -169 -130 -45 -63 -381
6035 -381 -371 -126 104 -297 68 -10 -38 -173 33 -103 -151 50 -1 60 -13 -117 -13 8 37 96 -81 158 15
6058 15 65 -13 -25 205 29 81 277 -90 115 78 54 128 67 -110 145 115 -189 317 118 77 84 -224 3 191
6082 191 207 148 -155 88 109 -17 246 -98 118 51 207 42 165 199 220 -318 -209 -9 453 174 -102 89
6104H9k26L2J73j13K7P4k63j78P28j08l03K03k15q0L48l4k45j44K61N2l05RM40
6127B22k0m17J84O1J49j00k1J92j65k76K19k0k39K26k50R4J29J32nk77K79l45
6149b48L50j10K90m72J88k15J01j13L45j71J46n54L78Q4J20j95M0k20K84J96j49
6170G5l65J96L0J72J10m96J19L75j03O1m19L48L0j68m6P0K71k53q3K15j08J59
6192A90j0k59L58m10L52J39l20L35m51R1QK52j58j25O2O4k17L23j13J18k26j74
6214a71J29K42P8k28J31k47K03j43r2K87l67L85j83K1O3j39M9j57J67L04l92K05
6236A45k65J74Q6k04M02q5n7j24l25J69K39l0K7J8r2n3l22J50p1L31j90j22Q8
6259a11K7N8m5j34O83m96k60K23j44M47j10K4j83K50j66p8J65n2k44M73k62K46
$$ plain form
6104 89 -137 -105 68 -45 -18 56 -207 -385 343 235 -68 135 -80 -160 188 154 -91 -235 26 78 -227 -218 222
6127 222 202 -215 -31 30 179 79 58 250 85 -191 28 8 -231 -5 -255 -161 -32 100 95 -182 97 -248
6149 -248 102 -8 282 -190 -2 -217 -116 -229 116 -55 91 -463 -85 -1 119 -76 -36 -256 28 224 75
6170 75 -290 -94 -64 108 218 -278 -159 216 113 174 -245 103 133 -35 -81 -11 260 7 -76 139 31 190
6192 190 180 -79 279 -131 221 360 40 375 -76 15 23 275 117 -8 54 118 -99 224 111 229 3 -171
6214 -171 -42 200 278 50 181 -66 137 -6 -98 189 -178 207 24 45 108 -31 18 -139 28 332 -60 145
6236 145 -120 54 140 -64 338 253 196 72 -253 -84 155 125 152 170 78 25 -297 -147 -218 113 -77 -199 -111
6259 -111 -84 -26 -71 -205 478 -18 -278 -55 -199 248 138 162 -21 229 63 -15 150 98 -146 327 65 311
6281C11k75j78K16j39J2n5J22j9O5m23K49J12J63P7j07j52mj77J75j30M26k27
6303D2j31r3K21j7j19K35j24k03M32k57p0n0j89K83QK38l44K72l74K12Qo5j24
6326b09J72J51n5j61L59m54L08n2q2p5K91P2k51j06J51j52O3J83l15J90j03k8
6348a03P4J40j45M59j86k74k18K59K94m09k3K03j72L28l88R0K09r4j11J99j16
6369A6J48k21J23k3J8M8j68N38k91k32k2J58j69J51OK4K8j60J5j17N7K86p1m44
6393c02J17J24K44m84L15n1P3l3J2Q4l0j82m8O1M04l0k69j23k04K67r1J59K13
6416B26m26PJ95j47J53L2J68n5r0J06l90J48L28k3k85KK95m40K50j69r5J12j08
6439b06M07j36k7l5j24J70j1L22m24k27N43j94J2k76J15J09J89j50N9l9P0J57
$$ plain form
6281 311 36 -142 74 -65 -53 -108 14 -5 60 -363 -114 -2 161 238 131 -21 -25 -202 -27 -157 269 42
6303 42 -89 -182 39 22 -97 138 14 -189 243 -14 -84 -134 -323 -40 -32 206 -138 134 -240 -28 -20 -85 -209
6326 -209 -37 114 59 -102 257 -197 111 59 -23 -98 193 265 14 -92 59 -93 -30 153 -162 28 -75 -103
6348 -103 -29 111 -34 425 239 -35 -253 6 300 -109 -132 71 -101 227 -161 -71 138 44 -67 132 16
6369 16 164 -57 66 43 61 109 -59 479 188 -44 -66 92 -77 74 80 104 132 -28 -13 -130 -73 213 142 -302
6393 -302 -185 -61 183 -301 14 -37 36 3 15 99 69 -113 -161 -100 304 274 5 -118 -322 -55 -146 13 226
6416 226 -200 -193 2 -145 8 40 208 153 63 169 -221 -73 255 232 -53 -51 244 -196 54 -115 -210 -98 -206
6439 -206 201 65 38 3 -121 49 38 360 -64 -291 252 58 70 -206 -91 18 207 57 116 77 147 304
6461C04m44N58l90R5j32M4J12k37L87l45k9Jq7J1L69K69m74m0J52q5k58J87q2
6484a14Q8p0K54k18L14k61o3p9L11l82K80P4L4j34L7k25J37j54j85M99j21K93
6506C15l33k3l54K79J77L13n37K70l31K31l6K9L29k11q9r9J71L5p5m4J07l8j78
6529i2j53K86L2r1J89j75j04Jn7L16n17M31j71j42L49j95J55k42n8K25j61K76
6551A02J16k31J78m8l19J72q6J94m6l92Q0M33k52K61j76j77M99j75O3l76K93j68
6573e5K8N3L27m88M15l26P4O1k0j94J81K41l15N1k8J58m3N0LJ00m05K15j51J03
6597C5R8k4j21M8j71K10k16J58k6j34M97r5m60J83Q5k48K28J09k55K06k9K2j02
6620bj01J91j8m4J95k25J9k24L56j5j55J20NP8N1l26M7l68L47K35J22m24l8K01
$$ plain form
6461 304 -140 418 28 123 -9 35 147 -90 297 -48 -77 -76 -163 -152 217 486 12 -28 124 39 -219 -32 -114
6484 -114 -26 -96 158 -60 254 -7 -70 -149 162 -220 60 134 168 34 71 -154 -17 -171 -356 143 22 315
6506 315 -18 -41 -395 -116 61 374 -163 107 -224 7 -29 0 329 118 29 -70 101 136 61 17 124 86 -92
6529 -92 -245 41 73 -18 171 -4 -108 -107 -164 152 -365 66 -105 -247 102 -93 62 -180 -238 -13 -174 102
6551 102 218 -13 165 117 -202 -30 -116 78 32 -360 -280 153 -99 162 -14 -191 308 133 196 -180 113 -55
6573 -55 -27 26 353 -135 280 -46 28 89 69 -125 56 297 -18 33 5 163 120 170 173 273 -132 83 -68 35
6597 35 133 109 -12 36 -135 75 -141 17 -9 -143 354 259 -201 -18 67 -181 47 156 -99 107 78 100 -2
6620 -2 -103 88 70 26 221 -4 15 -209 147 132 -23 97 102 180 231 -95 -48 -416 -69 166 288 -136 -174 27
6644B7m8j72M5L72l01J81j79J40M4k72k0R2M5P1m2n4k7J8K43j19j15N4J86j58
6668A1l6K66l52n9J37LK7l62O29n27qQ4J30m2m7J86l78M63k37J88l35K72O2j87
6692a12N3j60J15J64k11K76J31j33j01k20L76k02Nl1L81l42o4K56j00K30k88L6
6714E9K43l66RLJ2R3k25m7O5L37J16l21K77k54l36N56k28j88M28r1j95K49j83
6737A3K1J58m4l20K91R7o4j47l1Q8r5j49J07J64m87L89M5q0j28L3k3J61k75QK37
6762c1k11K07J6pk75K20j01K73l54K83j74J04j10K50k43o7K13j02J5J8Q6l5OL1
6786A2j96J64j05k3J37j21L6O8m5J83j73k90M26M6j9k94j6N3J47J67k80J97k92
6809b18k5NJ88N1l47L14q8L73n93L28n5N2J98r3r5J74j12j06J12m1k28l9K42K25
$$ plain form
6644 27 -21 -193 -148 224 -77 104 -75 65 109 -163 -183 -91 -46 25 -17 -71 -98 -80 163 44 -71 -17 169 11
6668 11 -25 241 -111 -170 -33 -30 -3 -365 264 -263 -271 -187 -57 -99 -146 40 -338 125 -112 76 -259 13 75 -112
6692 -112 -59 -219 -104 60 -151 125 256 123 22 -198 178 -24 -19 -50 331 -11 -75 181 81 311 23 59
6714 59 302 -64 -55 -52 -40 53 -172 -219 -154 183 299 -22 255 1 -335 221 -7 -195 233 142 -53 196 13
6737 13 34 192 148 -172 119 216 152 5 -26 62 -33 -182 -75 89 -398 -9 36 -44 -172 -139 -162 -1 -276 -268 -31
6762 -31 -242 -35 -19 -26 -301 -81 -182 91 -263 20 -154 -50 -160 90 -153 -220 -7 -109 -94 -76 10 -25 -19 12
6786 12 -184 -20 -125 -148 -11 -132 -96 -28 -73 110 -63 -353 73 119 100 -194 -210 -157 -10 157 -123 74 -218
6809 -218 -243 -238 -50 1 -346 -32 -120 253 -340 -12 -67 -15 183 90 -5 169 57 -49 63 22 -206 -245 -3 222
6833B22J31k45J5K7r0K4Q3m4k31L28k09j8J09K17l32K32L2j57k3k6l20J45r8J90
6857c8J04L4mj16o0J28m00L43l9o1K4J4L8l5L49m72K13Q9jj38R4j4K18m3l06L03
6883B24m01L53P8j48k6K9n3j47k43L09k14K76k30n4J30K43l27L48j27l73L32J05
6905H4j34n4q6p9J44J78L3m35K20J53m9j25L8j11J34J14j32J21J42j57m5m28O23
6928A49nj90r4J43k4j56K23j21mK76m50L77j78K8K7P8j11j15L5j91J43R0J53J10
6952A93l30J37N6m9j13J96J2J4J79l09O3k52L62j39J08L5qj00m05L28j32L0K34
6975A10j69N0j48J83j8J6o8j40j9K00KK95r6K6k01Rk00M9J44k38n3M53j58p6Q9
7000D2m8m5Q7m1l5j79J82L5j92K09J10J54k59r9N9K9k30M75l63j2JK35R1j98j93
$$ plain form
6833 222 353 108 123 150 60 84 167 123 -108 220 11 -7 102 319 -13 219 251 94 71 45 -275 -130 -228 -38
6857 -38 66 100 96 -20 -80 48 -352 -9 -48 -109 -85 -71 -33 -68 281 -191 22 111 110 -28 66 52 270 227 -79 224
6883 224 -177 176 254 106 80 109 56 -91 -334 -25 -239 37 -193 -247 -117 126 -201 147 20 -353 -21 84
6905 84 -50 -104 -190 -269 -125 53 86 -349 -129 24 -25 -150 -112 -223 -89 25 -107 14 156 -1 -46 -474 149
6928 149 144 -46 -140 3 -21 -177 46 -75 -79 197 -253 124 -54 -26 1 79 -32 -147 -112 -303 -160 -70 83 193
6952 193 -137 0 56 7 -106 90 102 116 295 -14 49 -203 159 20 128 163 155 55 -350 -22 -154 -124 110
6975 110 -59 -9 -157 26 8 24 -44 -184 -203 -3 -1 294 198 224 23 32 -168 -119 25 -213 -266 187 29 -47 42
7000 42 -6 -51 36 -5 -40 -219 -37 -2 -194 15 125 279 20 -79 -20 9 -221 254 -109 -121 -120 115 206 8 -185
7025a85J27P8j47j29L21J11l77M25m87P7J32J0O3p2l03M13m64L53J24O1j17q3
7047f9n1j16J90k74K47J01J25l35m8k2J95R8k53N2R9K4M3k34K34O3k08k89O08
7070A80J76j28j15K1j31J9o1k6J50j80r1J07M29m17J58k72L6M5J0K50k58J0K05
7093A17j05j1j0J24j31j73K12J86k73J69j38j56L13L7k05P9j32k3P2M8N1k04M09
7116B56m0l19J22J80n32O34N9k32j53k33L17J04k16K7j11J9L48j41p9J10j27N6
7138D9j64K31r5k9K65k60J89j92J47k35K01J00l99r2K05R5j00J62j62O7J6N6j81
7161a26rN2Q5j97K71j1j28j39o9K67m27M45J24j2j28k51L78j8l20L31j95j16L17
7184A24j68M1J87o9l74P6o7K44k76J58L49m74J05J73j62K9K34j52j5q9K64j65
$$ plain form
7025 -185 -58 20 -127 -256 65 176 -201 224 -263 -186 -54 -44 19 -53 -356 57 -407 -54 70 131 14 -69
7047 -69 -120 -236 -46 -320 -73 28 153 -182 -230 -252 -57 41 -212 -160 -61 -37 6 -228 6 69 -139 -428 180
7070 180 356 228 113 134 3 22 -39 -65 85 -95 -186 -79 350 -67 91 -181 -145 -100 -90 160 -98 -88 117
7093 117 12 1 -9 115 -16 -189 23 209 -64 105 -33 -189 124 161 -44 35 -97 -120 -48 0 51 -153 256
7116 256 216 -103 19 199 -333 301 360 128 -25 -258 59 163 -53 -26 -137 -118 230 89 10 120 -7 49
7138 49 -115 116 21 -8 257 -3 186 -6 141 -94 107 207 -192 -284 -79 16 -84 78 -84 -17 -1 55 -126
7161 -126 -135 -83 2 -195 76 65 -63 -202 -271 -4 -431 14 138 126 -2 -253 125 107 -213 118 -77 -193 124
7184 124 -44 -3 184 115 -259 -183 -250 -6 -282 -124 225 -249 -144 29 -133 -104 130 -22 -37 -126 138 -27
7206b7J84j23J6O9j72K47o7j32k3q4J85k96j1P4j4J31k62K19J18O4N0lk65L00
7230A78j03J23NK03n38J66k78L23k9o5j46J37l5l6j10K46J27k66J28J05J01k52
7252a6K9K64l41R7J35P0j82Mm4Q0K03k9k25J01r0k12L14p2q2k16M11m39L63l27
7276b04K49l21K69j0k36M19j63r2J27Q3l30l0K13RQ3j66j55L49q9M1j69J67l64
7299c20M80k51N6J37N5k87k0LJ07K38j11k26J08p4J66k71J49R4k4j24J22m5o0
7322i8L98l83l1J26N3l3pn2p1M4k9j24J73j55R4O4MJ64l14L77j15j46K62k18j68
7347a85K97k41R4J24m9r0n7m4L05j61L1L2l00L81m30N62m82L75M2l42K39k68M15
7370B48l43N70p74K30R6M7k40L15K57m89K2K69ml12J86M6N8k7m69K33L77j64k04
$$ plain form
7206 -27 157 34 50 119 -53 194 127 -5 -28 -112 73 -223 -234 -160 -174 -43 -305 -86 32 96 146 143 -122 178
7230 178 75 198 203 406 -132 34 -244 79 50 -15 -161 -24 -59 -95 -205 41 168 -98 30 135 236 -16
7252 -16 13 277 -64 33 168 238 56 60 16 96 299 270 45 146 56 -156 158 86 4 -212 199 -240 123 -204
7276 -204 45 -276 -7 -17 -253 166 3 -89 38 121 -209 -239 -26 -17 66 -100 -255 94 5 46 -123 44 -320
7299 -320 160 -91 -35 102 157 -130 -150 -147 -40 198 87 -139 -31 -105 61 -210 -61 33 9 -115 7 -38 -98
7322 -98 300 -83 -114 12 65 32 25 -27 -98 -54 -83 -207 -34 -189 -95 -31 -27 137 -177 200 85 -61 201 -17 -185
7347 -185 112 -129 -35 89 40 -50 -107 -151 154 -7 24 56 -244 137 -293 269 -213 162 204 -138 101 -167 248
7370 248 -95 475 -299 -69 27 74 -166 149 406 -83 -61 208 204 -108 78 124 182 155 -314 -81 296 132 -72
7393g2m2J64Q7j48k76L3L12j12J8K6k06L43j11M7j12n8oJ82o7k5l7R4j87O8J03
7418A8k40K43J37l1n3N8p8k58K54k40P7O1j4NJ82m34O4P6K43k22J93j74L37q9
7442A15J42j23p6K51j13L2k28r7k48K27J49Q3j39O9j18K4J65j20K1K02l40J25
7464Cj31J76k3j3J03j8J4K4K6k29N3j84K82j3P3j20p9R9L3j71k9j22L50K46n44
7489a94L78k79kj62N02l16n2K23j6k0J24O8l89K04o5J76k39K52N5m16K49J31p0
7512A42Jj63j73J39k9K61k61kJ49j13K56k0k27J51K15j44k43J33q6l3P6j12K28
7535A45l29j80L78Mq9M9J66l01K72q6k30L78j26pKp0j37J68O5j23Jq7N1k3N3J22
7561F6k27M2L4J61ql10L76q4j2K7k60M63j97J00k91K61J00l90K67j07K8j38K51
$$ plain form
7393 -72 -114 50 137 -11 -287 -254 58 -54 -36 -10 -216 127 16 63 -49 -107 -113 69 2 -23 -60 34 -153 -85 18
7418 18 -222 21 158 127 74 132 54 -204 50 -190 -113 -52 -66 -61 121 -313 -249 -173 70 -152 41 -133 204 115
7442 115 257 134 58 309 196 228 0 -97 -345 -118 31 114 -25 44 -74 -50 115 -5 16 218 -122 3
7464 3 -128 48 25 12 115 97 111 135 161 -68 -15 -199 83 70 143 23 -56 43 76 -95 -124 -246 104 350 -194
7489 -194 184 -95 -97 -259 243 -73 -125 98 82 62 186 254 -135 69 4 180 -59 193 248 -168 81 212 142
7512 142 143 -20 -193 -54 -83 178 -83 -85 64 -49 207 187 -40 111 326 182 -61 72 -14 -47 29 -83 145
7535 145 -184 -364 14 18 -71 -22 144 -157 115 29 -201 177 51 44 46 -24 -161 7 72 -51 -50 -137 -86 -109 -56 66
7561 66 -161 -119 -85 76 68 -242 134 50 38 65 -195 268 71 171 -120 141 241 -149 118 11 39 -99 152
7584A52q1M1p0O0l44K0P3J62J16j26r5M1j97L07l2J03l59J62J17j49J66R9k26
7607f0Q9l43K12J54R1m6l88L06K30j45j3ql21M81l73j76O04l24r9L69j52l11M48
7630B25lk08n3M7k00K80N8j49n8j21K08l25L13Q3j07M3k62L48n5k1j31mj0J20
7654A8j20L25j96K9k10Q7K8o3j66J87q7k7J1K10k77pM11j79K52m1J67j05l82K85
7678A50j36m72O49m08r2J18J17M3k92J31P7j61K71j90L9M67l03R6q4nj17J60J03
7701A61k16j59mJ19J15R3j22j73Q4L52p6j16l0P4l42K62j10J29K52o31L53K42
7723B57k66N6k44M9K89k01O8J57p8n2j95J28K18m7l74N61l18J06m89O42j71l7
7745E9k2r5LK28L5m09L14K5l23LL31q9K13K3j77m47N14j25j31M8j69L77k76j93
$$ plain form
7584 152 71 112 42 102 -242 -222 -149 13 129 3 -92 -51 -248 59 27 130 -229 -67 50 -99 67 166 -60
7607 -60 29 -314 -102 52 143 97 -291 15 245 100 87 79 -242 239 -134 -310 294 -30 -129 240 88 -223 225
7630 225 222 14 -39 8 -192 88 146 -3 -61 -182 26 -299 14 97 -10 33 -229 119 64 43 -88 -92 -102 18
7654 18 -102 223 27 56 -154 -67 -39 -102 -268 -81 -168 -195 -184 26 -251 -258 153 -26 226 185 352 247 -135 150
7678 150 14 -458 191 -217 -309 -191 -74 -31 -323 -192 -115 -276 -5 -195 -156 311 8 104 20 15 -102 58 161
7701 161 -55 -214 -218 -99 16 109 -13 -186 -102 250 174 58 28 102 -240 22 -88 41 293 -338 15 257
7723 257 -9 47 -197 -148 141 -60 8 165 87 35 -160 -32 186 139 -235 326 8 114 -375 267 96 59
7745 59 37 -58 -55 173 208 -201 113 138 -185 -182 149 60 273 296 119 -328 186 61 -70 -22 -191 186 -90 -283
7769b83K75P7m8J78m6n36P58m29j2J59p6l11M83l02n2K05R1j89K22j64J22l19
7791a97L33j85J68j78J1J53k07J77l40L94l22J39J51N7P4k81NJ37J43n32L0K38
7813c2j23K61r8J2L8j23j31L41j17j01J85j54k17R6J36R1j68j33J33QM5J22J26
7836A97j16j86N1j12J06j79K7J33o8rJ22M5N2l76K16J15k09K25K11k02K61k77
7858B7L0p3m20M80m6k5j82L89Qk45n1K08P6Pk68O3O3O3k98P4K71k96K94l20K14
7883D3J37j04j13q7k6J53Q1l58L71k82J20n7K32j39K0L54l82M9j07j51J29J31
7905A4j7k02n6L30J13j40Q5j54L6o8K93j07J30l45J68j19K65l56J13m%K09k07
7928a9J20m9nJ37l54K17l7K44l76q9O6L25l38K18M8k40J94nL9K00p6k16k5J63
$$ plain form
7769 -283 -8 69 21 199 153 -383 375 -54 -66 93 17 -294 189 -113 -165 40 131 -58 164 0 122 -197
7791 -197 136 -49 119 -59 -48 105 -102 75 -265 129 -193 -54 97 154 228 -53 -48 89 232 -300 -270 -32
7813 -32 -155 106 8 20 58 -65 -196 145 28 -73 112 -42 -259 -163 -27 64 -104 -237 -104 -96 -51 71 197
7836 197 81 -105 -54 -166 -60 -239 -212 -79 -147 -156 -34 11 63 -313 -97 18 -191 34 245 43 304 27
7858 27 57 -16 -436 44 -2 -27 -209 180 188 -57 -108 100 176 183 -85 -22 41 104 -194 -120 151 -145 149 -171 43
7883 43 180 76 -37 -124 -150 3 84 -274 97 -185 -65 -122 110 -29 -9 345 -37 12 -95 -246 -117 14
7905 14 -3 -205 -261 69 182 42 127 -27 9 -59 234 127 257 -88 80 -39 226 -130 -17 -21 -21 188 -19
7928 -19 101 52 47 184 -170 47 10 254 -122 -211 -145 180 -158 60 108 -132 62 57 96 296 220 4 -21 142
7952A42o2l6j69L08pm04N37k79N8N0k32j28K99OJ5l02M56k53j54L52j35o9J27
7975A20k1L3p8j94J0L07r8j80J53l67L62q5Q9K6l4M9n0R4p2o4J32m34J94K73k81
8000a16m9J30K16l59Q1K36J9k10J22l63K55K61l44L80j03j23Q0M5k7j14j24M8
8022e9J63j14J3J61k74j07K48r6l2L37J6j56k45L48j63n3j6K7J11r1k47M51k65
8045d3N4K55l40JJJ61O6k32K15k6Q4j83j7q9pJ54K5mj48M2N1J08q1m9J16l05J55
8072c6l63O50k09m9q2Q5M8j25M8k70L02j55K57r9Q4o2K18j55l5J81k33r3MK20
8096A31P0j40O9L5r3o2J42K03l52K1R7k37J68J8k68J97J69j04n8K1L5l22K70K27
8120B37J40n24P0R8O6n1O9Mk38J72Q5k31M0J62q4n7r9o0K49j53m7n8J25K80n43
$$ plain form
7952 142 80 44 -125 183 176 -228 309 30 88 138 -94 -222 77 83 98 -204 252 -1 -155 197 62 -7 120
7975 120 99 132 54 -140 -130 177 79 -101 52 -315 47 -38 51 77 43 92 42 136 64 0 132 -302 -108 165 -116
8000 -116 -165 -35 181 -178 -97 139 158 -52 70 -293 -38 223 -121 259 156 33 113 158 131 17 -107 -59
8022 -59 104 -10 3 164 -110 -217 31 -65 -97 240 256 100 -145 203 40 -13 -29 -2 109 18 -229 222 -43
8045 -43 11 266 -74 -73 -72 89 155 -77 138 112 196 13 -4 -93 -100 54 79 75 -73 -31 20 128 47 -2 114 -191 -36
8072 -36 -399 251 42 -7 -89 -4 44 -81 -33 -303 -1 -156 101 2 86 24 242 87 52 233 0 -93 -89 131
8096 131 201 61 130 165 72 10 152 355 3 24 121 -116 52 70 -198 -1 168 64 6 27 62 -260 10 237
8120 237 377 -147 -77 21 87 36 105 109 -129 43 128 -103 -63 99 15 -42 -141 -201 48 -105 -152 -210 -85 195 -348
8145c48L32L6j54jK14l0m3k53L0Q2j92Q2q0J96L08j76J30j67K07O5r0l09K55k07
8169a13K66m19L10K0p9L0ko4n2J27j35J02J25j59k2o9R7q0N65o04K42k30
$$ plain form
8145 -348 -16 20 -134 -135 79 49 6 -247 -217 -135 -327 -245 -325 -129 179 3 133 -34 173 238 148 -161 94 -113
8169 -113 153 -266 44 64 -15 15 13 -51 -103 24 -111 -9 116 -43 -65 -134 -37 -117 448 -156 86 -144
8191a44
$$ Imaginary data points
##PAGE= N=2
##DATA TABLE= (X++(I..I)), XYDATA
0@%%%%%%Qj6J6k4L2l2M0n6O9q2R9j18J38j62J92k24K58k98L44l94M49n11N79o54
30c47P38q29R31j043J163j298J446j606J784j980K192k427K687k974L296l656
46a923M059m516N039n646O360p210Q247r542J1212j3468J6701k1757L0873n2540
60c4111J97774K39912k04251j59021r3580R4380J35295J07117m3429j30879j35916
71b6709p873Q9669J10521J7353p3256j16581n5500M3630J13143O2571n2071j31213
83b6316q1669L5933J21177R1797j4254j12478j14626k3121R0338J24298N6267
94A47346n4450j13206q0139J5420R4734J01604K8258o6868j01195m0609N4413
105a4692R4975M8604l1889p1495m1236K5721O7963M7089j7724o2663m4191J7195
$$ plain form
0 0 0 0 0 0 0 0 8 -8 8 -16 16 -16 24 -32 37 -45 54 -64 74 -88 104 -120 138 -160 184 -210 239 -272 307 -347
30 -347 391 -438 493 -550 613 -685 761 -845 939 -1041 1151 -1276 1411 -1563 1733 -1923
46 -1923 2136 -2380 2659 -2987 3373 -3837 4410 -5132 6080 -7388 9313 -12444 18429 -34111
60 -34111 163663 403575 199324 40303 -53277 41103 176398 283515 240086 109207 -26709
71 -26709 -34582 55087 165608 182961 109705 -6876 -62376 -18746 94397 156968 104897 -26316
83 -26316 -107985 -72052 49125 140922 126668 14190 -100436 -123557 -33219 91079 147346
94 147346 92896 -20310 -100449 -85029 9705 111309 139567 72699 -28496 -69105 -14692
105 -14692 80283 128887 96998 25503 -15733 9988 77951 125040 107316 44653 462 17657
117A7657O0052N1315L656m7734o5795l1403L7094P8993M9200k6363p7704o2242
129a3274N77N7803O2966J3292m7111o3115k2631K7282L9507J3701j7401k9827
141B1769j9591L853K2385J6533j0825l3293k4402Q633L5107K9640o013m2112m4170
154d2486o350M0342N0966J4631l4226m8130k0565J9283L8074K6593j918k5586
166A0628k6813n242K0807K7180R217j4965k2139o796J7269K7790J1871k0304l5043
179f540j1898K7948M1744J6576k2690m0438k4413J0375L7738L4599L042l0535
191C5508l8863j5783J6681L5163K5593n293l4125l4645k428L0468L1643K46k8874
204A5291k8931l294K2429K5816M115k3017k9346r610J7462K8663J4963j0580k9691
$$ plain form
117 17657 77709 129024 132680 84946 19151 -12252 24842 103835 153035 126672 48968 -13274
129 -13274 -12697 45106 108072 121364 74253 11138 -11493 15789 55296 68997 51596 21769
141 21769 2178 6031 28416 44949 34124 831 -23571 -14938 20169 49809 43796 1684 -42486
154 -42486 -48836 -8494 42472 57103 22877 -25253 -45818 -26535 11539 38132 36214 10628
166 10628 -16185 -21427 -620 26560 35777 20812 -1327 -8123 9146 36936 48807 28503 -6540
179 -6540 -18438 9510 51254 67830 45140 4702 -19711 -9336 28402 63001 66043 35508
191 35508 -3355 -19138 -2457 32706 58299 53006 18881 -15764 -18192 12276 43919 44165 15291
204 15291 -13640 -16934 5495 31311 35426 12409 -16937 -26547 -9085 19578 34541 23961 -5730
217e730k7066j926K7164L5836J1857k4553l9884j9500J7097L6347K3647o870k9354
230b935k5411p17K2379K3695N173j3668j8843q777O633J8199J4412k980j9514
243b354j7363K870K1931J9450o31k1005k1612l046J8381K3868Q069j4828k2370
256h640j1011O655J6492J4718L453j1275j8451j0617O660J7573J2578k466j5212
269D57j3760k57J2307J1847k71j0376q935J496P977M781j282m055l883k393J517
284d830N822N882j34o946p963k059O966R492M934m990j0322n307M100Q115L302
299F062j528j884j503j993k116K87L790M144J069l277m089k523J446L819J885
314C589j535j174M96K00l112k156J978M421J083l214m043M73K690J767j075l543
$$ plain form
217 -5730 -32796 -34722 -7558 28278 40135 15582 -24302 -43802 -26705 9642 33289 26419 -2935
230 -2935 -28346 -29063 -6684 17011 22184 8516 -10327 -19104 -12471 5728 20140 17160 -2354
243 -2354 -19717 -16847 5084 24534 23903 2898 -18714 -21760 -3379 20489 28558 13730 -8640
256 -8640 -19651 -12996 3496 18214 21667 10392 -8059 -18676 -12016 5557 18135 15669 457
269 457 -13303 -13560 -1253 10594 10323 -53 -8988 -7492 485 5266 3984 -71 -3954 -6347 -4830
284 -4830 992 6874 6740 -206 -8169 -10228 -3262 6230 11164 6174 -4148 -9455 -5355 2760 6062
299 6062 4534 2650 1147 -846 -2962 -2675 1115 5259 6328 3051 -1038 -3561 -2115 1704 3589
314 3589 2054 880 1376 1576 -1536 -3692 -1714 2707 3790 576 -3467 -2994 -304 1463 388 -3155
330c155j588K814M260P12m191m624m28L361K969J187R32r54l820n078P4N897P041
347E409K022n572p895l737M836Q197L819l342o264k110K371K323J001L99K91j473
363B75k301r2K815K329j437l919k676J566N197L929k035p485n539K915P141M129
379D812k055m854l072j591J052L252L123L22k530l967k731J544L271L344q56m493
395e429k717K288M212k18l675k779J779L576J405q80k753k047J39J676J889R54
411b580Q9n55k007k062o44M024L834q62m108k395K030K674N51j724j897J147K306
428b179J326j230k848p96J915K957L07j090l23J48j216j663J304M093K067k325
444D47l304j525K649L333J308j839k933k61L345L138q82l395j071K022J996J082
$$ plain form
330 -3155 -4743 -1929 2331 3043 -1148 -5772 -6200 -2839 130 1317 2249 1295 -2525 -7603 -7529 -1632 5409
347 5409 7431 1859 -6036 -9773 -4937 3260 7079 3737 -2527 -4637 -2266 57 1058 1457 1748 275
363 275 -2026 -2118 697 3026 1589 -2330 -5006 -3440 1757 5686 3651 -3834 -9373 -6458 683 4812
379 4812 2757 -2097 -5169 -6760 -5708 -2456 667 989 -1541 -5508 -8239 -6695 -3424 -80 -936 -5429
395 -5429 -8146 -5858 -1646 -1864 -5539 -8318 -6539 -2963 -1558 -2438 -5191 -7238 -7099 -5423 -3534 -2580
411 -2580 -2491 -3046 -5053 -7115 -7759 -3735 99 -763 -4871 -7266 -5236 -2562 -2011 -3735 -5632 -4485 -2179
428 -2179 -853 -2083 -4931 -5727 -3812 -855 -548 -1638 -1961 -1813 -3029 -4692 -3388 705 2772 447
444 447 -2857 -4382 -1733 1600 2908 1069 -1864 -2125 1220 4358 3476 81 -990 1032 3028 4110
460D110J43j50j469j879n04K264L136J474j790l923k112J713M093L217k981m842
476E00j630L432L120p35k279k268j062R84K163R86j297j878l277j469J146L156
492d08K687j640n210m828J177N490L525k569m787k804J057L111J998j200k923
507g324j877O89K566J821J41j441k757j716R17M878M555o25n998m997J753O123
523c292N697L43m003n054p57L846N147J661j950k612j080J488K429K117P37k635
539B082l418j37M629M944P28n779o085q68N125P189K526m978p935m031L181O139
555C312L693q21l548n320l468K176N186L217k257n208l680J328M287L069j647
570C19o326m216K687P010M147l396o743m862J034N938O225K853m174p511n157
$$ plain form
460 4110 4253 4103 2634 755 251 2515 5651 7125 5335 1412 -700 1013 5106 8323 5342 500
476 500 -1130 2302 5422 4687 2408 140 -922 62 2225 3211 1914 36 -3241 -4710 -3564 -408
492 -408 2279 639 -4571 -9399 -8222 -2732 793 -1776 -6563 -9367 -8310 -5199 -3201 -4401 -7324
507 -7324 -9201 -8512 -5946 -4125 -3984 -5425 -8182 -9898 -8981 -4103 452 -173 -6171 -11168 -9415 -3292
523 -3292 2405 2748 -1255 -6309 -7066 -3220 1927 3588 1638 -974 -2054 -566 1863 3980 4717 2082
539 2082 -1336 -1473 3156 8100 8828 3049 -3036 -3904 1221 8410 10936 5958 -1977 -6008 -2827 3312
555 3312 7005 6184 2636 -2684 -6152 -3976 1210 4427 2170 -3038 -6718 -5390 -1103 1966 319
570 319 -6007 -10223 -7536 -526 3621 225 -6518 -11380 -10346 -4408 1817 4670 496 -7015 -12172
585a2172K162P896P149J172n921p459k435N469Q134L236m098n752j572M123M642
600D574K062k323m595j947K978O146L511j599o426n842L29O089Q298L806n521
615I540j1258n662M202R988O635j952p795p131j651M734O389J747l415n589k833
630d051J924L822K429j751m960m621J388O990N333l257q407p010R22Q136Q927
645E814J427o877j0416m507M495R302O355o91o182p668l464M632Q630M806l193
660B463p191l820L085N965L138k338n209l083L414P059L944l198p361m713J510
675f335O832P551K361m850j0079n616L443J0102Q011j03p601r077k924N251Q936
690E902L996l433o642l150J876M068K336o10l407k666Q72M826L310j226o074n193
$$ plain form
585 -12172 -10010 -2114 5035 6207 286 -7173 -9608 -4139 3995 7231 3133 -2619 -4191 -68 4574
600 4574 6636 4313 -282 -2229 749 6895 10406 8807 2381 -3461 -3132 2957 11255 15061 9540
615 9540 -1718 -7380 -3178 6810 13445 11493 3698 -3433 -5084 -350 6039 7786 4371 -1218 -4051
630 -4051 -2127 1695 4124 2373 -2587 -7208 -5820 1170 6503 3246 -5161 -12171 -11249 -3113 5814
645 5814 7241 364 -10052 -14559 -10064 -762 5593 4902 -1280 -8948 -12412 -7780 850 5656 2463
660 2463 -4728 -8548 -5463 502 3640 1302 -3907 -6990 -3576 3483 7427 4229 -3132 -7845 -6335
675 -6335 497 8048 10409 5559 -4520 -10136 -6693 3409 11420 11317 3716 -5361 -8285 -3034 5902
690 5902 9898 6465 -177 -3327 -1451 2617 4953 4343 936 -1730 -858 3968 7278 6052 -22 -5215
706e215L95O133P521L030n778r885n287M417R777O641j145o806p311k878L936
721b455P069M689j247n646m138m41L212L620J008k939l644n1M369L320k014n546
737h34l640J106N595N250Q19n080p274l724K770P199N659P3n272p399l949K945
753e756P118N488j312n654m374m77K711L332R35j373k369K0K164J196j071k750
769b172j736J184L476L568J208l444n545l702K918O601N191N3m822o688k523L073
785c360N836M090l83l758l334j552Q72K239K296O41j667j461k16R38n07j558j134
802b018R46K761J984O3l536m694j930K995M806K703n06l804m554k528J457M140
818a715L929N50k852l883j758L18K882K291M12q28j013l35j1j001k89N81K233
$$ plain form
706 -5215 -4820 1313 8834 11864 6086 -3799 -9086 -4669 5108 11749 10604 3798 -3513 -6391 -2455
721 -2455 4614 9303 8056 2410 -1728 -2169 1043 4663 5671 2732 -912 -963 3406 6726 4712 -834
737 -834 -4474 -3368 2227 7477 8296 3216 -4058 -7782 -5012 2187 7846 7919 2647 -4752 -8701 -5756
753 -5756 1362 6850 5538 -116 -4490 -4967 -2256 1076 2011 638 -1731 -1711 453 1649 578 -2172
769 -2172 -3908 -2724 752 4320 5528 2084 -3461 -7163 -4245 2356 7547 7600 2778 -3910 -6433 -3360
785 -3360 2476 6566 6183 2425 -909 -2461 -1589 650 2946 3587 1920 459 243 1181 674 -884 -2018
802 -2018 -1072 1689 3673 3736 200 -4494 -6424 -3429 1377 4080 3574 -230 -4784 -7312 -5855 -1715
818 -1715 2214 2764 -88 -3971 -5729 -5411 -2529 -238 174 -654 -1667 -2002 -2013 -3014 -3303 -2722 -489
835d89J657N93p52k072k459l11K580L117K977j5k799m039j536J445M185L663O12
852F357k604k920j504o3J897K185J763k00j206j652j564k75N72J873J344K19o63
869C559j288j673j864j03J982K607J142j627k535k378j268J333K138J709O68j830
885E72k250k143p00J078K479J806j64j820j994j613j02J247J811J334N98j267
901a128k049j571J61J107K002J577L2j081j548p57m12M80J878K058P02n29k158
918a236j621p97J352K670J746J40j146k376j326k65J852K410J806q45j856k074
934a566p1M69P58J542N87n04p41r07o61n23L66J101J352P43n40j686j478o89N10
953a938J507K495P02j709k696j663K39K292K463P20r99j930j660l89J812J040
$$ plain form
835 -489 1168 1761 1009 -1063 -3522 -3833 -1253 1864 4841 4826 2027 -2012 -3548 -2103 2082 5745 6357
852 6357 3753 833 -671 -734 1163 3348 5111 4911 3705 2053 489 214 786 2659 4003 4222 3559
869 3559 2271 598 -1266 -1369 613 3220 4362 2735 200 -2178 -3446 -2113 25 1734 2402 572
885 572 -1678 -3821 -4521 -3443 -964 842 678 -1142 -3136 -4749 -4851 -3604 -1793 -459 139 -1128
901 -1128 -3177 -4748 -4587 -3480 -1478 99 131 -950 -2498 -3255 -3667 -3187 -1309 749 1451 922 -1236
918 -1236 -2857 -3654 -2302 368 2114 2254 1108 -1268 -2594 -2859 -1007 1403 3209 2364 508 -1566
934 -1566 -1637 -1168 -410 1132 1719 1215 474 -433 -1094 -1617 -1251 -150 1202 1945 1405 -281 -1759 -2448 -1938
953 -1938 -431 2064 2766 1057 -1639 -3302 -3063 -771 1692 2412 1413 -517 -2177 -2566 -754 286
969B86J224J5q89r75l31M98o0N8M20P45Q92R9j085j368r63O34K003K040O78j595
989B326k923j305P61J985K402J072j339k699j467R3J536J968M64j073j346j127
1005f72N52J307J77p17n52L98M14M58o61j432o51n15J456J772O96r37k513j637
1023c057L90J542K838P04j458k695j633J36K598J501K75o39k127q48J20J757O17
1040B1q8r41j66j03Q03J18j70j013m03O62J563M89m98j231j229j8J506J448R41
1059A691p77k075j367M58J423J660N32n10j691j143J76J690R38lp24m59k78M57
1077bK13O78j76n12k77N37P08m76n11j68l52R21P36O67j82j417p11L39N48J036
1097A599L01l88n85q12J61J74N79O03M9l82k35r81R7K97P40J03K12k40n22q18
$$ plain form
969 286 1510 1525 636 -339 -670 -172 -232 -174 246 991 1883 1982 897 -471 -1434 -800 1203 3243 3921 2326
989 2326 -597 -1902 -1141 844 3246 4318 2979 280 -1187 -1094 442 2410 2874 1801 455 -672
1005 -672 -120 1187 1364 647 95 493 907 1365 704 -728 -1379 -1894 -438 1334 2030 1093 -1420 -3057
1023 -3057 -2667 -1125 1713 2417 959 -1736 -3369 -3233 -635 866 1141 502 -1625 -2473 -2353 -596 21
1040 21 -67 -1008 -1174 -1277 -474 -356 -526 -1539 -1942 -1280 283 772 274 -957 -2186 -2204 -698 750 1691
1059 1691 914 -1161 -2528 -2070 -647 1013 1545 1035 -656 -1799 -1623 67 1005 1002 278 -181 -459 -2
1077 -2 211 889 713 201 -76 461 1169 693 182 14 -338 583 1319 1986 1804 387 -324 15 563 1599
1097 1599 1900 1512 927 115 276 450 1029 1632 1681 1299 1064 83 180 477 1217 1320 1532 1292 770 -48
1117d8M07M18M14O3j51n75l52q8M29M36Q1l88p68L98L93j60r7r3l43M7K17N93
1139H33k54n13r03l38O14J226M96k50j078j295m14J357J485K74r97j118r21J12
1157a684R59J350J60j087j443L6Q66N78N62k80r95j012P72R83J082q57j215r11
1175b136K60J217J152L45q17k065o86J201J733J233o91j416j864K92J206K000
1191I64N89j067j637o81N46J081J247j37p22j618N9R01J813J57r33j313l10Q26
1209b35J503O98o42j434r86N86J112J436j66q07j259p01Q48J488R45m82j511j232
1227h39P19R21Q43M09j005j244m48R54J158R1m38j172j88J43R12M94m83p50p94
1246g17J39P68P32j41m56q82j08K45R94O02o49j200r0M40O47L07m28n77l72P0
$$ plain form
1117 -48 359 777 1191 1254 1103 528 176 88 517 953 1034 646 -122 276 669 509 412 319 -24 23 240 833
1139 833 579 66 -837 -1175 -561 665 1161 911 -167 -1462 -1876 -519 966 1240 243 -875 -1796 -1684
1157 -1684 -725 625 785 -302 -1745 -1709 -843 -265 297 17 -978 -1990 -1218 -235 847 -10 -1225 -2136
1175 -2136 -1876 -659 493 838 21 -2044 -2730 -1529 204 1437 746 -670 -2534 -2242 -1036 964
1191 964 1553 486 -1151 -1832 -1286 -205 1042 905 183 -1435 -1376 -475 1338 1495 562 -751 -1061 -235
1209 -235 1268 1966 1324 -110 -1096 -510 602 2038 1872 1065 -194 -895 -47 1441 2386 1904 393 -839
1227 -839 -120 801 1644 2053 1048 -196 -644 310 1468 1559 1121 -51 -239 -96 816 1310 827 77 -717
1246 -717 -578 190 922 781 325 -557 -665 -420 574 1176 527 -673 -763 -323 324 631 203 -374 -746 -676
1266f76P84K16K7n72q51J49M64P78K56n27r21n51P00R28L01k78r92o47N09O22
1286b81R43m94m04q86j85R24Q92K7q65p52n45M10J376R14o65j234j160k3J577
1305d31R09J01q19j137q58P84J732N89m85r28j063j19J242O73N26j010j317M4
1323a567O71J598M77q80j506q33O94J914J212k75j690j254j46J077J722Q30p03
1340A341j761j517O82J457J574N70j477j243n92J066J496K85o65j329j98N57J268
1357A514M35l84j314j147M05J059J802j69j226j466q38O28J845J457n74j616j356
1374i45l93P28J928N01n86j289r06n7J086J076j06o52r47j10L89Q61M54p32j102
1393h02n40Q65J346K93p20j264r73O20J263Q01L45j083j304n48M39J353Q11Q9
$$ plain form
1266 -676 108 324 351 -221 -1072 -923 -459 319 575 48 -873 -1424 -724 204 505 227 -765 -1412 -903 -281
1286 -281 662 168 -236 -1122 -1307 -383 509 536 -329 -1081 -1626 -1216 160 1074 409 -825 -1985 -2008 -431
1305 -431 478 579 -240 -1377 -2235 -1451 281 870 385 -543 -1606 -1725 -483 190 716 -294 -1611 -1567
1323 -1567 -896 702 1179 299 -1207 -2040 -1346 568 1780 1505 -185 -1439 -1585 -508 1214 2044 1341
1340 1341 -420 -1937 -1255 202 1776 2346 869 -374 -966 100 1596 1881 1216 -113 -311 246 1514
1357 1514 1949 1565 251 -896 -491 568 2370 2201 975 -491 -1329 -701 1144 2601 2027 411 -945
1374 -945 -1338 -610 1318 1819 1233 -56 -962 -1019 67 1143 1037 385 -562 -672 -283 578 1032 300 -802
1393 -802 -1342 -477 869 1162 442 -822 -1795 -1175 88 889 1234 151 -1153 -1701 -1262 91 902 991
1411I91r31j333l20M29J259J20J61m32p63J63K54J21J01r9k26K62R7M44l31m62
1431d95p46L77M94Q14L44j049o79r55O09J225J056q7o38q99m49L7R58O54l2j34
1451D05m61m50j11M33L94m9m3J67L62k9l49j083K53M69R49N19l50m06j256k46
1471h82M57J248L82J46o59p38r94Q76J050N82q9p39p22k83O20O35k96J02j25N9
1491F30L73J07o15p52J20M12L86P94k41o27j116n49M49J150J297J88j261j574
1509h29o14L22J890O07j84p13q32n15N14L67J011l07l98n84K27K70k69K24o71
1528d84k69N93R86L95q04j373j119O50J435J105J03r64j262q02M7J441J571R6
1546A345j092j379o74O3J447Q77ro21j132p5M86L14J30k72j5J91M14J85Rj168
$$ plain form
1411 991 60 -1273 -1593 -1164 95 215 376 -56 -819 -656 -402 -281 -180 -279 -505 -243 -146 298 -33 -495
1431 -495 -1241 -864 -370 444 788 -261 -940 -1895 -1286 -61 995 908 270 -629 -1078 -1041 -83 571 539 405
1451 405 -56 -506 -617 -184 210 161 118 285 647 618 269 -814 -561 -92 857 1376 1026 620 -636 -882
1471 -882 -425 823 1205 1351 692 -46 -1040 -164 886 1468 1379 640 -82 -365 255 890 594 696 571 630
1491 630 1003 1110 495 -257 -137 275 661 1455 1214 587 -529 -1078 -629 521 1818 2006 745 -829
1509 -829 -1443 -1121 769 1376 1192 479 -353 -868 -354 13 1024 717 319 -265 -38 232 -37 187 -484
1528 -484 -753 -160 826 1221 417 -956 -2075 -1425 10 1115 1218 254 -1008 -1810 -1763 -322 1249 1345
1546 1345 253 -1126 -1800 -1737 -290 587 578 -43 -1175 -1250 -764 -450 -320 -592 -607 -416 -2 183 192 -976
1566i76l17K35Q54J261K3n22j193j277L97J401J243L10q39j119j230N43J227J132
1584A153J77n49o00o75k3K39M08M56rk21j46J74q1k67p16L55J049M41M93j036
1604F22q78o10M18J144R78j6n79j369l64k36J018R76K14l04j005q6k7K25M16j63
1624C74l0j21K77J85n36o00j62O64P19P86l56r35q93m40N45J311R43k3j550j075
1644i17k16K34J833L77o47m19j028K77M36K86n3k44o8M42J22j61n53k09p62O70
1664f00P85R34n40n96j242p19R09J422R03l06j451j160l04J060J111P19m94p63
1682c32j068J39O43N88K90m13n58j86P57K60J4o58o32L0J069M95N32p75j543k64
1702a612N52J347O56M48j329j251j95L14J347Q61l6j075j159K10P76R99l7m40
$$ plain form
1566 -976 -1293 -1058 -204 1057 1080 558 -635 -1912 -1515 -114 1129 1439 600 -519 -1749 -1206 21 1153
1584 1153 1330 781 181 -494 -517 -278 130 586 577 356 210 384 303 36 -680 -325 724 1165 1658 622
1604 622 -256 -866 -448 696 1674 1658 1079 -290 -654 -890 128 1104 1318 1014 9 -77 -104 121 537 374
1624 374 344 223 500 685 149 -451 -613 51 770 1556 1200 265 -628 -1068 -523 788 1731 1708 158 -917
1644 -917 -1133 -899 934 1311 664 245 -783 -506 -70 216 163 -81 -149 293 415 254 -299 -508 -1270 -600
1664 -600 185 1119 579 -17 -1259 -1978 -1069 353 1256 950 -501 -1661 -1965 -905 206 925 431 -332
1682 -332 -1400 -1261 -618 -30 260 -153 -711 -897 -140 120 134 -524 -1156 -1126 -57 438 970 195 -1348 -1612
1702 -1612 -1060 287 943 1391 62 -1189 -1384 -1070 277 1138 1102 27 -1132 -922 -146 853 816 376
1720C76m91k85L13N06O2k34k08k33L82P69n1o8r18n19l6J126P42M18j109j073
1740e31k82L92J124P53k26j183o17J70L63P22l1n0k30m80m65Q59P8O1l68k78J42
1761g7N95J34n30m43m44K58Q30L61k05k98q50J01J39O41K67P3n00n40J44K57L64
1782B77L40o25l41J53P5O11m5q13j44R4L80M34k74l68k15j89J73P68L16r1q47
1803c31l39l05P89P96J15l09p48p57L72Q03P39o10m11n91K32K78O77J32p76n40
1823g84J38L53N15L65n19p94k85N81M50P67k17j103o51J18J071P41J25l86j171
1842f86m36O20R80M12L0q48p03k31P74P87M65o30o25p09N39P10M73j17n37p88
1862e20K49N87N05K89q70n88k36N45J114M29r46o56o43L44R18O86R4p19j171l91
$$ plain form
1720 376 -115 -400 -87 419 481 247 39 -194 188 957 906 838 -80 -599 -635 491 1233 1651 542 -531
1740 -531 -813 -421 703 1456 1230 47 -570 -400 -37 685 654 604 374 -106 -571 288 366 427 59 -219 -77
1761 -77 518 652 122 -321 -765 -507 323 684 479 181 -669 -568 -429 212 479 552 52 -488 -344 -87 277
1782 277 617 -8 -349 -196 -121 490 445 -368 -512 -418 -38 396 122 -246 -461 -650 -477 291 607 516 -331
1803 -331 -670 -975 -186 610 725 416 -332 -1089 -717 86 825 215 -196 -787 -555 -277 400 532 -244 -784
1823 -784 -646 -293 222 587 68 -726 -1011 -430 20 787 570 -533 -1184 -1066 5 746 871 485 -686
1842 -686 -1122 -502 478 890 920 72 -631 -862 -88 699 1164 534 -91 -800 -261 449 922 805 268 -520
1862 -520 -271 316 821 1110 240 -348 -584 -39 1075 1504 558 -98 -741 -397 521 1207 1301 582 -589 -980
1882i80P43J192K39m89n80m95J7N16R36l2q70m34l06R55L23K97n61q81j80K19
1902c71J188j07j75o69r93K52R15P90K71q07j009l42L12Q31O98l1r62n85l3J46
1922f81Q39K94l01o28n06P16L69M44m04k31m80N20K81K35j47q19k96n4O17N95
1942C63M28n24p82l90L98O60O96l86n54p31K38O50P8L39k52r4k38r4M72j15M2
1963B04k49k12j4K87N74j69n59j75j28O16N07J18l82p65j96L84N78J64k21j09
1983B53n11n5J45P39N0l27o71J67J06O01O4m21o7m1L00K01J27o0p93k49O28K64
2005D50J68K51o44K8m23m9P21L40j38p42m45L16R9N78k7j71m53m7M79J53j2l28
2027A04m53RL22J57L15Q2n54n62m2Q63L69j90m05k57n66L94N33M67j49o77o73
$$ plain form
1882 -980 -237 955 1194 705 125 -370 -353 163 1099 1067 197 -237 -543 412 735 1032 471 -410 -590 -371
1902 -371 817 710 535 -134 -1127 -875 40 830 1101 294 -715 -1057 -745 86 784 753 -209 -794 -827 -681
1922 -681 158 452 151 -477 -983 -267 102 546 142 -89 -569 -49 232 467 320 -499 -795 -849 -232 363
1942 363 791 267 -515 -905 -507 153 849 463 -91 -822 -584 66 144 483 231 137 -101 -195 277 162 204
1963 204 -45 -257 -271 16 590 421 -138 -313 -441 175 682 800 418 -347 -543 -159 419 583 362 253
1983 253 -258 -313 -168 571 621 294 -377 -210 -104 497 561 140 73 32 332 533 660 600 -193 -442 186 450
2005 450 618 869 225 253 -170 -219 502 842 704 -38 -483 -167 -68 510 483 312 -141 -188 291 444 432 104
2027 104 -349 -340 -18 139 454 536 -18 -580 -622 241 610 420 15 -242 -808 -414 119 586 437 -240 -913
2048i13N83O19m1Q5j56o34k70L80P22j59jk55o02K9N25M31j44j45o97J64L29K42
2070I2J88j12p74Q9k8O02K21J87l66o27L4J98K4P83j24o42m57N28L2N68j66l94
2092a44k96j49P04L35j18O2n04q81O73L67M59q2l13n86M3L48O02J38m43k82k84
2113c51J71K87O16j78m78j76j43L32P19l51k74n7l33J36M99M13j19n49n74j22
2133e32Q42M71L7j55q56P4J42L18N20j65l88k49M4K4O03k88l10n16J06L06N25
2154E53pj35p37l58L53K11O14j22l30n91j79O21M47L54n19m65m39J69J41K02N26
2175C09o23J42n23j4M71L74n56o7j57J66L50K89n12k94l11K54N71J41L86p39n69
2196i12o1N47K55N21j8j065q6J04o7Q62M0j18k40l69M89j7K28J50n16k04J84P61
$$ plain form
2048 -913 -330 289 248 333 177 -457 -727 -347 375 216 215 -40 -642 -613 -88 343 199 54 -643 -479 -150 92
2070 92 280 168 -606 -517 -545 57 278 465 99 -528 -494 -296 -272 511 387 -255 -712 -184 -152 416 250 -144
2092 -144 -440 -589 115 450 332 394 -110 -991 -318 49 508 426 113 -473 -430 -82 520 658 215 -67 -351
2113 -351 -180 107 723 545 67 -109 -252 80 799 448 174 117 -216 -80 419 832 713 164 -410 -532
2133 -532 310 781 818 663 -193 -119 23 341 861 696 308 59 103 127 730 442 132 -384 -278 28 553
2154 553 546 411 -326 -684 -331 -120 494 372 42 -549 -728 -107 340 694 175 -290 -729 -560 -419 -217 309
2175 309 -314 -172 -695 -709 -238 136 -420 -487 -644 -478 -128 161 -351 -645 -956 -702 -131 10 396 -343 -912
2196 -912 -973 -426 -171 350 332 -733 -819 -715 -782 80 120 2 -238 -607 -118 -135 93 243 -273 -477 -293 468
2218D68k16K24q29j4J80L31L08K60p47m88L3L26P30R0l3p22o17L1L03P18l6q6
2240B14k22n00L88L73K46n92K21j77J02K54K10n22k44k94J40N26M56k60n60q1
2260c22k60P7N73O02k79o23n02L15K54O30K2j25m00l47J29K22L12j42m25Oj18
2281d01M61K32j31m72m66P82M01N0l4m14o46l88N64Q49N6J0o49p10J52Q98L8J75
2303C57l36l74p2J2M52J85no21N1j75L51J95J4n63k16J16P44J1L60l68o24m91
2325i97K89R68K30m46m14l69l05O95O40J63m67m49j92J82N87O2p1k31m98L46M6
2346b31M69l52p4J9j23L24K64q1l78n26P3N74K48L36j80j04q46P2M32Q48J38m39
2368D63q01j32M48K63K46n1J99j076L77J78K19J54n16j07j38M09M23O4n01M8l87
$$ plain form
2218 468 252 476 -353 -367 -187 144 452 712 -35 -523 -490 -164 566 656 623 -99 -716 -685 -382 336 300 214
2240 214 -8 -508 -120 253 499 -93 128 -49 53 307 517 -5 -249 -543 -403 123 579 319 -241 -322
2260 -322 -582 -505 68 670 391 -232 -734 -419 -165 465 487 362 -38 -385 -256 -34 278 136 -289 -283 -401
2281 -401 60 292 161 -311 -777 5 406 456 422 8 -638 -1026 -462 387 443 453 -196 -906 -754 144 182 357
2303 357 21 -353 -425 -413 39 224 219 -402 -351 -526 -175 20 34 -529 -745 -629 115 126 486 118 -506 -997
2325 -997 -708 260 490 44 -370 -739 -1044 -349 291 454 -13 -462 -654 -472 115 177 106 -125 -623 -277 -231
2346 -231 238 -114 -188 -169 -292 32 296 215 -163 -689 -616 -42 206 542 362 258 -588 -516 -84 764 902 463
2368 463 -338 -470 -22 241 487 436 635 -441 -64 114 333 487 -29 -136 -274 135 558 622 121 169 -218
2389b18m8O64J27j08l09m45j2L95N59j32q9l74l66L8M34M66j3n51l92K14J46L20
2411C06K28o27k58K68K12L89Q9n87j82l85K91R12q3k62n84j84M3L04N22K05k72
2432C45o28k89M54j68N93q7o06J2K49J47l25M43k51j06k15M55mK46l90p7N8O4
2454h0K89j0k31k52L0Q8J75J23K70m37k28l57L57L00K77l7k53k89L2K34K17k87
2476f9K22k4j77K81J49l29j89Q2J28q9M55j48j65J49n35K33J18M98j05j28n45
2497a88j74K63M05N84n70k92k32K66L2L46M1k69M5l4m2L10j07k02k25R6K43p2
2519B24J7j29l21Q0L62k48K48K61m18k70J08nK49M76l21o3p39N74J72K46j28q1
2541B94l79j79L56J51K35j32j39m10L16J53K04m5l51l98M16K32J99Q2l28j10j41
$$ plain form
2389 -218 -266 398 525 417 108 -337 -349 46 605 473 384 10 -356 -318 116 582 569 18 -374 -160 -14 306
2411 306 534 -93 -351 -83 129 518 607 20 -162 -547 -256 656 573 311 -273 -457 -414 -110 412 617 345
2432 345 -283 -572 -118 -286 307 220 -386 -374 -125 22 -303 140 -111 -217 -432 23 19 265 -125 -202 -144 -80
2454 -80 209 199 -32 -284 -254 -166 9 132 402 -35 -263 -620 -263 37 314 277 24 -265 -233 1 218 -69
2476 -69 153 129 -48 233 382 53 -136 -54 74 -15 440 292 127 276 -259 -26 92 590 485 357 -188
2497 -188 -362 -99 306 890 320 28 -204 62 94 440 481 212 257 223 181 491 384 182 -43 53 296 224
2519 224 241 112 -209 -129 233 -15 233 494 76 -194 -86 -91 158 634 313 250 -489 85 257 503 375 294
2541 294 -85 -264 92 243 478 346 207 -203 113 266 470 425 74 -324 92 324 523 605 277 167 26
2562B6L16N5Ql1k35k82J72O4QJ16m6k80J73j49L28M3k13k00j10J06J15J78k97
2585a35k80J61J23J72rJ04k56k46j18K14M48o9J60m27k30K2J7M88o2O0k08j98
2607b69r7J91R6J51k24K66k91L11J38m2L7k29Q3K33j90K83j12k77j83N21j45L84
2629F35Pk73j47j24M12m01L10K08p0k07q7n5o4M1J50K43l35j36J25k7j34J61l
2652B29N7N3l03J60j57j08K7Q5J95J99l61l28L02J26j44J58j59j48j37K61k38
2673b31L24R3k88l7j31J89k52M15J3J24r9k17J42o0M2Q3j96k17L14K11j79n8K1
2696Fk46L05o8L92k66n9j79L2K98m48L58K84o74J83j88jN28j95j03L5k61K63K8
2719B4R1j57M1r8p8M72j38j27k61j27K76k11L11J67m03M1k01M7J40N8Q1k09P3
$$ plain form
2562 26 342 397 405 374 139 -143 29 93 101 217 171 -109 64 -85 243 286 73 -127 -237 -131 -16 162 -135
2585 -135 -415 -254 -131 41 32 136 -120 -366 -484 -270 178 109 269 -158 -388 -366 -349 139 77 137 -71 -269
2607 -269 -366 -175 -79 72 -152 114 -177 134 272 230 267 38 121 354 164 447 335 58 -125 396 251 635
2629 635 642 369 222 98 510 109 419 627 557 350 263 208 144 185 335 578 243 107 232 205 71 232 229
2652 229 286 339 36 196 39 -69 -42 43 238 437 76 -252 50 176 32 190 31 -117 -254 7 -231
2673 -231 93 186 -102 -139 -270 -81 -333 82 95 219 120 -97 45 -15 27 110 -86 -303 11 222 43 -15 6
2696 6 -240 65 -3 389 123 64 -115 -83 215 -233 125 409 -265 -82 -270 -271 257 62 -41 -6 -267 -4 24
2719 24 115 -42 -1 -99 -177 295 157 30 -231 -358 -82 -293 18 185 -218 -177 -378 -331 -191 -133 -52 -261 -188
2742a88J9K81j36j40n9K07kP0j40J18l4j92J88J33q5K01p7l69J46O1P0J36P6j77
2766A07p6j3Q1J73J49j2o92J65K93QK58k92j88K26n8j68l6J32j28J39k08J10J52
2789A22mj88K39m84J5P0M34l16m2m9K33j69j11N5K04j40j80l7Q8L04J02l3l73
2812b60l1p0Q4K17j23j0l4j72K94K95J8n46J5l3J55L17J37l67m84K07J22M07j23
2835A5p3j21M6k10k07K84J10J13k15o3j46J64J00Q5rj71Mj05J53K56o4k39p5N2
2859c16J43j91J83N3Rj16J56j27J97J95k27m5m01N54K0k85J63k03p6J18J81J5
2881@r7m2%K11j21R5j4k08L88r8m79M16j0R3j24J5k07N2K10k21m5K7L8J72j10
2906e9J9j8m8o7J27o5J04J62j69k85M48k48J15J25r6J64m34mL69j45J48k69j44
$$ plain form
2742 -188 -169 112 -24 -164 -223 -16 -18 52 -88 30 -4 -196 -8 125 40 241 164 -205 -59 2 72 208 284 107
2766 107 31 18 99 272 421 409 -283 -118 175 183 441 149 -39 187 129 -39 -75 57 -71 68 -140 -30 122
2789 122 118 -70 169 -315 -300 -230 204 -112 -154 -203 30 -139 -250 -195 9 -131 -311 -348 -260 44 146 113 -260
2812 -260 -291 -361 -277 -60 -183 -193 -227 -399 -105 190 208 -338 -323 -356 -201 116 253 -114 -598 -391 -269 138 15
2835 15 -58 -179 -133 -343 -550 -266 -156 -43 -258 -321 -467 -303 -203 -118 -127 -298 -294 -399 -246 10 -54 -293 -368 -316
2859 -316 -173 -364 -181 -128 -119 -235 -79 -206 -9 186 -41 -86 -487 67 87 -198 -35 -238 -314 -196 -15 0
2881 0 -97 -139 -139 72 -49 46 32 -176 212 114 -365 51 41 134 10 25 -182 -130 80 -141 -186 -159 -121 51 -59
2906 -59 -40 -58 -106 -173 -46 -111 -7 155 -14 -299 149 -99 16 141 45 209 -225 -229 140 -5 143 -126 -270
2929b70J39lJ2k41L94k40j10J89K4J09j03j09J05Q6R2m36J91J74j28L02j79M26
2951D24p36J48k03Q2J99l6N2R8l36Q0m7L54L2n0l62L64k95nL12j50k47L50j49
2974a21J84Q3k55K57k24k17K91k16M36l0j8k10l74L90r6L16K4n08L8n2%M62k30
2997g0j40M3J82p1J40J24p7j74k89L71J0J63j58j72K86J7l27J78J10m03K83k48
3019b22K1K93p6K12m6l15J80R4N2l49K98m68K40J9m8J26j63K28j26R0K55j46M7
3042A96m5j97K11r3K3k48J75k87M82l10J17J56M1l22K27j54j77M49l0mj56P8n2
3065H0K18m6k98j20j45M50k07J10k74K16M5r8K59k11l71J99k4l2J97k90M59O7
3087A84l69J02L0k3J13K88j86l66P4K13k67lO1n1n0L6Jn2J76M02m21j24K11J79
$$ plain form
2929 -270 -131 -134 -122 -363 31 -209 -319 -130 -106 3 -100 -209 -104 -18 74 -362 -171 3 -125 177 -2 424
2951 424 -312 -164 -367 -285 -86 -122 -70 28 -308 -228 -275 79 111 61 -301 63 -232 -237 75 -75 -322 28 -121
2974 -121 63 146 -109 148 -76 -293 -2 -218 218 188 170 -40 -414 -24 -120 196 220 -288 -250 -302 -302 160 -70
2997 -70 -210 -167 15 -56 84 208 131 -43 -332 39 49 212 54 -118 168 185 -142 36 146 -257 26 -222
3019 -222 -201 92 16 228 182 -133 47 141 193 -156 142 -326 -86 -67 -115 11 -152 76 -50 40 295 149 196
3042 196 151 -46 165 72 95 -153 22 -265 217 -93 24 180 221 -101 126 -28 -205 244 214 210 54 132 80
3065 80 298 252 -46 -166 -311 139 -68 42 -232 -16 29 -69 190 -21 -392 -193 -217 -249 -52 -342 117 184
3087 184 -185 -83 -53 -76 37 325 139 -227 -153 60 -207 -210 -149 -200 -250 -214 -213 -265 -89 313 -108 -232 -21 158
3111A58K5N7l06J13k89J30L92j14j33J27m84M39k8P9j29j38L12m7r6K30k28J33
3133B03k25K0J97L8j88j02J55k39O8L70j41O0j96k85J66J79q9J90n1r9J2n6K95
3156B82m39K61l9m47L02k4J87k3k66j20L16L9J16j11j52N3j38L36l76L98k80P5
3178e0Q0J36k07M41k97m3j27N7J24orp2M17m51J25q1l1l29K69k28J60j24K75j3
3202A6K61l21%q0N8J38Q4j73n4L37m52K72O6j79L14n7l49L9J54J2p8L3j58O7K1
3227b9jK70j84j73k7J36J04J30k22oQ2Q9m53J60K15L4j48J31k89J98m48N08K4
$$ plain form
3111 158 183 240 -66 47 -242 -112 280 166 33 160 -324 115 87 166 37 -101 211 164 68 298 70 203
3133 203 -22 -2 195 233 45 -57 98 -141 -73 297 156 216 20 -265 -99 80 -9 181 130 31 43 -13 282
3156 282 -157 104 65 -382 -80 -104 83 60 -206 -326 -10 29 145 34 -118 -65 -203 133 -243 155 -125 -50
3178 -50 30 166 -41 400 103 60 -67 -10 114 108 99 27 444 -7 118 37 6 -323 -54 -282 -122 -246 29 16
3202 16 277 -44 -44 -124 -66 72 156 -17 -71 266 -186 86 152 -27 287 230 -119 -80 74 86 8 41 -117 -50 -29
3227 -29 -30 240 56 -117 -144 -8 96 226 4 -2 80 169 -284 -124 91 125 -23 108 -181 17 -431 77 101
$$ [...]
8191D4
##END NTUPLES=NMR FID
##END=
