##TITLE=1H_BAU-29P(I)
 CDCl3, 8 sc, 
 29.1.2020
##JCAMPDX= 6.0         $$ Bruker NMR JCAMP-DX V2.0
##DATA TYPE= NMR FID
##DATA CLASS= NTUPLES
##ORIGIN= UXNMR, Bruker Analytische Messtechnik GmbH
##OWNER= root
$$ XWIN-NMR		Version 3.5
$$ Wed Jan 29 14:19:24 2020 Russian Standard Time (UT+4h)  she@DPX200
##.OBSERVE FREQUENCY= 200.1315
##.OBSERVE NUCLEUS= ^1H
##.DELAY= (6, 6)
##.ACQUISITION MODE= SIMULTANEOUS
##.ACQUISITION SCHEME= undefined
##.AVERAGES= 8
##.DIGITISER RES= 18
##SPECTROMETER/DATA SYSTEM= spect
##.PULSE SEQUENCE= zg30
##.SOLVENT NAME= CDCl3
##.SHIFT REFERENCE= (INTERNAL, CDCl3, 0, 15.7039)
##AUDIT TRAIL= $$ (NUMBER, WHEN, WHO, WHERE, WHAT)
$$ ##TITLE= Audit trail, XWIN-NMR		Version 3.5
$$ ##JCAMPDX= 5.01
$$ ##ORIGIN= Bruker BioSpin GmbH
$$ ##OWNER= she
$$ F:/spectra/data/she/nmr/H-F/1/audita.txt
$$ ##AUDIT TRAIL=  $$ (NUMBER, WHEN, WHO, WHERE, WHAT)
(   1,<2020-01-29 14:18:02.12 +0400>,<she>,<DPX200>,
      <created by zg, POWCHK disabled, PULCHK disabled
       configuration hash MD5:
       00 E9 B6 7A A2 85 ED C7 34 08 36 98 17 FE 4E 26
       data hash MD5: 16K
       2C 2C FD 8A 95 C1 61 A4 51 66 3C 5E 64 1E 1B 4E>)
$$ ##END=
$$ 
$$ hash MD5
$$ A7 9D 9B AE E6 ED 19 A1 E1 EC 04 02 AD 7B 86 C2
##$RELAX= 
##$RELAX= 
##$RELAX= 
##$RELAX= 
##$RELAX= 
##$RELAX= 
$$ Bruker specific parameters
$$ --------------------------
##$DU= <F:/spectra>
##$EXPNO= 1
##$NAME= <H-F>
##$PROCNO= 1
##$TYPE= <nmr>
##$USER= <she>
##$AMP= (0..31)
100 100 100 100 100 100 100 100 100 100 100 100 100 100 100 100 100 100 
100 100 100 100 100 100 100 100 100 100 100 100 100 100 
##$AQSEQ= 0
##$AQ_mod= 1
##$AUNM= <au_zg>
##$AUTOPOS= <>
##$BF1= 200.13
##$BF2= 200.13
##$BF3= 200.13
##$BF4= 200.13
##$BF5= 200.13
##$BF6= 200.13
##$BF7= 200.13
##$BF8= 200.13
##$BYTORDA= 1
##$CFDGTYP= 0
##$CFRGTYP= 5
##$CHEMSTR= <none>
##$CNST= (0..31)
1 1 145 1 1 1 1 1 1 1 1 1 1 1 1 1 1 1 1 1 1 1 1 1 1 1 1 1 1 1 1 1 
##$CPDPRG= <>
##$CPDPRG1= <>
##$CPDPRG2= <>
##$CPDPRG3= <>
##$CPDPRG4= <mlev>
##$CPDPRG5= <mlev>
##$CPDPRG6= <mlev>
##$CPDPRG7= <mlev>
##$CPDPRG8= <mlev>
##$CPDPRGB= <>
##$CPDPRGT= <>
##$D= (0..31)
0 1.2 0 0 0 0 0 0 0 0.06 0 0.03 0 0 0 0 0.0002 0 0 0 0 0 0 0 0 0 0 0 0 
0 0 0 
##$DATE= 1580293081
##$DBL= (0..7)
120 120 120 120 120 120 120 120 
##$DBP= (0..7)
150 150 150 150 150 150 150 150 
##$DBP07= 0
##$DBPNAM0= <>
##$DBPNAM1= <>
##$DBPNAM2= <>
##$DBPNAM3= <>
##$DBPNAM4= <>
##$DBPNAM5= <>
##$DBPNAM6= <>
##$DBPNAM7= <>
##$DBPOAL= (0..7)
0.5 0.5 0.5 0.5 0.5 0.5 0.5 0.5 
##$DBPOFFS= (0..7)
0 0 0 0 0 0 0 0 
##$DE= 6
##$DECBNUC= <off>
##$DECIM= 24
##$DECNUC= <off>
##$DECSTAT= 4
##$DIGMOD= 1
##$DIGTYP= 9
##$DL= (0..7)
0 120 120 120 120 120 120 120 
##$DP= (0..7)
150 150 150 150 150 150 150 150 
##$DP07= 0
##$DPNAME0= <>
##$DPNAME1= <>
##$DPNAME2= <>
##$DPNAME3= <>
##$DPNAME4= <>
##$DPNAME5= <>
##$DPNAME6= <>
##$DPNAME7= <>
##$DPOAL= (0..7)
0.5 0.5 0.5 0.5 0.5 0.5 0.5 0.5 
##$DPOFFS= (0..7)
0 0 0 0 0 0 0 0 
##$DQDMODE= 0
##$DR= 18
##$DS= 0
##$DSLIST= <SSSSSSSSSSSSSSS>
$$ [...]
##$SUBNAM2= <"">
##$SUBNAM3= <"">
##$SUBNAM4= <"">
##$SUBNAM5= <"">
##$SUBNAM6= <"">
##$SUBNAM7= <"">
##$SUBNAM8= <"">
##$SUBNAM9= <"">
##$SW= 24.9337058887773
##$SWIBOX= (0..15)
0 0 2 0 0 0 0 0 0 0 0 0 0 0 0 0 
##$SW_h= 4990.01996007984
##$TD= 16384
##$TD0= 1
##$TE= 0
##$TE2= 300
##$TE3= 300
##$TEG= 300
##$TL= (0..7)
0 120 120 120 120 120 120 120 
##$TP= (0..7)
150 150 150 150 150 150 150 150 
##$TP07= 0
##$TPNAME0= <>
##$TPNAME1= <>
##$TPNAME2= <>
##$TPNAME3= <>
##$TPNAME4= <>
##$TPNAME5= <>
##$TPNAME6= <>
##$TPNAME7= <>
##$TPOAL= (0..7)
0.5 0.5 0.5 0.5 0.5 0.5 0.5 0.5 
##$TPOFFS= (0..7)
0 0 0 0 0 0 0 0 
##$TUNHIN= 0
##$TUNHOUT= 0
##$TUNXOUT= 0
##$USERA1= <user>
##$USERA2= <user>
##$USERA3= <user>
##$USERA4= <user>
##$USERA5= <user>
##$V9= 5
##$VALIST= <valist>
##$VCLIST= <CCCCCCCCCCCCCCC>
##$VD= 0
##$VDLIST= <DDDDDDDDDDDDDDD>
##$VPLIST= <PPPPPPPPPPPPPPP>
##$VTLIST= <TTTTTTTTTTTTTTT>
##$WBST= 1024
##$WBSW= 4
##$XGAIN= (0..3)
0 0 0 0 
##$XL= 0
##$YL= 0
##$YMAX_a= 459245
##$YMIN_a= -339416
##$ZGOPTNS= <>
##$ZL1= 120
##$ZL2= 120
##$ZL3= 120
##$ZL4= 120
##$ABSF1= 10
##$ABSF2= 0
##$ABSG= 5
##$ABSL= 3
##$ALPHA= 0
##$AQORDER= 0
##$ASSFAC= 0
##$ASSFACI= 0
##$ASSFACX= 0
##$ASSWID= 0
##$AUNMP= <proc_1d>
##$AZFE= 0.1
##$AZFW= 0.1
##$BCFW= 1
##$BC_mod= 2
##$BYTORDP= 1
##$COROFFS= 0
##$CY= 11.3945322036743
##$DATMOD= 1
##$DC= 2
##$DFILT= <>
##$DTYPP= 0
##$F1P= 16.9975609425685
##$F2P= -3.02152046262296
##$FCOR= 0.5
##$FTSIZE= 0
##$FT_mod= 4
##$GAMMA= 1
##$GB= 0.15
##$INTBC= 1
##$INTSCL= 1
##$ISEN= 128
##$LB= 0.24
##$LEV0= 0
##$LPBIN= 0
##$MAXI= 10000
##$MC2= 0
##$MEAN= 0
##$ME_mod= 0
##$MI= 1.114404
##$NCOEF= 0
##$NC_proc= 0
##$NLEV= 6
##$NOISF1= 3.799351
##$NOISF2= 2.8
##$NSP= 1
##$NTH_PI= 0
##$NZP= 0
##$OFFSET= 15.70392
##$PC= 1
##$PHC0= -9793.845
##$PHC1= 23.00081
##$PH_mod= 1
##$PKNL= yes
##$PPARMOD= 0
##$PSCAL= 0
##$PSIGN= 0
##$REVERSE= no
##$SF= 200.130013532006
##$SI= 16384
##$SIGF1= 3
##$SIGF2= 2
##$SINO= 400
##$SIOLD= 16384
##$SREGLST= <1H.CDCl3>
##$SSB= 0
##$STSI= 0
##$STSR= 0
##$SW_p= 3612.71676300578
##$SYMM= 0
##$S_DEV= 0
##$TDeff= 0
##$TDoff= 0
##$TI= <>
##$TILT= no
##$TM1= 0
##$TM2= 0
##$TOPLEV= 0
##$USERP1= <user>
##$USERP2= <user>
##$USERP3= <user>
##$USERP4= <user>
##$USERP5= <user>
##$WDW= 1
##$XDIM= 8192
##$YMAX_p= 0
##$YMIN_p= 0
$$ End of Bruker specific parameters
$$ ---------------------------------
##NTUPLES= NMR FID
##VAR_NAME=  TIME,          FID/REAL,        FID/IMAG
##SYMBOL=    X,             R,               I
##VAR_TYPE=  INDEPENDENT,   DEPENDENT,       DEPENDENT
##VAR_FORM=  AFFN,          ASDF,            ASDF
##VAR_DIM=   8192,          8192,            8192
##UNITS=     SECONDS,       ARBITRARY UNITS, ARBITRARY UNITS
##FACTOR=    0.0002004,     1,               1
##FIRST=     0,             0,               0
##LAST=      1.6414764,     0,               0
##MIN=       0,             -339416,         0
##MAX=       1.6414764,     459245,          0
$$ Real data points
##PAGE= N=1
##DATA TABLE= (X++(R..R)), XYDATA
$$ [...]
2700a689K132J005j039k333j682l32J452J930Q51j179j965o07J05J078R03j32
$$ -1689 443 1448 409 -1924 -3606 -3938 -2486 -556 295 -884 -2849 -3456 -3351 -2273 -1370 -1502
2716a502j124o56N84J175M60p22r04r93Q22J742J065K56k116j684l10J244K600
$$ -1502 -2626 -3282 -2698 -1523 -1063 -1785 -2689 -3682 -2860 -1118 -53 203 -1913 -3597 -3907 -2663 -63
2733f3J487o93k285j797J56J449K598J179j650j877j062M07J652J319k39j099
$$ -63 1424 731 -1554 -3351 -3195 -1746 852 2031 381 -1496 -2558 -2151 -499 820 581 -518
2749e18j251k74J068J284L9j360j309j45J658J326J26j287k246q96R41K535J077
$$ -518 -1769 -2043 -975 309 348 -1012 -2321 -2466 -808 518 644 -643 -2889 -3785 -2844 -309 768
2766G68k93k217k209m43J718K359Q32o94k318j823K72J883K017J86j429j373o47
$$ 768 475 -1742 -3951 -4394 -2676 -317 515 -179 -2497 -4320 -4048 -2165 -148 38 -1391 -2764 -3411
2783c411R56J688M53o26j234r58R46J840O13o07j836j082N54J928J871j39j514
$$ -3411 -2455 -767 -314 -940 -2174 -3132 -2186 -346 267 -340 -2176 -3258 -2704 -776 1095 956 -558
2800e58k163j87J401J931J248n89k113j393j11J519K089O58j438j927q47J242
$$ -558 -2721 -2908 -1507 424 1672 1083 -1030 -2423 -2534 -1015 1074 1732 294 -1633 -2480 -1238
2816a238J705N57p40r77j072M06J337J101k11j544j202k21J577J387K99j445j548
$$ -1238 467 1024 284 -693 -1765 -1359 -22 1079 868 -676 -1878 -2099 -522 865 1164 -281 -1829
2833a829q66Q23J808R65k03j494j770J50J458J315M43j108j452n86N84J515R70
$$ -1829 -2695 -1872 -64 901 698 -796 -2566 -2416 -958 357 800 -308 -1760 -2346 -1762 -247 723
2850G23q69j053q28L43R83R94M0r68j168k80R06J485P77j307j552o10M80J646
$$ 723 -146 -1199 -2027 -1684 -701 293 333 -635 -1803 -2083 -1177 308 1085 -222 -1774 -2384 -1904 -258
2868b58R65k69j540j201Q0J130J467M9j077j446k26P36J788L75q31j265q14L54
$$ -258 707 438 -1102 -2303 -2223 -1093 374 423 -654 -2100 -2326 -1590 198 573 -258 -1523 -2337 -1983
2886a983J368J253n55j241r47m91J862J302L91r68j972m03Q15J504R32n96j671
$$ -1983 -615 638 83 -1158 -2105 -2596 -734 568 959 -9 -1981 -2384 -1569 -65 867 271 -1400
2903a400o76L3J667J280j85j260q76n48R91J575J108j156j627j032Q06J562J555
$$ -1400 -2076 -2043 -376 904 719 -541 -1417 -1965 -974 601 1709 553 -1074 -2106 -1300 262 1817
2920A817K93k203j319m4J178J742Q52j130j439j012N01K091Q75k70j384j208j70
$$ 1817 2110 -93 -1412 -1456 -278 1464 2316 1186 -253 -1265 -764 1327 2202 1932 548 -660 -830
2937h30J708J263K75j300j774j23J484J458Q08j015j904r75L27K056J900k61j729
$$ -830 878 2141 2416 1116 -658 -781 703 2161 2969 1954 50 -925 -598 1458 3358 3097 1368
2954A368j944n24J158K050J141q30j830j315J87J555J673J37j521j307l32P81
$$ 1368 -576 -1100 58 2108 3249 2419 589 -726 -539 1016 2689 2826 1305 -2 -334 447
2970D47J618M61j065j927j47L20J788R91j020j748j445N60J538J690Q0j489k161
$$ 447 2065 2526 1461 -466 -613 -293 1495 2486 1466 -282 -1727 -1167 371 2061 2141 652 -1509
2987a509j008R37K218J236l16k179j547j52J565J428M80q03j562o65N66J522M65
$$ -1509 -2517 -1580 638 1874 1558 -621 -2168 -2320 -755 673 1153 350 -1212 -1877 -1311 211 676
3004F76m26j291k84M36J429P79j15j334j554K67K256J283K41j266j952q30J203
$$ 676 250 -1041 -1325 -889 540 1319 1204 -130 -1684 -1417 839 2122 2363 1097 -855 -1685 -482
3021d82K139J250M1j828j447l46R67J956P08o37j470r02N18J113P45jj126p56
$$ -482 1657 2907 2948 1120 -327 -673 294 2250 2958 2321 851 -51 467 1580 2325 2324 1198 442
3039D42M02Q68N72m04j178r56mJ563J524j47j839j484q66Q23K171R49j29k172
$$ 442 844 1712 2284 1880 702 -254 -258 1305 2829 2682 843 -641 -1507 -684 1487 2436 2307 135
3057A35j540p66J592J443J244j042j337j097K66J181N77K32q21m91l01J142O19
$$ 135 -1405 -2171 -579 864 2108 1066 -271 -1368 -1102 79 656 888 67 -424 -725 417 1036
3074A036k10j170p46R93J249J217K1j273j391n53R13K450J424m17j709j824l90
$$ 1036 826 -344 -1090 -97 1152 2369 2390 1117 -274 -827 86 2536 3960 3543 1834 10 -380
3091c80J531K275O77n48j852j033J03J637J172J9j066p76m9N46R59k23r33j387
$$ -380 1151 3426 4103 3555 1703 670 773 2410 3582 3601 2535 1759 1710 2256 3215 2992 2059 672
3109F72L77J500P28j11j385k016r17J461J930J252q12k052k301n36J667K055J197
$$ 672 1049 2549 3277 3166 1781 -235 -1152 309 2239 3491 2679 627 -1674 -2210 -543 1512 2709
3126B709j256k010j752o6J661J264L12q08j506n08O55R07J9m18r26l1J222J004
$$ 2709 1453 -557 -2309 -2375 -714 550 862 54 -1452 -1960 -1305 -398 -379 -797 -1723 -1754 -532 472
3144D72O39j815j452j53P96K165J738k52k150j616o40J900K027J906o55k031j791
$$ 472 1111 -704 -2156 -2309 -1513 652 2390 2138 -12 -1628 -2268 -368 1659 3565 2910 879 -912
3161i12r5J927J955Q64j088j302o19K66J119R85m59q27l29L42R48N44q26j536
$$ -912 -1007 920 2875 3739 2651 1349 730 996 2115 3100 2641 1814 1485 1827 2775 3319 2493 957
3179I57o74Q71J312J502k94j797k396o74J627K327J342p52k673k151M5J303K295
$$ 957 283 1154 2466 3968 3674 1877 -519 -1193 434 2761 4103 3351 678 -1473 -1428 -125 2170
3196B170P24r16j693j456K82J244R49j58p00r02K6R36N24o92j103l67N69J331
$$ 2170 2894 1978 285 -1171 -889 355 1304 1146 446 -456 -430 506 1030 338 -765 -1132 -563 768
3214G68J263j67j535k001m26J592K420J203n51k459k083K65J816K248J019j280
$$ 768 2031 1864 329 -1672 -2098 -506 1914 3117 2566 107 -1976 -1711 105 2353 3372 2092
3230B092j519j477M99J305J086K07r13q33KO58N53m46q41m72K51J428Q46l69j724
$$ 2092 573 -904 -405 900 1986 2193 1280 447 449 1107 1660 1214 373 -99 152 1580 2426 2057 333
3249C33j671k86J379K183J193j091k451j855nJ801K283p1o28j786j462K49J346
$$ 333 -1338 -1624 -245 1938 3131 2040 -411 -2266 -2271 -470 1813 1742 1114 -672 -2134 -1885 -539
3266e39J335j61j013o67j59P74N39m78o76j50J94J162P93k08j623j454q5J274
$$ -539 796 635 -378 -1045 -1204 -430 109 -369 -1045 -1195 -1001 161 954 746 -877 -2331 -2416 -1142
3284a142K299R74j012k111j858L19J935K200P16j325j924j556O60J545J421K20
$$ -1142 1157 2131 1119 -992 -2850 -2531 -596 1604 2320 995 -929 -2485 -1825 -280 1141 1361
3300A361j252q28n21J011O86J21n14n96p7J098O41k45j243j133k44J174J922J028
$$ 1361 109 -719 -1240 -229 457 578 64 -532 -609 489 1130 885 -358 -1491 -1735 -561 1361 2389
3318B389j178k017j433J7K078K046R48j449k269j364O80J625J768L15j277j328
$$ 2389 1211 -806 -2239 -2222 -144 1902 2850 1401 -868 -2232 -1552 73 1841 2156 879 -449
3334d49n34Q26Q62O18k19j081R2N50Q04j29n08j699j31J385J697N16n51k089j211
$$ -449 -983 -157 705 1323 1104 23 115 665 1469 1340 832 -867 -998 387 2084 2600 2049 -40 -1251
3353a251j94J927J937P08j396k330j110QK246J379M21j234j799q75K87J673O91
$$ -1251 -1445 482 2419 3127 1731 -599 -1709 -1701 545 1924 2345 1111 -688 -1563 -1276 397 1088
3370A088o02m51o12J43P71r9m28r73k49P20J274M86o67j259j832K47J805J255
$$ 1088 486 35 -577 -434 337 238 -190 -1163 -1412 -692 582 1068 401 -858 -2690 -2443 -638 617
3388F17R96j159j963j153J94K157J299Q03j286j779o73N95J412R62k00p40q86
$$ 617 1613 454 -1509 -2662 -2468 -311 988 1791 505 -1274 -1947 -1352 60 1022 822 82 -804
3405h04R9R44P18k10j097m02M42J374M96k20j367j207M7J545J655Q45j294j937
$$ -804 -705 239 957 747 -350 -752 -310 1064 1560 1340 -27 -1234 -1187 358 2013 2858 1564 -373
3423c73j440N94J794J618N0q60j578j031O80J430J138j40j411r89QO42J005l47
$$ -373 -1813 -1219 575 2193 2243 1383 -195 -1226 -546 884 2022 1882 471 -518 -510 132 1137 790
3441G90o65n07K06J114P16m13j350j011k2J554J857J76p31k455j175O35K447J541
$$ 790 125 -382 -176 938 1654 1241 -109 -1120 -1142 412 2269 2445 1714 -741 -1916 -1281 1166 2707
3459B707K5j414j740j002R84J476J418l40j460j073L46R95J016k58n16j040k6
$$ 2707 2732 1318 -422 -1424 -440 1036 2454 2114 654 -419 -73 922 1938 1680 1164 124 98
3476I8J265N62K11j493j269K40J098J464P23j215j895j273O59J716J483L7j142
$$ 98 1363 1925 2136 643 -626 -386 712 2176 2899 1684 -211 -1484 -825 891 2374 2411 1269
3493A269k261p70M54K165J247n58j052j644k24R12J382K14j103p79o32J183P37
$$ 1269 -992 -1762 -1308 857 2104 1546 494 -1150 -1374 -462 920 1134 31 -748 -1380 -197 540
3510E40Q2n75j267m57P95J576P11n60j772j206J45J706J701L52q77k014r62O10
$$ 540 622 47 -1220 -1677 -882 694 1405 845 -927 -2133 -1988 -282 1419 1771 894 -1120 -2082 -1472
3528a472J967J648m83j611j247j70J008J315M67q69o95q09O19J109N54o69p61
$$ -1472 495 2143 1660 49 -1198 -1368 -360 955 1422 553 -142 -951 -332 777 1331 662 -99
3545i9o87N15J201O84n70j219j117K11Q58J629O88j382j631q26P36J362J001j75
$$ -99 -786 -271 930 1614 1044 -175 -1292 -1081 -223 1406 2094 712 -919 -1745 -1009 353 1354 1179
3563A179j075j056m91P53J410O25q12r91q21O66Q53Q10o92m87m54j2J079R30k01
$$ 1179 104 -952 -1443 -690 720 1345 533 -458 -1279 -613 240 1050 358 -129 -583 -595 484 1414 1213
3582A213j156r58L58Q25J119M04n37j769k24N95J212J038k43n29j325m43J123
$$ 1213 57 -901 -543 282 1401 1805 1268 -501 -725 -130 1082 2120 1877 1348 23 -420 703
3599G03J344n5l61p95o98K18J054N49J88j397m80J86N89P58j58q91r56l53R11
$$ 703 2047 1992 1631 836 138 356 1410 1959 2147 750 270 456 1045 1803 1645 754 -202 -555 356
3618C56R77M99n98j248j258P15R66R61k09j044j200o13J051J264N58q40j246o15
$$ 356 1333 1832 1234 -14 -1272 -557 409 1370 1161 117 -1083 -1696 -645 619 1177 337 -909 -1524
3636a524J54J455P17l55r54r47n8J071J050jn60j274l22Q55J236O97n03j229j067
$$ -1524 -1370 85 802 447 -507 -1454 -1512 -441 609 608 48 -1226 -1548 -693 543 1240 737 -492 -1559
3655a559J99J381J236K07j058j464m22J199J477M97m52j248j198L36J244J369
$$ -1559 -1360 21 1257 1464 406 -1058 -1480 -281 1196 1693 1241 -7 -1205 -869 375 1744
3671A744J0j320j254n9Q45J690L84j006j003j189P89J089J285m45j209j511N6
$$ 1744 1754 434 -820 -879 -34 1656 2040 1034 31 -1158 -369 720 2005 1560 351 -1160 -1104
3688a104J349J118O27j053j389j061J043J436J027k81j693j043j6J245J638J67
$$ -1104 245 1363 1990 937 -452 -1513 -470 966 1993 1712 19 -1024 -1040 205 1843 2010
3704B010q74j894l69O33J671J159q54j500o87j89J634J299j44r22j623l46P66
$$ 2010 1136 -758 -1127 -494 1177 2336 1482 -18 -705 -894 740 2039 1895 973 -650 -996 -230
3721b30J887O39l66j676j098J37J777J036j24r37j494m23J412J163N83j022j644
$$ -230 1657 2296 1930 254 -844 -707 1070 2106 1982 1045 -449 -872 540 1703 2286 1264 -380
3738c80j084Q18J841J205m13j594j692l3J483J394P31j168j538q09L75J522J173
$$ -380 -1464 -646 1195 2400 1987 393 -1299 -1332 151 1545 2276 1108 -430 -1239 -864 658 1831
3755A831m24j146j296O6J040J541l4r81j078o12R80J472M08r94j406p24O03J559
$$ 1831 1407 261 -1035 -969 71 1612 1578 597 -481 -1093 -113 1359 1767 773 -633 -1357 -754 805
3773H05J327l11j609j427r4J385J707L34j145j473q16N87J647Q68j40j387j055
$$ 805 2132 1821 212 -1215 -1309 76 1783 2117 972 -501 -1317 -730 917 1785 1645 258 -797
3790g97k86J266R96K42r98j228l20Q05J430L55j047j519o51P21J960O83m92j728
$$ -797 -1083 183 1179 1421 423 -805 -1125 -320 1110 1465 418 -1101 -1752 -1031 929 1612 1120 -608
3808f08j061o7J488J627O27j252k008o27J044J556Q43j97j640j217N55R72K046
$$ -608 -1669 -1736 -248 1379 2006 754 -1254 -1881 -837 719 1562 1365 -275 -1492 -937 35 2081
3825B081n61j173q35k48J385J046O95j260j590k96J067J835R60o80j732j626L38
$$ 2081 1520 347 -488 -736 649 1695 2390 1130 -460 -756 311 2146 3106 2426 694 -932 -594
3842e94K192J566K98j438j880j119J139J946J411m58j933j592l0J775J517K23
$$ -594 1598 3164 3462 2024 144 -975 164 2110 3521 3063 1130 -462 -492 1283 2800 3023
3858C023j462j515l22R82J568L00j214j906r36J543J853R40q58k396j541m5K168
$$ 3023 1561 46 -276 706 2274 2574 1360 -546 -1482 61 1914 2854 1996 -400 -1941 -1986 182
3875A82K383J53k002k177j209J235K066K106r47j831k003L05J318K102L78j475
$$ 182 2565 2718 716 -1461 -2670 -1435 631 2737 1790 -41 -2044 -1739 -421 1681 2059 584
3891E84j661o13J414J642N11j090j627j089J374J775J580o89k320j351J79K029
$$ 584 -1077 -1690 -276 1366 1877 787 -840 -1929 -555 1220 2800 2111 -209 -1560 -1381 648
3907F48K084N28j760k710j124J375K489J997r32k142j640j89J558J589P84j050
$$ 648 2732 3260 1500 -1210 -2334 -959 1530 3527 2595 453 -1187 -1376 182 1771 2555 1505
3923A505j619q35P82J501P49j149j409p87R48J457O12j34j640j806O0J699J958
$$ 1505 -114 -949 -167 1334 2083 934 -475 -1262 -314 1143 1755 1621 -19 -1825 -1765 -66 1892
3940A892N19j799k036j084R57K078J767m55j641j970O5J171J891L54p39j709l92
$$ 1892 2411 612 -1424 -2508 -1551 527 2294 1839 198 -1772 -1707 -536 1355 1709 970 -739 -1131
3957a131P01R86R54l24j261o39P46J160P59m73j552j000Q58J361J408P9j457j744
$$ -1131 -430 556 1510 1186 -75 -714 32 1192 1951 1478 -74 -1074 -216 1145 2553 2632 1175 -569
3975e69o04R62J799J438q11j439j445Q4R64J397M76o36j213p28M34P36N86m66
$$ -569 -1173 -211 1588 3026 2215 776 -669 -585 379 1776 2252 1616 403 -325 109 845 1431 965
3993I65p71o80P28Q28K46l98j528o29O98J140J213k14j699j270l79J013J618P87
$$ 965 194 -486 242 1070 1316 918 -610 -1239 -541 599 1812 1598 -101 -1371 -1750 -737 881 1668
4011A668l90j641j206l1J033J433M96r66j298n81P17J043L85q08l72j84K41Q64
$$ 1668 1278 -363 -1569 -1600 -567 866 1362 396 -902 -1483 -766 277 662 -146 -518 -702 -461 403
4029D03K38l99r44p83N62J270J178l86j542j041o77J320K019M7m84j533j093L39
$$ 403 641 242 -702 -1485 -923 347 1525 1139 -403 -1444 -2121 -801 1218 1265 781 -752 -1845 -1506
4047a506R74J251M81p00j239n23K59R02M70q0o17l30K77K63q5J45p40l90N43P80
$$ -1506 -532 719 1200 500 -739 -1262 -1003 -101 369 289 -328 -658 -381 -118 -203 -58 -798 -1188 -645 135
4067A35O65k03r63j151l77J320J289O58m71j185j458j78J452J456M26o30r58q55
$$ 135 800 597 -366 -1517 -1894 -574 715 1373 902 -283 -1741 -1919 -467 989 1415 785 -173 -1028
4085a028K31P84N84K19n03n09j38P45m4J96m92k42K26P87K41k79l07q22l41N90
$$ -1028 -797 -13 571 790 287 -222 -360 385 341 537 45 -197 29 816 1057 778 471 -351 -692 -102
4105a02J003Q83l05j480r46l56J295J126L18k34j098p74j61L32J306J09j68r59
$$ -102 901 1784 1479 -1 -947 -1303 -8 1118 1436 1202 104 -670 -831 -499 807 916 748 -211
4123b11m04l8O11p2l18N56m12J46M39l9m59k15P2k03O78O12p2r56n16m70J99J338
$$ -211 -615 -653 -42 -114 -432 124 -288 -142 297 258 -201 -416 -344 -547 131 743 671 -285 -801 -1271 -1072 266
4145B66O32J22r05j234k09p5J330O98J81p93q19j40p3O59P03q8l49m44j60J02
$$ 266 898 1020 115 -1119 -1328 -1403 -73 625 806 13 -806 -946 -1019 -360 343 255 -94 -538 -698 -596
4165e96L52j58pk24L73M88k62M2r08k49K31M60O99M52n60j404m40L84Q35J121
$$ -596 -244 -402 -409 -633 -260 228 -34 8 -900 -1149 -918 -458 241 693 133 -1271 -1711 -1327 -492 629
4185F29K54r76r27k76m4R41N47K20m44m72k17r8M11M77n9q4l35L70L29q1l33l52
$$ 629 883 -93 -1020 -1296 -1340 -399 148 368 -76 -548 -765 -863 -452 25 -34 -118 -453 -83 246 165 -168 -520
4207e20k46P01O46K57l67j023m19J82P44P54M92m41j187m50j52R08J057J04o11
$$ -520 -766 -65 581 838 471 -552 -971 -789 -45 709 1201 760 -427 -877 -1029 -121 936 1040 429
4226D29p00j47J32O89N09n19j25k81j98N89J3k58k86l90J70J029K98j43j125r71
$$ 429 -271 -418 -286 403 912 393 268 -13 -211 378 391 133 -153 -543 -373 656 954 811 -314 -1285
4246a285N77M32J261L06p67j084k57j41J113J119k7r85q90j79J30R94M61k42l14
$$ -1285 -708 -276 985 1291 524 -560 -817 -958 155 1274 1247 262 -628 -807 -677 317 778 536 222
4265B22m38J17L12N04m42l32k9L93M56J83m27r81m74K17P08J257K00j154r05r94
$$ 222 -216 -99 213 717 275 -57 -86 307 763 946 519 -462 -936 -719 -11 1246 1446 292 -613 -1607
4285a607M85J574M60j71r12j057j54O10J104m1n73k44o49J06Q43L61k01q77o62
$$ -1607 -1122 452 912 741 -171 -1228 -1382 -772 332 291 -282 -526 -1175 -1069 -226 135 -66 -943 -1605
4304a605P97Q55o8j51j059p24J69J190R60M63j142j342p19J020J412R55k56j287
$$ -1605 -808 47 -21 -172 -1231 -1955 -1786 -596 364 827 -315 -1657 -2376 -1356 56 1011 755 -532
4322e32r92j72J312J136K89o06q73o20P36R18M68l56j009m72L09R93R78j78q27
$$ -532 -1524 -1696 -384 752 1041 435 -438 -1058 -322 596 1064 708 -301 -773 -464 529 1507 1329 502
4341E02j519N47J050J175p2r29j395m73N37J416J050l66j337j419J7J189J028
$$ 502 -1017 -470 580 1755 1683 754 -641 -1114 -577 839 1889 1523 186 -1233 -1216 -27 1001
4358A001Q07r74j557o43O80P97R22m19q80j071J59J531Q10m48r24j111KJ012J103
$$ 1001 1808 834 -723 -1366 -686 111 1033 614 -266 -1337 -1178 353 1163 715 -209 -1320 -1318 -306 797
4377G97N45j053j465n84O99J301J326m21j442r41l71J336J205N04p74j243n99
$$ 797 1342 289 -1176 -1760 -1061 240 1566 1145 -297 -1238 -1609 -273 932 1436 662 -581 -1180
4394a180N71R46J104j66j384p87Q8J348P89p4q78q70k95O22R98R15j131j076q09
$$ -1180 -609 337 1441 1275 -109 -896 -808 540 1329 1255 377 -493 -788 -166 832 1747 616 -460 -1269
4413a269M21J118R56l40j008j023m07R66J120P65r80j360p42N81J068N80J31j321
$$ -1269 -848 270 1226 886 -122 -1145 -1552 -586 534 1299 319 -1041 -1783 -1202 -134 446 577 -744
4431g44r33K02P00J162J47j025r91k91P92Q11P36q13j110n37N71Q67Q86L69j177
$$ -744 -1677 -1475 -775 387 534 -491 -1482 -1773 -981 -170 566 -247 -1357 -1894 -1323 -456 430 799 -378
4450c78j026j19R77J306P4o68r17p04L35J472Q47o66j070m95N69N72P33J84o84
$$ -378 -1404 -1523 -546 760 834 166 -751 -1455 -1120 352 1199 533 -537 -1032 -463 109 842 1026 342
4469C42j034j70O86J179K48m42j071o38K23J607L51k41j083p22L22O61Q10K62
$$ 342 -692 -862 -176 1003 1251 809 -262 -900 -677 930 1281 1040 -43 -765 -443 218 1028 1290
4487A290q42q88l30N93R48M21n75r18o81J34J209N01j20q97p35j60Q11J006K50
$$ 1290 448 -440 -770 -177 771 1192 617 -301 -982 -848 361 862 742 -155 -890 -1050 -239 767 1017
4506A017p61j012n03O09R10L99j08o19p37r6Q82R64k72n95j067jP49J072N1o53
$$ 1017 256 -756 -1259 -650 260 659 551 -68 -805 -901 -19 945 673 78 -989 -990 -241 831 882 229
4526B29o74o21O33P67J167n69r66o74k11R73R57J64o94r60o35L86J058P50n48
$$ 229 -445 -1066 -433 334 1501 932 -34 -708 -919 54 1011 1175 481 -479 -1114 -728 330 1080 532
4545E32o44o38J01M92R68k72m39j219J50M23J023R6n84q48q71M66J326Q11l78
$$ 532 -112 -750 -649 -157 811 539 100 -1119 -969 -546 477 573 -11 -859 -1730 -1264 62 873 495
4564D95j069j097L94M65J276J40l78j156k00j3J087O59n23m91n32j09Q68N59M04
$$ 495 -574 -1671 -1277 -812 464 604 226 -930 -1130 -1143 -56 603 80 -411 -943 -1052 -184 375 779
4583G79p72q40nK75J023K24j96p89o58L22J192M54k49n84q38k90O80J273L13m89
$$ 779 7 -833 -838 -563 460 684 488 -301 -959 -637 555 1009 760 176 -662 -952 -272 1001 1314 825
4603H25q82n21rR41O41J43m61j011L16k6Q22K44k29o42K51k3N22N5j83p39l45
$$ 825 -57 -578 -587 354 995 1138 677 -334 -18 -44 778 1022 793 151 402 379 901 956 773 34 -311
4624c11K58J130J6K06p88p48l09Q38L34N47k38q59n26k32P77P02K43m28m94j87
$$ -311 -53 1077 1093 1299 511 -237 -546 292 626 1173 935 76 -450 -682 95 797 1040 612 118 -69
4644f9J00J81J76J64o55k4L8N00K14n01k63l36M84J28N27j17o54n73j21P08M31
$$ -69 31 212 388 552 -103 -127 -89 411 625 124 -139 -475 9 137 664 547 -107 -680 -801 -93 338
4665C38P8L05j049o88K69N00M36J15j74m84j21l11M35Q5Q6J61k08M7N5K68j80
$$ 338 416 721 -328 -1016 -747 -247 189 304 130 -354 -475 -786 -351 -266 -180 -19 -227 -180 -125 143 -37
4686c7l74Q3M26N6O4q4j43m51J79q8O73J44j98o51j0K9N69L82l0N2m01m23k4L75
$$ -37 -411 -328 98 154 218 134 -9 -460 -281 -369 304 448 250 -401 -411 -382 187 569 539 591 190 -233 -257 118
4710A18K83J48j37j87j20N2J98r4j34j14J73K75P0j66m51n10J23N22K79J95j33
$$ 118 401 549 412 225 105 157 355 261 127 13 186 461 531 365 -86 -596 -473 49 328 523 390
4731C90o28k93j44N48L18L89l3r86j03o8L33J33L41K54m44j5j06o9K61j27K56
$$ 390 -238 -531 -675 -127 191 580 547 -439 -542 -610 -277 -144 197 451 7 -8 -114 -183 78 -49 207
4752B07k5JN5J8k05q5j34M61K25L81l21l50k69l55M59N78M92o7l76p69k00L34
$$ 207 182 183 238 256 51 -34 -168 293 518 899 578 228 -41 -396 63 641 1133 1066 690 -79 -279 55
4774E5R41k3K19n97l02k35L59L29J55k24j86k70N6J83P5l78l75p4L13M46K05p17
$$ 55 996 973 1192 595 293 58 417 746 901 677 491 221 277 460 535 157 -218 -292 21 467 672 -45
4796d5l26m52K24L72M63J49o15o18l35R0R41M99j29o49m72n04L43O76M13l86k85
$$ -45 -371 -823 -599 -227 236 385 -230 -848 -1183 -1093 -152 347 218 -431 -903 -1407 -1064 -388 25 -361 -646
4817f46m03J55K36K22K49l70K9m64R86K42l35n15l18L71M11N84K08n72m28r25
$$ -646 -1049 -894 -658 -436 -187 -557 -528 -992 -6 236 -99 -614 -932 -561 -150 434 642 70 -358 -1283
4837a283N82J041Q77L8p65p08n70N09R74M32P0j028m4k05L88L08L79o48p3J2R5
$$ -1283 -701 340 1217 1255 490 -218 -788 -279 695 1127 1197 169 125 -80 308 616 995 347 274 286 381
4858C81N09k17n15k48j73O88Q10j05l82j010m04N83K81R98m1m57j166o42Q73O50
$$ 381 890 673 158 -90 -263 425 1235 1130 748 -262 -666 -83 198 1196 1155 698 -468 -1110 -237 413
4878D13P43p53n7o90j64M55L81K79j62l73P3O3L90k68j99l40j90Q98L21Q8m35
$$ 413 1156 403 346 -344 -508 -53 328 607 445 72 145 208 598 330 131 -209 -399 499 820 908 473
4899D73q71l13J65R05N68J83q64o75o6N04O76P07j25r22o29j9N38N30L16o57o05
$$ 473 -398 -711 -546 359 927 1110 246 -429 -495 9 685 1392 1267 345 -284 -303 235 765 1081 424 -181
4920a81J20J38M77p3l77m63K90K33J139m77p79n47j31M52O20Q60m43n99j318r
$$ -181 -61 77 554 481 104 -359 -69 164 1303 826 47 -500 -631 -179 441 1301 858 259 -1059 -1068
4940a068N33J211O20q16q92n58L2P70P49r7l10j012N00J92M52K54p29m89K22L14
$$ -1068 -535 676 1296 480 -412 -970 -938 -168 581 484 174 -838 -338 -146 306 560 -169 -658 -436 -122
4960a22O78J68n25j198J18L14J244N68l59q51j102O4P03J365M94n13j257n80R2
$$ -122 556 724 199 -999 -881 -567 677 1245 886 35 -1067 -1003 -300 1065 1559 1046 -211 -791 -699
4979f99R15Q21J09n21p17j11N73N62Oj15q70n2P13N19K13l71r97o50O80R76J018
$$ -699 216 1037 1146 625 -92 -203 370 932 938 823 -47 -99 614 1133 1346 975 -22 -672 8 984 2002
5000B002o70r66q97j4P21J056P13p24j078r85L04J033Q00J65o97p47l40N69N55
$$ 2002 1332 366 -531 -545 176 1232 1945 1221 143 -842 -538 495 1295 1460 763 16 -324 245 800
5019H00nJ01q93NK18O68K94m03p54k27l7Q46Q11o7r19q44l18O85J008M34l06j247
$$ 800 795 896 3 8 226 894 1188 785 31 -196 -233 613 1424 1357 438 -406 -724 -39 969 1403 1097 -150
5041a50p87K52Q89Q53J65o18q07k05L35M99M21n42k56m00L66K3N44k01r73R3J66
$$ -150 -937 -685 204 1057 1222 604 -203 -408 -73 426 847 305 49 -351 15 38 582 381 -592 -499 -333
5062c33M43R72m75q50m40k57P77P65J18m34q06l64Q1M53Q82O4n84r63p3N02Q30
$$ -333 110 1082 607 -243 -683 -940 -163 602 720 286 -520 -884 -803 -350 532 596 12 -951 -1024 -522 308
5083C08Q6l52p95k36P48K85M72o58m80j37M08Q96R0k57k46j078P8J084P32K60
$$ 308 394 42 -753 -989 -241 44 516 -142 -622 -759 -351 545 635 378 132 -946 -868 216 948 1208
5103A208o52r39l57K63P28Q31k31o07o39o5M54R48k3n58k66k02K51O49M7k97n80
$$ 1208 556 -383 -740 -477 251 1082 851 244 -395 -460 -6 942 919 361 95 -107 144 793 840 543 -37
5124c7q2M08M46K08j30o17o73j65P43P83J89n20r31l33J31J155L00j90p57m77
$$ -37 -119 289 735 943 813 196 -477 -642 101 884 1073 553 -378 -711 -580 575 875 685 -72 -549
5144e49m13O80O09J55o6n56n54L20N74M34p01j62p94L61O57N63k72k65r59l0N76
$$ -549 -962 -282 327 482 416 -140 -694 -374 200 634 -67 -229 -1023 -662 -5 558 286 21 -938 -968 -392
5165c92O83M47l65q97l70K03R75M66K75p23q63J88m6Q16O14m47n04l32j90Q76
$$ -392 291 738 373 -524 -894 -691 284 750 1025 302 -561 -373 -419 397 1011 564 60 -272 -462 414
5185D14M62m00m47l26j93M65M59M3m22n99j57L91N80J26j86m77n93O9P46Q9L36
$$ 414 876 476 29 -297 -490 -25 434 477 55 -544 -701 -310 270 396 210 -267 -860 -791 -45 44 380
5206C80p37k76l85L56M84L39j20k89p74J29O13N7L52o45m50r7K00O20K63l18m65
$$ 380 -357 -633 -1018 -662 -178 161 41 -248 -1022 -893 -280 -223 129 -516 -966 -1063 -863 -243 20 -298 -763
5227g63jK4P04L05k02l44o95K92M07O35k73Q1n64k33M17K67O85l51l10m66K98
$$ -763 -764 -740 -36 269 67 -277 -972 -680 -273 362 89 170 -394 -627 -210 57 742 391 81 -385 -87
5248h7J58K36J37J34o62j73N30N86kl42n34N4n4O46M08m04j9q83K30K36M93l5
$$ -87 71 307 444 578 -84 -257 273 859 857 515 -19 35 -19 627 1035 631 612 -271 -41 195 688 653
5270F53j02o00k94K56M85L38J40n58m78j7L38M14j62l07l45Q4M23j57L68j53o58
$$ 653 551 -49 -343 -87 398 736 876 318 -160 -177 161 575 413 106 -239 -155 268 111 479 326 -332
5291c32k27m3M80M47K8o19j74j36N1O45K59l01o83l27K64K87N54rq62j49J11J96
$$ -332 -559 -602 -122 325 353 -266 -440 -576 -525 120 379 78 -605 -932 -668 -381 173 164 -698 -847 -736 -540
5313e40M01K66Q6q08j22J83M51J78qk78n59K05qP75L39n90n89l70M80O92J12R5
$$ -540 -139 127 213 -595 -717 -534 -83 95 87 -191 -750 -545 -553 222 561 -29 -618 -988 -508 184 296 391
5335C91p81k98J35L04K16N33o72l77J54R4N10K59j45p76l71J88N53P45m36m37
$$ 391 -390 -688 -553 -249 -33 500 -172 -549 -395 -301 209 468 323 -453 -824 -636 -83 662 226 -211
5355b11m63m4P51M85N7k89o03l43pO86M54m11k64o83O0K74R71k36m34m59L35j7
$$ -211 -674 -718 33 518 575 286 -317 -660 -667 19 473 62 -202 -885 -825 -551 420 184 -250 -709 -374 -391
5377c91O09k1k56m36j35R9O76K17j07o81j81k06N28O34J61j65p31l12J70N90K57
$$ -391 218 197 -59 -495 -630 -531 145 362 255 -426 -607 -813 -285 349 510 345 -386 -698 -528 62 319
5398C19M1m91k04J23J48M11L04k20q68J89L8M64L43j96n50l24L47L83L27lo09
$$ 319 360 -131 -335 -212 -64 347 651 431 -437 -248 -210 254 597 401 -149 -473 -126 257 584 581 -28
5419b8k10j76M75K80M27j33p53m04k5P56L72k04m81m71J21J69K99L70m36l37l53
$$ -28 -238 -414 61 341 768 635 -118 -522 -547 209 581 377 -104 -575 -454 -285 14 384 -52 -389 -742
5440g42N56K86N5l31j46l22j52N56L48J17o52k72M9J55M17J96j39m19n36K25K91
$$ -742 -186 100 155 -176 -322 -644 -796 -240 108 225 -427 -699 -650 -495 -78 118 -21 -440 -976 -751 -460
5461d60P55l33m26n18L5K67M55K86m99r3n07O11J30M27k65k37k81j8M20N69p7
$$ -460 295 -38 -464 -982 -947 -680 -225 61 -438 -531 -1038 -427 -297 130 -135 -372 -653 -671 -251 318 241
5482B41m83o14L7M03P34J45m16q58r0J76N87P52j69l08p19l79O57P1O11j5l87
$$ 241 -242 -856 -819 -416 318 463 47 -811 -901 -725 -138 614 445 137 -582 -961 -304 -233 378 363 -24
5503b4l96K73J87L86j32l53l27J27M26L56k87j64k22m5L41L89M05q1r91l57L18
$$ -24 -420 -147 40 426 294 -59 -386 -259 167 523 236 72 -150 -195 146 535 940 859 -132 -489 -171
5524a71O90J80J18n25m21k14O74K24J93k59J47o52n9N18m1J04m90J75Nj71L09
$$ -171 519 699 817 292 -129 -343 331 555 748 489 636 -16 -75 443 402 506 16 191 196 25 334
5545C34j32m0n29P0J15N13J96o7q84m39L53M47N72K19n07q52j85K80M42L51J15
$$ 334 202 162 -367 -297 -182 331 527 460 -424 -863 -510 -63 509 728 221 -631 -816 -536 -94 257 372
5566C72o14m58J91j4M23p3K44m05n2J42L27j53P4p00K18L01M50K75n20k87J8K13
$$ 372 -242 -700 -509 -523 -100 -173 71 -334 -386 -244 83 -70 4 -696 -478 -177 273 548 28 -259 -241 -28
5588b8L11K91J86j30j026K16r0N86K15L54k88o31K3K9N14N39n70l55J17n1N1O03
$$ -28 283 574 760 630 -396 -180 -270 316 531 885 597 -34 -11 18 532 1071 501 146 263 212 263 866
5610H66l68l07J53Q7K90j58k63o5l87n6L17M60K02k16o52n34L27J64N83oo4k97
$$ 866 498 191 344 431 721 563 300 235 -152 -208 109 569 771 555 -97 -631 -304 -140 443 437 373 76
5632G6o18K75M04J21l8J63n13J84j91K12L7j63k02K86L06R2k86j39k38MO68L24
$$ 76 -542 -267 137 258 220 383 -130 54 -137 75 112 -51 -253 33 339 431 145 6 -232 -228 440 764
5654G64O6J26o66m25J77N13L63J21m41Qp20L04O71L37j36j6n66K35k64M63J53
$$ 764 830 956 290 -135 42 555 918 1039 598 606 -114 190 861 1198 1062 1046 480 715 451 914 1067
5675A067J96n61R6r1K1J68k22o7l9O37k54k11k9m03l69M8M21L63j42K4q01k65
$$ 1067 1263 702 798 707 728 896 674 607 568 1205 951 740 711 308 -61 -13 408 771 629 653 -148 -413
5697d13P6M66O40j34n82m58k29L12K35J96m18k68J9J69m1L92j42l71j13J8L86
$$ -413 -337 129 769 635 53 -405 -634 -322 -87 109 -309 -577 -558 -389 -430 -38 -180 -551 -664 -646 -260
5718b60L85l02j31l94J8M63M76L16n19k68m42J97M95O15j34j04p71q5O03J48O85
$$ -260 125 -177 -308 -702 -684 -221 255 571 52 -216 -658 -461 34 649 515 411 -360 -445 158 306 991
5739I91l86j48n33J38M82o9J84k67k66J78K53K12M5n77k66K80K78L81K7j70o95
$$ 991 605 457 -76 62 544 475 659 392 126 304 557 769 814 237 -29 251 529 910 937 767 72
5760G2l42O3Q89J16l9m88n83k33L06P29O6j82k23k27k31L97L11N1o12j85K85L33
$$ 72 -270 -207 682 798 759 271 -312 -545 -239 490 556 374 151 -76 -307 90 401 452 -160 -345 -60 273
5782B73J55J9l53m44j33M79L97L20k32m13q52J41P11O82k90j92p45j11M88L22
$$ 273 428 447 94 -350 -483 -4 393 713 481 68 -784 -643 68 750 460 268 -477 -588 -100 222
5802B22L44j79j27n68N2K66N38P7m82k60j78M20M60j73j18n06r3K78L41K03l8
$$ 222 566 387 260 -308 -256 10 548 625 143 -117 -295 125 585 412 294 -212 -305 -27 314 517 479
5823D79o51m54J23O53N45j54n98l31k10j37O92O19m36j46l69j18M30L1K12j67
$$ 479 -172 -626 -503 150 695 541 -57 -388 -598 -735 -43 576 140 -6 -375 -493 -63 -32 180 13
5843A3m99J03k3N13j66p7n37p5M23O56R2n68n47l9j39O21O10J66n34q37k9J81
$$ 13 -486 -383 -406 107 -59 -136 -673 -748 -325 331 423 -145 -692 -731 -870 -249 361 527 -7 -844 -873 -692
5865f92O72M32m81k91m63J69M70N88K13p96l08o2L48M49R3j44o43%K31J26M43
$$ -692 -20 412 -69 -360 -823 -654 -184 404 617 -179 -487 -549 -201 248 341 197 -446 -446 -215 -89 354
5886C54k81k58l85J33N38N24L1o85o31k42O13O33L85l71j39q14J94M43N52Mj72
$$ 354 73 -185 -570 -437 101 625 656 -29 -660 -902 -289 344 729 358 219 -595 -401 42 594 598 426
5907D26o92k7R8M45J0J20n81m07N61N16l7m2n36m14J54O76M86J62l58p91j65L65
$$ 426 -266 -293 -195 250 260 380 -201 -608 -47 469 432 390 -146 -560 -406 270 756 918 560 -231 -396 -31
5929c1M84L16l08n55l93j42O68O64l4l95m79M5M4L00J03n6l12m79K04M19K1ok61
$$ -31 453 769 461 -94 -487 -629 39 703 669 274 -205 -160 -116 184 287 231 -81 -560 -356 63 84 78 -183
5952a83j53l55P87R3K04k55m88l82J8P25L00k18k82n87l84O79N35J51n0q27l88
$$ -183 -336 -691 96 189 393 138 -350 -732 -714 11 311 93 -189 -776 -1160 -481 54 205 155 -672 -1060
5973a060M97N29j37O4k19l42k2J99P74k00n17j76R8j2O08R3o39k7j36O6N81M80
$$ -1060 -563 -34 -171 -107 -326 -668 -690 -491 283 83 -434 -610 -512 -524 84 177 -462 -489 -625 -559 22 502
5995E02l79l04m89k12O98K30J25j6l83j95k05P16K59k7n43N2k28K83L05j61l15
$$ 502 123 -181 -670 -882 -184 46 171 155 -228 -423 -628 88 347 320 -223 -171 -399 -116 189 28 -287
6016b87K7Q1M01k5N18n31n04J53k94N91M75J11l90n15k8L59M26kl23m01k17P3
$$ -287 -260 -179 222 197 715 184 -320 -167 -461 130 605 716 326 -189 -217 142 568 566 243 -158 -375 -302
6038c02K01N02j8m62j75o2L68M08k46j29m18j9K44M61Mj93l77k17j8N12K27k14
$$ -302 -101 401 383 -79 -254 -316 52 460 214 85 -333 -352 -108 353 357 164 -213 -430 -448 64 291 77
6060G7m51j97M6J16L62j9O8l45j80P5M86L85m17k44k67J21K05J90M8j41k26j71
$$ 77 -374 -571 -525 -409 -47 -66 2 -343 -523 -448 38 423 6 -238 -505 -384 -179 11 59 -82 -308 -479
6082d79J33L18M24k29n46J25o6L44L27r8q40J50K38K69J89r6l6m28j30L21K37
$$ -479 -346 -28 396 167 -379 -254 -320 24 351 253 -587 -437 -199 70 259 163 127 -301 -431 -110 127
6103A27J96N1m75r5m35O03J57K51k51l63l84J29M90J49j47m44j89J25J62M06k88
$$ 127 323 374 -101 -196 -631 -28 129 380 129 -234 -618 -489 1 150 3 -441 -630 -505 -343 63 -225
6124b25L3n97jQ1J05N20k23k64l65n6N20L02O0j05n64l25O58J63K14j54k68k10
$$ -225 -192 -789 -790 -709 -604 -84 -307 -571 -936 -992 -472 -170 -110 -215 -779 -1104 -446 -283 -69 -223 -491 -701
6146g01k45N38M03J73l60m15J43L94K52M90l17m01j91L4Q00Q4j68m37J13k53J43
$$ -701 -946 -408 -5 168 -192 -607 -464 -70 182 672 355 -46 -237 -203 597 681 513 76 189 -64 79
6167G9M28M42j037J78r1K10M94n6n1l49p1l87Q02L16j00m93l13l31L84K02L60
$$ 79 507 949 -88 90 -1 209 703 647 596 247 176 -211 591 907 807 314 1 -330 54 256 616
6188F16l77k74l85o4N04J83j20m98k69j76K51P03j92k94k92j01o1O19M55l89k66
$$ 616 239 -35 -420 -484 20 203 83 -415 -684 -860 -609 94 -98 -392 -684 -785 -846 -227 228 -161 -427
6209d27m39K08N02k04J50j23k81j14k2N58Po9k39J01j04j02P58J66n23j47j09
$$ -427 -866 -658 -156 -360 -210 -333 -614 -728 -750 -192 -185 -254 -493 -392 -496 -598 160 326 -197 -344 -453
6230d53N8J86M64k05k41k47L00N3J20j3m60M8R1M4M06Q9j46p02j78M72O26j24
$$ -453 -395 -209 255 50 -191 -438 -138 -85 35 22 -438 -390 -299 -255 151 240 94 -608 -786 -314 312 188
6252A88j60nn51J05J18J32N26n30k01j37L41M9K37k47k58l22L58M44o9kp52Q2
$$ 188 28 23 -528 -423 -305 -173 353 -177 -378 -515 -174 -125 112 -135 -393 -715 -357 87 18 16 -736 -654
6274f54M51n0n3N86m79r4l36J00M83L11J24n77j85n7J90K70K91j09r8m35J0K30
$$ -654 -203 -253 -306 280 -199 -293 -629 -529 -46 265 389 -188 -373 -430 -240 30 321 212 114 -321 -311 -81
6296h1L76J24m42P5n3K28k6j8j29q6K14l7M08M2k33n80k11M02L88N60k70n10m73
$$ -81 295 419 -23 52 -1 227 201 183 54 -32 182 145 553 595 362 -218 -429 -27 361 921 651 141 -332
6319c32L34l2M29qm3j10o80N33PJ77j14l29K07P7pJ40P8k23l28j4N55q3N7j12
$$ -332 2 -30 399 391 348 238 -442 91 98 275 161 -168 39 116 109 249 327 104 -224 -238 317 234 291 179
6343A79m01k62K82L28L73j33m12n17K53P0K52M66k7n68m34P7J42O12j01k6l81
$$ 179 -222 -484 -202 126 499 366 -46 -563 -310 -240 12 478 451 -117 -551 -474 -332 280 179 153 -228
6364b28L1L3K76k03J27n87L02Q7K38L1j26k37m27L78L05N07j40k88n29k59K67
$$ -228 -197 -164 112 -91 36 -551 -249 -162 76 107 -19 -256 -683 -305 0 507 367 79 -450 -709 -442
6385d42P45J11l42j80k11J05J42L85k02j04j37j12K11K20K33p6k92k49O7M62j19
$$ -442 303 414 72 -108 -319 -214 -72 313 111 7 -130 -242 -31 189 422 346 54 -195 -128 334 215
6406B15q3kk07K96J75K93K67n54m72O5L42L18L38j16o85j41o9M19j20N43n43k80
$$ 215 132 130 -77 219 394 687 954 400 -72 -7 335 653 991 875 190 49 -20 399 279 822 279 -1
6428aK4j22M63j2J94l67O9j78M99q1j20k46j00K3m8L57k34q9l17m06N80P5M15
$$ -1 23 -99 364 352 546 179 248 70 569 488 368 122 22 45 -3 354 120 31 -286 -692 -112 -37 378
6451C78J19o64k85J84K91j5L44m1k58m66O2L64J37J2j76j31l83O11k2j23j38n7
$$ 378 497 -167 -452 -268 23 8 352 311 53 -413 -351 13 150 162 -14 -145 -528 83 61 -62 -200 -257
6473b57K38j46K73K24m98K8p1K8L34M77l59r2j03j38R5Q3L3J32m92k97K98K11
$$ -257 -19 -165 108 332 -166 -138 -209 -181 153 630 271 179 76 -62 33 116 149 281 -211 -508 -210 1
6495AK04l33L7j17L1KJ74k89Rk05J79K09J54J80o42J2n24L12L70L81j42n04j43
$$ 1 205 -128 -91 -208 -177 -175 -1 -290 -281 -486 -307 -98 56 236 -406 -394 -918 -606 -236 145 3 -501 -644
6518f44k30M03K15N30j14k28k85L7m6K43K15l13J61K5k27J42J5L4j92P8J46L34
$$ -644 -874 -471 -256 274 160 -68 -353 -316 -362 -119 96 -217 -56 -31 -258 -116 -101 -67 -259 -181 -35 299
6540B99j95k05q2q7J58L60j60J94m40jl86L69O80j38j09k30l62J9K19L28K03k27
$$ 299 104 -101 -183 -270 -112 248 88 282 -158 -159 -545 -176 504 366 257 27 -335 -316 -97 231 434 207
6562B07k75o7M3j88L18k8j00r4o3J83k43L38r1j20k81N04Q7n3K53l92m36J66L40
$$ 207 -68 -135 -92 -280 38 10 -90 -184 -247 -64 -307 31 -60 -180 -461 43 130 77 330 -62 -498 -332 8
6585HL54l12k27k52J51L04J30j72r0K9m06Q1K98L46Q2k95l58Q5J22P0j5l9r7m4
$$ 8 362 50 -177 -429 -278 26 156 -16 -106 -77 -483 -402 -104 242 324 29 -329 -244 -122 -52 -67 -106 -203 -247
6609b47J40J01j08Rn28J36j40N29K15j02m19k87k2L95J79M31j46p36q1j28L77
$$ -247 -107 -6 -114 -105 -633 -497 -637 -108 107 5 -414 -701 -723 -328 -149 282 136 -600 -681 -809 -432
6630d32L22l6m26J5R3K20K25k98o2q8j47J63j0J81N8k7j37p6N05R3R4q70M97l07
$$ -432 -110 -146 -572 -557 -464 -244 -19 -317 -379 -467 -614 -451 -461 -280 -222 -249 -386 -462 43 136 230 -640 -143 -450
6654d50M02K94m8J19n26j5j2K86L38K40n37j08K16N8j52J61j40l02J33K97P8J38
$$ -450 -48 246 198 317 -209 -224 -236 50 388 628 91 -17 199 257 105 266 126 -176 -43 254 332 470
6676D70q4l46m48N12j13L29K9l87P8j90J08K60L3K1m94n2n2L28M18j29m13m17
$$ 470 386 40 -408 104 -9 320 349 -38 40 -150 -42 218 251 272 -222 -274 -326 2 420 291 -122 -539
6698e39L7K34J60J47n4m97N66k92J20M05n25j31j83M04O5L91k18l44j1j83M90
$$ -539 -502 -268 -108 39 -15 -512 54 -238 -118 287 -238 -369 -552 -148 -83 308 90 -254 -265 -448 42
6719D2L89k12j0n52K55m98L97L72J2j01K2k82j22N77k38K7k69J17K82p9Q9L7k79
$$ 42 431 219 209 -343 -88 -586 -189 183 195 94 116 -166 -288 289 51 78 -191 -74 208 129 218 255 -24
6742b4j44k26L64L80k72j20m11K90k4J57J37J62p56J32R6K16R0L01m81k68J23
$$ -24 -168 -394 -30 350 78 -42 -453 -163 -187 -30 107 269 -487 -355 -259 -43 47 348 -133 -401 -278
6763b78Q4L29j7n2l00l20K32L88j49J73l99k2j47N63p3J47k76J19m91K74M87J24
$$ -278 -194 135 118 66 -234 -554 -322 66 -83 90 -309 -331 -478 85 12 159 -117 2 -489 -215 272 396
6785C96m16j56l42J70M54M9J29k36k72P6K7M27K64k98p0k34P5J58K74q0l98j14
$$ 396 -20 -176 -518 -348 106 155 284 48 -224 -148 -121 306 570 272 202 -32 43 201 475 395 -3 -117
6807a17N6N5N68q3l29j62j85K90N11k01J00m11l22J07l6M36K59l08p9M6k32K67
$$ -117 -61 -6 562 479 150 -12 -197 93 604 403 503 92 -230 -123 -159 277 536 228 149 195 -37 230
6829B30L19j76l16r5J31K69N3K20l89n8m46L67M88n11M15j50m07J72L61o0k89
$$ 230 549 373 57 -38 93 362 415 635 246 188 -258 109 597 86 501 351 -56 116 477 417 128
6850A28L08n38P5J97J33j75O4l63K49j76J7K62J41j64l48l9K80K57j94j54r4l42
$$ 128 436 -102 -27 170 303 128 192 -171 78 -98 -81 181 322 158 -190 -229 51 308 114 -40 -134 -476
6872d76L97J89p6j85pP6m56N28L0j05k32k24J32L59K05k45J43n70Q0L88QO03n09
$$ -476 -79 110 34 -151 -158 -82 -538 -10 20 -85 -317 -541 -409 -50 155 -90 53 -517 -437 -49 -41 562 53
6895E3j67P4J83K52p4Kl61j34M8L31M79k70J4j43k00J14R9K89j03l63l04J55M50
$$ 53 -114 -40 143 395 321 323 -38 -172 -124 207 686 416 430 287 87 201 300 589 486 123 -181 -26 424
6918D24q1Q5l0m31N9O6o1M10K32m34n03L16K00J37R0k75k63N6K74J46k15R6l36
$$ 424 343 428 398 -33 26 92 31 441 673 239 -264 52 252 389 479 204 -59 -3 271 417 202 298 -38
6941c8k40J15J86J86O5k0k98Rp4N16m01M2j49k43K86L06m9n1j83j7J67R8J51l11
$$ -38 -278 -163 23 209 274 254 -44 -35 -109 407 6 48 -101 -344 -58 248 199 148 -35 -52 115 213 364 53
6965E3K11k52N5K1N14j14o5l41O3l2L7N70m06l3j24j19J23J61R5k17l94K23M10
$$ 53 264 12 67 88 602 488 423 82 145 113 150 720 314 281 157 38 161 322 417 200 -194 29 439
6988D39j49O8p0k38OK2K43j09J07j67m85o1J99L39J21p6j43j89j8J2K41N2J10
$$ 439 290 358 288 50 56 78 321 212 319 152 -333 -394 -195 144 265 189 46 -143 -161 -149 92 144 254
7011B54l93o4Q4K30j38mk16n9n2K46m3J11k07q0L87k48O48m64r8l2n6J17K94L12
$$ 254 -139 -203 -119 111 -27 -31 -247 -306 -358 -112 -155 -44 -251 -331 56 -192 456 -8 -106 -138 -194 -77 217 529
7035E29n31k94j19N35J12R0J84j96k89n8j3P4K89J28k67k26J77j72K24Q1J67l16
$$ 529 -2 -296 -415 120 232 322 506 310 21 -37 -50 24 313 441 174 -52 125 -47 177 258 425 109
7057A09j03J28N2K29k74n1o0J39J55J66n2k83k94q3N46P7J36k84j11P2m46K92
$$ 109 6 134 186 415 141 90 30 169 324 490 438 155 -139 -222 324 401 537 253 142 214 -232 60
7079F0K40L9l76j09K16j86N21k39O0J18m07J04K34P1l94K24k10N5J81j05J6l26
$$ 60 300 339 -37 -146 70 -116 405 166 226 344 -63 41 275 346 -48 176 -34 21 202 97 113 -213
7101b13J88J81p6J81J96N6l73m01J59J77K47J40j88l51J22J02j76O30n90J33k9
$$ -213 -25 156 80 261 457 513 140 -261 -102 75 322 462 274 -77 45 147 -29 601 11 144 115
7122A15L3Q6K25l57j37m5K19k6R2j20k14L97m23J18j36L76kn01j03L98J16R4j55
$$ 115 148 234 459 102 -35 -80 139 113 205 85 -129 268 -155 -37 -173 203 201 -300 -403 -5 111 205 50
7145E0J10n40n4K97K9Q2j90M1K46l47K39K10k81L8j58J08L43L2k60J69l11m6J26
$$ 50 160 -380 -434 -137 -108 -26 -216 -175 71 -276 -37 173 -108 -70 -228 -120 223 255 -5 164 -147 -193 -67
7168f7L79m0n2j04k07j61K18K13M8J04m67QJ6J79L24k19j75N6n1K59j92K14j69
$$ -67 312 272 220 116 -91 -252 -34 179 227 331 -136 -128 -112 67 391 172 -3 53 2 261 69 283 114
7191A14j55J29L4N0K80l84J3j90J59M01j03J82m80k02L0L53q9P1O8k72j30M5M76
$$ 114 -41 88 122 172 452 68 81 -109 50 451 348 530 50 -152 -122 231 142 213 281 9 -121 -76 400
7214D00p1K31m41j69K06m8J84M3q1j53j34K83m5l0j86J32l02L17l0L23k77l01
$$ 400 329 560 119 -50 156 108 292 335 254 101 -33 250 205 175 -11 121 -181 136 106 429 152 -149
7236a49O5m34K97L68L34l88j57m48K51K26K86r0k66MPj1K79q7k01l8r7q1L37J07
$$ -149 -84 -518 -221 147 481 93 -64 -512 -261 -35 251 161 -105 -101 -94 -105 174 87 -114 -152 -249 -330 7 114
7260A14k89J03k59L37o2k6k50K82j81j97L67J77M39m39l59l3k0M11K58P8k85l73
$$ 114 -175 -72 -331 6 -56 -82 -332 -50 -231 -428 -61 116 555 116 -243 -276 -296 115 373 451 166 -207
7282b07m7J00J25K40k99K74k24k41J26j52L31j27J49l52J78L04j18j64k13lM14
$$ -207 -254 -154 -29 211 -88 186 -38 -279 -153 -305 26 -101 48 -304 -126 178 60 -104 -317 -320 94
7303I4K34J03k06n62k53J83K06M14O0m77Op0J93J76K60k10j48l84J49J47K85r0
$$ 94 328 431 225 -337 -590 -407 -201 213 273 -204 -198 -268 -75 101 361 151 3 -381 -232 -85 200 110
7325A10j03l64K12K29K35J9j86k63J89J14K72k2q2k18k3k22L05N43j35j05l92
$$ 110 7 -357 -145 84 319 338 152 -111 78 192 464 442 360 142 119 -103 202 745 610 505 113
7346A13j64J25L51kM6k43jk70M27k40J93L2r1k12J88m1k0k83n3j75M34L05j06
$$ 113 -51 74 425 423 469 226 225 -45 382 142 335 367 276 64 252 211 191 -92 -145 -320 114 419 313
7369C13k31l97r4M19l4L93k82p6m72m25L47L95J83P3l98k00K46J9L84j90J2m19
$$ 313 82 -315 -409 10 -24 369 87 11 -461 -886 -539 -144 39 112 -286 -486 -240 -221 163 -27 -15 -434
7391d34P0M2Q0K33j60K18l91O3M84j43l27J15k11R3L06j80N44n44j73J33M40q6
$$ -434 -364 -322 -242 -9 -169 49 -342 -279 205 62 -265 -150 -361 -268 38 -142 402 -142 -315 -182 258 172
7413A72L13j31j40k73j56M36n7J04k30l10L49p8j9K80l67J46J4q3L8J43J58l32
$$ 172 485 354 214 -59 -215 221 164 268 38 -272 77 -1 -20 260 -107 39 53 -30 8 151 309 -23
7435b3J05l02L90K3J11j59k39j81J59J66J96k20k86j01L2K76J1L97m46m26K99
$$ -23 82 -220 170 193 304 145 -94 -275 -116 50 246 26 -260 -361 -329 -53 -42 355 -91 -517 -218
7456b18K63j75L65k79k54j02K84L49K01k64l97n3K99J51M9L19j76m89k52P57N1
$$ -218 45 -130 235 -44 -298 -400 -116 233 434 170 -227 -280 19 170 219 538 362 -127 -379 378 429
7477D29p9Q8k76m76K57K93J5r3J9j91j62M70J96J13p58k4K97k16K31Q2o3n3j6
$$ 429 350 438 162 -314 -57 236 251 158 177 -14 -176 294 490 603 -155 -179 118 -98 133 215 152 99 83
7500H3j79K42k7k28k0j56J1J50J43J48k32p6l30q5L19L0L06k24Nj87l12N69Q6
$$ 83 -96 146 119 -109 -129 -285 -274 -124 19 167 -65 -141 -471 -556 -237 -207 99 -125 -120 -307 -619 -50 36
7523C6L6o2k71j51K29J47K1k67O4j93N50k78L1j60l16J36J78M4K3j51J04k24j48
$$ 36 72 10 -261 -412 -183 -36 -15 -282 -218 -411 139 -139 -108 -268 -584 -448 -270 -226 -203 -354 -250 -474 -622
7546f22L20J44N36j91l73n6K02L28Q8n02K66k25K29Oj15J00l08Q5K07n2K74j83
$$ -622 -302 -158 378 187 -186 -242 -40 288 376 -126 140 -85 144 150 35 135 -173 -88 119 67 341 158
7568A58m15M47m62j4M57m0L4j74J49k12N9J0J60o1l52KK26j05M70k21k0l17M1
$$ 158 -257 190 -272 -286 171 131 165 -9 140 -72 -13 -3 157 96 -256 -254 -28 -133 337 116 96 -221 -180
7591a80L14J4j56k01%lN6M27j24k76K97l17K82j89J53M38n09k9k03L77lM2o4N
$$ -180 134 148 -8 -209 -209 -212 -156 271 147 -129 168 -149 133 -56 97 535 26 -3 -206 171 168 210 146 151
7615A51k01l42L30K40J23j23k41l01L67qp3K01k97M7K10r4K73j64l59k7J36k3
$$ 151 -50 -392 -62 178 301 178 -63 -364 3 -5 -78 123 -174 -127 83 -11 262 98 -261 -288 -152 -175
7637a75J07K96k86p6N1l96M54Jj91K87m27n0N96P1k17k48O1k09j33O34k23Q1r0
$$ -175 -68 228 -58 -134 -83 -479 -25 -24 -215 72 -355 -405 191 262 45 -203 -142 -351 -484 150 -73 8 -82
7660h2k90J61J36K83j30j50k48K88r0nO9oj5l97N9L11J24n2J09n50N7J88L69P9
$$ -82 -372 -211 -75 208 78 -72 -320 -32 -122 -127 -58 -64 -79 -476 -417 -106 18 -34 75 -475 -418 -230 139 218
7684B18k66q6j29K1p8O83m47L0J65j36M6J16K48o09J02L29m5N3k6L5k75m8r1K38
$$ 218 -48 -134 -263 -242 -320 363 -84 -54 111 -25 21 137 385 -224 -122 207 162 215 189 224 -51 -99 -190 48
7708D8K89j62r1p3l0M1J78o4O0k39N1PqM35k78n3q6m8j6K96l05K74l56L5K06r5
$$ 48 337 175 84 11 -19 22 200 136 196 -43 8 15 7 442 164 111 25 -23 -39 257 -48 226 -130 -95 111 16
7734A6J37k1pj73o6K40L5R9l30j05J20N4L61l28Ok22k78L36K59j06M82m38l57
$$ 16 153 132 125 -48 -114 126 161 260 -70 -175 -55 -1 360 32 38 -184 -462 -126 133 27 509 71 -286
7757b86J22M76J11n67J08j1K1%k1K46k42M98l38l23K64N12m76j04K7k42L27j80
$$ -286 -164 312 423 -144 -36 -47 -26 -26 -47 199 -43 455 117 -206 58 570 94 -10 17 -225 102 -78
7779g8M2K38l02J7J11O7q8L5j22m23J35M19J86k11l81Q5jK98p0N4k42L8n4J5J83
$$ -78 -36 202 -100 -83 28 95 7 42 -80 -503 -368 51 237 26 -355 -270 -271 27 -43 11 -231 -193 -247 -232 -49
7804d9n7J61j33k88k05J55L22L70m35j14j71M37j76MJ71l86J22K65k03P5O02l82
$$ -49 -106 55 -78 -366 -571 -416 -94 276 -159 -273 -444 -7 -183 -179 -8 -394 -272 -7 -210 -135 467 85
7826H5j85o2P9L03K7Nk04J15L9j02N9K31k18j07Mo7L78o6k62m3L38k38M19p7l20
$$ 85 -100 -162 -83 220 247 252 48 163 202 100 159 390 172 65 69 2 380 314 52 9 347 109 528 451 131
7851A31J66n7j77J57j29K15o7j93j56R4K69j05m08K13j33J28K53k16j76M58l53
$$ 131 297 240 63 220 91 306 239 46 -110 -16 253 148 -260 -47 -180 -52 201 -15 -191 267 -86
7872h6l18J42K00L25k34j89j48q6L16R4J80l89k5p2L91j81J06j33L70p39J37K03
$$ -86 -404 -262 -62 263 29 -160 -308 -394 -78 16 196 -193 -218 -290 101 -80 26 -107 263 -476 -339 -136
7894a36K13N8l10k74J84J89L48q1j84j53J9j96J65R4m9M40m14k16r9L20J22k09
$$ -136 77 135 -175 -449 -265 -76 272 191 7 -146 -127 -323 -158 -64 -113 327 -87 -303 -402 -82 40 -169
7916a69J19p3k3K68l1l26J94l38O90m4l99M26l49k66j6J30J76J09o1k17j80M30
$$ -169 -50 -123 -146 122 91 -235 -41 -379 311 267 -132 294 -55 -321 -337 -207 -31 78 17 -200 -380 50
7938E0O2K3j10q3m1j55k0J49R0ql34N2K86K12m09K02j86j85K68K3k24O15l05o9
$$ 50 112 135 25 -58 -99 -254 -274 -125 -35 -43 -377 -325 -39 173 -236 -34 -220 -405 -137 -114 -338 277 -28 -97
7962i7j73J68M3j04K99j85j3l47M07M30l57N02m97j05K87j39M46m29lj24J0P6
$$ -97 -270 -102 -59 -163 136 -49 -62 -409 -2 428 71 573 76 -29 258 119 565 136 133 9 19 95
7984I5K28k29j55K91l26J29K52o5k51J41q1J22L31j61o7j9n79M32k97K74K10r5
$$ 95 323 94 -61 230 -96 33 285 220 -31 110 29 151 482 321 254 235 -344 88 -209 65 275 180
8006A80k92L2r7J73K03k13j70QK52j66j41J88K26k49j48K50j9q6Mk18k74M23q
$$ 180 -112 -80 -177 -4 199 -14 -184 -176 76 -90 -231 -43 183 -66 -214 36 17 -69 -65 -283 -557 -134 -142
8029a42J06L28n09N5j4j28Q3K65k91L51l7l55J48K05l07K72l19j55K13K38k00
$$ -142 -36 292 -217 -162 -176 -304 -221 44 -247 104 67 -288 -140 65 -242 30 -289 -444 -231 7 -193
8050a93J90n3k31N4Q1J36J08r7m08L91q7K2p6J97k50J20k82J96J32j10j32K44
$$ -193 -3 -56 -287 -233 -152 -16 92 -5 -413 -22 -109 -87 -163 34 -216 -96 -378 -182 -50 -160 -292 -48
8072d8k20J7L70m8J58m83J97J40p7K5M2j81L6K61j48J52j71n4k33K92K73j02q5
$$ -48 -268 -251 119 71 229 -254 -57 83 6 31 73 -108 -72 189 41 193 22 -32 -265 27 300 198 113
8095A13K48l55k21n3L82j85J61K9j65k5K54k3k9l74K91rm8k7q7L21Q8l14K07l71
$$ 113 361 6 -215 -268 114 -71 90 119 -46 -71 183 160 131 -243 48 39 -9 -36 -123 198 286 -28 179 -192
8119a92j1M96k29L0l05M04j00K22m16m3R4n3M95l02j54J08k13j67K82N35m68P0
$$ -192 -203 293 64 94 -211 193 93 315 -101 -144 -50 -103 392 90 -64 44 -169 -336 -54 481 13 83
8141H3l80N08k55k47K86P3n4j28L4Q1l8J69m73K01O2M3J74J05l62MN9j70K12L22
$$ 83 -297 211 -44 -291 -5 68 14 -114 -80 1 -37 132 -341 -140 -78 -35 139 244 -118 -114 -55 -225 -13 309
8165C09k56m43R0K14J67L73P6o08j40J38r7J66J73L0l04j26K0RK81j24J33m19
$$ 309 53 -390 -300 -86 81 454 530 -78 -218 -80 -177 -11 162 192 -112 -238 -218 -209 72 -52 81 -338
8187c38j46J67K77K33
$$ -338 -484 -317 -40 193
8191A93
$$ Imaginary data points
##PAGE= N=2
##DATA TABLE= (X++(I..I)), XYDATA
0@%%%%%%Qj6J6k4L2m0N6o4P2q8J05j29J57j81K10k49K89l32L83m40N03n73O49
$$ 0 0 0 0 0 0 0 8 -8 8 -16 16 -24 32 -32 40 -48 57 -72 85 -96 114 -135 154 -178 205 -235 268 -305 344
29C44p32Q27r30J043j169J304j454J621j800J999k218K455k718L010l334L694
$$ 344 -388 439 -491 552 -617 687 -767 854 -946 1053 -1165 1290 -1428 1582 -1752 1942
45A942m094M546n064N650o328P129q081R241j0694J2569j5099J8728k4406L4651
$$ 1942 -2152 2394 -2670 2980 -3348 3781 -4300 4941 -5753 6816 -8283 10445 -13961 20690
59B0690n9028K22854K74729k32639j88289j06696J18157J68537J24336o1400j60012
$$ 20690 -38338 184516 459245 226606 38317 -68379 49778 218315 342651 281251 121239
70A21239j52965L853J16810J30999P445j05949j41595m2956Q2967J38395M3023
$$ 121239 -31726 -27873 88937 219936 227381 121432 -20163 -63119 19848 158243 201266
81B01266r9150j61402o6370Q2861J57716Q4856o1096j61522j24151J4168J44946
$$ 201266 102116 -59286 -125656 -42795 114921 199777 138681 -22841 -146992 -132824 12122
92A2122J53020L6720j10818j62591q0037O9302J58859J18329j6779j27909j20312
$$ 12122 165142 201862 91044 -71547 -151584 -82282 76577 194906 178127 50218 -70094
103g0094l797J07570J16105K6299o9667q6048j9758O1829Q6701L3055m9748q4600
$$ -70094 -73891 33679 149784 176083 106416 20368 610 62439 149140 182195 132447 47847
115D7847l2257N8564J01772N5137m0476j04901q0865J7605J09115J07669Q959
$$ 47847 15590 74154 175926 231063 190587 85686 4821 22426 131541 239210 248169
126B48169r6238j14211l9449N8326J00478N8366l0187r0767p4064J165O2112N6523
$$ 248169 151931 37720 -1729 56597 157075 215441 185254 94487 20423 21588 83700 140223
138A40223j982n4068n4422q235L9159M1845p014n8803n6535J105N8080N9450J941
$$ 140223 138241 84173 29751 21516 60675 102520 95506 36703 -19832 -18727 39353 98803 100744
151A00744o4850q1263l2316M5496Q6867N4623k8375q8884p5195R87P2770P9511
$$ 100744 35894 -45369 -77685 -32189 54678 109301 80926 -7958 -83153 -82166 -9396 70115
163G0115K0768n1108p3376l0731L6548O6027L4266k4518n2329k6365K6173N4951
$$ 70115 90883 39775 -33601 -64332 -27784 38243 72509 47991 -4338 -30703 -4530 50421
175E0421L4525j9990n8289m2664K1796P6891O4869p097p5819p8355j2474O9180
$$ 50421 84946 64956 6667 -35997 -14201 62690 127559 120462 44643 -33712 -46186 22994
187B2994R6294M3056m7710r6559o3526K0965Q3762P5660Q462o3339q1824l2206
$$ 22994 119288 162344 114634 18075 -45451 -24486 59276 134936 143398 80059 -1765 -33971
199c3971M2769P6221L8548l4033p2204m2698K2266O2410M1096k2798o7386n0890
$$ -33971 8798 85019 123567 89534 17330 -25368 -3102 59308 100404 77606 10220 -40670
211d0670J2496O4347N6811l237o5003p4506k2981M9328Q1734M6150l2805q8209
$$ -40670 -28174 36173 92984 89747 24744 -49762 -72743 -23415 58319 104469 71664 -16545
223a6545o9847P099P5862P8054J5439n7092p8504l4751L3425O8353M3397j4846
$$ -16545 -86392 -79293 -3431 74623 90062 32970 -45534 -80285 -46860 21493 64890 50044
235E0044n4630m3142K610M1914M2813O551l5877m4517r138L7434M9196J3691l5319
$$ 50044 -4586 -47728 -45118 -3204 39609 46160 10283 -34234 -43372 -5938 43258 56949 21630
248B1630n3172k2843K9159N8090L7495j5963n6707m8838q87M5047N3710K0904
$$ 21630 -31542 -54385 -25226 32864 70359 54396 -2311 -51149 -52036 -6989 46721 67625
260F7625k6710n2962l6834Q433M4113M1003M454l0988l7666j2667J7619K9083
$$ 67625 40915 -12047 -48881 -40448 3665 44668 49122 18134 -19532 -32199 -14580 14503
272A4503J2954j1629k3083j0052J1268J8081N897j2289j8395q155J0387K1930
$$ 14503 27457 15828 -7255 -17307 -6039 12042 17939 5650 -12745 -20900 -10513 11417
284A1417J5193n622k4225k2835j592K1229K7354J1665j1963k5022j8998J601J9977
$$ 11417 26610 20988 -3237 -26072 -27664 -6435 20919 32584 20621 -4401 -23399 -21798 -1821
297a821K0703N774r410j3159q181q21M780P046N282J612p30k243m547o543l396
$$ -1821 18882 24656 15246 2087 -6094 -6915 -2135 4911 10193 11805 11075 8832 4285 -2258 -5654
312e654K406Q097P816K883m282j1381j1072k246R964J2823M834n977j0497p283
$$ -5654 -3248 4849 12665 15548 11266 -115 -11187 -13433 -3469 9354 14188 8211 -2286 -9569
326i569j056L781M770K098r94k61J60k103o395n862K23O616P975N495j379r891
$$ -9569 -10625 -6844 -2074 24 -970 -1231 -1071 -3174 -9569 -15431 -15208 -8592 -617 4878 3499 -6392
342f392j2807o156P801J6278J1635j468j3214j5223n639Q744J5602R255l036r967
$$ -6392 -19199 -25355 -17554 -1276 10359 8891 -4323 -19546 -25185 -16441 -839 8416 5380 -4587
356d587p723k55L728M773L385L25k066q15J266J024k173m738j434M229Q004N312
$$ -4587 -12310 -12565 -8837 -4064 -679 -354 -2420 -3235 -1969 -945 -3118 -7856 -9290 -5061 2943 8255
372H255j831r787j0403k329J0017J2067M473o068j0123o831j01N805O830L020
$$ 8255 6424 -3363 -13766 -16095 -6078 5989 10462 4394 -5729 -12560 -12661 -6856 -26 2994
386B994l164m920k926l76Q09J88r7M09J927K487Q93m343q033m400M937J0564O734
$$ 2994 -170 -5090 -8016 -8392 -7583 -7395 -7492 -7083 -5156 -2669 -1776 -6119 -14152 -18552 -13615 -3051 3683
403C683k637j1037r083j374Q244J0862M450o155j0193n288L587P955N728j795
$$ 3683 1046 -9991 -19074 -20448 -12204 -1342 3108 -3047 -13240 -18528 -14941 -6986 -1258 -3053
417c053o569o791J102Q844P573k175j0617r200J533J2069J1833J574j2526j5585
$$ -3053 -9622 -16413 -15311 -6467 1106 -1069 -11686 -20886 -19353 -7284 4549 6123 -6403 -21988
431b1988n273J1910J7752Q732q170j7221j2132K795J5561J5743L232j4123j8113
$$ -21988 -27261 -15351 2401 11133 2963 -14258 -26390 -23595 -8034 7709 10941 -3182 -21295
444b1295n590J2066J9198R121q996j8649j1470O712K0331J5686m420j9409j6407
$$ -21295 -26885 -14819 4379 13500 4504 -14145 -25615 -18903 1428 17114 12694 -6715 -23122
457b3122J963J8463J8963M610j4449k0690q716J1965K3012J3976p397k2104j6741
$$ -23122 -21159 -2696 16267 20877 6428 -14262 -22978 -11013 11999 25975 18578 -3526 -20267
470b0267L553K1281K0712J720k0161k3192m540J8493K3908P913j5044k4669j3768
$$ -20267 -16714 4567 25279 26999 6838 -16354 -20894 -2401 21507 29420 14376 -10293 -24061
483b4061R515K4005J7866m940k4483k2729k186J9914K3907O423j7407k6940j4166
$$ -24061 -14546 9459 27325 22385 -2098 -24827 -27013 -7099 16808 23231 5824 -21116 -35282
496c5282J2308K5977J4260j0305k5875j7792M570K2273J8686j958k1818k2989
$$ -35282 -22974 3003 17263 6958 -18917 -36709 -32139 -9866 8820 6862 -14956 -37945
508c7945l042J9785K4815P258j6840k7388j3897J1736K9753K1646o521k8779k4629
$$ -37945 -40987 -21202 3613 10871 -5969 -33357 -47254 -35518 -5765 15881 9360 -19419 -44048
521d4048J249K5855K7978O968j8666k6594j1183J4988K7543J5897q467k3286j5574
$$ -44048 -42799 -16944 11034 18002 -664 -27258 -38441 -23453 4090 19987 11520 -11766 -27340
534b7340O235K3202K0199n18k1907k2202l65K3644K6591N692k0848k8870j1477
$$ -27340 -21105 2097 22296 21778 -129 -22331 -22696 948 27539 33231 12383 -16487 -27964
547b7964J7150L1378J9104j0148l1620k5013K227K5982K7700N119k0535k9483
$$ -27964 -10814 20564 39668 29520 -2100 -27113 -24886 1096 28796 33915 13380 -16103
559a6103j3853J3196K7084J5158j0714k5188j7950M952K1809J7140m363k3282
$$ -16103 -29956 -16760 10324 25482 14768 -10420 -28370 -23418 -1609 15531 11168 -12114
571a2114k1453J070K2760K2957J046k2458k7188r039J7448L0637J7204j1883l1671
$$ -12114 -33567 -32497 -9737 13220 14266 -8192 -35380 -44419 -26971 3666 20870 8987 -22684
584b2684k4238M389K8324K8554N394k0900k9013j1282J5722K8479J5141q846k2714
$$ -22684 -46922 -42533 -14209 14345 19739 -1161 -30174 -41456 -25734 2745 17886 9040 -13674
597a3674j3936P020K0858J5875l141j9157j6269M515K1789K0638j93k1537k3245
$$ -13674 -27610 -20590 268 16143 13002 -6155 -22424 -17909 3880 24518 24325 2788 -20457
610b0457n015K0510K9337J3941j4621l1878k1089P938K8674K5462J523k2957k7759
$$ -20457 -25472 -4962 24375 38316 23695 -8183 -29272 -21334 7340 32802 34325 11368 -16391
623a6391r617J5108K4693J2689j0236k1708j3730M993J7005J2256n374j8670j4386
$$ -16391 -26008 -10900 13793 26482 16246 -5462 -19192 -14199 2806 15062 9688 -8982 -23368
636b3368N163J9487J5588n587k2871k1058m24K1783K6134P297j9080k9853j6551
$$ -23368 -18205 1282 16870 11283 -11588 -32646 -33070 -11287 14847 22144 3064 -26789 -43340
649d3340J1291K9053K2393j584k3089k6086o737J6800K5363J1804j0641k0958
$$ -43340 -32049 -2996 19397 17813 -5276 -31362 -38099 -21299 4064 15868 5227 -15731
661a5731j0770P324J7525J0879n476j6301r248P831J9312J1995p262k0703j6183
$$ -15731 -26501 -19177 -1652 9227 3751 -12550 -21798 -13967 5345 17340 10078 -10625 -26808
674b6808M230K2662K3803M424k0125k8318j3213J4541K9867K0925l981k5496k5010
$$ -26808 -22578 84 23887 28311 8186 -20132 -33345 -18804 11063 31988 28007 2511 -22499
687b2499m658J8792K4833J0173j1649k0585j0553O404J5569R252m978j3314q618
$$ -22499 -27157 -8365 16468 26641 14992 -5593 -16146 -9742 5827 15079 10101 -3213 -11831
700a1831O452J5707R162p802j8494j3872N159K1801K0848J303k0882k6761r895
$$ -11831 -5379 10328 19490 11688 -6806 -20678 -15519 6282 27130 28433 7551 -19210 -29105
713b9105J6234K8779J7757o041k4993k3170k559J7997K3443R250j0093j9262j1245
$$ -29105 -12871 15908 33665 27624 2631 -20539 -23098 -5101 18342 27592 17499 -1763 -13008
726a3008M566J4797R676l158j1913p354M858J2491O821p627j6418r444O473J8821
$$ -13008 -8442 6355 16031 12873 960 -6394 -1536 10955 17776 10149 -6269 -15713 -9240 9581
740I581J5415j851k0128k2608o870J5185K4951J4856p623k3758k1219k600J6889
$$ 9581 24996 23145 3017 -19591 -26461 -11276 13675 28531 20908 -2850 -24069 -26669 -9780
753i780K2025Q729j0245j8391j1344L549J2155R335j483q381n869K872Q432M025
$$ -9780 12245 20974 10729 -7662 -19006 -15457 -3302 6033 4550 -3831 -9700 -6828 1604 5629
767E629n841j1497m984P708J5311J1424l444j6726j7694l227J6149K2688J2133
$$ 5629 -212 -11709 -16693 -8985 6326 17750 14306 -2420 -20114 -23341 -7192 15496 27629
780B7629q511k0896j7255L19J6692J9561Q178q164j6363r859K651J0304Q814J197
$$ 27629 19118 -1778 -19033 -18714 -2022 17539 25717 17553 1190 -8669 -6018 4286 13100 14297
794A4297n206n778N86M733K508m264p951k775O259J1523O534n756j5486j3551
$$ 14297 9091 3313 3899 8632 11140 6876 -1075 -3850 2409 13932 20466 14710 -776 -14327
808a4327p24J3533J7369P547r669j8996j4497n78J3680J6495O444p889j5112j0573
$$ -14327 -15051 -1518 15851 23398 13729 -5267 -19764 -20342 -6662 9833 16277 8388 -6724 -17297
822a7297M48Q519Q528K684m137m818j941J147Q29k243k881Q40N987P392K530n791
$$ -17297 -16849 -8330 198 2882 -1255 -6073 -8014 -6867 -6038 -8281 -11162 -10322 -4335 3057 5587 -204
838b04j0483p525K282J2743J3861N264q346j4168j0004K087J2463J4967O201n911
$$ -204 -10687 -18212 -15930 -3187 10674 15938 7592 -6576 -16580 -14493 -2030 12937 19138 13227
852A3227j2193q135J060P273Q285M465q72l711l113j745k61l52O01L218N153L023
$$ 13227 1034 -7101 -6041 1232 9517 13982 13110 9399 6286 4541 4280 3928 4529 7747 12900 15923
868A5923k094o897p981m144L974J0339Q374R8r612j2015p086K370R749R749K675
$$ 15923 13829 6932 -1049 -5193 -1219 9120 17494 17592 7980 -4035 -11121 -8751 998 10747 13422
883A3422o583j0921p525j078N332O373L727n28m517n307l470r90K94K339M031
$$ 13422 6839 -4082 -11607 -12685 -7353 -980 2747 2219 -2298 -7605 -11075 -12065 -11771 -9432 -5401
898e401L870N66l882p024n717m09N785R998O038j937q494r433l538M695J0099
$$ -5401 -1531 -965 -4847 -11871 -17588 -17997 -12212 -2214 3824 1887 -6607 -16040 -19578 -14883 -4784
913d784R344K168n731r481n406J272O978P511M433m56m881m614k114J034K620
$$ -4784 4560 6728 997 -8484 -13890 -12618 -5640 1871 6304 5848 967 -3647 -5761 -4727 -2107
928b107L886L829K380q99m389m653k665J066N320O376M104k175p038p332l689
$$ -2107 1779 5608 7988 7089 2700 -1953 -4618 -3552 1768 8144 12248 10073 3035 -4297 -7986
943g986L456Q043P890J509n898r242p133L71O230P870M954j778p033q151l249
$$ -7986 -4530 3513 11403 12912 7014 -2228 -9361 -8990 -2760 5110 10064 8286 1253 -6898 -10147
958a0147K819N655N070J228k087m593l744j224O03K148K931K147J524j062l574
$$ -10147 -7328 -1673 3397 4625 2538 -2055 -5799 -7023 -6420 -4272 -1341 806 2330 1268 -2306
973b306m672k645J481N447O991L395k887p849p805j561O011R856P430r02p690
$$ -2306 -6978 -9623 -8142 -2695 4296 7691 4804 -3045 -10850 -12411 -6400 3456 10886 9984 2294
988B294r969m571M361R391Q065J336n727q044m511J367N962N438J047k241k920
$$ 2294 -7675 -12246 -7885 1506 9571 10907 5180 -2864 -7375 -6008 -46 5392 6439 4198 1278
1003A278j665m3N54l2j190K08L471L459O39m320o997m138J941P735Q617K103o779
$$ 1278 -387 -430 124 92 -1098 -890 2581 6040 6679 2359 -4638 -8776 -6835 900 9517 11620 4841
1020D841j1678o769K392J0305J0134K836o704j1116p063J676Q767Q139J277m475
$$ 4841 -6837 -13606 -11214 -909 9225 12061 5357 -5759 -12822 -11146 -2379 5760 7037 2562
1034B562o677l702J722L821K761n22k276m24J972K058j056l989m289N36N349P244
$$ 2562 -4115 -7817 -6095 -2274 487 -35 -2311 -2735 -763 1295 239 -3750 -8039 -7503 -2154 5090
1050E090K652m559r067o529J671Q417R614L277n343j0107p093J306Q526Q194K716
$$ 5090 7742 3183 -5884 -12413 -10742 -2325 7289 10566 5223 -4884 -11977 -10671 -2145 6049 8765
1065H765m747p072m286J345M267M230N15k140k055P19J124J02k183j922J50L764
$$ 8765 4018 -3054 -7340 -5995 -1728 2502 3017 877 -1178 -459 665 767 -1416 -3338 -3188 576
1081E76M624J502l619o936m465K349P721O730J149n535p848m436K325P685N967
$$ 576 5200 6702 3083 -3853 -8318 -5969 1752 8482 9631 4096 -3752 -8188 -5863 1822 7789
1096G789K80m656n028j843J678L260K452p79j762J38J005J253j738l546j671K329
$$ 7789 8069 3413 -1615 -3458 -1780 1480 3932 3153 1391 1529 2534 3787 2049 -1497 -3168 -839
1112h39M717M192l1o488p291j690M920Q365M796k321p773p438p55N623P963K948
$$ -839 3878 8070 8039 1551 -5740 -7430 -2510 5855 10651 8330 557 -6881 -7636 -2013 5950 8898
1128H898l832o487l957J582M769L606j077m078l296J159N040L082k417o035m623
$$ 8898 5066 -1421 -5378 -3796 973 4579 3502 -576 -3872 -2713 2327 5409 2992 -3043 -7666
1143g666K099O893O115L25p186r294l247O227J0419O286l514j0139q658q89Q760
$$ -7666 -5567 1326 7441 7766 580 -8714 -11961 -5734 4685 10971 7457 -2682 -11340 -12229 -3469
1158c469J0045L797o201j0042n266L128Q661N997j649p214o294L98O810O659r1
$$ -3469 6576 10373 4172 -5870 -11136 -8008 653 6650 5001 -2213 -8507 -8109 -1299 5360 5269
1173E269o956o933r94O221Q524K719n741j0252n489M647J0448Q090j655r943r781
$$ 5269 -1687 -8620 -9614 -3393 5131 7850 2109 -8143 -13632 -8985 1463 9553 7898 -2045 -11826
1188a1826j994Q063J1102M801n548r887o579J872R499P677N16p274q024k062O435
$$ -11826 -13820 -5757 5345 10146 4598 -5289 -11868 -9996 -497 7180 7696 422 -7602 -9664 -3229
1203c229Q156K550m815p700k942L993Q124M494k592p996o148J474Q158P491P96
$$ -3229 4927 7477 2662 -5038 -7980 -3987 4137 8631 6039 -1957 -8105 -6631 1527 9018 9814
1218I814o607q708k488M942Q569N331l303q247o232R76O817O908M30n181o900
$$ 9814 3207 -5501 -7989 -3047 5522 10853 7550 -697 -6929 -5953 864 7772 8202 3021 -3879
1233c879k119M126O347K349l296n645l470J897N224L870j397n693m432J07N046
$$ -3879 -5998 -1872 4475 6824 3528 -2117 -5587 -3690 1534 5404 4007 -1686 -6118 -6011 -965
1248i65M820L54m943n116j579L291N728K248k730n549l008J835M679L576j115
$$ -965 3855 4209 -734 -5850 -7429 -4138 1590 3838 1108 -4441 -7449 -5614 -935 2641 1526
1263A526m155m068k03M443M086J091l979m421j049L057M960K166k201n480k332
$$ 1526 -2629 -6697 -6900 -2457 1629 2720 -1259 -5680 -6729 -3672 1288 3454 1253 -4227 -6559
1278f559J915N130L687j516m450l469K09M534L864Q14m453m447q07L417N351J880
$$ -6559 -4644 486 4173 2657 -1793 -5262 -5053 -519 3345 4159 -294 -4741 -5548 -2131 3220 5100
1294E100l122n730l055K221O085M227j451n843n663j08M853O067J750l962o634
$$ 5100 1978 -3752 -6807 -4586 1499 5726 4275 -1568 -7231 -7339 -2486 3581 5331 1369 -5265
1309e265l680K637O214M234j759n684m468j32M791N121R57n025n362j398L554
$$ -5265 -8945 -6308 -94 4140 2381 -3303 -7771 -7903 -3112 2009 2966 -2059 -7421 -8819 -5265
1324e265O598K683l666o680m126K244P198N872m06o630o918j266N094P836M428
$$ -5265 1333 4016 350 -6330 -10456 -8212 -1014 4858 4452 -2178 -9096 -10362 -5268 2568 6996
1339F996l139p471n689J166P146O461Q05n025n893j801L708N887L050l011n155
$$ 6996 3857 -3614 -9303 -8137 -991 5470 6275 1250 -4643 -6444 -2736 3151 6201 3190 -1965
1354a965k749K379N651L386j443n522m421N79N769N990J004n588p092k608L661
$$ -1965 -4714 -2335 3316 6702 5259 -263 -4684 -4105 1664 7654 8658 3070 -4022 -6630 -2969
1369b969P436N201j561p239o739p34M979O890K395l084n794m050N70M448L998
$$ -2969 4467 9668 8107 868 -5871 -6605 -1626 5264 7659 4575 -1219 -5269 -4699 -251 3747
1384C747N25l661l672k91K484K772R4k980l458k66L659M184M16l756n229j861
$$ 3747 4272 611 -3061 -3352 -868 1904 1998 -982 -4440 -4706 -1047 3137 3553 -203 -5432 -7293
1400g293K195N517M313l64n303n794j391L196N975L354j183m623m552p60K868
$$ -7293 -5098 419 4732 4368 -935 -6729 -8120 -4924 1051 4405 3222 -1401 -5953 -6713 -3845
1415c845M358J469j432k322j091K08J686K48r86j267O13J971K144p3l072l648
$$ -3845 513 1982 550 -1772 -2863 -2655 -969 -721 -1707 -2974 -2361 -390 1754 1681 -1391 -5039
1431e039o74K754M321L256j082n160m517q92L670M779L411j525l993l906q72K401
$$ -5039 -5713 -2959 1362 4618 3536 -1624 -6141 -7033 -3363 1416 4827 3302 -691 -4597 -5469 -3068
1447c068M150J716j136j936j302l50O05N55J38l99M87J680J169o22k856k888k98
$$ -3068 1082 2798 1662 -274 -1576 -1926 -1321 -766 -628 -1027 -540 1140 2309 1687 -1169 -4057 -4355
1464d355L173M394K948k235m799m700n89M312N759L212j828n095m866m30K975
$$ -4355 -1182 3212 6160 3925 -874 -5574 -6163 -1851 3908 7120 5292 197 -4669 -5099 -2124
1479b124N089K788j575l336k898j99J986J843J64p91o58P67J594l81j776k917
$$ -2124 2965 5753 4178 842 -2056 -2255 -269 1574 1738 947 289 1056 2650 2269 493 -2424
1495b424l76K159M050K651r69m851n349j091L815O704L946j451o189n919j370
$$ -2424 -2800 -641 3409 6060 5091 240 -5109 -6200 -2385 4319 8265 6814 625 -5294 -6664
1510f664L711O643L340j390m661m502j007K767L418J928r15k474j258P88J168
$$ -6664 -2953 3690 7030 5640 979 -3523 -4530 -1763 1655 3583 2668 194 -1064 -276 892
1525H92Mj886j205N63K974L080k83l757n321j950L272O369M419j027n626o950
$$ 892 896 -990 -2195 -1632 1342 4422 4139 382 -4939 -6889 -3617 2752 7171 6144 518 -6432
1541f432k731M362O685M768n63n825o104j724L007N335L135q58l646k645k06J633
$$ -6432 -9163 -4801 1884 6652 6089 264 -5840 -7564 -4557 778 3913 3055 -591 -3236 -3442 -1809
1557a809J288o07n48kJ091J896J31k256m120j632K616N581L680m11n031o589j997
$$ -1809 -521 -1128 -1676 -1678 -587 1309 1440 -816 -4936 -6568 -3952 1629 5309 4898 -133 -6722 -8719
1574h719L833P524M515j109n805n835j821L371N731L750j065l686l263k33J441
$$ -8719 -4886 2638 7153 6044 239 -5596 -7417 -4046 1685 5435 4370 684 -2579 -2812 -1371
1589a371K274K21m85q62J104J081O12k625l501q57K975N373L175k029n422n999
$$ -1371 903 1124 639 -223 881 1962 2574 -51 -3552 -4409 -1434 3939 7114 5085 -337 -6336
1605f336j256N196P026M241k530o518n691j308M558O393L159k007n324l427K01
$$ -6336 -7592 -2396 4630 8871 6341 -177 -5868 -7176 -2618 3775 6934 4927 -397 -3824 -3623
1620c623L384K336j70j902p06R66K002M81k516l790j165L311N609L160j672o416
$$ -3623 -239 2097 1927 25 -681 285 2287 2768 252 -3538 -4703 -1392 4217 7377 5705 -711
1636g11o179j020N664Q342M450l594p892o960k59O479P745L219l971o543m577
$$ -711 -6890 -7910 -2246 6096 10546 6952 -940 -7900 -8159 -1680 6065 9284 5313 -1230 -5807
1651e807J405M774L518K25l180k965L67K685J754j179l919k792J897N305M235
$$ -5807 -4402 372 3890 4115 935 -2030 -1663 1022 2776 1597 -2322 -5114 -3217 2088 6323
1666F323q59o118p364j825N633R102M640l134q988p794k86O598Q428L977l772
$$ 6323 5464 -654 -8018 -9843 -4210 4892 9532 6398 -2590 -10384 -10670 -4072 4356 8333 4561
1681D561q443n732P41N849N942J233l998m654j694K766L661O58k832l344M43L501
$$ 4561 -3882 -9614 -8873 -3024 2918 4151 153 -4501 -6195 -3429 232 890 -1942 -5286 -4843 -1342
1697a342M360M72m325o291k239M278P709N211j916p474p527j360N984R154M554
$$ -1342 3018 3490 -835 -7126 -9365 -5087 2622 7833 5917 -1557 -9084 -10444 -4460 4694 9248
1712I248k708q252o579J0N966O840K459l282n207l041J610M047K046r99k630j185
$$ 9248 6540 -1712 -8291 -8281 -2315 4525 6984 3702 -1505 -4546 -2936 1111 3157 2158 -472 -1657
1728a657J783L226Q28k699m239k335K765O287L694j235o343o688j099N369P439
$$ -1657 126 3352 4180 1481 -2758 -5093 -2328 3959 7653 6418 75 -6613 -7712 -2343 5096
1743E096M220k755p356n921k51N110O135K275k758m923l147O88K883K790o4k764
$$ 5096 9316 6561 -795 -6716 -6967 -1857 4278 6553 3795 -1128 -4275 -3587 -704 2086 2022 -742
1759g42o87Q69J814O91k102l334j151K787M889K740k332n746m670L8M929O502
$$ -742 -1429 -560 1254 1945 -157 -3491 -4642 -1855 3034 5774 3442 -2304 -6974 -6936 -2007 4495
1775D495K703l064p047m718Q73N779N148J666l633n010k055J920L285K211j118
$$ 4495 7198 4134 -2913 -7631 -6758 -979 4169 5835 2202 -2808 -4863 -2943 342 2553 1435
1790A435k538q78J798J784M87k548l181q60L062N136K589k740o250m488P51O018
$$ 1435 -1103 -1981 -183 1601 2088 -460 -3641 -4501 -1439 3697 6286 3546 -2704 -7192 -6441 -423
1806d23O469K469n174p537m284K322O956N246J09m750n932j701K895N005J992
$$ -423 6046 8515 3341 -4196 -8480 -6158 798 6044 6153 1403 -4529 -6230 -3335 1670 3662
1821C662j672m156j833J627L588J531k296m310k342K777N645L592k211o131o208
$$ 3662 1990 -2166 -3999 -2372 1216 2747 451 -3859 -6201 -3424 2221 5813 3602 -2529 -8737
1836h737P16O122P070K223m282q408n170K739P771O408O83n855p025k903L881
$$ -8737 -8021 -1899 5171 7394 3112 -5296 -10466 -7727 44 6452 7135 1280 -5745 -8648 -4767
1851d767P196L721k327n668l737J368N217L474p17m784l786J255N001M997k97
$$ -4767 2429 6150 3823 -1845 -5582 -4214 1003 4477 3760 -1024 -4810 -3555 1446 6443 6146
1866F146n522n719j383N309P515L692l441p989n693Q14P496P622J849n786q081
$$ 6146 624 -5095 -6478 -1169 6346 10038 6597 -1392 -7085 -6271 1225 8847 10696 4910 -3171
1881c171l633L315P369M837j044n816n373o13M702M828J007l767m612j487L655
$$ -3171 -6804 -3489 3880 8717 7673 1857 -3516 -4129 573 5401 6408 2641 -1971 -3458 197
1896A97M735J529l674n754k740K997O518L872j780p282n710%N982O862J991m291
$$ 197 4932 6461 2787 -2967 -5707 -2710 3808 7680 5900 -1382 -7092 -7092 -1110 5752 7743 3452
1912C452o824m609J700O503N398j05n142n273j351L238M885J974k392m375j931
$$ 3452 -3372 -7981 -6281 222 5620 5515 373 -4900 -6251 -3013 1872 3846 1454 -2921 -4852
1927d852K093M104J836k150l828k162J890M102L456r75m570m188k88L916N621
$$ -4852 -2759 1345 3181 1031 -2797 -4959 -3069 1033 4489 3514 -1056 -5244 -5532 -1616 4005
1942D005J926l018n313l605J449M962M404K11m165m105j205K501L761J513j428
$$ 4005 5931 2913 -2400 -6005 -4556 406 4810 5021 856 -3249 -4454 -1953 1808 3321 1893
1957A893k860j687Q86K754J484j048k842j749J541L051J961q10l567k977K78L416
$$ 1893 -967 -2654 -1768 986 2470 1422 -1420 -3169 -1628 1423 3384 2574 -993 -3970 -3692 -276
1973b76L849O91k637m542j556K046L362L185l73l748k648o12K405K962Q53j314
$$ -276 3573 4264 1627 -2915 -4471 -2425 937 4122 3749 1 -2647 -3259 -854 2108 2961 1647
1989A647k591j230J479K956P36j445k703r53J698L045J548j395l128k589N99L904
$$ 1647 -944 -2174 -695 2261 2997 1552 -1151 -2104 -406 2639 4187 2792 -336 -2925 -2326 1578
2005A578K939m0k681l899j413K219M239K253j504l863k961M67K997L382P1k568
$$ 1578 4517 4477 1796 -2103 -3516 -1297 2942 5195 3691 -172 -3133 -2666 331 3713 3784 1216
2021A216l136q58J848K951J160j744l010j889J758K845K002q37l413l150L88L209
$$ 1216 -1920 -2778 -930 2021 3181 1437 -1573 -3462 -1704 1141 3143 2306 -1107 -4257 -3869 -660
2037f60L788J73k800l819j479J912L987K798j144m108l249L37L325L132Q56k365
$$ -660 3128 3301 501 -3318 -4797 -2885 1102 3900 2756 -1352 -4601 -4264 -939 2193 3049 684
2053F84l443j361J284M122K286j141m070k264L18L485L240M30k975l813j108K599
$$ 684 -2759 -4120 -2836 1286 3572 2431 -1639 -3903 -3585 -100 3140 3570 595 -3218 -4326 -1727
2069a727L858J814k021l581k514N53L368L286K61l222l796r64J852L787K106j558
$$ -1727 2131 3945 1924 -1657 -4171 -3618 -250 3036 3297 75 -3721 -4685 -2833 954 3060 1502
2085A502l893l063P58L566L147k23l171l447j017J948L944K051j553m078k727
$$ 1502 -2391 -5454 -4696 -1130 2017 1794 -1377 -4824 -5841 -3893 51 2102 549 -3529 -6256
2100f256N79L295L382P53k978l614j697K388L765J944j128l373k507Q25L439K851
$$ -6256 -5677 -2382 1000 1753 -1225 -4839 -6536 -4148 -383 1561 433 -2940 -5447 -4622 -1183 1668
2116A668j65k309l116p82K473L864J649j710l310k601R02L911L457K26l080l594
$$ 1668 1503 -806 -3922 -4704 -2231 1633 3282 1572 -1738 -4339 -3437 474 3931 4157 1077 -2517
2132b517j016K055L934K394j120l545k756r2L222L138M92k254l173r11J082K904
$$ -2517 -3533 -1478 2456 4850 3730 185 -2571 -2663 559 3697 4189 1935 -1238 -2149 -1067 1837
2148A837J503r44l215j712O88K267K010l31k855l277M0K465L231R17k162l983
$$ 1837 3340 2396 -819 -2531 -1843 424 2434 2103 -752 -4029 -3989 -1524 1707 2624 462 -3521
2164c521k264Q22L501L076r8k869m225r56J960L663J552j298k953k015J44K018
$$ -3521 -5785 -4963 -1462 1614 1516 -1353 -5578 -6534 -4574 -911 641 -657 -3610 -5625 -5481 -3463
2180c463K479N7k119j649k77J938J732K89j811k406j42J937L185P91j522k958
$$ -3463 -984 -927 -3046 -4695 -4972 -3034 -1302 -1013 -2824 -5230 -5372 -3435 -250 541 -981 -3939
2196c939j768J018K972L100L57k663l482p16K058L010K062q28k337k342K82K227
$$ -3939 -5707 -4689 -1717 1383 1740 -923 -4405 -5121 -3063 -53 2009 1181 -1156 -3498 -3216 -989
2212i89J798J17j742j252M6J695J421n24j546j874J03K115K944j05k338k982j842
$$ -989 809 926 -816 -2068 -2022 -327 1094 570 -976 -2850 -2747 -632 2312 2207 -131 -3113 -4955
2229d955J993L661K444q70l224l838m59K501L712J465j411l486j930M06K702K086
$$ -4955 -2962 699 3143 2273 -951 -4789 -5248 -2747 965 2430 1019 -2467 -4397 -3991 -1289 797
2245G97m55k201j600J80K009K078r42k456k194N74L348K925L46l718l582j584
$$ 797 342 -1859 -3459 -3279 -1270 808 -134 -2590 -4784 -4210 -862 2063 2409 -1309 -4891 -6475
2261f475K612N088K981j652m647m019k55M419M697J774k818m617k127J526L962
$$ -6475 -3863 1225 4206 2554 -2093 -6112 -6367 -1948 2749 4523 1705 -2912 -5039 -3513 449
2276D49K732o00l202k533L50L202K781k32l337k705q7L767L637R68l672m888j451
$$ 449 3181 2581 -621 -3154 -2804 398 3179 2947 -390 -3095 -3182 585 4222 5190 1518 -3370 -4821
2293d821K511N704L839j603n746n421j22M509O107K038k898o255l395J191M886
$$ -4821 -2310 3394 7233 5630 -116 -5537 -5659 -1150 4957 6995 4097 -2158 -5553 -4362 524
2308E24M255k10l988l895j124L170L828O28l016l825j002K928M097J078k791n336
$$ 524 4779 4569 581 -3314 -4438 -1268 2560 3188 172 -3653 -4655 -1727 2370 3448 657 -4679
2324d679k413K314N844L854j339n510n629p55M517O336K988l170o324l938O21
$$ -4679 -7092 -4778 1066 4920 3581 -1929 -7558 -8313 -3796 2540 5528 2358 -3966 -7904 -7283
2339g283M979N287P30l338m799j505K767M057J418j815l368j330J932M040J487
$$ -7283 -2304 2983 3713 375 -4424 -5929 -3162 895 2313 498 -2870 -4200 -2268 1772 3259
2354C259k135l671k563J761N099L663m28m578n335p43M309O145K784k681n302
$$ 3259 1124 -2547 -5110 -3349 1750 5413 4985 407 -4928 -5671 -1362 4783 7567 4886 -416
2369d16m191O16M645M533J391k912m695j627J987L160J977q46k842j697J296K789
$$ -416 -4607 -3991 654 5187 6578 3666 -1029 -2656 -669 2491 4468 3622 780 -917 379 3168
2385C168Q58j641k858j669J686L832K452j146l887m052k38L732M475J985k607
$$ 3168 4026 2385 -473 -2142 -456 3376 5828 4682 795 -3257 -3495 237 4712 6697 4090
2400D090m872l416R60M007M048O54k742l761j600J678K592J253l57k121j072Q08
$$ 4090 -782 -4198 -3238 769 4817 5471 2729 -1032 -2632 -954 1638 2891 2534 413 -659 149
2416A49J838O46j421k381n94J716L156J513j564l815l093N18L894M638P12l182
$$ 149 1987 2633 1212 -1169 -1763 -47 3109 4622 3058 -757 -3850 -3332 562 5200 5912 2730
2432B730m612k529J179M445L308J37l110l653r93J879K457J495o32k265j045Q22
$$ 2730 -1882 -4411 -3232 1213 4521 4658 1548 -2105 -3098 -1219 1238 2733 2101 -164 -1209 -387
2448c87K019m3j166k134l32J862L049J119k364l587k582J509L939L852P39l446
$$ -387 1632 1589 423 -1711 -2043 -181 2868 3987 1623 -1964 -4546 -3037 902 4754 5493 2047
2464B047m569k275K630M105L139n2l547l634n82J934L335J583j421j861j343O89
$$ 2047 -2522 -4797 -2167 1938 5077 5025 1478 -2156 -2738 -804 2531 4114 2693 832 -511 178
2480A78K208R12j126k117n61J848K319J325j609l456k422J009L849L636K86l065
$$ 178 2386 3298 2172 55 -506 1342 3661 4986 3377 -79 -2501 -1492 2357 5993 6279 3214
2496C214n038j935J958M016L605m01l434m302j300K436L677J674j214k607k063
$$ 3214 -1824 -3759 -1801 2215 5820 5419 1985 -2317 -3617 -1181 2496 4170 2956 349 -1714
2511a714L38J979J155m70j722j054R44J939J178r81k565j848K69L339L363L40
$$ -1714 -1376 603 1758 1288 -434 -1488 -544 1395 2573 1592 -973 -2821 -2552 787 4150 4490
2527D490k714l722j912J502M378L432j54k928l671j102J931L565K311k15k615
$$ 4490 1776 -1946 -3858 -2356 2022 5454 5300 2372 -1299 -2401 -470 3095 5406 5191 2576
2542B576k179j65J494K162L97p98j315K61J206J151n44j731j624J00K384K265
$$ 2576 397 232 1726 3888 4285 3487 2172 2433 3639 4790 4246 2515 891 991 3375 5640
2558E640M28k161l141j810J163K961K924O6l052l765j830J483L244K177o72k305
$$ 5640 6068 3907 766 -1044 119 3080 6004 6070 3018 -747 -2577 -1094 2150 4327 3655 1350
2574A350k899r57R68J767Q16o85j208p69K53K69K46j120q49k04J650J287K47j662
$$ 1350 -1549 -2506 -1538 229 1045 360 -848 -1617 -1364 -1095 -849 -1969 -2818 -3022 -1372 -85 162 -1500
2592a500j985j689J142L046K313L16k291l048j172J581L009K479R3j747k393q73
$$ -1500 -3485 -5174 -4032 -986 1327 1643 -648 -3696 -4868 -3287 -278 2201 2294 547 -1846 -2719
2608b719J118K509J822o4j360l77j78Q66N09K69n47oN45J367N98j176j746m87
$$ -2719 -1601 908 2730 2666 1306 929 751 1617 2126 2395 1848 1842 2387 3754 4352 3176 1430 943
2626I43P74J854J766K45j959k615j376J006K464K095l62j890k372j378Q12J765
$$ 943 1717 3571 5337 5582 3623 1008 -368 638 3102 5197 4835 2945 573 -805 7 1772
2642A772J505n46q93j988l35M16O03O9o45m56M46L41N1n81j557n10N92J655J277
$$ 1772 3277 2731 1838 -150 -485 -69 534 603 -42 -498 -52 289 340 -241 -1798 -2308 -1716 -61 1216
2661A216K3j834j960p29J072K254J674K02j747k147j066J175K363J519k87j032
$$ 1216 1239 -595 -2555 -3284 -2212 42 1716 1918 171 -1976 -3042 -1867 496 2015 1728 696
2677F96j346M2Q53J112K80r8m21k89R11N04k06j089p36N60J593J040M99j646k078
$$ 696 -650 -608 245 1357 1637 1539 1118 829 1740 2244 2038 949 213 773 2366 3406 3905 2259 181
2696A81p84R49K331J456l90j945k038j235J601J960R16n67j724j798J19O90J184
$$ 181 -603 346 2677 4133 3743 1798 -240 -1475 126 2086 3002 2435 711 -1087 -968 -278 906
2713I06K61r13j434l92Q84M67J10j067j127k65R58K074K80j624k250q05P33K315
$$ 906 1167 254 -1180 -1572 -688 -221 -111 -1178 -2305 -2570 -1612 462 742 -882 -3132 -3937 -3204 -889
2731h89J727j97j908k080q89J174K804J505m55k298j353L2J359J919Q08o82j590
$$ -889 838 641 -1267 -3347 -4236 -3062 -258 1247 792 -1506 -2859 -2827 -1468 451 1259 577 -1013
2748a013n08Q85J255O43p11j093n59J023J414J047n64j856j356O32J447K294K59
$$ -1013 -1521 -636 619 1262 551 -542 -1101 -78 1336 2383 1819 -37 -1393 -761 686 2980 3239
2765C239k120j830j342J307K537J411k17k207k265l37J316K201J065j223j949
$$ 3239 1119 -711 -2053 -746 1791 3202 2985 778 -1487 -1824 -508 1693 2758 1535 -414
2780d14j281N94J501R59j01j374j384J85R72J578m13j324j684k5J471J419J056
$$ -414 -1695 -1101 400 1359 1258 -116 -1500 -1315 -343 1235 822 -502 -2186 -2211 -740 679 1735
2797A735j277k030j531O42K158J467K20k020j856o24R15K532J135r54j718j464
$$ 1735 458 -1572 -3103 -2461 -303 1164 1384 -636 -2492 -3116 -2201 331 1466 512 -1206 -2670
2813b670L62J434J050M70j799q36k67Q68J515N73j162j690n03M79J935M31l71
$$ -2670 -2308 -874 176 646 -1153 -1989 -2256 -1388 127 700 -462 -2152 -2655 -2176 -241 190 -181
2830a81j463j530j3J704J623J02j693j264q58R19J605R28l24j612j574J84J431
$$ -181 -1644 -3174 -3187 -1483 140 242 -1451 -2715 -3573 -2654 -1049 -121 -445 -2057 -3631 -3447 -2016
2847b016J061M82j349j186n45R61J153M37n41j571n72R09J342R69p39j271j101
$$ -2016 -955 -473 -1822 -3008 -3553 -2592 -1439 -1002 -1543 -3114 -3686 -2777 -1435 -466 -1205 -2476 -3577
2864c577K49J449J127K34j307j221q78J468J597N05m97j250r74O34J125J045K20
$$ -3577 -3328 -1879 -752 -518 -1825 -3046 -3924 -2456 -859 -354 -851 -2101 -3075 -2441 -1316 -271 -51
2881e1j417j314k24J592J061P35r72j864l71O43J569Q21k52j348j649M44J412
$$ -51 -1468 -2782 -3006 -1414 -353 382 -590 -2454 -2825 -2182 -613 208 -44 -1392 -3041 -2597 -1185
2898a185J299j05j298j081j76P87J675M65q75j837n61Q07J367J090l12j567j261
$$ -1185 114 9 -1289 -2370 -2546 -1759 -84 381 -494 -2331 -2892 -2085 -718 372 60 -1507 -2768
2915b768J3J360J795O0q87j869j036Q66J986J138n02j470j712J42J435J459K70
$$ -2768 -2755 -1395 400 460 -427 -2296 -3332 -2466 -480 658 156 -1314 -3026 -2884 -1449 10 280
2932B80j158j519m83O95J592Q88r86j474j135M55K226J049n67j556j607k13J760
$$ 280 -878 -2397 -2880 -2185 -593 295 -691 -2165 -3300 -2845 -619 430 -137 -1693 -3300 -3513 -1753
2949a753J896N23j060k258j142Q83K013J514mj755j932k32J416J919N78o09j910
$$ -1753 143 666 -394 -2652 -3794 -2911 -898 616 612 -1143 -3075 -3307 -1891 28 606 -3 -1913
2966a913q56O13J376J304l99j353j273P8J544J323K0j099k046k24J283J871P74
$$ -1913 -2769 -2156 -780 524 125 -1228 -2501 -2423 -879 444 464 -635 -2681 -2905 -1622 249 1023
2983A023p98k229j209M05K152K080l27j678j567j159J070J933J350p31j802j042
$$ 1023 225 -2004 -3213 -2808 -656 1424 1097 -581 -2148 -3307 -2237 -304 1046 315 -1487 -2529
2999b529j33J069J621l10j146j040Q3J147R66Q1j243j222k57J019J693R43r80
$$ -2529 -2662 -1593 28 -282 -1428 -2468 -2385 -1238 -272 -191 -1434 -2656 -2913 -1894 -201 742 -238
3016b38j890j163L49K010J756M58j522j708r61R90J967J523j31j443j074l57P84
$$ -238 -2128 -3291 -2942 -932 824 1282 -240 -1948 -2909 -1919 48 1571 1440 -3 -1077 -1434 -650
3033f50J494P01q21q26k17J013Q80J41m52j082l16J118J298P71j021j816q88J48
$$ -650 844 1545 724 -102 -319 694 1574 1715 1263 181 -135 983 2281 3052 2031 215 -673 -525
3051e25J991J576J59j461k057p62N36K050J061j6j571j606m09N83J348L18p51
$$ -525 1466 3042 3201 1740 -317 -1079 -543 1507 2568 2552 981 -625 -1034 -451 897 1215 464
3068D64r81m50M84N17J6o79q85k25P02J042L25j204j472r40N78J704J641n7j638
$$ 464 -517 -967 -483 34 50 -629 -1514 -1739 -1037 5 330 -874 -2346 -3286 -2708 -1004 637 580 -1058
3087a058k057o92J089K145J506k35j691j756KR64J726R43n38j226o23O41R22N41
$$ -1058 -3115 -3807 -2718 -573 933 698 -993 -2749 -2747 -1783 -57 886 348 -878 -1501 -860 62 603
3105F03l71o18n6N03J581P42o80j942o65N71J941J844M2j529k163j162J019K122
$$ 603 232 -386 -442 61 1642 2384 1704 -238 -903 -332 1609 3453 3495 1966 -197 -1359 -340 1782
3123A782K157n00j748k114q73J468J598J163q34j324r81j79J117N68M7j355l05
$$ 1782 3939 3439 1691 -423 -1296 172 1770 2933 2099 775 -206 -385 732 1300 1347 -8 -313
3140c13o1N58J099o10j636j285M77J839J529n4j082k457j507J361K113K352j23
$$ -313 -374 184 1283 673 -963 -2248 -1771 68 1597 1543 461 -1996 -3503 -2142 -29 2323 2200
3157B200k576j911n36J162K152J811n58j801j273J95J001J826j03n61p54P1Q57
$$ 2200 -376 -2287 -2823 -1661 491 2302 1744 -57 -1330 -1135 -134 1692 1589 1028 274 345 1202
3174A202Q73Jr47o53J11J234J651L61j255j750j006P83K113K088k9j936k227j084
$$ 1202 2075 2076 1129 476 587 1821 3472 3833 2578 828 -178 605 2718 4806 4777 2841 614 -470
3192d70J256K437J356o51j676j970k4Q25J351L29o36j061o96M52N44M04r21j025
$$ -470 786 3223 4579 3928 2252 282 258 1083 2434 2763 2127 1066 370 822 1366 1770 849 -176
3210a76j33J173J009j4j056j706j346J262J683J833j47k107k175p69R63K334J471
$$ -176 -309 864 1873 1859 803 -903 -2249 -987 696 2529 2382 275 -1900 -2669 -1706 628 2099
3227B099j24k091j830j03J432J475K12j97n33j088M31Q91K19k07q15pR56J060
$$ 2099 1975 -116 -1946 -2049 -617 858 1070 873 340 -748 -317 574 793 586 -229 -236 720 1780
3245A780L63j197j514p62J012K316J359r8k133j942n43J411J943J406k41j941
$$ 1780 2143 946 -568 -1330 -318 1998 3357 3259 1126 -816 -1359 52 1995 3401 3160 1219
3261A219j759l43J392J880N31q35j440n67O00N69N18n27r17K09O84R48N5o58j886
$$ 1219 -540 -883 509 2389 2920 2085 645 78 678 1247 1765 1238 321 530 1214 2162 2217 1559 -327
3280c27r49J174K089J454l95j959k201n26J573K683R89o30k251j603q5J352J855
$$ -327 -1276 -102 1987 3441 3046 1087 -1114 -1640 -67 2616 3605 2975 724 -879 -964 388 2243
3297B243O91p20j865p22M17J148Q61n39o88l20N34N30M06j005r20n06M92J806
$$ 2243 2934 2214 349 -373 44 1192 2053 1514 826 506 1040 1570 1976 971 51 -455 37 1843
3315A843J138k80j986k046j10J204K249J343p39k343k095m43J887K156P88r97
$$ 1843 2981 2701 715 -1331 -1441 -237 2012 3355 2616 273 -1822 -2265 -378 1778 2566 1569
3331A569j753j080rJ387P25N87j251o20j72R35N50r70m40o33J55J480R85k2j308
$$ 1569 -184 -1264 -1273 114 839 1426 175 -445 -617 318 868 -102 -542 -1175 -1020 460 1445 1423 115
3350A15j955l11J506J953J437o76k204j751k02J627K179Q25p11j849j258k29J471
$$ 115 -1840 -2151 -645 1308 2745 2069 -135 -1886 -2088 -461 1718 2543 1832 -17 -1275 -1504 -33
3367c3J258K76p64j064K05K43P87L17j139o95j7J226P69j05j081j433q62J236
$$ -33 1225 1501 737 -327 -122 121 908 1225 86 -609 -626 600 1369 1264 183 -1250 -2112 -876
3385h76J891J457j116j824j631m75J750K092Q65j101j639j443Q1J635J296L59
$$ -876 1015 2472 1356 -468 -2099 -2574 -824 1268 2133 1032 -607 -2050 -1969 -334 962 1321
3401A321j020j080k36N47P03J12l16n04J67N00J040P1r57j089o21J151J548J583
$$ 1321 301 -779 -1015 -468 235 347 31 -473 -306 194 1234 1305 348 -741 -1362 -211 1337 2920
3419B920q73k014j259k31J772K134O85j099j868q98J66J357J591J17r79j298j51
$$ 2920 2047 33 -1226 -1457 315 2449 3134 2035 167 -731 -565 792 2383 2500 1521 223 72
3436G2J38J200N84o91o88m59N79J078j75o50j283m45P11J545P90m23j816j622
$$ 72 210 1410 1994 1303 615 156 735 1813 1638 988 -295 -740 -29 1516 2306 1883 67 -1555
3454a555m8J489J859P42q82k356j114j49K023J200M11j301j363m98O90J207O12
$$ -1555 -1603 -114 1745 2487 1605 -751 -1865 -2014 9 1209 1620 319 -1044 -1542 -852 355 967
3471I67m44j079o38N90J195J5o77p90n17O82J443J078o53j304j687k95J879J726
$$ 967 523 -556 -1194 -604 591 606 -71 -861 -1378 -696 747 1825 1172 -132 -1819 -2114 -235 1491
3489A491P92q72k194j290M96J824J585L07j239j942p56Q48J643Q26n39j264p70
$$ 1491 2283 1411 -783 -2073 -1577 247 1832 2139 900 -1042 -1798 -950 693 1519 980 -284 -1054
3506a054K32R32R11n73r56n94k07J673R39k40j365j265l98P15K056J119r71j763
$$ -1054 -822 110 1021 448 -508 -1102 -1309 364 1303 1063 -302 -1567 -1965 -1250 806 1925 954 -809
3524h09j367J36J654J545O42r21k104o70P34J683R65l20p46j127k9J126Q04O9
$$ -809 -2176 -2040 -386 1159 1801 880 -1224 -1894 -1160 523 1488 1168 422 -705 -734 392 1196 1265
3542A265q18o87J31R82R33L3j012q86n99O61J691P95l11j557j479M1J590J284
$$ 1265 447 -240 -109 873 1806 1839 827 -59 -658 3 1694 2489 2178 621 -858 -817 773 2057
3560B057N55j068j426r84L88J238J121L9j407j187j0O21J077j05l38j294j59M01
$$ 2057 2612 1544 118 -866 -478 760 1881 1920 513 -674 -684 -63 1014 909 571 -723 -882 -481
3578d81J377J50j050r93k78L04J092O48l25j098j356N22O59J399K22q86j187o23
$$ -481 896 1046 -4 -997 -1275 -971 121 769 444 -654 -2010 -1488 -829 570 792 -94 -1281 -1904
3596a904O07J132Q55j10j139q19k22R91J083n4l94j059j91R16Q81K27o84q56k89
$$ -1904 -1297 -165 690 580 -559 -1378 -1600 -609 474 420 26 -1033 -1224 -308 573 800 116 -740 -1029
3615a029K04J313P96k92j350r19Q5R16J314K05r56j332l16L73J244P59j74j258
$$ -1029 -825 488 1284 992 -358 -1277 -1192 -276 1038 1243 287 -1045 -1361 -988 256 1015 841 -417
3633d17q70j03J061R88Q3p36j193o9k4J527N21n71j371o91N95J005J221l44j353
$$ -417 -1287 -1390 -329 659 742 6 -1187 -1256 -1280 247 768 197 -1174 -1865 -1270 -265 956 612 -741
3652g41j099k22J281J330L73p73j195r67K62J838J148j12j268j595K06O22J965
$$ -741 -1840 -2062 -781 549 922 149 -1046 -2013 -1751 87 1235 1123 -145 -1740 -1534 -912 1053
3669A053P62j169j135j113O48J886Q51l62r25j347o3J382J274L67j087j361n63
$$ 1053 1815 646 -489 -1602 -954 932 1783 1421 496 -851 -914 468 1742 2109 1022 -339 -902
3686i02M83J791R29o55j003j657L99J237J354Q7j002j722n82J049J378J346j080
$$ -902 -419 1372 2301 1646 643 -1014 -615 622 1976 2063 1061 -661 -1243 -194 1184 2530 1450
3703A450j630j437M51J547J271L36j421j533l69M85K127N72o22j608j021K75J362
$$ 1450 -180 -1617 -1166 381 1652 1988 567 -966 -1335 -850 1277 1849 1227 -381 -1402 -1127 235
3720B35J167K98j363j481l52J094J604P33j149j703n94M74J343J246l48j152j572
$$ 235 1402 1700 337 -1144 -1496 -402 1202 1935 786 -917 -1511 -1037 306 1552 1204 52 -1520
3737a520j06J362J419P15j496j522r02Q80J569R80l18j598j236k92J795J407o5
$$ -1520 -1626 -264 1155 1870 374 -1148 -2050 -1170 399 1379 1061 -537 -1773 -2065 -270 1137 1072
3754A072q93j305q49P90J541N44m05j524p38M89J144J379l76j421j317K4J766
$$ 1072 179 -1126 -1975 -1185 356 900 495 -1029 -1767 -1278 -134 1245 869 -552 -1869 -1845 -79
3771g9J155O24j305j655o75R56J702J172m88j667j096j36J730J364M32j251j550
$$ -79 1076 1700 395 -1260 -1935 -979 723 1895 1407 -260 -1356 -1492 238 1602 2034 783 -767
3788g67j82P97J347O18o83j393l89N35J346J046n72j292j265M22J661P37L98j365
$$ -767 -949 -152 1195 1813 1130 -263 -652 -117 1229 2275 1703 411 -854 -432 1229 1966 2364 999
3806I99j902n27J274J906N39k36k022j833O93J503J525P1j021j891n33J135J371
$$ 999 -903 -1430 -156 1750 2289 2053 31 -1802 -1109 394 1919 1990 969 -922 -1455 -320 1051
3823A051N64r01j167r28L67J736O43m82j516j006N13J520J187K70k128j567m2
$$ 1051 1615 714 -453 -1381 -1014 722 1365 883 -633 -1639 -1126 394 1581 1851 -277 -1844 -1886
3840a886J416K282M95m15k960j175M23K190K195j83j607k010m29J277J920P10
$$ -1886 -470 1812 2307 1892 -1068 -2243 -1820 370 2565 2382 775 -1235 -1664 -387 1533 2243
3856B243q34j377j144N91J700J018n63j651j264L7K026J430J55j688k174n50J504
$$ 2243 1409 32 -1112 -521 1179 2197 1634 -17 -1281 -1244 782 2212 2367 679 -1495 -2045 -541
3873e41K433J239j006k940j991P50K142K200J65j941k473q53J481J811J352r67
$$ -541 1892 3131 2125 -815 -2806 -2056 86 2286 2451 510 -1963 -2816 -1335 476 1828 861
3889H61j896j038L53J421J349j00j613j728N14J851J201K97j954j851l21J273
$$ 861 -1035 -2073 -1720 -299 1050 950 -663 -2391 -1877 -26 1175 1472 -482 -2333 -2654 -1381
3905a381K454J285j112k131j684J57K251K326J86j351k200q62J074K199J290o12
$$ -1381 1073 2358 1246 -885 -2569 -2412 -161 2165 2351 1000 -1200 -2062 -988 1211 2501 1889
3921A889j421j115P5J313J338M2j238j375O4J229J322L28j284j763k17J049J967
$$ 1889 468 -647 -572 741 2079 2121 883 -492 -428 801 2123 2451 1167 -596 -813 236 2203
3938B203J054r21k228j515J90K088J835K27j530j949q89P12J788J120k02j544
$$ 2203 3257 2336 108 -1407 -1217 871 2706 2933 1403 -546 -1435 -723 1065 2185 1983 439
3954D39j188k75J289J231j02r64j068k72J111R23Oj040j251q0R95J411O53j006
$$ 439 -749 -1024 265 1496 1394 430 -638 -910 201 1124 1130 90 -1161 -1241 -246 1165 1818 812
3972H12j581j023M03J799J607J80j449j697p71J047J614J173o99j227j031J46
$$ 812 -769 -1792 -1389 410 2017 2197 748 -949 -1720 -673 941 2114 1415 188 -843 -697
3988f97O61J233k1p28q80j75R96O38o5j181n85l07J227J469M9j274j562o31O65
$$ -697 -36 1197 1176 448 -432 -607 389 1027 962 -219 -804 -1111 116 1585 1634 360 -1202 -1833 -1168
4007a168J676J359l30j547j288o46J292R81J147o77j271r54JJ032R46j37p47o27
$$ -1168 508 1867 1537 -10 -1298 -1944 -652 329 1476 799 -472 -1426 -1425 -393 553 416 -331 -958
4025i58K49N77P35l16o14n13l87J332Q56O02j268j582o15J096J499J015l88j038
$$ -958 -709 -132 603 287 -327 -840 -1227 105 961 1563 295 -1287 -1902 -806 693 1708 1320 282
4043B82j428m88J066J720M89k32j477r50L03R47P03K96o05n15k89M81K95J56m47
$$ 282 -1146 -1634 -568 1152 1641 1409 -68 -1018 -715 232 935 1231 626 111 -178 303 598 754 307
4062C07q12L94O18P51r6o12j033n14M85J340J130m15p79j481p80Q40J601R26o06
$$ 307 -505 -111 507 1258 1162 550 -483 -997 -512 828 1958 1543 764 -717 -1497 -657 944 1870 1264
4081A264j072p28m23R22Q26K20j36o99n54r0M42L00k7m57j55M20O71r4k32q06
$$ 1264 192 -536 -959 -37 789 1009 873 174 -380 -470 -28 272 245 -212 -367 53 724 630 398 -408
4101d08l46J95P43J185q1q00j354l26N23R73J136k6j156j041l56N05R31N79k6
$$ -408 -754 -559 184 1369 1288 488 -866 -1192 -669 304 1440 1414 258 -783 -1139 -634 297 876 850
4120H50q66l25n21M04O30o3M8q8k28R3P1m22j68l40N8P77L1M85p65q62k36J75
$$ 850 -16 -341 -862 -458 172 109 157 69 -159 -66 5 -417 -585 -925 -867 -90 -59 426 -339 -1201 -1437 -1262
4142a262J135N45M03m17j409n83P8J113P80L02n54j093l61K71P11N20K53j84l57
$$ -1262 -127 418 821 404 -1005 -1588 -1510 -397 383 685 131 -962 -1323 -1052 -341 179 432 248 -109
4161a09n04J71K13K5L20j32j47K25M79l51m02k46k3O51N72K87l00r24m65p2R56
$$ -109 -613 -442 -229 -204 116 -16 -163 62 541 190 -212 -458 -481 170 742 1029 729 -195 -660 -732 224
4182B24P12M14k43j002q04L7O36Q45L69j87o29j051K33P75j52M66l35j38p1K01
$$ 224 936 1350 1107 105 -699 -662 -26 819 1188 1001 372 -679 -446 329 177 643 308 170 99 300
4202C00K09K68q06l2J19L44N74m4n55p13j68N31R66N92k76j264p74j94J068R23
$$ 300 509 777 -29 -61 58 402 976 932 377 -336 -504 27 993 1585 1309 45 -729 -923 145 1068
4222A068M18j10j163p86j1P25O02M6k73q06Q4L31j4K46k19n16L19P10j30K37m49
$$ 1068 1486 1376 213 -573 -584 141 743 789 516 -290 -206 125 111 357 138 -378 -59 651 521 758 309
4243C09j009l94M98J243K44m00j024o43j13R14J042K95m08j178j069L10R99Q21
$$ 309 -700 -1094 -596 647 891 491 -533 -1176 -1289 -375 667 962 554 -624 -1693 -1383 -384 437
4261D37l7p88k10m49M97O23nm64l67J29Q20M07m38m45n73l31Q81J234L27p04q60
$$ 437 400 -388 -598 -1047 -550 73 68 -396 -763 -634 186 593 155 -290 -863 -1194 -313 921 1248 544 -316
4282c16j005J06J545J005L19j092r32p11O19J027Q27j98r00o37Q2P58M10J00q85
$$ -316 -1321 -1215 330 1335 1654 562 -370 -1081 -462 565 1392 1194 294 -343 -261 497 907 1007 122
4301A22m15N1P04M59k07n78q47j68P80J281K03n09j327j146O39R75J338K60j090
$$ 122 -293 -242 462 921 714 136 -711 -879 -99 1182 1385 876 -451 -1597 -958 17 1355 1615 525
4320E25q99q87O75J537O21m97j201q99K00R42R73j34o04q74j18R03Q91P0n85j151
$$ 525 -374 -1261 -586 951 1572 1075 -126 -1025 -825 117 1090 956 352 -522 -640 263 1154 1224 639 -512
4340e12m16J042Q45O97l17j244j175M53J268J546J8q99j668o65P39J589R47m76
$$ -512 -928 114 959 1656 1339 95 -1080 -627 641 2187 2205 1306 -362 -1027 -288 1301 2248 1772
4358A772j460q23r6J084J240j14r60j038k41R25R97L16r39j281n80L24J598P86
$$ 1772 312 -511 -607 477 1717 1603 643 -395 -636 289 1286 1602 663 -618 -1198 -874 724 1510
4376A510n97j347j279L29J197J485j90n45j703o50O92J424O50m26j129j172K13
$$ 1510 913 -434 -1713 -1384 -187 1298 1108 563 -1140 -1790 -1098 326 976 550 -579 -1751 -1538
4393a538J100J133o0n10j485j48O05J180N25o58r33p20O90J289Q60j10j523q85
$$ -1538 -438 695 635 125 -1360 -1508 -903 277 802 144 -789 -1509 -819 470 1330 1220 -303 -1188
4411a188P3R85J388L73r54j396k74M19J577P08j41j489q19j6J282J347p5j020
$$ -1188 -1115 -130 1258 1631 677 -719 -993 -574 1003 1711 1570 81 -738 -754 528 1875 1800 780
4429G80q42m89M88J374K87l72j389n91O43P07J012m06p22r50l41R85J117O8o17
$$ 780 -62 -551 -63 1311 1598 1226 -163 -754 -111 596 1608 1202 480 -470 -811 174 1291 1359 742
4448G42r97o25L88J547N53m52j020j134L59J061N49K18p83j061k34O78J141L79
$$ 742 -255 -880 -492 1055 1608 1156 136 -998 -639 422 971 1189 406 -655 -889 -211 930 1309
4466A309o91r31k79M13Q81Q21m87o32j077O60O50Q00K72r78j005k19Q56P49M96
$$ 1309 618 -313 -592 -179 702 1523 1036 404 -673 -13 637 1437 1709 731 -274 -493 363 1112 1608
4485A608k85j098o03K78Q81Q46j53q70r39J31O99P36K32o50j260k71N98J194O4
$$ 1608 1323 225 -378 -100 781 1627 1474 604 -335 -204 495 1231 1463 813 -447 -718 -120 1074 1138
4504A138k94j021o28n3J173O59L99j200p54m10N04R55N74o92o73j056O27R58M81
$$ 1138 844 -177 -805 -858 315 974 1373 173 -581 -991 -487 468 1042 350 -323 -1379 -752 206 687
4523F87K17j297o85m0Q73J024J01r62o42q83Q43J062P03m39o95p41j52J065Q78
$$ 687 904 -393 -1078 -1118 -245 779 880 -82 -724 -1607 -764 298 1001 562 -133 -874 -1026 39 917
4542I17Q1o25p50o18Q80Q78O00p21o59k22j67J058O14j21r67p66j25J318Q33O0
$$ 917 998 373 -377 -995 -115 763 1363 642 -17 -239 -406 652 1266 1145 178 -588 -713 605 1438 1498
4562A498n64j309P9J0J461M16m95p31q94J69M96J102J01l93j050j37l3J341Q3
$$ 1498 934 -375 -296 -286 1175 1591 1096 365 -529 -360 136 1238 1339 946 -104 -241 -274 1067 1150
4581A150l02p17n45N8R07O62m86m35o04K00L13J063M8r29r00j16L23Q67M66r8
$$ 1150 848 131 -414 -356 551 1213 727 292 -312 -112 201 1264 1312 383 -517 -633 -310 557 1023 925
4601I25n72p52j07P23N76N15k15r70m02k15Q86O45n64j70m31l35N03J112o59j49
$$ 925 353 -399 -506 217 793 1308 1093 123 -279 -494 392 1037 473 303 -128 -463 40 1152 493 344
4621C44o59J20K29R45Pn55n58m51K44M69P37J55p66p64k12N61P01J96M1q39l03
$$ 344 -315 -195 34 979 986 431 -127 -578 -334 135 872 1027 261 -503 -715 -154 547 743 784 -55 -358
4642c58P1L34J60j58j8l15J55J92J49K0j64m52K06K64N52m35k95n18K1J82L38
$$ -358 -287 47 207 49 31 -284 -129 63 212 232 68 -384 -178 86 638 203 -92 -610 -589 -407 -69
4663f9N76K42o84n81k50M75N29K93j83m99m53N6K97J40K64j68k29j14L32j8N1
$$ -69 507 749 65 -516 -766 -291 238 531 348 -151 -604 -548 -251 -111 153 -15 -244 -358 -26 -44 7
4684Gj75k48K09K60Q3L1l54l03J06K97M73K04j84l00n57J31J73P87J10J60p28
$$ 7 -168 -416 -207 53 136 167 -187 -490 -384 -87 386 590 406 106 -451 -320 -147 640 750 910 182
4705A82n62M64j4M96m5M53k75l24j84L73p6Kj17K43NK84oj79l33k18J17N89M28
$$ 182 -380 84 70 566 521 974 699 375 191 564 488 490 373 616 621 905 899 720 387 169 286 875 1303
4728A303k44p24m13o0O05L90L38L0p00p30l77P90M61L13l82l95o28M73q8J17j18
$$ 1303 1059 335 -78 -138 467 857 1195 1225 525 -205 -582 208 669 982 600 205 -423 50 -38 79 -39
$$ [...]
8191I6
##END NTUPLES=NMR FID
##END=
