##TITLE=1H_BAU-28.01K
 CDCl3, 8 sc, 
 28.1.2020
##JCAMPDX= 6.0         $$ Bruker NMR JCAMP-DX V2.0
##DATA TYPE= NMR FID
##DATA CLASS= NTUPLES
##ORIGIN= UXNMR, Bruker Analytische Messtechnik GmbH
##OWNER= root
$$ XWIN-NMR		Version 3.5
$$ Tue Jan 28 14:38:35 2020 Russian Standard Time (UT+4h)  she@DPX200
##.OBSERVE FREQUENCY= 200.1315
##.OBSERVE NUCLEUS= ^1H
##.DELAY= (6, 6)
##.ACQUISITION MODE= SIMULTANEOUS
##.ACQUISITION SCHEME= undefined
##.AVERAGES= 8
##.DIGITISER RES= 18
##SPECTROMETER/DATA SYSTEM= spect
##.PULSE SEQUENCE= zg30
##.SOLVENT NAME= CDCl3
##.SHIFT REFERENCE= (INTERNAL, CDCl3, 0, 15.7039)
##AUDIT TRAIL= $$ (NUMBER, WHEN, WHO, WHERE, WHAT)
$$ ##TITLE= Audit trail, XWIN-NMR		Version 3.5
$$ ##JCAMPDX= 5.01
$$ ##ORIGIN= Bruker BioSpin GmbH
$$ ##OWNER= she
$$ F:/spectra/data/she/nmr/H-F/1/audita.txt
$$ ##AUDIT TRAIL=  $$ (NUMBER, WHEN, WHO, WHERE, WHAT)
(   1,<2020-01-28 14:37:19.85 +0400>,<she>,<DPX200>,
      <created by zg, POWCHK disabled, PULCHK disabled
       configuration hash MD5:
       00 E9 B6 7A A2 85 ED C7 34 08 36 98 17 FE 4E 26
       data hash MD5: 16K
       42 C5 94 44 11 C7 74 89 46 AC E5 85 3D 60 AF 6C>)
$$ ##END=
$$ 
$$ hash MD5
$$ 38 74 EB CA 10 54 2D 4E AF B1 69 E8 81 F3 DF FC
##$RELAX= 
##$RELAX= 
##$RELAX= 
##$RELAX= 
##$RELAX= 
##$RELAX= 
$$ Bruker specific parameters
$$ --------------------------
##$DU= <F:/spectra>
##$EXPNO= 1
##$NAME= <H-F>
##$PROCNO= 1
##$TYPE= <nmr>
##$USER= <she>
##$AMP= (0..31)
100 100 100 100 100 100 100 100 100 100 100 100 100 100 100 100 100 100 
100 100 100 100 100 100 100 100 100 100 100 100 100 100 
##$AQSEQ= 0
##$AQ_mod= 1
##$AUNM= <au_zg>
##$AUTOPOS= <>
##$BF1= 200.13
##$BF2= 200.13
##$BF3= 200.13
##$BF4= 200.13
##$BF5= 200.13
##$BF6= 200.13
##$BF7= 200.13
##$BF8= 200.13
##$BYTORDA= 1
##$CFDGTYP= 0
##$CFRGTYP= 5
##$CHEMSTR= <none>
##$CNST= (0..31)
1 1 145 1 1 1 1 1 1 1 1 1 1 1 1 1 1 1 1 1 1 1 1 1 1 1 1 1 1 1 1 1 
##$CPDPRG= <>
##$CPDPRG1= <>
##$CPDPRG2= <>
##$CPDPRG3= <>
##$CPDPRG4= <mlev>
##$CPDPRG5= <mlev>
##$CPDPRG6= <mlev>
##$CPDPRG7= <mlev>
##$CPDPRG8= <mlev>
##$CPDPRGB= <>
##$CPDPRGT= <>
##$D= (0..31)
0 1.2 0 0 0 0 0 0 0 0.06 0 0.03 0 0 0 0 0.0002 0 0 0 0 0 0 0 0 0 0 0 0 
0 0 0 
##$DATE= 1580207839
##$DBL= (0..7)
120 120 120 120 120 120 120 120 
##$DBP= (0..7)
150 150 150 150 150 150 150 150 
##$DBP07= 0
##$DBPNAM0= <>
##$DBPNAM1= <>
##$DBPNAM2= <>
##$DBPNAM3= <>
##$DBPNAM4= <>
##$DBPNAM5= <>
##$DBPNAM6= <>
##$DBPNAM7= <>
##$DBPOAL= (0..7)
0.5 0.5 0.5 0.5 0.5 0.5 0.5 0.5 
##$DBPOFFS= (0..7)
0 0 0 0 0 0 0 0 
##$DE= 6
##$DECBNUC= <off>
##$DECIM= 24
##$DECNUC= <off>
##$DECSTAT= 4
##$DIGMOD= 1
##$DIGTYP= 9
##$DL= (0..7)
0 120 120 120 120 120 120 120 
##$DP= (0..7)
150 150 150 150 150 150 150 150 
##$DP07= 0
##$DPNAME0= <>
##$DPNAME1= <>
##$DPNAME2= <>
##$DPNAME3= <>
##$DPNAME4= <>
##$DPNAME5= <>
##$DPNAME6= <>
##$DPNAME7= <>
##$DPOAL= (0..7)
0.5 0.5 0.5 0.5 0.5 0.5 0.5 0.5 
##$DPOFFS= (0..7)
0 0 0 0 0 0 0 0 
##$DQDMODE= 0
##$DR= 18
##$DS= 0
##$DSLIST= <SSSSSSSSSSSSSSS>
$$ [...]
##$SUBNAM2= <"">
##$SUBNAM3= <"">
##$SUBNAM4= <"">
##$SUBNAM5= <"">
##$SUBNAM6= <"">
##$SUBNAM7= <"">
##$SUBNAM8= <"">
##$SUBNAM9= <"">
##$SW= 24.9337058887773
##$SWIBOX= (0..15)
0 0 2 0 0 0 0 0 0 0 0 0 0 0 0 0 
##$SW_h= 4990.01996007984
##$TD= 16384
##$TD0= 1
##$TE= 0
##$TE2= 300
##$TE3= 300
##$TEG= 300
##$TL= (0..7)
0 120 120 120 120 120 120 120 
##$TP= (0..7)
150 150 150 150 150 150 150 150 
##$TP07= 0
##$TPNAME0= <>
##$TPNAME1= <>
##$TPNAME2= <>
##$TPNAME3= <>
##$TPNAME4= <>
##$TPNAME5= <>
##$TPNAME6= <>
##$TPNAME7= <>
##$TPOAL= (0..7)
0.5 0.5 0.5 0.5 0.5 0.5 0.5 0.5 
##$TPOFFS= (0..7)
0 0 0 0 0 0 0 0 
##$TUNHIN= 0
##$TUNHOUT= 0
##$TUNXOUT= 0
##$USERA1= <user>
##$USERA2= <user>
##$USERA3= <user>
##$USERA4= <user>
##$USERA5= <user>
##$V9= 5
##$VALIST= <valist>
##$VCLIST= <CCCCCCCCCCCCCCC>
##$VD= 0
##$VDLIST= <DDDDDDDDDDDDDDD>
##$VPLIST= <PPPPPPPPPPPPPPP>
##$VTLIST= <TTTTTTTTTTTTTTT>
##$WBST= 1024
##$WBSW= 4
##$XGAIN= (0..3)
0 0 0 0 
##$XL= 0
##$YL= 0
##$YMAX_a= 177140
##$YMIN_a= -252676
##$ZGOPTNS= <>
##$ZL1= 120
##$ZL2= 120
##$ZL3= 120
##$ZL4= 120
##$ABSF1= 10
##$ABSF2= 0
##$ABSG= 5
##$ABSL= 3
##$ALPHA= 0
##$AQORDER= 0
##$ASSFAC= 0
##$ASSFACI= 0
##$ASSFACX= 0
##$ASSWID= 0
##$AUNMP= <proc_1d>
##$AZFE= 0.1
##$AZFW= 0.1
##$BCFW= 1
##$BC_mod= 2
##$BYTORDP= 1
##$COROFFS= 0
##$CY= 11.3945322036743
##$DATMOD= 1
##$DC= 2
##$DFILT= <>
##$DTYPP= 0
##$F1P= 16.9975609425685
##$F2P= -3.02152046262296
##$FCOR= 0.5
##$FTSIZE= 0
##$FT_mod= 4
##$GAMMA= 1
##$GB= 0.15
##$INTBC= 1
##$INTSCL= 1
##$ISEN= 128
##$LB= 0.24
##$LEV0= 0
##$LPBIN= 0
##$MAXI= 10000
##$MC2= 0
##$MEAN= 0
##$ME_mod= 0
##$MI= 1.114404
##$NCOEF= 0
##$NC_proc= 0
##$NLEV= 6
##$NOISF1= 3.799351
##$NOISF2= 2.8
##$NSP= 1
##$NTH_PI= 0
##$NZP= 0
##$OFFSET= 15.70392
##$PC= 1
##$PHC0= -9949.556
##$PHC1= 22.20081
##$PH_mod= 1
##$PKNL= yes
##$PPARMOD= 0
##$PSCAL= 0
##$PSIGN= 0
##$REVERSE= no
##$SF= 200.130013532006
##$SI= 16384
##$SIGF1= 3
##$SIGF2= 2
##$SINO= 400
##$SIOLD= 16384
##$SREGLST= <1H.CDCl3>
##$SSB= 0
##$STSI= 0
##$STSR= 0
##$SW_p= 3612.71676300578
##$SYMM= 0
##$S_DEV= 0
##$TDeff= 0
##$TDoff= 0
##$TI= <>
##$TILT= no
##$TM1= 0
##$TM2= 0
##$TOPLEV= 0
##$USERP1= <user>
##$USERP2= <user>
##$USERP3= <user>
##$USERP4= <user>
##$USERP5= <user>
##$WDW= 1
##$XDIM= 8192
##$YMAX_p= 0
##$YMIN_p= 0
$$ End of Bruker specific parameters
$$ ---------------------------------
##NTUPLES= NMR FID
##VAR_NAME=  TIME,          FID/REAL,        FID/IMAG
##SYMBOL=    X,             R,               I
##VAR_TYPE=  INDEPENDENT,   DEPENDENT,       DEPENDENT
##VAR_FORM=  AFFN,          ASDF,            ASDF
##VAR_DIM=   8192,          8192,            8192
##UNITS=     SECONDS,       ARBITRARY UNITS, ARBITRARY UNITS
##FACTOR=    0.0002004,     1,               1
##FIRST=     0,             0,               0
##LAST=      1.6414764,     0,               0
##MIN=       0,             -252676,         0
##MAX=       1.6414764,     177140,          0
$$ Real data points
##PAGE= N=1
##DATA TABLE= (X++(R..R)), XYDATA
0@%%%%%%%qJ6j6J6k4L2m0M8n6P2q8J04j20J44j72J97k25K62l03L45l93M47n08
30b70N75o47P24q10R07j013J127j250J388j541J708j892K096k321K570k848L161
47A664l516L920m384M927n572O350p313Q542j0169J2444j5870K1680l4050J02585
61H1238j43110j75259K82787Q0612j79047j4675K03922p1535k22992N4924K24791
72A21656l8619j39559M8458O1520j23141k2969J74337L9568j76768l3311J33193
83D4365j0513j13505P3768J23182r8090j36736Q6188J07306p1085m8403Q9666
94D6143k477j22899J7089J34063j9668j08345M2063P5195q8088o4402J24978P1838
106A05490j28366o4797J09906K6404j03146K3302J18529n2436j32710N7753J19871
$$ plain form
0 0 0 0 0 0 0 0 0 -8 8 -8 8 -16 16 -24 24 -32 40 -48 56 -64 80 -92 105 -120 142 -161 184 -209 238 -270
30 -270 305 -342 382 -428 479 -534 593 -657 731 -810 898 -994 1102 -1219 1351 -1497 1664
47 1664 -1852 2068 -2316 2611 -2961 3389 -3924 4618 -5551 6893 -8977 12703 -21347 81238
61 81238 -61872 -237131 45656 126268 -52779 -67454 136468 64933 -158059 -103135 121656
72 121656 83037 -56522 -8064 53456 -69685 -92654 81683 121251 -55517 -88828 44365
83 44365 33852 -79653 -5885 117297 19207 -117529 -31341 75965 4880 -43523 46143
94 46143 43666 -79233 -62144 71919 52251 -56094 -14031 61164 -26924 -91326 33652 105490
106 105490 -22876 -87673 22233 48637 -54509 -31207 87322 34886 -97824 -40071 79800
117G9800o4138q6191R0655N9536j24209n3754J37794N2041j24264l0885J04881
128D1266q332r9349M2816J02004n7390r1353O3080O0156p9238k4840J08645N590
140F3055j31590q34J31603q553j14921L4280J02535o4769j01679P9921R9032p6412
152A1668p6565P1696L7530q1375k384R9395j4650j05160K3347R0435m1863o9249
164e7175P2769O0003r8881o0831J04346N3917r4858k8305R0027n408r6951K8183
176c3164J02750l6432r2037M5007O6806o5545m4388R1528L4379j06185k8105J03602
188C8216J1153r5548J6720R4314m1891r7469N4560R1540o0607p1707P1971M7638
200E8890q9920l1272J02557K0779j01758n068R2932k0109q8082M4646Q7954n8053
$$ plain form
117 79800 15662 -70529 20126 79662 -44547 -98301 39493 91534 -32730 -63615 41266
128 41266 32934 -66415 -23599 78405 21015 -70338 -7258 52898 -26340 -51180 57465 63055
140 63055 -68535 -69369 62234 53681 -61240 -26960 75575 10806 -90873 -10952 88080 11668
152 11668 -64897 6799 44329 -37046 -39430 59965 45315 -59845 -36498 53937 12074 -57175
164 -57175 15594 75597 -23284 -84115 20231 74148 -20710 -49015 41012 35604 -61347 -33164
176 -33164 69586 33154 -58883 -13876 52930 -12615 -57003 34525 68904 -37281 -65386 38216
188 38216 49369 -46179 -29459 64855 22964 -74505 -19945 71595 10988 -60719 11252 58890
200 58890 -31030 -62302 40255 61034 -40724 -45792 47140 27031 -61051 -16405 71549 13496
212A3496q1968O2557O2263p0171l6650Q5426J7633r8272q145R7190l591q4307
224d4539K5818P2965n2650p0373O9721O8455p2768n4888P1621K9266p8056m098
236c9526Q9656j0050r3672J6906Q2970k9156o4773N0817N2087p2119m7557Q1288
248A6871M0898p8506k2753P5417k808p9462K3244Q5074l2596q0680L8375O4184
260D7258n0356m5232O8244L3477q1182k6507Q2208J4537p5718O389P2234k8708
272A6644p3599M3187P1975m9402n9963N6009M1287o7999k5034Q0092J5282q3471
284c4992n607P7580j0465p0042L0893O6809m6611o3889N3809N3852n7613l5986
296d2262O5149J7949p4804n739P8668l112p2996J5887O2989l3639n5917M9592
$$ plain form
212 13496 -68472 -5915 56348 -13823 -50473 34953 52586 -45686 -53831 43359 39768 -44539
224 -44539 -18721 54244 1594 -68779 942 69397 -3371 -58259 13362 42628 -35428 -39526
236 -39526 50130 40080 -53592 -36686 46284 17128 -47645 3172 55259 -16860 -64417 16871
248 16871 57769 -20737 -43490 31927 29119 -50343 -27099 57975 25379 -55301 -16926 47258
260 47258 -3098 -48330 19914 53391 -27791 -54298 27910 42447 -33271 -26882 45352 16644
272 16644 -56955 -13768 58207 8805 -51158 4851 46138 -21861 -46895 33197 48479 -34992
284 -34992 -40599 36981 26516 -43526 -12633 54176 7565 -56324 -2515 51337 -6276 -42262
296 -42262 22887 40836 -33968 -39707 38961 35849 -37147 -21260 41729 8090 -47827 1765
308A765N1571n7362m3623N8975K8044o1183r061O6668o031p0851J5261O7521k3882
321A7812n6924L6327M5326n1001l7487O1184L1073o3589k0598O1357M181o0414
333c2753J2773O2000k5055o0918L1911N2578l8869l9306M9279K6873o0032j8601
345d0120O4819J0696o2713J432N8145j6982n5711L0501N3308l8524m6850M3547
357A548L4740m9603k1182N6554R741o0829j66O0134j0534n5684K2773N0601l4590
370C503m5335M3454L8236m9054k8498N2980J6616n5924m467N7213o622n5718J6937
383a6679N1289k7026m4674L6884L7135m4829k9109N0006J9908n2288q745N3083
395B4955k950n2849J3314N0891k1810m5152K9689L6821l8120k8002M5780K0333
$$ plain form
308 1765 53336 -4026 -47649 11326 39370 -21813 -30874 35794 29763 -41088 -25827 41694 17812
321 17812 -39112 -2785 42541 -8460 -45947 15237 46310 -17279 -37877 23480 27661 -32753
333 -32753 -19980 42020 16965 -43953 -12042 40536 1667 -37639 11640 38513 -21519 -40120
345 -40120 24699 35395 -27318 -25886 32259 15277 -40434 -9933 43375 4851 -41999 1548
357 1548 36288 -13315 -34497 22057 31798 -29031 -29197 30937 20403 -35281 -12508 38093 3503
370 3503 -41832 1622 39858 -9196 -37694 15286 31902 -24022 -28489 28724 22102 -33616 -16679
383 -16679 34610 7584 -37090 -206 36929 -7900 -37009 12997 32905 -19383 -28128 24955
395 24955 22005 -30844 -17530 33361 11551 -33601 -3912 32909 -5211 -33213 12567 32900
407C2900n0048j2170N0549K061m9089R562M7953j9986m5794K7340M0884l2813
419A349l2392L8497K2535m4316j3417M8371N442m9014L133M6708j2772m3387K2573
432f690L9867l0549l5183L5869K8206l9550j9091M2779R450m5167q05M5509p285
445A7360m3018J5683L8418k4274l3584L1663K8398l6618k1701L9023J3258m0667
457a6059m030M1555m438m0884J1715L7437j8815l2053K6147K5843l2695j9908
469b6185L7035J3292l9147n545L9555k881l9382J0627L7854j7277l4159K2892
481c321K8482k8406k2094L3334J5421l6526q805L7723J370l7357O553L6059j4129
494H304l4026K0257L0467k4976k5150K9045J8554l2686j1628L5333N013l6045
$$ plain form
407 32900 -17148 -29318 21231 23292 -25797 -16235 31718 11732 -34062 -6722 34162 1349
419 1349 -31043 7454 29989 -14327 -27744 20627 26069 -22945 -19812 26896 14124 -29263 -6690
432 -6690 33177 2628 -32555 3314 31520 -8030 -27121 15658 25108 -20059 -20864 24645 17360
445 17360 -25658 -9975 28443 4169 -29415 2248 30646 -5972 -27673 11350 24608 -16059
457 -16059 -20089 21466 17028 -23856 -12141 25296 6481 -25572 575 26418 -6277 -26185
469 -26185 10850 24142 -15005 -20550 19005 16124 -23258 -12631 25223 7946 -26213 -3321
481 -3321 25161 -3245 -25339 7995 23416 -13110 -21915 15808 17178 -20179 -13626 22433 8304
494 8304 -25722 -5465 25002 26 -25124 3921 22475 -10211 -21839 13494 18507 -17538
506a7538J540L4928q565l2557J5633K9624k1801k6024K6513K1357k9709j5187
518b1786L2019Q448l3696j523L4102m596l2924J0576L0105j6421k6186K2129K1809
531B2056k6632j7046K9646J1702l0959n517L1244q40l0662O969K9238j2166k6352
544a9319J6726K2009k0722j6698K4358J1386k7125n913K8205O09k7807N029K6316
557A7054j0591k4183J5735K1156j9652j7270K2588J2531k4839o974K6275J425
569A3255k6852L752K6286q789k4425J3667K1733j8168j8622K1743J4877k4237
581e780j0431K5784N150k6719J39K6757m858k5824R145K3386j3312k0252J7453
594F38J6564k0972j2969K3178Q816k3906m162K3884j235k3731O353K2770j0343
$$ plain form
506 -17538 -15998 18930 10365 -22192 -6559 23065 1264 -24760 1753 23110 -6599 -21786
518 -21786 10233 18681 -15015 -16538 17564 12968 -19956 -9380 20725 4304 -21882 247 22056
531 22056 -4576 -21622 8024 19726 -11233 -16750 14494 13654 -17008 -10039 19199 7033 -19319
544 -19319 -2593 19416 -1306 -18004 6354 17740 -9385 -15298 12907 13516 -14291 -9262 17054
557 17054 6463 -17720 -1985 19171 -481 -17751 4837 17368 -7471 -14445 11830 13255
569 13255 -13597 -9845 16441 7652 -16773 -3106 18627 459 -18163 3580 18457 -5780
581 -5780 -16211 9573 14723 -11996 -11857 14900 10042 -15782 -6637 16749 3437 -16815 638
594 638 17202 -3770 -16739 6439 15255 -8651 -12813 11071 9836 -13895 -7542 15228 4885
607D885k0865J3556J7260j6646j3010J9808Q872k2196n209K2779J201k2000L616
620g949K0787q756j9547J2631J7925j5305j4935J7353J0465j9347n974K1275K206
633A0829k1961J167K0967n005j8895R390J6951j3512j4926J6296J2331j7764q563
646a2695J8906M120k0037M5K0761l406k0018O460J8054r786j5541J3448J3198
659A3509j6272j0674J7855P490j8348l555J8825n35j8984M074J8517p024j6703
672a1825R800J4288j2681j1522J5191Q870j6645n808J7260K260j7261J545J7024
685A0496m917j6299P831J4651j0251j2145J2590R434j4807o672J6179L803j6419
698f526p56J6021k790j5377O260J4343q895j2805J1015J0259j2793p467J4550
$$ plain form
607 4885 -15980 -2424 14836 -1810 -14820 4988 13860 -8336 -13545 9234 10435 -11565 -7949
620 -7949 12838 4082 -15465 -2834 15091 -214 -15149 2204 12669 -6678 -12652 8623 10829
633 10829 -11132 -9965 11002 5997 -12898 -3508 13443 -69 -14995 1301 13632 -4132 -12695
646 -12695 6211 10331 -9706 -9661 11100 7694 -12324 -5864 12190 2404 -13137 311 13509
659 13509 -2763 -13437 4418 11908 -6440 -9995 8830 8295 -10689 -6615 11902 4878 -11825
672 -11825 -2025 12263 -418 -11940 3251 12121 -4524 -10332 6928 9188 -8073 -6528 10496
685 10496 5579 -10720 -2889 11762 1511 -10634 1956 11390 -3417 -10089 6090 9893 -6526
698 -6526 -7282 8739 5949 -9428 -3168 11175 2280 -10525 490 10749 -2044 -9511 5039
711E039M643j5832k031J6021p49j5258L716J4046o725j3130R320J1498j1021r210
725i673J2215O299j3609l323J4595P46j4831J554J4030m186j2759O998J1353r388
739B1j0038J0776Q127j1767n249J2462K251j3292J38J3454k160j2627M387J1023
753G506p014r439R413Q061j0850o476J1398L877j1564q55J2035j862j2272L793
767d249J1580n355r797P333P646r562n898J1380M462j1893k630J1662n9j1286
781f666L067J1278n374j0943O802R773p934p377R333N010j0930l143J2080J506
795F482j1827M59J1004k968j0124N593R567p455q640Q502O996r237m610J0207
809C949K398j1212l87J1432j201j0781L127R599n354q434P375P505q814o015R486
$$ plain form
711 5039 9682 -6150 -8181 7840 7091 -8167 -4451 9595 2870 -10260 -940 10558 -463 -9673
725 -9673 2542 8841 -4768 -8091 6504 7250 -7581 -6027 8003 3817 -8942 -1944 9409 21
739 21 -10017 759 8886 -2881 -8130 4332 6583 -6709 -6571 6883 4723 -7904 -3517 7506
753 7506 492 -8947 466 8527 -2323 -8799 2599 6476 -5088 -5943 6092 4230 -8042 -4249
767 -4249 7331 1976 -7821 -488 7158 -2404 -8302 3078 7540 -4353 -6983 4679 4620 -6666
781 -6666 -3599 7679 2305 -8638 -1836 7937 3 -7374 1959 6969 -3961 -7104 4976 6482
795 6482 -5345 -4886 6118 3150 -6974 -1381 8186 731 -7909 593 7589 -1648 -6258 3949
809 3949 6347 -4865 -5252 6180 4979 -5802 -2675 6924 1570 -6864 511 8016 -798 -6813 2673
824B673M007j0105j595J0621l92j0883K132J0374l910r276N766Q056p557o981
838g070Q892N466r597l469J0085J125j0635Q52J0747k426j0242L972Q969n797
852H72p636P628O422q995n208R423L385r393j175R472j255r606L001R263m283
867A915q254N618O369p091m704Q616L255r543j891R467J30r060K092Q619m352
882A186q243N910P690p072o350Q043M409q950k616R960R83j0402L58J0201j912
897C195r319L690Q476n491p616O900O466p658m978Q249L153q651j156Q977o31
912C606q880K157Q452l656p365N065O221o365m801P429L361q091j716Q374J10
927C901q328J700P957l435p335N109O613o390n505P321M042p858k321Q401O13
$$ plain form
824 2673 6680 -3425 -5020 5601 5209 -5674 -3542 6832 2922 -6354 -588 7468 -89 -7070
838 -7070 1822 7288 -2309 -5778 4307 5432 -5203 -4351 6396 3970 -6272 -2300 6669 872
852 872 -6764 864 7286 -1709 -6917 2506 5891 -3502 -4677 4795 3540 -6066 -3065 6198 1915
867 1915 -6339 -721 5648 -1443 -6147 2469 5724 -3819 -5710 3757 3887 -5173 -3081 5538 1186
882 1186 -7057 -1147 6543 -529 -6879 1164 5573 -3377 -5993 3967 4950 -5452 -5094 5107 3195
897 3195 -6124 -2434 6042 551 -7065 -165 6301 -1357 -6335 1914 5067 -3584 -4740 4237 3606
912 3606 -5274 -3117 5335 1679 -5686 -621 5600 -765 -5566 1863 5224 -2867 -4583 3791 3901
927 3901 -4427 -2727 5230 1795 -5540 -431 6182 -208 -5713 1608 5650 -2208 -4529 3872 4485
942D485q854J031Q883k398q241L811P096n330n903O795M845p832l680Q217K199
957E124q247l26Q246j520q352L143P995m207p091N218N454o294l957P430K670
972E286q174j554Q200J23p812J625P202l376o785M886N976n749m931O317L356
987D590o975j619P486L0p817J329P575k760o842M111N914n563n057O747L926p458
1003b383k620P771J049q020O73P886k157p605L519O886m823n840N978M617o924
1018a993l379P604J978p944l68P952j244p730K744P164m052o179N206N142o403
1033a502l844P180K637p537j170P593n51p480K365P349l644o816M666N711n570
1048f13m223O782K697p775j534Q262M92p965J112P223k858o802M702O538n692
$$ plain form
942 4485 -4369 -3338 5545 3147 -5094 -1283 5813 483 -5420 1375 6220 -1612 -5292 2925 5124
957 5124 -3123 -3449 4797 3277 -5075 -1932 6063 1856 -5235 -17 5437 -857 -4814 2616 5286
972 5286 -2888 -4442 3758 3881 -3931 -2306 4896 1520 -5265 -379 5597 -152 -5083 1234 4590
987 4590 -2385 -4004 3482 3512 -4305 -2976 4599 1839 -5003 -892 5022 -541 -5598 1149 5075 -2383
1003 -2383 -5003 2768 3817 -4203 -3530 4356 2199 -5406 -1887 4999 176 -5664 314 4931 -1993
1018 -1993 -5372 2232 4210 -3734 -4102 3850 2606 -5124 -2380 4784 732 -5447 -241 4901 -1502
1033 -1502 -5346 1834 4471 -3066 -4236 3357 2806 -4674 -2309 5040 1396 -5420 -754 4957 -613
1048 -613 -4836 1946 4643 -3132 -4666 3596 4088 -3877 -2765 4458 1600 -5202 -500 6038 346
1063C46n803O166M370o570k533P383R45q133M12Q053j500p330K952O383m679n527
1079e065O104M792o853l765P150K215p382m35P578j122p584K459P033l667o084
1094d626M840N012o082l814O940K476p335j124P486m53p448J975P099l378o481
1109d913M532N546n600m402O456L071p124j714P361K82p451J224P142k621o753
1124d964L848N959m997m937O054L659o794k497P324J004p219K87P113j928o858
1139d946L327O388m333n704N224M425o007k985O671J695p264m86P238p19o687
1154d163K155N981l628n379M968M739n777l767O237K392o518q10O884o42o952
1169d280J745O702k740n812L836M734n092l532O040K616o519j477O664L6o497
$$ plain form
1063 346 -5457 709 5079 -1491 -4024 3359 4304 -3829 -3417 4636 3136 -4194 -1242 5141 462 -5065
1079 -5065 1039 5831 -1022 -4787 2363 4578 -2804 -3239 4339 3217 -4367 -1908 5125 1458 -4626
1094 -4626 214 5226 -856 -4670 2270 4746 -2589 -3713 3773 3320 -4128 -2153 4946 1568 -4913
1109 -4913 -381 5165 -435 -4837 1619 4690 -2434 -4148 3213 3495 -3956 -2732 4410 1789 -4964
1124 -4964 -1116 4843 -154 -5091 963 4622 -2172 -4669 2655 3659 -3560 -3273 3840 1912 -4946
1139 -4946 -1619 4769 436 -5268 -44 4381 -1626 -4611 2060 3755 -3509 -3995 3243 2524 -4163
1154 -4163 -2008 3973 345 -5034 -66 4673 -1104 -4871 1366 3758 -2760 -3570 3314 2672 -4280
1169 -4280 -2535 4167 1427 -4385 -549 4185 -907 -4439 1601 4217 -2302 -3779 2885 2921 -3576
1184c576J511O474k874o181L879N571m695m296N386L108o211j774O591O87o758
1199c158O71O487j951o031L238N488m305m682N091L808n757k705O283J424o434
1214b533j35O382j272o114K493N633l512m940M482L845n220k831O017J648o429
1229b486o04O314n69n926J889N485l262n012M228M357m911l257N299J805n809
1244b459m99O317o52o432J506N935k499n208L845M230m922l560N595K683n958
1259b078j447N914qo032J419O033k467n689L252M947m110l964M992K794n676j675
1275c795N972P42n934K18N703j628n141K958M558l980l949M701L193n202k073
1290c657N469P91n632M91N782j514n616K433N110l410m137M263L296n115k260
$$ plain form
1184 -3576 -2065 4409 1535 -4646 -767 4804 109 -4187 1199 4307 -1904 -3678 2913 3600 -3158
1199 -3158 -2487 4000 2049 -3982 -744 4744 439 -4243 848 4656 -1101 -3806 2477 3901 -2533
1214 -2533 -2668 3714 2442 -3672 -1179 4454 942 -3998 484 4329 -891 -3722 2295 3943 -2486
1229 -2486 -3090 3224 2655 -3271 -1382 4103 841 -4171 57 4414 -497 -3754 1545 3350 -2459
1244 -2459 -2958 3359 2707 -3725 -2219 3716 1217 -3991 -146 4084 -838 -4398 1197 3880 -2078
1259 -2078 -3525 2389 2381 -3651 -2232 3801 1334 -4355 -1103 3844 -266 -4230 762 3556 -2120 -3795
1275 -3795 2177 2919 -3015 -2797 2906 1278 -3863 -905 3653 -327 -4276 425 3618 -1584 -3657
1290 -3657 1812 2603 -3029 -2538 3244 1730 -3886 -1453 3657 247 -3890 373 3669 -1446 -3706
1305c706N625J398n877l44N837p28n609K027N177l137m614M033L934m625k950
1320c559N020J840n362n33N669n18n816J464N489k215m762L136L975m326l067
1335c565N102K502n416j720N403M68n188Q71N184k121n043K917M491l408l549
1350c072M104K311m690j407N194O24n291K53M930j344m563K553M062l528l603
1365c467M160K835m555j864M708P71m997K89N169j294m981J992M587k819l846
1380c312L597K936m372k300N000J546n141q15M932k44m715J499M542k566m391
1395c804L073L881l345k839L730J527m267o94M816R6m873O01M258j452l602K529
1411c65L153l490k716L769K387l958j323L896J42m004R11M151j602l922K039L414
$$ plain form
1305 -3706 1919 3317 -2560 -2904 2933 2205 -3404 -1377 3800 663 -3951 82 4016 -609 -3559
1320 -3559 1461 3301 -2061 -2594 3075 2557 -3259 -1795 3694 1479 -3283 -147 3828 -498 -3565
1335 -3565 1537 4039 -1377 -3097 2306 2774 -2414 -1543 3641 1520 -3523 -606 3885 477 -3072
1350 -3072 1032 3343 -1347 -2754 2440 3064 -2227 -1974 2956 1612 -2951 -398 3664 136 -3467
1365 -3467 693 3528 -1027 -2891 1817 2588 -2409 -2120 3049 1755 -3226 -1234 3353 534 -3312
1380 -3312 285 3221 -1151 -3451 1549 3095 -2046 -2861 2071 1827 -2888 -1389 3153 587 -3804
1395 -3804 -731 3150 -195 -3034 696 2223 -2044 -2738 2078 2174 -2699 -2098 2160 708 -2894 -365
1411 -365 2788 -702 -3418 351 2738 -1220 -2543 1353 1495 -2509 -1598 2553 951 -2971 -932 2482
1427B482k624k525L329J683l874j027M220N12m182K54L857j183l383K092L066
1442B697k777k638L209K140l535j220L688M17l978N47M037j230l841J821L521
1457B858k515k851L015K272l598j575L995R51m050k73M088n87l838J488L496k158
1473G18l295K743K847l045k296L325J419l547n74L729j33l826P69L489j366k885
1489a928J991K301k730j881L339J398l429r28L276J23l223Q03L113j571l038J988
1505c96K706k303k031K731J046l151m25L588j24l703N90L329j246k887K067K465
1521B256k770k237L209J806l322j206L291K79l389N01L632j065l656J528L276
1536B133j985k641K547K026l074j534L382J113l469n78L369k34l069J006K936
$$ plain form
1427 2482 -142 -2667 662 2345 -1529 -2556 1664 2176 -2006 -1752 2105 922 -2461 -369 2697
1442 2697 -80 -2718 491 2631 -904 -2124 1564 1981 -1997 -1450 2587 1357 -2484 -663 2858
1457 2858 343 -2508 507 2779 -819 -2394 1601 2552 -1498 -1771 2317 1730 -2108 -620 2876 718
1473 718 -2577 166 3013 -32 -2328 997 2416 -1131 -1705 2024 1891 -1935 -1166 2323 957 -1928
1489 -1928 63 2364 -366 -2247 1092 2490 -939 -1867 1409 1532 -1691 -888 2225 654 -2384 -396
1505 -396 2310 7 -2024 707 1753 -1398 -1823 1765 1641 -2062 -1472 1857 611 -2276 -209 2256
1521 2256 -514 -2751 458 2264 -1058 -2264 1027 1306 -2083 -1582 2050 985 -2671 -1143 2133
1536 2133 148 -2493 54 2080 -994 -2528 854 1967 -1502 -2080 1289 1055 -2014 -1008 1928
1551A928j647k793K142K517k369j872K490J188k788m40L112o0l112M54K847r29
1567F68k323J561J940k212j607K610J295k742o46K594Q0k647O26K736j229k463
1583a759J561K174j864j679K226J120k586n39K807J81k991L79K845r33k522J431
1599a49K236j946j956K422J645k705j171K666O47k605J2K646o41k697R91K626
1615B021j370k144J505J697k068j165K532Q27k667o20K485J58k198M42K119j242
1631C12k034J493J948j646j406J636P46j957r9K074j95k295M63K048p85j587J250
1648c4J162j781r95K133P70k142m30K024j36j926P34J909j178j919J394J740j572
1665b47j214J722P39k077k30K210j9k286L88K059o72j852J143J582j569j357J929
$$ plain form
1551 1928 281 -2512 -370 2147 -222 -2094 396 1584 -1204 -1644 1468 1408 -1704 -1250 1597 668
1567 668 -1655 -94 1846 -366 -1973 637 1932 -810 -1456 1138 1218 -1429 -803 1933 704 -1759
1583 -1759 -198 1976 112 -1567 659 1779 -807 -1346 1461 1642 -1349 -970 1875 942 -1580 -149
1599 -149 2087 141 -1815 607 2252 -453 -1624 1042 1689 -916 -904 1742 1101 -1596 -605 2021
1615 2021 651 -1493 12 1709 -359 -1524 1008 1835 -832 -1452 1033 1191 -1007 -565 1554 312
1631 312 -1722 -229 1719 73 -1333 303 1049 -908 -1007 1067 872 -1423 -960 1088 303 -1284 -34
1648 -34 1128 -653 -1648 485 1255 -887 -1317 707 571 -1355 -621 1288 110 -1809 -415 1325 -247
1665 -247 -1461 261 1000 -1077 -1307 903 884 -1402 -1014 1045 373 -1479 -336 1246 -323 -1680 249
1682B49J161k043q83K057N05k001N6K027o01j980Q28K017j010j703J197J172j461
1699d13p15J865M37j885m32J887J03j509M75J297r82j353J286J343j243j045J255
1716C71L67j366J88J790m46j919M78J709o17j235J071R44j634p94J760Q92j763
1733b04n28J498K0j579N56J667q12j737Q85J546j066j045J128Q05j515m59J614
1750G74K71j602k5J426l48j294P06J152j006j000J064Q88j314n56J357K55j362
1767f14M7J268l57j332N68J293p80j028P34P84r57n04J241K58j342j53J229P0
1785D25j060K44R03p10q45R42Q82r85p31Q76L55r46J28J108k96j330K72J286l14
1804B04r00N25N80r27n30J309N67j255m51R11J75p42K93R61n84j123N62J011l41
$$ plain form
1682 249 1410 -633 -1516 541 1046 -955 -899 1128 527 -1453 -625 1392 382 -1321 -124 1048 -413
1699 -413 -1128 737 1174 -711 -1143 744 847 -662 -187 1110 128 -1225 61 1404 161 -884 371
1716 371 738 -628 -440 1350 904 -1015 -537 1172 555 -680 391 1335 -299 -1093 667 1559 -204
1733 -204 -732 766 786 -793 -237 1430 618 -1119 -234 1312 246 -799 329 1134 -381 -840 774
1750 774 1045 -557 -582 844 496 -798 -92 1060 54 -946 118 1006 -308 -864 493 748 -614
1767 -614 -567 701 344 -988 -420 873 93 -935 -201 583 -374 -878 363 621 -721 -874 355 425
1785 425 -635 -391 512 -198 -1043 -101 781 -204 -935 -59 296 -650 -522 586 290 -1040 -768 518 204
1804 204 -696 -171 409 -518 -1048 261 828 -427 -878 33 208 -534 -241 720 136 -987 -425 586 245
1823B45p00O37K39q42l05J256J94r76j76P35q6o93N70O95p51o94P42N04n74k90
1843b70P03J21q75O0Q98j16q09K55O60m20o12O07M97n83l73N97K22o84q3P74k7
1864E42p51K09N42l23n50N69N04o83m10N78K54n73L4N79j67q15K58P47k20n30
1884b06K02M60o00l15P57L57p93l33N52J38m03P2N70l03p86L37N65j17l97K54
1904A1R4n12p6N96K72o35k59N00l7l91K75M11l91n19L00M68k93k22L54K7m72O4
1926d35O05r4m98J01L07j33k79L05L42m72k76M04K48l56o6L71k3m70J54M74j75
1947C4m74L22K87k97k08L28K35m24r0M02J28l82j03N11j4l97J25J91j70k01L07
1968A10K77k81l01L26K25k77j9K70j9n05Q8M47J51l42o7J34j35j12K73K22k39
$$ plain form
1823 245 -455 182 421 -421 -726 530 724 -252 -428 307 221 -472 98 793 42 -652 90 594 20 -270
1843 -270 433 554 -321 -261 637 521 -288 -33 627 207 -405 202 699 116 -257 340 562 -122 -205 569 542
1864 542 -209 0 542 219 -331 238 742 59 -351 227 481 -92 -58 521 354 -461 -203 544 324 -206
1884 -206 -4 456 -144 -459 298 655 -138 -471 81 219 -184 -112 458 155 -631 -294 271 154 -243 11
1904 11 105 -407 -483 113 385 -250 -509 -9 -46 -437 -162 249 -142 -661 -361 107 -186 -408 -54 -27 -499 -435
1926 -435 170 76 -422 -321 -14 -147 -426 -121 221 -251 -527 -123 125 -231 -297 74 51 -419 -265 209 34
1947 34 -440 -118 169 -128 -336 -8 227 -197 -287 115 243 -139 -242 269 255 -142 -17 174 4 -197 110
1968 110 387 106 -195 131 356 79 60 330 311 -194 -106 341 492 150 83 217 82 -30 243 465 226
1989B26k33O3R6L9J27R3k60k54L6M06k5j18l2n1j03m9L01R4k32j07J7JjJ73J57
2014C64k95k31Q5K18j9p8O4p3k45O2K25K2j09j11O8j04L0R2K18k13k61J66J05
2037b0j40o0K02k2k42p5K61R8j86l5J08j14m7L8K08n1j77M3J28q8o7J01J48k31
2061b20j27K33Mk6o4J34m3j88J07J45Q8j49pk2N1o0J78P2j96k1L7J08p6LR5j27
2087g1n2Q9P9%k0O6rr8j2R4J45j55qJ07r1j23J52J57j44j15J40M3k9p5J89n1k34
2114b6nK60J23l02P1J39m8k89K75J88k02k53K24J61k46p6K76O6l96J6L40j2l04
2137b0l5L37j61k62J26K71j89k60K37J96k12j94K73pk61R2K63j08k68L0K09q6
2159b9j34J74Oj80j35L04qj71J8J15m0k54K67K09k44l00K25K15k30j30L80j4m13
$$ plain form
1989 226 -7 56 152 191 318 411 151 -103 -67 339 314 196 164 113 10 -39 262 356 124 17 34 35 34 207 364
2014 364 69 -162 -77 141 122 44 108 35 -210 -148 77 99 -10 -121 -53 -157 -127 -35 183 -30 -291 -125 -20
2037 -20 -160 -220 -18 -40 -282 -357 -96 2 -184 -219 -111 -225 -272 -234 -26 -77 -254 -211 -83 -171 -238 -137 11 -220
2061 -220 -347 -114 -110 -136 -200 -66 -109 -297 -190 -45 43 -106 -113 -135 -84 -144 34 106 -90 -111 -74 34 -42 -39 56 -71
2087 -71 -123 -34 45 45 25 91 82 -16 -28 66 211 56 48 155 64 -59 93 250 106 -9 131 174 145 70 259 208 -26
2114 -26 -31 229 352 50 121 260 212 -77 198 386 184 -69 155 316 70 -6 270 336 -60 -44 296 284 -20
2137 -20 -55 282 121 -141 -15 256 67 -193 44 240 28 -166 107 100 -161 -69 194 86 -182 -152 57 -29
2159 -29 -163 11 17 -163 -298 6 -2 -173 -155 -40 -80 -334 -67 142 -102 -402 -177 38 -192 -322 58 44 -369
2182c69p1M78k9k66L5K16k31k15L52K78k95l11K39K06j96j1K92j04m64J32N08
2203A74j6l03k3K14j89j31L86J47l37k74K57J77j66R2K43k65k68K70L17r5l27
2224a17K65m4j82K3M03m8m26J4K86J9j66J30J74l16k11M11J91k86k21K80J19l21
2246b3R9L67k30l74K18L38j32l30J65J65k40l6L59ln05j5M65Pl09N5K23k41k84
2269b61L83L53m11l41K71J66j54lK95k29m15J33M58j20l55J39J68k65n1M23L7
2290B21m78j09M08P2k70K0K43k52l39L68L33k85l39L82j5l01O9M08q5m74O6N16
2312A59j00m47J72L42l31k10L75J95m53r9L76J7l41K21K81j91m90L79M24m09k25
2333c55K48K54l58m2L92k5m40O4M91j75k26J07K59l87p8M86K13n04k19M46J00
$$ plain form
2182 -369 -440 38 9 -257 -222 -6 -237 -452 -100 178 -117 -428 -189 17 -179 -190 102 -2 -466 -334 174
2203 174 158 -145 -168 46 -143 -274 112 259 -78 -352 -95 82 -84 8 251 -14 -282 -12 305 210 -117
2224 -117 148 104 -78 -55 348 300 -126 -112 174 193 27 157 331 15 -196 215 406 120 -101 179 298 -23
2246 -23 76 443 213 -161 57 395 263 -67 98 263 23 -13 346 343 -162 -177 288 295 -14 41 264 23 -261
2269 -261 122 475 64 -277 -6 160 6 3 298 69 -346 -213 245 125 -230 -91 77 -188 -239 184 221
2290 221 -257 -366 42 114 -156 -136 107 -145 -484 -116 217 -68 -407 -25 -40 -341 -272 136 51 -423 -357 159
2312 159 59 -388 -216 126 -205 -415 -40 155 -298 -397 -21 -4 -345 -124 157 -34 -524 -145 279 -130 -355
2333 -355 -107 147 -211 -253 139 114 -326 -262 229 54 -172 -65 194 -193 -271 215 428 -76 -295 151 251
2354B51l92K05L28k72m71L25M73j48l61K40j1l69M7O84o5o74qM06M3l00L19K55
2376E05m76m13M83M93l95k44K77q2k60J51N33j86n92J31M28k16k69L82J77n64
2396a37j88N95J70n31p1M12j30l63K22M27l66l89L70K47l29k15M75l4m47L3M71
2417B22r1n21K17M16k99l22L57K11m69j46M99Q6n11m4M48o6l69K89L40l95m45
2438e93M55M40m25k74L49R3m24K7N60m6o26P3N10j57k71L61J89n49k07N86K25
2459B96n20j52M44j13l30L10M58l87n08L43M62l15k11L47N8m86J3N91On59Q3L90
2481B20j36l79M23L30n55k32M90K87n25K3M09j18m79K38N12k90m39K97L17l22
2501G1j94M27K8n00N5N60q9n06M2M46k26l34M53K42n15k50N50J47m27n0L52o1
$$ plain form
2354 251 -141 64 392 120 -351 -26 447 299 -62 178 167 -202 -155 529 464 -210 -218 188 231 -69 250 505
2376 505 29 -384 99 592 197 -47 230 148 -112 39 572 386 -206 -75 353 137 -132 250 427 -137
2396 -137 -325 270 440 -91 -162 250 120 -243 -21 406 40 -349 21 268 -61 -276 199 165 -282 -249 222
2417 222 131 -390 -173 243 -56 -378 -21 190 -279 -425 74 160 -351 -395 53 -13 -382 -93 247 -148 -593
2438 -593 -138 302 -123 -397 -48 45 -379 -352 208 162 -464 -391 119 -38 -309 52 241 -308 -515 71 296
2459 296 -224 -376 68 -45 -375 -65 393 6 -502 -159 303 -12 -223 124 182 -304 -291 300 306 -253 -170 220
2481 220 84 -295 128 458 -97 -329 161 448 -77 -54 355 237 -242 -4 508 218 -221 76 393 71
2501 71 -123 304 332 -168 -113 447 358 -148 -106 340 114 -220 233 475 -40 -290 260 407 -20 -70 282 221
2523B21n18K89N60k86n25K34L83l40k29M71L2n29j60O62N5n15Q3L21k10l26M07
2544H0L15m41m04M67J26l20K2M35k17n26J82N04j03m89K76K02l56j50N18Q9n94
2565c84l5N26m0m87K45M22l47n23M90L76m35k80M81J91n20q7N84o7n28O3O01l00
2587e4l98L33L95m33k50M34K33n69p7O23k2n70J46M54j59m19L19M63n56k78M49
2608F4K84m39j53M88m4n14J32O93k69n50K62L84k53k81N10J14n71j67O31R0n33
2629a22M8N11k69m71M08M70m67l74M12L34m96n8N81j00o18OO82k25m41K72L37
2650D20m54l10O20K90o28k37N73M6n05K9O49l07o08L21N04l91l13M11K77n93j31
2671c37N65O1n84J22N57k71n02K79M27m16l26M98K69o55j21N84Pn11J47N10l13
$$ plain form
2523 221 -297 -8 552 266 -259 -25 358 18 -211 260 292 -237 -397 265 320 -195 -112 209 -1 -327 80
2544 80 395 -46 -450 17 143 -177 -155 280 63 -463 -281 223 120 -369 -93 109 -247 -397 121 210 -384
2565 -384 -419 107 67 -420 -175 247 -100 -623 -133 243 -192 -472 9 200 -320 -407 177 110 -418 -355 246 -54
2587 -54 -452 -119 276 -157 -407 27 260 -309 -386 237 215 -355 -209 245 86 -333 -14 449 -107 -385 64
2608 64 348 -91 -244 244 200 -314 -182 511 242 -308 -46 338 85 -196 314 428 -143 -310 321 411 -122
2629 -122 -74 437 168 -303 105 575 108 -266 146 480 -16 -74 507 407 -211 -205 477 252 -189 83 420
2650 420 -34 -344 276 566 -62 -299 274 320 -185 -156 493 186 -422 -101 403 12 -301 110 387 -206 -337
2671 -337 228 289 -295 -173 384 113 -389 -110 317 -99 -425 73 342 -313 -434 150 157 -354 -207 303 -10
2692a0n33L90N02n23l69N56K58o01j52O43N1o65J22N45j65n07K84M67n16l72O42
2713D7K77o04k27O71N1o57J70N89k22o24L21N87l77m75N67K41n08k35O18J06o53
2734c37Q1N81j03n79L20M34l79m41O14K85n91k04N49O5n97K19N57k58n87L68N21
2755E18l99m34N70K21n92j34O69M9p54Q5O43k09n22K98N38n15m39O45L18o14k38
2776b96P20np09N4P77k08o84K39O39l35o21N34M03o35l24P52J57p01m1O10k0o86
2798c80K89O09m43n47M71M08n44l22N84K03o38o1N92r2n46K35N25l83m27M14L16
2819B63n48j57O16K3o32O0P42k47o46K95N99m84n07O25M24p04l19P49R6o82J6
2840d18P04j90o45K26P73m41o50N21N51o15l66P51J92p84j1P84j18p79L10O48
$$ plain form
2692 -10 -543 -153 349 -174 -543 13 271 -330 -482 161 212 -453 -331 214 49 -458 -174 293 -223 -595 47
2713 47 324 -280 -507 164 215 -442 -272 317 95 -529 -208 379 2 -473 94 335 -173 -408 210 316 -337
2734 -337 -256 325 222 -357 -37 397 18 -423 191 476 -115 -319 230 295 -302 -83 474 216 -371 -3 518
2755 518 119 -315 255 476 -116 -250 419 468 -286 -201 442 233 -289 9 547 32 -407 238 556 -58 -296
2776 -296 424 419 -290 -236 541 333 -351 -112 527 192 -429 105 508 -127 -451 301 458 -243 -284 326 306 -380
2798 -380 -91 518 75 -472 -1 407 -137 -459 125 328 -310 -371 221 129 -417 -182 343 -40 -467 -53 263
2819 263 -285 -442 174 197 -435 -375 367 120 -526 -231 368 -116 -623 2 426 -278 -597 152 248 -434 -418
2840 -418 286 96 -549 -323 450 9 -641 -120 431 -184 -550 201 393 -391 -402 382 264 -515 -205 443
2860D43l52o10N08N03n64m92P12L25o79n1O22j16o25K03O79l25n41M56L83m85
2880fl11O27J95p47o4P39n0p18K99N36m61m09N66M25o19l79O56J91p09R2P53l08
2902B98p59L96P05m75o00N76L98o88l17Q65J86q94j38Q94j30p45L22P53o01o83
2922f37O52N89p10m20P14K84q34j22Q89l8q55J53Q16l16p33M87N25o30l42P27
2942A99K32q49j10P67J2p56K39O21l59n96N19N56o53m76O60K89p62L5Q01k09q36
2963f76L19P86m26o20N31N33q11m01R74K15q58q5Q45j08q36L96Q24n46q44O68
2983a20Q08q59m54Q78K63r71o7R59J8r55J33R27l81p73N85O80p36o56R16M93r02
3004b14k88R67Qr70K25Q76k67q28M47O66o51n07P47M02q58k04R60K7r85J73R40
$$ plain form
2860 443 91 -519 -11 492 -72 -564 148 473 -206 -257 365 249 -376 -173 506 181 -360 96 479 -6
2880 -6 -317 310 505 -242 -306 433 383 -335 -36 500 39 -370 196 621 2 -377 279 470 -239 -147 606 298
2902 298 -461 -65 640 165 -435 141 539 -149 -466 399 585 -309 -447 447 317 -428 -106 647 46 -637
2922 -637 15 604 -106 -526 188 472 -362 -484 405 367 -488 -335 481 165 -568 -81 444 -186 -528 199
2942 199 431 -418 -528 239 251 -505 -266 355 -4 -600 -81 475 -178 -654 6 295 -467 -432 369 160 -676
2963 -676 -357 429 3 -617 -86 447 -364 -765 209 424 -434 -519 326 218 -618 -222 602 56 -788 -120
2983 -120 688 -171 -625 253 516 -455 -522 437 455 -500 -367 560 179 -594 -9 671 -65 -721 195 688 -214
3004 -214 -502 465 473 -497 -272 604 337 -491 -44 622 -29 -536 211 613 -245 -449 511 538 -447 -274 666
3025F66l82p30N62N90p23o08R29L85r35k07R55l1r64K87R95n45r19N43R62q38
3045hn76Q80L82j044k50J109J63j167L9J069l86q44O02P89q71p12Q60N90r25l67
3065f67J055M8j102J64J151k88j087M21Q90n97p34Q39N38r56m45J023K38j013
3083e22PJ031l54r45N38R15o74q59P95O21r05l32J045R1j136R9J137k55j097M86
3103c14R49p12p61R72N28r07n10J083K47j120N1J082l13j008N07R44o19r82R60
3122G7P04j059m17J158J86j199lJ189j37j181M42J011o42q62Q96P23r68n60R86
3141C44M28j170p7J171k15j076L13J101n33r70P13Q51r90n43J131K68j172r9J143
3160F18n5j013K94R32n97r14Q80P90r84o21R74L75j050j02J227k02j285M44J135
$$ plain form
3025 666 284 -446 116 706 -17 -625 304 689 -246 -453 502 471 -493 -206 789 244 -675 -132 830 -8
3045 -8 -584 296 678 -366 -616 493 656 -511 -472 597 211 -633 -31 758 -113 -825 35 625 -300 -667
3065 -667 388 436 -666 -502 649 361 -726 -305 585 -12 -746 93 631 -325 -770 253 491 -522
3083 -522 -515 516 162 -783 -245 670 -4 -863 -68 553 -352 -684 361 452 -684 -585 552 297 -800 -314
3103 -314 635 -77 -838 134 662 -245 -755 328 575 -545 -494 588 275 -733 -226 718 99 -883 77
3122 77 781 -278 -695 463 649 -550 -553 636 499 -682 -240 771 129 -733 163 886 -82 -642 344
3141 344 772 -398 -475 696 481 -595 -282 819 286 -684 29 880 -110 -653 478 746 -426 -525 618
3160 618 563 -450 -156 776 179 -735 145 935 -49 -670 304 679 -371 -473 754 552 -733 -289 846
3179H46m90j085O91P98r82n79J147M62j273k79J287k9j168K49J187o10j091P76
3197a43R04q46p95J023M72j132k30J315Oj315J47J230m57j042O70R24r21p75J016
3216E1O97j217l15J124J27j236K11J298m79j200O94J011q38q47R56O76j111m33
3234h31J293J63j283P6J203k76j150N39J056q01r57J080O34j027m39J166K04j239
3252e89M2J298k69j348N12J216p41r28R19P61j107n38J285L07j329q8J310k40
3270D73j222N31J152p50r72Q90Q53j039o59J223L42j279j23J373j69j269L80J172
3288I07o28j020Q30Q30j037o49J144M85j242k24J302r4j287M08J199o31j121Q35
3306GR36j034p13J203L86j371j47J337M5j362L33J169n28j159Q50R48r43q52J087
$$ plain form
3179 846 356 -729 -38 760 -222 -801 346 808 -465 -744 543 514 -654 -405 782 172 -919 -143
3197 -143 761 -85 -880 143 615 -517 -747 568 574 -741 -594 636 179 -863 -193 731 -190 -965 51
3216 51 748 -469 -784 340 467 -769 -558 740 261 -939 -245 766 -72 -919 37 713 -398 -831
3234 -831 462 625 -658 -582 621 345 -805 -266 790 -11 -968 112 746 -281 -720 446 650 -589
3252 -589 -547 751 482 -866 -354 862 121 -807 112 873 -234 -772 513 820 -509 -597 713 473
3270 473 -749 -218 934 184 -788 102 955 -84 -743 480 822 -457 -580 793 624 -645 -265 907
3288 907 279 -741 89 919 -118 -767 377 862 -380 -604 698 604 -683 -275 924 293 -828 7
3306 7 943 -91 -804 399 785 -586 -733 604 649 -713 -380 789 261 -898 -48 900 -43 -895 192
3325A92N85j292k09J278L0j353K17J338n71j127P23J036r40q30J141N62j342l12
3343h74J340J77j397J52J327m52j227O91J167r61j047J220O79j233m90J394J36
3360F02j362J93J325l60j362O72J097q91p94R51P22j224m48J296K35j262N9J284
3378G33l20j310O93J209r13r79R25Q01j153m71J309K93j466O4J353j27j450N98
3396b11J148q27j016J022R63j232o68J280M24j399r3J398k18j310M33J232n65
3413C61j178R34Q58j103o42J223M90j405j44J362p6j400L22J372o25j178Q38R80
3431I89j080p08J198M79j265k91J313M1j422L75J235n59j177Q13Q85r43p73J223
3449C33N58j359k43J333j03j223K51J297n66j228P88J029r79q54J167N38j249
$$ plain form
3325 192 777 -515 -724 554 584 -769 -552 786 215 -912 -189 847 -93 -923 218 780 -562 -874
3343 -874 466 643 -754 -602 725 273 -954 -263 904 -57 -1104 116 795 -438 -928 466 602
3360 602 -760 -567 758 398 -964 -292 805 -86 -880 71 793 -431 -879 417 652 -610 -551 733
3378 733 413 -897 -204 1005 92 -887 38 839 -314 -785 524 817 -649 -585 768 641 -809 -211
3396 -211 937 110 -906 116 1079 -153 -821 459 883 -516 -609 789 571 -739 -306 926 361
3413 361 -817 117 975 -128 -770 453 943 -462 -606 756 680 -720 -398 974 349 -829 9 989
3431 989 -91 -799 399 878 -387 -678 635 676 -746 -371 864 305 -872 -59 826 -117 -890 333
3449 333 891 -468 -711 622 519 -704 -453 844 278 -950 -162 867 -112 -966 201 739 -510
3466e10k65J285O6j399K18J336l80j288P09J077q90q90R97P17j230m83J337K11
3484F18j392J82J327l88j284N80J145p92r53R88P61j124n65J278K78j302j1J287
3502F33k26j249N14J172q39r32R55Q63j119n49J195K02j246N8J252j70j251M39
3520b98J158p12r57R31P87j119n84J200L74j286n3J280k14j219M75J145o70j006
3538g68P65R07j037o29J216L44j297l8J260j34j221L19J135n36j083Q70R12j034
3556d9p62J124N16j234k07J270n2j275K20J308m20j208P49Q57q65p95J092N30
3574G99j212k90J255M3j244K40J165n03j137P28R79q23r09J053M94j089k60J199
3592D88L2j249J73J192l31j111N76Q94p16q57R18P02j152m00J223J35j176P9J172
$$ plain form
3466 -510 -775 510 576 -823 -605 731 351 -937 -228 849 -41 -931 66 783 -447 -930 407 618
3484 618 -774 -592 735 347 -937 -357 788 -4 -957 31 792 -332 -897 381 659 -643 -654 633
3502 633 407 -842 -328 844 5 -927 28 891 -228 -777 418 620 -626 -568 684 514 -737 -298
3520 -298 860 148 -809 122 909 -210 -794 406 780 -506 -559 721 507 -712 -237 908 238 -768
3538 -768 -3 904 -133 -762 454 798 -499 -537 723 589 -632 -313 822 286 -797 73 985 -49
3556 -49 -811 313 829 -405 -612 658 606 -669 -449 859 439 -769 -20 837 -28 -823 269 799
3574 799 -413 -703 552 595 -649 -409 756 253 -884 -156 823 0 -909 144 638 -451 -711 488
3592 488 520 -729 -556 636 305 -806 -230 664 -52 -909 9 711 -441 -841 382 517 -659 -580 592
3611E92k95j084M92J094q15q65Q62P70j030m99J113L04j270m9J278j90j225M64
3629c53J092o91q63Q05P97r46o18J092L05j027j27J115j32j215M31J065n15r81
3647g66P04Q29r06n66J130L02j099k20J101L4j007K43R60n53r02O90Q66q35o66
3666f61R48M44j056j79J059kj047J45J128m63r23N73Q27q94o24R99N22j054k49
3685e07R82M8j024J90J013l78j001N10R35p63o86Q64N55j031k64J022R5j062N2
3704d50J092l61r89N20Q67o77p47Q74N25q86m62R08K46r86P1J001k55r61M27Q61
3724F18n34p83P02N45p74m25R70J02r76j6R97j37q96L19P84n47o33O79O55q88
3744b38m11Q38K84j003N0R63k12r41L39Q81n10o71N61O88q23m50Q59L39r01j44
$$ plain form
3611 592 297 -787 -295 799 -16 -881 -19 751 -279 -778 335 639 -631 -680 598 408 -817 -353
3629 -353 739 48 -815 -10 787 -159 -777 315 620 -407 -534 581 449 -766 -335 730 215 -766
3647 -766 -62 767 -139 -705 425 727 -372 -592 509 543 -464 -221 739 186 -716 -26 840 5 -661
3666 -661 287 731 -325 -504 555 553 -494 -349 779 316 -607 -34 793 -101 -725 274 796 -258 -507
3685 -507 475 523 -501 -311 702 324 -677 -167 768 5 -681 183 738 -293 -557 465 560 -502 -450
3704 -450 642 281 -708 -188 679 2 -745 129 654 -232 -694 214 460 -526 -455 546 291 -670 -243 618
3724 618 84 -699 3 548 -226 -651 319 421 -555 -571 426 289 -607 -288 496 -51 -684 -5 650 -238
3744 -238 -649 189 473 -530 -480 483 271 -670 -331 550 40 -631 -70 618 -205 -655 204 543 -358 -502
3764e02Q91n6q67L15Q06m42p77N45P18p21m74P53M77r31k24R41k8r35J83Q87k95
3785B64p75M74P36o89o08Q00M06p83k97Q56J57r21J07Q55k56q67N41P15o27n57
3805d69O80L67p13k51P71J45q85P4Q50k56o87L14N40m70m91O63M89p51m21P14
3825B13K22p77M3Q04k00q35L58P08m68n13N35L22n58l26P30K61q83L3O65p7o85
3846d28K27O58m22o41N94M51n45m12O25L47q13k2O40k5p39K19O81l19n68M14M87
3867D09n73l60O37K33o71o1N76K4n78K2P03k96n22L89M82m87l51M74L10n79j75
3888c94O55jo67O5P26k33n82L33N54n17m20O03L38n66k52M93K23o26P3N54k07
3909A52n05K28O13l94m27L96L14m87k14N57J45o30j6N78l0n20J71M34k78m64N12
$$ plain form
3764 -502 389 333 -534 -219 587 145 -632 -87 631 -90 -564 189 666 -265 -489 452 424 -511 -328 559 264
3785 264 -511 -37 699 10 -598 202 608 -175 -472 384 541 -380 -273 582 326 -541 0 715 88 -469
3805 -469 211 578 -135 -386 385 530 -355 -281 569 313 -374 -60 480 10 -481 182 671 -80 -501 213
3825 213 435 -342 -299 505 305 -530 -172 536 68 -445 90 412 -146 -472 258 519 -364 -331 334 257 -428
3846 -428 -201 457 35 -606 -12 439 -106 -518 107 454 -359 -381 259 234 -505 -286 395 76 -492 -78 409
3867 409 -164 -524 113 346 -325 -386 190 214 -364 -342 361 65 -457 -68 414 -73 -424 50 360 -219 -394
3888 -394 261 260 -407 -342 384 151 -431 -98 456 -61 -481 122 460 -106 -358 135 358 -268 -195 359 152
3909 152 -353 -125 488 94 -333 63 377 -110 -324 233 378 -252 -268 310 280 -240 -69 365 87 -377 135
3930A35K92m61k51M89J68n18n5N46o3n68K03N03k86m12L29L40m01k41L52K03m41
3951a37p9M08K9m61J45M23k64l89L29L72m01k66M38J49m76m3M10k0m93J22N05
3972C01j85m02J51L57l41k11M44J54m34j29M17Q2m63O3M60k03m73K75L97k79l46
3993c65L45K14l70j33M60l0m01l3M49p3l77J67K58j54k30L05K01k82k71L24J23
4014A27k98JK77j0l60J08L26j21k92J89J97k41j64L33J89l68o4L49j1l57O4L36
4036B10p8l49K77J35k56j42L41Q5k87p8L13J9l74R1L38l2l81J75K17j48k81L00
4058I5Q8j77j65L42Rj95l1K25n3k73Q6L08j28l33K07J91k34m4J91J14l01K3J29
4081G4Q1k44O1K09j64j68J33K41k63p7J70J04k37n2K91j19j33k6K32j00j89J64
$$ plain form
3930 135 427 -34 -285 204 372 -146 -201 345 282 -286 -83 420 134 -278 51 391 -10 -251 101 304 -137
3951 -137 -216 192 221 -240 -95 328 64 -325 4 376 -25 -291 147 296 -180 -223 187 167 -326 -204 301
3972 301 116 -286 -135 222 -119 -330 114 268 -166 -295 122 204 -259 -196 264 61 -412 -137 260 -19 -365
3993 -365 -20 194 -176 -309 151 121 -280 -313 136 63 -314 -147 111 -43 -273 32 233 -49 -320 4 127
4014 127 -171 -170 107 97 -263 -155 171 50 -242 -53 144 -97 -261 72 261 -107 -171 178 167 -190 -126 210
4036 210 132 -217 60 195 -61 -203 138 223 -64 -142 171 190 -184 -93 245 213 -168 7 224 76 -205 95
4058 95 183 6 -159 183 192 -3 -34 191 138 -135 -49 259 131 -202 5 196 -38 -82 109 223 -78 -55 74
4081 74 155 -89 -28 181 17 -151 -18 223 -40 -117 53 157 -80 -132 159 40 -93 -119 113 13 -176 -12
4103a2J02j05j83K64M1k40p8K92Rk10j6J99j03j25J18J32j21j29J59L8j18n5J65
4126B4M2k11k5J96j1j58P8R0oj81J23J15j55m5P4Q2j14m9J63l3j34Q4J29r5r8
4151a15K2J52j08l3L4Q8p9r2J47R1j37m8J36%j22L4J12r5q9J86j7o7j7N0P4j48
4177d1OJ24O6k19Q6J29n2o9o8J54p7m3N1R0j2j56P7Q0j53rJ87q4o8RJ39n8j62
4204g3J24L6o6q0J31J4m8n4R5N6j36l2P9L5j08oK7J4m6QJ10j19rL9M7q4m1J62
4232G5L6j59j9K7R8j52m8J52p5kK0M3Rp6kP6r5p2N7Q7k5o4J15j19J4L1O0j8j47
4261a73J71N7j17j03J35QJ1j10J46n2j28R2P7J7j55L6J43r3r3J03J07j08o3J13
4285B1N3p7j13K23Qj92M5J49r0j40Q5J83j49o3J04M5j06k9J66n7j10j1J24J7j11
$$ plain form
4103 -12 90 -15 -198 66 107 -133 -211 81 90 -120 -136 63 -40 -165 -47 85 -36 -165 -6 32 -86 -141 24
4126 24 66 -145 -170 26 15 -143 -65 25 19 -162 -39 76 -79 -124 -50 32 -82 -131 32 -1 -135 -51 78 -17 -115
4151 -115 -93 59 -49 -82 -48 40 -39 -131 16 107 -30 -78 58 58 -64 -30 82 -13 -102 84 67 0 -17 33 107 -41
4177 -41 -35 89 155 -64 22 151 99 30 -38 116 39 -4 47 137 125 -31 46 126 -27 -36 151 67 -1 8 147 89 -73
4204 -73 51 87 21 -59 72 86 38 -16 79 135 -1 -33 46 81 -27 -33 -6 8 -38 -30 80 -39 -48 -9 38 -46 -87 75
4232 75 111 -48 -67 -40 58 -94 -142 10 -65 -67 -47 -4 5 -71 -73 3 -92 -164 -107 -20 -45 -109 6 -113 -99 -68 -8 -26 -173
4261 -173 -2 55 -62 -165 -30 -22 -11 -121 25 -27 -155 -63 14 31 -124 -88 55 -38 -131 -28 79 -29 -92 21
4285 21 74 -3 -116 107 115 -77 -32 117 27 -113 -28 155 6 -57 47 92 -14 -43 123 66 -44 -55 69 86 -25
4310b5JJ11j15n4J49L9l8j47J97Kj89O9J55l4j94J72J0l5p2N5J04k42J8J95%j28
4336Dm2J75p8k16J62J02p2j38J21J46j43j23K06J2k33O9J60m6j90%K55j00k28
4359a97K04R2j16j43J51J42j97J7M6L5j69O1J71n0k11N1J44j03p3J23M7j39pJ10
4383a1O7j85O9J71j15j44O7J20j14j67K34Q5j68j38K28R6k41oK41k3k30J47J51
4406A34j74j38J47J69j90j51K78M4k04l3J89K9k14L7K63j23k14Q8K92j80j60J53
4428D2J46k59m9L15k3k33j9L07j43j73J24J82j77j68J88J00j67l3J63l2j44L8
4450a5J73Jk91J37K19j87j63K22Q6j53r7K40l6k25%K35n6k46K06J65k09j62K42
4473H6J43k80j03K18Q2j98l7K03Nk98P0K30p6j76J44J62k11j77K54J32l03k9K04
$$ plain form
4310 -25 -24 87 -28 -82 67 106 68 -79 118 120 -69 0 155 121 -73 99 109 74 2 57 161 -81 -63 132 132 4
4336 4 -38 137 59 -157 5 107 35 -103 18 164 21 -102 104 116 -117 -48 112 66 -124 -124 131 31 -197
4359 -197 7 99 -17 -160 -9 133 -64 -47 -1 34 -135 -74 97 47 -164 -113 31 -72 -145 -22 25 -114 -121 -11
4383 -11 56 -129 -60 111 -4 -148 -81 39 -75 -242 -8 77 -91 -229 -1 95 -146 -152 89 66 -164 -17 134
4406 134 -40 -178 -31 138 -52 -203 75 119 -85 -118 71 100 -114 -77 186 63 -151 -63 229 49 -111 42
4428 42 188 -71 -120 195 172 -61 -80 227 84 -89 35 217 40 -128 60 160 -7 -40 123 91 -53 -15
4450 -15 158 159 -132 5 224 37 -126 96 182 29 -68 172 136 -89 -89 146 90 -156 50 215 6 -156 86
4473 86 229 -51 -154 64 146 -52 -89 114 119 -179 -109 121 45 -131 13 175 -36 -213 41 173 -130 -159 45
4496D5J06l42J28J89j18k26J59J66j31j35J42J00j99j29L21N2l32Q1J85n5k37
4517b30J27K84k46j16J16K12j87j21J54O5j80o2K41Kk53R8J48k6k10J47J63k13
4539h7j17L01J8j65j0J69Ol22J70K33j28k18J39J42j40j42K23R4k60rK29m3j78
4562i5K9K39k9k90J26K31k10j09J80J07j75j71K85O5k51M2K21p8k31J40K15j94
4584D7j04J10Q5j87q9K60L7k40p4M04j28k03Q9K12j54k16K02J23j71r8K14n4j98
4607a33N0K84j17k40J06J64j49p9J77J26k66r1K40Nj40q2K32j2j77M5J60n3k18
4630a68R0J20r5n6J56P8l44O9K26M4k74qK25q1j74J68J69j79k01K15J11j65m5
4653a19J73L0k60P1K29j02k31K01J32j02j90J87O7j64o0J63N7j97JK15o6k03J56
$$ plain form
4496 45 151 -191 -63 126 8 -218 -59 107 -24 -159 -17 83 -116 -245 76 128 -204 -123 62 7 -230
4517 -230 -103 181 -65 -181 -65 147 -40 -161 -7 58 -122 -184 57 59 -194 -96 52 26 -184 -37 126 -87
4539 -87 -204 97 115 -50 -60 109 115 -207 -37 196 68 -150 -11 131 -9 -151 72 166 -94 -103 126 83 -95
4562 -95 -66 173 144 -146 -20 211 1 -108 72 179 4 -167 118 183 -68 -26 195 117 -114 26 241 47
4584 47 -57 53 138 -49 -138 122 159 -81 -155 249 121 -82 7 219 65 -151 51 174 3 -95 119 65 -133
4607 -133 -83 201 84 -156 -50 114 -35 -114 63 189 -77 -168 72 77 -63 -145 87 75 -102 -57 103 50 -168
4630 -168 -78 42 -53 -109 47 125 -219 -150 76 120 -154 -162 63 -18 -192 -24 145 -34 -235 -20 91 -74 -119
4653 -119 54 84 -176 -105 124 22 -209 -8 124 22 -168 19 86 -78 -138 25 82 -115 -114 101 35 -168 -12
4676a2J69j28k09J31J72j52r2K10lj33J5J26Ok25J9K90j15j85J71R7j95j04K81
4699A34M7k31j1K12k5j88M0J98m9k28J30J85k34j11K25M0j21j22K61J8k42L0J83
4722A41Mk40Q8J97j66j00J16J12k30J0J95K6k29k3K02Rk25M7J69p8j19J15J10
4745A31j87p0J32J73k55j7J91j2k23N5J64m0k45J71J61j43j33J92k5j06r2K76
4767I8l9j81j9K22Ok38J58N2r1j89L00Pj36p1J10P3k01j3K30p6j73J26J38j12
4791a9j15J16J40j60n0J61L7j66J5J80k1k13K3J88j37j00J37J6n1n8J36Q1k44
4814a04L9K01m4j35jR2K1j76J47J01j48j38J80R1j26o9Q9M6j79J95M0q9j45J52
4838D0J31j31j24J40R9j19j40J83P4k11N2J05j0j42P9R8p5q8K3J01p5o6Q6K9o8
$$ plain form
4676 -12 157 29 -180 -49 123 -29 -121 89 86 -47 -32 94 100 -125 -106 184 69 -116 55 152 -43 -147 134
4699 134 181 -50 -61 151 126 -62 -22 176 127 -101 29 214 -20 -131 94 134 13 -109 152 170 -72 -42 141
4722 141 145 -95 -7 190 24 -76 40 152 -78 -68 127 153 -76 -99 103 112 -113 -66 103 25 -94 21 131
4745 131 -56 -126 6 179 -76 -93 98 86 -137 -82 82 42 -203 -32 129 -14 -147 45 20 -86 -178 98
4767 98 59 -122 -141 81 87 -151 7 59 -32 -221 79 86 -50 -121 -11 62 -139 -152 78 2 -171 -45 93 -19
4791 -19 -134 -18 122 -38 -88 73 110 -56 -41 139 118 -95 -72 116 -21 -121 16 32 -19 -77 59 140 -104
4814 -104 -65 136 92 -43 -44 48 69 -107 40 141 -7 -145 35 126 0 -69 20 66 -113 82 122 33 -112 40
4838 40 171 40 -84 56 155 36 -104 79 153 -58 -6 99 89 -53 26 124 49 -39 -16 85 10 -56 30 59 -9
4863il3J06M0j84L0J60o2j02N8J01j59r1K11J6k16OJ55M4j45j0K31j25j74J73
4887B1M4j77%J13Q0j74o3K22k4j61M8J21o9o9M4J22j19j72J16J96j34j53K05K3
4911D0j23J9J06j4j01l7K15r2j21N7J07p7j27R7J28j58J0J16Kj26M3Q7%j60P8
4936c1J49j34p2R9N2j42N8R3K4k36J06J59o2p6o3J71J1j48J20Kr1q2R9J01j67
4961f0K0J74k2k16J53O3l6j49O4J34j07q7J59O4k41j5K28k8j59J7J38j8j06M3
4985A3J41j30j26Q8J38j97L8M9P6j69M2O4M7j16J8J00j04o3O6K9m2kN0J4p3kR9
5012D8K7j48O7O4p7j37J38L3J1j18R6mm0q3J34lj41L8J73m1k21J53Q6j34r9J35
5038d3O9q9m3J28L7j79P6J57l9j80O2Q4k1j08O3J23j05q7Q0J33k12j8J79l9j03
$$ plain form
4863 -9 -42 64 104 -80 -50 110 48 -54 4 105 -54 -145 66 82 -134 -128 27 71 -74 -84 147 22 -152 21
4887 21 65 -112 -112 1 81 -93 -156 66 42 -119 -71 50 -19 -88 -44 78 -41 -213 -97 99 -35 -188 17 40
4911 40 -83 -64 42 28 -73 -110 105 13 -108 -51 56 -21 -148 -51 77 -81 -71 45 47 -79 -36 51 51 -109 -31
4936 -31 118 -16 -88 11 63 -79 -21 72 96 -140 -34 125 63 -13 -76 95 106 -42 78 80 -11 -93 6 107 -60
4961 -60 -40 134 112 -104 49 112 76 -73 -9 125 18 -69 90 154 -87 -102 126 98 -61 -44 94 76 -30 13
4985 13 154 24 -102 -14 124 -73 -35 14 90 -79 -37 27 74 -42 -24 76 -28 -91 -25 4 -38 -40 10 24 -49 -51 48
5012 48 75 -73 -6 58 -19 -156 -18 15 26 -92 4 0 -40 -123 11 8 -133 -95 78 37 -184 -31 55 -79 -178 -43
5038 -43 26 -63 -106 22 59 -120 -44 113 74 -106 -44 40 19 -89 -26 97 -8 -95 -15 118 -94 -112 67 28 -75
5063g5L6J07l0j39J11Q5p8j46J72Nm3o3J33K1j46N7P8j35PO5J39j03q4P2L7r6
5089a3o5J63k3j29O2N8L6j66J15J72k36m1J20J11j57j08J80L9j90m3K76k7j95
5112f1PJ46l0j22O7J87k44n9K48L4j95m6J91kj93J1K12j09j09O7J31p0j87J52
5136B6M3j18m4J36j9j01j6J27Rj28jJ38l0j81J80K9j29n1J29N3q4m6J51o3j07
5161i7j2J58l6j50J28P7j63o6J77k6m1p7K13l9j35L3J68j20j23J21O7j22q2J70
5185B3P8k02j04K89m5r8kJ32L7k27P5J78j46j29J69J03j24q8J14K7q5rJ40j6k27
5210a37O5J59n3j18J54O0j90m9J25J19j59l4J12M0j44P0J61r7j85O1J63j24j14
5233a15J31J23j72mJ28L9j95O9J09o3j28J46J20j68j20J12J31j75nJ88n6k16R0
$$ plain form
5063 -75 -39 68 38 -101 10 95 17 -129 43 48 5 -58 75 96 -50 7 85 -50 -43 22 161 58 -26 46 83 -13
5089 -13 -78 85 62 -67 -5 53 89 -77 38 210 -26 -67 53 164 7 -101 79 118 -72 -115 161 134 -61
5112 -61 -54 92 62 -60 7 194 -50 -109 139 173 -22 -68 123 121 -72 -61 151 42 -67 0 131 61 -126 26
5136 26 69 -49 -93 43 24 -77 -93 34 43 -85 -86 52 22 -159 21 50 -79 -130 -1 52 -32 -78 73 10 -97
5161 -97 -109 49 13 -137 -9 68 -95 -161 16 -10 -51 -128 85 46 -89 -56 112 -8 -131 -10 57 -65 -147 23
5185 23 101 -101 -205 84 39 -59 -61 71 108 -119 -44 134 -12 -141 28 131 7 -81 33 60 -25 -34 106 90 -137
5210 -137 -72 87 34 -84 70 130 -60 -109 16 135 -24 -58 54 94 -50 20 181 84 -101 -40 123 -1 -115
5233 -115 16 139 -33 -37 91 130 -65 4 113 50 -78 68 188 20 -100 12 143 -32 -37 151 95 -121 -31
5256c1J99r9j59N8J83j49m3N0J13j81q3K14%r8q8J94m6j46R5J14q3j67J56L7l7
5281Cq6J49L1j84pJ85q0j46M5J41l1j53N8J38j41j31K19M9j14n3J95o8j72R4J74
5306A15j44j00R7J12r3j29J45P1j49n9K24n6j66J4K29p5j22J5K48j17j91J85J01
5329A55j75j05K50k5j96j5K15pk33J28J57o5j63J17P4j26p7J27P4j66JK30q4j76
5353h5Q3J03o7j49P7J52j12p2J41O5k03L6J50J1j81jK07p6k07J34J45j65j02J87
5377G1J00k17oJ29kj25K1K02j31j21O7J47j23q3J01R7j92l1J84k6j74M0J84r9
5401A3j33J14J19j77j45K19P8j44q8J76M4j69k2K02j8k06O9J78j84p2J76M3r2
5424a9k08L41K0k40lJ64m6j32J10J65k03j30J53J69j80l9J14N6j66n7K14J3k51
$$ plain form
5256 -31 168 69 -90 -32 151 2 -41 9 122 -59 -142 72 72 -26 -114 80 34 -112 -17 97 14 -153 3 40 3
5281 3 -83 66 97 -87 -94 91 11 -135 -90 51 20 -133 -75 63 -78 -209 10 59 -55 -108 87 19 -153 -59 115
5306 115 -29 -129 -32 80 -13 -142 3 74 -75 -134 90 34 -132 -118 111 36 -86 -71 177 60 -131 54 155
5329 155 -20 -125 125 100 -96 -111 104 97 -136 -8 149 84 -79 38 112 -14 -91 36 110 -56 -55 175 91 -85
5353 -85 -2 101 34 -115 -38 114 2 -70 71 136 -67 -31 119 130 -51 -52 155 79 -128 6 151 -14 -116 71
5377 71 171 -46 -52 77 75 -50 -29 173 42 -79 -12 135 12 -71 30 127 -65 -96 88 62 -112 -72 112 13
5401 13 -120 -6 113 -64 -209 10 88 -56 -144 32 76 -93 -115 87 69 -137 -68 110 -74 -146 30 73 -19
5424 -19 -227 114 134 -106 -109 55 9 -123 -13 152 -51 -181 -28 141 -39 -78 36 92 -74 -131 83 96 -155
5447a55J09J57j20q5J32J24j79o4J09R8j38q4K06m8j34M2J63o1j73P9J97j78j01
5470a04J70K3j13r0K88k3k39K6K09m8k11J13J72j59r7J88M5j30j18K12m1p6m7
5493e0K55j08k16J08J79j04j70J42J42k10q8K14K8j86L4J78p5j74%K52j30j33
5515a12J56Q6k12j2K21j5j63m7K15j5k38L6J50j8j59J28J06j62j22K15J06k69
5537a25K7K25l7k71J03J94n7k13Q9J87j93j34J60J64j79n7J71N9k59R0J63l8k18
5560a49P6K21j58r3O1Q7q9n3J67M6k03m3K54n7k39J07J71j06j24J54J12j72r3
5583a23K17l3j27l0J26K6k10J06J92j16j59J66J07j97q7J57J29k72mK54l5j62
5605g5P2J83j65j66J56J82j80j05J24Q3k19L4K28j02j65O9J83m2k03R3J57j51
$$ plain form
5447 -155 -46 111 -9 -94 38 162 -17 -81 28 126 -12 -96 110 62 -72 -30 133 72 -101 -22 175 -3 -104
5470 -104 66 89 -24 -114 174 151 -88 -62 147 99 -112 1 173 14 -83 105 150 20 -98 114 73 -3 -50
5493 -50 205 97 -119 -11 168 64 -106 36 178 -32 -120 94 122 -64 -30 148 73 -101 -101 151 21 -112
5515 -112 44 130 -82 -94 127 112 -51 -98 117 102 -136 -100 50 32 -127 1 107 -55 -177 38 144 -125
5537 -125 -98 127 90 -181 -78 116 59 -154 -65 122 -71 -205 -45 119 -60 -117 54 113 -146 -56 107 69 -149
5560 -149 -73 148 -10 -103 -42 45 -44 -97 70 116 -87 -130 124 67 -172 -65 106 0 -124 30 142 -30 -123
5583 -123 94 61 -66 -96 30 56 -154 -48 144 28 -131 35 142 -55 -142 15 144 -128 -132 122 87 -75
5605 -75 -3 180 15 -151 5 187 7 -98 26 109 -110 -76 152 50 -115 -46 137 95 -108 -15 142 -9
5627ip9J01J29j90l3J73K0k18L6K31j24j67J18J78r4j30M2J38j70o2K30K9k54
5650a05J1K07j04j25J19J00j30j53K14J16j54j26K30Jj92j3K00j7j49o2J91j7
5672D2j95J19J68j61j22J70J00j83j05K78p6j47J24J65j58j25O7J40j06j21J46
5693B0N1j51JJ32L7k76P3K45q9j80P1J93j54r7R9J21j53m3J79k7j09%K01j07j72
5718a35R9J55q1j59J70N3j51j19K57K3k48K7K16n9j23J45R0j16j86J76J44k61
5740h3J3J88k4j27RJ85j19j65Q5K00k08p5J77J23j44j79L02M9k35j2K38p4k54
5763a30J11J19j08j04J21J87j77r9J47O8k18k6K29q6j98P0K08o9j73J42O9p5j64
5786a56K10Q3j79q3J73j5j01lJ92j31j38J01J38j64p2J65P0j29m0K00k2j81n0
$$ plain form
5627 -9 -88 13 142 -48 -81 92 112 -106 -70 161 37 -130 -12 166 72 -58 -16 122 -48 -110 120 149 -105
5650 -105 -94 113 9 -116 3 103 -27 -180 34 150 -4 -130 100 101 -91 -104 96 79 -70 -132 59 42
5672 42 -153 -34 134 -27 -149 21 121 -62 -167 111 35 -112 12 177 19 -106 -39 101 -5 -126 20
5693 20 71 -80 -79 53 90 -186 -113 132 43 -137 -66 127 -27 -124 -25 96 -57 -100 79 52 -57 -57 144 37 -135
5718 -135 -36 119 38 -121 49 102 -49 -168 89 112 -136 -109 107 48 -75 70 160 44 -142 34 178 -83
5740 -83 -70 118 94 -33 -24 161 42 -123 -38 162 -46 -121 56 179 35 -144 158 207 -28 -40 198 124 -130
5763 -130 -19 100 -8 -112 9 196 19 -80 67 135 -83 -109 120 34 -164 -94 114 45 -128 14 83 8 -156
5786 -156 54 137 -42 -125 48 33 -68 -71 121 -10 -148 -47 91 -73 -145 20 90 -39 -79 121 99 -82 -132
5809a32K25j8k12O2K14j09k23J68J74j86q9J61J0k10M1J84lk55J60J68j90j12
5831a72J84Q8j09j41K01oj08l4J47k8j24L9J57l9j64P0J74j81r2J82N0j85J7J69
5855I5K9j95k2K39j22j66J56J93k58m3J20O7j44r9K54Kk24K6J96mk14J45J02j18
5879A5p4J10K6j36q7K36Oj45m4K06k7j94J07J50j15j22J04J29j71p0J59J7j63
5902h3J2J66o0k10J30J22o4j67J51J64j64j13J74M2k05OJ31M3j92M5J45k0j92
5925a39J72O6j71K0O9O7j99N9J15N6k17j5J76pj94L8K36j45j42J42J23j31m2J21
5949E8n3q2l6J69oj54J25P5r8q7O2J58j92p9K39r8n7n0J20J5k15J75J40r7j17
5974h5J04J09j64o2K03L3j63o5J73o7j10K9J66j05o9J34M1q7r3J10O3o0j04J89
$$ plain form
5809 -132 93 75 -137 -75 139 30 -193 -25 149 -37 -126 35 45 -165 -124 60 57 -198 -38 130 -60 -172
5831 -172 12 100 -9 -150 51 45 -63 -97 50 22 -102 -63 94 55 -109 -39 135 -46 -138 44 94 -91 -74 95
5855 95 124 -71 -93 146 24 -142 14 207 -51 -94 26 93 -51 -150 104 106 -118 -92 104 100 -114 31 133 15
5879 15 -59 51 77 -59 -146 90 96 -49 -93 113 86 -108 -1 149 34 -88 16 145 -26 -96 63 80 -83
5902 -83 -71 95 35 -175 -45 77 13 -154 -3 161 -3 -116 58 100 -105 -99 32 75 -117 -72 73 53 -139
5925 -139 33 99 -72 -52 17 84 -115 -56 59 115 -102 -117 59 52 -142 -104 132 -13 -155 -13 110 -21 -63 58
5949 58 5 -77 -113 56 50 -104 21 96 -2 -89 -27 131 -61 -140 99 1 -56 -106 14 29 -186 -11 129 32 -85
5974 -85 19 128 -36 -98 105 138 -25 -90 83 16 -94 -65 101 -4 -73 61 102 15 -78 32 95 35 -69 120
5998A20l6k24P3J65j15lLR0r4m2N7J57k53J7J68Jj18j9J98j18j35J17R6j04q0
6023g9J57K5j94M5J22j8p0n3J15n8j01O3J63j27j22J74Q0j83K4J58l7j52NJ29
6047F6l9p0k1J72j57o9J15P2j12q0J63l0j38jK37o7j55R1P7n4r8Q3O3j47o9J83
6073A5P2j23n0J96o8k27J24J61j34o9Q1Q0j59nJ86K3j20m8J33l3j43J22M4j8j44
6098a04P3J35j62NJ37k9j44NJ34k0o5K8K9l3m9P9J01j15q2J14P2j35o4J50k5j13
6124g8K1J58o0j17N5J03p2o1L3P0j43L5J13k0j51J4J70n8p5L1J16r0n8J03J8o0
6150cj9O7%o5NO9l1q9R3L3m0p7K0J72k00N4L0P8j16J2K9oj47P3J79j08r2N2K11
6179A84k17o2J14J4m0k6J02K0j97P4J10l5r1N1O2n8m9P9K5o7M2kJj24M7O4j4m6
$$ plain form
5998 120 84 -140 -67 98 -17 -20 -17 73 -21 -63 -6 151 -102 -85 83 84 -34 -53 145 27 -108 9 105 1 -79
6023 -79 78 103 -91 -46 76 58 -12 -65 50 -8 -109 -46 117 -10 -132 42 122 -61 -37 121 84 -68 -63 66
6047 66 27 -43 -64 108 -49 -118 -3 69 -43 -123 40 10 -128 -129 108 41 -114 -23 54 0 -98 -15 48 -99 -168 15
6073 15 87 -36 -86 110 42 -185 -61 100 -34 -103 -22 58 -101 -106 80 103 -17 -65 68 35 -108 14 58 40 -104
6098 -104 -31 104 -58 -53 84 55 -89 -84 50 30 -35 -7 22 -11 -60 19 120 5 -77 37 109 -26 -90 60 35 -78
6124 -78 -57 101 41 -76 -21 82 10 -51 -18 52 -91 -56 57 37 -114 -100 70 12 -63 -32 84 -6 -64 39 57 -3
6150 -3 -22 45 45 -20 -15 54 23 -66 27 60 20 -57 -37 135 -65 -11 19 97 -19 -7 22 16 -131 -58 121 13 -79 -27 184
6179 184 -33 -95 19 33 -7 -33 69 89 -108 -34 76 41 -50 1 63 5 -44 35 60 -7 35 33 34 -90 -43 21 7 -39
6207c9O0jr3k7J09j3p6P3N0L1j52L3J31m4r7M2N0n5q6J76k0n9o6J02K7n6o5J30
6235F5m7k4l7O0k7p2R9J1j5l0N4J5j59J2J85jj50L3L7K4j32J53K4r0l3Q9K6p6
6263fl1P6j2l4K8M1q9Nj8P9m0j1J9Q9r9r2J56m5o1L6P2o6l1O7J7o4l6N3k0j4N4
6294B3LK1p0L7M2q6K7Jkn4lP6L5p0m9Q0l9m3M0N9l7oj4N8o0L7L4j5lo0M8Rj53
6327a34J24M3o4l1L4O3o0P4j5K8o7J8N6l6q3LM6M3j42P5J6N9p5O0n3pn2J10m6
6356a3j9K3MLj6jN0o3J3O3o9j2n0RR7n4jR8p0n3N6N0pl9J1N2j09K2O9pj00P3O4
6389G4o2jJ1N9m2pk1q1P5k0K9L4j3p2Q5j3n4J3L0j3n9P5rk1l6O4K8m1qJ8kj06
6421h6Q1K3om4P3mj01L0Q9nq2LR3o9J8Nnk6o7J35k0p4J2K1J9pn5Q2m0j7L3L1j4
$$ plain form
6207 -39 21 20 -73 -100 9 -4 -80 -7 43 74 -78 -45 86 42 -55 -13 37 -18 -104 72 52 -7 -73 29 56 0 -65 65
6235 65 18 -6 -43 17 -10 -82 17 28 13 -17 37 52 -107 -95 90 89 -61 -28 9 33 -99 54 78 -12 -45 44 70 -6
6263 -6 -37 39 27 -7 21 62 -27 -22 -40 39 -1 -12 7 96 -3 -95 61 16 -45 -9 63 -3 -34 33 50 -14 -50 3 -17 -31 23
6294 23 26 47 -23 14 56 -30 -3 -2 -4 -58 -61 15 50 -20 -69 11 -28 -71 -31 28 -9 -15 -29 29 -31 6 40 25 22 -38 10 19 -134
6327 -134 -10 33 -31 -62 -28 35 -25 49 34 62 -5 13 69 33 -50 -47 -1 42 -100 -25 -9 50 -25 35 -18 -25 -77 33 -13
6356 -13 -32 -9 -5 -2 -18 -19 31 -32 -19 44 -25 -37 -87 -78 19 -35 -36 62 -8 -61 -5 45 38 -1 10 62 -47 -25 44 37 -63 10 74
6389 74 12 11 22 81 39 32 11 -70 5 -15 14 48 35 -37 48 35 -19 -6 24 11 -48 27 18 -3 -39 25 53 12 4 22 20 -86
6421 -86 -5 18 12 -32 41 37 -64 -34 55 50 -32 -29 64 -5 13 18 13 -13 -80 55 35 -39 -27 -6 13 6 -49 33 -7 -24 9 40 26
6454B6n4K6nL5o4Q5n3l2k7K1L7K8r1M4N1k9o4N6J4n4P7m2l1N6l8O1J0k5k3mn8
6485f7R7j6n4J5K1l8MM6l4R1j09J22j05N8j09R0Kn1J2K4J5JK6n8J8Nl1k4Q5k8
6515Hk4L1lj10J35Rp7O4Qk0j6roO6l8k8M4ko2L5J4l5jP9p1l1k8R6o8J6R9q7L0
6548A8j0K1l6K2k4LL3j3JK1J9q6L0N6q3K9J2%l2k4Q3m1k4K3N9nk8k9k0O6j54N3
6580f0M8rJ5j%j0k0K7K1K3kp3L0kj1J7L5Ll1%n0N5k2L9j0o9J01J3l2l4pk0O0j2
6614A2k8Ql0P2o8Oj3P3o6RO0J4l2n6M9K8Jj4Mq8rN8QJ8j8JQ7j10%R6n9J0n7P0
6648C6n0n0J06o6jL6QN7q5k7P0k6N9o7O2q1N1m0L6m3mL2l5J5kK3J7k0K5n2N2k9
6680Gj7N4p4N4J3J9j2Op9l4K9M6L5k7k5J9nnk6M0pm4J0O1kp8j9N4l3J3M7L3l2
$$ plain form
6454 26 -28 -2 -7 28 -36 49 -4 -36 -63 -42 -5 23 -68 -24 27 -2 -66 -10 4 -50 27 -15 -46 10 -28 33 43 18 -5 -9 -67
6485 -67 30 14 -40 -25 -4 -42 -38 8 -26 65 -44 78 -27 31 -78 12 14 -37 -25 -1 14 15 41 -17 1 6 -25 -49 36 8
6515 8 -16 15 12 -98 37 46 -31 33 41 21 5 -4 -10 56 18 -10 34 32 -30 5 19 -16 -17 62 -9 -40 -68 28 -40 -24 75 -12 18
6548 18 8 29 -7 15 -9 -6 27 14 15 36 55 -31 -1 55 -28 1 13 13 -19 -43 40 -1 -25 -2 57 52 24 -5 -25 41 -113 -60
6580 -60 -12 -21 -6 -7 -7 -17 -37 -10 11 34 32 -41 -11 -13 -24 -7 28 31 0 0 -50 5 -17 22 12 -57 44 57 25 -9 -16 -36 24 12
6614 12 -16 -8 -38 34 -34 -28 -41 32 -34 -25 35 49 17 -39 10 38 39 25 29 -59 -68 -10 -2 16 -2 -1 86 -24 -24 72 13 23 -34 36
6648 36 -14 -64 42 -24 -25 11 19 76 -9 -36 34 8 67 0 62 -19 32 -8 28 -15 -19 13 -22 -7 -9 14 31 11 36 -16 36 7
6680 7 -10 44 -30 24 37 56 44 50 -29 -63 -34 12 47 20 -5 14 9 4 -22 18 11 -33 -23 38 36 -42 -61 -7 -40 -27 20 53 21
6713B1l0Q8j18NQ8l1K8j17R0Mq1J2K3n1L2P6o0P0j02N3M2r9M0qqrJ6j3lN1j9O6
6745E6r0k0J83r3l1j13J25Rm7lP6n0j6k4kJ3J1J9J4J1l2n3R2Jq6J00k5l6j1N4
6775C2k4k4L5k3pPj8O4k2K6n7j5nKk1K0K5m3M9r6J21k7jNl8M7m4j3J3J5k5M0K
6808@K9J2o5j3M9J6KpJ0pnk6L1ln0L4On0%MLN1O7n5j9l2L2k6J0K9J1j1q9P2m3
6843c3oL3k5M4l8l0P9j6n3l9J56r8k1K2O1p9KL8L4o9J9J5jK6k2J1j6K9k2Oj2j1
6875a6P5o5l6L1K9j6MJ1m4k4Rj4M0J6J4j6O8n1m6M0n8L5M7k0k6K0k1K7o2M2J5
6906HJ5p3j2J02n7j0mR1n4l0J6L4k9j7L7k7k0KO8m0k5R3p2rPP6ln4J4n9Q7o1o
6939a2J9P1j20J9M2j9l0O9o8j8lR6o8qQ4l0M4q5Q7j4l5k8NL3m4n3O9J0J4Jk1K0
$$ plain form
6713 21 -9 79 -39 -34 54 23 51 -66 24 28 -53 -41 -18 -69 -37 39 -21 49 -53 0 42 -57 -17 -25 -33 -42 -26 -39 -42 9 -10 56
6745 56 -34 -54 129 36 5 -108 17 26 -21 -24 52 2 -14 -38 -40 -27 -16 3 17 28 -4 -57 35 36 -50 50 25 -11 -22 32
6775 32 8 -16 19 -4 -11 -4 -22 42 20 46 -11 -26 -31 -29 -50 -30 -5 -48 1 -95 26 -1 -2 3 -35 12 -32 -45 -32 -17 -42 -2 0
6808 0 29 41 -24 -37 12 28 30 23 33 26 21 -5 26 23 -27 7 13 -37 -37 -33 -30 21 88 33 14 -18 14 -12 -2 27 38 27 -62 10 -33
6843 -33 -39 -6 -31 13 -25 -55 24 8 -45 -84 72 -26 -47 -25 36 -43 -41 -3 31 -38 -19 -4 -5 21 -1 10 -6 23 1 7 -5 -16
6875 -16 59 -6 -42 -11 18 2 6 17 -27 -51 -42 -56 -16 0 14 -2 66 15 -31 9 -49 -14 33 13 -13 7 -14 13 -49 -7 8
6906 8 23 -50 -62 40 -17 -27 -31 60 6 -24 -8 26 -3 -20 17 -10 -30 -28 40 0 -25 68 -4 -13 -6 70 67 13 27 -32 55 -6 -12
6939 -12 7 78 -42 -23 19 0 -30 39 -29 -47 -50 46 -22 -30 54 24 68 -17 70 56 21 -7 -2 31 -13 -66 3 13 27 28 7 27
6971B7l0J1J0j4o2L8OML6M2n3lL3no8O8n3M4rj28J26k2J9p2M6M8m5K0M2n6m2K1
7003b1M7m9M1o2N8j09O7j3L7o2mJ26l1k7m2Q5l9Om8N8j6l1J9q4M9M7n0L2l0JN8
7034A3QnJ1J6%Jm2Rn4M6P2k2n7J2l0j2J7J9k5J2L8j0L3m7qL0Ll8l9Q2M4q9qJO1
7069D2n3k3R0Rk5qJ0l6l0O8M7j51O7J2n0P3k3j7rp2O3J04r7K3Ol3K4J6J2o8j4
7100d3J28n6p8J8P2n5j8K2L9o7L7n8O8j8o3P9PN9n7Mk1l5K9J4lm1N2o5P1n4m3
7131g6L9Q6q3M0k1L3j5l8P4p8M6Mk0l5R9p6Q4j43J00rp1l8J04O5j18m0J06N8j00
7160b3LK6j0o0J07k0m9M9n1N7m8j8O5j5J1n1M3PLm5M3Qq3O4O3r8L4M8m0pK0Lj4
7193B2n3L1M8n0j8N5O9o9q7N4J8m3M2j2M3o2j0K7k7M0j5M6q3OP9n7j6Q4o2J1j0
$$ plain form
6971 27 -3 8 18 4 -58 -20 -14 -10 26 68 15 12 45 40 -28 40 -13 31 22 -106 20 -2 17 -55 -9 39 -6 14 56 0 -42 -21
7003 -21 26 -23 18 -44 14 -95 -28 -41 -4 -66 -70 56 25 -2 -44 41 2 8 -40 18 2 -29 -10 -94 -45 2 -48 -16 -46 -45 13
7034 13 21 16 27 43 43 44 2 11 -43 3 75 53 -4 8 -22 -34 -17 2 -23 -11 27 17 50 3 -5 25 28 -10 -49 33 77 -12 -20 -19 42
7069 42 -11 -34 56 65 40 32 42 6 -24 44 91 -60 7 19 -31 42 19 2 -7 -79 -16 88 -9 14 20 -13 11 27 39 -29 -43
7100 -43 85 29 -49 -31 41 -14 -32 -10 29 -38 -1 -59 9 -9 -72 7 14 73 16 20 -1 -36 -7 7 4 -37 15 -50 21 -33 -76
7131 -76 -37 49 -34 6 -15 18 3 -35 39 -39 7 11 -9 -44 55 -21 63 -80 20 11 -60 -98 6 71 -47 -87 19 77 -23
7160 -23 -20 6 -4 -64 43 23 -26 23 -28 29 -19 -37 28 13 24 -27 16 23 26 -19 24 32 -51 13 76 -22 12 60 20 13 33 36 22
7193 22 -31 0 48 -2 -20 35 104 35 -52 2 20 -23 19 7 50 -12 -22 5 -22 18 3 49 -34 -28 51 -6 -22 62 0 11 1
7224AO5qm6j0K8K2m4o0Q3l9k2M3lQK0m3j8P1j26M8M0J4j4J0jN2j12L5J1j05J40
7255D0m8kjM8Nq5mJ7nKK3NK8k7k8Q0r5P3l6O5m4K6p3K2J3RO2p1K6l1J7L6n7lK0
7290GK1n0N4M1j01O5l2j0K1o3N3l8O1LQLn1l1N9l8J3J5L5o3J6Mj6l7L2Jl7O3n1
7323d3Q8p1K9k9L0j8KJ5L3q5P6L9j7m9L7Lp0Pk4Q6j29P0N3nq9K4K0M7o3L0M6j08
7355f5RJ9M1J5m2N5Kj9l5M7m3M9n2JM2q8R8o0L5k1j8P8j0p6P1j2Po1Mj5Q2m4O1
7388E5k8rpK6k8o3J14l2o8K9M6n5k8n6O4rO3j4M8l6l2J8L4m0J0J3M8q0o3P7P1
7419F8r0j7P4j00N3K0qJ9o4Q9o4M0k0K5J7l6k0pL9j4Q2j72J38l0Om5O6p0J0P2
7449F1p6J6M0k4m8N5J2M7j36K4N0l7k2J6K3oL1pl1LRL6o3L0nNnmK1l0N5p3N8N6
$$ plain form
7224 1 66 58 12 2 30 52 8 -52 31 -8 -30 13 10 18 38 -5 -23 48 -78 -30 10 24 10 20 19 71 -41 -6 5 -100 40
7255 40 -8 -10 -11 37 42 -43 -47 -30 -35 -33 -10 -5 23 -4 -32 48 -47 26 -10 55 11 37 -36 -14 -1 8 70 -1 25 -6 11 47 -10 -13 7
7290 7 28 -22 32 73 -28 37 5 -5 16 -47 6 -32 29 32 40 43 -8 -39 20 -18 -5 10 45 -18 -2 2 -14 -51 -19 -18 -55 8 -43
7323 -43 45 -26 3 -26 4 -14 -12 3 36 -49 27 66 49 0 37 40 -30 -23 -47 39 -90 -20 33 28 -61 -37 -17 30 -33 -3 43 -65
7355 -65 -56 -37 4 19 -23 32 34 15 -20 27 -16 33 -19 -18 24 -64 34 -26 9 -12 -30 48 38 -38 33 21 28 -33 -29 -44 38 -6 55
7388 55 27 18 11 37 9 -54 60 28 -40 -11 35 -20 -48 -104 -40 -49 14 0 48 12 -20 -2 32 -8 2 15 63 -17 -80 -3 68
7419 68 -22 -39 35 -65 -12 8 0 19 -45 44 -20 20 0 25 42 6 -14 -21 18 4 86 -86 52 22 28 -17 49 -21 -11 61
7449 61 -15 1 41 17 -31 24 36 83 -53 -29 21 -16 -38 -22 1 -5 26 19 -12 -9 0 36 -27 3 -2 3 -2 -6 15 -15 40 -33 25 81
7483H1j21O2p9R7l9j4L9ln0NL0j6qM8k0l9L6J3qk4j6Mk4k6P1Jk8l8P4J4oL4op0
7517b6L6m8N5o3N3L1On6j8M4n1j3R0K5j12J5L6j1k5j5M0PQj2M4m5jJ2QK5k0K1
7549D0l8K4l1J9k7P6j0n9rk0N1j1j0J4l2J7m5mjM3O2l5J1ln1L7kM9n3O2o3m5K7
7582a7J7rJ3k3K9l3L5j8L9j8qL2m7M4K0j8j1m9K4Mrk3J8L2l2k7Q2lj1j5oK4m9
7615a3N7K0j2on0O5m1j2Kj2pk4L2M5o1P0o0K3l4QM1o1j2Q1Po8m2O3L9n7J3j2K0
7648BL9o2N1j7o6J5M3L3p5O6k1j7oJ5J3n3N8n8J25p8K4m9J8J8k3%L1m8P9o6k7
7679c6lk0J8Q2k7p3L9K6nL4k4n5%L1k7K5j1K6l8J8K6k0ORj3l9M9o5N7P0k7l5O5
7712F3o7o3MP6k3O5o1L0p1M0k5P6o5p5J00J2j1l4N0J9o3O5l3%n3N3j0r0J32n1
$$ plain form
7483 81 -40 22 -57 40 1 -13 26 23 -27 -22 8 -8 -16 32 12 -27 9 22 14 -10 -26 -22 -46 -72 -1 0 -28 -66 8 22 16 50 44 -26
7517 -26 10 -38 17 -46 7 38 44 -12 -30 14 -37 -50 40 65 -47 -32 4 -7 -32 -47 -7 0 8 -4 40 -5 -6 6 14 39 19 40
7549 40 2 26 -5 14 -13 63 53 -6 -15 -35 16 5 -5 9 -23 -6 -51 -55 -56 -13 49 14 25 22 -29 8 6 55 2 64 1 -44 -17
7582 -17 0 -9 4 -19 10 -23 12 -6 33 15 7 39 -8 36 56 38 27 -22 2 6 -3 -26 -8 24 -8 -35 47 44 33 18 12 36 -13
7615 -13 44 64 52 46 -4 61 20 8 10 -2 -9 -33 -1 44 -17 53 -7 16 -18 -10 31 -30 -42 39 46 -22 -64 -1 38 -19 -6 -18 2
7648 2 41 -21 30 13 -53 -38 5 38 -37 29 8 -9 -15 0 13 -40 18 -40 85 7 31 -18 0 18 -5 -5 26 -22 57 -9 -36
7679 -36 -39 -59 -41 41 14 -59 -20 6 1 35 11 -44 -44 -13 -40 -15 -26 0 -38 -20 6 -14 -8 1 -12 -51 -2 -67 -10 60 33 -2 63
7712 63 -4 -67 -63 13 -10 55 -6 24 -47 -7 -32 44 -21 -96 4 16 5 -29 21 40 -23 42 9 9 -44 9 -1 -91 41 -10
7742a0K7l0RK4m0M4k8On9M2K5Mq2J02o7N2m1l1R0ln4N2l5k8K9K5L1m3n7O4rj7
7774hN4m1m4K1J6N7p8l1K5L1M6k7kNr5N7L5k3k7j0J7K7N5r2N5K3r2O2j1k8N4k1
7806A0mo6O3m2N4K5m3no5P8Oj4m1N3K9p0O3o2M9j0q1J26k0k2J1m7k5Q8Rj0o9K0
7838a2RL8m5N7q6Q4j8p1K3N8n1qN6k4nnm5J22r4P2j4j9k4L0m5P2l8k9R7k2k4q4
7870d5RL1l8O5m3K5j7L3m0J1Q1m8pj9j9K6m0jO3L7j02M6m3N3m1N0qJ3M4q0kk1
7902b7N5p7Q6q7R3q5JNRN1k9kM4k5k4J2K2q8J9PJ6N4o6N2j7l4Q1q9K5J0k1K1k0
7935b8Mj7L9jK0o0OJ4n0O3N5j27Q0m0J9k6O5p2P6K2k7Np4Q3j03O8K8r7J15p3K
7966c1M0k5Kk4K6M8m2LL3k9L5p3L5J3m9M7K5l4q1M5K4l3N6J4K5m1j2Q3j35Q1l9
$$ plain form
7742 -10 17 -13 -4 20 -20 24 -4 2 -57 -15 10 14 -68 34 -33 19 -22 -53 37 34 -20 32 -3 -31 -2 23 54 11 -46 18 9 -8
7774 -8 46 5 -39 -18 -2 55 -23 -54 -29 2 48 21 19 24 -71 -14 21 -2 -29 -39 -22 5 60 -32 23 46 -46 16 5 -23 31 10
7806 10 6 -60 3 -39 15 40 -3 -8 -73 5 11 -3 -44 9 38 -32 31 -31 18 8 -73 53 33 11 22 -25 -50 38 47 37 -32 -12
7838 -12 -3 35 -10 47 -39 45 27 -44 -21 37 -14 -22 34 10 5 0 -45 77 -17 55 41 22 -2 28 -17 55 17 -12 85 63 39 -45
7870 -45 -36 -5 -43 22 -21 4 -13 20 -20 -9 72 24 17 -2 -21 5 -35 -36 27 64 -38 8 -35 18 -23 27 19 32 76 -4 -6 -27
7902 -27 28 -49 37 -50 43 -42 -41 -36 -27 24 -5 -7 37 12 -12 0 22 -66 -47 -40 -24 30 -36 16 -1 -35 46 -43 -18 -8 -29 -8 -28
7935 -28 -24 -41 -2 -3 17 -43 -37 -23 -73 -10 45 -82 -2 -42 -23 -49 16 -56 20 42 15 20 -54 29 -74 -6 22 -75 40 -33 -31
7966 -31 9 -16 -14 -38 -12 36 -6 -3 30 1 36 -37 -2 11 -38 9 34 0 -81 -36 -12 -45 11 25 50 9 -3 80 -55 26 -13
7997a3L8n2J3O8l7Jk9qoJ0jJ9j0K6m2qLK0rJ07j32PN4Kn2J7M7ko9J5K4K2j5m2
8031c4j4N6m0J2K2o1L6L2J5p5K4nP7j00O9j6m1J9k7K2j2QK1j6jRM6k1n7L3M1k7
8063el0N8j0J7l0J4K0p8N2J4m8J7j3J2J0J3M4q7L3j7p1J35ln7J5n1J9J6Jj2J1
8094a1J3l0QL6m6P9r4J04m6n9J2N7J3pln5L6L9m3K0On2L6Nl0M2m7Q2j04K6J8Q
8126A3kJ6k2Qj1o7R5m8OmK7L0k0l2M3om4J3L1J2n4LM7p7J3k8l0J06p0P2o4M0P
8159CoN8q4M2j0j6K3n2M3M2j9N8l8j8k1N5r4rM1Kn4N8j9K5k3K9%k3Qj5O6j9
$$ plain form
7997 -13 25 -27 -14 54 17 18 -11 -19 -25 -15 -16 3 -7 19 -23 -31 -28 -8 -17 90 -42 -35 19 21 -31 -14 33 31 -38 -23 1 23 8 -34
8031 -34 -48 8 -32 -20 2 -59 -23 9 24 -51 -27 -32 45 -55 14 -2 -43 -24 -51 -29 -41 -33 -12 -28 -29 -20 26 5 -52 -19 22 -5
8063 -5 -35 23 13 30 0 14 34 -44 8 22 -26 -9 -22 -10 0 13 57 -30 3 -14 -85 50 47 -10 5 -46 -27 -11 -10 -22 -11
8094 -11 2 -28 -20 16 -30 49 -45 59 13 -46 -34 23 36 29 26 -29 7 46 3 23 29 -23 13 18 -12 30 -17 65 -39 -13 5 13
8126 13 11 27 5 13 2 -65 30 -18 -12 -16 11 41 21 -11 32 26 -18 -5 26 38 -16 -13 34 -43 -30 -58 -88 18 -52 20 -44 -4 3
8159 3 -3 55 -29 13 3 -13 10 -42 1 43 24 82 44 26 5 60 -34 -43 -2 0 -54 4 -15 10 -13 16 16 -7 1 -14 52 33
8191C3
$$ Imaginary data points
##PAGE= N=2
##DATA TABLE= (X++(I..I)), XYDATA
0@%%%%%%%Qj6J6j6J6k4L2l2M0m8N6o5P3q8J04j20J38j62J86k10K39k70L05l43
31a81L83m30M85n41O01o68P42q23R10j008J118j237J369j519J685j872K086k331
49a231K617k955L364l867M499n330O474q146J0831j5831K8130j08765j62466L11956
63E9280J17860k11318n9270J90069m2415k09725O6693K36629m7966j85427L3156
74e2434R8902q4557l2589J52944L0529j84463m0409J54974J7313j19572M4815
85a4547J14620r1302j33753R5693J27451p5380p9867P6557J8934j06537J3487
96e4644J33518j7639j24475K6927R0474o3810o6128J09932O7745j31076p1924
107a01100J19743M9139j03516o07J09067m1593j27792N6942J30134n8910j03960
$$ plain form
0 0 0 0 0 0 0 0 0 8 -8 8 -8 8 -16 16 -16 24 -24 32 -33 40 -48 56 -64 74 -88 98 -112 127 -143 162 -181
31 -181 202 -228 257 -284 317 -351 391 -432 478 -530 588 -649 720 -799 886 -986 1100 -1231
49 -1231 1386 -1569 1795 -2072 2427 -2903 3571 -4575 6256 -9575 18555 -90210 -252676 59280
63 59280 177140 -34178 -93448 96621 54206 -155519 -88826 147803 99837 -85590 -52434
74 -52434 46468 -38089 -70678 82266 112795 -71668 -112077 42897 60210 -59362 -14547
85 -14547 100073 8771 -124982 -29289 98162 22782 -57085 19472 38406 -68131 -54644
96 -54644 78874 61235 -63240 -36313 54161 -9649 -75777 34155 101900 -29176 -101100
107 -101100 18643 67782 -35734 -36341 72726 31133 -96659 -39717 90417 31507 -72453
118g2453P4965P0436j08301n4538J34804N4253j33539m4494J13649J2345j00036
129e2909K7694J01009n2497r9311N9936P7828o9054m1428R3223J2748j22456k390
141f7607J34622j941j24071J9559J07140n0378j01028P5026J01975p9711r0687
152g7101P2881N7969p4530j8171R0609q334j04915J8773R9930l0615p9410N6569
164C655O2619q7787o0126J04272N9494j00337m3322R0902J1059r2423J8855J01309
176F8170l3598r9901L9596Q0206n3725n4396P8951L7992j01083l1854J06499K1463
188E8320r9251K024R3798l0651r6199M9785R6234n7601q3017O5126N9255q0656
200b2833l8283R7642K5976j03810j4227R7521o759q9623L3332Q7982n3036q6378
$$ plain form
118 -72453 2512 72948 -35353 -89891 44913 99166 -34373 -78867 34782 47127 -52909
129 -52909 -25215 75794 23297 -76014 -16078 61750 -7304 -48732 44491 57239 -65217 -67607
141 -67607 67015 65074 -58997 -39438 67702 17324 -83704 -8678 93297 13586 -77101
152 -77101 -4220 53749 -20781 -38952 51657 43323 -61592 -42819 57111 26496 -52914 3655
164 3655 66274 -21513 -81639 22633 82127 -18210 -61532 29370 40429 -51994 -33139 68170
176 68170 34572 -65329 -25733 54473 748 -53648 25303 63295 -37788 -69642 36857 58320
188 58320 -40931 -38907 54891 24240 -71959 -22174 74060 16459 -66558 -1432 57823 -22833
200 -22833 -61116 36526 62502 -41308 -55535 41986 35227 -54396 -21064 66918 13882 -72496
212g2496O0643P3714o5400m9196P7126K5802r3014j2276R9716L342r1432J3445
224c0026P7694l9560p0759O3123P0255p2678o3497P1865M2986p3680j5541Q3903
236D4085m471r3404J3702R0084k1833p3815L9217N7290o2436m9356P8731M5364
248F3158q0788l3253P6209J0181p6546J4392Q2925k9135q4528L5188P3512m3237
260H078n4201N9221L8316p6083k9952Q3210K1696p9199m930P3276j8145p2649
272e1362L7290P3727m6820o7239N2094N0777o1370l2292P4646J9499q3184j1019
284d5253Q1321j544p3509K0704O7954l9868o5867N1127O0094n5601m5695O0872
296A4735K6359p0190j1061P7905J319p6847Q653O7864k4340n8925M2371N3577
$$ plain form
212 -72496 -11853 61861 -3539 -52735 24391 50193 -42821 -55097 44619 47961 -43471 -30026
224 -30026 47668 8108 -62651 472 70727 -1951 -65448 6417 49403 -24277 -39818 44085
236 44085 39614 -53790 -40088 49996 28163 -45652 -6435 50855 -11581 -60937 17794 63158
248 63158 -17630 -50883 25326 35507 -41039 -26647 56278 27143 -57385 -22197 51315 8078
260 8078 -46123 13098 51414 -24669 -54621 28589 50285 -28914 -33844 39432 21287 -51362
272 -51362 -14072 59655 12835 -54404 -2310 48467 -12903 -45195 29451 48950 -34234 -45253
284 -45253 36068 34524 -38985 -18281 49673 9805 -56062 -4935 55159 -442 -46137 14735
296 14735 41094 -29096 -40157 37748 39067 -37780 -29127 38737 14397 -44528 -2157 51420
308E1420n4581m8459N8486L6661n9706j8541O3670P83o9519J1209P0251j9351
320B2323o2810K9530N0831m3830m0937N6991L4437o3293k6698O2561J3051o0458
332b8302M538O1129j9736o2261K8868N7801l5124m6164M3736L2556n5045k2330
344d0334O3492J4787o4436n175O0363r059n6581K4351N4739l5047n0858M1150
356b608M1357m6362k7834N3236J5111n9308m790O1158m899n8200J6535N3185k8930
369G651m8001L9509M2133m6612l3616N1173K2727n4568j0398N6803j164n6867
381c1230J1915N3930k2016m8127L2068M0969m1117l3156M7848K4657n1396j4418
393c0073N2762K820n3130Q435N2224j7717m8421K5737M1165l3918l2318M2304
$$ plain form
308 51420 -3161 -51620 6866 43527 -16179 -34720 28950 29733 -39786 -28577 41674 22323
320 22323 -40487 -10957 39874 -3956 -44893 12098 46535 -16758 -43456 19105 32156 -28302
332 -28302 -23764 37365 17629 -44632 -15764 42037 6913 -39251 4485 37041 -18004 -40334
344 -40334 23158 37945 -26491 -31666 28697 19638 -36943 -12592 42147 7100 -43758 -2608
356 -2608 38749 -7613 -35447 17789 32900 -26408 -31198 29960 25061 -33139 -16604 36581 7651
369 7651 -40350 -841 41292 -5320 -38936 12237 34964 -19604 -30002 26801 25637 -31230
381 -31230 -19315 34615 12599 -35528 -3460 37509 -3608 -36764 11084 35741 -15655 -30073
393 -30073 22689 25509 -27621 -19186 33038 15321 -33100 -7363 33802 -116 -32434 9870
405I870K4000m8475j6445N0715P386m9876L754M8482j5115m7134K3995M3806l0175
418D788l7027L5479K7512m1452j7876M6669R421m9168j339M8100p921m5045J7770
431a0089M1629k6883l7792L3444L2012l7785k3890M1095J4216m4126n054M5688
443B2465l325m4578J1363M0796k0018l6035K8248L1033l4436k5362L7947J7727
455B5825l9858q714M1189l25m1557Q198L9466j5297l4892K2522K8875k9552k2910
468b7030L5262J6640l8356r454L9348J430l9595O923L8821j4110l6213K0162L1507
481B5335k5725k5252L1030J8700l5193j2125L7417N194l7553K509L6829j0444
493A0722l5140J7411L2441k2675k8052K7085K2004l0913j5083L4279Q325l6008
$$ plain form
405 9870 33870 -14605 -31050 19665 27051 -22825 -19071 29411 14296 -32838 -8843 34963 4788
418 4788 -32239 3240 30752 -10700 -28576 18093 27514 -21654 -22993 25107 17186 -27859 -10089
431 -10089 31540 4657 -33135 309 32321 -5464 -29354 11741 25957 -18169 -23223 22465
443 22465 19140 -25438 -14075 26721 6703 -29332 -1084 29949 -4487 -29849 8098 25825
455 25825 -14033 -22747 18442 18117 -23440 -15242 24224 8927 -25965 -3443 25432 -4120 -27030
468 -27030 8232 24872 -13484 -22938 16410 17840 -21755 -14832 23989 9879 -26334 -6172 25335
481 25335 -390 -25642 5388 24088 -11105 -23230 14187 19381 -18172 -15663 21166 10722
493 10722 -24418 -7007 25434 2759 -25293 1792 23796 -7117 -22200 12079 20404 -15604
505a5604j726L5766m933l3820J2029L1241j8888k7909K4440K3848k8333j8282
517b2171L0961J1804l2950m870L4075j537l3755P636L1635j3524k8101J9292K3940
530B2435k4455j9461K8354J4449l0458q754L1194K406l1090M011L0072r688k8013
543a8998J4595K4264j8786j9463K2588J4052k5846q686K7755L310k8166K125K7127
556A5871p829k5262J3250K2716j7816j9462K1198J4991k3744r747K5455M236k6714
569a2857J139K6728o350k5446J1246K3128j6007k0287K0024J6864k3188j2727
581a7733K5023P883k6247k601K6819k510k6499O962K4841j1253k1939J5440J8406
594A6592j9369j4735K2268J0998k3773o576K4013J466k3871L971K3333q464k2025
$$ plain form
505 -15604 -17330 18436 13503 -20317 -8288 22953 4065 -23844 596 24444 -3889 -22171
517 -22171 8790 20594 -12356 -17226 16849 15312 -18443 -10807 20828 7304 -20797 -1505 22435
530 22435 -2020 -21481 6873 21322 -9136 -17890 13304 15710 -15380 -11369 18703 9015 -18998
543 -18998 -4403 19861 1075 -18388 4200 18252 -7594 -16280 11475 14785 -13381 -11256 15871
556 15871 8042 -17220 -3970 18746 930 -18532 2666 17657 -6087 -15834 9621 13857 -12857
569 -12857 -11718 15010 8660 -16786 -5540 17588 1581 -18706 1318 18182 -5006 -17733
581 -17733 7290 15173 -11074 -13675 13144 10634 -15865 -8903 15938 4685 -17254 -1814 16592
594 16592 -2777 -17512 4756 15754 -8019 -14595 9418 10884 -12987 -9016 14317 5853 -16172
607a6172J1956J9307j5049j5149J8211J0877k1086p005K2647L345k2493J195K1357
620A1941o213k0192J0807J9042j4135j6530J6231J2761j8148q262K0461M083k1855
633a0009n37K1659k887k0017P247J7868j1560j5974J5134J3869j7138j0609J8372
646E418O271j9427j848K0463j707k0645M925J9180q072j6763J1663J4306j4943
659a179j1930J7160R169j8156n614J8642J445j8972K404J8885n629j7739Q454
672c060J5508j1284j2884J4002J0124j6032p362J6954M138j7303k77J7039l360
685F203j6767O456J5568r056j3534J1548J0650j3782q030J5608N273j6491k284
698h638J6220j133j5627M639J4775p637j3746R998J1672j1982q922J3775N903
$$ plain form
607 -16172 -4216 15091 42 -15107 3104 13981 -7105 -14110 8537 11882 -10611 -9416 11941
620 11941 5728 -14464 -3657 15385 1250 -15280 951 13712 -4436 -12698 7763 11846 -10009
633 -10009 -10546 11113 8226 -11791 -4544 13324 1764 -14210 924 14793 -2345 -12954 5418
646 5418 11689 -7738 -9586 10877 9170 -11475 -6550 12630 4558 -12205 -542 13764 -1179
659 -1179 -13109 4051 13220 -4936 -10550 8092 9537 -9435 -7031 11854 6225 -11514 -3060
672 -3060 12448 1164 -11720 2282 12406 -3626 -10988 5966 10104 -7199 -7476 9563 6203
685 6203 -10564 -4108 11460 2404 -11130 418 11068 -2714 -10744 4864 10137 -6354 -8638
698 -8638 7582 6449 -9178 -4539 10236 2599 -11147 -1149 10523 -1459 -10381 3394 9297
711I297j5262l308J5970O74j5642K182J4649n355j3553Q122J2323j0213j0472
724a0588J1615P801j2899m701J4117J972j4887L77J4645k882j3424N687J1986
737H819q257j0738J0248R085j1208o736J2072L805j2933r01J3416j160j3166L214
751d440J1895n602j0126Q152Q842j0223p390J1236N280j1333k450J1730n58j2139
765g126K895J2154m585j0751O251Q724q409o610J0581N222j1831l667J1944J435
779F227j1447J526J1183m243j1197O204J0475p291q612Q540O147j0146l963J1530
793D933K316j2072n68J1468j678j0551M361R769o583r223Q048P887q754n935R652
808C070L453j0754j301J1333l77j1168K148J0034m217r061O486P991q203o793
$$ plain form
711 9297 -5965 -9273 6697 7371 -8271 -6089 8560 3205 -10348 -2226 10097 -116 -10588
724 -10588 1027 8828 -4071 -8772 5345 7317 -7570 -7193 7452 4570 -8854 -3167 8819
737 8819 562 -10176 72 9157 -2051 -8787 3285 7090 -5843 -6744 6672 5512 -7654 -4440
751 -4440 7455 1853 -8273 -121 8721 -1502 -8892 2344 7624 -3709 -6159 5571 5013 -7126
765 -7126 -4231 7923 3338 -7413 -1162 7562 -847 -7457 3124 8346 -3485 -7152 4792 6227
779 6227 -5220 -3694 7489 3246 -7951 -1747 8728 1437 -7175 1365 7512 -2634 -6597 4933
793 4933 7249 -4823 -5391 6077 4399 -6152 -1791 7978 1395 -7828 220 8107 -647 -6582 3070
808 3070 6523 -4231 -5532 5801 5424 -5744 -3596 6438 2221 -6840 -354 7637 -566 -7359
822g359R071N050r821k798J0401N56j0896J299J0673l023r789M819Q592o763p536
837g524Q303O285r315m507R795K290j0368j22J0795j667j0685L209R673m893q266
852f997O721O981q433n773R257M314r356k283R385j42r562K290R498l661q881
867f642M986P338o378n499P922L939r145k529R562J109r313R85Q787l187q451
882f516N242Q055o477p197P674N375q436l476R463J797j0192l32J0374j113r704
897e463K738Q942m547q038O254P122p287n929Q052M139q439k208Q973K22r002
912d471J415Q674k865p865M281O809n756n477O980M061p727k677Q285R49q389
927c773Q13Q125k570p623M201O953n701o089O859M836p628l293Q181J500q747
$$ plain form
822 -7359 1712 6762 -3059 -5857 4544 5100 -5796 -4497 6176 3153 -6636 -1817 6775 12 -7524
837 -7524 779 7064 -2251 -6758 3037 5327 -5041 -5163 5632 3965 -6720 -3511 6162 1269 -6997
852 -6997 -276 6705 -1728 -7501 1756 6070 -3286 -5569 3816 3674 -5888 -3598 5900 2239 -6642
867 -6642 -1656 5682 -696 -6195 1727 5666 -3479 -6008 3554 4663 -4650 -3665 5122 1935 -6516
882 -6516 -1274 6781 304 -6893 781 6156 -2280 -5756 3707 5504 -4688 -5020 5354 4241 -5463
897 -5463 -2725 6217 1670 -6368 -114 7008 -279 -6208 1844 5983 -2456 -4664 4309 4531 -4471
912 -4471 -3056 5618 2753 -5112 -831 5978 222 -5255 1725 5786 -1941 -4618 3667 4616 -3773
927 -3773 -2960 5165 2595 -5028 -827 6126 425 -5664 1195 6031 -1597 -4890 3291 4791 -3956
942c956K84Q819j774q625L141P690m606o513O122N321p450m305Q087L055q261
957b971j367Q264p36q244K386Q146l640p717M696O364n706m792O888L307p990
972c112k036Q226R13q040P18P480k607o912M138O377n283n595O018M263o691k464
988d607P278Q29p760P31P721k052p220L428O347m813n526O288M479p116l312P657
1004B352J848p877k06Q057j488p801K889P343m151o417N419N294o523m003P398
1019B134K653p824j119Q092n25p931K089P488l329o719M632N634n827m492O924
1034A880L273p461j875P598L29p484J484P431l027p290M310O372n081n065O177
1049A571L415p294k095Q073J101q207J79P653j902p000L764O761n388o263O013
$$ plain form
942 -3956 -3672 5147 3373 -5252 -2111 5579 973 -5540 582 5903 -1547 -5852 2235 5290 -2971
957 -2971 -4338 3926 3190 -5054 -2668 5478 1838 -5879 -1183 5181 -525 -5317 1571 4878 -3112
972 -3112 -5148 3078 3991 -4049 -3331 4149 1542 -5370 -1232 5145 -138 -5733 285 4548 -2143 -4607
988 -4607 2671 3500 -4260 -3529 4192 2140 -5080 -1652 4695 -118 -5644 644 5123 -1993 -5305 2352
1004 2352 4200 -3677 -3883 4174 2686 -5115 -2226 5117 966 -5451 -32 5262 -1261 -5264 2134
1019 2134 4787 -3037 -4156 3936 3411 -4520 -2431 5057 1728 -4991 -359 5275 -552 -5044 1880
1034 1880 5153 -2308 -4183 3415 3744 -3740 -2256 5175 2148 -5142 -832 5540 459 -4606 1571
1049 1571 4986 -2308 -4403 3670 4771 -3436 -3257 4396 2494 -4506 -742 6019 631 -5632 381
1064C81N148o358l484P062J504p785j35Q228r23p937K226O815l768n968N405N231
1080E642o612m359P010L037p353j280P491k89p762J808P383l034o672M281N541
1095D832n579m341O533L154p210j900P531K59p461J174P362k738o804L971N944
1110D727n003n088O112L779o835k390P278R37p462N46P326j920p027L266O366
1125D612m322n528N577M263o442l032O991J877p242m01P131j093o970K670O686
1140D777l891o030M820N052n567l696O353K354p000j025P225j5o984J348O400
1155D121k846n694M379N089n489m207O047L155o376j683O717R8p019J302O904
1170D498k216o316L283N263m456m128N656L110o443k070O642Q58o562O91O428
$$ plain form
1064 381 5529 -829 -4313 2749 4253 -3532 -3667 4561 3638 -4299 -2073 4742 974 -4994 411 5642
1080 5642 -970 -5329 1681 4718 -2635 -3915 3576 3287 -4475 -2667 4716 1682 -4990 -709 4832
1095 4832 -747 -5088 1445 4599 -2611 -4511 3020 3279 -4182 -3008 4354 1616 -5188 -1217 4727
1110 4727 -276 -5364 748 4527 -2308 -4698 2580 3517 -3945 -3399 3927 2007 -5020 -1754 4612
1125 4612 290 -5238 339 4602 -1840 -4872 2119 3996 -3246 -3647 3484 2391 -4579 -1909 4777
1140 4777 886 -5144 -324 4728 -839 -4535 1818 4172 -2828 -3853 3372 3357 -3627 -2279 4121
1155 4121 1275 -4419 -40 5049 -440 -4647 1400 4555 -1821 -3504 3213 3311 -3708 -2406 4498
1170 4498 2282 -4034 -751 4512 56 -4072 1584 4694 -1749 -3819 2823 3681 -2881 -2190 4238
1185D238k243o299L417N869m245m992N052L701n846k451O475J244o758p2O671
1200C761j299o301K614N785l868n087M685M313n580l220O061K039o419p34O392
1215C142o39o189J858N874l101n262L966M401m877l266N628K132o257j122O445
1230B733K4o212J191N724k596n268L872M676m601l948N183K557n637j120O139
1245B717j05o448R71O376k096n530L213M582m295l936N319L229n796k183N918
1260A936Q13n916P05O058j998n831K843N379l664m447M536L321n228k233N797
1275B071J318o051j88N830r49n420K331M846l459m324M401L659m936k653N359
1290A835J408n582j14N835j048n758K040N335k885m621L785L799m730k837N452
$$ plain form
1185 4238 1995 -4304 -887 4982 737 -4255 797 4498 -1348 -3799 2676 3920 -2838 -2910 3761
1200 3761 2462 -3839 -1225 4560 692 -4395 290 4603 -977 -4197 1864 3903 -2516 -3250 3142
1215 3142 2503 -3686 -1828 4046 945 -4317 -351 4050 -827 -4093 1535 3667 -2590 -3712 2733
1230 2733 2757 -3455 -2264 3460 864 -4404 -532 4144 -457 -4405 778 3335 -2302 -3422 2717
1245 2717 2612 -3836 -2865 3511 1415 -4115 -902 3680 -615 -4551 768 3997 -1799 -3982 1936
1260 1936 2749 -3167 -2462 3596 1598 -4233 -1390 3989 325 -4122 414 3735 -1493 -3726 2071
1275 2071 3389 -2662 -2850 2980 2031 -3389 -1058 3788 329 -3995 406 4065 -871 -3524 1835
1290 1835 3243 -2339 -2453 3382 2334 -3424 -1384 3951 1066 -3555 230 4029 -701 -3538 1914
1305A914J899n866q86O001k08n746J315N402k608m805L519M324m337l557M779
1320A140K564n235j246N560n0n744R83N686j830n212K733M398l760l600M760K819
1336C966n359k138N457J060n245K00N169j585n157K551M766l168m019L709K875
1351C082m360j889N038R64n325k08N168q59m655J820M346l041l896L858L314m366
1367a009k412M634J309m915j39N058q02n096J567M844k353m257L145L412l934
1382i48k618M736J881n029j294N091K90m759R21M609k147m387K838M151l126l420
1398c211L479K316l985j139M652K83m896K80M583r63l824J919L367l061l021L816
1414E95K629l926j821L869Q00l974M08M140j263m134J885L654k248k989K966K112
$$ plain form
1305 1914 3813 -2053 -2939 3062 2854 -2892 -1577 3825 1217 -3588 -69 4255 -82 -3639 1140
1320 1140 3704 -1531 -2777 2783 2733 -3011 -2028 3658 1828 -3384 -651 3747 -13 -3613 1147 3966
1336 3966 -1393 -3531 1926 2986 -2259 -2059 3110 1525 -3632 -1081 3685 517 -3502 207 3082
1351 3082 -1278 -3167 1871 2835 -2490 -2698 2470 1611 -3044 -1224 3122 81 -3815 43 3357 -1009
1367 -1009 -3421 1213 2522 -2393 -2532 2526 1724 -3372 -1805 3039 686 -3571 -426 2986 -948
1382 -948 -3566 1170 3051 -1978 -3272 1819 2109 -2650 -1729 2880 733 -3654 -816 3335 209 -3211
1398 -3211 268 2584 -1401 -2540 2112 2395 -2501 -2221 2362 1399 -2425 -506 2861 -200 -3221 595
1414 595 3224 -702 -2523 1346 2146 -1828 -1420 2720 1457 -2677 -792 2862 614 -2375 591 2703
1430B703l640j267M073O94m110j87M006p04l552J597L232k433k975K998K536l441
1446d70j703L666Q02l830J0M009r25l917J529L720k184l232K769K582l367j905
1462b446L748J248m031n94M029j31l981R98L650j746l507K546L066k985k583L127
1478D08J846l397r65L632J75l839N01L675j076l231J701K559k403k076L072J644
1494B226l468j227L377N70l183L17L194j310l029J840K875k192k297K437J468
1509A598k835o94L443J0l620K86L573r24l056J705K587k470k368L093K142l300
1525h30j576L320Q33l415J52L567q81l585J285L527j769k880K152K423k782j817
1541b276L328J226l457q12L382L02l202O05K997j383k798J934K614k224k202K396
$$ plain form
1430 2703 -937 -2204 1869 2563 -1547 -1734 2272 1568 -1984 -387 2845 412 -2563 435 2971 -470
1446 -470 -2173 1493 2295 -1535 -1525 2484 1559 -2358 -829 2891 707 -2525 244 2826 -541 -2446
1462 -2446 1302 2550 -1481 -2075 1954 1823 -2158 -1160 2490 744 -2763 -217 2849 -136 -2719 408
1478 408 2254 -1143 -2108 1524 1699 -2140 -1639 2036 960 -2271 -570 1989 -414 -2490 582 2226
1494 2226 -1242 -2469 908 1478 -1705 -1388 1806 496 -2533 -693 2182 -10 -2307 130 1598
1509 1598 -1237 -1931 1512 1522 -2098 -1812 1761 837 -2219 -514 2073 -397 -2765 328 2470 -830
1525 -830 -2406 914 1747 -1668 -1516 2051 1170 -2415 -1130 2397 628 -2252 -100 2323 -459 -2276
1541 -2276 1052 2278 -1179 -1991 1391 1693 -1509 -904 2093 710 -2088 -154 2460 236 -1966 430
1557D30J605k699p84K983J54l118K43L047n73k739J212K235j887j817K388J541
1573B221k660j019K612L73k658L10K679r07k641J387K389j817j934K159J374k521
1589f53q24K732L11k865J28K830o73k603J121K427j804k018K183J763k544j485
1605a974K618R58k609l61K619l49k727R35K664j252k445J507J870j863j288K278
1621E81R34k684o84K657L57k373J71K160q64k096J430J916j534j710J611J186
1637A058j812l88K009o4k269L79K154o16j755R40J356j457j021J898R20k085p28
1654a481K097K03j913L85J973j009j942J403J784j493j429J679R98j913m09K063
1670I96J07k285K63K246n25k032R55J774j351j486J723J369k105r79K104O44k038
$$ plain form
1557 430 2035 -664 -1448 1535 1689 -1429 -1186 1861 1288 -1451 -239 1996 109 -1708 680 2221
1573 2221 -439 -1458 1154 1527 -1131 -821 1858 951 -1690 -303 2086 269 -1665 494 1868 -653
1589 -653 -1477 1255 1566 -1299 -1171 1659 986 -1617 -496 1931 127 -1891 292 2055 -489 -1974
1605 -1974 644 1602 -1007 -1368 1251 902 -1825 -890 1774 522 -1923 -416 1454 -409 -1697 581
1621 581 1515 -1169 -1853 804 1161 -1212 -1041 1119 255 -1841 -411 1505 -29 -1739 -128 1058
1637 1058 -754 -1142 867 803 -1466 -1087 1067 451 -1304 -364 992 -465 -1486 412 1332 -753 -1481
1654 -1481 616 819 -1094 -709 1264 255 -1687 -284 1500 7 -1422 257 1255 -658 -1067 996
1670 996 1103 -1182 -919 1327 802 -1230 -275 1499 148 -1338 385 1754 -351 -1330 774 1418 -620
1687f20j20J908l62j989P79K110r39j883R91J468j268r05J683O00k036m80J972
1704I09L24j717J19J465p61j315J134J431j303j279J183P40j249j82J596l40j813
1721a058L38J868n12j512Q51J014j291r00J689R29j851o52J529L16j531K32J595
1738A054o15j792Q06J560q35j216R51Q47j267o28J617L60j672j32J450j54j282
1755i48N15J155q59j055J034R63j137p51J276M00j341j21J426k44j313M04J328
1772G32n83j232P39R84r08o09J115L68j322j44J267J47j139J19R52m55r06Q51
1790b4R34j001q86R91N68q64j21J041k61j241L62J343k37j145M33O83p05m42J075
1809E03O25j278o55J128L63p84P6Q47n11j047N61J157m60q90N06M90p79j65R45
$$ plain form
1687 -620 -740 1168 806 -1183 -404 1706 767 -1116 -125 1343 75 -830 853 1453 -583 -1063 909
1704 909 1233 -484 -365 1100 339 -976 158 1589 286 -993 190 930 -319 -501 1095 755 -1058
1721 -1058 -720 1148 636 -876 -25 989 -302 -1202 487 1416 -435 -1087 442 758 -773 -541 1054
1738 1054 439 -1353 -547 1013 178 -1038 -87 760 -507 -1135 482 842 -830 -962 488 334 -948
1755 -948 -433 722 -137 -1192 -158 805 -332 -1083 193 593 -748 -869 557 313 -1000 -596 732
1772 732 149 -1083 -344 640 -268 -877 238 606 -716 -860 407 554 -585 -466 486 31 -875 -24
1790 -24 910 -91 -977 14 582 -282 -403 638 377 -864 -502 841 604 -541 -108 575 -130 -572 503
1809 503 1128 -150 -805 323 686 -98 -22 825 314 -733 -172 985 525 -365 141 631 -148 -313 632
1828F32L19j152k15Q58L1o74L92O56o67p47O90O69o34m57N99K20q27j8R68j51
1848D92q20R3P11l20n62N16N24o78m57O60K77o99q5P14Pp77J25O69k86o22M18
1869a00N64o49m48O43L22n52j65N59j22p18K27P96k10o79K60M55n19k67O69L84
1889D50p44n12O31M04m65q4M42j66p18L88O30j32n55J91K36l62q8N99J53o04k79
1910e85O21P0l68J13M50l51m86M09M41k03l79L08J20l56MM71j7n33J06M50j17
1931A68l75L64J86k97l40M52K22l36k03M10M1l87J39L52j47m01K09L98k94k58
1951i7K93K71l90k23N00Q0l95r4M37K2m51J06K59j13k31K39K15k86l13L08K77
1972D14k59j55L01q5l40oM66R3m11j48J44Or7K09J55k94k33J64K31p3n9L5j19
$$ plain form
1828 632 951 -201 -416 442 473 -201 191 847 180 -567 123 792 158 -299 300 520 -307 -325 643 492
1848 492 -328 -235 476 156 -406 110 634 -44 -501 159 436 -263 -348 366 373 -404 -279 390 104 -518 -100
1869 -100 464 -185 -633 10 332 -220 -385 174 52 -666 -439 357 147 -532 -272 183 -336 -603 66 450
1889 450 -294 -806 -175 229 -236 -320 122 -44 -762 -374 256 124 -431 -240 -4 -366 -454 145 298 -306 -585
1910 -585 36 106 -262 -149 301 -50 -536 -127 314 111 -268 40 160 -196 -192 279 262 -271 -165 285 168
1931 168 -207 157 343 46 -294 158 380 44 -159 251 292 -95 44 396 249 -152 57 455 161 -97
1951 -97 196 467 77 -146 354 434 39 -55 382 404 -47 59 318 205 -26 213 428 142 -171 137 414
1972 414 155 0 301 216 -124 -130 336 429 18 -130 14 20 -77 132 287 -7 -240 -76 155 82 23 58 -61
1995f1k86K20L27j3k86m6L0r3N7K69ok51k11J79QM3J45l6k02k17J88K66j08j09
2019a93J9m6j16P1K35j3j45j14K0R2PQ7J11j92j80J96J06n1rM0K8j58k2K53R0
2044A16k17n8J29K7j11pK32p6j57kJ70Lj23J45J5j50l0J96J21j25j00O8P2j84
2068d6J00J22K6j10JQ0pp2J49m8r3n3P7J51j05l0J28n0k21J24J40m8m5n2N8p4
2094A02k6J72rj08n9Q0M1j80J29J61k69j08J71J48p7j70J27Q7k85k4K30mj97O7
2118aQ6j03j58J69K37k68j52J44J29j61q8K42M4l43p7L59Pl35M6K70p9k40N4K58
2142D0j81j95J50K43k52j68J92J20j59k3K32n7k79J07J79l4j39Q8O1j07p6K29
2164b9J21k99k2J86m4j81K41K02k92k70L15K35k57j06K78ll52L1M91n4l10l4L16
$$ plain form
1995 -61 -347 -127 200 187 -99 -145 -115 -208 -151 118 112 -139 -350 -171 -163 -120 25 -11 -213 -430 -242 24 -84 -193
2019 -193 -174 -220 -336 -265 -30 -43 -188 -302 -282 -190 -183 -96 15 -177 -357 -161 -55 -106 -115 -75 -47 -205 -227 26 116
2044 116 -101 -159 -30 -3 -114 -121 111 35 -122 -124 46 49 -74 71 86 -64 -94 102 223 98 -2 66 138 -46
2068 -46 54 176 202 92 93 173 166 94 243 195 102 49 126 277 172 142 270 220 -1 123 263 215 170 118 176 102
2094 102 76 248 239 131 72 152 193 13 142 303 34 -74 97 245 168 -2 125 212 -73 -97 133 129 -68 -1
2118 -1 85 -18 -176 -7 230 -38 -190 -46 83 -78 -166 76 120 -223 -300 59 66 -269 -223 47 -32 -272 -218 40
2142 40 -141 -336 -186 57 -195 -363 -171 -51 -210 -233 -1 -58 -337 -230 -51 -85 -224 -136 -75 -182 -258 -29
2164 -29 92 -207 -229 -43 -87 -268 -27 175 -117 -387 -72 163 -94 -200 78 75 -277 -246 245 191 -119 -153 163
2187A63j30j67K10L12l79l31L06K82j92j11L13p0l90J09M96j37k59l4K21r4n9
2208E9K24J40m25j89L81J70k03q2K57k38k50L24L14k30l26J41J24j38J5L62j05
2229C25m74oM27J19l75N7J67k17k65M33J69k85k96L44O6l01P5K97p5m61R8N00
2251C22j83m22J67K53k49n9K65n2l36o3M56R8m44l2L98k30k68L06L61m04m45L64
2273a97L32k67j58K96j24l49J98M75j76m64J12K99k30mL90J7m97j46N12Q1k67
2294a67k2L00k16l25M01L36l80k81K96K01l08N8L59j35m96J69N16j87l69J77L52
2315B79k38k86L76K79m67j56M58j4l47O3L92k24l44K71M20l76l15L50K39l31j05
2336g6M12m9m96J10M90m0m24J20K35k40j04M46J05n17k41N22J70l71K1L17k69
$$ plain form
2187 163 33 -134 76 388 9 -322 -16 266 74 -37 276 206 -184 -75 421 284 25 -9 212 118 59
2208 59 283 423 -2 -191 190 360 157 75 332 94 -156 168 482 252 -74 67 191 53 68 430 325
2229 325 -149 -155 272 391 16 73 240 23 -242 191 360 75 -221 123 189 -112 -37 260 185 -276 -178 322
2251 322 139 -283 -116 137 -112 -171 94 42 -294 -357 99 197 -247 -279 119 -111 -379 -73 288 -116 -561 -197
2273 -197 135 -132 -290 6 -118 -467 -269 206 30 -434 -322 -23 -253 -257 133 150 -347 -493 19 100 -167
2294 -167 -189 111 -105 -430 -29 307 -73 -354 -58 143 -165 -107 252 117 -379 -210 306 119 -250 -73 279
2315 279 41 -245 131 410 -57 -213 245 231 -116 -53 339 115 -229 42 462 86 -229 121 360 29 -76
2336 -76 336 287 -209 -99 391 351 -73 47 282 42 -62 384 489 -28 -269 253 423 52 73 390 121
2357A21m32L77M65k26m98K14J33k73L3N35kp12m4N48L1l70J36K87l94l31M56M42
2379D96m34m63L65Q2k71R2M90k35n77J54N03j49l20K84P7m57j12N71K29n71j02
2400c48L33j9k75K30K67l09l69L46L46l55k52M29P1m87j3O25j80m67J43M57k27
2421e4l24K53L03l64j81M74J08n79%M80qm13J65L61l47l39M25M28l60k92K29K99
2443B64n23J22M95j18o06J13N48j08l45K32K54m32k11N50K33m70k12L92J20m22
2463a24K10M08l66l88L60L73k35l29K93O0l97N6O05j54n35P9M26j04l68L68K18
2484D56m37k73M99K37m42j63M08m2m42K43M67l37m95K79M59l60k84M12R1m47j16
2505b87O43o3o33J08M94k00m37L71K91n22k03M76K75n46j25M04P7n50K39M76k97
$$ plain form
2357 121 -311 66 531 305 -193 21 154 -119 -86 449 447 -265 -309 239 270 -100 36 323 -71 -402 54 496
2379 496 62 -401 -36 46 -225 -133 357 122 -455 -301 202 53 -267 17 94 -363 -475 96 325 -246 -348
2400 -348 -15 -34 -309 -79 188 -121 -490 -144 202 -153 -405 24 95 -392 -405 220 40 -427 -284 173 -54
2421 -54 -378 -125 178 -186 -367 107 215 -364 -364 116 108 -305 -140 221 -126 -465 -40 388 28 -264 -35 264
2443 264 -259 -137 358 240 -366 -253 295 187 -158 74 328 -104 -315 235 468 -2 -214 178 298 -124
2463 -124 86 494 128 -260 100 473 238 -91 202 262 -135 -79 526 372 -163 -84 342 238 -130 238 456
2484 456 19 -254 245 482 40 -123 285 243 -199 44 511 174 -321 -42 417 57 -227 185 276 -171 -287
2505 -287 356 293 -340 -232 262 62 -375 -4 287 -235 -438 38 313 -233 -358 46 123 -427 -188 288 -9
2526im93K59M34k83k54L61J39n29o5O44L7n76J9L41n1m02L24L73m21l34L67L74
2548B55m19j35M36j32m31R3O20j66n19K39L03k75k67N34J27n36p3N41K1m77J07
2569a54M90l03l93L35M89m66l90M81K40m17j45M97K7n21P5N87k38m77K59N22m05
2590I3l36M20K89m95j70O11K3n60oN73k11m23L32L69m43l24M85L00n15j95M57
2611B74N6m94J25N67k10o38K70M44k79l43M96J11n69j32O42R0n25m1M17j54m86
2632c79M58M18m90m43M35L23m45j36M92j9o72J84O46j08o39K02M59m21l09N21
2652G7K94o53k32O10J39n39K3N64k48n49K73N34l15m48L74L41n12j98O05J6o36
2673d80J01O53k08n80K72N77m23m07N36K55n47k14O03P2n12k1N54j72o07M68N46
$$ plain form
2526 -9 -502 -243 191 -92 -346 15 154 -375 -440 204 241 -335 -316 25 -26 -428 -104 269 -152 -486 -119 255
2548 255 -164 -299 137 5 -426 -333 287 121 -398 -159 144 -131 -398 136 263 -273 -346 195 216 -261 -154
2569 -154 336 33 -360 -25 464 -2 -392 89 329 -88 -233 264 291 -230 -155 432 194 -283 -24 498 93
2590 93 -243 177 466 -29 -199 412 435 -125 -131 442 231 -192 140 509 66 -258 227 527 12 -183 274
2611 274 330 -164 -39 528 318 -320 -50 394 115 -228 268 379 -190 -322 320 410 -115 -156 261 107 -379
2632 -379 79 497 7 -436 -1 322 -123 -259 233 214 -458 -274 372 264 -375 -173 286 -135 -444 77
2652 77 371 -282 -514 96 235 -304 -281 283 35 -514 -241 293 -22 -470 -96 245 -267 -465 140 156 -480
2673 -480 -379 274 66 -514 -242 335 -88 -495 41 296 -251 -465 138 210 -302 -323 231 59 -548 -80 466
2694D66m67m74N17L35n49j52N67O3o01J0O41j25n65K31N37l60m95N64L53n64k48
2715c16O11J58o62M0O44j61o51L28N41l33m93L82M57n31j77M78J34o41j9O36n2
2736C73o33K90M79l37m98M32L77n18l44O51J69n20oN38k21n52K92N75m02m99M86
2757A32L15n91k19P30%p14M9P08j69o90L18O14m39n38N40M22o49l27P37J29p56
2778c98l0P85j08p90K49O99l82n61N03M25n48m32O49K92o76j26O24j0o41J42O13
2799B79k36n90M40M49n47l09N89J77n63j32O03n3n02J81N50k96n98N65L00m84
2819a77l29O74J30o87N2O99j30o82K88O07l83n54N57M57o38l37P74J06p89M7P18
2840D03r7p16K70O52l70o24N64N27n54m90P85K42p85j55Q66m0q55J33Q23l02o48
$$ plain form
2694 466 -1 -475 42 377 -172 -324 243 306 -295 -285 356 231 -334 -103 434 74 -421 143 496 -68 -316
2715 -316 295 453 -209 -169 475 314 -337 -9 532 199 -294 88 545 14 -163 315 449 -192 -211 425 373
2736 373 -260 30 509 172 -326 106 483 -35 -379 272 441 -79 -85 453 232 -320 -28 547 145 -354 132
2757 132 447 -144 -363 367 367 -347 -298 410 241 -449 -131 483 44 -494 46 468 -181 -508 229 358 -398
2778 -398 -428 357 249 -541 -292 407 25 -536 -33 392 -156 -588 61 353 -323 -449 175 165 -476 -334 279
2799 279 43 -547 -107 342 -205 -514 75 252 -311 -443 160 107 -395 -214 336 40 -558 7 307 -177
2819 -177 -506 168 298 -389 -337 362 232 -450 -162 445 62 -492 65 522 -116 -453 321 427 -362 -315 403
2840 403 306 -410 -140 512 142 -482 82 609 55 -435 350 592 -193 -348 518 478 -377 -244 579 277 -371
2861c71M27N83n61n43O76M05o43k98P15o0n53J24O10k62o30M22M43m33l43N67
2881B75K50p13j56P56j5p08J17O79m19n43N27N42o58m19O96J92p25L6P00j50p61
2902d97K75P32m48o21N13N11o86l69Q25K76r76j01R18m6q89K83P77m16p81N54
2922a66O84o54m81O39L80p35k40Q49m1q54J48R19l25p43M20O05n25m65O06M49
2942D70p35k88P58J23p67P0P57l12o32M54O18n50m91N95L16o18j43P78j23q58
2962e78K82Q48l24p14M86N59o79m24R01K84q70j98Q91Jq18J65Q97m72q65O45P88
2983H05o65o89P82M60r40k20J074L5j046K7J053l29q56M76P91o71p12P81O35q62
$$ plain form
2861 -371 56 639 78 -465 211 616 -27 -325 390 330 -223 -99 511 249 -381 41 484 51 -292 275
2881 275 525 -188 -344 412 397 -311 -194 485 66 -477 50 592 -66 -485 211 403 -322 -286 414 264 -497
2902 -497 -222 510 62 -559 -46 465 -221 -590 235 511 -465 -566 352 306 -583 -300 477 61 -720 -166
2922 -166 518 -136 -617 22 402 -333 -573 276 235 -619 -471 448 123 -620 -200 405 -120 -585 21 470
2942 470 -265 -553 205 328 -439 -369 388 76 -556 -102 516 -34 -525 70 386 -232 -375 403 280 -578
2962 -578 -296 552 228 -486 0 559 -120 -544 357 641 -229 -427 464 465 -353 -188 709 237 -628 17 805
2983 805 140 -549 233 693 -247 -467 607 642 -404 -377 676 347 -509 -33 758 87 -625 156 791 -71
$$ [...]
8191D
##END NTUPLES=NMR FID
##END=
