##TITLE=1H_BAU-27PN
 CDCl3, 8 sc, 
 27.8.2019
##JCAMPDX= 6.0         $$ Bruker NMR JCAMP-DX V2.0
##DATA TYPE= NMR FID
##DATA CLASS= NTUPLES
##ORIGIN= UXNMR, Bruker Analytische Messtechnik GmbH
##OWNER= root
$$ XWIN-NMR		Version 3.5
$$ Tue Aug 27 14:38:35 2019 Russian Standard Time (UT+4h)  she@DPX200
##.OBSERVE FREQUENCY= 200.13155
##.OBSERVE NUCLEUS= ^1H
##.DELAY= (6, 6)
##.ACQUISITION MODE= SIMULTANEOUS
##.ACQUISITION SCHEME= undefined
##.AVERAGES= 8
##.DIGITISER RES= 18
##SPECTROMETER/DATA SYSTEM= spect
##.PULSE SEQUENCE= zg30
##.SOLVENT NAME= CDCl3
##.SHIFT REFERENCE= (INTERNAL, CDCl3, 0, 15.7039)
##AUDIT TRAIL= $$ (NUMBER, WHEN, WHO, WHERE, WHAT)
$$ ##TITLE= Audit trail, XWIN-NMR		Version 3.5
$$ ##JCAMPDX= 5.01
$$ ##ORIGIN= Bruker BioSpin GmbH
$$ ##OWNER= she
$$ F:/spectra/data/she/nmr/H-F/1/audita.txt
$$ ##AUDIT TRAIL=  $$ (NUMBER, WHEN, WHO, WHERE, WHAT)
(   1,<2019-08-27 14:37:25.35 +0400>,<she>,<DPX200>,
      <created by zg, POWCHK disabled, PULCHK disabled
       configuration hash MD5:
       00 E9 B6 7A A2 85 ED C7 34 08 36 98 17 FE 4E 26
       data hash MD5: 16K
       59 59 89 9F 25 5E B5 B4 1A 4D 4F 2B 13 36 78 DB>)
$$ ##END=
$$ 
$$ hash MD5
$$ 41 5C A4 27 5C 00 2E F1 22 64 B4 B5 C1 D3 00 19
##$RELAX= 
##$RELAX= 
##$RELAX= 
##$RELAX= 
##$RELAX= 
##$RELAX= 
$$ Bruker specific parameters
$$ --------------------------
##$DU= <F:/spectra>
##$EXPNO= 1
##$NAME= <H-F>
##$PROCNO= 1
##$TYPE= <nmr>
##$USER= <she>
##$AMP= (0..31)
100 100 100 100 100 100 100 100 100 100 100 100 100 100 100 100 100 100 
100 100 100 100 100 100 100 100 100 100 100 100 100 100 
##$AQSEQ= 0
##$AQ_mod= 1
##$AUNM= <au_zg>
##$AUTOPOS= <>
##$BF1= 200.13
##$BF2= 200.13
##$BF3= 200.13
##$BF4= 200.13
##$BF5= 200.13
##$BF6= 200.13
##$BF7= 200.13
##$BF8= 200.13
##$BYTORDA= 1
##$CFDGTYP= 0
##$CFRGTYP= 5
##$CHEMSTR= <none>
##$CNST= (0..31)
1 1 145 1 1 1 1 1 1 1 1 1 1 1 1 1 1 1 1 1 1 1 1 1 1 1 1 1 1 1 1 1 
##$CPDPRG= <>
##$CPDPRG1= <>
##$CPDPRG2= <>
##$CPDPRG3= <>
##$CPDPRG4= <mlev>
##$CPDPRG5= <mlev>
##$CPDPRG6= <mlev>
##$CPDPRG7= <mlev>
##$CPDPRG8= <mlev>
##$CPDPRGB= <>
##$CPDPRGT= <>
##$D= (0..31)
0 1.2 0 0 0 0 0 0 0 0 0 0.03 0 0 0 0 0 0 0 0 0 0 0 0 0 0 0 0 0 0 0 0 
##$DATE= 1566902244
##$DBL= (0..7)
120 120 120 120 120 120 120 120 
##$DBP= (0..7)
150 150 150 150 150 150 150 150 
##$DBP07= 0
##$DBPNAM0= <>
##$DBPNAM1= <>
##$DBPNAM2= <>
##$DBPNAM3= <>
##$DBPNAM4= <>
##$DBPNAM5= <>
##$DBPNAM6= <>
##$DBPNAM7= <>
##$DBPOAL= (0..7)
0.5 0.5 0.5 0.5 0.5 0.5 0.5 0.5 
##$DBPOFFS= (0..7)
0 0 0 0 0 0 0 0 
##$DE= 6
##$DECBNUC= <off>
##$DECIM= 24
##$DECNUC= <off>
##$DECSTAT= 4
##$DIGMOD= 1
##$DIGTYP= 9
##$DL= (0..7)
0 120 120 120 120 120 120 120 
##$DP= (0..7)
150 150 150 150 150 150 150 150 
##$DP07= 0
##$DPNAME0= <>
##$DPNAME1= <>
##$DPNAME2= <>
##$DPNAME3= <>
##$DPNAME4= <>
##$DPNAME5= <>
##$DPNAME6= <>
##$DPNAME7= <>
##$DPOAL= (0..7)
0.5 0.5 0.5 0.5 0.5 0.5 0.5 0.5 
##$DPOFFS= (0..7)
0 0 0 0 0 0 0 0 
##$DQDMODE= 0
##$DR= 18
##$DS= 0
##$DSLIST= <SSSSSSSSSSSSSSS>
##$DSPFIRM= 0
$$ [...]
##$SUBNAM2= <"">
##$SUBNAM3= <"">
##$SUBNAM4= <"">
##$SUBNAM5= <"">
##$SUBNAM6= <"">
##$SUBNAM7= <"">
##$SUBNAM8= <"">
##$SUBNAM9= <"">
##$SW= 24.9336996594482
##$SWIBOX= (0..15)
0 0 2 0 0 0 0 0 0 0 0 0 0 0 0 0 
##$SW_h= 4990.01996007984
##$TD= 16384
##$TD0= 1
##$TE= 0
##$TE2= 300
##$TE3= 300
##$TEG= 300
##$TL= (0..7)
0 120 120 120 120 120 120 120 
##$TP= (0..7)
150 150 150 150 150 150 150 150 
##$TP07= 0
##$TPNAME0= <>
##$TPNAME1= <>
##$TPNAME2= <>
##$TPNAME3= <>
##$TPNAME4= <>
##$TPNAME5= <>
##$TPNAME6= <>
##$TPNAME7= <>
##$TPOAL= (0..7)
0.5 0.5 0.5 0.5 0.5 0.5 0.5 0.5 
##$TPOFFS= (0..7)
0 0 0 0 0 0 0 0 
##$TUNHIN= 0
##$TUNHOUT= 0
##$TUNXOUT= 0
##$USERA1= <user>
##$USERA2= <user>
##$USERA3= <user>
##$USERA4= <user>
##$USERA5= <user>
##$V9= 5
##$VALIST= <valist>
##$VCLIST= <CCCCCCCCCCCCCCC>
##$VD= 0
##$VDLIST= <DDDDDDDDDDDDDDD>
##$VPLIST= <PPPPPPPPPPPPPPP>
##$VTLIST= <TTTTTTTTTTTTTTT>
##$WBST= 1024
##$WBSW= 4
##$XGAIN= (0..3)
0 0 0 0 
##$XL= 0
##$YL= 0
##$YMAX_a= 500357
##$YMIN_a= -600746
##$ZGOPTNS= <>
##$ZL1= 120
##$ZL2= 120
##$ZL3= 120
##$ZL4= 120
##$ABSF1= 10
##$ABSF2= 0
##$ABSG= 5
##$ABSL= 3
##$ALPHA= 0
##$AQORDER= 0
##$ASSFAC= 0
##$ASSFACI= 0
##$ASSFACX= 0
##$ASSWID= 0
##$AUNMP= <proc_1d>
##$AZFE= 0.1
##$AZFW= 0.1
##$BCFW= 1
##$BC_mod= 2
##$BYTORDP= 1
##$COROFFS= 0
##$CY= 11.3945322036743
##$DATMOD= 1
##$DC= 2
##$DFILT= <>
##$DTYPP= 0
##$F1P= 20.1720416913024
##$F2P= 0.152960286110954
##$FCOR= 0.5
##$FTSIZE= 0
##$FT_mod= 4
##$GAMMA= 1
##$GB= 0.15
##$INTBC= 1
##$INTSCL= 1
##$ISEN= 128
##$LB= 0.24
##$LEV0= 0
##$LPBIN= 0
##$MAXI= 10000
##$MC2= 0
##$MEAN= 0
##$ME_mod= 0
##$MI= 1.114404
##$NCOEF= 0
##$NC_proc= 0
##$NLEV= 6
##$NOISF1= 3.799351
##$NOISF2= 2.8
##$NSP= 1
##$NTH_PI= 0
##$NZP= 0
##$OFFSET= 15.70392
##$PC= 1
##$PHC0= -9215.316
##$PHC1= 18.00096
##$PH_mod= 1
##$PKNL= yes
##$PPARMOD= 0
##$PSCAL= 0
##$PSIGN= 0
##$REVERSE= no
##$SF= 200.130013532006
##$SI= 16384
##$SIGF1= 3
##$SIGF2= 2
##$SINO= 400
##$SIOLD= 16384
##$SREGLST= <1H.CDCl3>
##$SSB= 0
##$STSI= 0
##$STSR= 0
##$SW_p= 3612.71676300578
##$SYMM= 0
##$S_DEV= 0
##$TDeff= 0
##$TDoff= 0
##$TI= <>
##$TILT= no
##$TM1= 0
##$TM2= 0
##$TOPLEV= 0
##$USERP1= <user>
##$USERP2= <user>
##$USERP3= <user>
##$USERP4= <user>
##$USERP5= <user>
##$WDW= 1
##$XDIM= 8192
##$YMAX_p= 0
##$YMIN_p= 0
$$ End of Bruker specific parameters
$$ ---------------------------------
##NTUPLES= NMR FID
##VAR_NAME=  TIME,          FID/REAL,        FID/IMAG
##SYMBOL=    X,             R,               I
##VAR_TYPE=  INDEPENDENT,   DEPENDENT,       DEPENDENT
##VAR_FORM=  AFFN,          ASDF,            ASDF
##VAR_DIM=   8192,          8192,            8192
##UNITS=     SECONDS,       ARBITRARY UNITS, ARBITRARY UNITS
##FACTOR=    0.0002004,     1,               1
##FIRST=     0,             0,               0
##LAST=      1.6414764,     0,               0
##MIN=       0,             -600746,         0
##MAX=       1.6414764,     500357,          0
$$ Real data points
##PAGE= N=1
##DATA TABLE= (X++(R..R)), XYDATA
0 0 0 0 0 -8 8 -8 8 -16 24 -25 32 -40 56 -65 79 -96 113 -137 161 -186 224 -262 299 -346 402 -459 523
27 523 -591 672 -762 856 -962 1081 -1210 1352 -1503 1673 -1863 2066 -2285 2534 -2806 3107
43 3107 -3438 3808 -4226 4694 -5225 5838 -6548 7382 -8384 9604 -11144 13146 -15863
56 -15863 19795 -26020 37398 -64989 269994 115131 -451292 35565 284689 -18686 -121093
67 -121093 381739 406276 -134364 -290909 144219 186027 -105452 72606 490744 163525
77 163525 -458322 -287845 350001 307201 -135235 -45005 277616 6169 -386148 -121949
87 -121949 311214 150690 -136126 24737 118073 -257079 -367486 152702 423124 -37173
97 -37173 -361559 -50151 142730 -175186 -263716 151958 289042 -111671 -304816 -55318
107 -55318 22096 -152054 -25957 263994 77826 -347196 -254353 152388 123567 -168823 -61008
118 -61008 217833 41994 -304782 -185940 153214 136016 -49272 9238 71664 -130772 -215934
129 -215934 68581 246655 16143 -158175 23323 125797 -96747 -188701 84615 252880
139 252880 40142 -153402 -59138 39944 -21527 -5852 125393 89987 -97394 -106534 54073
150 54073 58850 -73674 -27084 143713 90383 -137349 -158627 42266 120291 7505 -43647
161 -43647 13349 -4034 -80000 -44763 52541 34981 -41087 -13635 39229 -37564 -124828 -30739
173 -30739 116394 69055 -90692 -100070 18600 36922 -44386 -38955 45805 38167 -47213 -52149
185 -52149 8953 3147 -29279 26646 78561 -9910 -104919 -22241 102308 48416 -67045 -16075
197 -16075 94241 38718 -75426 -23730 90892 57502 -26402 15234 68393 -6286 -50573
208 -50573 59635 119728 -2240 -71492 52841 119947 -12497 -81853 55804 133509 5161
219 5161 -72471 32896 84764 -16089 -38790 69567 69289 -55116 -48360 78189 54256 -82588
231 -82588 -48906 96595 57214 -100041 -72020 71845 41745 -85553 -46833 63752 5516
242 5516 -101160 -33503 61552 -18664 -103143 -6259 73132 -41780 -125632 -6070 81054 -30676
254 -30676 -106233 2389 63963 -43675 -90218 20896 60708 -42156 -60848 43580 44495
265 44495 -63735 -46925 75630 61436 -58229 -38894 75600 51841 -53134 -16435 88522
276 88522 51551 -44326 -3867 77849 29637 -37994 25440 90442 17018 -49797 21074 81555
288 81555 9328 -42476 30633 72472 -7888 -51522 19154 52058 -14964 -37266 22724 26056
300 26056 -44804 -48128 19707 16977 -50414 -47125 10584 -6544 -69741 -53156 8070 -8562 -65852
313 -65852 -52215 -8594 -30466 -69311 -40532 -1769 -29962 -66242 -40142 -10436 -35439 -55687
325 -55687 -21656 1947 -29409 -50846 -21092 243 -19614 -26630 968 8403 -16393 -19826 7916
338 7916 17034 1134 3795 23952 21706 2427 8607 33741 36005 20751 23606 37969 33380 21069
352 21069 29660 46998 44241 31623 32519 40094 36640 31398 37460 44867 39828 29659 28552 32169
366 32169 31095 28953 31322 31126 23963 17771 17672 18724 18102 17307 15999 11395 5166 2073 2802 5281
382 5281 4185 641 -2249 -5398 -8917 -11212 -9097 -5897 -7463 -12747 -17315 -16565 -15501 -16776 -16593 -12570
398 -12570 -13381 -20147 -23517 -18908 -15057 -16779 -17416 -14436 -15312 -20387 -21107 -14851 -10760 -12680 -14076 -12047
414 -12047 -12392 -15543 -13016 -6453 -5226 -8594 -7949 -6153 -8814 -8735 -2395 1624 -2189 -5293 -1817 -272
430 -272 -4683 -3962 4781 6688 -2005 -5820 1547 3551 -2272 -1631 5824 4466 -5107 -4534 2242 175
446 175 -4699 691 5240 -4004 -11893 -3523 3885 -5127 -11018 -1099 2570 -11491 -16326 -1663 2137
461 2137 -12279 -13076 1599 -1951 -20346 -14850 7016 1919 -19680 -13585 8153 364 -20612 -9437
475 -9437 13798 3867 -16501 -3029 14547 -1350 -12961 11593 25084 -3137 -14681 18005
487 18005 31506 -974 -10240 27506 37463 -353 -7563 30474 37010 1466 3684 40134 30260
500 30260 -9398 7944 51731 31075 -15863 7440 54018 26358 -22307 7211 53732 22181
512 22181 -22993 6423 41073 4745 -22601 20292 38611 -17731 -37049 23532 38345 -29446
524 -29446 -43536 25488 34242 -42207 -53502 18602 28033 -38735 -42407 14689 1531 -56266 -30126
537 -30126 32607 -2048 -68000 -28889 35313 -11074 -75244 -20037 50716 -1485 -72031 -27213
549 -27213 32180 -7303 -44501 8338 35211 -29125 -51822 21174 42808 -28722 -36251 46433
561 46433 50244 -44554 -54243 43843 67273 -10974 -27431 33495 29634 -28794 -7380 59248 35951
574 35951 -26964 230 51004 4468 -49456 14784 88164 29767 -57077 -24488 43697 19332
586 19332 -23025 13494 44324 -6225 -44152 -3673 21840 -13921 -14352 39646 26997 -61464
598 -61464 -74421 15998 54788 -8640 -45738 -6341 5793 -40558 -48218 4337 26516 -6059
610 -6059 -24450 -19477 -37406 -50944 -3655 49986 19061 -54597 -58210 -2716 10804 -21315 -15969
623 -15969 27440 25115 -31518 -58890 -21386 22787 30550 20937 6239 -25431 -46959 -11473 45903
636 45903 42790 -5899 -9946 24640 8763 -45330 -23034 68344 87060 1735 -52510 -13008
648 -13008 23606 13825 26527 61676 30281 -37886 -24680 38147 25660 -16392 33549 95103
660 95103 17489 -96550 -47693 82885 79593 -12101 -9627 39249 -8257 -63283 7783 83171
672 83171 23416 -37290 20676 40033 -67342 -87467 69359 134943 -17879 -117131 -9081
683 -9081 62805 -30768 -61546 57356 79839 -55743 -90496 19648 28657 -63247 -12853 110765
695 110765 28330 -150302 -91901 98047 71108 -84361 -44373 87298 12939 -129668 -49809
706 -49809 97223 36267 -70084 4892 64299 -68473 -126296 56459 152457 -26601 -136222
717 -136222 18281 101382 -54814 -111827 68596 133423 -41988 -112124 26098 57770 -62555
728 -62555 -29932 121996 58494 -135509 -84502 112369 69587 -104807 -38780 131399 41363
739 41363 -146323 -69079 111705 54736 -78848 -5532 81017 -44847 -128951 34341 136114
750 136114 -27734 -126392 31889 105380 -72532 -137750 60152 142712 -39511 -125364 18360
761 18360 66247 -60669 -56050 92233 64466 -103915 -74741 88519 49360 -101461 -31795
772 -31795 132306 50452 -131924 -68141 106614 65042 -67045 -11446 86690 -950 -92861
783 -92861 14812 109743 4628 -72497 40527 95752 -43404 -100935 56502 135582 -5604
794 -5604 -89610 20193 76382 -22947 -48870 60559 74705 -38587 -51625 47156 39032 -55800
806 -55800 -19684 92541 46084 -88949 -62835 65195 53697 -49490 -31335 53410 17044
817 17044 -69586 -31924 48214 15435 -44854 -1518 40755 -30563 -80227 5400 74882 -521
829 -521 -74798 -16551 43493 -12201 -60880 917 52249 -2273 -51755 -11512 18997 -19219
841 -19219 -25384 32427 36133 -38770 -54934 19436 44140 -18653 -35933 26337 40577 -27727
853 -27727 -49095 15180 44022 -2003 -20484 15941 14175 -30016 -18182 40304 33773 -27200
865 -27200 -24615 31509 23083 -36203 -22256 45715 39466 -30418 -34813 21806 24066 -19892 -8308
878 -8308 34735 12084 -37494 -14730 35530 10604 -34182 -571 44942 2208 -52962 -11342
890 -11342 48027 13741 -38734 -6670 35062 -5010 -41944 4161 41260 -6543 -39473 9522
902 9522 33450 -22893 -43269 22272 45302 -22181 -47892 14892 35543 -23767 -36380 23988
914 23988 31367 -29992 -34118 24307 21855 -33258 -21131 36180 16993 -44603 -22978 39370 17372
927 17372 -40696 -15149 39650 10166 -42029 -9927 39730 7362 -35688 432 38099 -3440
939 -3440 -37269 9434 42451 -4715 -34410 13874 39286 -9271 -31081 19445 38300 -10125
951 -10125 -25270 21210 30506 -14827 -18312 27939 26861 -19590 -15975 29046 21098 -22433 -11420
964 -11420 31415 16825 -25228 -10672 28031 10840 -24174 -5604 26242 3946 -27314 -4045
976 -4045 24037 -339 -26167 -924 21059 -6633 -27317 480 19036 -8410 -24064 2577
988 2577 14237 -12721 -21782 5350 13470 -13197 -19061 6737 10031 -14832 -14973 10901 10340 -14834
1002 -14834 -12837 11431 8456 -13365 -8041 13426 7467 -12765 -5532 13282 6955 -10022 -2172
1015 -2172 13765 4795 -9985 -461 13984 4115 -8731 806 11509 1553 -8457 2115 10617
1028 10617 337 -8200 1822 8056 -1912 -7937 2269 7043 -4324 -8435 1601 5174 -5606
1041 -5606 -7983 2360 3706 -6569 -8073 1919 3225 -6097 -6264 1810 2043 -5774 -4856 2730 2288
1056 2288 -4597 -3437 2541 1507 -3337 -872 3765 1580 -2147 596 4561 1658 -817 2342 5134
1071 5134 2285 -31 2947 5014 2403 665 3047 4362 1900 494 2820 3509 1719 919 1737 2278
1087 2278 1098 158 336 1487 968 -815 -1261 -234 406 -858 -2339 -1102 -206 -1576 -2858 -1507
1103 -1507 -379 -2070 -3272 -1140 -380 -2929 -3659 4 -11 -2989 -2940 855 410 -2603 -1938 1548 597
1120 597 -1982 26 3116 264 -2642 1732 5078 162 -3337 2359 6194 255 -3457 2225 5391
1135 5391 -61 -2596 2714 3252 -1693 -1197 4452 1607 -4712 -1027 5770 372 -6881 -1433 6051
1150 6051 -150 -7835 -1212 4726 -2772 -6680 1495 3415 -6288 -6916 4293 3898 -9049 -7390 7361
1165 7361 5495 -9676 -7457 7393 5191 -7645 -3513 8563 1742 -8038 1900 10431 -1852 -9104
1179 -9104 7079 14172 -4425 -11844 8627 16944 -3363 -10505 8318 13298 -5262 -6951 11750
1192 11750 9725 -9252 -3779 15202 5397 -16459 -2593 20743 5897 -19951 -6102 17812
1204 17812 3717 -17789 -2224 15328 -2680 -17356 2035 12075 -11157 -16161 11810 13870
1216 13870 -19922 -23033 13344 17894 -17394 -20693 12540 12914 -18819 -15959 13844 8630 -16639
1229 -16639 -5765 17607 -1866 -25253 1287 29220 1161 -28311 -1269 26772 610 -23639
1241 -23639 3720 26121 -31 -18388 5626 15834 -8159 -9603 21110 17396 -20760 -18079
1253 -18079 22700 20879 -17802 -15016 22341 17520 -20161 -16703 16535 13601 -10786 -3329 12689
1266 12689 -4897 -21562 4105 24417 -2545 -24842 938 20605 -6636 -26256 1928 24115
1278 24115 699 -19903 -5683 5889 -5608 -4706 11996 6372 -16960 -12335 11844 7948 -14927
1291 -14927 -7438 18826 12108 -17625 -18600 7261 15867 2897 -3231 -362 -3062 -5767 2878 8440
1305 8440 1296 -2747 4635 5963 -7307 -12988 2050 18961 12499 -7846 -15568 -3459 9168
1318 9168 7355 -1497 -758 5446 1197 -8911 -7368 3814 8271 6760 5412 -3261 -16641 -10499
1332 -10499 15971 22877 -2735 -17107 3216 14329 -7907 -15880 13041 27961 889 -18417
1344 -18417 -2784 6681 -4190 4859 27017 10407 -26907 -16120 23573 16640 -18472 -3829
1356 -3829 34380 12181 -36676 -21378 27495 21457 -11983 -665 16968 -14525 -34586 10058
1368 10058 38789 -5477 -33529 8653 26578 -28283 -45389 21149 49232 -13278 -46888 -957
1380 -957 16612 -24416 -20837 32922 21682 -42418 -35006 24923 11641 -41752 -10451 52426 11955
1393 11955 -65038 -34440 41620 22296 -33282 -4379 37247 -10592 -54130 2060 50127 -740
1405 -740 -36283 18922 39056 -34710 -54448 34259 68557 -11933 -48687 16180 35153 -27522
1417 -27522 -28344 46261 45549 -31498 -32235 31331 18625 -38944 -3980 66419 22579 -61711 -29191
1430 -29191 49310 23002 -38004 -923 51858 193 -58130 -7641 47500 3403 -33464 17748
1442 17748 38201 -33824 -57185 25385 59045 -15339 -46671 18050 33654 -35013 -41286 34673
1454 34673 45490 -24718 -34247 21291 14300 -37326 -10351 53241 22399 -49155 -24517 39710
1466 39710 15265 -37754 -2025 51669 10523 -47911 -13125 38102 9453 -24522 12624 35934
1478 35934 -15777 -42321 13522 43814 -6323 -30846 17500 32391 -22976 -38037 19386 39670
1490 39670 -9045 -27751 10997 15365 -23539 -18031 26782 21187 -25273 -20976 18913 8883 -29787
1503 -29787 -12424 31168 14607 -31569 -22144 17456 9016 -21157 -6547 21301 1118 -28569
1515 -28569 -8996 19060 696 -21262 2164 22212 -6348 -30708 -2039 25178 2451 -20911
1527 -20911 -693 17661 -4953 -21683 2207 20602 -1148 -15573 4415 13136 -10594 -16723
1539 -16723 12934 22253 -8065 -19764 7084 16580 -9013 -15250 13212 19591 -9431 -17830 7600
1552 7600 13755 -8997 -8883 16423 12703 -16875 -14350 15630 14311 -13275 -8764 18107 10854 -19318
1566 -19318 -12278 18160 13960 -12781 -6751 15969 4280 -18208 -3145 22183 6845 -18156
1578 -18156 -2893 17860 -505 -19910 2097 24055 730 -22010 -1262 17906 -2826 -17600
1590 -17600 6216 19149 -7925 -22118 4908 17464 -8699 -16780 10339 15266 -15351 -20477
1602 -20477 11268 16238 -12662 -15061 11381 9677 -17550 -12906 16085 11217 -16578 -10376 15210
1615 15210 5549 -18117 -4129 21107 6323 -18974 -4132 19073 3791 -15175 3015 21725
1627 21725 1491 -16627 3620 21187 1891 -11995 9035 19953 -3308 -13387 10918 20824
1639 20824 -2103 -10307 11245 15696 -6901 -8931 13899 15931 -7444 -9236 11865 9965 -10176
1652 -10176 -6198 13884 7798 -13695 -8067 10511 4024 -13545 -5378 10598 -472 -17409 -6605
1665 -6605 9129 -1235 -15526 -4932 6887 -6355 -17834 -3731 7259 -5950 -15665 -3030
1677 -3030 4320 -8780 -13951 538 5816 -8355 -13162 255 4166 -8198 -9235 4381 4994 -9160
1691 -9160 -8582 4832 4905 -6551 -4271 7575 4080 -7745 -3548 8436 4921 -5110 -878 8288
1705 8288 3053 -5904 697 9855 3697 -4280 1357 7717 1030 -4224 2998 7934 615 -4066 2279
1720 2279 5822 -674 -2607 3782 5656 -1872 -3214 3193 4220 -1980 -2133 3711 3074 -2854 -2194 3434
1736 3434 2618 -1993 -548 3251 1661 -2347 -125 3792 2358 -1079 465 3275 1373 -373 1612
1751 1612 3175 1526 355 2239 2363 1104 1184 2748 2807 1062 1365 2535 2109 1308 1782 1720 1109 1332
1769 1332 1786 1312 958 1331 1484 429 -81 1216 575 -808 -135 1165 135 -2172 -515 1530 -782
1786 -782 -3023 -611 1520 -1360 -3734 -1212 1344 -2002 -4022 -988 620 -3034 -3896 -245 -31 -4203
1802 -4203 -4123 837 -361 -5385 -4192 1108 -627 -5641 -3563 1319 -1246 -5786 -2122 1353 -2933
1817 -2933 -5960 -420 2105 -4067 -6560 171 2834 -4499 -6396 690 2438 -4776 -5060 1993 1276
1832 1276 -4586 -2954 3424 382 -5965 -553 5565 -204 -6281 400 6839 -97 -5219 2202 6960
1847 6960 -185 -3507 4956 6391 -2210 -1332 7574 6222 -3508 -903 9848 6370 -4384 -69 10394
1862 10394 5633 -4265 956 9476 2919 -3517 3768 8912 -1333 -5443 6174 8855 -4423 -6722
1876 -6722 7036 8320 -6119 -7692 5892 6100 -7291 -5823 5760 1716 -10027 -3296 7687
1889 7687 -1368 -12601 -2165 8637 -3848 -13997 -1284 9460 -3614 -13177 -348 6782 -5192
1902 -5192 -9095 4381 5781 -8758 -7675 8418 6025 -10527 -5477 12346 7002 -11530 -5651
1915 -5651 12922 7684 -7740 -830 12230 2925 -8229 4177 14021 402 -7815 7708 14345
1928 14345 -3996 -10071 9744 16570 -2424 -9006 6906 10371 -4370 -4778 10426 7654 -7796
1941 -7796 -3470 9759 2410 -11418 -224 14487 1631 -15754 -5042 10630 1971 -10303 -1014
1954 -1014 7258 -4204 -11997 -735 5542 -4905 -7363 4290 2870 -12998 -11594 6272 7718
1967 7718 -7167 -9262 2031 862 -8732 -5485 5371 2289 -6039 -3163 969 -5552 -7555 4151
1981 4151 9439 -2306 -10538 -2655 3836 -904 -3205 3019 4702 -2273 -5380 -2054 -1035 530 5022
1996 5022 5102 -3360 -8599 -2005 4206 2441 133 2053 857 -3633 -3765 28 922 2446 6263 2450
2012 2450 -8078 -8647 3747 8576 1386 -1867 2869 741 -6345 -2541 7325 5105 -1115 2714 4718
2027 4718 -6175 -9940 7040 16658 1380 -9900 1464 8208 -3792 -6649 9922 13586 -3557
2040 -3557 -8271 5123 4554 -7925 595 18786 7755 -15811 -8609 14159 7186 -10716 312
2053 312 17541 2267 -17302 -3020 15379 2365 -9546 7818 14074 -10689 -18982 9952 20699
2066 20699 -6209 -15102 10877 14433 -14299 -16322 15634 18192 -10694 -11660 12301 6137 -18633
2079 -18633 -4684 23769 8085 -21697 -6707 20051 1618 -22627 882 26005 928 -25456
2091 -25456 -2743 18423 -4206 -18541 9074 19280 -13575 -24456 8951 17932 -14749 -18713
2103 -18713 15587 15360 -23098 -22960 14411 14940 -18326 -14690 15251 4707 -25613 -11627 19612
2116 19612 4773 -23847 -6410 18488 -3857 -28185 -1917 24986 -610 -25396 -1315 18185
2128 18185 -6513 -21151 8186 21850 -7880 -20122 8612 16719 -11829 -13968 18419 19664
2140 19664 -14578 -16588 16004 16996 -11359 -7912 20285 13042 -15957 -8036 19471 11174 -12328
2153 -12328 189 20903 3170 -18349 243 22902 5659 -14935 2302 17750 -2043 -16736
2165 -16736 4674 19567 -1045 -14528 3699 12193 -7789 -12621 10149 14166 -9415 -15016 5984
2178 5984 9741 -10063 -10206 10204 9349 -12379 -12730 6688 6814 -8934 -5874 9618 3317 -13593
2192 -13593 -6799 10674 5500 -9769 -3273 9669 817 -12231 -2573 12395 4752 -9113 -2713
2205 -2713 8423 348 -8465 1897 12194 1407 -9793 -462 9271 81 -7132 4081 11148
2218 11148 -1638 -10540 875 10058 856 -6312 3239 7994 -3679 -9014 3828 9512 -2139
2231 -2139 -7236 3529 6101 -6425 -7904 6312 9065 -5295 -8754 3958 5398 -6790 -6486 7559
2245 7559 6344 -8321 -8115 5987 5061 -7592 -4131 8752 3734 -10846 -5854 8611 4397 -7961
2259 -7961 -2757 8843 1012 -11087 -2568 10505 2059 -9513 -1020 7911 -2093 -10462 1318
2272 1318 10688 -1599 -10864 523 7939 -3845 -9600 3909 9127 -5603 -11293 2872 7215
2285 7215 -5793 -7879 5841 6493 -8483 -8901 5981 6586 -7257 -6109 6796 4046 -9599 -5599
2299 -5599 8684 4793 -8334 -3345 7819 1651 -9097 -989 10554 2309 -8633 -725 8715
2312 8715 57 -7636 2667 10623 -683 -8565 2011 9232 -1346 -6260 4995 8731 -4046
2325 -4046 -7689 4643 7731 -2915 -5075 5621 5922 -5776 -5541 6098 6143 -5070 -4263 5646 3481
2340 3481 -6616 -2920 7555 3415 -6330 -2543 5976 1813 -5946 -137 7557 1138 -6898 -274
2354 -274 6642 667 -5268 2138 7249 -774 -5970 2205 7302 238 -3581 3528 5900 -1910 -3922
2369 -3922 4366 7026 -930 -2925 3955 4010 -2698 -1911 5262 4475 -2899 -2825 3670 1979 -3923 -1290
2385 -1290 4545 1084 -5547 -2787 2407 -175 -4675 -1525 2258 -2494 -6555 -2223 1750 -1959 -5621
2400 -5621 -1752 159 -4054 -6240 -1391 845 -3699 -5208 -1449 -947 -4469 -3906 50 412 -3563 -3584
2416 -3584 -124 -480 -3094 -1581 1446 258 -2758 -1045 1488 918 -992 940 2249 313 -935
2431 -935 836 2453 1411 615 1730 1767 846 568 2088 2102 1402 1551 1227 868 808 1890 2267 1174 1020
2450 1020 754 719 75 885 1671 878 -142 864 807 -381 -27 1208 1288 -646 -510 798 125 -1224
2468 -1224 -123 1563 330 -1484 -132 1488 -221 -1504 1406 2237 -703 -1775 1450 2526 -913
2483 -913 -1527 1647 2417 -1337 -1510 2743 2016 -1780 -230 2587 1314 -2532 90 3409 366 -3070
2499 -3070 428 2950 -425 -3045 787 3016 -1311 -2978 1234 2357 -2446 -2906 2283 1952 -3486
2514 -3486 -3235 2695 1425 -4356 -2260 2740 711 -4065 -1745 2971 109 -4135 -272 3219 -1157
2529 -1157 -4051 1086 3946 -2150 -3744 2319 3687 -2440 -2901 3394 3227 -3025 -2051 3897 2317 -3590
2545 -3590 -685 4738 1254 -4650 -16 5477 355 -5037 662 5005 -1229 -4784 1431 4132 -2400
2560 -2400 -4447 2558 2941 -4193 -3398 3932 2233 -5721 -3470 4647 1254 -6252 -2357 4557 218
2575 218 -6189 -785 5021 -1199 -5665 1081 4721 -2690 -5715 2505 5591 -3543 -5246 3767 4809
2590 4809 -3864 -3852 5071 4422 -4219 -2280 5920 2388 -4971 -444 7103 1302 -6170 846 7596 -41
2606 -41 -5897 1773 7284 -1335 -6085 2465 5894 -2564 -4709 3878 4540 -5191 -4870 5082 3616 -5669
2622 -5669 -3424 5559 2106 -7062 -2885 5527 1235 -5958 -1372 4847 -1498 -6017 1373 5686 -2020
2637 -2020 -6055 2110 5244 -3554 -5041 3913 5852 -3256 -3813 3809 3500 -3124 -1384 5758 2764
2652 2764 -3534 -144 5959 1528 -3448 1778 6591 539 -4168 1521 5499 584 -1885 3067 3590
2667 3590 -1872 -2159 3431 3221 -2356 -1229 3752 1109 -4307 -1467 3745 1147 -3697 -1456 1840
2682 1840 -1685 -3920 197 1962 -2692 -3519 853 5 -4487 -2718 2641 723 -4417 -2860 1175
2697 1175 -824 -3985 -257 2495 -2174 -4313 655 1702 -3173 -2966 3551 2728 -3943 -3279 2984 2070
2713 2070 -3182 -233 4668 259 -4817 285 4931 -746 -4273 2827 5313 -3224 -5662 3723 5849
2728 5849 -2989 -4181 4429 3685 -5669 -3709 6127 3497 -6043 -2333 6258 675 -7578 -836 8410
2743 8410 689 -7974 -337 7261 -1463 -7640 3010 8096 -2810 -7617 3577 6904 -4523 -5504
2757 -5504 7244 7200 -6869 -6240 7877 6280 -6522 -3344 9465 4417 -8638 -2608 10151 3488
2771 3488 -7522 451 10080 285 -9736 1633 11133 -465 -8826 3136 9260 -4187 -9179
2784 -9179 5242 9574 -4890 -8546 5484 6362 -7924 -6178 8558 6180 -9510 -6727 7765
2797 7765 3702 -9842 -3480 10002 2438 -11261 -3963 8716 1004 -9369 311 9568 -2322
2810 -2322 -11175 1132 9913 -1870 -8274 3677 8263 -5333 -9305 5431 8975 -4101 -6765
2823 -6765 5818 5744 -7245 -5599 8345 6734 -6731 -4900 7208 3257 -7718 -2120 9388 3757
2837 3757 -7818 -3375 6845 1325 -6808 820 8560 -1085 -9387 -971 6483 -888 -6235 2224
2851 2224 5863 -4554 -8447 1598 6370 -2230 -5422 2883 3261 -5953 -6203 4240 5833 -3556 -4243
2866 -4243 3225 1873 -5140 -2561 6552 4273 -4675 -3855 3534 1905 -3391 447 6583 2450 -5062
2881 -5062 -2380 4235 2015 -2203 1706 5126 -427 -5060 -774 5200 2234 -2159 944 3408 -1762
2896 -1762 -4903 1406 5513 1026 -3979 -460 2099 -2291 -3306 2155 4620 -1456 -5250 -1438 1871
2911 1871 -1597 -2336 2226 2879 -3701 -5433 587 3034 -776 -1869 2098 1354 -4352 -3645 3431 4085
2927 4085 -1127 -2448 1652 816 -3419 -1116 5294 3763 -3000 -2611 2681 1550 -2104 732 5487
2942 5487 1887 -4689 -1880 3776 2614 -1684 1508 4373 -1011 -4798 -96 5392 1807 -2641 257
2957 257 2346 -2695 -4185 2318 5295 -492 -4845 -413 1828 -2783 -2705 3748 3526 -3515 -5720 386
2973 386 2347 -1923 -1321 3787 1561 -5726 -4344 2871 3485 -1740 -1046 2814 -545 -5809 -1650 5501
2989 5501 3592 -2827 -1625 1828 -1292 -3669 1874 6352 1337 -4334 -1427 2257 -736 -1327 3755
3004 3755 4938 -1781 -5500 -899 3160 88 -741 2889 2113 -4665 -5117 1882 3764 -594 -1700 1349
3020 1349 -558 -5272 -2993 3823 3894 -2034 -2710 375 -1022 -4098 181 5074 1845 -3990 -2846 772
3036 772 -343 -1893 2228 4251 -469 -4799 -1293 2833 984 -163 2499 3291 -2644 -3973 1307
3051 1307 4651 1416 -544 1835 1295 -2862 -2138 3716 4503 67 -1205 707 159 -2359 29 4092
3067 4092 2163 -2252 -1870 482 -149 -1521 1283 3156 -155 -3645 -1758 1307 -94 -1180 1165
3082 1165 1425 -2152 -3653 64 1604 -451 -1116 589 226 -2783 -2290 1206 1782 -561 -688 337
3098 337 -342 -1831 322 2345 1361 -833 -294 726 -283 -336 1342 2419 204 -1094 158 688 -234
3115 -234 618 1577 1207 -912 -680 619 585 -183 363 1051 -537 -1294 -124 259 -289 -455 250 -444 -1587
3134 -1587 -1047 559 -103 -867 -180 214 -1108 -1539 12 686 -799 -1186 286 139 -1509 -1074 926
3151 926 587 -1127 -638 1083 496 -1258 64 2059 304 -1465 629 2226 -108 -977 1289 2168
3167 2168 -614 -943 1719 1955 -793 -517 2085 1526 -1676 -722 2468 1257 -1884 -439 2340 291
3183 291 -2545 -146 2039 -514 -2377 327 1805 -1326 -2703 1033 1492 -1907 -2505 1001 1242 -2417
3199 -2417 -1994 1928 1178 -2751 -1638 2200 494 -2918 -583 2839 70 -2543 149 3172 -320
3214 -320 -2822 907 3216 -939 -2225 1803 2702 -1184 -1790 2783 2672 -1923 -1307 3219 1792 -2369
3230 -2369 -696 3407 997 -2958 -148 3323 172 -3086 290 3150 -837 -3349 932 2924 -1935
3245 -1935 -2982 1591 2242 -2652 -2697 2239 1591 -3100 -2538 2604 651 -3716 -1278 2906 20 -4012
3261 -4012 -325 3426 -854 -3615 986 3543 -1344 -3230 2172 3200 -1740 -2750 2930 3248 -2445
3276 -2445 -1865 3262 2389 -2888 -1107 4542 2131 -3176 -246 4389 305 -3625 666 3946 -445
3291 -445 -3474 927 3638 -1783 -3384 1880 3170 -2601 -3372 2054 2534 -3277 -2506 3129 1287 -4019
3307 -4019 -2031 3255 369 -4325 -901 3616 -497 -4244 -140 3172 -936 -4175 1155 3480 -2001
3322 -2001 -3360 1858 3102 -1838 -2811 2711 2423 -2965 -1634 3833 2383 -2933 -898 3836 1153
3337 1153 -3155 244 4045 534 -3273 887 3922 -566 -2812 1925 3184 -1677 -2538 1585 2228
3352 2228 -2451 -2344 2584 1303 -3291 -1760 2516 569 -3435 -1028 2575 -539 -3758 -453 2528
3367 2528 -735 -3137 830 2255 -2222 -3243 1224 1880 -1931 -2153 2237 1239 -2846 -1186 2887 1209
3383 1209 -2764 -88 2855 -70 -2819 613 3682 -68 -2366 1281 2387 -1365 -1975 2634 3014
3398 3014 -1377 -1763 2347 1668 -2191 -678 3285 1061 -2931 -920 2548 -248 -3049 616 3072
3413 3072 -1487 -3520 522 2509 -1683 -2601 1981 2172 -3130 -3067 2173 1943 -2743 -1495 2995 717
3429 717 -4157 -1188 3796 898 -2997 46 3223 -1006 -3728 1215 4712 -562 -2872 1717 2873
3444 2873 -2365 -2469 3646 4120 -2082 -2658 2658 1882 -2549 -408 4645 2191 -3830 -1549 3544 955
3460 955 -2532 724 4403 -597 -4757 -525 3876 -240 -2950 1363 2550 -3170 -4570 1481 3462
3475 3462 -1920 -3361 1779 698 -4375 -2730 3772 2488 -3248 -2301 2060 -295 -4003 -66 4736
3490 4736 842 -4589 -1109 2724 -341 -2891 1918 4232 -1605 -4218 970 3533 -375 -1393 2857
3505 2857 2673 -2802 -2965 3024 3737 -1113 -984 2803 807 -3427 -877 3908 2403 -2562 -1290 1712
3521 1712 -349 -2745 1040 3968 78 -3679 -1680 1369 -771 -1538 1709 2247 -1983 -3967 -189
3536 -189 1808 -476 -856 1160 382 -3443 -2999 1789 2401 -425 -1340 827 -177 -2824 -309 3222
3552 3222 2357 -1365 -1562 776 45 -837 2010 3284 759 -2346 -824 944 901 615 2192 1858 -982
3569 -982 -2536 -574 2367 1619 739 806 -357 -2096 -1692 1150 2608 1017 -536 -1259 -1695 -1844 -90
3586 -90 1965 1869 -936 -2547 -1706 -910 -80 1122 1821 634 -2507 -2911 -828 996 1370 1133 391 -1147
3604 -1147 -2669 -1775 1305 2615 1922 -34 -498 -1519 -1560 586 3000 2790 309 -1445 -1353 -583 651
3621 651 2048 3266 1305 -1674 -1968 -342 1133 1609 2183 1424 -1142 -2753 -1696 1309 2195 1100
3637 1100 444 -578 -2391 -2756 -1 2508 1771 -604 -1605 -1713 -2070 -1164 1431 2266 -125 -2352 -2133
3654 -2133 -805 -591 694 2276 1545 -1307 -2900 -1016 768 1113 1408 1494 -57 -2568 -2114 1179 2360
3671 2360 1470 700 366 -1042 -2188 -83 2622 2506 286 -683 -424 -915 -1050 934 3026 1304 -1315
3688 -1315 -1243 -579 -580 -81 1554 1549 -904 -2577 -995 235 -137 -204 1130 351 -2410 -2418 -26 1279 -294
3707 -294 -478 451 -570 -2461 -1313 1546 1303 -268 -871 288 -479 -1476 424 2061 1190 -865 -456
3724 -456 487 -186 -43 1879 2232 393 -1151 284 1088 325 471 2270 1500 -917 -1114 636 1251 382
3742 382 388 1394 289 -1498 -557 1124 1003 -372 101 555 -786 -1584 136 831 -42 -1234 -165 -410
3760 -410 -1393 -1070 600 1071 -997 -1219 3 -404 -1353 -158 707 224 -1108 -930 668 -41 -740 292
3778 292 916 251 -1185 -56 962 372 71 946 706 -378 -717 1041 874 59 143 894 42 -891 354
3797 354 1507 325 -477 47 699 -291 -983 313 786 -260 -1015 -14 124 -1357 -866 585 315 -1352
3815 -1352 -888 379 -202 -1136 -237 1102 -445 -1367 -287 766 -687 -972 399 971 -704 -1209 845
3832 845 749 -504 -660 1456 589 -1074 -239 1798 892 -886 -25 1466 223 -879 803 1976 350
3849 350 -1288 720 1565 -486 -864 1432 1654 -944 -1178 1091 1016 -1202 -636 1630 688 -1687 -736
3866 -736 1676 -77 -1671 -653 1660 -551 -1987 119 1578 -1163 -1822 617 1128 -1260 -1665 1111
3882 1111 922 -1516 -1133 1769 890 -1883 -702 1943 480 -2028 135 2081 34 -1901 537 2213
3898 2213 16 -1324 1019 2419 -783 -1509 1555 2091 -806 -1280 2054 1650 -1278 -815 1866 758
3914 758 -2403 -440 2233 295 -2056 -453 1923 -339 -2390 84 1974 -1004 -2473 861 1714
3929 1714 -1809 -2335 1093 1405 -2103 -1930 1551 749 -2260 -1317 2007 384 -2133 -439 2208 197
3945 197 -2303 227 2254 -506 -2112 959 2331 -696 -2040 1707 2228 -1189 -1472 2069 1977 -1508
3961 -1508 -705 2465 1432 -2013 -791 2443 769 -2466 -160 2512 -114 -2422 183 2185 -896
3976 -896 -2303 880 1900 -1804 -2439 981 1439 -2179 -1958 1489 713 -2398 -1575 1620 152 -2569
3992 -2569 -1140 2113 120 -2573 -243 2123 -251 -2393 623 2386 -871 -1873 888 2079 -1190
4007 -1190 -1608 1990 2073 -1384 -1018 2197 1435 -1624 -490 2476 1189 -1891 117 2880 308 -2159
4023 -2159 732 2650 -634 -2068 914 2344 -905 -1797 1319 1736 -1780 -1757 1677 1085 -1999 -1317
4039 -1317 1397 338 -2402 -863 1814 264 -2477 -433 1846 -601 -2518 511 2120 -744 -2372
4054 -2372 832 1439 -1118 -1491 1605 1729 -1540 -1429 1765 1230 -1476 -346 2256 1041 -2004 -594
4070 -594 2381 639 -1638 494 2347 -13 -1959 853 2092 -564 -1415 1081 1761 -1354 -1544 1189
4086 1189 1433 -1347 -1580 1191 576 -1718 -1234 1691 343 -2214 -992 1279 -282 -2096 -118 1537
4102 1537 -709 -2646 51 1192 -1094 -1801 952 1238 -1722 -1558 1087 1130 -1174 -795 1521 555 -1538
4119 -1538 -427 1778 1107 -1331 -97 1699 -40 -1320 813 2156 113 -1270 955 1565 -499
4134 -499 -701 1625 1233 -927 -898 879 948 -802 112 1525 147 -1583 -678 1257 370 -1274 -72
4151 -72 919 -668 -2012 211 1237 -197 -1068 -1 282 -1357 -1379 857 1160 -660 -814 357 -51
4168 -51 -1000 -7 1102 726 -786 -586 685 92 -280 522 1511 -379 -1379 113 1220 150 47 1205
4186 1205 758 -850 -796 1060 1055 277 184 779 93 -1110 -26 1190 656 -643 -593 -9 -916 -1057 395
4205 395 1145 -307 -947 -629 -265 -1056 -537 886 965 -1103 -1170 -296 -337 -535 202 1060 -523 -1412 -533 726
4225 726 327 -1 547 427 -830 -934 268 1065 601 20 1008 217 -1047 -99 1479 1371 82 89 605
4244 605 -57 -616 400 1793 756 -669 -253 322 -331 -382 583 1274 -405 -1242 -411 195 -362 -262 937
4263 937 243 -1280 -1365 64 491 -446 -142 436 -487 -1923 -1013 967 308 -378 -126 -84 -1160 -1565 287
4282 287 1174 133 -457 131 -14 -604 -733 1186 1506 114 -483 281 258 -39 504 1610 917 -604 -844
4301 -844 643 482 188 965 1052 231 -1698 -549 1011 803 96 472 563 -1013 -1486 -139 1455 516
4319 516 -431 -323 -358 -1430 -1127 708 843 -348 -1212 -387 -597 -538 109 1562 598 -1015 -1600 -40 377
4338 377 -131 763 1213 52 -1432 -705 484 920 639 800 559 -634 -1365 413 1425 936 560 350
4356 350 -145 -1116 -815 1421 1527 729 -56 -613 -599 -397 182 1315 672 -347 -1162 -1098 -428 -237 845
4375 845 669 -51 -1274 -1416 -145 206 101 585 172 -906 -1494 -727 251 813 371 55 -990 -1394 -1052
4394 -1052 -127 1020 735 247 -405 -1034 -316 216 1195 1122 662 -287 -986 -252 561 910 1247 437 -179 -520
4414 -520 -761 633 1356 908 -23 -310 -387 -567 -319 979 1112 -72 -474 -541 -692 -745 342 965 416 -931
4434 -931 -1231 -350 -667 -410 178 588 -295 -1332 -742 181 382 -256 367 219 -793 -1229 86 1316 250
4453 250 273 586 93 -764 -696 1054 1388 -22 -236 675 353 -571 119 1425 1287 -574 -387 785 248
4472 248 -499 405 1754 230 -1064 49 865 -114 -589 623 1322 -1085 -1135 716 776 -750 -829 781
4490 781 384 -1862 -969 860 775 -953 -656 844 -297 -1673 -464 1079 51 -1405 -343 1130
4506 1130 -485 -1384 552 1413 -906 -1463 597 999 -1085 -863 1424 859 -961 -560 1420 978 -899
4523 -899 -256 1866 703 -1184 -167 1879 17 -1123 327 1649 -285 -1407 190 1440 -757
4538 -757 -985 761 779 -1000 -970 786 572 -1366 -991 1108 48 -1665 -613 1134 -48 -1324 -194
4555 -194 962 -437 -1600 -89 1039 -473 -1539 629 1325 -832 -1175 981 898 -1144 -808 1144
4571 1144 775 -921 -175 1714 559 -979 -67 1549 385 -1185 345 1920 77 -1185 1038 1611
4587 1611 -234 -1247 992 1228 -940 -995 1097 831 -1300 -782 1250 388 -1476 -597 1317 -38 -1759
4604 -1759 -323 1192 -602 -1739 114 1084 -874 -1661 286 987 -1155 -1102 876 845 -1020 -1026 1344
4621 1344 588 -1246 -168 1606 707 -1335 -61 1651 182 -1187 471 1477 -29 -1172 766
4636 766 1653 -304 -773 1110 1430 -875 -838 1320 1049 -1005 -662 1688 587 -1430 -197 1563 307
4653 307 -1931 -386 1392 -313 -1841 202 1123 -595 -1847 574 1123 -1236 -1455 611 759 -1719
4669 -1719 -946 1216 430 -1747 -486 1201 449 -1787 -254 1396 142 -1250 469 1565 -567 -1166
4685 -1166 349 1145 -693 -1215 1140 1251 -788 -806 1292 996 -1246 -550 1385 963 -855 -209 1636
4702 1636 467 -1221 139 1758 -331 -1697 258 1302 -950 -1696 466 1106 -1100 -1552 750 810
4718 810 -1431 -900 830 695 -1556 -993 979 260 -1715 -445 1131 76 -1583 3 1536 -371
4734 -371 -1126 511 1256 -605 -1232 843 1419 -600 -698 1428 1470 -882 -871 1552 1162 -961 -371 1699
4752 1699 711 -1129 119 1645 292 -1313 100 1262 -92 -1174 492 1457 -525 -1138 967 1332
4768 1332 -987 -1487 586 749 -1152 -1080 1021 530 -1244 -832 844 422 -1328 -496 1002 102 -1590
4785 -1590 -436 1188 21 -1078 -63 891 -410 -1072 429 1012 -279 -870 788 1113 -783 -1224
4801 -1224 993 1119 -207 -307 745 588 -781 -441 1277 377 -887 -332 1047 122 -513 7 992
4818 992 -33 -784 56 672 -229 -591 321 655 -316 -748 132 425 -619 -619 164 190 -923 -780 151 175
4838 175 -544 -430 179 364 -804 -126 377 340 -398 -150 429 45 60 167 563 299 49 48 16 170 150 333
4860 333 288 265 -35 -59 38 593 575 151 78 143 228 33 42 349 187 -458 -153 -522 -33 -246 169 737 -340
4883 -340 -1300 -186 115 115 -201 -66 -173 -1009 -1138 -106 626 -469 -221 128 75 -1110 -575 778 1143
4902 1143 -349 -401 163 88 -775 38 1622 639 -640 -1054 388 291 -338 1044 1687 304 -1185 -2
4920 -2 812 527 -34 1064 1220 -933 -1582 171 1643 471 -245 1025 284 -1824 -1356 1094 1309 -387
4938 -387 -844 192 -500 -1638 -615 1909 1477 -1296 -1244 134 -407 -1433 578 2022 340 -2421 -1598
4955 -1598 165 215 -703 1358 1645 -1225 -2737 -220 1503 450 -134 1303 965 -1700 -1719 1005 2247
4972 2247 359 -315 528 -29 -1679 -720 2183 2259 -453 -878 410 -332 -1526 630 2207 1059 -1931
4989 -1931 -1646 150 -60 -643 1106 2267 -305 -2864 -1466 1123 140 -598 1115 1246 -1833 -2496 9
5006 9 1770 241 -775 325 -105 -2517 -1628 1467 2366 -208 -1196 427 -221 -1766 -199 2268 1716
5023 1716 -822 -1056 42 -11 -794 811 2316 767 -1808 -936 1052 512 -93 1357 1901 -516 -2324
5040 -2324 -307 1524 393 -250 378 799 -1454 -1707 293 1689 -94 -759 263 113 -1459 -736 956
5057 956 1316 -489 -928 52 -479 -870 -131 960 560 -1106 -1136 -15 -69 -589 623 1179 327 -1341 -618
5076 -618 655 607 28 357 1077 -253 -935 -95 880 746 84 420 485 -80 -837 321 1011 471 -461 146
5096 146 71 -356 -273 429 1004 218 -744 -239 271 -367 -235 340 673 -474 -1203 -234 436 -84 -676 199
5116 199 449 -917 -1266 -117 461 -49 -645 170 89 -722 -786 469 954 -435 -868 729 330 -523 -552
5135 -552 950 941 -517 -328 862 709 -423 96 1358 463 -804 -158 1237 116 -1078 292 1725
5152 1725 96 -1328 355 1363 145 -933 544 957 -703 -1116 390 1407 -815 -952 623 432
5168 432 -1470 -1306 575 649 -1348 -840 941 335 -1500 -655 1468 262 -1347 -427 1254 146 -1303
5185 -1303 156 1523 -314 -1420 391 1233 -194 -1185 905 1739 -357 -1318 902 1684 -467 -837
5201 -837 1436 1133 -1000 -807 1755 657 -1234 -457 1632 731 -1280 -232 1550 153 -1366 31
5217 31 1147 -448 -1458 408 1116 -619 -1368 524 749 -941 -1270 524 1052 -1154 -1066 813 587
5234 587 -1057 -764 1217 188 -1324 -319 1355 -165 -1163 265 1239 -311 -1125 212 720 -152 -737
5251 -737 421 1059 -329 -771 727 845 -834 -536 1228 622 -796 -86 965 160 -774 -90 969
5268 969 68 -938 18 715 -44 -878 346 937 -604 -811 689 388 -1094 -894 681 111 -1031 -610
5286 -610 471 -266 -1256 -313 495 -206 -838 124 604 -174 -1034 565 759 -608 -690 500 571 -530 -315
5305 -315 928 345 -415 62 1042 208 -983 313 1080 -194 -726 215 865 -12 -742 700 1062 -140
5323 -140 -597 626 397 -713 -379 385 190 -1174 -307 730 523 -946 -430 915 -19 -1154 -441 627
5341 627 -692 -1312 -209 856 -846 -876 -18 765 -754 -654 684 344 -816 -457 581 852 -890
5358 -890 -497 1364 368 -858 185 1486 123 -1008 51 891 174 -458 494 1093 -218 -815 742
5375 742 943 -262 -319 951 535 -593 -310 702 329 -1118 -231 1165 -192 -1187 -33 715 -542
5392 -542 -1276 -102 774 -679 -1298 44 833 -813 -915 468 519 -868 -851 748 435 -1041 -535 991
5410 991 68 -1021 -215 1082 275 -870 7 1217 152 -853 401 1190 -181 -816 803 1102 -800
5427 -800 -502 856 705 -352 131 1161 679 -632 -257 1049 418 -1068 -523 892 -31 -975 -212 1051
5445 1051 -351 -1285 -141 1301 -198 -1245 244 596 -487 -1110 248 762 -786 -863 628 153 -891
5462 -891 -835 916 346 -836 -381 731 149 -552 -233 941 166 -1059 -224 857 462 -634 424 1074
5480 1074 86 -1013 328 827 163 -135 501 693 -252 -525 494 708 -192 -523 145 168 -609 -339 643
5499 643 666 -470 -318 397 172 -624 -181 620 205 -969 -488 169 160 -776 100 446 -114 -1064 -557 348
5519 348 -38 -190 256 247 -252 -531 65 659 317 -367 -192 66 -257 -202 367 783 -64 -304 -247 194 139 -58
5541 -58 749 598 24 -486 206 453 115 165 558 306 -267 -750 79 925 12 -27 140 126 -737 -1045 250
5562 250 723 -25 -531 1 -152 -829 -560 711 747 -796 -911 -29 32 -637 -87 1399 755 -1103 -869
5581 -869 399 573 47 71 821 155 -937 -306 770 908 -105 -50 1357 -147 -1155 -53 1658 532
5599 532 -487 237 503 -660 -846 467 1791 49 -1299 -174 419 -608 -616 1034 1201 -784 -1480
5616 -1480 333 728 -667 -384 1110 425 -1671 -1123 986 606 -761 -154 1141 116 -1675 -703 1345
5633 1345 619 -907 -96 1013 -294 -1752 277 1829 237 -1254 -5 1224 -19 -1029 1009
5648 1009 1775 -214 -1190 306 1052 -663 -713 1607 1523 -901 -1509 914 1088 -730 -507 1431 647 -1536
5666 -1536 -1451 1085 1059 -1269 -490 883 -71 -2073 -664 1634 178 -1631 -276 1120 -219 -1785
5682 -1785 277 1533 -330 -1841 152 874 -690 -1437 507 1488 -850 -1639 429 1131 -516 -918
5698 -918 1124 1280 -1114 -1255 1096 1225 -684 -459 1703 627 -910 -277 1794 961 -1246 -281 1332
5715 1332 194 -1421 207 1534 372 -1386 -75 1347 -328 -1390 574 1325 -21 -1581 -178
5730 -178 1010 -481 -1153 412 1298 -954 -1393 272 640 -814 -900 447 798 -1185 -1009 631 620 -358
5748 -358 -730 846 509 -1279 -594 887 381 -478 -455 1147 557 -724 -147 1027 585 -665 -253 1029
5766 1029 -27 -805 292 1036 215 -772 74 655 17 -668 137 1023 -154 -1001 -139 739 -485 -574 50
5785 50 692 -958 -923 49 569 -339 -1016 208 465 -666 -948 221 701 -380 -644 29 406 -645 -669
5804 -669 620 593 -511 -961 454 678 -680 -624 957 789 -838 -510 685 637 -779 -373 962 409
5822 409 -1164 -216 1045 220 -881 -168 923 207 -885 -195 1085 336 -902 -99 1043 -219 -1285
5839 -1285 194 1287 -296 -986 286 909 -812 -736 926 1131 -710 -1319 540 1064 -1104 -760 921
5856 921 731 -1119 -797 1108 464 -933 -269 1414 113 -1641 -265 1719 453 -903 89 1220
5872 1220 -124 -1473 218 1485 14 -800 922 582 -850 -935 962 1279 -725 -974 934 595 -1087
5889 -1087 -657 1164 877 -989 -923 721 425 -1026 -348 1061 107 -1537 -275 1131 -139 -1493 198
5906 198 1320 -470 -1836 133 857 -565 -859 424 394 -707 -771 996 747 -757 -848 794 247 -987
5924 -987 -142 1128 464 -807 -332 1173 272 -836 317 1152 -108 -729 100 627 303 -588 586 724
5942 724 -343 -617 413 799 -374 -296 412 205 -774 -150 99 248 -637 -477 380 7 -959 -303 409
5961 409 -463 -941 -119 252 -290 -498 188 392 -406 -497 506 143 -595 91 490 96 -362 -188 400 0
5981 0 -401 297 540 0 -129 300 599 -73 -56 668 301 -514 179 818 178 -236 -95 455 219 -89 301
6002 301 491 45 -430 350 266 -283 -477 335 326 -510 -242 380 181 -720 -324 136 -304 -776 123 543 12
6023 12 -785 128 412 -469 -328 207 654 -239 -228 94 516 -323 -335 154 291 28 -229 824 137 -523 79
6044 79 508 201 -368 89 618 -65 -627 252 413 -93 -748 465 544 -510 -432 376 487 -378 -730 460
6064 460 349 -684 -379 337 -187 -806 -56 438 23 -942 -75 246 -433 -610 20 434 -279 -581 161 407
6084 407 -304 -427 235 331 -349 -517 337 328 -452 -349 695 46 -592 -125 910 403 -703 187 771 220
6104 220 -486 193 457 -148 -194 112 718 -367 -504 395 607 -362 -354 292 287 -830 -459 6 29 -750 62
6125 62 603 -9 -818 97 514 -191 -517 214 870 -98 -503 161 709 15 -499 32 490 -290 -35 485
6145 485 706 -28 -219 404 419 -355 -169 924 514 -243 -115 790 421 -389 156 847 417 -353 -358 910
6165 910 277 -18 57 475 193 -441 428 701 214 -448 22 568 -468 -728 111 505 -393 -568 64 237
6185 237 -460 -634 385 152 -728 -924 68 401 -269 -648 269 405 -506 -348 316 332 -357 -65 219 -76
6205 -76 -417 -487 483 373 -392 -153 535 194 -263 54 723 213 -435 194 436 367 -187 88 605 248 -372
6226 -372 74 -34 -42 -263 219 350 246 -630 194 515 -146 -357 260 478 -232 -582 10 182 -448 -564 218
6247 218 268 -753 -636 260 277 -212 -170 64 367 -390 -614 666 625 -739 -614 391 -39 -413 -160 487
6267 487 506 -708 -167 820 193 -361 56 683 -102 -1051 53 721 -30 -355 228 848 -122 -835 -67 999
6287 999 35 -383 -63 709 -388 -846 474 716 -38 -887 348 677 -505 -687 716 742 -722 -761 668
6306 668 354 -528 -377 859 485 -1167 -552 970 477 -824 -105 1108 273 -959 -154 906 336 -746
6324 -746 87 1422 -166 -1236 360 1388 246 -789 347 1035 -399 -956 767 1364 -490 -1159
6340 -1159 491 1272 -476 -691 809 1211 -555 -1147 732 664 -829 -711 1220 665 -1328 -940 1003
6357 1003 403 -1239 -533 1183 -255 -1505 -236 1235 -223 -1244 51 1166 -287 -1237 446 1155
6373 1155 -209 -1011 267 1038 -766 -1366 861 1295 -730 -830 644 920 -966 -696 938 820 -911
6390 -911 -939 813 579 -924 -42 1371 277 -1348 -850 954 234 -1252 -250 1364 -26 -865 -378
6407 -378 944 -44 -1041 124 686 -639 -1503 -298 959 -483 -991 310 600 -850 -1195 805 1173
6424 1173 -439 -715 407 670 -696 -380 1022 1061 -518 -963 692 778 -451 17 1284 610 -511
6441 -511 -171 813 312 -325 288 1158 627 -901 -52 701 540 -233 -10 982 116 -1142 -220 931 346
6460 346 -475 232 142 -782 -640 216 825 -117 -674 -392 328 -402 -681 398 594 -427 -881 -139 268 -622
6480 -622 -440 444 344 -916 -930 259 685 -338 -265 274 302 -1152 -486 516 904 1 -118 577 -113
6499 -113 -906 -341 1563 891 -612 -143 463 95 -550 222 1020 460 -760 -353 783 357 -299 326 952
6518 952 -227 -1568 278 1261 23 -854 502 779 -531 -1095 224 752 -579 -683 318 368 -1102
6535 -1102 -816 729 805 -646 -746 802 574 -1146 -643 1067 475 -1030 -890 816 444 -787 -96
6552 -96 1296 -40 -1251 54 1167 -154 -978 749 860 -658 -999 335 959 -94 -699 469 705
6569 705 -678 -870 964 779 -613 -1008 610 313 -716 -242 814 287 -1407 -442 962 230 -1027
6586 -1027 -37 825 130 -725 -211 814 155 -582 322 893 -332 -894 515 812 -26 -706 784 652
6604 652 -362 -549 720 777 -171 -556 614 844 -607 -221 778 454 -648 -112 958 411 -517 35
6622 35 862 12 -573 -169 535 -292 -148 -58 396 -530 -460 32 662 -110 -806 395 2 -442 -622 432
6642 432 -302 -226 -205 179 -121 -350 -145 238 -39 -529 80 147 186 -407 127 287 244 -198 154 214 231 203 265
6665 265 262 -82 264 397 250 114 353 357 148 164 315 119 347 -13 -125 -101 -80 44 212 -52 -100 28 106
6688 106 -314 -333 -13 43 -1 -401 6 3 -180 7 14 -343 -181 -509 -94 -89 -427 50 57 165 -248 144 137 -353
6712 -353 -154 408 171 -203 -280 -62 168 -56 -327 318 367 -144 -92 173 176 -425 -91 569 247 -179 199 289
6734 289 74 -67 116 311 -180 -235 183 507 9 -121 313 355 -400 -384 299 16 -395 -213 439 150 -618
6755 -618 -197 333 328 -284 -212 236 92 -244 8 499 -200 -638 0 336 -42 -115 369 309 -437 -169 260 157
6777 157 -285 -163 227 195 -9 -372 411 319 -330 -58 399 -85 -303 157 227 -49 -525 119 198 -110 -231
6798 -231 291 295 -189 -318 40 46 -596 -331 350 187 -313 -177 170 145 -388 -95 435 -5 -503 -172 322 -183
6820 -183 -589 90 4 -12 -585 -164 160 -63 209 82 144 -186 -103 646 475 91 -259 281 383 -49 18 241
6842 241 185 -353 -349 232 114 -88 -203 550 105 -213 155 343 -20 -282 39 232 133 -277 40 212 -44
6863 -44 -303 186 -14 -137 -345 107 -51 -152 16 199 382 -222 -260 -67 182 -180 196 230 25 298 -110
6884 -110 514 56 -152 -138 89 188 -210 71 380 349 -301 -98 213 405 -58 178 609 26 28 77 311 84
6906 84 -122 99 152 -174 -200 103 136 21 -360 -151 -42 -223 -533 208 210 -351 -577 -170 -119 -301 -498 -82
6928 -82 103 -137 -278 -227 315 -234 -102 467 416 -319 -128 -85 568 78 84 527 340 -248 -183 401 372 -368 264
6951 264 456 196 -271 -98 329 422 -281 -5 391 -7 -464 -121 668 224 -278 -244 378 -341 -749 83 583
6972 583 -117 -720 -61 401 -184 -406 422 548 -642 -925 -148 385 -239 -546 344 286 -570 -552 464 701
6992 701 -267 -347 611 16 -1066 -252 753 212 -814 -227 707 119 -526 122 1080 126 -572 -50 830
7011 830 -48 -905 261 1008 31 -783 29 595 -347 -507 440 612 -335 -620 189 938 -427 -554 518
7030 518 543 -821 -1029 576 600 -564 -255 673 -120 -1099 -311 1041 476 -713 96 803 227 -678 104
7049 104 831 161 -891 -19 911 -36 -520 823 1186 45 -622 164 442 -366 -464 849 1133 -520 -681
7068 -681 316 594 -201 -303 928 550 -1084 -920 788 589 -1006 -277 913 -67 -1209 -380 941 389
7086 389 -711 -408 633 -469 -1111 -149 548 -133 -869 -398 564 -202 -716 366 600 -516 -776 344
7104 344 731 21 -410 590 702 -539 -849 413 1043 -166 -124 550 362 -626 -459 999 632 -746
7122 -746 -269 443 124 -690 -99 865 540 -292 -260 413 -51 -560 255 699 17 -1121 -637 288 91 -761
7142 -761 10 371 -285 -730 -317 769 -64 -481 -153 368 -449 -403 227 467 -266 -874 250 446 -260 -448
7162 -448 232 808 -283 -611 425 417 -286 -194 718 350 -353 -248 362 529 -416 129 658 581 -451 -411 878
7183 878 404 -348 -249 456 228 -617 -312 719 120 -522 -59 486 -416 -904 148 587 -323 -902 -301 594
7203 594 -102 -617 231 461 -306 -747 332 401 -562 -832 551 586 -864 -900 499 674 -228 -245 656 316
7223 316 -595 -276 719 237 -471 -160 605 177 -536 -22 884 361 -809 63 1010 182 -538 165 931 138
7243 138 -653 72 804 -31 -388 381 636 -381 -733 440 410 -654 -343 522 521 -621 -322 608 311 -730
7263 -730 -216 382 109 -957 -458 671 -254 -767 -85 682 1 -789 342 1006 17 -708 136 518 -41
7282 -41 -753 303 515 -378 -625 509 706 -178 -603 705 409 -450 -141 553 452 -153 -308 287 289 -455
7302 -455 -244 291 70 -604 -575 113 -280 -551 -43 249 -374 -530 199 401 -131 -56 258 207 -505 -26 13
7323 13 -174 -439 -158 -25 50 -636 -237 386 384 -303 -329 367 -137 -24 64 181 -31 -88 221 466 242 -137
7345 -137 455 342 -106 40 349 -12 -108 -263 305 218 182 -36 -98 54 -152 -288 38 -8 -111 16 -295 -13
7367 -13 -240 -115 -68 -25 -36 -80 -138 61 1 -217 -32 -76 382 -326 -294 -139 -49 115 20 48 138 12 -24 -132 150
7392 150 -116 -142 281 78 -9 93 1 289 -201 74 279 288 -176 194 158 57 139 309 380 -434 -399 -178 365
7415 365 -91 -172 90 75 -191 -271 103 201 -275 -118 -75 -120 -86 62 25 75 -241 -423 247 35 -134 -388 265
7438 265 -214 -57 -42 176 128 -165 -79 211 -249 -248 240 277 -150 -152 10 354 122 -146 26 385 -39 -185 245
7461 245 351 -86 103 399 -107 -31 -105 270 -256 -387 -384 259 -31 -151 -166 201 -47 -256 -290 -8 -287 -685
7483 -685 -34 305 -200 -219 -38 5 -374 -149 80 -237 -154 -397 70 130 -142 -283 36 -2 -145 57 519 29
7505 29 -501 47 358 20 15 89 244 75 -226 4 451 106 111 126 19 -92 -91 496 247 -311 23 173 330
7528 330 -334 -66 89 191 -647 -284 334 -51 -143 192 29 -109 -563 191 -184 77 -243 -182 -91 -281 -162
7549 -162 108 56 -363 -88 25 242 -263 153 -87 106 -196 -92 243 -97 -13 -188 491 267 -162 229 64
7570 64 61 -75 2 352 30 -241 178 472 -66 -75 -12 17 326 93 -187 214 58 -363 74 213 -264 -303 107
7593 107 -2 -55 -377 59 -164 -267 -666 59 54 19 -300 -230 93 -48 -79 248 79 86 88 273 300 -349 -133 -108
7617 -108 -4 78 -244 3 145 -233 -158 390 133 -360 12 23 242 -562 -393 485 428 -43 -194 68 -9 -583
7639 -583 -138 184 151 -63 -304 176 -201 -291 42 225 -215 -415 -202 290 23 72 108 124 -109 -423 43 385
7661 385 -495 -358 289 319 -276 -414 -65 336 -473 -94 382 413 -325 -462 394 150 -481 -132 549 393 -269
7682 -269 -280 521 109 -154 -48 327 168 -451 223 466 -79 -714 -259 587 -24 -584 32 500 -372 -523
7702 -523 194 439 -383 -573 114 486 -499 -617 419 541 -635 -525 481 339 -550 -553 571 196 -739
7721 -739 -490 570 103 -607 -111 580 -19 -571 -263 416 -44 -333 368 642 -160 -456 481 820 -168 -329
7741 -329 501 803 -496 -335 587 777 -307 -491 139 358 -248 -51 593 415 -532 -480 511 617 -402
7760 -402 -280 368 109 -454 -634 547 21 -675 -188 445 -111 -372 -118 370 -46 -676 81 274 -181 -418
7780 -418 135 390 -494 -859 -5 176 -43 -439 446 488 -168 -472 100 401 -342 -243 597 502 -313 -462 473
7801 473 290 -383 -80 527 314 -403 154 422 342 -402 92 441 23 -474 -54 347 101 -379 165 145 -486
7822 -486 -584 218 576 -77 -272 37 270 -285 -327 11 536 -142 -541 -54 425 -46 -117 347 184 -627 -313
7843 -313 285 250 -101 -262 208 68 -405 -158 594 232 -421 -297 431 344 -495 -376 528 346 -486 -143 196
7864 196 -25 -253 -185 372 -86 -316 128 303 1 -343 2 675 -33 -762 -288 436 158 -314 79 349
7884 349 -202 -450 139 604 -256 -449 257 289 -416 -350 436 302 -432 -328 330 207 -310 -111 637 226 -616
7905 -616 -13 661 157 -790 177 697 79 -561 -67 705 67 -480 23 355 -210 -397 292 510 -286 -301
7925 -301 67 645 -538 -458 12 491 -643 -433 89 398 -430 -542 329 12 -408 -255 334 260 -387 -137
7945 -137 421 174 -585 -465 666 -53 -427 -61 630 16 -530 88 597 -150 -54 94 551 -335 -293 599
7965 599 637 -94 -75 346 256 -433 -354 372 533 -333 -317 473 340 -403 -171 217 90 -489 -160 98 28 -544
7987 -544 -440 11 109 -419 -210 176 -45 -248 -223 140 -375 -217 164 27 -285 -444 130 512 -42 -250 152
8008 152 338 -245 -192 288 366 95 -146 32 435 205 42 449 387 -283 81 247 275 -50 7 492 385 -230
8030 -230 -79 223 75 10 -110 272 90 -114 154 -22 -24 -120 -161 -70 -22 -77 102 -112 -22 -199 -236 201 -263
8053 -263 25 -31 -221 -326 -302 -7 255 -264 -29 -208 277 -203 -280 -296 -189 -22 -140 -169 -124 -258 -322 80
8075 80 208 33 -51 -167 177 46 -72 33 56 -81 -138 214 441 -46 -74 33 231 70 -274 -127 262 -349
8097 -349 -254 -55 16 29 -171 -221 -142 -259 -17 -21 48 -180 31 219 52 -358 -324 139 -38 -152 -104 25 20 -44
8121 -44 185 272 29 -154 58 78 65 -61 156 173 -91 -4 36 578 67 127 232 216 -66 182 63 -30 -51 -2
8145 -2 434 -18 -51 161 4 10 99 -126 -152 228 -132 -161 143 -27 -304 -87 -25 46 -199 280 269 -51 -372 137
8169 137 157 6 -74 42 -15 47 34 11 50 -233 -94 -280 283 -310 157 132 -36 50 -82 310 125 122
8191A22
$$ Imaginary data points
##PAGE= N=2
##DATA TABLE= (X++(I..I)), XYDATA
0 0 0 0 0 0 -8 0 -8 8 -8 8 -16 16 -24 24 -32 40 -48 56 -64 78 -93 104 -118 139 -160 180 -203 233 -265 297
30 297 -331 376 -421 468 -521 579 -646 717 -791 878 -974 1078 -1191 1320 -1464 1628 -1807
47 -1807 2018 -2263 2548 -2889 3305 -3823 4489 -5380 6640 -8556 11792 -18270 36192 -182261
61 -182261 -600746 5307 386944 1309 -235574 154688 217076 -252101 -304330 211454
71 211454 290523 -100643 -63858 295185 68761 -404752 -128162 500357 355120 -221477
81 -221477 -165723 248452 111245 -217799 40240 420038 170257 -201188 -23999 201503
91 201503 -37890 -138379 278946 426972 -89259 -375150 48462 339821 23929 -150076
101 -150076 174122 263528 -137893 -274111 78940 220038 -15149 -31257 168525 10507
111 10507 -318235 -143312 284506 200206 -192058 -153731 132734 18248 -262615 -101404
121 -101404 227928 126837 -165924 -134733 12174 -81456 -131466 103640 201348 -88270 -268939
132 -268939 -36757 137485 -42884 -145479 77026 180097 -71451 -234767 -47295 126907
142 126907 51357 -14853 49827 11621 -129331 -81357 119068 126058 -44185 -50524 88054
153 88054 49574 -122500 -81155 138742 169546 -17987 -102796 -11844 32951 -7063 23534
164 23534 89388 32546 -73041 -46827 39099 8960 -53938 16956 106394 12253 -143803 -105448
176 -105448 59230 83174 -30665 -65548 -4812 -12243 -78863 -55524 28185 19829 -48831 -38943
188 -38943 -2005 -59349 -108559 -6760 99161 9659 -131775 -83043 45758 16562 -80138
199 -80138 -28027 70313 10777 -94215 -45800 45331 6068 -39509 38823 72394 -51919 -105437
211 -105437 39650 126085 411 -80274 38174 103607 -22708 -83338 50989 121516 8951
222 8951 -46041 46101 60774 -39357 -18460 112442 86536 -62702 -46096 96215 71572
233 71572 -66125 -26080 117385 72115 -78635 -47775 81094 47057 -54529 1725 86400
244 86400 -2364 -96648 227 94394 -4435 -89630 14831 85622 -36227 -112194 10294
255 10294 89054 -20501 -86436 9104 46030 -55601 -71984 41653 51995 -63166 -67255
266 -67255 41853 29917 -79361 -50405 70520 42367 -78615 -55182 53261 27966 -59876
277 -59876 -15887 68016 14692 -66996 -9170 67510 11443 -48063 21992 76896 -2095 -58101
289 -58101 23823 82325 12858 -31908 35200 65662 -4624 -25732 48167 67858 608 -10415
301 -10415 49827 46105 -17461 -6062 63067 52103 -17741 -10623 45859 30608 -22003 -1316
313 -1316 47932 21654 -30181 -12188 25965 2555 -29576 -2974 22329 -14367 -47040 -19232
325 -19232 6994 -20138 -42372 -17890 -6013 -39197 -55233 -27149 -13916 -37841 -46974 -28649
337 -28649 -29566 -52585 -51556 -26456 -24255 -45257 -46709 -30151 -32806 -48257 -39425 -18162 -20695 -37545
351 -37545 -34927 -20294 -20556 -26556 -16236 -3577 -7019 -16213 -11710 -419 3012 2460 8492 14658
365 14658 11789 8211 13353 22108 24958 26462 28597 28494 25910 26846 32185 36316 37424 36312 34685
380 34685 33221 31886 32111 35432 38048 35329 29675 27058 26863 26452 25512 25600 25893 22443 14859 10518 13482
397 13482 15508 11731 7643 7924 5116 -2146 -4647 250 2106 -2983 -6820 -7356 -8485 -12418 -12212 -7331
413 -7331 -6506 -11671 -14552 -12503 -12753 -14243 -9958 -5519 -8190 -12557 -10596 -7306 -8460 -8026 -1483 578
429 578 -5630 -8020 -1291 2656 -884 -1270 6790 7490 -1827 -2774 6347 9402 3453 3998 9513 5273
445 5273 -1720 2933 10084 5087 -1272 4836 8318 -2842 -9712 2042 8575 -3901 -11117 -868
459 -868 326 -14260 -15337 779 -851 -19711 -18847 -1847 -8030 -28150 -20467 1846 -6593 -31463
473 -31463 -24483 -2684 -11995 -30860 -17441 292 -16232 -32788 -12427 2297 -21125 -30920 6
486 6 11138 -23058 -34254 3350 16535 -17934 -25492 12246 17737 -19049 -19066 20016 17146 -18485
500 -18485 -5257 35125 15655 -28488 -2674 47003 22642 -25145 2068 48976 19119 -24913
512 -24913 7837 49330 16561 -16557 21036 43792 -4689 -21242 38986 55453 -10919 -28352
524 -28352 39702 51234 -19675 -28984 45026 53682 -19151 -28076 33553 30430 -25660 -5884 51626
537 51626 17370 -49468 -13176 52985 11803 -52454 -3588 60317 3479 -68162 -18927 48359
549 48359 7353 -42687 -560 28334 -31031 -54445 16779 40365 -32771 -49608 24812 28464
561 28464 -59076 -62408 37816 54395 -36536 -60010 8466 17542 -37993 -21957 41341 17409
573 17409 -49544 -25472 32615 -290 -47919 10258 73248 7777 -74913 -27112 56099 32907
585 32907 -20488 7818 41318 -4261 -37879 12165 48518 13103 -817 39784 28682 -43098
597 -43098 -38658 56885 85248 5400 -38643 7942 31959 -7902 -13812 37913 50810 2413
609 2413 -24557 -9401 -7326 -10825 25287 56124 8852 -62783 -51400 15522 28800 -12303 -18624
622 -18624 12935 2215 -51709 -63309 -10838 30655 15279 -17974 -37645 -52054 -51713 -10787
634 -10787 33102 13468 -44070 -50363 -11225 -14914 -52402 -26449 49212 44610 -51010 -91429 -25704
647 -25704 29200 13390 3236 21222 -6156 -60043 -34055 38526 33321 -15419 14016 59975
659 59975 -9095 -95438 -23772 108200 85814 -29670 -34736 31389 8515 -36429 28893 97335
671 97335 29103 -45299 7320 45688 -32341 -43881 92495 131407 -32693 -122461 7262
682 7262 98519 4313 -45032 57426 77114 -56205 -87689 37734 66114 -29839 -11071 88732
694 88732 13977 -140126 -65045 127280 88081 -87633 -60649 76937 18320 -115545 -33056
705 -33056 116896 47152 -84627 -24222 55447 -45303 -95742 68827 144861 -42033 -150807
716 -150807 14687 114686 -34938 -100808 68854 126916 -56787 -128418 29792 87295 -35440
727 -35440 -33402 98046 42534 -133404 -73491 127710 84456 -100723 -49752 117661 35575
738 35575 -143966 -56193 134170 68830 -92126 -34007 71056 -27474 -107520 41661 134522
749 134522 -32801 -137902 20229 105963 -59814 -125162 65742 138027 -57517 -147020 15427
760 15427 86423 -43417 -63039 71926 50857 -110420 -81446 87475 56901 -98432 -43760
771 -43760 110953 30883 -144142 -68212 116265 66987 -87450 -43127 68615 -2619 -94766
782 -94766 6834 102933 -3748 -91825 14310 79558 -45353 -97123 55322 123843 -29127
793 -29127 -114410 10346 84009 -16280 -55132 48692 66374 -47427 -61982 45704 50985
804 50985 -42417 -18905 82208 37163 -88833 -50667 84750 68903 -47348 -34694 56486
815 56486 28394 -56220 -17480 68201 34075 -37803 -2724 45856 -11266 -54288 27017 86678
827 86678 3800 -71181 -6591 61078 5910 -46972 11881 60928 -417 -53020 -6507 34389
839 34389 -2024 -19537 26399 27882 -41205 -50610 25224 47129 -20949 -43744 17182 31424
851 31424 -35301 -52004 16008 42663 -12829 -38658 48 7859 -30307 -21274 31042 21469 -39852
864 -39852 -36406 22355 18135 -37291 -24709 39133 28850 -41601 -41129 23395 29619 -18942 -14243
877 -14243 28822 10929 -35401 -11176 40393 17594 -29540 -791 44186 5312 -45054 -775
889 -775 57763 20092 -37069 -5261 41368 5824 -32741 10057 47519 -358 -36105 10740
901 10740 38860 -13412 -35187 25725 46565 -21841 -47469 17215 40740 -20254 -37706 21717
913 21717 30567 -31172 -37400 21936 23031 -33496 -26893 29033 12409 -47570 -26896 35558 14300
926 14300 -46023 -22918 33649 6543 -46718 -15300 36115 3959 -41528 -7195 32915 -5723
938 -5723 -40266 4598 38412 -8237 -39560 8708 36883 -11322 -34006 16130 36717 -12276
950 -12276 -29259 18240 30747 -14457 -20387 25471 26567 -19443 -17683 27947 22456 -21699 -12288
963 -12288 31267 18154 -24981 -10747 29851 13687 -23119 -5298 27686 6504 -25259 -2241
975 -2241 27155 2973 -24142 447 24336 -2773 -24209 3612 23514 -4244 -21479 5009
987 5009 18877 -8043 -18126 8660 17449 -9430 -16148 9856 14247 -10647 -12522 13470 13164
1000 13164 -12997 -11195 13412 10911 -11828 -7471 13924 8268 -12641 -6206 13623 7263 -10985
1013 -10985 -4066 12236 3696 -11663 -2791 12004 2243 -11468 -2049 9690 -232 -10898 -606
1026 -606 8636 -2122 -10567 -509 6648 -3325 -9294 800 6060 -4522 -9543 1549 5039 -4799
1040 -4799 -8027 2434 4495 -5552 -6844 3228 4403 -4507 -5645 3026 3839 -4306 -3949 4117 3781
1055 3781 -3643 -2355 4177 2520 -2629 -706 4149 2149 -2410 306 3927 1629 -1472 843 3501
1070 3501 325 -2059 687 2798 -44 -1947 547 1526 -1071 -2368 98 719 -1186 -2065 -666 7
1086 7 -1000 -2132 -1434 -391 -580 -2016 -1733 -433 174 -1015 -1877 -738 739 -168 -1328 -376 1579
1103 1579 172 -942 705 1762 -150 -467 2382 2587 -89 -67 3419 3408 326 731 4156 2772 121
1120 121 1350 4271 1718 -1046 2430 5105 277 -3235 2055 5747 -432 -4355 1394 4681 -1549
1135 -1549 -4434 836 2533 -2911 -3523 1866 -1 -6289 -2719 3487 -754 -8550 -3041 4890 -1104
1150 -1104 -8696 -2350 4407 -2152 -7266 96 3456 -5255 -6371 4154 4418 -7655 -6053 7883
1164 7883 6270 -8829 -6561 8648 6872 -7187 -3670 8720 3602 -7189 1038 10123 -981
1177 -981 -8692 5948 12464 -4520 -12026 7893 15723 -4608 -12890 6414 13002 -5827 -8758 9782
1191 9782 8923 -9935 -6024 12790 4936 -15639 -3329 19354 4419 -20699 -6131 18915 4923
1204 4923 -17415 -3099 16205 -552 -16650 2197 14648 -6213 -13563 11852 15248 -16350
1216 -16350 -18205 17524 20868 -14962 -19035 14803 16874 -15062 -13971 16974 13090 -14574 -7024
1229 -7024 16860 2007 -20863 2541 28234 180 -28999 -1560 27204 1054 -25151 1569
1241 1569 24807 -2490 -23346 1248 16322 -7006 -12940 13768 11615 -23237 -19019 20755 18454
1254 18454 -21169 -19096 18769 14470 -23055 -18287 17650 15047 -13705 -9654 9982 -2343 -17688
1267 -17688 5086 23863 -2803 -25096 1264 22672 -3554 -22033 6553 26946 56 -21481
1279 -21481 -2985 14034 2524 -2175 11113 6495 -14057 -8122 16043 12301 -11337 -5439 18320
1292 18320 9998 -18637 -15391 13519 19076 -938 -9604 -3408 -1980 -3708 2641 7105 -1501 -7278
1306 -7278 -973 1155 -9175 -11767 3559 14671 2364 -17489 -18584 -1847 10164 3837 -7475
1319 -7475 -7130 -509 -3053 -10593 -6484 5295 7210 269 -3983 -8550 -13572 -3633 17651 18133 -9433
1334 -9433 -21207 1669 15833 -3821 -12412 13740 24838 -4797 -22934 -917 15633 4301
1346 4301 4815 20056 4834 -25630 -10785 30174 21925 -15753 -5673 29244 9801 -33415 -13163
1359 -13163 37198 27839 -14998 -9483 14665 -6093 -23108 16671 41328 -4605 -35410 6396
1371 6396 29133 -18053 -33827 28272 49973 -17319 -50701 3239 30976 -10256 -16655 29034
1383 29034 19564 -40963 -31750 31562 23094 -32089 -10579 45040 6814 -64034 -26506 52790
1395 52790 29464 -37378 -16088 30163 -8047 -48932 5474 52651 -1756 -45571 5273 31956
1407 31956 -31009 -48405 35050 61952 -25074 -63407 8497 38340 -23174 -31269 37067 35228
1419 35228 -42378 -43824 27419 24378 -34265 -9705 52029 9784 -68418 -29127 55320 28249
1431 28249 -41942 -11493 43042 -2384 -56928 -3704 55256 9081 -38428 6685 33810 -26941
1443 -26941 -46819 33159 62121 -17537 -52177 15794 39592 -25234 -34646 38894 46880 -28803
1455 -28803 -40576 22027 24805 -26447 -8453 48346 16559 -52638 -25000 44362 22036 -36295
1467 -36295 -6646 45186 4608 -52076 -12767 44313 13509 -29517 1435 28158 -16760 -40691
1479 -40691 15143 44727 -8547 -37155 10957 30067 -21161 -34839 23435 41122 -13241 -33896
1491 -33896 9245 21134 -15829 -13905 28226 22040 -24776 -20663 23148 17240 -21198 -6865 33511
1504 33511 15665 -30363 -17050 27009 18787 -15782 -4347 23416 4943 -23764 -3370 25579
1516 25579 7112 -17797 2015 21984 -4808 -26721 2548 28865 2961 -23643 -3372 16950
1528 16950 -4465 -21757 2220 19456 -4388 -21307 -1442 10212 -10841 -17722 9382 16268
1540 16268 -14470 -25747 3236 14793 -11185 -18364 8414 14430 -14314 -21797 5500 13683 -9599
1553 -9599 -12110 11386 9068 -18253 -14670 15943 14901 -13361 -10987 16313 10370 -17795 -10030
1566 -10030 21221 15965 -13079 -8284 16150 7434 -14443 -567 23550 7903 -17684 -3004
1578 -3004 19981 3629 -16913 3838 24217 1173 -22057 -870 20960 486 -16536 4839
1590 4839 18224 -8147 -21635 5435 18722 -7582 -18263 7939 13686 -15270 -19940 11174
1602 11174 16346 -14079 -18547 8748 9322 -17626 -13623 14658 9429 -19363 -13742 12728 5437
1615 5437 -18803 -6328 18303 3337 -22089 -6854 17774 3454 -17087 -830 18033 -1521
1627 -1521 -19420 808 20000 13 -15373 4493 16837 -5054 -15020 9250 19284 -4058
1639 -4058 -13506 8839 15178 -6480 -9320 13714 15379 -7751 -9909 12642 12377 -7489 -4412 15281
1653 15281 10091 -11121 -5066 15511 9321 -8590 -1536 14862 4979 -11264 -287 16089 5545
1666 5545 -10054 244 13078 1161 -10202 3512 14480 284 -10426 2239 10761 -2087
1678 -2087 -8759 4797 9900 -4726 -10353 3297 7579 -5598 -8020 4495 4802 -9267 -9367 4629
1692 4629 3955 -8875 -7731 3720 609 -11423 -7220 4263 403 -10546 -6684 2633 -2447 -11108
1706 -11108 -4849 3924 -2063 -10767 -4598 2952 -3520 -8956 -1607 3583 -3534 -8353 -1394 3245 -2886
1721 -2886 -5155 1280 3076 -3339 -4572 2075 4026 -2098 -2632 3635 3125 -2637 -1667 4613 4031 -1260
1737 -1260 -639 4475 2679 -1434 629 4641 2616 -800 416 3326 1424 -585 1250 2649 533
1752 533 -1088 253 1018 -246 -1041 734 371 -962 -1144 -14 -157 -831 -469 -169 -512 -634 -293 -200
1770 -200 -669 151 769 -92 -400 997 1440 174 971 2688 1750 264 1883 4081 2508 245 3008
1787 3008 5365 2959 490 3569 5892 3264 885 4045 5895 1975 985 4888 5333 841 1088 5139
1803 5139 4373 -700 125 4913 3028 -2213 -652 3821 941 -3606 -887 2874 -1636 -5320 -507
1818 -507 1858 -4310 -6491 -603 1569 -5672 -7903 -780 615 -6677 -7673 -947 -638 -7458 -6044 21
1834 21 -2542 -8224 -4102 1954 -3190 -8738 -2654 3716 -2785 -8194 -789 4219 -2710 -6398 1405
1849 1405 4006 -3791 -3998 4881 4155 -5145 -2598 7516 4584 -5736 -1997 8733 4282 -5614 -383
1864 -383 8301 2345 -4866 2395 7858 -740 -5186 5534 8736 -3822 -6346 6734 8574 -5441
1878 -5441 -6649 7228 7860 -5743 -5248 7039 4024 -7556 -1738 8821 808 -10241 -302 10344
1892 10344 -1104 -11700 895 11349 -2033 -12098 969 9189 -3197 -8755 4148 6469
1904 6469 -7613 -8050 7828 6010 -10539 -6555 10348 5020 -13427 -6967 11282 5778 -11327
1917 -11327 -5025 8544 658 -10899 129 10688 -2275 -11452 3414 10565 -6310 -12281 7130
1930 7130 13193 -6072 -12456 4829 10428 -4925 -6459 8531 7278 -8394 -5041 10046 4752
1943 4752 -8413 911 15012 2705 -13422 -1253 15935 6505 -7633 1268 11252 902 -7029
1956 -7029 4571 11636 1241 -3409 7413 7351 -6694 -4834 12404 12435 -4547 -7229 5865 6307
1970 6307 -4520 -2039 8298 4984 -5452 -3432 2263 -1687 -4481 4669 7654 -4842 -12347 -2308
1984 -2308 5279 -1119 -5411 -210 1283 -5992 -8429 -3392 -392 -663 504 -709 -8426 -10912 -2286
1999 -2286 3784 316 -4273 -2905 -2626 -5802 -4634 634 1338 459 1509 -1585 -9192 -6924 5549
2014 5549 9096 -974 -5665 -232 213 -4745 -1092 7841 4984 -3526 -1314 2620 -4941 -6786 8134
2029 8134 14827 -2227 -13649 -931 8895 -2504 -6853 8004 9977 -7315 -12205 3174 5579
2042 5579 -6527 -2093 12782 2535 -19236 -9911 14372 7788 -12440 -3720 12970 -862 -19370
2055 -19370 -3569 16615 3030 -12330 2357 11080 -10016 -16527 11276 21479 -6427 -16683
2067 -16683 9117 15606 -11315 -13050 18147 20672 -10464 -13174 13751 11542 -11899 -1024 24918
2080 24918 10029 -19908 -4908 23592 7982 -17218 3597 27751 3114 -23580 657 24795
2092 24795 2548 -15305 9012 20642 -10439 -20852 12684 22517 -10702 -17199 15707 16391 -20097
2105 -20097 -19842 18597 18896 -16902 -16059 14867 7460 -22520 -9863 21642 6770 -24068 -8321
2118 -8321 18058 -1188 -25785 -1055 24467 -1577 -27960 -3744 18552 -4795 -21802 5655
2130 5655 19390 -10566 -23737 5930 16184 -11611 -16495 13607 14850 -19033 -20247 14266 15877
2143 15877 -14417 -13258 14707 9221 -19472 -11173 17339 9449 -15913 -5882 15596 625 -19941
2156 -19941 -1204 21464 3062 -18861 -2062 16199 -2140 -16649 4660 19300 -2160 -16852
2168 -16852 2949 13443 -4768 -10790 10651 14739 -9100 -14222 8745 13815 -6378 -8474 11963
2181 11963 10974 -10332 -10132 11158 11803 -6168 -5117 9964 4870 -11077 -3972 13448 7521 -9460
2195 -9460 -4161 9360 2249 -10430 -1498 13021 3901 -11175 -4766 7579 943 -8912 678 9769
2209 9769 -1276 -12348 -2090 8486 -586 -8748 1266 7586 -4210 -12163 256 9629 -922
2222 -922 -8712 442 6399 -4622 -8944 3618 9558 -2963 -8167 2914 6697 -4604 -5880 7518
2236 7518 9796 -4655 -7961 5771 8538 -3005 -3727 9140 8220 -6441 -5964 8745 8518 -4502
2250 -4502 -2234 9912 5123 -8526 -3324 11231 6608 -7079 -2881 9218 2499 -9353 -1024
2263 -1024 11363 2926 -10210 -2215 8621 -886 -9826 1010 10027 -2817 -11966 -273 7856
2276 7856 -3488 -9630 2994 7848 -6513 -11942 2589 7781 -5524 -8406 4390 5886 -9004
2289 -9004 -9118 6598 6787 -6977 -6834 6224 4200 -9061 -5176 9126 5219 -8404 -4347 8126
2303 8126 2572 -8143 -944 10085 1937 -9572 -1298 8758 792 -7738 1574 9310 -1888 -9740
2317 -9740 1431 8779 -1457 -7741 2737 6673 -4865 -8986 3230 7072 -4630 -7575 3072
2330 3072 3815 -6952 -6684 4899 4821 -6775 -6523 4046 2214 -7034 -4216 6026 1898 -7951 -3912
2345 -3912 5235 1397 -6525 -762 6661 10 -7344 -533 7135 1398 -4997 1411 6776 -558 -5576
2360 -5576 2631 7951 654 -3782 3191 6447 -886 -3113 5480 7541 -467 -2723 3953 5169 -1373
2375 -1373 -1087 6036 5269 -2560 -2197 4744 4156 -1706 179 5670 2378 -4104 -834 5142 2432 -2553
2391 -2553 185 4305 214 -4053 620 4543 480 -3610 87 2857 -1140 -3177 1245 3413 -1153
2406 -1153 -3390 627 1535 -1610 -2188 1895 1440 -2749 -2650 988 669 -2190 -1014 1406 -61 -3492
2422 -3492 -2236 945 -299 -2387 -1110 228 -1807 -3323 -1532 277 -1245 -2610 -1531 -1310 -2300
2437 -2300 -2472 -889 -805 -1918 -2257 -1635 -1921 -2017 -1066 -604 -1505 -1592 -1276 -953 -1452 -682 458 -490 -1046 -253
2457 -253 398 -463 98 1067 1174 -422 29 1508 1618 -14 762 2452 1454 -238 932 3025 1237
2474 1237 28 2021 2942 123 -609 2350 3563 266 -844 2536 2605 -776 -1023 2701 2097 -1538
2490 -1538 -890 2478 1127 -2728 -580 2739 59 -3405 -277 2491 -1008 -3941 -14 2561 -1404
2505 -1404 -3767 652 2248 -2325 -3053 1571 2144 -3209 -2591 2773 2095 -3393 -1643 3806 1883 -3546
2521 -3546 -814 3900 909 -2793 532 4487 319 -3074 1898 4812 -726 -2969 3084 4842 -1664
2536 -1664 -2676 3620 3807 -2440 -2160 3758 2659 -3427 -1323 4484 1061 -4829 -891 4796 26
2551 26 -5322 -263 4664 -1194 -5588 431 3586 -2640 -5186 1721 2689 -4070 -4213 3390 1974 -5549
2567 -5549 -3208 4356 1969 -5866 -2560 4975 753 -6145 -849 5499 -241 -5451 960 5517 -1945
2582 -1945 -5199 3022 5932 -2555 -5049 4097 5392 -3716 -3773 4976 4520 -4311 -2593 5459 2619 -5085
2598 -5085 -899 6595 795 -6422 -394 6883 -277 -6719 616 5985 -1838 -6927 1463 5533 -3097
2613 -3097 -5703 2592 3534 -5158 -5337 4335 3339 -6242 -4421 4732 2158 -6571 -3187 5492 1599 -6459
2629 -6459 -1977 5075 -511 -5731 1252 6118 -1969 -6027 2220 5483 -2743 -4690 3801 5450 -3288
2644 -3288 -4573 3618 3921 -2959 -1788 4889 2127 -4604 -1239 5599 1534 -4333 252 5512 -150
2659 -150 -5428 1135 5415 -214 -3448 1606 2979 -2486 -2919 3240 3371 -2592 -2163 3168 1313 -3992
2675 -3992 -1096 4668 1789 -3065 -621 2902 94 -2157 1594 3634 -633 -2163 2275 2655 -1864
2690 -1864 -68 4470 2348 -3020 -915 3363 1799 -1769 1342 4028 -583 -3438 1603 3514 -1643
2705 -1643 -1962 3476 2492 -4127 -3491 3680 2582 -3399 -1526 3591 -194 -5567 -641 4197 -1472 -5417
2721 -5417 811 3180 -4590 -6954 2273 4460 -4761 -6267 2156 2567 -6141 -5022 4779 2632 -7146
2736 -7146 -4021 4811 431 -7717 -1273 7678 114 -9162 -1211 7339 -682 -7074 2310 8068 -2892
2751 -2892 -7766 3351 7681 -3387 -5658 6377 7196 -6542 -6094 7745 7114 -6328 -4208 8392
2765 8392 4312 -8705 -3092 10250 3557 -8259 -1212 8703 -408 -9845 1293 10801 -1259 -10508
2779 -10508 1545 8775 -3970 -9203 4677 9571 -5552 -9530 4704 7257 -6905 -6645 8311
2792 8311 6123 -9371 -7185 8303 5510 -8504 -3566 9816 2937 -10443 -2811 10561 2689
2805 2689 -8601 184 9879 -863 -9958 2459 11425 -968 -8223 3363 8787 -4202 -8047
2818 -8047 5812 10106 -3750 -7763 4779 6316 -6153 -5287 8258 6198 -7640 -6161 6687
2831 6687 3662 -7683 -2354 8431 2471 -9860 -4167 7171 1925 -7278 -457 7204 -1416 -9675
2845 -9675 -872 7274 -385 -6400 1156 5382 -4224 -7985 2893 7785 -1937 -6205 2083 3808 -4408
2860 -4408 -4339 5824 6513 -3545 -5302 3298 3007 -3994 -1409 6955 4114 -5520 -3989 4022 3558 -2783
2876 -2783 -214 5337 1034 -5937 -2435 5012 2644 -2663 -38 3375 -1448 -5513 -137 5443 1352
2891 1352 -3869 -1172 1884 -1683 -4328 1633 5131 -365 -5286 -1548 2175 -1181 -2231 2049 3805
2906 3805 -2324 -5573 -350 3424 -126 -2135 2161 2517 -3315 -4518 2227 4747 -177 -2318 1500
2921 1500 1613 -3046 -2014 4653 4852 -1579 -3105 1379 1595 -2242 -346 5051 3127 -3970 -3507 2837
2937 2837 2300 -1796 92 4056 29 -5631 -2449 4399 2033 -2852 -809 2162 -1796 -5408 95
2952 95 5277 1234 -4724 -1437 1717 -1946 -3713 2732 5178 -1784 -5625 -475 2983 -919 -1548 3780
2968 3780 3272 -3693 -5210 2252 4565 -37 -987 3212 1455 -4711 -2422 5024 5045 -1164 -1585 2715
2984 2715 503 -3510 468 6690 3230 -3508 -2682 1911 681 -2354 2212 5441 -12 -5744 -2305
2999 -2305 3068 603 -1636 2100 2633 -3443 -6063 -148 4008 157 -2293 878 314 -4644 -4420 2654
3015 2654 4406 -1018 -3516 318 -307 -4062 -1678 4654 3310 -3383 -3968 587 666 -1902 723 4923
3031 4923 1007 -4879 -2723 2613 1968 -702 2022 3440 -1339 -4652 -427 4604 2180 -439 1456
3046 1456 1161 -2644 -3665 2458 4966 694 -2262 36 712 -2535 -1497 3474 3440 -2069 -3663 -260
3062 -260 151 -1981 -115 2992 994 -4112 -2851 1081 494 -987 811 2146 -1093 -3954 -1342 2694
3078 2694 859 -903 551 1076 -1912 -2537 1383 3127 537 -972 830 565 -1297 -683 2815 2560
3094 2560 -473 -905 1238 540 -478 1324 2702 1256 -1396 -523 829 -55 -83 1525 1486 -532 -1772
3111 -1772 35 1092 -159 -490 750 -196 -1802 -1098 296 388 -219 -631 12 -1064 -1670 -418 449
3128 449 -374 -894 -41 -363 -1038 -817 642 228 -681 -209 511 -726 -952 555 1458 -138 -993 792
3146 792 1208 -289 -155 1609 1163 -703 -418 1301 1284 -715 451 1936 537 -1341 519 1847 -479
3163 -479 -1078 791 1550 -803 -1761 1062 1515 -1433 -1559 1213 471 -2122 -1470 1220 727 -2407 -1423
3180 -1423 1642 -201 -2658 -589 1340 -643 -2644 -180 1871 -1132 -2356 523 2072 -1376 -2276
3195 -2276 1822 1840 -1462 -1605 2240 2004 -2092 -721 3054 956 -2191 48 3639 948 -2366 601
3211 601 3524 255 -2033 872 3253 -679 -2072 1685 2629 -1491 -2145 2071 1972 -2468 -1791 2265
3227 2265 1395 -3299 -1403 2500 524 -3583 -921 2622 -246 -3851 -94 2760 -1043 -4002 238
3242 238 2796 -1896 -3356 1436 2411 -2400 -2704 2311 1976 -2797 -1568 2784 1476 -3037 -875 3678
3258 3678 1000 -3140 222 4125 24 -2867 1365 4058 -522 -2925 1946 3507 -1444 -2682 2917
3273 2917 3356 -2397 -2070 3071 2282 -3258 -1777 3507 1419 -3604 -1245 3557 262 -3959 -14 3507
3289 3507 -1191 -4333 295 2997 -1959 -4006 1464 2792 -2875 -3493 2144 2472 -3497 -3122 2525 1802
3305 1802 -3664 -1968 3410 1150 -3766 -886 3915 517 -3962 85 4482 -14 -3339 1288 4089
3320 4089 -1168 -2917 2358 3840 -1609 -2631 2936 2970 -2489 -1876 3597 2233 -3255 -1419 3818 1092
3336 1092 -3606 -541 3432 135 -3790 41 3237 -1113 -3366 828 2897 -2070 -3609 1262 2329
3351 2329 -2293 -2606 2174 1297 -3194 -1885 2364 1015 -2989 -971 2940 8 -3070 90 3357
3366 3357 -417 -2824 1112 2742 -991 -2239 2009 2921 -956 -2008 2495 2062 -1978 -411 3299
3381 3299 1628 -2318 -529 2998 536 -2329 731 3255 -527 -2614 700 2265 -1357 -2580 2111
3396 2111 2379 -2335 -2674 1706 1477 -2717 -1102 2403 482 -3822 -1709 2132 -109 -3329 -250 2459
3412 2459 -1590 -3799 392 2864 -1264 -3095 1457 2066 -2732 -2732 2690 2737 -2131 -1485 2684 1089 -3385
3429 -3385 -499 4405 1622 -2858 -123 3250 254 -3151 1586 4593 -205 -3232 1080 3147 -1503
3444 -1503 -2032 3104 3247 -2655 -3651 2280 2550 -2638 -1092 3961 1068 -4840 -1955 3376 1256 -2979
3460 -2979 -228 3368 -1161 -5083 -135 4077 15 -3367 635 2468 -2824 -4027 2122 4155 -2150
3475 -2150 -3601 1755 1818 -3273 -1559 4229 2766 -3663 -2249 2804 1550 -2824 650 4885 672
3490 672 -4300 -970 3904 711 -2259 2070 3624 -1701 -4143 1295 4264 -51 -2138 1754 1858
3505 1858 -3282 -2798 2937 3584 -2103 -2447 1401 464 -3416 -899 3672 1535 -3914 -2344 1486 -350
3521 -350 -2651 454 3284 -715 -4574 -1587 2415 237 -1684 925 1958 -2414 -3442 1205 3057
3536 3057 261 -1397 735 778 -2333 -1251 2988 3278 -684 -1668 900 328 -1146 950 3926 1755
3552 1755 -2393 -1841 1233 1113 -180 1542 2402 -646 -3180 -1101 1980 1676 105 639 209 -2236
3568 -2236 -2722 -126 2284 1217 -982 -814 -1077 -2165 -1119 1752 2115 -777 -2006 -1760 -1133 -514 915
3585 915 2077 1004 -1820 -2719 -713 744 1300 1776 1173 -860 -2406 -2047 970 2619 2037 631 -344
3602 -344 -1323 -1572 316 2453 2949 763 -924 -1216 -764 108 1775 2879 1384 -1271 -2625 -1130 835
3619 835 1334 1757 1549 -702 -2696 -2533 314 2052 1066 319 -671 -2334 -3046 -1091 2056 2050 32 -1314
3637 -1314 -1923 -2389 -1211 1298 2660 1032 -1744 -2068 -1130 -218 637 2222 2106 -437 -2485 -1080 454
3654 454 1535 1596 2098 719 -1968 -2047 822 2524 1930 862 755 -610 -1956 -813 2041 2849 798
3671 798 -685 -623 -918 -1349 721 2884 1587 -1248 -1739 -841 -775 -314 1174 1957 -504 -2921 -2057 69
3689 69 170 -136 719 303 -2012 -2953 -379 1049 507 -174 361 -270 -1967 -1768 1103 1934 64 -702
3707 -702 33 -475 -1534 -133 2131 1755 -384 -705 508 -203 -504 1021 2241 743 -1321 -875 824
3724 824 276 -67 1435 1533 -705 -2096 -237 1228 51 49 1043 256 -1603 -1381 727 1087 -272 -502
3742 -502 295 -648 -1885 -669 1416 496 -933 -351 252 -1017 -897 632 1434 -192 -1729 -116 190
3759 190 -536 -215 1120 1225 -641 -922 652 986 -57 673 1477 641 -1055 -450 1490 1163 -312 927
3777 927 1077 155 -851 367 1527 398 -189 439 453 -731 -764 1003 740 -677 -512 440 -239 -1489
3795 -1489 -441 790 23 -1279 -684 185 -932 -1410 461 891 -1028 -1561 -26 -105 -930 -685 829
3812 829 100 -1386 -736 637 392 -1109 263 1066 -296 -1024 132 1416 284 -631 656 1279 -574
3829 -574 -627 1412 1840 -513 -554 1358 922 -1155 -422 1594 936 -1137 -445 1403 101 -1495 68
3846 68 1455 -184 -1400 281 1404 -668 -1389 462 903 -1184 -1798 902 779 -1640 -1167 1123 63
3863 63 -2122 -1161 1279 -86 -1739 -209 1455 -420 -1984 190 1815 -456 -1325 770 1755 -823
3879 -823 -1249 1403 1570 -668 -878 2023 1249 -884 -414 2067 1028 -1579 -113 2265 400 -1665
3895 -1665 488 2411 -81 -1687 886 2158 -656 -1689 1021 1770 -1385 -1844 1230 988 -1855 -1848
3911 -1848 1590 647 -2283 -1139 1886 20 -2720 -548 2170 -195 -2697 -128 2066 -511 -2410
3926 -2410 438 1993 -1401 -1875 1313 1877 -1533 -1516 2009 1773 -1952 -791 2513 1177 -1829 -172
3942 -172 2439 353 -1950 645 2918 210 -1752 1086 2527 -708 -2030 1190 2467 -1046 -1780
3957 -1780 2012 1789 -1922 -1242 1832 1201 -2450 -949 2182 519 -2799 -541 1817 -385 -2580 -114
3973 -114 1877 -762 -2742 538 1910 -1432 -2386 721 1665 -1827 -1979 1591 1440 -1952 -1241 2193
3989 2193 934 -2285 -722 2569 583 -2300 72 2887 -23 -2171 716 2452 -63 -2273 1178
4004 1178 2567 -904 -1424 1644 1890 -1450 -1792 2137 1593 -1712 -789 2233 756 -2453 -396 2261
4020 2261 159 -2427 -216 2156 -624 -2824 331 2300 -1103 -2540 634 1418 -1623 -2085 1374
4035 1374 1478 -1893 -1807 1689 1083 -1974 -537 2238 613 -1994 -259 2645 31 -2105 908 2388
4051 2388 -164 -1896 846 2269 -685 -1270 1921 2200 -1200 -1333 2280 1634 -1458 -859 2476 608
4067 608 -2097 -607 1955 682 -1676 10 1942 -320 -2154 258 1911 -617 -2053 347 1363
4082 1363 -1364 -1663 1174 1389 -1649 -1655 796 578 -1718 -949 1646 533 -1892 -770 1421 229 -1661
4099 -1661 330 1861 -596 -2012 827 1921 -192 -1227 1136 1410 -1092 -1198 1487 1662 -719 -906
4115 -906 1659 1037 -1645 -232 2381 872 -1331 -220 1604 173 -1349 595 1622 -301 -1833
4130 -1833 153 1032 -717 -894 613 1028 -1537 -1842 287 573 -1087 -650 965 -99 -1863 -684
4146 -684 1248 364 -1274 -643 564 -559 -1626 28 1692 -361 -1204 8 639 -464 -274 1251
4162 1251 1311 -784 -910 834 873 -299 46 1804 507 -1113 -462 1477 517 -34 554 1093 -583 -1167
4180 -1167 780 1395 297 -152 470 307 -1206 -811 967 899 -586 -478 62 -358 -1217 -269 877 69
4198 69 -1323 -850 -144 -511 -839 398 1054 -816 -1306 -311 334 -331 -47 929 186 -1260 -1117 683 686
4217 686 150 525 1100 -285 -1183 -48 1432 744 49 564 616 -484 -592 871 1554 270 -309 240
4235 240 -22 -742 -580 1392 768 -432 -723 -279 -166 -808 236 1013 101 -1607 -754 -45 -525 -408 548
4254 548 107 -1044 -1706 -515 558 -182 -177 253 65 -1506 -1069 564 726 -156 -45 343 -356 -1088 -56
4273 -56 1611 668 -226 15 318 -199 -556 1152 1830 217 -988 24 317 -238 17 1493 1025 -550
4291 -550 -988 -75 663 20 462 925 296 -1648 -1360 258 876 -186 -164 288 -1109 -1767 -593 914
4309 914 587 -588 -583 -603 -1025 -1415 194 1738 -222 -1147 -740 -452 -685 -106 1195 1168 -610 -1746 -188
4328 -188 264 376 901 1286 438 -1286 -1204 551 1131 591 701 922 -158 -1078 -267 1651 1384 367 386
4347 386 148 -943 -762 656 1825 858 -523 -489 -254 -671 -310 986 1346 -94 -1192 -1126 -338 -274 367
4366 367 929 42 -1639 -1640 -379 352 433 724 299 -985 -1634 -945 788 952 447 219 -256 -1099 -811 413
4386 413 1442 983 268 -325 -417 -550 154 1390 1584 616 -475 -702 -605 344 1127 1337 582 -144 -728 -810
4406 -810 303 945 1141 443 -188 -838 -798 -297 250 640 42 -800 -961 -723 -543 -51 670 254 -763 -1244
4426 -1244 -948 -311 -267 325 520 -128 -1273 -1191 229 590 120 141 470 -580 -1434 -162 1315 819 -32
4445 -32 354 300 -830 -638 825 1433 507 -391 343 265 -289 -51 1473 1022 -481 -591 209 363 -291 102
4465 102 1327 346 -1384 -1110 662 243 -763 -116 1043 -495 -1550 -153 852 -301 -1023 332
4481 332 681 -1047 -1310 265 1034 -726 -1074 566 497 -1342 -755 969 1057 -1106 -619 1455 305 -1190
4499 -1190 -420 1883 210 -966 292 1382 11 -933 796 1439 -51 -820 890 1338 -568 -871
4515 -871 1232 1166 -1046 -873 1152 1058 -1120 -310 1149 360 -1394 -394 962 -115 -1615 -1 1265
4532 1265 -251 -1451 -75 1069 -565 -1403 308 950 -1325 -1598 842 724 -1195 -1169 1063 213 -1313
4549 -1313 -228 1178 186 -1173 50 1195 214 -1218 516 1615 -202 -914 653 1561 -291 -695
4565 -695 1173 1176 -734 -632 1452 1149 -967 -513 1621 312 -1477 -136 1510 413 -1378 -133 1387
4582 1387 -365 -1430 -73 1107 -779 -1638 630 692 -1313 -1431 818 537 -1608 -1320 898 138 -1787
4599 -1787 -665 1178 413 -1391 -178 1099 -315 -1465 463 1129 -454 -1196 634 1244 -614 -675
4615 -675 1097 1292 -963 -694 1442 881 -1086 -141 1680 690 -964 -150 1441 108 -1361 180 1724
4632 1724 72 -1256 761 1327 -528 -1535 791 1283 -1111 -1231 910 1221 -1310 -832 1182 600
4648 600 -1729 -827 1430 -118 -1812 -627 1258 -352 -1741 127 1515 -446 -1396 704 1137 -789
4664 -789 -1402 918 1107 -982 -544 1266 801 -1130 -395 1564 559 -1059 -38 1442 207 -1062
4680 -1062 555 1975 -74 -1227 887 1755 -646 -1204 956 1500 -825 -1030 1093 1004 -1284 -748 1197
4697 1197 393 -1330 -667 1480 33 -1601 -199 1144 -685 -1778 -8 1268 -911 -1623 487 736
4713 736 -885 -1560 767 1275 -956 -837 1079 1008 -1195 -534 1529 794 -1351 -460 1499 233 -1486
4730 -1486 64 1770 220 -1320 558 1594 -327 -1188 1111 1443 -628 -911 1086 1239 -1070 -875
4746 -875 1356 903 -1191 -682 1233 417 -1439 -518 1246 126 -1815 -199 1042 -133 -1472 -62
4762 -62 1125 -829 -1377 458 1278 -1000 -1272 692 1144 -1148 -948 1004 1091 -1151 -589 1278 612 -920
4780 -920 -208 1189 752 -851 -100 1357 348 -902 312 1686 269 -746 468 1507 -139 -501
4796 -501 598 962 -14 -544 833 1115 -514 -511 840 840 -859 -901 1085 371 -1119 -763 781 176 -1136
4815 -1136 -527 914 -473 -1264 -512 501 -86 -909 -35 77 -460 -656 -335 204 -278 -429 199 231 -574
4834 -574 -464 356 68 -334 -473 434 207 -268 14 529 217 -160 -286 193 379 3 334 655 491 -8
4854 -8 -152 202 375 165 -1 74 296 -110 -209 -171 444 264 -217 -249 -242 -268 -223 61 337 -293 -906 -609 171
4877 171 -145 -532 -198 96 -647 -1344 -80 527 42 -493 88 129 -609 -373 651 908 -89 -622 37 66
4897 66 -557 5 1206 871 -245 -664 -84 267 -192 478 1355 538 -1290 -373 822 473 -14 584 932
4916 932 -496 -1573 -471 1195 486 -477 119 602 -1349 -1590 286 1324 61 -1150 -288 -159 -1668
4933 -1668 -794 1451 1580 -798 -1715 -113 -112 -1129 -43 1821 990 -1594 -1826 200 716 -675 722
4950 722 1731 -177 -2345 -716 1360 1097 -75 980 971 -1269 -2190 362 2589 1089 -369 225 380
4967 380 -1292 -1154 1295 2349 2 -935 -120 178 -1176 -389 2319 1572 -1380 -2123 -18 268 -555
4984 -555 517 1917 365 -2447 -1831 775 461 -619 467 1327 -1188 -3079 -645 2004 989 -679
5000 -679 544 764 -1750 -2042 1067 2434 465 -1134 -458 95 -1519 -541 2270 2302 -574 -1376 193
5017 193 173 -481 457 2479 1276 -1796 -1547 424 598 49 949 2044 -418 -2363 -819 1352 960
5034 960 -549 67 852 -1038 -2326 -91 1495 340 -1110 -117 -286 -1401 -1547 783 1691 -480 -1362
5051 -1362 -246 -46 -1253 -296 1367 1447 -739 -1343 -35 -52 -347 310 1570 491 -1028 -1058 675 1006
5069 1006 299 269 976 -452 -1035 -123 786 985 256 204 698 -399 -1067 132 1248 586 -564 -370 138
5088 138 -492 -348 488 539 289 -1101 -475 -71 -102 -251 49 646 -566 -1248 -579 195 -218 -635 348 522
5108 522 -563 -957 165 527 262 -734 61 428 -832 -893 91 1024 129 -590 424 605 -533 -659 845
5127 845 1161 -288 -384 805 821 -441 -10 1217 807 -1089 -815 798 857 -858 -202 1197 164 -1423
5145 -1423 -628 1157 319 -1340 45 1021 -284 -1656 -335 979 -118 -1286 137 787 -711 -1520
5161 -1520 527 1365 -782 -1240 506 734 -1257 -875 1088 934 -1186 -886 1034 637 -1309 -707 1764
5178 1764 823 -1236 -319 1297 490 -978 231 1800 113 -1634 450 1647 -179 -1227 667 1734
5194 1734 -341 -1266 659 1296 -579 -872 941 802 -871 -1010 1215 974 -1388 -649 797 361 -1609
5211 -1609 -733 1401 135 -1758 -223 871 -250 -1445 27 1391 -503 -1497 353 1061 -678 -956
5227 -956 565 1101 -762 -994 891 701 -1040 -534 1337 561 -1179 -59 1247 404 -912 166 1156
5244 1156 91 -765 146 1021 -58 -742 484 1076 -299 -806 1004 777 -813 -599 798 145 -817
5261 -817 -207 1086 529 -928 -411 963 -204 -1109 -365 618 -186 -1036 77 665 -488 -1090 327 744
5279 744 -962 -792 804 644 -805 -289 894 367 -798 68 1025 319 -596 132 1161 53 -745 423
5297 423 1149 -273 -465 536 599 -476 -526 936 400 -591 -299 810 180 -1014 -113 916 -136 -1021
5315 -1021 200 925 -157 -948 252 578 -303 -1117 236 521 -960 -486 403 538 -779 -622 500
5332 500 448 -1314 -278 788 -102 -909 -146 997 242 -900 131 896 -459 -717 496 618 -321 -247
5350 -247 1162 936 -484 -428 839 933 -527 -129 1083 389 -681 428 1042 334 -687 249 1285 101
5368 101 -831 490 1103 -457 -983 193 673 -787 -850 721 93 -996 -747 663 -156 -1069 -225 645
5386 645 7 -1190 -123 1142 -263 -1014 -26 705 -483 -757 370 893 -547 -883 610 772 -574
5403 -574 -329 1261 483 -872 -361 1250 741 -657 -63 857 286 -784 187 1208 184 -1022 28
5420 28 865 -373 -674 383 1039 -476 -1198 475 708 -910 -614 657 197 -726 -610 770 337 -1268
5438 -1268 -453 812 132 -1340 -130 698 -277 -1072 -114 1041 -346 -950 -56 582 -415 -909 481 917
5456 917 -505 -1022 628 864 -682 -576 728 763 -528 -430 1029 942 -759 -134 912 470 -595 221
5474 221 1070 380 -645 204 824 -131 -590 331 816 -72 -812 -23 656 -556 -753 397 632 -724 -695
5493 -695 298 91 -429 -496 337 85 -990 -567 -56 226 -546 35 692 -145 -851 -446 358 336 -486 -13
5513 -13 442 -145 -685 293 634 742 -97 18 462 110 58 144 911 560 -273 105 365 -265 33 503 855
5534 855 -184 -614 -102 415 85 73 334 308 -330 -786 -259 568 168 -273 -159 -83 -864 -1044 15 902
5554 902 -117 -827 -277 89 -656 -547 267 784 -7 -885 -283 215 -371 55 575 846 -492 -914 193
5573 193 457 -44 184 1033 193 -889 -564 1272 1008 137 68 791 -135 -937 -313 1563 845 -625 -255
5592 -255 653 -226 -806 449 1543 425 -1181 -330 394 -215 -817 527 1186 -431 -1681 -367 663
5609 663 -319 -791 943 704 -1097 -1787 428 1091 -661 -604 501 377 -1316 -1002 1297 1052 -705 -674
5627 -674 1062 249 -1497 -211 1624 747 -1194 -241 743 298 -1227 365 1970 613 -1412 -78
5643 -78 1171 -208 -818 1105 1650 -301 -1526 238 1125 -173 -882 925 956 -1459 -1828 923 1414
5660 1414 -758 -796 1017 404 -2004 -1238 1401 984 -1296 -851 870 164 -1466 -534 1629 588 -1409
5677 -1409 -372 981 -86 -1272 454 1727 -317 -1930 75 1299 -453 -1332 900 1689 -764
5692 -764 -1633 765 1660 -487 -1090 1114 1170 -1255 -1186 1224 1261 -941 -977 1203 753 -1576 -796 1431
5710 1431 844 -1260 -783 901 158 -1597 -505 1571 -82 -1676 -678 902 -48 -1355 384 1007
5726 1007 -610 -1762 -152 1200 -662 -1276 348 925 -680 -1093 597 1414 -2 -877 799 831 -499
5743 -499 -800 959 1158 -602 -636 1200 580 -765 -132 1266 1133 -672 -539 984 335 -715 -225 958
5761 958 431 -584 -293 906 -52 -676 -59 822 -85 -1314 -313 582 -7 -1026 -187 658 -305 -1258
5779 -1258 -356 814 -144 -753 205 512 -396 -728 33 631 -288 -640 320 510 -443 -827 483 871 -103
5798 -103 -630 161 872 -412 -740 1053 971 -421 -700 625 814 -437 -425 950 750 -701 -397 826
5816 826 825 -954 -384 708 311 -958 -414 818 309 -1132 -270 1045 221 -1051 -230 1144 66 -1306
5834 -1306 -113 910 -529 -915 217 1100 -272 -1637 164 625 -736 -1271 789 1283 -885 -1218
5850 -1218 491 1394 -552 -487 1312 780 -1220 -665 1252 727 -1168 -177 1119 331 -967 74 1457
5867 1457 306 -829 207 1617 -485 -1313 406 1216 -103 -1032 -58 961 -794 -1206 604 1134
5883 1134 -776 -1418 485 770 -1016 -941 1104 582 -1471 -861 833 282 -1235 -482 695 135 -1521
5900 -1521 -263 1070 276 -1070 63 1172 -155 -1135 497 1502 106 -881 91 1042 -677 -917
5916 -917 823 870 -649 -290 862 616 -614 -494 1424 443 -691 -398 683 366 -587 107 662 -96
5934 -96 -834 168 805 -8 -557 392 665 -768 -722 401 675 -398 -641 78 79 -738 -101 568 245 -292
5954 -292 -376 189 -35 -651 -29 554 193 -658 -47 814 -85 -589 306 176 -104 53 473 42 -245 146
5974 146 735 165 -879 -166 422 67 -158 -147 592 -317 -368 133 281 -307 -274 322 -98 -577 -486 470 51
5995 51 -472 -548 276 -293 -703 -486 140 -316 -408 57 389 -632 -600 191 324 -494 -469 204 258 -204 -342 510
6017 510 499 -238 69 503 53 -307 -50 652 -139 -368 478 371 337 -276 511 824 -243 -344 618 694 -194
6038 -194 -54 693 168 -377 298 632 106 -434 146 530 11 -657 148 506 -292 -500 257 462 -418 -549
6058 -549 149 544 -693 -293 407 36 -875 -474 447 137 -842 -96 263 69 -484 -290 631 137 -720 480
6078 480 689 -259 -506 97 731 -549 -520 472 598 -236 -306 853 358 -156 207 701 510 -722 -128 544
6098 544 150 -516 246 923 100 -841 -165 636 -373 -361 248 165 -193 -1013 333 433 -558 -422 391 211
6118 211 -382 -513 261 229 -735 -419 135 193 -990 -72 407 15 -647 -55 584 -108 -564 65 578 -192
6138 -192 -298 488 280 -16 -560 437 551 -17 -230 419 653 -519 -223 538 419 -357 -387 682 595 -440
6158 -440 144 834 460 -333 -115 536 55 -268 330 523 -128 -824 -163 645 -271 -566 406 577 -12 -461
6178 -461 187 586 -49 -561 231 366 -264 -444 371 395 -354 -176 447 510 -376 -192 390 21 -323 -401 201
6199 201 596 -132 262 359 212 -223 -205 47 59 -284 -97 402 141 -679 -110 200 -27 -600 -283 301 129
6220 129 -736 23 -36 -64 -589 -37 56 147 -645 95 636 -254 -788 -102 553 -338 -233 216 352 -606 -412
6241 -412 155 571 89 -442 444 576 -173 -355 540 680 -239 -516 453 485 -180 -137 591 602 -206 -373 671
6262 671 192 -38 168 610 14 -529 -333 503 387 -659 -239 556 -258 -753 -287 664 77 -568 -252 326
6282 326 -610 -1114 45 923 -528 -1313 46 399 -527 -1040 331 761 -449 -1370 -153 608 -583 -510
6300 -510 872 856 -704 -837 680 607 -368 -522 752 387 -1016 -149 1011 767 -324 -193 1248 358
6318 358 -914 -192 1461 601 -1097 -100 1155 -38 -1148 108 1476 -103 -1139 -170 722 -455
6334 -455 -1176 632 1043 -571 -1466 255 689 -716 -931 676 746 -1072 -1215 525 779 -819 -688 848
6352 848 604 -1227 -758 1442 648 -994 -53 1230 -156 -1312 -132 1741 601 -829 171 844
6368 844 -232 -1140 270 1411 -87 -953 525 1017 -418 -920 998 1215 -399 -1054 632 759 -850
6385 -850 -964 1303 811 -1265 -794 1122 647 -1074 -331 984 277 -1375 -630 974 106 -1277 -693
6402 -693 1155 -98 -1704 -100 1252 159 -1327 -185 806 -370 -1169 369 1009 -96 -850 103
6418 103 557 -771 -748 542 1074 -248 -738 405 614 -658 -483 1293 832 -773 -740 217 599 -620
6436 -620 -397 1003 404 -1152 -536 783 488 -590 427 819 -179 -948 -412 1141 386 -655 -91 531
6454 531 -362 -763 -41 905 286 -636 -326 470 24 -865 413 1283 59 -1072 -12 771 121 -500 540
6473 540 928 -421 -772 232 1128 -88 -259 690 404 -452 -593 712 1177 -27 -418 496 377 -545
6491 -545 -287 857 776 -423 -1010 533 237 -981 -57 807 408 -1200 -705 311 310 -902 -406 704
6509 704 -16 -1279 -590 873 423 -915 -107 601 -402 -1448 -61 810 -78 -921 28 777 -962 -992
6527 -992 685 1236 -299 -831 353 886 -409 -556 1297 989 -610 -634 624 889 -667 -100 1079
6544 1079 657 -968 -336 1251 383 -715 -188 1129 -104 -1191 134 997 -75 -762 116 898 -572
6561 -572 -1073 97 977 -398 -1101 318 634 -833 -990 751 483 -785 -821 378 409 -1087 -666 989
6579 989 321 -1300 -654 889 148 -644 -377 1017 6 -871 -286 1073 -56 -652 362 1024 -339
6596 -339 -782 682 1056 -177 -675 486 706 -430 -644 591 765 -641 -687 516 427 -578 -158 654
6614 654 292 -719 -192 721 79 -769 -177 419 -134 -590 -122 452 -339 -595 -60 165 -569 -607 358 530
6634 530 -315 -196 390 315 -348 -671 475 36 -476 -154 292 -42 -238 25 430 256 94 235 572 178
6654 178 67 137 673 -57 -239 124 121 516 87 39 163 -463 61 367 -125 -99 199 59 -72 -72 370 159
6676 159 -228 -188 -153 -9 -111 49 -126 -53 -454 17 177 -164 -383 -9 92 55 -218 -42 -43 -162 201 294
6698 294 84 99 -93 284 189 -293 -177 273 173 -2 149 48 211 -41 164 274 -14 -59 430 175 -323
6719 -323 -204 107 282 -431 68 390 -93 -497 -364 109 -68 -384 -121 -60 -530 -443 -26 83 -224 -613 -21
6740 -21 -105 71 -281 302 263 -330 -455 366 -26 -352 -25 214 15 -338 311 388 263 -127 78 400 439 -239
6762 -239 300 437 155 324 119 202 -11 163 701 424 -266 -206 415 446 -87 -62 342 148 -123 116 306
6783 306 323 -545 -11 352 -28 -525 77 338 -343 -783 201 216 -83 -559 174 289 -312 -639 143 -75 -558
6804 -558 -84 338 269 -419 -288 158 490 -392 31 86 57 -289 -202 413 68 -507 192 942 283 -193 60
6825 60 627 -19 -48 329 258 -88 -411 329 423 -96 -228 93 276 -443 -338 219 -93 -342 -63 -44 -205 -473
6847 -473 33 253 38 -363 54 138 -354 -570 -61 200 -201 -503 -271 364 52 -77 46 87 -174 -181 64
6868 64 53 -217 -286 56 280 -214 -218 443 314 -338 -126 323 53 -22 -132 512 150 -136 -77 341 327 -190 103
6891 103 342 142 -82 -139 308 131 -315 -44 310 36 -486 -155 685 207 -599 43 195 86 -417 -95
6911 -95 171 -195 -274 -66 186 -272 -110 -121 201 -144 -461 268 419 -195 -153 442 363 -339 -386 321 416 -183
6933 -183 32 472 519 -251 -200 461 512 -153 -83 223 341 -154 -65 506 -3 -407 206 -16 -186 -509 -177 646
6955 646 305 -785 -249 370 -94 -425 -159 572 106 -279 -483 647 -126 -347 211 450 -406 -633 46
6974 46 407 113 -308 428 682 -262 -557 508 1134 -194 -257 559 73 -300 -320 454 456 -347 -328 548 257
6995 257 -245 -210 479 269 -626 -178 540 355 -588 -149 745 313 -939 -9 628 -385 -819 188 681
7014 681 -523 -998 86 394 -274 -424 21 560 -787 -1166 335 661 -352 -542 169 294 -1074 -575
7032 -575 764 744 -369 -463 775 -7 -829 -532 1512 357 -834 -237 763 98 -706 16 858 281
7050 281 -917 213 721 165 -509 401 1209 -126 -1165 294 760 88 -530 656 578 -602 -653 514
7068 514 581 -287 -352 383 303 -690 -421 858 963 -625 -499 489 13 -829 -28 1095 478 -788 -494 263
7088 263 -263 -790 122 999 -135 -731 -611 569 71 -505 268 541 -332 -752 431 765 20 -390 572
7107 572 663 -762 -511 423 813 -256 -366 345 145 -621 -477 1144 528 -519 -719 398 260 -654 -262
7126 -262 844 323 -721 -582 405 -35 -379 -182 433 -274 -730 15 317 -61 -345 38 419 -492 -578 243
7146 243 815 149 -254 123 373 -192 -599 308 799 -213 -905 -10 500 -361 -61 493 678 -361 -449 264
7166 264 401 -258 -409 501 336 -452 -432 255 503 -375 -359 496 202 -802 -465 752 280 -291 -319 566
7186 566 -128 -461 -270 755 523 -633 -33 653 -184 -774 37 821 -98 -730 -35 508 -157 -732 252
7205 252 492 -318 -876 176 746 -332 -413 311 550 -349 -400 746 727 -346 -185 543 571 -541 -600 659
7225 659 299 -665 -456 695 117 -1067 -28 829 81 -1107 -113 1056 78 -546 -7 499 -470 -974
7243 -974 -131 676 -96 -701 238 214 -587 -792 536 293 -655 -454 512 432 -582 -362 475 803 -608 -137
7263 -137 734 175 -615 -298 863 10 -391 -55 1052 15 -494 188 727 9 -600 145 544 122 -117
7282 -117 454 562 -411 -341 370 362 -244 -171 373 417 -456 -612 319 566 -439 -156 334 -64 -473 -194 156
7303 156 25 -569 -114 312 -109 -716 35 534 -111 -518 106 437 -241 -280 108 297 -11 -81 106 259 -10
7324 -10 -308 508 -63 -223 -29 375 348 -273 26 469 551 -122 17 112 271 -67 10 -6 -18 30 194 185 -249
7347 -249 -491 122 27 -114 -264 -13 157 200 29 -82 -188 -255 -64 273 -197 -169 -84 -95 -8 56 -144 199 -195
7370 -195 -176 215 -39 -18 85 -24 -309 10 181 309 -107 -254 373 320 74 176 260 180 -305 284 -213 189
7392 189 -117 39 233 120 -11 337 42 58 -82 139 -82 -134 -28 -2 190 -401 46 130 -203 -252 -206 -39
7414 -39 -232 -275 203 67 -114 -243 -14 234 204 -100 -29 -103 -442 -292 13 143 129 -8 244 280 -265 181
7436 181 337 26 -25 55 406 359 -489 111 495 254 126 -83 165 -325 56 188 178 -117 -268 117 286
7457 286 -372 -35 162 150 -276 134 101 109 -498 59 45 -77 -502 -290 50 -251 -48 49 337 15 -243 -26
7479 -26 104 -462 -353 67 165 -486 -163 266 -365 337 -281 205 69 169 -436 164 122 65 229 283 -142 -132
7501 -132 147 340 -154 -177 333 289 -127 -25 370 108 -103 -240 -115 301 -122 -67 56 63 -60 -208 107 103
7523 103 -64 -91 136 67 -170 -192 200 -158 -280 -229 100 21 -49 -242 376 113 57 9 102 101 -239 200 231 127
7547 127 -323 118 279 -148 9 218 239 -51 -132 309 157 -90 -122 55 44 -252 -40 325 274 -125 -77 -24
7569 -24 10 -202 -58 480 177 -446 -380 79 58 -270 -24 248 -285 -442 -146 -206 -498 -191 62 98 -116 65
7591 65 -408 43 -276 -224 125 179 -127 -145 -67 309 431 10 478 189 -101 -372 192 291 -76 163 335 136
7613 136 201 17 87 485 51 45 -141 30 155 -42 476 416 -154 -219 247 -102 152 41 147 77 -531 2
7635 2 167 -68 -200 -399 95 -128 -853 -142 278 -3 -459 -96 40 -429 -287 207 150 -56 -467 -52 245
7656 245 -366 -21 412 237 -118 -273 159 613 147 -127 319 499 -255 -203 386 433 -120 -103 701 215 -239
7677 -239 -102 571 80 -18 -108 404 -24 -809 -183 436 -338 -388 -237 471 33 -508 223 169 -238 -572 -9
7698 -9 284 -338 -325 179 413 -284 -553 390 398 -417 -482 392 518 -474 -404 573 215 -570 -26 712 330 -421
7720 -421 -414 798 510 -630 -173 735 52 -579 164 805 393 -469 227 454 -45 -632 302 933 -135 -250
7740 -250 106 365 -334 -391 531 548 -476 -897 346 442 -263 -203 514 364 -615 -573 530 50 -478 -194 479
7761 479 278 -658 -112 692 37 -451 -159 925 -329 -419 -169 623 14 -561 628 495 -172 -394 306
7780 306 854 -233 -744 486 486 -131 -179 329 570 -500 -410 386 334 -245 -146 515 54 -855 -346 282 336
7801 336 -602 -516 424 48 -463 -275 299 -50 -244 -459 232 -245 -746 61 784 21 -292 -571 193 -17
7821 -17 -232 215 440 -47 -588 33 555 -81 -479 310 411 -130 -318 97 478 62 -64 410 477 -398 -488
7842 -488 276 490 -333 -128 313 229 -440 -124 702 383 -226 -99 488 202 -414 -208 677 131 -452 -89
7862 -89 613 -90 -182 70 525 66 -422 -14 433 -36 -838 -148 576 -138 -308 -34 701 19 -603 16 564
7883 564 -319 -582 122 365 -134 -233 218 622 -276 -359 550 639 -214 -702 714 788 -363 -305 416 340 -41
7904 -41 -116 567 177 -528 -93 709 81 -557 16 684 81 -657 13 639 -106 -596 -196 377 48 -820 258
7925 258 305 -504 -525 505 485 -688 -749 346 343 -546 -181 313 205 -577 -497 396 420 -492 -87 874 291 -686
7947 -686 -317 659 181 -511 184 867 120 -623 138 743 -283 -414 129 387 -59 -434 108 441 -480 -369
7967 -369 376 529 -388 -302 280 458 -458 -425 504 305 -127 -553 294 -211 -363 -108 384 5 -282 -246 681
7988 681 85 -119 43 342 -143 -541 -19 112 -222 -74 2 300 -134 -475 437 233 19 -254 255 378
8008 378 -156 -100 231 46 4 148 130 148 -287 -182 291 -222 -42 -134 63 140 -323 -256 87 -163 -288 -295 260
8031 260 172 -145 -250 -80 -4 -142 164 43 -99 -157 19 73 122 16 90 -122 250 -225 182 407 324 129
8053 129 -2 180 43 314 420 160 -150 56 344 267 -42 77 98 67 396 10 -136 -33 87 -73 -158
8074 -158 292 86 -244 166 54 230 -146 -293 -41 -89 -211 -164 -26 -228 -482 211 -43 -301 -412 -191 56
8095 56 -96 -426 -108 -195 -60 -214 131 258 -148 -123 -71 202 121 13 -2 -31 -323 -245 120 277 -64 -23 138
8118 138 101 -103 133 364 -222 -91 152 571 103 -36 -104 452 -91 -116 387 85 -45 23 90 168 -345 -178
8140 -178 -55 113 -40 110 -29 49 -317 -58 -128 -329 -111 -78 125 137 131 -317 -24 -54 -263 81 157 -193 -227
8163 -227 33 158 -176 -71 -94 94 -106 69 126 -66 -166 -68 510 21 -64 -123 126 189 0 -322 170 302
8185 302 135 1 424 178 -135 239
8191B39
##END NTUPLES=NMR FID
##END=
