##TITLE=1H_BAU-21K7
 CDcl3, 8 sc, 
 20.8.2019
##JCAMPDX= 6.0         $$ Bruker NMR JCAMP-DX V2.0
##DATA TYPE= NMR FID
##DATA CLASS= NTUPLES
##ORIGIN= UXNMR, Bruker Analytische Messtechnik GmbH
##OWNER= root
$$ XWIN-NMR		Version 3.5
$$ Tue Aug 20 15:13:24 2019 Russian Standard Time (UT+4h)  she@DPX200
##.OBSERVE FREQUENCY= 200.13155
##.OBSERVE NUCLEUS= ^1H
##.DELAY= (6, 6)
##.ACQUISITION MODE= SIMULTANEOUS
##.ACQUISITION SCHEME= undefined
##.AVERAGES= 8
##.DIGITISER RES= 18
##SPECTROMETER/DATA SYSTEM= spect
##.PULSE SEQUENCE= zg30
##.SOLVENT NAME= DMSO
##.SHIFT REFERENCE= (INTERNAL, DMSO, 0, 15.7039)
##AUDIT TRAIL= $$ (NUMBER, WHEN, WHO, WHERE, WHAT)
$$ ##TITLE= Audit trail, XWIN-NMR		Version 3.5
$$ ##JCAMPDX= 5.01
$$ ##ORIGIN= Bruker BioSpin GmbH
$$ ##OWNER= she
$$ F:/spectra/data/she/nmr/H-F/1/audita.txt
$$ ##AUDIT TRAIL=  $$ (NUMBER, WHEN, WHO, WHERE, WHAT)
(   1,<2019-08-20 15:12:22.54 +0400>,<she>,<DPX200>,
      <created by zg, POWCHK disabled, PULCHK disabled
       configuration hash MD5:
       00 E9 B6 7A A2 85 ED C7 34 08 36 98 17 FE 4E 26
       data hash MD5: 16K
       83 CA 34 D2 B9 2C D7 CA BA 5A 1F 38 F1 62 D1 34>)
$$ ##END=
$$ 
$$ hash MD5
$$ 5D 25 6A 29 22 A1 C3 21 BB DB AC 32 93 D2 C9 F9
##$RELAX= 
##$RELAX= 
##$RELAX= 
##$RELAX= 
##$RELAX= 
##$RELAX= 
$$ Bruker specific parameters
$$ --------------------------
##$DU= <F:/spectra>
##$EXPNO= 1
##$NAME= <H-F>
##$PROCNO= 1
##$TYPE= <nmr>
##$USER= <she>
##$AMP= (0..31)
100 100 100 100 100 100 100 100 100 100 100 100 100 100 100 100 100 100 
100 100 100 100 100 100 100 100 100 100 100 100 100 100 
##$AQSEQ= 0
##$AQ_mod= 1
##$AUNM= <au_zg>
##$AUTOPOS= <>
##$BF1= 200.13
##$BF2= 200.13
##$BF3= 200.13
##$BF4= 200.13
##$BF5= 200.13
##$BF6= 200.13
##$BF7= 200.13
##$BF8= 200.13
##$BYTORDA= 1
##$CFDGTYP= 0
##$CFRGTYP= 5
##$CHEMSTR= <none>
##$CNST= (0..31)
1 1 145 1 1 1 1 1 1 1 1 1 1 1 1 1 1 1 1 1 1 1 1 1 1 1 1 1 1 1 1 1 
##$CPDPRG= <>
##$CPDPRG1= <>
##$CPDPRG2= <>
##$CPDPRG3= <>
##$CPDPRG4= <mlev>
##$CPDPRG5= <mlev>
##$CPDPRG6= <mlev>
##$CPDPRG7= <mlev>
##$CPDPRG8= <mlev>
##$CPDPRGB= <>
##$CPDPRGT= <>
##$D= (0..31)
0 1.2 0 0 0 0 0 0 0 0 0 0.03 0 0 0 0 0 0 0 0 0 0 0 0 0 0 0 0 0 0 0 0 
##$DATE= 1566299541
##$DBL= (0..7)
120 120 120 120 120 120 120 120 
##$DBP= (0..7)
150 150 150 150 150 150 150 150 
##$DBP07= 0
##$DBPNAM0= <>
##$DBPNAM1= <>
##$DBPNAM2= <>
##$DBPNAM3= <>
##$DBPNAM4= <>
##$DBPNAM5= <>
##$DBPNAM6= <>
##$DBPNAM7= <>
##$DBPOAL= (0..7)
0.5 0.5 0.5 0.5 0.5 0.5 0.5 0.5 
##$DBPOFFS= (0..7)
0 0 0 0 0 0 0 0 
##$DE= 6
##$DECBNUC= <off>
##$DECIM= 24
##$DECNUC= <off>
##$DECSTAT= 4
##$DIGMOD= 1
##$DIGTYP= 9
##$DL= (0..7)
0 120 120 120 120 120 120 120 
##$DP= (0..7)
150 150 150 150 150 150 150 150 
##$DP07= 0
##$DPNAME0= <>
##$DPNAME1= <>
##$DPNAME2= <>
##$DPNAME3= <>
##$DPNAME4= <>
##$DPNAME5= <>
##$DPNAME6= <>
##$DPNAME7= <>
##$DPOAL= (0..7)
0.5 0.5 0.5 0.5 0.5 0.5 0.5 0.5 
##$DPOFFS= (0..7)
0 0 0 0 0 0 0 0 
##$DQDMODE= 0
##$DR= 18
##$DS= 0
##$DSLIST= <SSSSSSSSSSSSSSS>
##$DSPFIRM= 0
$$ [...]
##$SUBNAM2= <"">
##$SUBNAM3= <"">
##$SUBNAM4= <"">
##$SUBNAM5= <"">
##$SUBNAM6= <"">
##$SUBNAM7= <"">
##$SUBNAM8= <"">
##$SUBNAM9= <"">
##$SW= 24.9336996594482
##$SWIBOX= (0..15)
0 0 2 0 0 0 0 0 0 0 0 0 0 0 0 0 
##$SW_h= 4990.01996007984
##$TD= 16384
##$TD0= 1
##$TE= 0
##$TE2= 300
##$TE3= 300
##$TEG= 300
##$TL= (0..7)
0 120 120 120 120 120 120 120 
##$TP= (0..7)
150 150 150 150 150 150 150 150 
##$TP07= 0
##$TPNAME0= <>
##$TPNAME1= <>
##$TPNAME2= <>
##$TPNAME3= <>
##$TPNAME4= <>
##$TPNAME5= <>
##$TPNAME6= <>
##$TPNAME7= <>
##$TPOAL= (0..7)
0.5 0.5 0.5 0.5 0.5 0.5 0.5 0.5 
##$TPOFFS= (0..7)
0 0 0 0 0 0 0 0 
##$TUNHIN= 0
##$TUNHOUT= 0
##$TUNXOUT= 0
##$USERA1= <user>
##$USERA2= <user>
##$USERA3= <user>
##$USERA4= <user>
##$USERA5= <user>
##$V9= 5
##$VALIST= <valist>
##$VCLIST= <CCCCCCCCCCCCCCC>
##$VD= 0
##$VDLIST= <DDDDDDDDDDDDDDD>
##$VPLIST= <PPPPPPPPPPPPPPP>
##$VTLIST= <TTTTTTTTTTTTTTT>
##$WBST= 1024
##$WBSW= 4
##$XGAIN= (0..3)
0 0 0 0 
##$XL= 0
##$YL= 0
##$YMAX_a= 136716
##$YMIN_a= -180852
##$ZGOPTNS= <>
##$ZL1= 120
##$ZL2= 120
##$ZL3= 120
##$ZL4= 120
##$ABSF1= 10
##$ABSF2= 0
##$ABSG= 5
##$ABSL= 3
##$ALPHA= 0
##$AQORDER= 0
##$ASSFAC= 0
##$ASSFACI= 0
##$ASSFACX= 0
##$ASSWID= 0
##$AUNMP= <proc_1d>
##$AZFE= 0.1
##$AZFW= 0.1
##$BCFW= 1
##$BC_mod= 2
##$BYTORDP= 1
##$COROFFS= 0
##$CY= 11.3945322036743
##$DATMOD= 1
##$DC= 2
##$DFILT= <>
##$DTYPP= 0
##$F1P= 20.1720416913024
##$F2P= 0.152960286110954
##$FCOR= 0.5
##$FTSIZE= 0
##$FT_mod= 4
##$GAMMA= 1
##$GB= 0.15
##$INTBC= 1
##$INTSCL= 1
##$ISEN= 128
##$LB= 0.24
##$LEV0= 0
##$LPBIN= 0
##$MAXI= 10000
##$MC2= 0
##$MEAN= 0
##$ME_mod= 0
##$MI= 1.114404
##$NCOEF= 0
##$NC_proc= 0
##$NLEV= 6
##$NOISF1= 3.799351
##$NOISF2= 2.8
##$NSP= 1
##$NTH_PI= 0
##$NZP= 0
##$OFFSET= 15.70392
##$PC= 1
##$PHC0= -9214.67
##$PHC1= 17.40096
##$PH_mod= 1
##$PKNL= yes
##$PPARMOD= 0
##$PSCAL= 0
##$PSIGN= 0
##$REVERSE= no
##$SF= 200.130013532006
##$SI= 16384
##$SIGF1= 3
##$SIGF2= 2
##$SINO= 400
##$SIOLD= 16384
##$SREGLST= <1H.CDCl3>
##$SSB= 0
##$STSI= 0
##$STSR= 0
##$SW_p= 3612.71676300578
##$SYMM= 0
##$S_DEV= 0
##$TDeff= 0
##$TDoff= 0
##$TI= <>
##$TILT= no
##$TM1= 0
##$TM2= 0
##$TOPLEV= 0
##$USERP1= <user>
##$USERP2= <user>
##$USERP3= <user>
##$USERP4= <user>
##$USERP5= <user>
##$WDW= 1
##$XDIM= 8192
##$YMAX_p= 0
##$YMIN_p= 0
$$ End of Bruker specific parameters
$$ ---------------------------------
##NTUPLES= NMR FID
##VAR_NAME=  TIME,          FID/REAL,        FID/IMAG
##SYMBOL=    X,             R,               I
##VAR_TYPE=  INDEPENDENT,   DEPENDENT,       DEPENDENT
##VAR_FORM=  AFFN,          ASDF,            ASDF
##VAR_DIM=   8192,          8192,            8192
##UNITS=     SECONDS,       ARBITRARY UNITS, ARBITRARY UNITS
##FACTOR=    0.0002004,     1,               1
##FIRST=     0,             0,               0
##LAST=      1.6414764,     0,               0
##MIN=       0,             -180852,         0
##MAX=       1.6414764,     136716,          0
$$ Real data points
##PAGE= N=1
##DATA TABLE= (X++(R..R)), XYDATA
0@%%%%%%%qJ6j6J6j6K4l2M0m8N6p1Q4r6J10j31J52j76K05k32K65l05L45l88M41
$$ 0 0 0 0 0 0 0 0 -8 8 -8 8 -8 16 -16 24 -24 32 -39 45 -51 59 -72 80 -96 109 -123 142 -163 182 -206 235
31B35m94N50o20O94p74Q63r57J062j180J308j448J602j774J967k180K420k693
$$ 235 -259 291 -329 365 -409 454 -503 559 -621 687 -761 841 -933 1034 -1146 1274 -1419
48a419L003l363L786m287M896n655O629p934R787j2646J7701k9328J06437K7543
$$ -1419 1584 -1779 2007 -2280 2616 -3039 3590 -4344 5443 -7203 10498 -18830 87607 115150
62A15150j68129l8213L4463J08942O1913p498j07555j17328n1463O8174J09165
$$ 115150 -52979 -91192 -56729 52213 114126 106628 -927 -118255 -169718 -101544 7621
73G621O2366m2358r4504p8234J405P3852J02685N1620l1352q4041n3563K4921
$$ 7621 69987 27629 -66875 -145109 -143704 -69852 32833 84453 53101 -30940 -84503 -59582
85e9582Q6330P3798J5193m3040o1021l8399J4106N5096M8924p347n7064n8984
$$ -59582 26748 100546 115739 72699 11678 -26721 -12615 42481 91405 84058 26994 -31990
97c1990j8294J7802K5825J2618p756k8982l5261j1534K2585K9468Q256q364j321
$$ -31990 -50284 -32482 -6657 5961 -1795 -30777 -66038 -77572 -54987 -25519 -17263 -25627 -26948
110b6948Q435P852N388J2343J6137R662N429J1023R311p240j9534o502J5297J9211
$$ -26948 -18513 -10661 -5273 7070 23207 32869 38298 49321 58632 51392 31858 25356 40653 59864
124E9864Q56k1631l2299k8213j0359J3120K4786P297k9305m8851k8854J3608M0057
$$ 59864 60720 39089 6790 -21423 -31782 -18662 6124 13421 -15884 -64735 -93589 -79981 -39924
137c9924L2944N467k2115l5112j8090K4119N9470M9213l43l8641l4499q68L1575
$$ -39924 -6980 -1513 -23628 -58740 -76830 -52711 6759 55972 55629 16988 -17511 -18379 13196
150A3196M5248L0667p891m7083m8881q832L5541L9282N185l0828m4450l4511o218
$$ 13196 58444 89111 81220 34137 -14744 -23576 11965 51247 56432 25604 -18846 -53357 -59575
163e9575K7141L6211J0024k9282l9922j4825J7968L3462K6106Q636j0104j8634
$$ -59575 -32434 3777 13801 -15481 -55403 -70228 -52260 -18798 7308 15944 5840 -12794
175a2794p238J8162L1709K0841k080j3692q827l37K062K980L874j127j2742j5013
$$ -12794 -20032 -1870 29839 50680 48600 34908 26081 25744 27806 30786 34660 33533 20791 5778
189E778p756m302j0807j1845l34R078J219j4218j6263n705N293J3998K0394J6467
$$ 5778 -1978 -6280 -17087 -28932 -29266 -20188 -18969 -33187 -49450 -55155 -49862 -35864 -15470 997
203I97m401k1521j2621J6713L7209L0401N695j7284k5361j4788J1938L5949L1459
$$ 997 -3404 -24925 -37546 -20833 16376 46777 52472 35188 9827 -4961 6977 42926 74385
216G4385n693m1122m3049j3709K0674L2515J7485j4368m3257m4177j0339L2515
$$ 74385 68692 27570 -15479 -29188 -8514 24001 41486 27118 -16139 -60316 -70655 -38140
228c8140M5949J7740k4197m1256k5290R588L9497M4914J9859k1207m2911k1952
$$ -38140 7809 25549 1352 -39904 -65194 -55606 -16109 28805 48664 27457 -15454 -37406
240c7406K1785M7177L3811p81k8805l7390k0455J3436L6997K5986j2528m2399
$$ -37406 -15621 31556 65367 64586 35781 -1609 -22064 -8628 28369 54355 41827 -572
252e72l7965q580J8162K5907J3678j0176l1556k9067j859K7598L1756J1799j1937
$$ -572 -38537 -47117 -28955 -3048 10630 454 -31102 -60169 -62028 -34430 -2674 9125 -2812
265b812j8440r359Q005K2353K6945J2905r177j8895p480J0806J6437R946j368
$$ -2812 -21252 -30611 -22606 -253 26692 39597 30420 11525 4045 14851 31288 41234 39866
278C9866q993j4005j2859k255Q032N992o787j3972j0027m567k253m68L899M836
$$ 39866 30873 16868 4009 1754 9786 15778 8991 -4981 -15008 -19575 -21828 -22296 -18397 -13561
292a3561j551o923k548M744O546M563O898P756K275m271k320O401R225N164K39
$$ -13561 -15112 -22035 -24583 -19839 -13293 -8730 -1832 5924 8199 3928 1608 8009 17234 22398 22637
307B2637k713n470p379l584M069O135k696j2549j1445m821R77K734K445k01n812
$$ 22637 19924 14454 7075 3491 7560 13695 10999 -1550 -12995 -17816 -16839 -14105 -11660 -11861 -17673
322a7673r369k829R618J2822M832k755k799K434N834P545R900N883k399p074p84
$$ -17673 -27042 -29871 -20253 -7431 -2599 -5354 -8153 -5719 115 7660 17560 23443 21044 13970 13186
337A3186Q549Q007j232p504p452m277k424J555K092m295j1856j2421j491O699
$$ 13186 21735 29742 28510 21006 13554 9277 6853 8408 10500 6205 -5651 -18072 -19563 -12864
351a2864M837l694o881n983k433M808J0719R841o9q530o079O765J4568J1689J733
$$ -12864 -8027 -11721 -18602 -24585 -27018 -22210 -11491 -1650 -1719 -10249 -16328 -9563 5005 16694 18427
366A8427n470p122m719M157J2312R690m926j6602j3320q70Q885P996q3q388j4255
$$ 18427 12957 5835 1116 5273 17585 27275 22349 5747 -7573 -8443 442 8438 8355 -33 -14288
381a4288j1580J796J4071J2276j279j3253r849R57J1322J4005J0017k72j0990
$$ -14288 -25868 -24072 -10001 2275 996 -12257 -22106 -21149 -9827 4178 14195 13923 2933
394B933r343M397J6682J4350O64j0375j1054m977L980R906P259n073j6257j5182
$$ 2933 -6410 -2013 14669 29019 29683 19308 8254 3277 7257 17163 24422 19349 3092 -12090
408a2090k355R350P865j877j0297j1357o625K140J0186J0322j79j0145q768L565
$$ -12090 -14445 -5095 2770 893 -9404 -20761 -27386 -25246 -15060 -4738 -4917 -15062 -23830 -20265
422b0265J3037J1562L747k675n693l172M474J2503R214j267j1136q712J604O957
$$ -20265 -7228 4334 8081 5406 -287 -3459 1015 13518 22732 21465 10329 1617 3221 10178
436A0178N628l20p506j1125p732K095R124N500n993j2226o780K704Q543P880K675
$$ 10178 15806 15486 7980 -3145 -10877 -8782 342 5842 -151 -12377 -19157 -16453 -7910 -30 2645
451B645m204q329l135P899J4418Q515l982r678n133M133R178P834J562p951j2588
$$ 2645 -1559 -9888 -13023 -5124 9294 17809 13827 4149 -984 3149 12327 20161 21723 13772 1184
466A184p161N268J0779L429q839j3896r022J49P069Q111J396q739j3299m767R470
$$ 1184 -5977 -709 10070 13499 4660 -9236 -18258 -18109 -11040 -2929 -1533 -10272 -23571 -28338 -18868
481a8868J4359P214l453q695n315L041J1939J3865N834p187j2215l502R058J2775
$$ -18868 -4509 2705 -748 -9443 -14758 -11717 222 14087 19921 12734 519 -2983 6075 18850
495A8850N972m415j1205j0349k541P313J0378K195j0932j5548p007N766J0499
$$ 18850 24822 20407 9202 -1147 -3688 3625 14003 16198 5266 -10282 -17289 -11523 -1024
508a024N360k789r614r836r93R840J3838N636p321j0816l541P805J1351Q293J28
$$ -1024 4336 1547 -8067 -17903 -18896 -9056 4782 10418 3097 -7719 -11260 -3455 7896 16189 16317
523A6317q780j0066k474R180J1248K176r006j3127o476K515P119O221j444j0786
$$ 16317 7537 -2529 -5003 4177 15425 17601 8595 -4532 -11008 -8493 -1374 4847 3403 -7383
537g383j2248k862Q555J1255L881o469q765m187M585J0496J1147K655o802r005
$$ -7383 -19631 -22493 -13938 -2683 1198 -5271 -14036 -18223 -13638 -3142 8005 10660 3858 -5147
551e147m0R833J2197M482m904q186o094P96P478Q171L65j0627j2161m029N041
$$ -5147 -5187 4646 16843 21325 16421 8235 2141 2937 10415 18586 18951 8324 -3837 -7866 -2825
566b825P011K167m898r296p944l10P369Q681J416o736q018m64O487Q127N253n55
$$ -2825 4186 6353 1455 -7841 -15785 -16095 -8726 -45 1371 -5365 -13383 -13847 -7360 767 6020 5465
582E465m982n264J377Q114P508O48o648p120j098L922M114J474l956o877o252
$$ 5465 483 -4781 -3404 4710 12218 12866 6218 -902 -2000 1922 6036 7510 3554 -3323 -9575
597i575K11N567M476k300p315n340J062N675N598K578k124n354k104N380J0161
$$ -9575 -9364 -3797 679 -1621 -8936 -14276 -13214 -7539 -1941 637 -1487 -6841 -8945 -3565 6596
612F596O114j837o311l398K478O392P605J885o487r914m989L892Q684L153n277
$$ 6596 12710 10873 4562 1164 3642 10034 17639 19524 13037 3123 -1866 2026 10710 13863 8586
627H586j0860q469j741O038P535K365p237j1897n727N357J1225Q172j801p784
$$ 8586 -2274 -10743 -12484 -6446 1089 3454 -3783 -15680 -21407 -16050 -4825 3347 1546 -6238
641f238o953m91Q032J2096O896l850j0393o304M132J0145P818j2p248r803n416
$$ -6238 -13191 -13682 -5650 6446 13342 9492 -901 -7205 -3073 7072 14890 14878 7630 -2173 -7589
656g589M005R033N256n220j0445p343L40N819P068K268m707p657l654M735R173
$$ -7589 -3584 5449 10705 5485 -4960 -12303 -11963 -6144 924 3192 -1515 -9172 -12826 -8091 1082
671A082N623q25m979l173J801N645N924K606l132n064k753K419N404J601m152
$$ 1082 6705 5880 901 -2272 -471 5174 11098 13704 10572 5508 2755 5174 10578 12179 8027
686H027o815l148M88J930Q66j535n990n295q94M227M232o28n160m047L12M415
$$ 8027 1212 -1936 -1448 482 1348 -187 -6177 -11472 -12366 -8139 -3907 -4535 -9695 -13742 -13430 -9015
702i015O604M416j226n533l405M392Q994O240k77n845n897n74M951P438L763m216
$$ -9015 -2411 2005 779 -4754 -8159 -3767 5227 11467 11190 5345 -552 -1126 3825 11263 15026 10810
718A0810j0134p473J511P649O540j580p998r375l529M635R293O301k450r589p628
$$ 10810 676 -6797 -5286 2363 8903 7323 -675 -10050 -13579 -8944 349 6650 4200 -5389 -13017
733a3017K465R515R942K935n661p900m527M178J0428Q787j982j0063q876j387
$$ -13017 -10552 -1037 8905 11840 6179 -1721 -6248 -2070 8358 17145 15163 5100 -3776 -5163
747e163O089P796L039n828j0899q420J238Q197P203j440q947q212k263N295Q975
$$ -5163 926 8722 11761 5933 -4966 -13386 -12148 -3951 3252 1812 -7135 -15347 -17610 -12315 -3340
762c340N701k606p246n047K080R667R045J791n041o126j432M667Q105N259k087
$$ -3340 2361 -245 -7491 -12538 -10458 -791 8254 10045 5004 -1122 -2554 2113 10218 15477 13390
777A3390p861o606P88O310N240j335o355o972l265K091N895L377l220p856m907
$$ 13390 5529 -1077 -289 6021 11261 9926 3571 -3401 -6666 -4575 1320 4697 1477 -6379 -11286
792a1286K548O189N212o4m235m670j212N486P383L870l454o681l021L002O288
$$ -11286 -8738 -2549 2663 2599 -1636 -6306 -7518 -2032 5351 9221 5767 -914 -3935 -933 5355
807E355M288j296o206o458k106M472O451J665o040q667m956L170P261N129j880
$$ 5355 9643 8347 2141 -4317 -6423 -1951 4500 6165 125 -8542 -13498 -10328 -3067 2062 182
822A82o361o455n95O524R767M125m471p570l076M372R241P146Q48o393q247j817
$$ 182 -6179 -12634 -13229 -6705 3062 7187 2716 -4854 -7930 -3558 5683 12829 13677 7284 -963 -2780
838b780O367Q743M084n426q594o865O14N994P265k87p535r622m186M574P994M345
$$ -2780 3587 12330 16414 10988 2394 -4471 -3857 2137 9402 9115 1580 -8042 -12228 -7654 340 4685
854D685l288p366o139P25O554Q061K533m844o826k899M969P745M424j757n793
$$ 4685 1397 -5969 -12108 -11383 -4829 3232 5765 921 -5905 -8804 -3835 3910 8334 6577 784
869G84m841k49N354O187L36n584o544k206L435N091K052k927n854m400Q90O163
$$ 784 -4057 -4306 1048 7235 7571 1987 -4557 -6763 -3328 1763 3815 888 -4966 -9366 -8476 -2313
885b313N690l61n879m436j26N967O724L266l111o207l593L575Q187O149j279p267
$$ -2313 3377 3016 -2863 -7299 -7425 -1458 5266 8532 5421 -786 -4379 -804 7383 13532 12253 4986
901D986p322r05O006P508K342m932r843o810J030Q487P051q68q610j0049l257
$$ 4986 -2336 -3241 2765 10273 12615 7683 -2160 -8970 -7940 547 7598 6730 -1880 -11929 -15186
916a5186N343R569O035k519r307q381O90R477R669L942n039r256n554K932J0074
$$ -15186 -9843 -274 5761 3242 -6065 -14446 -13756 -4279 5390 9332 4293 -4963 -10517 -7585 2489
931B489Q836O48p985q983l134N104Q261N417k526p652q127j353N698P949K839
$$ 2489 11325 11973 3988 -4995 -8129 -3025 5236 10653 8127 475 -7652 -9005 -3307 4642 7481
946G481l695p392m516J070N950N609J907l346m986k534K573N130L637K77l193
$$ 7481 3786 -3606 -8122 -7052 -1102 4507 6414 3068 -1918 -4452 -1879 3251 6888 7165 3972
961C972k664o32N78K368J741p06k300j486j058n25j001j54N91L50q88j563k082
$$ 3972 1308 676 1254 3622 5363 4657 2357 871 -187 -712 -1713 -1867 -1276 -926 -1814 -3377 -5459
978e459j106J70K112K670O40j571l625j286K386M824L901K17k951m197j308L762
$$ -5459 -6565 -6395 -4283 -1613 -973 -2544 -6169 -7455 -5069 -245 3656 3873 922 -3275 -4583 -821
994h21O216M652k098n968n487j03N265O054K063l843p689m982J327O870N869k95
$$ -821 5395 10047 7949 1981 -3506 -3609 1656 7710 9773 5930 -1759 -6741 -5414 1456 7325 7030
1010G030o268o756k591L675P572N076j672p006o246N76O241O806K343l968o684
$$ 7030 762 -5994 -8585 -4910 2662 7738 6066 -940 -7186 -6610 -369 6437 8780 4812 -1872
1025a872m276K116O560N584j027o387o681j421M999N337K022l905o363m499J528
$$ -1872 -6148 -4032 2528 8112 7085 698 -5983 -7404 -2405 2932 4954 1049 -5314 -9813 -8285
1040h285N703N146p08n344n230o44N742N976K537l010n256l255K901P384N091
$$ -8285 -2582 2564 1856 -3488 -8718 -9362 -3620 2356 4893 1883 -3373 -6628 -3727 3657 8748
1055H748l71n782n479o2N340O315K427m208p377m673K213O893N360j513p007p303
$$ 8748 8377 2595 -2884 -2946 2394 8709 11136 6928 -449 -5122 -2909 3984 9344 7831 824 -6479
1071f479j474M646P248L194l612p579o008J389P508P006N30n311o896l257M286
$$ -6479 -7953 -3307 3941 7135 3523 -4056 -10064 -8675 -1167 5839 6369 1058 -5838 -9095 -4809
1086d809P427N533j689p039o391K61N362O477K034m413o553m419J845O092M626
$$ -4809 2618 8151 6462 -577 -6968 -6707 -1345 5132 7166 2753 -3800 -8219 -6374 -282 4344
1101D344n15n189n452q31L917N005K350j706m306l036J828M632M087j28l315k713
$$ 4344 3829 -1360 -6812 -7643 -3726 1279 3629 1923 -2383 -5419 -3591 1041 5128 5000 1685 -1028
1117a028K54L320L194J192k644k947j485K101K884J175k146l968k063P30L256
$$ -1028 -774 2546 5740 6932 4288 1341 -144 1957 4841 6016 3870 -98 -2161 -1431 1825
1132A825J354j129m034l399k80L281M163jl187m507j505K797M860L394j287m691
$$ 1825 3179 2050 -1984 -5383 -5663 -2382 1781 1780 -1407 -5914 -7419 -4622 238 3632 2345 -2346
1148b346m135O78M967N619J043l550n770k380K810N423L781p26n701n567k11M899
$$ -2346 -6481 -5803 -836 4783 5826 2276 -3494 -5874 -3064 2359 6140 5414 -287 -5854 -6065 -1166
1164a166N853J555l750o531l051K256O445M609n37n149n533l99N209O226K214
$$ -1166 4687 6242 2492 -4039 -7090 -4834 1611 6220 5683 534 -4999 -5398 -189 6037 8251
1179H251l516o269l105K194O537M820j089o106o153o28N123N854J930m730p411
$$ 8251 4735 -1534 -4639 -2445 4092 8912 7823 1717 -4436 -5064 59 5913 7843 3113 -4298
1194d298m339K315O978N324j659p435o777q58N693Q053L374m235q045n483K645
$$ -4298 -8637 -6322 656 5980 4321 -3114 -9891 -10749 -5056 2997 6371 2136 -5909 -11392 -8747
1209h747Q676P754M37o796q221k625N985R524N575k932r332p543L00Q212R077
$$ -8747 -71 7683 8120 1324 -6897 -9522 -3537 5987 11562 8630 -702 -8245 -7945 267 9344
1224I344K692o503r902n468L213R571P282l84q402r406k461O261J0025N143l558
$$ 9344 12036 5533 -4369 -9837 -6624 2947 10229 9845 1443 -7963 -10424 -4163 5862 11005 7447
1239G447q927p162O46P898Q305K145n589q810m122L430P586N626r18o444p591
$$ 7447 -1480 -8642 -7996 -98 8207 10352 4763 -4047 -8169 -4739 2847 8473 7555 1111 -6480
1254f480j205M126O566K541l320o376m177J244M911M103P98l988m308j025K942
$$ -6480 -7685 -3559 3007 5548 2228 -4148 -8325 -7081 -2170 1933 2731 -1257 -5565 -6590 -3648
1269c648M689K019j480l827j255J645L517K576Ll159k181O74L202K510p5l177
$$ -3648 1041 3060 1580 -2247 -3502 -1857 1660 4236 4239 1080 -1101 -427 2775 5285 5210 2033
1285B033k793m49K478L121O26k769m534k039J916M403K774j182n046m194K43L891
$$ 2033 -760 -1209 1269 4390 5016 2247 -2287 -4326 -2410 1993 4767 3585 -1461 -5655 -5412 -1521
1301a521N468P20l065n113k743K252N750M209q36m629n126j367L641N950K522
$$ -1521 3947 4667 1602 -3511 -6254 -4002 1748 5957 5121 492 -4634 -6001 -2360 3590 6112
1316F112k688n873m405L07M798N264Q83l858n946k494K447N196M315j059m259
$$ 6112 3424 -2449 -6854 -6547 -1749 3515 4398 540 -5406 -7900 -5453 -257 4058 2999 -1260
1331a260l611m80M119M530K018j388m084k033J014L979L268k77k462l114o89J827
$$ -1260 -4871 -5351 -1232 3298 5316 3928 -156 -2189 -1175 2804 6072 5795 3333 219 -470 1357
1347A357K760N57j549l275j770Q55J614J451r98k703k191J76K501K019n06k344
$$ 1357 4117 4674 3125 -150 -1920 -1065 549 2000 1002 -1701 -3892 -3716 -1215 804 298 -2046
1363b046k190N8K297L416J013k314k510j409J733L669K349o78l373l157n40L313
$$ -2046 -4236 -4178 -1881 1535 2548 234 -2276 -3685 -1952 1717 4066 3388 15 -3142 -3682 -369
1379c69L667P33k510m447k102P84M393L306j64l927m485r63L237M903L122j903
$$ -369 3298 4031 1521 -2926 -5028 -4244 149 3455 3291 -636 -5121 -6084 -2847 2056 5178 3275
1395C275m097l098Q53M219M399J510k538m600k246K424L877L014p09m228l856
$$ 3275 -822 -3920 -3067 1152 5551 7061 4523 -77 -2323 101 3978 6992 6283 2055 -1801
1410a801j169K471L463J508k930l948k699L18K720K614L05k724l024r15J941L120
$$ -1801 -2970 -499 2964 4472 1542 -2406 -5105 -4787 -2067 547 852 -1872 -4896 -5811 -3870 -750
1426g50J467p27k225p16M00K732K000J23j519j778J92J697K001K1j431j947j398
$$ -750 717 -10 -2235 -2951 -2551 181 2181 2304 785 -993 -801 896 2897 2918 1487 -460 -1858
1443a858J492J780R55j555k328j283L58K268J828j88k602j712K01K156K519J668
$$ -1858 -366 1414 2369 814 -1514 -2797 -2439 -171 1657 1469 -1133 -2845 -2644 -488 2031 3699
1459C699j668k771j102J826L384K048n84k671k257r50J717L262P29k297l656k056
$$ 3699 2031 -740 -1842 -16 3368 5416 4832 2161 -96 -1046 671 3933 4662 2365 -1291 -3347
1475c347M20K572J950p38l021l129j432K725L032J102j309k972j771J378L702
$$ -3347 -2927 -355 1595 857 -2164 -5293 -6725 -4000 -968 134 -1175 -4147 -5918 -4540 -838
1490h38K786M16k416k018k81K445L406J494j292k652j791N04K694K221k23k739
$$ -838 1948 2364 -52 -2070 -2351 94 3500 4994 3702 1050 -741 -237 2457 4678 4455 1716
1506A716l211j318J729K974J120j930l055j773K55K514K856L63k167k676n97K004
$$ 1716 -1495 -2813 -1084 1890 3010 1080 -1975 -3748 -3493 -979 1877 2240 73 -2603 -3200 -1196
1522a196L417J600m86k647j899K78K322K533L29k003k962j023N71K153J524j831
$$ -1196 2221 3821 3335 688 -1211 -933 1389 3922 4251 2248 -714 -1737 -1166 987 2511 680
1538F80k685k054j01J498J743L67j695k407n91J573K114J936o27j269o83M07K276
$$ 680 -2005 -4059 -4160 -2662 -919 -552 -2247 -4654 -5245 -3672 -1558 378 -249 -1518 -2201 -1794 482
1555D82K182Q10j531j062O4J370K103K06j010k221p14O87J394N98j120k623j769
$$ 482 2664 3474 1943 881 945 2315 4418 4624 3614 1393 679 1366 2760 3358 2238 -385 -2154
1572b154j05J594K142k87k410k706o57K265K709J552j107k829j954R99L722K998
$$ -2154 -2259 -665 1477 1190 -1220 -3926 -4583 -2318 391 1943 836 -1993 -3947 -2948 774 3772
1588C772M60k589l100j428J753L984K320j267m236l379n76K656L324J485k375
$$ 3772 4232 1643 -1457 -2885 -1132 2852 5172 3905 -331 -3710 -4286 -1630 1694 3179 804
1603H04m760l084J335M256L062R9l108l696j035K723M865L011q28l371k929M36
$$ 804 -3956 -7040 -5705 -1449 1613 1712 -1396 -5092 -6127 -3404 1461 4472 3644 273 -2656 -2220
1619b220L644M364J129j894l691k150Q35L881K200o38l372l846j595J801L177
$$ -2220 1424 5788 6917 5023 1332 -818 17 3898 6098 5460 2088 -1758 -3353 -1552 1625
1634A625P34j382l485k946P86K402K426J52j935k131n69J752K809J632n13j953
$$ 1625 2359 977 -2508 -5454 -4668 -2266 160 312 -1623 -3754 -4323 -2571 238 1870 1357 -596
1650e96j653J324K241J443k0j466k070L5R81K042k7j411k133j373Q29J451R62
$$ -596 -2249 -925 1316 2759 2739 1273 -797 -762 219 2261 2234 823 -1310 -2683 -1854 -403 559
1667E59l52k688j456O19J873K176O73j054k437q2J692K525K319m19k443j382K15
$$ 559 207 -2481 -3937 -3318 -1445 731 1404 350 -2087 -2169 -477 2048 4367 3948 1505 123 338
1684C38K332K383N19j923k664k159R81K384R96j025k530k570j053J844J856K54
$$ 338 2670 5053 5572 3649 985 -1174 -193 2191 3187 2162 -368 -2938 -3991 -2147 -291 -37
1700c7j451k325j248O92J951K064J57j010j521Q7J293K388J340l57j312j008M32
$$ -37 -1488 -3813 -5061 -4369 -2418 -354 -197 -1207 -2728 -2641 -1348 1040 2380 2023 711 -297 135
1717A35J583J354j00j476j400n97N77R82j58n49j619m62L34P01M41m95r42k69
$$ 135 1718 3072 2972 1496 96 -501 76 1058 900 351 -1268 -1730 -1396 -695 -254 -749 -1691 -1960
1735a960Q87J192J265l87q22n80O31J606J517K09j022j825m30J079J768Q24j281
$$ -1960 -1073 119 1384 997 175 -405 226 1832 3349 3558 2536 711 281 1360 3128 3952 2671
1752B671k521j954K0J313J958m74j811l096j029O86K696J647o28k295k293K70
$$ 2671 150 -1804 -1784 -471 1487 1013 -798 -3894 -4923 -4237 -1541 106 -522 -2817 -5110 -4840
1768d840K354L269R83o74k363j507J080K919L419p0j957k586j205J375K948J791
$$ -4840 -2486 783 1766 1092 -1271 -2778 -1698 1221 4640 4570 2613 27 -1178 197 3145 4936
1784D936j012l027k641l09J747K195P20j909k879j535R51K162K431l75j612k200
$$ 4936 3924 897 -1744 -2053 -306 1889 2609 700 -2179 -3714 -2763 -601 1830 1455 -157 -2357
1800b357j84J816K203J524m60k108j009L57J800J522N7j602j605q66P42J072M71
$$ -2357 -2541 -725 1478 3002 2542 434 -575 -218 1582 3104 3161 1559 -46 -912 -170 902 1373
1817A373j297j557j503K95O46O59R8j318p66J40J033Q63N39n52m06J09J307J632
$$ 1373 76 -1481 -2984 -2689 -2043 -1384 -1286 -2604 -3370 -3230 -2197 -1334 -795 -1347 -1753 -1644 -337 1295
1835A295N55m69q63j4R45J640M32k55j466j396J48J138J326m09j233k485q73J074
$$ 1295 1850 1381 518 504 1449 3089 3521 3266 1800 404 552 1690 3016 2607 1374 -1111 -1984 -910
1853i10J525O33q21j896j881L12J782J898L63j073k044p58J587K469J694o15k005
$$ -910 615 1248 427 -1469 -3350 -3038 -1256 642 1005 -68 -2112 -2870 -1283 1186 2880 2265 260
1870B60j570j55J767K559O13j751l057j039Q28J887J479o66k538j976o80J625
$$ 260 -1310 -1465 302 2861 3474 1723 -1334 -2373 -1545 342 1821 1155 -1383 -3359 -4039 -2414
1886b414K270J280j309k685j242R19K870K232K11j734j744j92K240K317J602q81
$$ -2414 -144 1136 -173 -2858 -4100 -3181 -311 1921 2132 398 -1346 -1538 702 3019 4621 3740
1902C740k424j713O54J961K544l41k733k644n49J388K244Q55j713k862k312N55
$$ 3740 1316 -397 257 2218 4762 4421 1688 -956 -1505 -117 2127 2982 1269 -1593 -3905 -3350
1918c350K275K273j54j997k640r81K240K784J812j383j877j938M08K630K613N59
$$ -3350 -1075 1198 1044 -953 -3593 -4574 -2334 450 2262 879 -998 -2936 -2528 102 2715 3274
1934C274k043k517q97J291K389J834j077k705j977m80K059K130M89j644k498j397
$$ 3274 1231 -1286 -2183 -892 1497 3331 2254 -451 -2428 -2908 -849 1281 1770 126 -2372 -3769
1950c769J099K676J918j82k208k088K03K219K247J241q27j973j362P37K222K093
$$ -3769 -2670 6 1924 1742 -466 -2554 -2351 -132 2115 3356 2529 556 -806 -69 2153 4246
1966D246m11j880k191l94J382J715K15j253k266j546R3J958J042n01j776j665
$$ 4246 3835 1955 -236 -630 752 2467 2682 1429 -837 -2383 -2290 -332 710 209 -1567 -3232
1982c232n4J144J359P29j066j272p36J083J940J172K01j521j458R18J354J789
$$ -3232 -3286 -2142 -783 -54 -1120 -2392 -3128 -2045 -105 1067 1268 -253 -1711 -793 561 2350
1998B350K24j350j758l86R49J606J286j572j882j397L4J663J640M19j988k049
$$ 2350 2574 1224 -534 -920 29 1635 2921 1349 -533 -1930 -1896 -233 1407 1826 -162 -2211
2014b211o14J407K407J327l89k336j686P53K014K309M85j302k254j346J061K525
$$ -2211 -2825 -1418 989 2316 1927 -409 -2095 -1342 672 2981 3466 2164 -90 -1436 -375 2150
2030B150J648q71k403k048n58J688J684P20j870k693j243P28J824J583l44j760
$$ 2150 3798 2927 524 -1524 -2082 -394 1290 2010 140 -2553 -3796 -3068 -1244 339 -5 -1765
2046a765k097J98J846K122J275j197j933p47J017K499J521P1j781j874K3J686
$$ -1765 -3862 -3664 -1818 304 1579 382 -1551 -2298 -1281 1218 2739 2810 1029 -845 -822 864
2062H64K295M34j320k268j508Q68J812J383m23k490j724p23K089K216N28j589
$$ 864 3159 3593 2273 5 -1503 -635 1177 2560 2137 -353 -2077 -2800 -711 1505 2033 444
2078D44k046j461J236K459K019m76j630k163m20J991K576Q81j239k688j488J50
$$ 444 -1602 -3063 -1827 632 2651 2175 545 -1618 -2038 -47 2529 3410 2171 -517 -2005 -1855
2094a855K437J888m5j972k801j332J138K390J376r52k065k235l2J770K723J127
$$ -1855 582 2470 2425 453 -2348 -3680 -2542 -152 1224 272 -1793 -4028 -4060 -2290 433 1560
2110A560j555j357j347O33K255K114K30j238j144p99Q62J674J239k21j496j073
$$ 1560 5 -1352 -2699 -2066 189 2303 2533 1295 151 -648 214 1888 3127 2906 1410 337
2126C37j99P38P18M99j045j434l10m8L3P73l04r2l63K4l87L29K69k7J6J85L89
$$ 337 138 876 1594 2093 1048 -386 -696 -744 -711 62 -242 -334 -697 -673 -1060 -731 -462 -489 -473 -288 101
2147A01J46m13L0p3M07J220Q5r73j319n43N44J300M14j77j518j481k92J028J585
$$ 101 247 -166 -136 -209 198 1418 1503 530 -789 -1332 -788 512 926 749 -769 -2250 -2542 -1514 71
2166G1O10m04j630j656O47J790K194K31j059j955n33P04K478J730L15j990j594
$$ 71 681 277 -1353 -3009 -2362 -572 1622 1853 794 -1161 -1694 -990 1488 3218 3533 1543 -51
2183e1p16J363J786J319q25k063k436L89J373J955K21j432k294j402L37J692J746
$$ -51 -767 596 2382 3701 2876 813 -1623 -1234 139 2094 2315 883 -1411 -2813 -2476 -784 962
2200I62j76j367k046l49J222K140Q38n08j555q80K33J546J545O8j196j361n14
$$ 962 786 -581 -2627 -2976 -1754 386 1224 716 -839 -1719 -1486 60 1605 1673 477 -884 -1398
2217a398R91J226L54n38j368o56L98O38N68M38j557q74J82J131J052O4o69r18
$$ -1398 -407 819 1173 635 -733 -1389 -991 -353 215 653 -904 -1778 -1596 -465 587 651 -18 -936
2235i36N4Q50J331R75m67j627o47N24J500J344k01j334j486o65N75K164P14j339
$$ -936 -882 -32 1299 2274 1807 180 -467 57 1557 2901 2700 1366 -120 -785 -210 1954 2668 1329
2253A329j682j690K3J685J300J70j272k441p42R55K013J350j97j678j761j62J450
$$ 1329 -353 -2043 -2020 -335 965 1135 -137 -2578 -3320 -2365 -352 998 801 -877 -2638 -2800 -1350
2270a350K346Q59o81j834j369M96K008J863o6j211k270p86J291J424J114m91j733
$$ -1350 996 1855 1174 -660 -2029 -1533 475 2338 2272 1061 -1209 -1995 -704 720 1834 1343 -390
2287c90j251j66J375J406M53p71j119q31O84J379O33m39n04n74j07J105O69l09
$$ -390 -1641 -1807 -432 974 1427 656 -463 -1294 -610 769 1402 963 459 -115 -222 883 1552 1243
2305A243p19n22j4P95O21k54p30j245J83J66N99L23m35j353j116N97J245Q32o9
$$ 1243 524 2 -12 783 1404 1150 420 -825 -642 -476 123 446 11 -1342 -2458 -1861 -616 216 147
2324A47j477j027j41J507J662N01j052j134r58P59K136J193k82j397j476q07J584
$$ 147 -1330 -2357 -2498 -991 671 1172 120 -1014 -1972 -1213 923 2116 1834 437 -1039 -1846 -262
2341b62K300R07j347j849j607N66J702J864M31j784k104j166J230K097J501m35
$$ -262 2038 2945 1598 -251 -1858 -1292 410 2274 2705 921 -1183 -2349 -1119 978 2479 2044
2357B044k071j966R9J684J744J226j492j982j127N56J611K059j33j744j912q05
$$ 2044 -27 -1993 -1894 -210 1534 2760 1268 -714 -1841 -1285 326 2385 2252 508 -1404 -2209
2373b209R34K131J101p28k026j728j71J724J787L35j285j707o61Q41J540J351
$$ -2209 -1275 856 1957 1229 -797 -2525 -2696 -972 815 1150 -135 -1842 -2503 -1662 -122 1229
2389A229R9j664j550K16J689J635J84q39j291n93O52J500J110o84j161j329M19
$$ 1229 1328 -336 -1886 -1670 19 1654 1838 999 -292 -885 -233 1267 2377 1693 532 -797 -378
2406c78O40J661k28j137j296n30P91J348O55n78j396j005J69J544R70Q6j302j105
$$ -378 262 1923 1695 558 -738 -1268 -477 871 1526 948 -448 -1453 -1284 260 1230 1316 14 -1091
2424a091n97J073J524P61n26j640j495P44J155J295J86j452j732j41P54J504O44
$$ -1091 -1688 -615 909 1670 1144 -496 -1991 -1247 -92 1203 1389 -63 -1795 -1936 -1182 322 966
2441I66m30j654j246M01J541J552K07j300j615n01J279J697R26j29j501j244K10
$$ 966 536 -1118 -2364 -1963 -422 1130 1337 37 -1578 -2079 -800 897 1823 1694 193 -1051 -841
2458h41J561J374M92j021j531r51M85J501J463n20j454j570k87J363J279J30q69
$$ -841 720 2094 2586 1565 34 -917 -432 1069 2532 2012 558 -1012 -1299 64 1343 1473 604
2475F04j548p50N9J256J577k11j375j014n10J009J419J089j067j078p54L18J150
$$ 604 -944 -1694 -1635 -379 1198 987 -388 -1402 -1912 -903 516 1605 538 -540 -1294 -976 174
2492A74P31J83j115j099n50P87R76M67l38j130k51L58J160L01p1r18p60K12P46
$$ 174 905 1088 -27 -1126 -1676 -889 87 554 216 -914 -1165 -807 353 654 583 -335 -1095 -883 -137
2511a37J190k8n33p19k73R23P48M63j37p24j150L82P42R08j19q57j040l06M46
$$ -137 1053 1025 492 -227 -500 423 1171 1634 1497 773 -377 5 747 1655 1536 679 -361 -667 -221
2530b21R22N10m29j082j202O2R67J375j88r76j306m44P73J305P82j24j114j107
$$ -221 701 1211 782 -300 -1502 -1440 -473 902 714 -262 -1568 -2012 -1239 66 848 724 -390 -1497
2548a497K65J071P92O03p21j262q17P85R11J023m6j143j178J0P10Q50J030q92
$$ -1497 -1232 -161 631 1234 513 -749 -1566 -781 130 1153 1107 -36 -1214 -1204 -494 356 1386 494
2566D94j017l52o8R27J124m6o95p83J56N75Q20J63m38o41m26N48O43L82j98p52
$$ 494 -523 -875 -943 -16 1108 1062 367 -416 -260 315 1135 1298 860 219 -207 341 984 1366 1168 416
2586D16q31K22L59P17r1o48q20m07L23Q53L54q89q70k32q8J191O82J87o19j091
$$ 416 -415 -193 166 883 792 144 -676 -1083 -760 93 447 -442 -1312 -1544 -1632 -441 241 428 -191 -1282
2606a282k65P70J277O38n09j388o14P34J061P07K39j003j249l67R17J111R76o60
$$ -1282 -1547 -777 500 1138 629 -759 -1373 -639 422 1129 1368 365 -884 -1251 -334 777 1753 1093
2624A093j222j234K8J247J688L47j368r94o28L57J405Q92L2j168j297j13Q01J323
$$ 1093 -129 -1363 -1335 -88 1600 1947 579 -415 -1043 -686 719 1611 1643 475 -822 -935 -134 1189
2642A189O06o56j315p23O2R92J045k16o66j287m01J89J289L15k77j028m55j43
$$ 1189 1795 1139 -176 -899 -837 155 1200 984 318 -969 -1370 -1181 108 423 146 -882 -1337 -1480
2660a480N14Q15M3j87j009j28Q10K19J099m20l27l74J93O19M82Q1n72n17O1M78
$$ -1480 -966 -151 -108 -295 -1304 -1432 -622 -403 696 276 -51 -425 -232 387 869 950 378 -139 -78 400
2680D00R17j98l22q87j94J02P12O00m91o80l81KN71R37p7q35m35o04P49R85K85
$$ 400 1317 1119 797 -90 -284 -182 530 1130 639 -41 -422 -420 151 1088 1011 176 -259 -863 -114 871 1156
2701A156l46r25o64J93O50P60M23j218l99o78K42J179K40k48r33p65l99J189Q88
$$ 1156 810 -115 -779 -586 64 824 1247 29 -370 -1048 -806 373 613 365 -568 -1333 -1732 -543 345
2720C45J94l77j318n71P51O26J150j47q17p28MP85R50L4j31o14m33J82J018P84
$$ 345 539 162 -1156 -1727 -976 -350 800 653 -164 -892 -888 -103 847 881 750 136 -297 -115 903 1687
2740A687o32p25m29j44Q73J25K64m21p99n02N12O18M33n19q39m94k1R13R99l36
$$ 1687 1055 330 -99 -243 630 755 1019 598 -201 -703 -191 427 860 341 -498 -992 -1013 -100 899 563
2760E63p68p21j30Q76Q46K96k9j461n86k07J213J399m84o73q77j052O71J709M3
$$ 563 -205 -926 -1056 -180 666 962 933 -528 -1114 -1321 -108 1291 807 134 -743 -1795 -1124 585 628
2779F28L61j694q44j50P58J686L84p39j159n23M6J527J011N20j145j175l03O69
$$ 628 989 -705 -1549 -1699 -941 745 1129 390 -769 -1292 -1246 281 1292 1812 667 -508 -811 -142
2797a42J284Q06l90r23j197k44J216R28N78p43j465p94M38Q75N79K86r89j164
$$ -142 1142 1948 1558 635 -562 -806 410 1338 1916 1173 -292 -1086 -648 227 806 1092 103 -1061
2815a061k69K63J224R4j22m64r63M08N90J66L75k33l30k77M23M07K54m36k07K26
$$ -1061 -1330 -1067 157 251 129 -335 -1298 -890 -300 -134 241 8 -322 -599 -176 231 485 49 -158 68
2835F8m01N05K2m70n2o9J6L81L83j96n20k78J84M68O01k43k04r6n40N68Q25L3
$$ 68 -333 172 194 -276 -328 -397 -381 0 383 187 -333 -611 -427 41 642 399 195 99 -441 127 952 985
2857I85o7o63n87K00R53O19K05r98j160k44P88N11N23o61r50n23l04R57O66K66
$$ 985 918 255 -332 -132 821 1440 1645 647 -513 -757 31 542 1065 404 -546 -1069 -1373 -416 250 516
2877E16o67j239l47N20R00Q98l9q46r05J59N03J030L69l10o37m71j2O38Q93No51
$$ 516 -151 -1390 -1737 -1217 -317 581 542 -304 -1209 -1050 -547 483 852 542 -95 -566 -578 60 953 958 307
2898C07o40j96K20P65J04l05p66j93L73M50Q62k79m44q57K74O70J65N71o88n01
$$ 307 -333 -529 -309 456 560 255 -511 -704 -331 119 981 702 258 -599 -325 345 510 1081 393 -108
2918a08J3L21O65K27l05o86q72M45P79M13J0p83j020m45P06J116k2o98l96q39
$$ -108 -95 226 891 1118 813 127 -745 -300 479 892 902 119 -901 -1346 -640 476 454 -244 -640 -1479
2938a479L8O36J341%j038m41n77L29J342O91n1p13j184L72O55Q32P21n47j139
$$ -1479 -1441 -805 536 536 -502 -943 -1520 -1191 151 842 791 78 -1106 -734 -79 753 1474 927 -212
2957b12q03K88J033N45L28o68j027o75N41J084N72J06r13o15m52O48P12K96Ko47
$$ -212 -1015 -727 306 851 1179 511 -516 -1191 -650 434 1006 1112 199 -416 -868 -220 492 788 790 143
2977A43p41R8O95P04J82n52n90k57O7L75K72j26l14l26J0J17L23k63l78qj11L61
$$ 143 -598 -500 195 899 1081 529 -61 -318 -251 124 396 270 -44 -370 -360 -243 80 -183 -561 -569 -680 -319
2999c19j19o5j5k26L74K60L31k56n24J89L46K19O17Q0l76p90j67P17N50J42J42
$$ -319 -438 -503 -518 -744 -370 -110 221 -35 -559 -370 -24 195 812 892 516 -274 -441 276 826 968 1110
3020A110j149l86rN21J018l0j34j208m59N5R40R44p0o32j254n04O73J278N43l19
$$ 1110 -39 -425 -434 87 1105 1075 941 -267 -726 -671 269 1213 1143 511 -743 -1247 -574 704 1247 928
3040I28j119p26M5Q47Q55K36n19j313q32M02J170R10Oj391q82l9O91Q68L91l66
$$ 928 -191 -917 -872 -25 830 1066 547 -766 -1598 -1196 -26 884 890 -501 -1383 -1422 -731 137 528 162
3060A62j150m63K54J098O76K18k66j086j73M57O82Q12j51r33n65N32K9J044J59
$$ 162 -988 -1451 -1197 -99 577 795 529 -557 -730 -273 409 1221 1070 137 -428 104 133 1177 1336
3079A336n62o53n06M07R45K01m84p30l57l38M03J111o4m73r48l3J74P41O12l40
$$ 1336 774 121 -385 22 967 1168 684 -46 -403 -741 -338 773 709 236 -712 -745 -571 170 782 442
3099D42r46l07K40O36Q36k45n77q11l50Q00R18o8k20q47p86K85O15Q24J86p11
$$ 442 -504 -811 -571 65 901 656 79 -732 -1082 -282 636 568 348 -499 -1285 -1000 -385 439 625 -86
3119h6m12p20N05O21O00J13p53o64rQ04Q30J57r9q70n36M53O47O85M2p52q12J06
$$ -86 -498 -1218 -713 -92 508 621 -132 -796 -805 -1 829 986 887 17 -519 -66 581 1266 1308 556 -256 -150
3141a50K21N75L98l17o47n64M4K62M54k32j43p27qK76M94M22n43l22j09L13L39
$$ -150 71 646 1044 727 80 -484 -440 -178 276 44 -99 -826 -834 -558 -64 358 -185 -507 -616 -303 36
3162C6Q5n2l50l94N2O86K06q7n33j95J83J47N61M7k03o70r4K30M57N05k08p87
$$ 36 121 69 -281 -675 -623 63 269 182 -351 -546 -363 -216 345 392 189 -481 -575 -345 112 617 409 -378
3184c78k08M76L82O88J86o36o08o61O67P73M03k02m94p31k46O10P39K52p9j368
$$ -378 -586 -110 272 960 1146 510 -98 -759 -92 681 1084 882 388 -343 -589 21 760 1012 933 -435
3204d35j79O5N29J101o37m35j069K6K48Q15K42J02j025k48j23P13P51n0k60o64
$$ -435 -614 -549 -20 1081 444 9 -1060 -1034 -786 29 271 373 -652 -900 -1023 -310 441 391 131 -533
3224e33m92L72R83k08K10r43j51RO74L83M96o29n64J34n5O23N21k53o40j54L2
$$ -533 -1025 -653 330 122 332 -611 -762 -753 -79 304 800 171 -393 -259 -314 309 830 577 -63 -217 -185
3245a85L99L28M59r49m50K11P1L60O88n7q69l71k81R88K69J7m42k21n60L13L91
$$ -185 214 542 1001 52 -398 -187 -116 244 932 875 6 -365 -646 342 611 628 186 -35 -595 -282 109
3266A09P46j06p41p87RK63J087k00j66p90n38L73N23O39j43o31n36J72K91R05
$$ 109 855 749 8 -779 -770 -507 580 380 214 -576 -1114 -741 -218 421 278 -353 -889 -717 -426 479
3286D79J22k79l82n68K31M11M57N00p16l71j22L37K51K48q6l86j51J33J1M28j87
$$ 479 601 322 -60 -628 -397 14 471 971 255 -116 -238 99 350 598 512 126 -25 108 119 547 360
3307C60m70R1J94N9n3J58l08l29rM45K23Pk57k62n03L54M41K58j63n13l88l1P32
$$ 360 -110 -19 175 234 181 339 31 -298 -307 138 361 368 111 -151 -654 -300 141 399 236 -277 -665 -696 36
3330C6K7J68k67o76j55K31O43K94J9j153n7k12P33P99K56m79p87O9L03O08M78
$$ 36 63 231 -36 -712 -867 -636 7 301 320 -833 -890 -1102 -369 430 686 207 -580 -511 -208 400 878
3351H78k22p86k13k41N32J090K45m72r39j68j27O90R34P3o98p61n38K65Q43N95
$$ 878 656 -130 -343 -584 -52 1038 1283 811 -128 -296 -423 267 1201 1274 576 -185 -723 -458 385 980
3371I80k85p69q11J29N93Q54J7m56r17k05M38O17J72k85m45j50k17O54L42J52
$$ 980 695 -74 -885 -756 -163 691 708 252 -665 -870 -432 185 357 72 -373 -523 -740 -86 256 408
3391D08l60o90l8oO01N47l96m02j77J44L61N43K0n22k44l8L72M08M61l78r02k5
$$ 408 48 -642 -680 -686 -85 462 66 -336 -513 -369 -8 535 555 33 -211 -249 123 531 992 614 -288 -313
3413c13j2P26M99j10l49q06o0O03M01N67k90j007p24L81P53O35l17k03j159r0
$$ -313 -325 401 900 790 441 -365 -425 178 579 1146 856 -151 -875 -494 259 894 577 374 -785 -875
3433h75L04J237M26p30n02q12j59P53O19M83n12q01l94n4R18N65R9n92q11j82
$$ -875 -571 666 1092 362 -140 -952 -1111 -358 261 744 232 -569 -963 -1017 -99 466 565 -27 -838 -1020
3453a020O44Q64L73l18p09m22m23J342L15K54l09p24n44M07P41N10k05m85n97
$$ -1020 -376 488 861 543 -166 -588 -1011 331 646 900 591 -133 -677 -270 471 981 776 291 -306
3472c06O6N74K15L87n43l27l04L79L4K06q2l74j79q2L70N67j75m84m38l00M31
$$ -306 -240 334 549 936 393 66 -238 141 175 381 299 -75 -254 -336 34 601 426 -58 -496 -796 -365
3493c65Q29L9q11m60j95L47P32M01m11n33l67m6P92M68k25o1n01k47Q6J000L10
$$ -365 464 503 -308 -768 -963 -616 116 517 106 -427 -794 -840 -48 420 195 134 -367 -614 -528 472 782
3514G82m1o33p40k27J048P25j47l35o14n92L88N54P47M28j011q83L5L48Q90L98
$$ 782 741 108 -632 -859 189 914 767 432 -182 -774 -386 168 915 1343 332 -551 -516 -168 722 1120
3534A120p6j082p88K33M16R57J59n44q64k92O0J018M33m03o23o03j30M09R08J03
$$ 1120 1044 -38 -826 -593 -177 780 939 395 -469 -761 -701 317 750 347 -276 -879 -1009 -600 308 411
3554D11j09q05l95J02N31P37k99J24j199L32K04O36R5n48o3l23J79L58N04j78
$$ 411 302 -503 -898 -796 -265 472 173 297 -902 -570 -366 270 365 -183 -246 -569 -390 -32 472 294
3574B94q3n90R1N91N9J45l04k62n19P25K48M0J86o71k46K98K30L58Q8o12m59q0
$$ 294 211 -379 -288 303 362 507 203 -59 -578 147 395 435 621 -50 -296 2 232 590 678 66 -393 -473
3596d73N29K92L70k14p01k06lL93L71l49o5p71l7K27R49J95m90o14l11R9M84P08
$$ -473 56 348 718 504 -197 -403 -406 -13 358 9 -56 -827 -864 -637 312 507 17 -597 -908 -809 -325 383
3618C83k06k26l52l31Q7N81O07o2m62n88k8M79P82K66m99m37l87j8N78J06N28
$$ 383 177 -49 -401 -732 -645 -64 543 481 19 -569 -597 -118 664 930 431 -6 -393 -411 167 273 801
3639H01n10o40O6L37K06O19k80r63%K90K09M51j7m30k09k64K26L95J27k72j91
$$ 801 291 -349 -283 54 260 879 599 -364 -364 -74 135 586 569 139 -70 -334 -108 287 414 142 -49
3660d9o40K58K89L69o1k29m54j03J79K89l8j39M9r6j85M29j3l9n5k58J81K34R1
$$ -49 -689 -431 -142 227 166 -63 -517 -620 -441 -152 -190 -329 -280 -376 -561 -132 -145 -184 -239 -497 -316 -82 9
3683IK35r9l66J45K29N86k32j12l76k33L30J86L10n09J26n18PR64k59J25j07n17
$$ 9 244 145 -221 -76 153 739 507 395 19 -214 116 302 612 103 229 -289 -282 682 423 548 441 -76
3705g6k60J38M71K31m42j28m89J42K47N44K92o88o0l57j55M65M63J6k52o43j60
$$ -76 -336 -198 273 504 62 -66 -555 -413 -166 378 670 -18 -78 -435 -590 -125 338 354 102 -541 -701
3726g01K89M69J76k15l70l60Q5K82O22k16Rp57L24J14K41L85j27j43l65K58L03
$$ -701 -412 57 233 18 -352 -712 -627 -345 277 61 70 -687 -363 -249 -8 377 250 107 -258 0 303
3747C03M4L56p8n1q50N81K15K06n4m57k53K36l9K61J70o22j39j42L50KM1j08l48
$$ 303 347 703 625 574 -276 305 520 726 672 215 -38 198 159 420 590 -32 -171 -313 37 39 80 -28 -376
3770c76m5%L00M4L16n20l35L81J40R8K93j68o34k80M36L78L96j21p86k07O2lR30
$$ -376 -421 -421 -121 -77 239 -281 -616 -235 -95 3 296 128 -506 -786 -350 28 424 303 -483 -690 -628 -631 299
3793B99j66k30l58l1K88L20M93k16k13q04M02M17J50P24p39l37k39K27J15Q05
$$ 299 133 -97 -455 -486 -198 122 615 399 186 -618 -216 201 351 1075 336 -1 -240 -13 102 907
3813I07q7m48n27l8J96J48N43l01k28m18l20K96L76J74j97m38n6J98J89K27k31
$$ 907 820 372 -155 -193 3 151 694 393 165 -253 -573 -277 99 273 76 -362 -418 -220 -31 196 -35
3834c5k73l07KK11O76p1m27m22J81q6M04J14K2k4j04J39M52k87J35m58ko7Q3Q73
$$ -35 -308 -615 -613 -402 274 203 -224 -646 -465 -551 -147 -33 -11 -35 -139 0 452 165 300 -158 -160 -227 -144 729
3858G29m27j59q5j76L06j08N66j68n32l25N36Q6M33o6j54o57m42Q08K07K32m08
$$ 729 302 143 58 -118 188 80 646 478 -54 -379 157 243 676 610 456 -201 -643 165 372 604 196
3879A96j50q64K65L83N66j9n72k15m78L10O97L75j90o71m60o4L73O09M61l25m53
$$ 196 46 -818 -553 -170 396 377 -195 -410 -888 -578 119 494 304 -367 -827 -891 -518 91 552 227 -226
3900b26q01L84N08O73J98o94m39l65O52M99L96j2r33k22M7L64Q01q6m40n70j6
$$ -226 -1027 -643 -135 538 736 42 -397 -762 -110 389 785 773 -160 -382 -335 29 830 744 304 -266 -282
3921b82K30M42M39l1q54l82L41p6P54J5k92m17m85J30N56J82l6l42r2k04J33N14
$$ -282 -52 390 829 798 -56 -438 -97 -173 581 596 304 -113 -598 -468 88 270 234 -108 -200 -404 -271 243
3943B43R2k16o29j91L30M06K37j45m37p3j73L56L15J21k29j47l03j71N73N17l22
$$ 243 335 119 -510 -701 -371 35 272 127 -310 -383 -556 -200 115 236 7 -140 -443 -614 -41 476 154
3964A54j07l59N7L65O26j37m05j64L1l62N40J8J10j82n59L49n8N21M31n55l00
$$ 154 47 -312 -255 110 736 599 194 30 61 -301 239 257 367 185 -374 -25 -83 438 869 314 14
3985A4m51M33L13J77Nm16p15K45N05L37j27m21k49k63K30N84j45K38n09m52r3
$$ 14 -437 -4 309 486 491 75 -640 -395 110 447 320 -101 -350 -613 -383 201 56 294 -215 -667 -760
4006g60K13P75J03k24n57L42j56k7N01J05l40j47m50N86L12j05o8l48J55j1M27
$$ -760 -547 228 331 107 -450 -108 -264 -291 210 315 -25 -172 -622 -36 276 171 103 -245 -90 -101 326
4027C26L29j72o63J39L5Q8P38m60j11k42k70N24M9J28l57l16R7p1N19K82k61j07
$$ 326 655 483 -180 -41 -6 82 820 360 249 7 -263 261 310 438 81 -235 -138 -209 310 592 331 224
4049B24n94k4L06L35K48m38l15j67k44L29P60k42k44m78r0K60L30K57j1n39j00
$$ 224 -370 -394 -88 247 495 57 -258 -425 -669 -340 420 178 -66 -544 -634 -374 -44 213 202 -337 -437
4070d37q8O58J43K76j77o81j09J27M87M70j60l50n15nM93M45M98o82k61m89K4
$$ -437 -525 133 276 552 375 -306 -415 -288 199 669 509 159 -356 -361 132 577 1075 393 132 -357 -333
4091c33K43P68J0o08l01q1K71L49K66l35j20m88K34L23K46j96j97m21J04j9M58
$$ -333 -90 678 688 80 -221 -302 -31 318 584 249 129 -359 -125 198 444 248 51 -370 -266 -285 173
4112A73P9l84l11R5k3J13K89K77n99l28Q9M58K2J87j31j61k57K27L96N08k93l41
$$ 173 252 -132 -443 -348 -371 -258 31 308 -291 -619 -530 -72 -50 137 6 -155 -412 -185 211 719 426 85
4134H5j24r3m4P00J6m9m58j28N24j66L27Rn94J39l40N40J60J08k58n58K12j70
$$ 85 -39 -132 -176 524 540 491 33 -95 429 263 590 599 5 144 -196 344 504 612 354 -204 8 -162
4156a62L91j35K09k21k93L9K3J79M20j91p82j09K15L97K1j13k76q7R7K87L54k78
$$ -162 229 94 303 82 -211 -172 -149 30 450 259 -523 -632 -417 -20 1 -112 -388 -475 -378 -91 263 -15
4178a5K42p70o1L72k4P78l44l89l47K19J95K42L07l53l55L49k62P09j73n7l4l71
$$ -15 227 -543 -604 -232 -256 522 178 -211 -558 -339 -144 98 405 52 -303 46 -216 493 320 263 229 -142
4200a42q5L99J81J43m8o28j89J94N89J90n0n52l22k60L74L30j92n9k15k00L29
$$ -142 -227 172 353 496 448 -180 -369 -175 414 604 554 2 -320 -580 -206 124 -68 -127 -342 -542 -213
4221b13L35M82k13o23n78L51J72O68j39k37j53k45J1N12K76o1l4p95J52K47Q6
$$ -213 122 604 391 -232 -810 -459 -287 381 242 5 -148 -393 -382 130 406 345 311 -484 -332 -85 1
4242AN34n08m10O4k0O84L06k68k62j54k23%O02L19l19m66j34P9N90L46m75j17
$$ 1 535 27 -383 -319 -339 345 651 383 121 -33 -256 -256 346 665 346 -120 -254 -175 415 761 286 169
4264A69k54j93K96J71M11k79q5p04L23L72J74q4l84k80l5M05J6K90l48l64l6J13
$$ 169 -85 -278 18 189 600 321 236 -468 -145 227 401 317 -67 -347 -382 23 39 329 -19 -383 -419 -306
4286c06K24K34l2j83m42M0R6N95Q5l84l56p2J42O71J98k08j20m49j87L13N83j73
$$ -306 -82 152 120 -63 -505 -465 -369 226 311 -73 -429 -501 -359 312 510 302 182 -267 -454 -141 442 269
4308B69k6l59n2j53L41M26nj13n87k7M74M00j4k58m21l35J73J10P04k47k95m50
$$ 269 243 -116 -168 -321 20 446 441 328 -259 -286 188 588 574 316 -105 -440 -267 -157 547 300 5 -445
4330d45k17L99K39L98n06k86m26K33L94L95j32l46j22l51L95M97M13l67n65oQ3
$$ -445 -662 -263 -24 374 -132 -418 -844 -611 -217 178 46 -300 -422 -773 -378 119 532 165 -400 -406 -323
4351c23L96L27o3k07k45j66j7Q99j18l14l9m35K34K11L25lK09q47K12k60M69J12
$$ -323 73 400 337 130 -115 -281 -298 601 483 169 130 -305 -71 140 465 462 671 -176 36 -224 245 357
4373C57p9m68k25K42K84L01j08j36m95O8j61Q84M7k41o52L24K03n1o5L06m59L2
$$ 357 278 -190 -415 -173 111 412 304 168 -327 -259 -420 464 511 270 -382 -58 145 94 29 335 -124 -92
4395i2l84J65N52l20m0k70j85K20M21lj07k51j84N0L37J07L59j49m01k45qL61
$$ -92 -476 -311 241 -79 -119 -389 -574 -354 67 64 -43 -294 -478 -428 -91 16 375 226 -175 -420 -428 -67
4417f7L27K36k29l62k17O38p3J77k14k73K5l89P91j18K80k38n83%K14O6N12l74
$$ -67 260 496 267 -95 -312 326 253 430 216 -57 -32 -421 370 252 532 294 -289 -289 -75 -9 503 129
4439A29m06J54J0m82N89Q6m13K94%k64K10N19l19m78J1J47J2J15n8j17l15J34
$$ 129 -277 -123 -113 -595 -6 80 -333 -39 -39 -303 -93 426 107 -371 -360 -213 -201 -86 -144 -261 -576 -442
4461d42L09K59l9l29m45J43N95K75k75L07l30k89J91K74L0M53j48m15l78K14N47
$$ -442 -133 126 87 -242 -687 -544 51 326 51 358 28 -261 -70 204 234 687 539 124 -254 -40 507
4482E07J63j53k38k78k2k31P42q0Q7p36k35j12M06N43O0n67l94j07J37L91O39
$$ 507 670 517 279 1 -21 -252 490 410 497 -239 -474 -586 -180 363 423 -144 -538 -645 -508 -117 522
4503E22k55n29n02J64L26J01L46J34n06l26K06L29K48j27j55J5n84L57N48j63
$$ 522 267 -262 -764 -600 -274 -173 173 307 -199 -525 -319 10 258 131 -24 -9 -593 -236 312 149
4523A49N6j078J35J34N53J95J25l74K67J4j20L95j26k75K33j43k13N14R2j87J1
$$ 149 205 -873 -738 -604 -51 144 269 -105 162 176 56 451 325 50 283 140 -73 441 533 346 357
4544C57l19J69K52m39M51n72j15m5j64N16Q9k31R4m79J31K85J68j38k96j52J74
$$ 357 38 207 459 20 471 -101 -216 -261 -425 91 180 -51 43 -436 -305 -20 148 10 -286 -438 -264
4565b64P9L01j2m36p2K9K89L30j73J71m14nJ29J11L28j44l3l65k33L15K17J14
$$ -264 -185 116 104 -332 -404 -375 -86 244 71 242 -172 -177 -48 63 391 247 214 -151 -384 -69 148 262
4587B62j05n3l52j84M14K43K30q7m51J29m4J71P68m33n07p0m5R9L76K81o29J76
$$ 262 157 104 -248 -432 -18 225 455 368 -83 46 2 173 941 508 1 -69 -114 -15 361 642 13 189
4609A89k71Nk83Q47l79j44o03J11K42J32K92o0n40j75J97L01J26oj70j76R3L05
$$ 189 -82 -77 -360 487 108 -36 -639 -528 -286 -154 138 78 -462 -637 -440 -139 -13 -19 -189 -365 -272 33
4631C3J5K17k5k40k42K91j9O37k95k32k37j08J44N13M39p64k68j87k61P84L28
$$ 33 48 265 240 0 -242 49 30 667 372 140 -97 -205 -61 452 891 127 -141 -328 -589 195 523
4652E23Ro47k21j82L34L59M34o35K03m87k5K70Q14j82k62l89l56J66J56P38j24
$$ 523 532 -115 -336 -518 -184 175 609 -26 177 -310 -335 -65 749 567 305 -84 -440 -274 -118 620 496
4673D96n37m57J33J90K71n2k87l22l8K34K50J95j00m08L48p38O79L34m5J18k64
$$ 496 -41 -498 -365 -175 96 44 -243 -565 -603 -369 -119 76 -24 -432 -84 -822 -143 191 146 264 0
4694@j51L16K83P1J92m06j58m9j22K31L00k22k64j44j8L62K59n02k46k79K40J38
$$ 0 -151 165 448 519 711 305 147 98 -24 207 507 285 21 -123 -141 221 480 -22 -268 -547 -307 -169
4716a69K55k3L2l48P5L9L42J7k03J64j49k28L32J30Jn55j88J66O4K93J76k16l29
$$ -169 86 63 95 -253 -178 -139 203 220 17 181 32 -196 136 266 267 -288 -476 -310 -246 47 223 7 -322
4739c22j49L26J48N6J91m52l95J37K64J86L39j72k49k86K93J71M55K68m10k71
$$ -322 -471 -145 3 59 250 -202 -597 -460 -196 -10 329 157 -92 -378 -85 86 541 809 399 128
4759A28j05J66M98L0r9n04n69K05J91L06Qk76j69j66R1J26L59j9l73m42K16mL48
$$ 128 23 189 687 717 618 114 -455 -250 -59 247 255 -21 -190 -356 -265 -139 220 201 -172 -614 -398 -402 -54
4782e4L06Nl40k46k6M69J32l60p4k81N5K94N25rl86p16L1P84m49N24J04m33N4
$$ -54 252 257 -83 -329 -355 114 246 -114 -188 -469 -414 -120 405 396 10 -706 -675 109 -340 184 288 -145 -91
4805i1j08J97J29J30k0l45k37K41J19M0J11j23r7j13L56K72J95l00l34l98K42
$$ -91 -199 -2 127 257 237 -108 -345 -104 15 55 166 43 -54 -167 189 461 656 356 22 -376 -134
4826a34K81K23j95k44k54k30L45J13M48m35k86j87j44L16L43N8m42P4J44n2K33
$$ -134 147 370 175 -69 -323 -553 -208 -95 353 -82 -368 -555 -699 -383 -40 18 -424 -350 -206 -258 -25
4847b5K97j47m14P7J33l93Q12P4j57o27K11J38M23k73J28n2l45l47L75L38j1k25
$$ -25 272 125 -289 -212 -79 -472 340 414 257 -370 -159 -21 402 129 257 205 -140 -487 -112 226 215 -10
4869a0k16M9M2M29j88L92n55R7k6O6M56k53m22J33Q9q2M67J90n43j8m06J20J75
$$ -10 -226 -177 -135 294 106 498 -57 40 14 80 536 283 -139 -6 83 1 468 658 115 97 -309 -189 -14
4892a4J44jm02j56j83J70K68J70j54k4l50M4K80K05r7j49l38M88J40K97k95K02
$$ -14 130 129 -273 -429 -612 -442 -174 -4 -158 -182 -532 -488 -208 -3 -100 -249 -587 -99 41 338 43 245
4914B45n06r9M09K0N73m10l36P0j3N9J36J06r6k89N2L24l1q6L13n03j5r9O9L01
$$ 245 -261 -360 49 69 642 232 -104 -34 -47 12 148 254 158 -131 -79 245 214 128 441 -62 -77 -176 -107 194
4938A94J27ro21K52l1R8K97j87j81k70O1K2N74j17j04o97K88o8J97J24j7q0m04
$$ 194 321 312 -309 -57 -88 10 307 120 -61 -331 -270 -248 326 209 105 -592 -304 -372 -175 -51 -68 -148 -552
4961e52MK03L04Rk25j20Q7p5N65L52o0l18k60J83K72K8K42p3p15l4J39L50K19
$$ -552 -548 -345 -41 -32 -257 -377 -290 -365 200 552 492 174 -86 97 369 397 639 566 -149 -183 -44 306 525
4984E25n1k36n54L58J52K25j64r3n38L40k07Q4N08k75l7l19j04L0P11m53N35n85
$$ 525 474 238 -316 42 194 419 255 162 -376 -36 -243 -159 349 74 37 -282 -386 -356 355 -98 437 -148
5006a48j99N82n7Qj09j11P5l27O0Q1M04O2l47l48K09J52J10R5n24M05k42J06J02
$$ -148 -347 235 178 186 77 -34 41 -286 -226 -145 259 321 -26 -374 -165 -13 97 192 -332 73 -169 -63 39
5029C9J07J44j12l69J57L12R0j98K23n53N3N65K22m27k11J77M5j56L18K2m62O3
$$ 39 146 290 178 -191 -34 278 368 170 393 -160 -107 458 680 253 42 219 264 108 426 448 -14 49
5051D9k15N5l9M75j17j38o73N13j29M16j30M4j12j55J58r4J87J74l35rk81j27
$$ 49 -166 -111 -150 325 208 70 -603 -90 -219 197 67 111 -1 -156 2 -92 95 269 -66 -75 -356 -483
5073d83P29J51l96J17l08j27L51K07j1m43K05m18K59N44j3L4m24m2k24K95K16
$$ -483 246 397 1 118 -190 -317 34 241 230 -213 -8 -426 -167 377 364 398 -26 -68 -292 3 219
5094B19K72m66K7j82O6L31mK12l82J00m7p6K66j11j68j21k72p1L41M88k55l48
$$ 219 491 25 52 -130 -64 267 263 475 93 193 146 70 336 225 57 -64 -336 -407 -66 422 167 -181
5116a81j46j06J92k6K51k2k17J9l68N73j20K22k34l38M51J17R5p2J31n52K88j83
$$ -181 -327 -433 -241 -267 -16 -38 -255 -236 -604 -31 -151 71 -163 -501 -50 67 162 90 221 -331 -43 -226
5138b26M38J64o9O2m29k67M37m7K58r9m46Q1K49J0M3J79k15k81k5K61R0Q3l5m60
$$ -226 212 376 307 369 -60 -327 110 63 321 222 -224 -143 106 116 159 338 123 -158 -183 78 168 251 216 -244
5162b44j3J92N00KK5m39k34oM44K11m47q4kj57j85M55j19L6n7l23j97K34N37n
$$ -244 -257 -65 435 437 462 23 -211 -217 227 438 -9 -93 -95 -252 -437 18 -101 -65 -122 -445 -642 -408 129 124
5186A24m2j04k84J02L6L41J30k23r6p1K49j80j9J94q1J45m38QM63J21j97m00O9
$$ 124 82 -22 -306 -204 -168 173 303 80 -16 -87 162 -18 -37 157 76 221 -217 -209 254 375 178 -222 -153
5209a53J99M79l31k07L56m38J03J20J96l08j2k17M6K82J18R8l19L1j52L0J65j14
$$ -153 46 525 194 -13 343 -95 8 128 324 16 4 -213 -167 115 233 331 12 43 -109 -79 86 -28
5231b8K26j28l78j98O61n5R4n10j65k76N33K95k3J7K6m44K8L29J22L22m75nJ38
$$ -28 198 70 -308 -506 155 100 194 -316 -481 -757 -224 71 48 65 91 -353 -325 4 126 448 -27 -32 106
5254A06k0J1L51J12k59m77J01J29L08J51l25k78J02j72K92J74j24l83K57j35Q0
$$ 106 86 97 448 560 301 -176 -75 54 362 513 188 -90 12 -160 132 306 182 -201 56 -79 1
5275Aj3K09K15o36j49p1N56oK36n63k78M80r7J38K32j18m38Nj96L29K92R5m81
$$ 1 -12 197 412 -224 -373 -444 112 106 342 -221 -499 -19 -116 22 254 136 -302 -297 -493 -164 128 223 -258
5298b58j45j85M18K22j49J04m11j82L19M01J3L70l04k45k20L68J34L16n57p5p0
$$ -258 -403 -588 -170 52 -97 7 -404 -586 -267 134 147 517 213 -32 -252 116 250 566 9 -66 -136
5319a36J91K9K48k76j00p9L12j55M04O6n71K79l27j57N79k7k19k71j10J79J47
$$ -136 55 84 332 56 -44 -123 189 34 438 504 -67 212 -115 -272 307 280 61 -210 -320 -141 6
5340FJ04J57l22l3L00k62o4K13k55n9p7r5M38J2o5k53o2j27J39K53M22k16m06
$$ 6 110 267 -55 -88 212 -50 -114 99 -156 -215 -292 -387 51 63 -2 -255 -317 -444 -305 -52 370 154 -252
5363b52N9l58N24J48P6K15j1o57K82J67K01M0j99k99J29j92L76O5rj81m00M38
$$ -252 -193 -551 -27 121 197 412 401 -256 26 193 394 434 235 -64 65 -127 249 314 305 124 -276 162
5385A62K40k77K42j04o24k0N65J55j59Q3m31j56p3P10k88J59k80k85L36K7K90
$$ 162 402 125 367 263 -361 -381 184 339 180 263 -168 -324 -397 313 25 184 -96 -381 -45 -18 272
5406B72L0l38k83K8M3J67m5K58j23j33l15M57J84l71N88o75k0J79J44L17l2n17
$$ 272 302 -36 -319 -291 -248 -81 -126 132 9 -124 -439 18 202 -169 419 -256 -276 -97 47 364 332 -185
5428a85R1J04K49J41j75mk28k9QL23q8L10n04r0J36k40N04l98L32l88m10j44O27
$$ -185 -94 10 259 400 225 221 -7 -36 -28 295 207 517 13 -77 59 -181 323 -75 257 -131 -541 -685 -58
5451e8mL51k72n48j6L93J37J06P8n73k16K93N46k97N47o49j96J48l18N46L79J0
$$ -58 -62 289 17 -531 -547 -154 -17 89 167 -406 -622 -329 217 -80 467 -182 -378 -230 -548 -2 377 387
5473C87l85k36J04J0L45r3k81j39k18K7O17K29k66Q1k71K0r8K84J27j50m13M42
$$ 387 2 -234 -130 -120 225 132 -149 -288 -506 -479 138 367 101 182 -89 -69 -167 117 244 94 -319 123
5495A23k15l5M26k66J06j50k53P3L36m8rj79l77J47L78R1j5m0k59m61L57M39q0
$$ 123 -92 -127 299 33 139 -11 -264 -191 145 97 88 -91 -468 -321 57 148 133 93 -166 -627 -270 169 89
5518H9r0k65j17O9N46j01m5qm56K63K77KK26l09j49j57lN14L5j09k66l56K55J84
$$ 89 -1 -266 -383 -314 232 131 86 78 -378 -115 162 164 390 81 -68 -225 -228 286 321 212 -54 -410 -155 29
5542B9J72j2J89m17l82L62L87K4J01l07n4j24JJ65M18l46n31J94M1j53N48l6l23
$$ 29 201 189 378 -39 -421 -59 328 352 453 146 92 -32 -31 134 552 206 -325 -131 -90 -243 305 269 -54
5565e4k84J2K35q1L22j52l97o1L83q2K77l08K26k99J37j96K93L50k62L7k79K79
$$ -54 -338 -326 -91 -172 150 -2 -399 -460 -77 -159 118 -190 36 -263 -126 -322 -29 321 59 96 -183 96
5587I6J27j09J25m01K8K22J6K63j61J46j96j19L4J66L0k96o8k99J36L80J75l59
$$ 96 223 114 239 -162 -134 88 104 367 206 352 156 37 71 237 267 -29 -97 -396 -260 120 295 -64
5609f4k88K69o5n0L45J88k20k77J30p8J58j33J51k18k43K15n56P22l67L75n67
$$ -64 -352 -83 -148 -198 147 335 115 -162 -32 -110 48 -85 66 -152 -395 -180 -736 -14 -381 -6 -573
5630e73J80N2K39K43k05k6k57K65N5J04j92K19j65k87L03j75O48j81j32k19n5
$$ -573 -393 -341 -102 141 -64 -90 -347 -82 -27 77 -115 104 -61 -348 -45 -220 428 247 115 -104 -159
5651a59L44m7K64k25k37J02o8J14L58o6Rm70j30J49J12M5K14k43lj1j50Q0N5k67
$$ -159 185 138 402 177 -60 42 -26 88 446 380 389 -81 -211 -62 50 95 309 66 63 52 -98 -18 37 -230
5675b30J28j58j24J53N23k07j13m05L22M0NL0Q4J5L2j95L3M90l12l59R2K96L3
$$ -230 -102 -260 -384 -231 292 85 -28 -433 -111 -71 -66 -36 48 63 95 -100 -67 423 111 -248 -156 140 173
5698A73j37l9m9J32j6r7K35J10q4p6o2K55j86L8k5j2l54K77j06o4J88P9l66k29
$$ 173 36 -3 -52 80 64 -33 202 312 228 152 90 345 159 197 172 160 -194 83 -23 -87 101 180 -186 -415
5722d15N13j7l9K31l82r5K03k96L75Jk26j1pJ5j2J07j9k57J96LJ34kK5L2j94O3
$$ -415 98 81 42 273 -109 -204 -1 -297 78 79 -147 -158 -165 -150 -162 -55 -74 -331 -135 -132 2 0 25 57 -137 -74
5748g4l76O13j35J64m1j69k26K56J71J62r3m39j19K40j10L40P6j63l51L20k15
$$ -74 -450 163 28 192 151 -18 -244 12 183 345 252 -187 -306 -66 -176 164 240 77 -274 46 -169
5769a69J69L32J5l68l72M74K20J31k37p0j83K23m42L58q3L29l69k58k19K37M73
$$ -169 0 332 347 -21 -393 81 301 432 195 125 -58 165 -277 81 -2 327 -42 -300 -519 -282 191
5790A91l46j05L4m14J45L78Q7l09R5m26M33k03O72J06m98k07L31p9J18R9K89n34
$$ 191 -155 -260 -226 -640 -495 -117 -30 -339 -244 -670 -237 -440 232 338 -160 -367 -36 -115 3 102 391 -143
5812a43m3J49L0K45J45k37j27l18J56N59o4Ok34m62K8J7M28L7L34l87n11K18K43
$$ -143 -186 -37 -7 238 383 146 19 -299 -143 416 352 358 124 -338 -310 -293 135 172 506 119 -392 -174 69
5835F9K85j70m80m9N6K25K44L8k01k52P9J18N1K14J65m59k49N7j28L61p1n0l2
$$ 69 354 184 -296 -345 -289 -64 180 218 17 -235 -156 -38 13 227 392 -67 -316 -259 -387 -26 -97 -147 -179
5858a79L6l72N29L15k77Pj63%J63K30kj90j30J82j55l7J61J86n5j23r0j10l6L02
$$ -179 -143 -515 14 329 52 59 -104 -104 59 289 287 97 -33 149 -6 -43 118 304 249 126 36 -74 -110 192
5882A92n0J20o36M47K67j73N5n28r6K58l5L26J39n50M7q7K29K0J2L69k40j96j97
$$ 192 142 262 -374 73 340 167 222 -306 -402 -144 -179 147 286 -264 -217 -304 -75 -55 -43 326 86 -110 -307
5905c07J48Q2l0j29R8m7J50m1K40k65J08l75j76O31r9N4M0Qk40k23M51J52L45
$$ -307 -159 -77 -107 -236 -138 -185 -35 -76 164 -101 7 -368 -544 87 -12 42 82 90 -150 -373 78 230 575
5928E75j55m09l01N15q5K33k36n32J37J58J79K11K05n87J07k48J73J18K06k48
$$ 575 420 11 -290 225 140 373 137 -395 -258 -100 79 290 495 -92 15 -233 -60 58 264 16
5948A6j89j71J13L84k73L40k52j91k16N53J14j53l29l2J19L7J1L45k96K6p5k59
$$ 16 -173 -344 -231 153 -120 220 -32 -223 -439 114 228 75 -254 -286 -167 -130 -119 226 -70 -44 -119 -378
5970c78L57j12J74m1k74J77j4P8K00O8l49j39O5Q2M46k46Q5j12k17o7K63K94O6
$$ -378 -21 -133 41 0 -274 -97 -111 -33 167 235 -114 -253 -188 -106 340 94 179 67 -150 -217 46 340 406
5993D06m27p2j15L06K29r8Qj17m20L80j58K33n6O4j68m34K83J94L98m76k6P7m48
$$ 406 -21 -93 -208 98 327 229 237 120 -300 80 -78 155 99 163 -5 -439 -156 38 436 -40 -66 11 -437
6016d37K30K12K89l10l66K05j16L96Jj22j50n4J23L25l06J82j6m63N07J14j97
$$ -437 -207 5 294 -16 -382 -177 -293 103 104 -18 -168 -222 -99 226 -80 102 86 -377 130 244 47
6037D7j5j23J41k24J26K56O8J86m35Q0J6P6j2L3M4m22J93k28K38L27Rn79KR0J1
$$ 47 32 -91 50 -174 -48 208 276 462 27 107 123 199 187 220 264 -158 35 -193 45 372 381 -198 -196 -106 -95
6062i5OP5J23o05M58k07L13J20n1l96Ok22M14P1K70j65k29p3J60l1K71k30J59
$$ -95 -89 -14 109 -496 -38 -245 68 188 137 -259 -253 -475 -61 10 280 115 -114 -187 -27 -58 213 -17 142
6085A42J41l69J98k02L41k26q0O3J7K9k60L36j01O1q9l7K63l6n5k00J0Q6K45k23
$$ 142 283 -86 112 -90 251 25 -55 8 25 54 -206 130 29 90 1 -36 227 191 136 -64 -54 32 277 54
6109E4J97j04n1k28j13L56J50j04j09n07L00P7J96r7K5j12r2J47k77L49m7r0j11
$$ 54 251 147 96 -132 -245 111 261 157 48 -459 -159 -82 114 17 42 -70 -162 -15 -292 57 10 -80 -191
6132a91k4K15N6J19l02Mj08J94j73K36r8j08K55l84N11o6k13K00j21J57K66m17
$$ -191 -215 0 56 175 -127 -123 -231 -37 -210 26 -72 -180 75 -309 202 136 -77 123 2 159 425 8
6154HL48n73L48Jm7k71K34J2K25o51L19J68Q1j66K24o6m06J99p5J69Q5P6l61O2
$$ 8 356 -217 131 132 85 -186 48 60 285 -366 -47 121 202 36 260 194 -212 -13 -88 81 166 242 -119 -57
6178e7K5p6K50k96j03k33J43O51m57L9K6Mj22k9K96J74k97l35k1L70k91O77q2
$$ -57 -32 -108 142 -154 -257 -490 -347 304 -153 -114 -88 -84 -206 -235 61 235 -62 -397 -418 -48 -339 338 256
6201B56nj22k37j19L60k30L35j57j66L17k50K40J29k68J29l84K80J75J17o3m85
$$ 256 251 129 -108 -227 133 -97 238 81 -85 232 -18 222 351 83 212 -172 108 283 400 337 -148
6222a48J85j63K20q4j9M19m19l31K25K07k67J54k08l3P2j94P05k14j62k01j79
$$ -148 37 -126 94 10 -9 410 -9 -340 -115 92 -175 -21 -229 -262 -190 -384 321 107 -55 -256 -435
6243d35M60K81l28O0K09p42J23M47j76r8K41m5PJ37M1J28l61j9j67K06M10k03
$$ -435 25 306 -22 38 247 -495 -372 75 -101 -199 42 -3 4 141 182 310 -51 -70 -237 -31 379 176
6265A76R7k41O3m0J31Q8j9J40j36j97j01N9k34O26m92J57j64n0K78P8l31j21j95
$$ 176 273 32 95 55 186 274 255 395 259 62 -39 20 -214 412 -80 77 -87 -137 141 219 -112 -233 -428
6288d28L18K6k83M44R3k88K31kJ3n4j11j44J25n2k01K24P3J72o7j62j90N37m82
$$ -428 -110 -84 -367 77 170 -118 113 111 124 70 -41 -185 -60 -112 -313 -89 -16 156 89 -73 -263 274 -208
6311b08J14L07l94J85J67j7L10m63l39L09k8J45K75k65j48p9K3k05M28J8J01j40
$$ -208 -94 213 -181 4 171 154 464 1 -338 -29 -57 88 363 98 -50 -129 -106 -311 117 135 236 96
6333I6L2j96r3K84j88J40k61L08J9K28k83R1k97k17L22k00L43j21m62L95l29L11
$$ 96 128 -68 -161 123 -65 75 -186 122 141 369 86 177 -120 -337 -15 -215 128 7 -455 -60 -389 -78
6355g8%K84m19J24m4P0j79J03J39nj93J43J56l05K86l15L36l40L00K14j70Q1m03
$$ -78 -78 206 -213 -89 -133 -63 -242 -139 0 -5 -198 -55 101 -204 82 -233 103 -237 63 277 107 188 -215
6378b15J0P7L73k19N7P1m82K81J55O9j48M61m40K2j33L02P4j27k57R4k53K00m8
$$ -215 -205 -128 245 26 83 154 -328 -47 108 177 29 490 50 72 -61 241 315 188 -69 25 -228 -28 -76
6401g6P5J8k69K38K6n3L66j72l62J04k97M63r0L10m0l94m4KM71l71K26k13p8j28
$$ -76 -1 17 -252 -14 12 -41 325 153 -209 -105 -402 61 -29 281 241 -153 -197 -195 276 -95 131 -82 -160 -288
6425b88L94mJ49K1l52q5J00j20N41j15j57j36m8N7j4K65J99n63J65j01J19OP3
$$ -288 106 102 251 272 -80 -165 -65 -185 356 241 84 -52 -100 -43 -57 208 407 -156 9 -92 27 33 106
6448A06j50K54k96K83O4M4l76J03j50J72J02j24k11K44j72J4o0R8J59l75M48q48
$$ 106 -44 210 -86 197 261 305 -71 32 -118 54 156 32 -179 65 -107 -93 -153 -55 104 -271 177 -671
6470f71M37M6J17L11n26R6J67J17j11Q1o7N9k44J18j53M15K00l42n22K78J05O16
$$ -671 -234 -188 -71 240 -286 -190 -23 94 -17 64 -3 56 -188 -70 -223 192 392 50 -472 -194 -89 527
6492E27l7l81l4k71L40k27K60K51j12m51K17%n3J51k57L56k95j60L07j34j2j44
$$ 527 490 109 75 -196 144 -83 177 428 316 -135 82 82 29 180 -77 279 -16 -176 131 -3 -15 -159
6514a59k6o7L43Q1p0p5l56L09k40K71j31K83l50J61J8O3j32M7J50j08j22Q2J01
$$ -159 -185 -252 91 172 102 27 -329 -20 -260 11 -120 163 -187 -26 -8 55 -77 -30 120 12 -110 -28 73
6537G3J51l54L59l91J0O9J39k07L58q1j83J34JmJ25l27K13k24M8L48J88l45l58
$$ 73 224 -130 229 -162 -152 -83 56 -151 207 126 -57 77 78 74 199 -128 85 -139 -91 257 445 100 -258
6560b58L35l44N48j03j88q0O3q1j40J14L31k75j17k75J56K42L56l27J14ll41p5
$$ -258 77 -267 281 178 -10 -90 -27 -108 -248 -134 197 -78 -195 -470 -314 -72 284 -43 71 68 -273 -348
6582c48L47q4nM8k70L03n2j17j27K42J25m4K8J20J27l82l7M3j28K35M7J16m5j34
$$ -348 -1 -85 -90 -42 -312 -9 -61 -178 -305 -63 62 18 46 166 293 -89 -126 -83 -211 24 71 187 142 8
6606HJ18m0L10o5k84M2p6j52N1J61L27l70m42K29J73lJ4P8j35J46l10K22j22K16
$$ 8 126 86 396 331 47 89 13 -139 -88 73 400 30 -412 -183 -10 -13 1 79 -56 90 -220 2 -120 96
6630I6J8k34j62N0K46Q2j19k18J28q5J69M4L54m76K6k43J30N13l41L73l36k41
$$ 96 114 -120 -282 -232 14 96 -23 -241 -113 -198 -29 15 369 -107 -81 -324 -194 319 -22 351 15 -226
6652b26K54n8J33J53k59j70J93L4k32K1L54k04P7P0j01Q1j58J5N1o0K9oL16l54
$$ -226 28 -30 103 256 -3 -173 20 54 -178 -157 197 -7 70 140 39 120 -38 -23 28 -32 -3 -9 307 -47
6676d7K5m3p2p0J42K30O7l28oJ65MO1j08l07K19j28K53J75k66k5j68J32m9K40
$$ -47 -22 -65 -137 -207 -65 165 232 -96 -102 63 67 128 20 -287 -68 -196 57 232 -34 -59 -227 -95 -144 96
6700I6k5%j85j11K37O1p2J64j8k92K06L6J04l2m5M8k95K14l35N40j89pJ9q2j60
$$ 96 71 71 -114 -225 12 73 1 165 147 -145 61 97 201 169 124 172 -123 91 -244 296 107 100 119 37 -123
6725a23P3K06j68J24m4K54o1m45K73n4J29k05j20M62q4o9j75j13N8K04j54K27
$$ -123 -50 156 -12 112 68 322 261 -184 89 35 164 -41 -161 301 217 148 -27 -140 -82 122 -32 195
6747A95j98P9j30Q2j21L73j92J0m60J70L54j02P0l02M60m06K64j46J26p9k59L34
$$ 195 -3 76 -54 28 -93 280 88 98 -362 -192 162 60 130 -172 288 -118 146 0 126 47 -212 122
6769A22k03L26M4l32M4n8M5O3p6L14n3m18L3K13K3K21l3k32j50l13J54K27L1l
$$ 122 -81 245 289 -43 1 -57 -12 51 -25 289 236 -182 -149 64 87 308 275 43 -107 -420 -266 -39 -8 -11
6793a1J55j96q1j4k97L77j48rQ5J30j69L63j11p3P0j36K09l07K01R1k75k2l2K34
$$ -11 144 -52 -133 -147 -444 -67 -215 -224 -139 -9 -178 185 74 1 71 -65 144 -163 38 129 -146 -168 -200 34
6817C4j00j18L13l40j18L46J04k36L22n32J76J53M6j1R0J94m76K71m0M68m89j84
$$ 34 -66 -184 129 -211 -329 17 121 -115 207 -325 -149 4 50 39 129 323 -153 118 78 546 57 -127
6839a27j02K68j30K90J59m45J86l25k54M83N3j66M9j92j4K48j69L16k04L80o49
$$ -127 -229 39 -91 199 358 -87 99 -226 -480 3 56 -110 -61 -253 -267 -19 -188 128 -76 304 -345
6860c45L76j21K09j41L14o83K66J46k82L39J35j63l53L20l51L08l7q5L6J59m9
$$ -345 31 -90 119 -22 292 -391 -125 21 -261 78 213 50 -303 17 -334 -26 -63 -148 -112 47 -2
6881bK72l01K72l18j49K11p3K71k36J46k14n3J91P4j4o9j22M4Q8J83l2j31q7j88
$$ -2 270 -31 241 -77 -226 -15 -88 183 -53 93 -121 -174 17 91 77 8 -114 -70 18 201 169 38 -49 -237
6905b37K86j42q6K79j77K4j52K99m37K81K6K6N0k19k10L07J68n9j36K04K9l70
$$ -237 49 -93 -179 100 -77 -53 -205 94 -343 -62 -36 -10 40 -179 -389 -82 86 27 -109 95 124 -246
6927b46L76j99J53l16L95m7P5Q7j27J14l24J45r9kM1k41M14k60j38j05M14r7R1
$$ -246 130 -69 84 -232 163 116 191 278 151 265 -59 86 -13 -15 26 -215 199 -61 -199 -304 110 13 104
6950A04j18R2l6J60j6m6j34j06n0Q2j33K05k86k27M30k88N38j31j99L59l10j31
$$ 104 -14 78 42 202 186 140 6 -100 -150 -68 -201 4 -282 -509 -79 -367 171 40 -159 200 -110 -241
6972b41P9R8L0o6J7j13j51N19j24m0J9j03l19M89j07J89l65n1O6J30J84j16N2
$$ -241 -162 -64 -34 -100 -83 -196 -347 172 48 8 27 -76 -395 94 -13 176 -189 -240 -174 -44 140 24 76
6995G6k14j3K42J09k98L41m07J88L0K0J3m7M06l24j07l00L36Q0r3k47J64P8P3
$$ 76 -138 -151 91 200 -98 243 -164 24 54 74 87 40 446 122 15 -285 51 131 38 -209 -45 33 106
7018A06m0m0J94j99k90J13J8J09M7k31L1n1j01L89Q0J0l13rL44K30j45l03J59
$$ 106 66 26 220 21 -269 -156 -138 -29 18 -213 -182 -233 -334 55 135 145 -168 -177 167 397 252 -51 108
7041A08o4j21M8K47p0p1o8P9k33J44o5K85J7m19O5K73l8N7J41l10n75M61J42L21
$$ 108 44 -77 -29 218 148 77 9 88 -145 -1 -66 219 236 -183 -118 155 117 174 315 5 -570 -109 33 354
7065C54m54o2K55K0r9R7p2j01J71pn8j26K86m04j37K43K68Ql53J16k81L39J26
$$ 354 -100 -162 93 113 14 111 39 -62 109 102 44 -82 204 -200 -337 -94 174 182 -171 -55 -336 3 129
7088A29j24j42mJ04N3k3k04L20l32M91j58K0j89K97r5j78J19R8j96J16j31K38
$$ 129 5 -137 -141 -37 16 -7 -211 109 -223 268 110 130 -59 238 143 -35 84 182 -14 102 -29 209
7110B09j77P0o7q0J94k63K59n9J12O3k13R0k8m6k92M8N1K67l36L9K29l11K54J6
$$ 209 32 102 35 -45 149 -114 145 86 198 261 48 138 110 64 -228 -180 -129 138 -198 -159 70 -241 13 29
7134B9J64m88J6K67L5j48N0J29p7K47j54K4j11J72j34R9l27J44M7M9L08m94K99
$$ 29 193 -295 -279 -12 23 -125 -75 54 -23 224 70 94 -17 155 21 120 -207 -63 -16 33 341 -153 146
7157A46p6L20k50K84k34k46J19J52j91j72M33j13j8m07M24l24r0N29l01j27K64
$$ 146 70 390 140 424 190 -56 63 215 24 -148 285 172 154 -253 171 -153 -243 286 -15 -142 122
7178A22o9J30K4m9k72J36k38K63p7R9j07J25oj31l95L56J09r7j16J9k62M74j01
$$ 122 53 183 207 158 -114 22 -216 47 -30 69 -38 87 81 -50 -445 -89 20 -77 -193 -174 -436 38 -63
7201f3N9L6J14m76O29k25k9R0j65J97kP2l87K13j76K17j35o0l2L0J92R4m9n3N5
$$ -63 -4 32 146 -330 299 74 45 135 -30 167 165 237 -150 63 -113 104 -31 -91 -123 -93 99 193 144 91 146
7226A46N7k53P2J19r8k19J43J96K7k08l83L58m34L33J38o5j68l1J8K38p7J05R3
$$ 146 203 -50 22 141 43 -176 -33 163 190 -18 -401 -43 -477 -144 -6 -71 -239 -270 -252 -14 -91 14 107
7249A07k69K77j10K29l77q7J85j36K27J54k99O9J50j20j44K95l4N9k45L28k38
$$ 107 -162 115 5 234 -143 -230 -45 -181 46 200 -99 -30 120 0 -144 151 117 176 -69 259 21
7270B1o8j32K90J39m8j21j68J14J14o7k69K52m67K70m7M95m2k79k48L40R7J12
$$ 21 -47 -179 111 250 202 81 -87 27 141 74 -195 57 -410 -140 -187 308 266 -13 -261 79 176 288
7292B88m13k2K18k50J07O2J68k59o9K17l17K76j3o0J79J41k15k89M27o8k76j2
$$ 288 -125 -147 71 -179 -72 -10 158 -101 -170 47 -270 6 -7 -67 112 253 38 -251 176 108 -168 -180
7314a80K76m02L55J02j92J49l02L9M04o8K96m41j57J57j60K27k01R2K47o0k14
$$ -180 96 -306 49 151 -41 108 -194 -155 249 181 477 36 -121 36 -124 103 -98 -6 241 181 -33
7335c3r7K86k38R8r2Q3n5K27o3p6J41j23J19k66l9j06K28r1Q1kO4j4k62L79l20
$$ -33 -130 156 -82 16 -76 7 -48 179 116 40 181 58 177 -89 -128 -234 -6 -97 -16 -18 46 32 -230 149 -171
7360a71k31K59p2J72Rj05j79J29J5K42N1J94l26J68J16m80K15kJ02l14K06J19
$$ -171 -402 -143 -215 -43 -34 -139 -318 -189 -174 68 119 313 -13 155 271 -209 6 4 106 -208 -2 117
7382A17P3j48Q9k75j66J80m8L23k39n2R3J55J59Oj31K8l31J79n7j4J48j3q0on8
$$ 117 190 42 131 -144 -310 -130 -178 145 -94 -146 -53 102 261 267 136 164 -167 12 -45 -59 89 76 -4 -10 -68
7407f8L57k49O9K9j99j50K53j7k88K26O9l03R9K83j63L0K67p70M68J81m64L10
$$ -68 289 40 109 138 -61 -211 42 25 -263 -37 32 -271 -172 111 -52 -22 245 -525 -57 124 -340 -30
7429c0JQ3k66L37j7J01j57Kk54L99k60K95oj64k07j14L99p6Q6p7nrq8J38p6O7
$$ -30 -29 54 -212 125 108 209 52 54 -200 199 -61 234 228 64 -143 -257 142 66 152 75 70 61 -27 111 35 102
7455A02J27q6k42r7L56j86J12N3l53J6Q4L02Km0j56O0k79K44K45l13m5J69k13
$$ 102 229 143 -99 -196 160 -26 86 139 -214 -198 -114 188 190 150 -6 54 -225 19 264 -49 -94 75 -138
7478a38N7K78O9m74j49M47k05J53J4n6P3K37k41j41L7j3J42j57J70o5j2l8P4J63
$$ -138 -81 197 266 -208 -357 90 -115 38 52 -4 69 306 65 -76 -39 -52 90 -67 103 38 26 -12 62 225
7502B25n37K27o7K08j51J17j30m2j11L19pK18J2m57L08n15M30q4j64J45J9l52
$$ 225 -312 -85 -152 56 -95 22 -108 -150 -261 58 51 269 281 -176 132 -383 47 -37 -201 -56 -37 -389
7524c89K61K9J20j40nJ09Jl23M83N5l72K7K23J30r0PN3l45K22n5j7L4K87l61L6
$$ -389 -128 -99 21 -119 -124 -15 -14 -337 146 201 -171 -144 79 209 119 126 179 -166 56 1 -16 18 305 -56 -20
7549b0j86L85j55J60p3j77J38m1PkJ95l63O5K00j06m1j27j55Q2K1J43n5K55m31
$$ -20 -206 179 24 184 111 -66 72 31 38 36 231 -132 -67 133 27 -14 -141 -296 -214 -193 -50 -105 150 -281
7573b81L05j56k2L38q9j42l16L07k88N28k26M60k27j79J1k71M03o1J23l3k99J36
$$ -281 24 -132 -154 184 95 -47 -363 -56 -344 184 -42 418 191 12 23 -248 155 94 217 184 -115 21
7595B1j48K89L6j43j48m5J45k90L6K60O8k87j07K94K7J74k24j32K61L1J34k45
$$ 21 -127 162 198 55 -93 -138 7 -283 -247 13 81 -206 -313 -19 8 182 -42 -174 87 118 252 7
7617GK96k70p2k3J95K55k83O2m3l15N1R9J3Nj19J35k80L66j60K0J89l04J15k48
$$ 7 303 33 -39 -62 133 388 105 167 124 -191 -140 -41 -28 -23 -142 -7 -287 79 -81 -61 128 -176 -61 -309
7641c09K86n2J51n8K9j16m8K07j71K62k49M4O5k2K9j67K97k58k52K57J91Q0k46
$$ -309 -23 -75 76 18 47 -69 -117 90 -81 181 -68 -24 41 19 48 -119 178 -80 -332 -75 116 196 -50
7664e0K81J12n37J88J65J55k90j45J01P5nK42l72N5K54m13R4K72K50m81o2J50
$$ -50 231 343 -194 -6 159 314 24 -121 -20 55 50 292 -80 -25 229 -184 -90 182 432 -49 -111 39
7686C9j04J25j67M4k80R8L31q8K4r1l2k43N18l58j29L10n1k32L46k48J67J57j32
$$ 39 -65 60 -107 -63 -343 -245 86 -2 22 -69 -101 -344 174 -184 -313 -3 -54 -286 60 -188 -21 136 4
7709Dm5J45jj09j7L83l00l1m2k10R7J70j23M44Q8l43j36j47J92k52L67j80K68
$$ 4 -41 104 103 -6 -23 360 60 29 -13 -223 -126 44 -79 365 453 110 -26 -173 19 -233 134 -46 222
7732B22j83o8j50J00J2K2J35j66j13L9L94l02m1K23j3N4k91J41O9k73P4L06j21
$$ 222 39 -29 -179 -79 -67 -45 90 -76 -189 -150 244 -58 -99 124 111 165 -126 15 84 -189 -115 191 70
7755G0L5j48L5M0r5q7O9K30k37J86j8k7J58j15J43m64J60K34k62k4j1J19p0J71
$$ 70 105 -43 -8 32 -63 -150 -81 149 -88 98 80 53 211 96 239 -225 -65 169 -93 -117 -128 -9 -79 92
7779I2J15k07J97j92k24J73j97M59m39J48K0l4J35R0m77M82l35q9J21J69K93k28
$$ 92 207 0 197 5 -219 -46 -243 216 -223 -75 -55 -89 46 136 -341 141 -194 -283 -162 7 300 72
7801G2j28QP9j79J13j91L02j68J5Q7M1J25k34k79M03K07j30k56P6L44n13L16k94
$$ 72 -56 -48 31 -148 -35 -226 76 -92 -77 10 51 176 -58 -337 66 273 143 -113 -37 307 -206 110 -184
7824a84R4l0N6J85l41L73j8N2l2m14M32l91K75M1K5m6K02n82j5M32j55K01k50
$$ -184 -90 -120 -64 121 -220 153 135 187 155 -259 173 -218 57 98 123 77 279 -303 -318 114 -41 160 -90
7847i0O3o7k20L52n2O4l8j02K13J59k87K04l08J46k04J36o8J91J08K0l35j30J05
$$ -90 -27 -94 -314 38 -14 50 12 -90 123 282 -5 199 -109 37 -167 -31 -99 92 200 220 -115 -245 -140
7870a40J16K57m5j07o8p5k86J14K4O8mp2K05J61j79j2L93l50n0n8J90j76M25l99
$$ -140 -24 233 188 81 13 -62 -348 -234 -210 -142 -146 -218 -13 148 -31 -43 350 0 -50 -108 82 -94 331 -68
7894f8J01j0q7J11P6j8l13K85k29J98k77K64j74L45r9j40nJ09j38K35k93M70m22
$$ -68 33 23 -64 47 123 105 -208 77 -152 46 -231 33 -141 204 105 -35 -40 69 -69 166 -127 343 -79
7917g9k24J69MO1J9J7pr7q8n4K36l0L0j04J5L9RJ9r7L92q0j05l18N95l22J24n4
$$ -79 -303 -134 -130 -69 -50 -33 -40 -137 -225 -279 -43 -73 -43 -147 -132 -93 -84 -65 -162 230 150 45 -273 322 0 124 70
7944G0N0k26q3L35l9n7J11l00P7J51J56p3j22k35K40n3j14K39l51M56l08P2Qj74
$$ 70 120 -106 -189 146 107 50 161 -139 -62 89 245 172 50 -185 55 2 -112 127 -224 232 -76 -4 4 -170
7968a70J55J1q5n3l8j13M05k21J8O0O0r7J78j47K3K71n78K55l32N74j90k69L08
$$ -170 -15 -4 -89 -142 -180 -293 112 -109 -91 -31 29 -68 110 -37 -14 257 -321 -66 -398 176 -14 -283 25
7991B5j9K24p8k16K81k32J90l42K2K8L65j9j37P1J43m22n8K57j93p7J5K17Q7l76
$$ 25 6 230 152 -64 217 -15 175 -167 -145 -117 248 229 92 163 306 -116 -174 83 -110 -187 -172 45 132 -244
8015b44M74k70k3J72J4K22l28k90R8K51j84p7j04J82J48J30k51O9J97P3k59P1
$$ -244 230 -40 -63 109 123 345 17 -273 -175 76 -108 -185 -289 -107 41 171 -80 -11 186 259 0 71
8037G1n6J70j29l01J02k86K91K10j38N2K1J07r5J5J7k6K69q9j24P3j15J16j58
$$ 71 15 185 56 -245 -143 -429 -138 72 -66 -14 7 114 19 34 51 25 294 205 81 154 39 155 -3
8060cj56K65Jn82M08L73l16N59k77l67N9nJ63p8k35Q8j45K45k2P4k97L02l09L0
$$ -3 -159 106 107 -475 -67 306 -10 549 272 -95 -36 -41 122 44 -191 -103 -248 -3 -25 49 -248 54 -255 -225
8084b25K77m1l0K4N7J85j09k28M05m26r6J40K54k93k9J84n0l8k2K34J37k20O3
$$ -225 52 11 -19 5 62 247 138 -90 315 -111 -207 -67 187 -106 -135 49 -1 -39 -61 173 310 90 153
8107A53l22J73J99q5j95R2O8q6L6j18K78o3k36J89M4m6j72k1L30j30j97K93k90
$$ 153 -169 4 203 118 -77 15 83 -3 33 -85 193 130 -106 83 127 81 -91 -112 218 88 -109 184 -106
8130a06K7J87k12O1j97Q5kJ87j64J3K20j14j0M3k27k4p1N51j71j84p0K73K38l88
$$ -106 -79 108 -104 -43 -240 -155 -157 30 -134 -121 99 -15 -25 18 -209 -233 -304 247 76 -108 -178 95 333 -55
8154e5K28j55Q0k01n1J44l4J43l43K63Q4o5l5j44m6M68%R3M6o87K96k00K52j47
$$ -55 173 18 98 -103 -154 -10 -44 99 -244 19 103 38 3 -141 -187 281 281 374 420 -267 29 -171 81 -66
8178f6j73L71l43K51J14l6j25R6j65J56k00p0J61
$$ -66 -239 132 -211 40 154 118 -7 89 -76 80 -120 -190 -29
8191b9
$$ Imaginary data points
##PAGE= N=2
##DATA TABLE= (X++(I..I)), XYDATA
0@%%%%%%%%%%%Qj6J6j6J6j6K4l2L3m1M9n7O9p7Q7j02J16j30J48j66J85k08K32
$$ 0 0 0 0 0 0 0 0 0 0 0 0 8 -8 8 -8 8 -8 16 -16 17 -24 25 -32 37 -40 47 -55 61 -69 79 -87 98 -110 122
34A22k60K91l22L57l96M39m86N37n95O60p32Q13r03J004j120J258j421J614j852
$$ 122 -138 153 -169 188 -208 231 -255 282 -313 347 -385 428 -475 529 -591 667 -754 860 -992
53i92K150k539L072l848N094p421J3244n3582j32189K8951J00615R9764J0482
$$ -992 1158 -1381 1691 -2157 2937 -4484 8760 -44822 -177011 -148060 -47445 52319 62801
66F2801p0006j11062o2585L7155J21518J03834P281q5910q9503j8196O7265J02732
$$ 62801 -7205 -118267 -180852 -143697 -22179 81655 88936 3026 -86477 -104673 -37408 65324
78F5324P1392j0096p8691q3138j4409O4733Q4419K8687m5703p9421n7252n991
$$ 65324 136716 126620 47929 -35209 -49618 15115 99534 128221 82518 3097 -54155 -60146
90f0146M1206N2027J5849m3152o8490l7154J8626M6226L1695J960j7599k2986
$$ -60146 -18940 33087 48936 5784 -62706 -99860 -81234 -35008 -3313 -1353 -18952 -41938
102d1938j1896J7070M0669L2660J028j4734k207J0914Q539J941M475N961k944
$$ -41938 -53834 -36764 3905 36565 37593 22859 20652 31566 40105 42046 46521 52482 49538
115D9538r244n922o302j8255k1803m368J3223P182j5751l0943k5290p125J3933
$$ 49538 40294 34372 28070 9815 -11988 -16356 -3133 4049 -11702 -42645 -67935 -75060 -61127
128f1127K6251K1467k695l0252k8320P421M4564M9625J9900j5040k9459j9416
$$ -61127 -34876 -13409 -16104 -46356 -74676 -67255 -22691 26934 46834 31794 2335 -17081
140a7081R099M2506N0019J5453l6439n5153k4276J9194L7620K4289o342m0171
$$ -17081 -7982 34524 84543 99996 63557 8404 -15872 3322 40942 65231 58889 18718
152A8718n4492l0370J8272M6698K6343j9911m4597l3700l158K7094M2122K9329
$$ 18718 -35774 -66144 -47872 -1174 25169 5258 -39339 -73039 -76197 -49103 -6981 22348
164B2348o351l4645k5281J2330L9844L6137J1225j1431k1520j6218K399K2219
$$ 22348 15997 -18648 -43929 -31599 8245 44382 55607 44176 22656 6438 8837 31056
176C1056K1941k27k3360k5635j1466J277J982j683l248q205j3673j1774n87M396
$$ 31056 52997 52770 29410 3775 -7691 -6414 -4432 -6115 -9363 -17568 -31241 -43015 -43602 -39206
190c9206k98l07Q744J4347L671q952m817J0414J9950J9065J4176M243j2732j9321
$$ -39206 -39504 -39811 -31067 -16720 -13049 -22001 -26818 -16404 3546 22611 36787 41030 28298 8977
204H977j529K4691L0328P182k1792l3529k4010j592K0346K6636M784l1237m8444
$$ 8977 7448 32139 62467 69649 47857 14328 -9682 -11274 9072 35708 40492 9255 -39189
217c9189k7111J3956L7114K7581k267l0639l7302j5417K4271N0739L8171n089
$$ -39189 -66300 -52344 -15230 12351 10084 -20555 -57857 -73274 -49003 1736 39907 34818
229C4818l8912l3157K323L5399M4428K4704j1806m1500l8269j261L7443M0028
$$ 34818 -4094 -37251 -34928 471 44899 69603 57797 16297 -21972 -23233 14210 54238
241E4238N463l2339m4063k8088J995K8861L1993M780l2564m3636j6899J9602L6267
$$ 54238 59701 27362 -16701 -44789 -42794 -13933 18060 22840 -9724 -53360 -70259 -50657 -14390
254a4390K4641M24j9923k5315p186K2567L8800K5416n300k2689j6890K333J8126
$$ -14390 10251 10675 -9248 -34563 -41749 -19182 19618 45034 39734 17045 155 2488 20614
267B0614K1143J1997p269k3812k2188k839J3613J1807l265j4677j6124j2820n442
$$ 20614 41757 53754 46485 22673 485 -2354 11259 23066 19801 5124 -11000 -23820 -29262
280b9262M847J0497L690q746j2011k390O110P005O680P224N756o37l341K429R435
$$ -29262 -24415 -13918 -10228 -18974 -30985 -33375 -27265 -20260 -13580 -6356 -600 -1237 -4578 -2149 7286
295G286Q501K696J928J833l207p708k927M710N110k988q158p778o893n538r12
$$ 7286 15787 18483 20411 22244 19037 11329 8402 13112 18222 15234 7076 -702 -7595 -13133 -14045
310a4045N295L851o050j1685n367M814Q576P121K820Q99k684k174N393J3731J1532
$$ -14045 -8750 -4899 -10949 -22634 -28001 -23187 -14611 -7490 -4670 -3771 -6455 -8629 -3236 10495 22027
325B2027N00p054l250L388N674M026J782l479r326r546j734N764K155q957j1903
$$ 22027 22527 15473 12223 15611 21285 25311 27093 23614 14288 4742 3008 8772 10927 1970 -9933
340i933p288j003J147K130Q42m313q744l386P157J2574N660k921m257L38O234
$$ -9933 -17221 -18224 -17077 -14947 -14105 -18418 -27162 -30548 -23391 -10817 -5157 -8078 -12335 -11997 -5763
355e763R559J0586N199n266r389j983R731J2259K614q391j2002p767r46N499P921
$$ -5763 3796 14382 19581 14315 4926 2943 12674 24933 27547 19156 7154 -613 -1559 3940 11861
370A1861O33j2843j7150p172Q244J2872M975n067j0063p960j69J1631J7580P861
$$ 11861 12494 -349 -17499 -24671 -16427 -3555 1420 -3647 -13710 -21670 -21839 -10208 7372 15233
384A5233o723j3475l465R582J5087J0268j39r583j2367n981Q315J4110M337j1423
$$ 15233 8510 -4965 -8430 1152 16239 26507 26368 16785 4418 -1563 6752 20862 25199 13776
398A3776j7000j0266J031O533P076p4j0821j5363p512P716J5286O641n428r577
$$ 13776 -3224 -13490 -12459 -5926 1150 1076 -9745 -25108 -32620 -24904 -9618 -2977 -8405 -17982
412a7982m758L838J1171J3120O636m205r925k656R996J4171O244m579q878o315
$$ -17982 -22740 -18902 -7731 5389 12025 7820 -2105 -4761 5235 19406 25650 21071 12193 5878
426E878n55N701Q044P15r799j4207n949M897Q085J453o169q865p207q01Q229J0480
$$ 5878 5323 11024 19068 19783 9984 -4223 -10172 -5275 2810 4263 -1906 -10771 -17978 -18779 -10550 -70
442g0K563q113r237L53J0367J1340M985k324o374n133J310J0480J0366R9j1083
$$ -70 2493 -5620 -14857 -14504 -4137 7203 12188 9864 3490 -1643 -333 10147 20513 20612 9529
457I529j1822k191O761P198P91o738j1522j0001k79Q894R565j984j1254j0673
$$ 9529 -2293 -4484 2277 9475 10266 3528 -7994 -17995 -18274 -9380 185 -1799 -13053 -23726
471b3726m89R325J1132O512k355q125o518M593J5270J3126N68r175q361m97Q150
$$ -23726 -24215 -14890 -3758 2754 399 -7726 -14244 -9651 5619 18745 19313 10138 1777 1280 9430
486I430J0836O504m563j3872j1521P66J1176Q403l526j2535j2243n143M166R625
$$ 9430 20266 26770 22207 8335 -3186 -2420 8756 17159 13633 1098 -11145 -16288 -12122 -2497
500b497O934m320j3056j0309K827J2990J1588J239p008q434k599O691J3404R490
$$ -2497 4437 117 -12939 -23248 -20421 -7431 4157 5396 -1612 -10046 -12645 -5954 7450 16940
514A6940j848j1819r189K070J0936R076J21q408j1551p139K715J0385O821n165
$$ 16940 15092 3273 -5916 -3846 7090 16166 16287 7879 -3672 -10811 -8096 2289 9110 3945
528C945j3153r975M98Q950R201K228n243r550n162O238J3867R888j633q685o349
$$ 3945 -9208 -19183 -18685 -9735 -534 1694 -3549 -13099 -18261 -12023 1844 11732 10099 1414 -4935
543d935K808R592J0251M203m369j0506p304L709J0687O488m266j1739r773k689
$$ -4935 -2127 7465 17716 21919 17550 7044 -260 3449 14136 20624 16358 4619 -5154 -7843
557g843M230O586K867n725j2100q332K337J0199O963j173o882o476r22O298J0568
$$ -7843 -3613 2973 5840 115 -11985 -20317 -17980 -7781 -818 -1991 -8873 -15349 -16271 -9973 595
572E95O715k139q032m544M612R015O638J15n245o631k716L273O969K768m987r149
$$ 595 7310 5171 -2861 -7405 -2793 6222 12860 12975 7730 1099 -1617 1656 8625 11393 6406 -2743
588b743n739K060N035L248k200n400n127j225M057P599L421m016o087n93O198
$$ -2743 -8482 -6422 -1387 1861 -339 -5739 -10866 -12091 -8034 -435 2986 -1030 -7117 -7710 -1512
603a512P792M111o74m181l921J488O450P264K83p425q312j990M271N332J607m949
$$ -1512 6280 10391 9717 5536 1615 3103 9553 16817 17100 9675 1363 -627 3644 8976 10583 5634
619E634r652q536l46P195P053j272r161r263k018O121R737N827j276q409o982
$$ 5634 -4018 -12554 -12900 -5705 1348 76 -9085 -18348 -20366 -14245 -4508 1319 43 -8366 -15348
634a5348K095J1261J1855L229o715q731k639N112J0194P833j366r833j0720k271
$$ -15348 -13253 -1992 9863 13092 6377 -2354 -4993 119 10313 18146 16780 6947 -3773 -6044
648f044Q025R067J609p033j0436p376J038Q171P918M92q559r502j324O689R331
$$ -6044 1981 11048 12657 5624 -4812 -12188 -11150 -2979 4939 5431 -3128 -12630 -13954 -7265 2066
663B066M868j441o238m946J328Q558Q299J536n595o460j606L519N262J579k683
$$ 2066 6934 5493 -745 -5691 -4363 4195 12494 14030 8435 1975 369 3888 9150 10729 8046
678H046o645n472j206L832L167k026o554n382j1L222K871L24k430l249j582M050
$$ 8046 1401 -4071 -5277 -1445 1722 -304 -6858 -12240 -12251 -9029 -6158 -5834 -8264 -11513 -13095 -9045
694i045O799M357k044m332p56M632O355M790P83m022n458n76N757P032J154o119
$$ -9045 -2246 2111 67 -4265 -5021 -389 5966 10756 11539 7517 2059 1483 7240 14272 15426 9307
710I307q358m484K248N640M429k405q227r173k304O892Q692L049n974q067n122
$$ 9307 949 -3535 -1287 4353 8782 6377 -1850 -11023 -13327 -6435 2257 5306 -668 -8735 -13857
725a3857L904R100Q757J554o872q907k312P577J1203N252m173r597p346J82P149
$$ -13857 -9953 -853 7904 9458 2586 -6321 -8633 -1056 10147 15399 11226 1629 -5717 -5535 1614
740A614Q838J432q530j2232n047M601Q128M885k189r103q784j199P550J0317M359
$$ 1614 10452 11884 3354 -8878 -13925 -9324 -1196 3689 1500 -7603 -16387 -17586 -10036 281 4640
755D640m982q171l805M821R259Q177J457n800o648j574O858R405M081m128q842
$$ 4640 -342 -8513 -12318 -7497 1762 9939 11396 5596 -1052 -2626 4232 13637 17718 13590 4748
770D748n499J725N873M897j013p036q740l971M369O325K084m614p445l982J461
$$ 4748 -751 974 6847 11744 10731 3695 -5045 -9016 -4647 1678 3762 -852 -8297 -12279 -10818
785a0818N699O112P39m822o118l57O492P715K522l040n276k802K671N947N174
$$ -10818 -5119 993 1732 -3090 -9208 -9565 -3073 4642 7164 4124 -1152 -3954 -1283 4664 9838
800I838j033o768o715k08N019N124P2m875p516l536K662O551M385j883o984o057
$$ 9838 8805 2037 -4678 -4886 133 5257 5329 454 -7062 -10598 -7936 -1385 3000 1117 -5867 -11924
816a1924J119P369Q107J837m222o451k113M715Q887O725j063p981o655N57P272
$$ -11924 -10805 -3436 4671 6508 2286 -4165 -6278 -1563 7324 14049 12986 5005 -1650 -1093 6179
831F179P214J604n526r360o053J757Q289N718k492r919q200j797N321P275L656
$$ 6179 13393 14997 9471 111 -5942 -4185 4104 9822 7330 -2589 -10789 -12586 -7265 10 3666
846C666m086r001o040K576R174P688Q49o251o686j035N795Q293M743j984p303
$$ 3666 -420 -9421 -15461 -12885 -3711 3977 4826 -1425 -8111 -9146 -3351 4942 9685 7701 398
861C98n523J284P059O377k82o113o566k344L118N412L182k893o602n017J679O031
$$ 398 -5125 -3841 3218 9595 9313 3200 -3366 -5710 -2592 2820 6002 3109 -3493 -8510 -6831 -800
877h00M527n96m675m284k72M345O909L083l615n910k422M140O531M206j387o345
$$ -800 3727 3131 -1544 -5828 -6100 -1755 5154 8237 4622 -1288 -3710 430 6961 11167 9780 3435
893C435n727m92N526O801R48o615q780m602L439P457M286k776q487p635j147O661
$$ 3435 -2292 -2784 2742 9543 10491 3876 -4904 -9506 -6067 1390 5676 2900 -5587 -13222 -14369 -7708
909g708R192L621n404r557m980L878R931Q367J313o577r205k583O654J1057O218
$$ -7708 1484 5105 -299 -9856 -14836 -10958 -1027 7340 8653 2076 -7129 -9712 -3058 7999 14217
924A4217l215r205p871k21P392R371K918n653j0469o373K449P897P182j15o638
$$ 14217 11002 1797 -6074 -6295 1097 10468 13386 7733 -2736 -9109 -6660 1237 8419 8304 1666
939A666q395l884M312Q126N950j161o792o365l19N197O740L438k327n124m525
$$ 1666 -6729 -10613 -6301 1825 7775 6614 -178 -6543 -6862 -1665 5075 8513 6186 1062 -3463
954c463R6M244M946J064l470m246k467K30K225J773o2k189k549j420J70L87K13
$$ -3463 -3367 877 5823 6887 3417 -829 -3296 -3066 -841 932 870 -1319 -3868 -5288 -5118 -4731 -4518
971d518N29J043K44m52r03l53Q40K347K274K064k15k663k031J333M165M048Q21
$$ -4518 -3989 -2946 -2702 -3154 -4057 -4410 -3570 -1223 1051 3115 2900 237 -1794 -461 3704 7752 8573
988H573k666m888k439J209M990L861l1n582o623k031K927O168L363k426o382o228
$$ 8573 5907 1019 -1420 -211 4779 8640 8609 3027 -3596 -5627 -2700 3468 6831 4405 -1977 -8205
1004h205q15N720P020L029m428p238m134K320O816O592Q51n547p220k632M328
$$ -8205 -9020 -3300 3720 6749 2321 -4917 -9051 -6731 85 6677 7528 1981 -5239 -7871 -3543
1019c543Q011L863k534o876n602q53N605O214J323m327p534l599L071O470M593
$$ -3543 4468 8331 5797 -1079 -6681 -7534 -1929 4285 5608 1281 -6253 -9852 -6781 -311 4282
1034D282j646n571m865k25N100O725K511l694n758k440L822O742M537j406n377
$$ 4282 2636 -2935 -7800 -8025 -2925 3800 6311 2617 -3141 -5581 -1759 4983 9520 8114 2737
1049B737m800L97M686N995J487m873p165l042L406N573L515k281o964o593m69
$$ 2737 -2063 -1666 3020 9015 10502 5629 -1536 -4578 -1172 4401 7916 5635 -1329 -7922 -8391
1064h391N125P038J925n369p780l914L389P710N516l06o461o843j518O495Q390
$$ -8391 -3266 3772 5697 328 -7452 -11366 -7977 -267 5249 4943 -1518 -8361 -9879 -3384 5006
1079E006L415l833p577m717K126O500O500O24n597p478l213L975O669M754k467
$$ 5006 8421 4588 -2989 -7706 -5580 920 7420 8044 2447 -5031 -8244 -4269 2400 7154 4687
1094D687o033n994k83N693O275J725l367n948k822K851N795M414q51l961m177
$$ 4687 -1346 -7340 -7623 -1930 4345 6070 2703 -3245 -6067 -3216 2579 6993 6142 2181 -1996
1109a996j03L741M483J188k430m618j836J888L145J335j329l896k812J01K473
$$ -1996 -2099 1642 6125 7313 4883 265 -1571 317 3462 4797 3468 -428 -3240 -3139 -666
1124f66K652j121l679l179L0K961K950L39l033l128p71K281M763K655j787l931
$$ -666 1986 865 -2814 -5993 -5963 -3002 -52 287 -2746 -5874 -6645 -4364 399 3054 1267 -2664
1140b664k910J327N220M335L36l721m647j521L525N351K889k438n700l861M74
$$ -2664 -5574 -4247 973 5308 5644 1923 -2724 -4245 -720 4631 7520 5082 -618 -4479 -4005
1155d005M740N240M75m427n604k858L280O127M031j832n993m883O42N369N671
$$ -4005 735 5975 6450 2023 -3581 -6439 -3159 2968 6999 5167 -826 -5709 -5067 302 5973
1170E973J506m112n872k962L076O331M111k038n759n495j12M974N434J482n026
$$ 5973 7479 3367 -2505 -5467 -2391 3940 8051 6013 254 -5241 -5353 -379 5055 6537 1511
1185A511o894l546L194O263M324k712n911o008K0O695O553J984n183p088l026
$$ 1511 -5383 -8929 -5735 528 4852 2140 -3771 -9779 -9759 -3064 3489 5473 290 -6798 -9824
1200i824M294Q262N441p68p547o655l65P409Q583L042n172q759n195K446R084
$$ -9824 -5530 2732 8173 7405 -142 -6797 -7162 247 8830 11872 6700 -2059 -7254 -4808 4276
1215D276P171q71p632r316l010N565R449N254l436j0258p350L14Q389R252K335
$$ 4276 11447 10576 2944 -6372 -9382 -3817 5632 10886 7450 -2808 -10158 -9844 -1455 7797 10132
1230A0132o024j0117n337M167R436P525q51p843q744k371N705R309M916l769q595
$$ 10132 4108 -6009 -11346 -7179 2257 9782 8931 1088 -7656 -10027 -4322 4987 9903 6134 -2461
1245b461p236Q98P437O751J643n147p851m160L083O890N531r05o111n043q34M445
$$ -2461 -9697 -8799 -1362 5389 7032 1885 -5966 -10126 -7043 -153 5378 4473 -1638 -6681 -7515 -3070
1261c070O237K620k876m400k877J861M848L554J5l469l246J00K797L177M62k494
$$ -3070 3167 5787 2911 -1489 -4366 -2505 2343 5897 5912 2443 -803 -703 2094 5271 5733 3239
1277C239l477j045J713L028O89k481l547j675J281K915K034j566l876k739K08
$$ 3239 -238 -1283 430 3458 4147 1666 -1881 -3556 -2275 640 2674 1108 -2768 -5507 -5299
1292e299L964M125J7l321m333j096K791N137L090j559m985m033M47M748N079J021
$$ -5299 -1335 2790 2807 -514 -4847 -5943 -3152 1985 5075 3516 -1469 -5502 -5055 -307 4772 5793
1308E793l203o134l057K340M890M736p87n263n319j192L970N639L074k167n221
$$ 5793 2590 -3544 -6601 -4261 629 5365 4578 -685 -6004 -7196 -3226 2413 5487 3320 -1901
1323a901l925J290N138M957J093l211m879j808K659M696L131r66l929l970k23
$$ -1901 -5826 -4536 602 5559 6652 3441 -1438 -3246 -587 4109 7240 6274 2345 -1625 -1848
1338a848K615L812Q66k904l653k250P90K575J973j067k940k720Q6J984K455K21
$$ -1848 767 4579 5445 2541 -1112 -3362 -2572 3 1976 909 -2031 -4751 -4665 -2681 -226 -5
1354ej789k696n3K114K603J385j381k196r43J391L015K211n77l332k235Q68K658
$$ -5 -1794 -4490 -4543 -2429 174 1559 178 -2018 -2961 -1570 1445 3656 3079 -253 -2488 -1620 1038
1371A038K636O66k399m490j706J984M233K375j787m013l006J8L570M117J877k717
$$ 1038 3674 4340 1941 -2549 -4255 -2271 1962 4337 2550 -1463 -4469 -4451 -881 3236 5113 2396
1387B396m552k209K114M535L826M7l910l873j166K693M697K302j815n112l712
$$ 2396 -2156 -4365 -2251 2284 6110 6157 2247 -1626 -2792 -99 4598 6900 5085 -27 -3739
1402c739K87L519L715O3l455m283k602J516L766K579p05l849l348K20K759L443
$$ -3739 -3452 67 3782 3845 390 -3893 -6495 -4979 -1213 1366 661 -3188 -6536 -6316 -3557 -114
1418a14J334r36k681j604R42L886K788r0k060k068J57J744K423Q17j581k221j549
$$ -114 1220 284 -2397 -4001 -3059 827 3615 3525 1465 -603 -446 1298 3721 4538 2957 736 -813
1435h13R58J559J140j407k153j668P15J365J665k6k327j603k02K062K381P68j300
$$ -813 145 1704 2844 1437 -716 -2384 -1669 -304 1361 1335 -992 -2595 -2797 -735 1646 2414 1114
1452A114k276l09J103K853J758o38k359k839M53J971K955p5k518l084j764R37
$$ 1114 -1162 -1471 -368 2485 4243 3605 1246 -1593 -1140 831 3786 3711 1193 -1891 -3655 -2718
1468b718K304J593q07l356k940K45K311L092P11j745l012j070J946L327L032n0
$$ -2718 -414 1179 372 -2984 -5924 -5679 -3368 -276 435 -1310 -4322 -5392 -3446 -119 2913 2863
1484B863k474k378O45K239L682J422j636l270j424J040K630K055n58l193k996
$$ 2863 389 -1989 -1344 895 4577 5999 4363 1093 -331 709 3339 5394 4836 1643 -1353
1499a353r70J692K972O64k342l034k009O77K850K245m1k716k398Q4K050L059J860
$$ -1353 -2323 -631 2341 3005 663 -2371 -4380 -3703 -853 1392 1351 -1365 -3763 -3679 -1629 1430 3290
1516C290j145k825j574J053L012K156k60k282l186n45J659K254J026j501l414
$$ 3290 2145 -680 -2254 -1201 1811 3967 3707 1425 -1761 -2306 -647 1607 2633 1132 -2282
1531b282j689k23K438J868p1j836k290o88J724K708J719p80j791q80Q16K621J939
$$ -2282 -3971 -4194 -1756 112 41 -1795 -4085 -4773 -3049 -341 1378 598 -1193 -2073 -1257 1364 3303
1548C303O34j552j301M04P57K161M40o30k287j821J206J173K86q83k448j533n19
$$ 3303 3937 2385 1084 1488 2245 4406 4846 4216 1929 108 1314 2487 2773 1890 -558 -2091 -2610
1565b610J498J200k47k333j466l48J533K385J034q92k466q08P89L225K537k33
$$ -2610 -1112 88 -159 -2492 -3958 -4306 -2773 -388 646 -246 -2712 -3520 -2731 494 3031 2798
1581B798k087k643o02K502L458J237j977l644k757J052K891K918l80l013m286
$$ 2798 711 -1932 -2534 -32 3426 4663 2686 -958 -3715 -2663 228 3146 2766 -247 -4533
1596d533j579K478L798K366q64l487l565O5M130M137J877j911l661k133J166M619
$$ -4533 -6112 -3634 164 2530 1666 -1821 -5386 -5321 -1191 2946 4823 2912 -749 -2882 -1716 2903
1612B903L820L41l314m016j458K404L757K001j888m065l678p52L291K761K59k654
$$ 2903 6723 7064 3750 -266 -1724 680 4437 6438 4550 485 -3193 -3945 -654 2107 2366 -288
1628b88l910k118R57L507K498l33k792k805M0K321L578J651j021k512j186J341
$$ -288 -4198 -6316 -5359 -1852 646 313 -2479 -5284 -5244 -2923 655 2306 1285 -1227 -2413 -1072
1644a072K740J965K83j748k600j66J324K017N62k007k090j281N98J339J375p56
$$ -1072 1668 3633 3916 2168 -432 -598 726 2743 3305 1298 -792 -2073 -1475 -136 1239 483
1660D83j880k016P42J622J806L67j446j761K7J990K238J650p60j875j636Q08K479
$$ 483 -1397 -3413 -2671 -1049 757 1124 -322 -2083 -2056 -66 2172 3822 3062 1187 -449 359 2838
1677B838J910n3k170k486j661J503K260O50j339l253k399n8K046J892J56k321
$$ 2838 4748 4695 2525 39 -1622 -119 2141 2791 1452 -1801 -4200 -4258 -2212 -320 -164 -2485
1693b485k324o95J222K458K089n7k048j438O27K135K294J252p19j651q78P44K026
$$ -2485 -4809 -5504 -4282 -1824 265 208 -1840 -3278 -2651 -516 1778 3030 2311 660 -218 526 2552
1710B552J614m35j419j776o00P70R77N99r38j778j482M11Q58N64k79j014p29L04
$$ 2552 4166 3731 2312 536 -64 706 1683 2282 1344 -434 -1916 -1505 -647 -83 -362 -1376 -2105 -1801
1728a801J322J129n69j63p46O46J396J017L49j247o71m18P58J429M64j392j751
$$ -1801 -479 650 81 -82 -828 -182 1214 2231 2580 1333 662 244 1002 2431 2895 1503 -248
1745b48j450L10J216O30K0k437j838p42R93K296J080j208k119j590J004K826K537
$$ -248 -1698 -1388 -172 458 478 -1959 -3797 -4539 -3546 -1250 -170 -1378 -3497 -5087 -4083 -1257 1280
1762A280O45j215k255n85J573L480K277n76k158k502j79J877K842J013k143k847
$$ 1280 1925 710 -1545 -2130 -557 2923 5200 4624 2466 -36 -215 1662 4504 5517 3374 527
1778E27k670K85K754J985l11k272l498r28J322K710J807j026k458j956L92K371
$$ 527 -2143 -1858 896 2881 2570 298 -3200 -4128 -2806 -96 1711 685 -1773 -3729 -3337 -966
1794i66K380J301j370j892j347J150K490J554K8k114k099m98J147J403N29j074
$$ -966 1414 2715 1345 -547 -1894 -744 1746 3300 3328 1214 -885 -1383 -236 1167 1696 622
1810F22j987j793N66J285Q99l58p66j650QJ044J651L52o22n25j01Q29J945R02
$$ 622 -1365 -3158 -2592 -1307 -408 -766 -1532 -3182 -3174 -2130 -479 -127 -749 -1274 -1375 -546 1399 2301
1828B301k14o67k07L47J406K86J8p87j343p4O75O32j60j320j967o22M24J372O
$$ 2301 2087 1420 1213 1560 2966 3252 3270 2483 1140 1066 1741 2373 2213 893 -1074 -1696 -1272 100 106
1847A06p94j850j090M39J732J823j75j616j558J77J689K097J159o77k065j085
$$ 106 -688 -2538 -3628 -3189 -1457 366 191 -1425 -2983 -2806 -1117 980 2139 1462 -603 -1688
1863a688O37J873J972K16j785k412r39J261K068J080j357k203k413Q60J504K444
$$ -1688 -1051 822 2794 3010 1225 -1187 -2126 -865 1203 2283 926 -1277 -3690 -2830 -1326 1118
1879A118j42j301k112q47J228L096J478k30k084j611N3K230L075O43j578k468
$$ 1118 976 -325 -2437 -3284 -2056 1040 2518 2288 204 -1407 -1354 876 3951 4594 3016 548
1895E48j154J110K220J442p06k364k537n71J873K189P5j911k943j652P18K874
$$ 548 -606 504 2724 4166 3460 1096 -1441 -2012 -139 2050 2125 214 -2729 -4381 -3663 -789
1911g89J422n92k255j987j05J888L023P86r51k338j218J007L278K335K26k664
$$ -789 633 41 -2214 -4201 -4306 -2418 605 1391 440 -1898 -3116 -2109 1169 3504 3730 1066
1927A066k555k18J695K674J060j273k907j903o6L097K053l18k432k520r51J654
$$ 1066 -1489 -1707 -12 2662 3722 2449 -458 -2361 -2427 670 2723 2405 -27 -2547 -3498 -1844
1943a844K654J496p70k380j923L79K706K344N58j341k308j084J524K226J827p23
$$ -1844 810 2306 1536 -844 -2767 -2388 318 2662 3220 1879 -429 -1513 11 2237 4064 3341
1959C341k154k274m03J676K334p2j594k748r69j26K655P06n52k081j494j46J570
$$ 3341 1187 -1087 -1490 186 2520 2448 854 -1894 -2863 -2989 -334 372 -180 -2261 -3755 -3901 -2331
1976b331J978K72q15j665p33J547J978J465o6j287j516P94J651J551K18j530j365
$$ -2331 -353 -81 -896 -2561 -3294 -1747 231 1696 1630 343 -1173 -379 1272 2823 3041 1511 146
1993A46n90J179J666L31m66k595j649N72J687J785n52j917j852o2R69K458Q23
$$ 146 -444 735 2401 2732 2266 -329 -1978 -1406 281 2066 1514 -403 -2255 -2317 -1348 1110 1933
2010A933p52k153j218O04K280K218K6j933j991n52J430K261O90q30k445j857K60
$$ 1933 1181 -972 -2190 -1586 694 2912 2938 1005 -986 -1538 -108 2153 2843 2013 -432 -2289 -2029
2027b029J835J470J85j856k618r92J512J993J383r38j918j949O63J910K058P51
$$ -2029 -194 1276 1461 -395 -3013 -4005 -2493 -500 883 -55 -1973 -3922 -3259 -1349 709 1460
2043A460j014j713q52J502K108J889n31j972j306J97J639J795N15j383k344j202
$$ 1460 446 -1267 -2119 -617 1491 3380 2849 877 -429 -232 1407 3202 3717 2334 -10 -1212
2059a212J076J519J039n72k539j702R3J430K110j06j489j967p91J096K502J445
$$ -1212 -136 1383 2422 1850 -689 -2391 -2298 -868 1242 1136 -353 -2320 -3111 -2015 487 1932
2075A932m54j886j713J93K061K233O18j475k779j096P19K672J570m70k792k077
$$ 1932 1478 -408 -2121 -1928 133 2366 2984 1509 -1270 -2366 -1647 1025 2595 2125 -667 -2744
2091b744o22J988K187J052j767k557j381O87K436K305J43j218k650o62J628K777
$$ -2744 -3366 -1378 809 1861 94 -2463 -3844 -3157 -721 1584 1727 509 -2141 -2803 -1175 1602
2107A602J597m74j579j944O2K022J744Q24o80k385j263K23J540J077j98j425j858
$$ 1602 3199 2725 1146 -798 -736 1286 3030 3854 3174 789 -474 -251 1289 2366 2168 743 -1115
2124a115p31L61J504L48n10p26j089q6K98J154N1L9k92o9K38L94L75P0l01L21
$$ -1115 -1846 -1485 19 367 -143 -869 -1958 -2044 -1746 -592 -541 -502 -794 -863 -625 -231 144 214 -87 234
2144B34J87J48m38o0m21L43N33L30o63q74p07j60J070O82K61q61r47p60R72J542
$$ 234 421 569 131 71 -350 -7 526 856 193 -681 -1388 -1548 -478 204 465 -396 -1343 -2103 -1131 411
2164D11J027J52j054j751K07J124J996J355o92j803j736L29J620J881L31j303
$$ 411 1438 1590 536 -1215 -1008 116 2112 3467 2775 972 -764 -435 1185 3066 3397 2094
2180B094k550j300N82J732J376r3k001k267q10J102J954J462j006k055j520q3
$$ 2094 -456 -1756 -1174 558 1934 1841 -160 -2427 -3237 -2135 -181 1281 275 -1780 -3300 -3383
2196c383J962K213O29r28j988p52J018J869J239J65j407j351k01J015J266P88
$$ -3383 -1421 792 1421 493 -1495 -2247 -1229 640 1879 2044 637 -714 -915 100 1366 2154
2212B154o78j908o93L17R25Q85k97p10j250j1P33J487K07q59p06m61R87J242L80
$$ 2154 1476 -432 -1125 -808 117 1002 705 -5 -1255 -1266 -533 954 1161 302 -404 -865 122 1364 1744
2231A744m01j189l35J81J171R17O7j353j376k14Q76J364N50j416j780j311K93
$$ 1744 1343 154 -181 0 1171 2088 2155 802 -574 -788 88 1452 2002 586 -1194 -2505 -2212
2248b212J857J116n0j754j974p12J877J593J511j005j762j589O32K117J904O16
$$ -2212 -355 761 711 -1043 -3017 -3729 -1852 -259 1252 247 -1515 -3104 -2472 -355 1549 2165
2264B165j392j934n64J176K106J454m78j817j776m19J441K067P94j172j916j373
$$ 2165 773 -1161 -1725 -549 1557 3011 2533 716 -1060 -1479 -38 2029 2823 1651 -265 -1638
$$ [...]
8191c22
##END NTUPLES=NMR FID
##END=
