##TITLE=1H_BAU-1.10
 CDCl3, 8 sc, 
 10.1.2020
##JCAMPDX= 6.0         $$ Bruker NMR JCAMP-DX V2.0
##DATA TYPE= NMR FID
##DATA CLASS= NTUPLES
##ORIGIN= UXNMR, Bruker Analytische Messtechnik GmbH
##OWNER= root
$$ XWIN-NMR		Version 3.5
$$ Fri Jan 10 15:31:34 2020 Russian Standard Time (UT+4h)  she@DPX200
##.OBSERVE FREQUENCY= 200.1315
##.OBSERVE NUCLEUS= ^1H
##.DELAY= (6, 6)
##.ACQUISITION MODE= SIMULTANEOUS
##.ACQUISITION SCHEME= undefined
##.AVERAGES= 8
##.DIGITISER RES= 18
##SPECTROMETER/DATA SYSTEM= spect
##.PULSE SEQUENCE= zg30
##.SOLVENT NAME= CDCl3
##.SHIFT REFERENCE= (INTERNAL, CDCl3, 0, 15.7039)
##AUDIT TRAIL= $$ (NUMBER, WHEN, WHO, WHERE, WHAT)
$$ ##TITLE= Audit trail, XWIN-NMR		Version 3.5
$$ ##JCAMPDX= 5.01
$$ ##ORIGIN= Bruker BioSpin GmbH
$$ ##OWNER= she
$$ F:/spectra/data/she/nmr/H-F/1/audita.txt
$$ ##AUDIT TRAIL=  $$ (NUMBER, WHEN, WHO, WHERE, WHAT)
(   1,<2020-01-10 15:30:24.25 +0400>,<she>,<DPX200>,
      <created by zg, POWCHK disabled, PULCHK disabled
       configuration hash MD5:
       00 E9 B6 7A A2 85 ED C7 34 08 36 98 17 FE 4E 26
       data hash MD5: 16K
       97 25 0F F7 FA A8 5C 5F A1 70 D9 02 20 88 F6 C6>)
$$ ##END=
$$ 
$$ hash MD5
$$ 18 B6 93 A5 CC 46 E5 B0 3A E0 41 E3 C2 74 1A B2
##$RELAX= 
##$RELAX= 
##$RELAX= 
##$RELAX= 
##$RELAX= 
##$RELAX= 
$$ Bruker specific parameters
$$ --------------------------
##$DU= <F:/spectra>
##$EXPNO= 1
##$NAME= <H-F>
##$PROCNO= 1
##$TYPE= <nmr>
##$USER= <she>
##$AMP= (0..31)
100 100 100 100 100 100 100 100 100 100 100 100 100 100 100 100 100 100 
100 100 100 100 100 100 100 100 100 100 100 100 100 100 
##$AQSEQ= 0
##$AQ_mod= 1
##$AUNM= <au_zg>
##$AUTOPOS= <>
##$BF1= 200.13
##$BF2= 200.13
##$BF3= 200.13
##$BF4= 200.13
##$BF5= 200.13
##$BF6= 200.13
##$BF7= 200.13
##$BF8= 200.13
##$BYTORDA= 1
##$CFDGTYP= 0
##$CFRGTYP= 5
##$CHEMSTR= <none>
##$CNST= (0..31)
1 1 145 1 1 1 1 1 1 1 1 1 1 1 1 1 1 1 1 1 1 1 1 1 1 1 1 1 1 1 1 1 
##$CPDPRG= <>
##$CPDPRG1= <>
##$CPDPRG2= <>
##$CPDPRG3= <>
##$CPDPRG4= <mlev>
##$CPDPRG5= <mlev>
##$CPDPRG6= <mlev>
##$CPDPRG7= <mlev>
##$CPDPRG8= <mlev>
##$CPDPRGB= <>
##$CPDPRGT= <>
##$D= (0..31)
0 1.2 0 0 0 0 0 0 0 0.06 0 0.03 0 0 0 0 0.0002 0 0 0 0 0 0 0 0 0 0 0 0 
0 0 0 
##$DATE= 1578655823
##$DBL= (0..7)
120 120 120 120 120 120 120 120 
##$DBP= (0..7)
150 150 150 150 150 150 150 150 
##$DBP07= 0
##$DBPNAM0= <>
##$DBPNAM1= <>
##$DBPNAM2= <>
##$DBPNAM3= <>
##$DBPNAM4= <>
##$DBPNAM5= <>
##$DBPNAM6= <>
##$DBPNAM7= <>
##$DBPOAL= (0..7)
0.5 0.5 0.5 0.5 0.5 0.5 0.5 0.5 
##$DBPOFFS= (0..7)
0 0 0 0 0 0 0 0 
##$DE= 6
##$DECBNUC= <off>
##$DECIM= 24
##$DECNUC= <off>
##$DECSTAT= 4
##$DIGMOD= 1
##$DIGTYP= 9
##$DL= (0..7)
0 120 120 120 120 120 120 120 
##$DP= (0..7)
150 150 150 150 150 150 150 150 
##$DP07= 0
##$DPNAME0= <>
##$DPNAME1= <>
##$DPNAME2= <>
##$DPNAME3= <>
##$DPNAME4= <>
##$DPNAME5= <>
##$DPNAME6= <>
##$DPNAME7= <>
##$DPOAL= (0..7)
0.5 0.5 0.5 0.5 0.5 0.5 0.5 0.5 
##$DPOFFS= (0..7)
0 0 0 0 0 0 0 0 
##$DQDMODE= 0
##$DR= 18
##$DS= 0
##$DSLIST= <SSSSSSSSSSSSSSS>
$$ [...]
##$SUBNAM2= <"">
##$SUBNAM3= <"">
##$SUBNAM4= <"">
##$SUBNAM5= <"">
##$SUBNAM6= <"">
##$SUBNAM7= <"">
##$SUBNAM8= <"">
##$SUBNAM9= <"">
##$SW= 24.9337058887773
##$SWIBOX= (0..15)
0 0 2 0 0 0 0 0 0 0 0 0 0 0 0 0 
##$SW_h= 4990.01996007984
##$TD= 16384
##$TD0= 1
##$TE= 0
##$TE2= 300
##$TE3= 300
##$TEG= 300
##$TL= (0..7)
0 120 120 120 120 120 120 120 
##$TP= (0..7)
150 150 150 150 150 150 150 150 
##$TP07= 0
##$TPNAME0= <>
##$TPNAME1= <>
##$TPNAME2= <>
##$TPNAME3= <>
##$TPNAME4= <>
##$TPNAME5= <>
##$TPNAME6= <>
##$TPNAME7= <>
##$TPOAL= (0..7)
0.5 0.5 0.5 0.5 0.5 0.5 0.5 0.5 
##$TPOFFS= (0..7)
0 0 0 0 0 0 0 0 
##$TUNHIN= 0
##$TUNHOUT= 0
##$TUNXOUT= 0
##$USERA1= <user>
##$USERA2= <user>
##$USERA3= <user>
##$USERA4= <user>
##$USERA5= <user>
##$V9= 5
##$VALIST= <valist>
##$VCLIST= <CCCCCCCCCCCCCCC>
##$VD= 0
##$VDLIST= <DDDDDDDDDDDDDDD>
##$VPLIST= <PPPPPPPPPPPPPPP>
##$VTLIST= <TTTTTTTTTTTTTTT>
##$WBST= 1024
##$WBSW= 4
##$XGAIN= (0..3)
0 0 0 0 
##$XL= 0
##$YL= 0
##$YMAX_a= 280897
##$YMIN_a= -315009
##$ZGOPTNS= <>
##$ZL1= 120
##$ZL2= 120
##$ZL3= 120
##$ZL4= 120
##$ABSF1= 10
##$ABSF2= 0
##$ABSG= 5
##$ABSL= 3
##$ALPHA= 0
##$AQORDER= 0
##$ASSFAC= 0
##$ASSFACI= 0
##$ASSFACX= 0
##$ASSWID= 0
##$AUNMP= <proc_1d>
##$AZFE= 0.1
##$AZFW= 0.1
##$BCFW= 1
##$BC_mod= 2
##$BYTORDP= 1
##$COROFFS= 0
##$CY= 11.3945322036743
##$DATMOD= 1
##$DC= 2
##$DFILT= <>
##$DTYPP= 0
##$F1P= 16.9975609425685
##$F2P= -3.02152046262296
##$FCOR= 0.5
##$FTSIZE= 0
##$FT_mod= 4
##$GAMMA= 1
##$GB= 0.15
##$INTBC= 1
##$INTSCL= 1
##$ISEN= 128
##$LB= 0.24
##$LEV0= 0
##$LPBIN= 0
##$MAXI= 10000
##$MC2= 0
##$MEAN= 0
##$ME_mod= 0
##$MI= 1.114404
##$NCOEF= 0
##$NC_proc= 0
##$NLEV= 6
##$NOISF1= 3.799351
##$NOISF2= 2.8
##$NSP= 1
##$NTH_PI= 0
##$NZP= 0
##$OFFSET= 15.70392
##$PC= 1
##$PHC0= -9946.783
##$PHC1= 17.8008
##$PH_mod= 1
##$PKNL= yes
##$PPARMOD= 0
##$PSCAL= 0
##$PSIGN= 0
##$REVERSE= no
##$SF= 200.130013532006
##$SI= 16384
##$SIGF1= 3
##$SIGF2= 2
##$SINO= 400
##$SIOLD= 16384
##$SREGLST= <1H.CDCl3>
##$SSB= 0
##$STSI= 0
##$STSR= 0
##$SW_p= 3612.71676300578
##$SYMM= 0
##$S_DEV= 0
##$TDeff= 0
##$TDoff= 0
##$TI= <>
##$TILT= no
##$TM1= 0
##$TM2= 0
##$TOPLEV= 0
##$USERP1= <user>
##$USERP2= <user>
##$USERP3= <user>
##$USERP4= <user>
##$USERP5= <user>
##$WDW= 1
##$XDIM= 8192
##$YMAX_p= 0
##$YMIN_p= 0
$$ End of Bruker specific parameters
$$ ---------------------------------
##NTUPLES= NMR FID
##VAR_NAME=  TIME,          FID/REAL,        FID/IMAG
##SYMBOL=    X,             R,               I
##VAR_TYPE=  INDEPENDENT,   DEPENDENT,       DEPENDENT
##VAR_FORM=  AFFN,          ASDF,            ASDF
##VAR_DIM=   8192,          8192,            8192
##UNITS=     SECONDS,       ARBITRARY UNITS, ARBITRARY UNITS
##FACTOR=    0.0002004,     1,               1
##FIRST=     0,             0,               0
##LAST=      1.6414764,     0,               0
##MIN=       0,             -315009,         0
##MAX=       1.6414764,     280897,          0
$$ Real data points
##PAGE= N=1
##DATA TABLE= (X++(R..R)), XYDATA
$$ [...]
$$ plain form
1529 -1363 3524 4411 1224 -2532 -3280 -1185 1061 1156 -197 -789 40 994 266 -1556 -2395 -916 1716
1546 1716 2834 923 -2278 -3657 -1384 2250 3426 963 -2656 -3611 -1011 2624 3350 467 -3289
1561 -3289 -3659 -217 3692 3696 -365 -4293 -4140 208 4698 4668 -100 -5173 -5441 -423 5158 6002 1373
1578 1373 -4456 -6003 -2221 3546 5900 3065 -2177 -4946 -3094 1194 3989 3086 -192 -2704 -2351
1593 -2351 191 2202 1907 -47 -1524 -1071 734 1713 1035 -685 -1568 -714 1178 2035 912 -974 -1548
1610 -1548 -334 1152 1429 349 -696 -430 636 895 -242 -1447 -732 1633 3080 1360 -2436 -4402
1626 -4402 -1920 3296 6056 3143 -3324 -7103 -3990 3263 7635 4691 -2698 -7425 -4827 2290 6711
1641 6711 4323 -2174 -6039 -3629 2295 5345 2635 -2797 -5063 -2153 2786 4669 1694 -3066 -4778
$$ packed form
1529a363M887Q87l187l756p48K095K246R5j353n92Q29R54p28j822q39J479K632
1546A716J118j911l201j379K273L634J176k463l619r55K600L635P26k883l756
1561c289l70L442L909Mm061l928J53M348M490l0m768n073k68N018N581Q44m629
1578A373n829j547L782N767K354k835n242k769J852M288K795r03l278k512L53
1593b351K542K011k95j954j477M53J805R79o78j720q83Q54J892Q57j123j886n74
1610a548J214J486K77j080j045K66J066K59j137j205P15K365J447j720l796j966
1626d402K482N216K760k913o467l779L113P253M372k944p389m727K598P117M421
1641F711k388o497l865K410N924L050k710n432k266K910M939J883k975m760j712
$$ plain form
1656 -4778 -1889 2607 4221 1750 -2233 -3961 -2217 1060 2944 1906 -734 -2392 -1988 -295 1091
1671 1091 1165 494 -354 -672 -814 -873 -629 154 1102 1487 377 -1555 -2634 -1712 947 2983 2433 -521
1689 -521 -3344 -3210 -215 2939 3383 463 -2901 -3332 -511 2701 3092 182 -3022 -3182 230 3597
1705 3597 3442 -418 -4165 -3843 441 4741 4699 -128 -4905 -5200 -405 5024 5803 1140 -4441 -5733
1721 -5733 -1498 4033 5675 2093 -2987 -4605 -1692 2538 3935 1408 -1805 -2342 -131 1958 1543
1736 1543 -742 -1973 -492 2064 2665 346 -2479 -2645 151 2923 2789 -65 -2468 -1917 817 2550
1752 2550 1354 -1512 -2423 -185 2596 2766 -238 -3418 -3214 686 4177 3825 -431 -4489 -4265 24
1768 24 4309 4489 532 -3912 -4630 -1309 3041 4227 1731 -2176 -3958 -2188 1218 3078 2071 -735
$$ packed form
1656d778K889M496J614k471l983j728J744L277J884j038k640j658M04J693J386
1671A091P4o71q48l18j42n9K44P83R48L85j110j932j079R22K659K036n50k954
1689e21k823J34K995L154M44k920l364m31K821L212L91k910l204j60L412L367
1705C597j55l860l747L22M284M300m2m827m777k95M795N429P79m663n581j292
1721e733M235N531J642l582n080j618K913M230J397k527l213n37K211K089m15
1736A543k285j231J481K556O01k319k825j66K796K772j34k854k403N51K734J733
1752B550j196k866r11K238K781J70l004l180K04L900L491l52m256m058K24M289
1768B4M285J80l957m444p18L321M350J186k496l907j782J770L406J860j007k806
$$ plain form
1784 -735 -2677 -2016 245 1926 1396 -727 -2120 -1340 803 1937 934 -1360 -2581 -1304 1349 2634
1800 2634 1280 -1422 -2830 -1590 861 2164 1185 -790 -1680 -859 376 491 -281 -778 195 1326 898
1817 898 -1134 -2542 -1598 1334 3488 2286 -1582 -4251 -3049 1261 4561 3540 -1097 -4657 -3674 776
1833 776 4371 3547 -678 -4013 -3069 949 3839 2656 -1333 -3763 -2076 1976 4178 1946 -2184 -4180
1849 -4180 -1999 2423 4509 2409 -1871 -4091 -2282 1492 3794 2488 -660 -2591 -1748 535 1766
1864 1766 1156 -30 -583 -26 512 192 -643 -662 526 1688 1350 -348 -1923 -1574 505 2310 2157 -87
1882 -87 -2117 -2136 12 2191 2281 294 -1877 -2091 -132 1926 2044 30 -2053 -2031 262 2455 2294 -377
1900 -377 -3068 -3019 114 3465 3681 216 -3760 -4410 -859 3590 4597 1320 -3389 -4842 -1780 2753
$$ packed form
1784g35j942O61K261J681n30k123j393P80K143J134j003k294j221J277K653J285
1800B634j354k702j408J240K451J303r79j975q90Q21J235J15p72m97R73J131m28
1817H98k032j408R44K932K154j202l868k669J202M310L300j021m637l560R83M450
1833G76L595q24m225l335R44M018K890j183l989k430J687M052K202k232m130j996
1849d180K181M422K086k100m280k220J809L774K302j306l148j931Q43K283J231
1864A766o10j186n53N57N38l20q35j9J188J162l38j698j575L49K079J805j53k244
1882h7k030j9K148K179R0j987k171k14J959K058J18k014k083K2K293K193j61k671
1900c77k691M9L133L351K16l465l976o50L551M449J007l277m709j453L062M533
$$ plain form
1916 2753 4344 1665 -2509 -4027 -1665 2049 3155 811 -2116 -2647 -560 1804 1824 -393 -2185 -1528
1932 -1528 802 2061 896 -1485 -2412 -875 1404 2034 431 -1654 -2029 -265 1424 1304 -408 -1645
1948 -1645 -804 1007 1714 213 -1964 -2407 -191 2643 2993 272 -3073 -3700 -902 2936 4063 1407
1964 1407 -2598 -4063 -1834 2085 4004 2080 -1618 -3510 -1971 1395 3194 1901 -1106 -2737 -1458
1979 -1458 1257 2735 1364 -1134 -2419 -994 1485 2587 1169 -1322 -2374 -989 1547 2668 1313
1994 1313 -1026 -2243 -1294 926 2170 1423 -333 -1327 -975 257 885 553 -53 -8 468 544 -285 -1184
2012 -1184 -874 568 1905 1656 -393 -2307 -2076 282 2614 2480 -33 -2516 -2527 13 2573 2547 -88
2029 -88 -2663 -2440 244 2619 2112 -578 -2798 -2117 793 2971 1872 -1254 -3253 -2151 1231 3318
$$ packed form
1916B753J591k679m174j518K362L714J106k344k927n31K087K364K0k217j792O57
1932a528K330J259j165k381r27J537K279O30j603k085l75J764J689j20j712j237
1948a645Q41J811P07j501k177m43K216K834L50k721l345o27K798L838J127k656
1964A407m005j465K229L919J919j924l698j892J539L366J799j293l007j631J279
1979a458K715J478j371k498j285J425K479J102j418k491j052J385K536J121j355
1994A313k339j217R49K220J244p47j756r94L52J232O28l32o06M5M76P6q29q99
2012a184L10J442J337k49k049j914K31K358K332j34k513k483j1K540K560k6k635
2029h8k575K23K684K375n07k690k220O81K910K178j099l126j999J102L382K087
$$ plain form
2045 3318 2105 -1314 -3593 -2534 777 3121 2434 -491 -2817 -2468 -27 1851 1732 106 -1338 -1207
2061 -1207 -145 533 173 -513 -543 171 773 334 -819 -1372 -745 720 1435 799 -846 -1674 -1001 738
2079 738 1531 687 -819 -1524 -632 895 1358 240 -1272 -1560 -60 1725 1696 -170 -2095 -2051 249 2638
2097 2638 2599 20 -2760 -3060 -260 2875 3405 806 -2489 -3330 -1080 2206 3220 1310 -1565 -2620
2113 -2620 -932 1509 2230 701 -1196 -1557 -39 1487 1478 -43 -1614 -1225 554 1966 1411 -580 -1765
2130 -1765 -1170 742 1899 1259 -462 -1546 -873 629 1461 582 -603 -901 20 951 770 -444 -1282
2147 -1282 -636 1110 1979 813 -1433 -2452 -1020 1635 2981 1564 -1405 -3264 -2076 1071 3117
2162 3117 2169 -846 -2914 -2135 501 2361 1719 -677 -2279 -1441 688 1986 993 -1257 -2234 -915
$$ packed form
2045C318j213l419k279J059L311K344o87k925k326L49K441J878j19j626j444J31
2061a207J062O78l60o86l0P14O02m39j153n53O27J465P15o36j645q28O73J739
2079G38P93q44j506p05Q92J527M63j118j512k88J500J785k9j866j925M4K300K389
2097B638l9k579k780l00K800L135N30k599l295q41K250L286J014j910k875j055
2113b620J688K441P21j529j897l61J518J526rj521j571L89J779J412n55j991j185
2130a765N95J912J157o40j721j084O73J502Q32q79j185k98R21R31j81j214q38
2147a282O46J746Q69j166k246j019J432K655J346j417k969j859J188L147K046
2162C117r48l015k068P79K636J860o42k396j602Q38K129J298r93k250r77J319
$$ plain form
2178 -915 1283 2308 819 -1570 -2659 -1240 1287 2434 1187 -1269 -2492 -1494 748 1953 1227 -611
2194 -611 -1713 -1127 298 1006 489 -445 -711 -80 496 181 -670 -1110 -256 1080 1478 320 -1526 -2023
2212 -2023 -530 1451 2107 744 -1394 -2187 -932 1217 1970 605 -1254 -1723 -247 1368 1570 -70
2228 -70 -1628 -1563 342 2051 1754 -423 -2307 -1901 535 2510 2192 -196 -2316 -2214 35 2265 2382
2245 2382 338 -1882 -1984 -328 1515 1779 515 -940 -1173 -177 819 814 -37 -666 -174 707 931 72
2263 72 -915 -1007 44 1356 1411 128 -1202 -1299 -86 1203 1215 214 -941 -872 127 966 554 -462 -984
2282 -984 -254 1002 1350 164 -1398 -1713 -326 1617 2084 498 -1710 -2441 -883 1583 2516 1088 -1420
2299 -1420 -2535 -1341 1024 2265 1236 -867 -2028 -1140 648 1531 707 -890 -1399 -476 969 1281
$$ packed form
2178i15K198J025j489k389j089J419K527J147j247k456j223R98K242J205p26j838
2194f11j102N86J425P08n17r34k66O31N76l15q51m40Q54J336L98j158j846m97
2212b023J493J981O56j363k138p93J255K149P53j365j859m69J476J615K02j640
2228g0j558O5J905J709k97k177j884M06K436J975l18k388k120J02K249K230J17
2245B382k044k220j02J656J843K64j264j455k33R96R96nq51o29M92Q81K24q59
2263G2r87r2J051J312N5j283j330r7J213J289J2j001j155O9R99Q39m12j016n22
2282i84P30J256L48j186j562l15J387J943M67j586k208p31J558K466R33j428k508
2299a420j115J194K365J241j029k103j161Q88J788Q83q24j597n09R23J445L12
$$ plain form
2315 1281 -10 -1458 -1518 31 1514 1464 -204 -1743 -1695 -118 1468 1418 8 -1393 -1315 -30 1005
2332 1005 714 -400 -838 -310 619 763 -221 -1176 -1041 482 1556 1100 -669 -1968 -1334 620 2118
2349 2118 1567 -578 -2197 -1721 391 2129 1664 -270 -1864 -1542 306 1694 1420 -187 -1476 -1124
2365 -1124 495 1593 957 -688 -1526 -756 942 1893 1059 -907 -2041 -1175 959 2185 1513 -529 -1905
2382 -1905 -1399 404 1768 1425 -73 -1199 -887 299 1027 635 -261 -673 -42 784 869 -134 -999 -697
2400 -697 490 1473 929 -592 -1550 -936 646 1736 1091 -606 -1622 -1016 646 1692 943 -721 -1419
2417 -1419 -671 877 1404 336 -1199 -1499 -137 1520 1664 10 -1862 -1947 -93 1938 2139 155 -1909
2434 -1909 -2293 -553 1647 2068 429 -1562 -2027 -512 1144 1427 180 -1247 -1262 -76 990 816 -381
$$ packed form
2315A281j291j448o0J549J483n0j668j539M8J577J586n0j410j401P8J285J035
2332A005k91j114m38N28R29J44r84r55J35J523J074m56j769j299O34J954J498
2349B118n51k145j619M76K112J738m65j934j594L22J848J388k74j607j289L52
2365a124J619J098o36j645q38P70J698R51q34j966j134Q66K134J226o72k042j376
2382a905N06J803J364l43j498j126L12J186P28l92q96m12O31Q26Q5j003q65L02
2400f97J187R83n44j521r58O14J582J090o45j697j016O06J662J046p49j664o98
2417a419P48J548N27j068j535l00J362J657J44j654j872q5J854K031K01j984k064
2434a909l84J740K200M21j639j991m65J515J656K83j247j427j5J186J066j74j197
$$ plain form
2451 -381 -1214 -793 357 1072 430 -750 -1328 -490 679 1144 357 -807 -1228 -425 686 1008 270 -634
2469 -634 -867 -259 496 491 -101 -608 -366 311 742 255 -607 -1042 -422 786 1361 714 -752 -1595 -898 608
2489 608 1719 1212 -398 -1600 -1215 296 1527 1222 -167 -1296 -1025 337 1348 919 -369 -1216 -613
2506 -613 776 1384 551 -834 -1364 -322 1187 1567 414 -1112 -1394 -179 1256 1505 428 -1063 -1217
2523 -1217 -134 974 1028 86 -680 -521 373 807 260 -705 -879 110 1097 1075 -36 -1275 -1321 91 1510
2542 1510 1495 53 -1426 -1436 -42 1344 1377 30 -1264 -1220 35 1168 1014 -245 -1262 -906 315
2559 315 1208 775 -594 -1356 -825 533 1375 764 -756 -1542 -949 510 1371 889 -506 -1384 -1042 204
2577 204 1084 860 -161 -973 -852 -16 585 429 -195 -659 -220 287 467 -75 -740 -684 78 870 779 -201
$$ packed form
2451c81q33M21J150P15o42j180n78Q38J169M65p87j164m21Q03J111L22p38r04
2469f34k33O08P55nn92n07K42O77M31m87q62m35O20J208N75o47j466q43O97J506
2489F08J111n07j610j202L85J511J231l05j389j129K71J362J011m29j288q47O03
2506f13J389O08q33j385n30J042J509L80j153j526k82J215J435K49j077j491j54
2523a217J083J108N4r42p66J59Q94M34n47r65j74R89R87k2j111j239m6J412J419
2542A510j5j442j479j0J394J386L3j347j294M4J255J133j54j259j017L56J221
2559C15Q93m33j369p62N31J358Q42o11j520p86N93J459Q61m82j395q78L42J246
2577B04Q80k24j021q12J21Q36O01j56o24m64M39N07J80n42o65N6P62P92r1r80
$$ plain form
2597 -201 -1144 -1026 50 1025 1097 -98 -1214 -1105 112 1110 951 -249 -1223 -889 424 1223 716 -668
2615 -668 -1387 -524 998 1594 546 -1078 -1732 -504 1396 1975 583 -1344 -1981 -592 1355 2038 768
2632 768 -1054 -1654 -527 1019 1432 520 -863 -974 -55 942 859 -82 -909 -573 451 1122 653 -419
2650 -419 -951 -537 606 1145 629 -372 -932 -373 440 747 398 -333 -570 -149 511 569 25 -544 -484 267
2670 267 750 507 -340 -895 -612 419 1171 757 -432 -1310 -994 228 1283 1106 -135 -1317 -1265 -39
2688 -39 1163 1207 119 -1057 -1087 -66 944 930 -157 -1016 -840 206 1022 705 -478 -1214 -818 389
2706 389 1214 712 -552 -1306 -871 351 1126 705 -497 -1092 -594 293 742 319 -324 -685 -185 384 351
2725 351 -278 -584 -235 456 786 195 -770 -996 -174 854 1136 210 -1007 -1273 -290 962 1236 249 -871
$$ packed form
2597b01r43J18J076R75P2j195j116J09J217R98j59j200r74L34J313P99n07j384
2615f68p19Q63J522N96j048j624o54J228J900N79j392j927o37J389J947O83j270
2632G68j822o00J127J546M13r12j383j11R19R97q3r41q27L36J024O71m69j072
2650d19n32M14J143N39n16j001n60N59Q13L07l49p31k37M21O60N8n44n69O0P51
2670B67M83k43q47n55K83J031P52m14j189q78L16J222J055j77j241j182N2J226
2688c9J202M4j088j176l0J021J010j4j087q59J76J046Q16l17j183p36L96J207
2706C89Q25n02j264p54M35J222P75m21j202n95M98Q87M49m23o43l61N00N69l3
2725C51o29l06L49O91L30n91r65k26Q22J028K82r26j217k66R83J252K74r87j120
$$ plain form
2744 -871 -1066 -184 890 955 8 -943 -916 229 1158 820 -294 -1203 -870 439 1327 1115 -134 -1233 -977
2763 -977 92 1189 1104 100 -918 -965 -117 806 966 278 -608 -676 -129 571 664 133 -299 -320 116 452
2783 452 290 -181 -406 9 537 530 48 -527 -537 19 658 698 133 -595 -616 76 784 566 -188 -670 -465 415
2805 415 898 443 -562 -1072 -441 775 1209 480 -924 -1452 -619 916 1545 552 -935 -1644 -781 830
2823 830 1604 765 -789 -1483 -746 597 1263 619 -631 -1225 -603 483 884 355 -628 -975 -229 612 821
2842 821 62 -828 -890 -94 688 643 -49 -675 -755 -113 571 488 -5 -488 -341 72 310 29 -404 -426 52 519
2864 519 533 -203 -769 -563 226 891 702 -343 -1079 -861 257 1139 904 -135 -1043 -991 76 1106 1037
2883 1037 -36 -1025 -957 66 1046 977 -3 -931 -877 202 1042 969 -187 -1065 -783 237 1159 993 -136
$$ packed form
2744h71j95Q82J074O5r47r51K7J145R29l38j114r09L33J309Q88k12j249j099K56
2763i77J069J097q5j004j018m7Q48R23J60o88q86o8N47P00R3n31m32k1M36L36
2783D52j62m71k25M15N28pm82n75j0N56O39M0n65p28k1O92P08k18p54m82K05Q80
2805D15M83m55j005n10O31J216M34p29j404n28Q33J535O29r93j487p09Q63J611
2823H30P74q39j554o94P37J343O66o44j250n94O22J086M01n29r83l47P46Q41K09
2842H21p59q90o2P96P82m5o92o26q0O42O84q3m93m83J47M13K38k81m33k2M78M67
2864E19J4p36n66K06P89O65j89j045p36K18J118Q82k35j039r08N2J067J030o9
2883A037j073r89O8J023R80o9r80r28N4J079Q40p3j156q78K82J020R22j66j129
$$ plain form
2902 -136 -1016 -897 146 1038 953 41 -788 -740 21 677 708 46 -505 -411 112 503 208 -178 -328 97 459
2923 459 334 -136 -476 -260 354 639 256 -431 -671 -235 496 788 252 -592 -826 -223 572 807 169 -640
2943 -640 -819 -150 712 808 54 -932 -974 -56 942 950 77 -1015 -1259 -255 920 1159 244 -899 -1213 -485
2963 -485 653 1048 419 -557 -935 -455 465 722 248 -421 -641 -272 340 433 22 -434 -421 2 355 298 -169
2984 -169 -413 -239 150 330 155 -311 -399 -102 301 258 -87 -403 -278 216 363 173 -403 -603 -188 526 763
3005 763 217 -635 -916 -350 691 1122 525 -635 -1104 -592 617 1245 758 -495 -1130 -625 498 1097
3023 1097 684 -386 -1013 -580 530 1061 559 -405 -869 -425 507 915 474 -449 -789 -392 500 927 355
3042 355 -425 -688 -239 439 622 309 -219 -423 -99 267 303 49 -189 13 243 215 -71 -441 -262 162 614
$$ packed form
2902a36q80J19J043Q92q5r12q29M8P61O56L1o62n51R4N23L91k95l86j50M25L62
2923D59j25m70l40K16O14K85l83o87k40M36P31K92n36q44k34O03P95K35o38q09
2943f40j79O69Q62R6p54r86m2R18R98Qq73j092k44J004J175K39r15j143l14P28
2963d85J138L95o29r76l78M80R20K57m74o69k20L69O12R3m11m56J3M23L53n7m67
2984a69k44J74L89J80j75m66q8K97M03m3l45l16J25M94J47j90n76k00M15P14K37
3005G63n46q52k81N66J041M31n97j160m69N12J209O28m87j253o35N05J123N99
3023A097m13j070o27M33J110N31n02r64m64M44R32M08m41r23l40L97Q92M27n72
3042C55p80k63M49O78J83l13n28k04L24L66L6k54k38K02K30k8k86l70J79M24M52
$$ plain form
3063 614 487 -115 -727 -585 164 821 666 -113 -898 -790 10 884 700 -78 -924 -811 73 861 709 -166
3083 -166 -960 -868 156 941 867 -230 -1039 -908 85 977 913 -131 -1046 -1005 0 952 914 26 -906 -965 -152
3104 -152 639 795 76 -569 -656 -182 367 420 -53 -379 -231 134 253 47 -270 -328 -33 319 261 -94 -418
3125 -418 -278 91 411 238 -247 -462 -174 396 528 163 -397 -565 -132 545 718 85 -671 -759 -109 798
3145 798 842 122 -763 -950 -194 800 1103 300 -731 -1123 -440 696 1140 516 -475 -917 -427 400 841 467
3165 467 -346 -590 -184 405 627 237 -286 -501 -117 373 494 124 -290 -434 -79 354 343 104 -205 -253 -36
3186 -36 168 168 -17 -93 44 137 120 -85 -291 11 364 425 200 -337 -573 -244 415 742 317 -465 -930 -527
3208 -527 377 858 567 -367 -899 -621 238 881 455 -346 -847 -591 316 823 439 -385 -870 -483 303 793
$$ packed form
3063F14j27o02o12J42P49O57j55p79p85J08Q00Q74j84p78q46J13Q84P88j52q75
3083a66p94R2J024P85p4j097q09J31R93Q92o4j044r15M1J005R52l8q88r32n9Q13
3104a52P91J56p19o45q7M74N49N3m73l26J48L65J19k06l17n8K95L52n8l55l24
3125d18J40L69L20j73m85k15K88N70J32l65n60j68M33O77J73o33p56q8O50R07
3145G98M4p20q85j87P56R94L03q03j031l92O83J136M44o24r91m42M90Q27M41l74
3165D67q13k44M06N89K22l90n23k15L84M90J21l70m14j44L55M33j1k39l09m8K17
3186c6K04%j85p6J37R3j7k05k06L02L53O1k25n37k36L29O59L27m25p82m65M03
3208e27R04M81k91r34n32K78Q59O43m26q01n01K56R07N07l84q24m85L87P86M90
$$ plain form
3228 793 501 -450 -877 -515 325 745 463 -337 -754 -466 144 585 379 -219 -483 -270 112 312 178 -46
3248 -46 -225 -73 101 -24 -178 -137 21 267 218 -100 -437 -358 88 494 384 -122 -466 -474 38 585 538 -111
3270 -111 -607 -496 159 665 503 -172 -647 -560 236 815 618 -180 -807 -675 130 909 751 -6 -826 -762 30
3291 30 796 823 124 -638 -764 -134 617 828 201 -486 -585 -140 466 548 77 -312 -378 74 371 337 -106 -298
3313 -298 -172 253 440 161 -200 -326 -129 243 345 40 -353 -239 166 366 128 -248 -423 -107 392 542
3333 542 36 -543 -633 -95 572 754 91 -617 -792 -201 654 864 233 -642 -906 -373 559 850 333 -525
3353 -525 -853 -388 420 722 283 -452 -694 -422 274 594 254 -329 -568 -254 223 434 159 -353 -536 -353
3373 -353 180 494 212 -176 -440 -250 72 275 151 -32 -127 -136 -28 -30 -62 -56 121 187 77 -210 -325 -193 177
$$ packed form
3228G93k92r51m27L62Q40M20k82q00m17K88O10M41k06n98k64K13L82K00j34k24
3248d6j79J52J74j25j54M1J58K46m9l18l37P9M46M06j10n06l44qN12N47m7o49
3270a11m96J11O55N06j62o75m75Q7P96N79j97p98o27J32Q05P79j58p57q20O4P92
3291C0P66K7o99p62j26O30P51K11o27o87r9M45O06Q2m71l89o6M52K97l4m43j92
3313b98J26M25J87k79l61j26J97L72J02l05l93J14M05K00k38l76j75L16M99J50
3333E42n06n79r0N38O67J82o63p08j75N91Q55K10o31q75k64N33R32K91n17q58
3353e25l28M65Q08L02m39p35k42K72O96L20l40n83k39L14M77K11k75n12j83J83
3373c53N33L14k82l88k64J90L22K03j24j83r5rJ08kl2OJ77O6j10k87j15J32L70
$$ plain form
3396 177 503 262 -199 -516 -310 166 607 478 -161 -597 -394 197 663 505 -108 -611 -441 199 684 499
3416 499 -191 -700 -331 248 780 555 -219 -725 -548 297 773 589 -77 -690 -563 103 612 532 68 -463
3436 -463 -481 8 348 319 32 -130 -167 76 184 150 -122 -95 99 149 39 -130 -144 9 230 269 -49 -284 -304
3459 -304 14 299 228 -115 -390 -295 82 401 280 -138 -505 -329 179 528 344 -220 -671 -494 128 649 527
3480 527 -65 -717 -707 -67 554 681 153 -558 -726 -217 437 564 136 -468 -596 -206 338 512 122 -362
3500 -362 -500 -154 251 394 -9 -325 -410 -35 260 299 -60 -302 -261 19 269 133 -132 -153 -84 92 117 3
3522 3 -106 -16 228 262 37 -371 -374 -69 488 540 176 -437 -599 -139 475 667 288 -354 -669 -241 432 641
3544 641 244 -311 -602 -285 384 651 208 -438 -586 -249 412 605 262 -339 -527 -170 404 603 348 -275
$$ packed form
3396A77L26k41m61l17K06M76M41j29o39m36K03N91M66j58o13n03J70O40M85j85
3416D99o90n09L69N79N32k25p74n06J77Q45M76j84o66o13J27O66N09q0m64n31
3436d63j8M89L40k9k87j62l7K43J08l4k72K7J94N0j10j69j4J53K21L9l18k35k0
3459c04L18K85p1l43k75R5L77L19j21m18l67J76N08L49j84n64m51J77O22N21j22
3480E27n92o52J0O40O21J27n28p11j68N09O54J27m28o04j28L90N44J74l90m84
3500c62j38L46M05J43m03l16q5L75K95L9l59k42M1K80K50j36k65k1O9J76K5j14
3522Cj09R0K44L4k25m08lL05N57N2l64o13j62M60O14J92l79o42l15M28O73K09
3544F41l97n55k91L17O69K67m43o46j48L37O61J93l43o01j88L57N74J99k55o23
$$ plain form
3564 -275 -517 -220 250 624 238 -147 -372 -215 145 379 304 -23 -228 -161 -48 138 121 -8 -16 48 19 -68 -91
3587 -91 -87 -11 181 217 -22 -254 -217 36 291 256 -51 -325 -319 -18 338 267 -115 -463 -340 156 508 343 -186
3610 -186 -581 -435 173 604 452 -236 -695 -581 113 619 491 -124 -626 -529 -15 519 524 -19 -489 -523 -28
3631 -28 359 404 55 -350 -294 -15 289 180 -90 -214 -158 84 209 146 -108 -180 -70 74 98 -68 -110 -60 72
3654 72 73 54 -121 -89 65 246 166 -67 -294 -257 111 330 364 -119 -373 -325 52 482 338 -31 -412 -451 6
3677 6 541 483 115 -452 -451 -49 403 463 181 -278 -420 -17 389 422 130 -256 -373 -66 396 406 73 -326 -329
3700 -329 -53 294 360 98 -178 -278 -81 221 234 20 -123 -119 -37 105 97 -86 -54 44 89 57 -98 -179 -101 152
3724 152 309 49 -217 -279 -110 280 440 107 -344 -468 -252 229 470 174 -276 -466 -253 275 399 80
$$ packed form
3564b75k42K97M70L74l86l85k25J57L60K34p5l27k05O7J13J86j7j29qO4k9q7k3
3587i1MP6J92L6k39k32L7K53K55l5l07k74OL01L56p1l82l48J23M96L52j65n29
3610a86l95J46O08M31j52o88m59J14O94N06j28o15n02R7N14N34Nn43m70l4M95
3631b8L87M5l49m05N6K79L04j09k70j24N6K42J25o3k54p2J10J44K4j66m2N0J32
3654G2Jj9j75L2J54J81q0k33k27L7L68K19L4m83k54M8L77M30j44l69l81l9M57
3677FN35n8l68n67JM02M52O0k82m59j42M03M06L3k92l86j17L07M62J0l33l99l
3700c29K76L47O6k62k76j00J97L02J3k14j43MQ2J42qj83L2R8M5l2j55q1P8K53
3724A52J57k60k66o2J69L90J60l33m51j24K16M81K41k96m50j90K13N28J24l19
$$ plain form
3744 80 -304 -463 -202 312 523 175 -303 -526 -243 318 504 213 -235 -530 -294 182 421 168 -206 -404
3764 -404 -226 91 259 238 -129 -256 -130 58 182 120 -134 -177 -9 86 102 -41 -89 -29 75 104 18 -152 -167
3787 -167 18 132 129 -14 -164 -220 8 267 214 -67 -318 -254 113 364 213 -100 -298 -261 155 459 375 -88
3809 -88 -475 -319 52 548 360 -13 -432 -382 18 436 451 30 -391 -336 14 390 399 56 -250 -309 -12 317
3831 317 328 19 -218 -156 23 243 179 -30 -148 -159 32 163 99 -76 -111 -67 7 102 34 -26 -57 26 12 26 -158
3856 -158 -199 -6 184 186 3 -281 -265 -59 198 304 49 -309 -356 9 168 388 -6 -247 -361 -94 253 357
3878 357 51 -237 -346 -154 256 343 68 -302 -396 -98 234 316 130 -307 -292 -116 190 275 87 -176 -312 -165
3900 -165 157 202 120 -110 -241 -102 13 144 -26 -30 -69 -3 51 -7 -66 -43 -8 115 80 -50 -127 -71 89 177 82
$$ packed form
3744H0l84j59K61N14K11l48m78k23K83N61J86k91m48k95K36M76K39k53l74j98
3764d04J78L17J68k1l67j27J26J88J24o2k54m3J68R5J6j43m8O0J04K9q6j70j5
3787a67J85J14lj43j50n6K28K59n3k81k51O4L67K51j51l13j98L7M16L04q4m63
3809h8l87J56L71M96j88l73m19N0M00M18J5m21m21N5L50L76Rl43l06n9K97L29
3831C17J1l09k37O2J79K20o4k09j18j1J91J31o4j75l5M4P4R5o8o0l1Q3j4J4j84
3856a58m1J93J90Kj83k84J6K06K57J06k55l58m7L65J59K20l94k41j14K67L47J04
3878C57l06k88j09J92M10Q7k75l70r4K98L32Q2j86m37J5J76L06Q5j88k63j36J47
3900a65L22M5q2k30j31J39J15J31j70ml9O6N4n8n9K3L5J23l5j30p7N6J60Q8r5
$$ plain form
3925 82 -187 -244 -188 142 242 130 -158 -278 -65 122 358 150 -152 -288 -113 280 430 132 -165 -373 -105
3946 -105 265 385 184 -239 -405 -236 189 408 235 -129 -357 -200 138 298 214 -79 -261 -152 168 225 156
3967 156 -106 -128 -99 109 150 143 -124 -103 -9 89 113 -18 -81 -67 22 141 -24 -108 -70 9 113 105 -30 -164 -122 76
3993 76 232 151 -99 -240 -234 73 307 186 -102 -318 -224 73 275 220 -12 -349 -337 15 272 337 13 -358 -313
4016 -313 -58 243 223 -38 -332 -325 -79 265 273 13 -276 -220 -31 230 159 -51 -149 -228 -29 256 163 -37 -184
4039 -184 -137 36 136 65 -85 -40 -72 57 80 62 -59 -48 71 144 -11 -98 -117 4 121 271 120 -122 -183 -57
4063 -57 203 241 52 -81 -241 -105 226 225 84 -162 -245 -54 250 230 95 -166 -264 -77 228 343 110 -120
4085 -120 -314 -135 174 285 91 -133 -266 -88 149 299 164 -117 -223 -55 42 153 107 -59 -73 -59 21 151
$$ packed form
3925H2k69n7N6L30J00j12k88j20K13J87K36k08l02j36J75L93J50k98k97k08K68
3946a05L70J20k01m23j66J69M25K19j73l64k28J57L38J60q4k93j82J09L20N7o9
3967A56k62k2K9K08M1pk67K1R4R8K4j31o3J4Q9J19j65q4L8P9J04qj35j34M2J98
3993G6J56q1k50j41OL07K34j21k88k16R4K97K02n5k32l37J2L52K57O5l24l71M5
4016c13K55L01k0k61k94PK46L44Qk60k89N6J89K61p1k10r8p9J99K85r3k00j47
4039a84M7J73J00p1j50M5l2J29K3j8j21J1J19P3j55q7j9J21J17J50j51k42o1J26
4063e7K60L8j89j33j60J36L31jj41k46q3J91L04k0j35k61r8J87L05J15k33k30
4085a20j94J79L09J11j94k24j33J78K37J50j35k81j06J68R7J11m6j66j4J4Q0J30
$$ plain form
4107 151 -16 -58 -10 -11 96 58 1 -129 11 50 111 2 -125 -128 -35 100 2 -64 -168 -100 66 181 28 -158 -192
4132 -192 -111 53 268 124 -130 -211 -109 108 201 89 -157 -343 -147 134 239 108 -125 -326 -214 33 235
4153 235 195 -19 -257 -177 -18 180 163 -67 -153 -118 115 99 96 -82 -88 -44 79 65 75 -13 -94 -101 49 113 -7 -3 -65
4180 -65 0 73 44 -8 -75 14 56 102 -24 -100 -103 70 190 115 -24 -89 -125 10 155 136 8 -168 -146 -64 287 267
4206 267 -9 -237 -203 9 187 216 29 -175 -226 -24 179 193 -16 -192 -197 23 251 213 -24 -159 -133 2 184
4229 184 103 -3 -151 -164 -39 125 142 -24 -70 -165 28 -14 38 -45 -62 -3 64 51 -5 -92 -45 42 157 67 -77 -122
4255 -122 -83 103 102 37 -115 -202 -94 54 155 98 -91 -237 -30 103 148 106 -167 -217 -66 125 244 27 -163
4278 -163 -222 -131 116 173 91 -169 -210 -166 111 207 140 -52 -273 -147 65 166 151 -125 -177 -106 70 184 4 -37
$$ packed form
4107A51j67m2M8jJ07l8n7j30J40L9O1j09j27lR3J35r8o6j04O8J66J15j53j86l4
4132a92Q1J64K15j44k54q1J02K17R3j12k46j86J96K81J05j31k33k01J12K47K02
4153B35m0k14k38Q0J59J98j7k30q6L5K33j6lj78oM4J23j4J0q8q1pJ50O4j20Mo2
4180f5O5P3k9n2o7Q9M2M6j26p6lJ73J20p5j39o5l6J35J45j9j28j76K2Q2L51k0
4206B67k76k28L4K12J78K9j87k04n1K02K03J4k09j76nK20K28l8k37j35K6J35J82
4229A84q1j06j48j3J25J64J7j66m6r5J93m2N2q3j7N9O7j3n6q7M7Q7J15r0j44m5
4255a22L9J86jo5j52q7J08J48J01n7j89j46K07J33M5m2k73n0J51J91J19k17j90
4278a63n9R1K47N7q2k60m1M4K77R6o7j92k21J26K12J01j5k76n2P1J76J14j80m1
$$ plain form
4302 -37 -116 8 72 58 50 -49 -101 -18 83 111 -81 -50 -43 4 137 62 -51 -36 23 51 51 110 -106 -47 1 102 98 -39
4330 -39 -139 -109 67 192 183 -49 -183 -55 1 219 165 -48 -202 -151 -24 178 161 -30 -146 -109 70 67 120 62
4354 62 -127 -75 8 151 111 23 -142 -83 -18 78 73 0 -56 -108 -3 27 36 -3 -114 -83 -4 38 41 -38 8 -39 16 32 -138
4383 -138 -35 -27 64 80 -3 -79 -107 -3 47 109 -47 -80 -106 -97 92 164 -13 -127 -163 -14 108 109 12 -115 -134 8
4409 8 113 142 51 -59 -192 -94 151 146 34 -97 -249 -32 170 165 97 -163 -165 -48 48 146 64 -75 -152 -5 62 53
4435 53 -72 -62 -20 47 123 -13 -24 -70 -35 44 64 15 -60 -26 46 96 102 -25 -135 -67 65 134 58 3 -93 -59 46 177
4463 177 94 -60 -93 -17 104 150 58 21 -92 -64 112 96 143 -39 -190 -71 51 170 151 -9 -80 -140 72 148
4487 148 143 14 -105 -89 71 94 96 -8 -55 -98 64 131 57 -63 -97 1 63 34 19 -58 -86 -30 123 97 23 -48 -29
$$ packed form
4302c7p9J24O4j4qr9n2Q3J01K8j92L1PM7J33p5j13J5N9K8%N9k16N9M8J01mj37
4330c9j00L0J76J25rk32j34J28N6K18n4k13j54N1J27K02j7j91j16L7J79lN3n8
4354F2j89N2Q3J43m0q8j65N9O5R6np3n6n2J05L0Rl9j11L1P9M2Lp9M6m7N5J6j70
4383a38J03QR1J6q3p6k8J04N0O2j56l3k6RJ89P2j77j14l6J49J22Jr7j27j9J42
4409HJ05K9r1j10j33R8K45nj12j31j52K17K02no8k60kJ17R6R8q2j39p7J47O7r
4435E3j25J0M2O7P6j36j1m6L5P9K0m9p5L4P2N0Oj27j10O8J32O9p6n5r6L4J05J31
4463A77q3j54l3P6J21M6r2l7j13K8J76j6M7j82j51J19J22J19j9j60p1o0K12P6
4487A48nj29j19J6J60K3Kj04m7m3J62O7p4j20l4R8O2k9j5p7k8N6J53k6p4p1J9
$$ plain form
4514 -29 37 121 46 -40 -64 7 50 95 -30 -147 -62 2 116 48 -40 -167 -191 25 72 88 26 -118 -158 10 38 123 24
4541 24 -162 -160 -23 138 152 0 -131 -171 -23 81 82 42 -47 -137 14 87 71 -76 -108 -71 -20 58 66 -31 -84 -13 45
4568 45 0 -26 -7 -80 -34 -12 49 44 -34 -60 83 15 59 -65 -36 39 59 110 29 -69 -57 -10 55 67 31 -106 -98 -9 75 85
4598 85 59 -58 -83 -29 115 105 29 -51 -148 -41 50 130 78 -67 -97 -49 79 133 131 -4 -142 -88 36 85 40 -46 -96
4625 -96 -45 9 69 -12 -54 -69 -14 3 62 23 8 -18 39 65 10 -15 -80 -24 -22 51 54 -45 -19 72 57 114 20 -76 -44 42 146
4656 146 27 -81 -139 -74 86 115 73 -41 -64 -77 38 76 148 -19 -180 -72 -17 126 92 -75 -96 -102 95 137 76
4681 76 -25 -121 -126 -30 118 106 -50 -97 -31 -20 89 19 -9 -72 -57 20 12 42 76 -116 0 8 -13 39 -19 29 6 40 86
4710 86 32 -39 -45 30 18 -44 -28 -38 47 72 85 32 -50 -143 -132 57 101 34 -33 -79 -18 60 76 -5 -117 -150 -16 79 110
$$ packed form
4514b9O6Q4p5q6k4P1M3M5j25j17Q5O4J14o8q8j27k4K16M7J6o2j44m0J68K8Q5r9
4541B4j86KJ37J61J4j52j31m0J48J04Jm0q9r0J51P3j6j47l2L7N1P8Qr7n3P1N8
4568D5m5k6J9p3M6K2O1np8k6J43o8M4j24K9P5K0N1q1r8J2M7O5J2l6j37QQ9Q4J0
4598H5k6j17k5N4J44j0p6q0r7J07R1Q0n2j45l0M8J28N4kj35j38N4J24M9m5q6n0
4625i6N1N4O0q1m2j5N5J7N9l9j5k6N7K6n5k5o5N6KP3Lr9K6R1j5N7r4r6L2Q6J04
4656A46j19j08n8O5J60K9m2j14k3j3J15L8P2j67j61J08N5J43l4j67k1oJ97M2o1
4681G6j01r6nR6J48j2j56m7O6J1J09p0k8o3J5P7qL0L4j92J16Qk1N2n8M8k3L4M6
4710H6n4p1oP5j2o2J6j0Q5K5J3n3q2r3J1J89M4o7o7m6O1P8J6q1j12l3J34R5L1
$$ plain form
4739 110 -14 -76 -94 -42 56 18 77 -75 -154 -37 95 100 35 -37 -170 -15 84 100 10 -23 -67 -48 19 53 64 -67 -45
4766 -45 -34 1 1 19 -41 -7 63 41 23 -25 -28 -25 63 99 -21 -33 -38 -27 82 74 20 -55 -12 25 95 85 10 -116 -31 13 89
4797 89 42 -27 -98 -115 -4 98 39 -34 -132 -80 -5 50 -8 -68 -86 -88 -21 112 53 -27 -80 -23 33 48 117 -68 -46 -36 33
4826 33 0 24 -42 -20 -45 80 34 -32 -36 -12 23 28 10 -50 2 27 -5 55 -1 -1 -13 -21 93 17 -8 -70 -69 22 77 25 -15 -16
4858 -16 -68 4 63 59 -21 -73 -79 19 34 22 29 -34 -21 4 1 38 -18 -31 -63 -9 95 71 23 -25 -99 2 110 65 29 -56 -27
4889 -27 36 37 48 -49 8 -17 18 59 16 19 -19 -15 20 40 55 41 1 45 19 -14 0 -8 -6 11 55 6 -124 -98 -43 33 52 -11
4921 -11 -36 -106 -39 14 150 0 -125 -49 -55 32 57 62 -113 -78 -70 -10 102 -13 -6 -117 -70 71 96 36 -23 -106 4 146
4949 146 -29 56 -8 -73 -22 28 62 60 22 -10 10 20 51 32 -40 21 28 1 46 -15 -39 -13 26 12 -5 12 -19 37 -4 51
$$ packed form
4739A10j24o2j8N2R8l8N9j52p9J17J32No5p2j33J55R9J6r0l3m4J9O7L4J1j31K2
4766d5J1L5%J8o0L4P0k2j8m8lLQ8L6j20j2nJ1J09qn4p5M3L7P0j0p5j26Q5M4P6
4797H9m7o9p1j7J11J02n9p3r8N2P5N5n8o0j8kO7J33n9q0n3N7N6J5O9j85K2J0O9
4826C3l3K4o6K2k5J25m6o6mK4L5Nj8o0N2K5l2O0n6%j2qJ14p6k5o2JR1N5n2m0j
4858a6n2P2N9mq0n2oR8J5j2Po3J3K5lL7n6j3l2N4J04k4m8m8p4J01J08m5l6q5K9
4889b7O3JJ1r7N7k5L5M1m3Ll8ML5K0J5j4m0M4k6l3J4qKJ7M4m9j30K6N5P6J9o3
4921a1k5p0O7N3J36j50j25P6oQ7K5Nj75L5QO0J12j15Pj11M7J41K5o0n9q3J10J42
4949A46j75Q5o4o5N1N0L4kl8l2K0J0L1j9p2O1Pk7M5o1k4K6L9j4j7J7l1N6m1N5
$$ plain form
4979 51 -41 -59 -29 14 3 69 -13 -75 -33 -14 46 60 -3 -90 -31 -14 123 39 12 -10 -29 -13 100 20 -29 -35 -35 55 114 60
5009 60 -29 -30 -54 52 69 24 64 -48 -39 61 88 37 9 -17 -53 -2 42 34 -32 6 -41 -31 -16 -37 -101 -56 5 37 -15 -43
5039 -43 -38 55 74 30 -29 -31 -64 -49 -2 55 -20 -45 -11 1 -8 78 -61 -34 -34 -57 57 77 -26 -72 -36 -29 109 109 32 -43 -86
5070 -86 -35 99 108 75 -59 -7 3 45 19 -12 -4 -54 -24 -5 26 -6 -19 23 -34 22 20 34 12 34 30 -23 -23 -19 -33 37 -70 -35
5102 -35 -27 -31 -33 -58 33 31 -34 -37 -50 25 70 102 4 -14 28 73 -12 101 -29 -18 16 78 88 -3 -35 -36 41 52 86 29 21 -32 -34
5135 -34 40 79 33 14 -72 -106 49 82 88 -52 -60 7 82 98 24 -32 -12 -6 -11 71 -22 45 6 -28 0 39 3 13 -13 25 43
5166 43 3 -28 -41 12 16 41 -57 -44 -87 3 42 31 26 -31 -43 29 29 35 33 -39 -43 -33 52 48 -35 -20 -40 -9 68 119 -22 -11 -103
5199 -103 -15 5 90 68 -58 -56 -44 20 -52 18 -78 -28 -57 -4 -5 21 -10 -30 -48 3 77 87 -65 -79 -16 -7 23 41 -68 -36
$$ packed form
4979E1r2j8L0M3j1O6q2o2M2J9O0J4o3q7N9J7J37q4k7k2j9J6J13q0m9o%R0N9n4
5009F0q9jk4J06J7m5M0j12RJ00K7n1k8k6l6N1M4qo6L8m7J0J5k1o4M5O1L2n2k8
5039d3NR3J9m4n9kl3J5M7N7p5k5L4J2rQ6j39K7%k3J14K0j03m6L6PJ38%p7p5m3
5070h6N1J34Rl3j34N2J0M2k6l1Qn0L0J9L1l2j3M2n7N6kJ4k2K2mn3%Mj4P0j07L5
5102c5Qmkk5R1ko5lj3P5M5L2r8j8M2M5q5J13j30J1L4O2J0r1l2jP7J1L4n7qn3k
5135c4P4L9m6j9q6l4J55L3Oj40qO7P5J6p4n6K0OnQ2r3O7l9l4K8L9l6J0k6L8J8
5166D3m0l1j3N3MK5r8J3m3R0L9j1nn7j2P2%Okp2mJ0Q5mq3J5k0L1P7N1j41J1r2
5199a03Q8K0Q5k2j26KJ2O4p2P0r6N0k9N3jK6l1k0j8N1P4J0j52j4O3RL0J8j09L2
$$ plain form
5229 -36 10 59 -5 -45 5 -39 -5 -1 -31 34 22 26 34 11 5 -7 -3 19 26 -2 -27 -15 -3 16 15 87 -21 -59 62 -18 59 17 -29
5262 -29 -57 -18 2 41 47 -39 -39 -41 32 24 21 16 -81 -37 -1 84 26 32 -86 -32 47 -25 -14 4 14 -14 -12 -33 26 58 7 -29 29 -4
5296 -4 42 21 -14 50 -4 5 23 -37 22 37 23 -2 -29 15 11 -32 26 41 -25 -15 -50 -6 -25 -21 -115 20 27 37 55 -20 -18 -28 31
5329 31 -55 12 -24 -33 31 48 73 36 -18 -25 -55 60 -39 4 5 -82 -38 -5 68 -27 -12 -27 7 26 105 22 -15 -35 28 12 -28
5360 -28 5 -16 43 12 41 65 7 -13 -14 41 55 -21 -4 -43 -23 13 48 6 -12 -70 3 -2 75 -10 -105 -67 -27 85 73 19 -5
5391 -5 -54 -49 53 34 -28 -5 6 10 37 24 -26 -8 -73 -34 24 1 56 -34 -61 21 -12 44 96 25 -58 23 54 81 4 -63 -6
5422 -6 -14 70 36 -14 -64 -18 49 60 43 9 3 -44 33 36 -2 4 -24 -53 -2 -64 6 -45 -35 6 34 28 -55 -21 -30 76 -9 11 -47
5455 -47 -35 -64 31 53 43 -56 -43 44 29 7 26 -8 -40 3 41 127 -6 -55 -54 4 51 27 84 27 -40 -21 11 94 9 -28
$$ packed form
5229c6M6M9o4m0N0m4L4Ml0O5j2MQk3oj2MK2Pk8k5J2J2J9jP2j08l8J21q0P7m2m6
5262b9k8L9K0L9Oq6%kP3qlnr7M4L6Q5n8Oj18N4P9p2J1J8J0k8Kk1N9L2n1l6N8l3
5296dM6k1l5O4n4RJ8o0N9J5j4k5k7M4mm3N8J5o6J0l5M4j9Mr4J35PJ0J8p5Kj0N9
5329C1q6O7l6rO4J7K5l7n4pl0J15r9M3Jq7M4L3P3r5J5j5L4J9P9q3l7k0O3j6m0
5360b8L3k1N9l1K9K4n8k0jN5J4p6J7l9K0L6L5m2j8n8P3nP7q5r5L8M0J12j2n4k4
5391em9NJ02j9o2K3J1MK7j3n0J8o5L9N8k3N5r0k7Q2l3N6N2p1q3Q1L1K7p7o7N7
5422fqQ4l4n0n0M6O7J1j7l4om7P7Ll8Ok8k9N1o2P0n1J0M1K8oq3L4rJ06q5K0n8
5455d7J2k9R5K2j0r9J3Q7j5k2J9l4l2M3L8Q6j33m9JN8M7k4N7n7o7J9L2Q3q5l7
$$ plain form
5485 -28 -26 21 0 27 35 -63 36 0 37 75 32 -25 16 13 62 37 12 -31 -3 32 -10 52 -41 12 -16 12 31 -70 17 21 -12 21
5517 21 88 -63 -14 58 0 17 19 -8 23 7 17 27 42 18 1 9 27 81 20 35 -31 -39 10 -30 0 -35 -20 -19 -90 28 7
5548 7 -3 12 -11 -3 12 -38 0 -9 25 -34 49 -43 -11 -5 -3 24 -4 -38 26 -15 9 -10 -9 -66 -35 17 -6 1 -8 4 -32 -13 75 32
5582 32 19 6 -11 -11 2 -26 38 -19 -82 -42 -37 124 -4 -30 -6 -73 35 48 25 15 -30 36 -4 71 -39 -35 0 -19 29 23
5612 23 9 0 -28 -28 -11 54 28 12 -15 17 -45 10 -8 -27 -18 -37 -3 10 -36 32 -36 15 31 18 13 -1 -33 68 24 -21 -38 -61
5644 -61 -6 24 28 -27 29 22 71 -15 -27 15 -46 7 -46 53 23 67 -20 27 5 17 84 -30 58 22 32 40 20 17 -27 -39 -12 11
5676 11 47 1 -38 -31 3 -8 36 32 -51 38 55 44 -77 0 -33 0 29 3 23 -14 -18 38 60 15 -13 -9 -65 8 -2 22 -53 -40
5708 -40 -4 26 9 50 13 -53 9 99 91 4 -47 -80 -38 34 18 24 -39 -51 13 101 93 -3 -37 34 22 -32 79 -32 -66 -84 87
$$ packed form
5485b8KM7k1K7Qr8R9l6L7L8m3n7M1lM9k5k5m3K8L5m2O2r3N3k8K8J9j01Q7Ml3L3
5517B1O7j51M9P2n8J7Kk7L1j6J0J0J5k4j7QJ8N4o1J5o6qM9m0L0l5J5Jp1J18k1
5548Gj0J5k3QJ5n0L8rL4n9Q3r2L2OKK7k8l4O4m1K4j9Jn7L1N2k3PrJ2l6J9Q8m3
5582C2j3j3j7%J3k8O4n7o3M0NJ61j28k6K4o7J08J3k3j0m5O6m0P5j10ML5j9M8o
5612B3j4rk8%J7O5k6j6k7L2o2N5j8j9Rj9L4J3m6O8o8N1J6j3nj4l2J01m4m5j7k3
5644f1N5L0Mn5N6pM9q6j2M2o1N3n3R9l0M4q7M7k2J2O7j14Q8l6J0Qk0lm4j2K7K3
5676A1L6m6l9PL4j1M4mq3Q9J7j1j21P7l3L3K9k6K0l7mN6K2m5k8Mn6P3j0K4p5J3
5708d0L6L0j7M1l7o6O2R0qq7n1l3M2P2j6Oo3j2O4Q8qr6l4P1j2n4J11j11l4j8J71
$$ plain form
5739 87 -19 -8 68 -35 -76 -51 -10 -13 13 5 -38 -57 -9 -12 -17 7 -14 -12 -10 -7 -12 20 -35 15 14 -63 -43 35 60 23 10 32 1 3
5773 3 17 -15 -34 6 13 -31 23 15 -53 -22 -88 -19 43 31 42 -49 -25 55 69 54 2 -40 -34 27 13 42 52 13 -68 -61 34 67 37
5806 37 -11 -58 -41 -11 -7 48 -6 -42 41 -10 10 4 25 -8 -27 -48 59 -26 -15 -7 34 65 12 -13 -74 -5 -31 22 25 29 -29 -13
5838 -13 3 12 -8 -11 -25 -49 18 -23 -37 -11 -32 -27 25 12 21 62 -11 37 35 -20 -18 -58 -65 13 -4 69 -28 -12 -26 -21 19 103 11 10 -32
5873 -32 -24 62 -40 -25 -11 -6 41 -48 49 30 -4 -38 -9 -4 -49 1 -51 -28 9 4 35 -33 49 16 16 -29 -17 11 59 -43 -19 -4
5905 -4 0 -51 -34 -15 18 35 -4 -4 -97 -6 -7 25 -20 -15 -31 -32 47 -19 -2 -35 -42 92 82 26 7 -34 -29 -8 -39 44 -12 -16 13 -49
5939 -49 82 -10 0 -45 -69 -12 59 -6 -25 -23 -4 -76 41 59 45 29 53 10 14 25 -28 6 15 -1 10 51 -15 -32 87 -63
5969 -63 28 -4 5 29 1 52 35 -82 6 -38 21 38 -71 5 -7 3 -21 71 3 -1 -32 4 -23 50 7 9 -70 -16 -25 -34 -15 -45
$$ packed form
5739H7j06J1P6j03m1K5M1lK6qm3j9M8lnK4k1KKLnL2n5N0jp7K0P8K5l7j3K2l1K
5773CJ4l2j9M0Pm4N4qo8L1o6O9O2j2J1r1K4Q0J4j5n2m2OO1j4K9J0l9q1PR5L3l0
5806C7m8m7J7L0MN5n4l6Q3n1K0oK1l3j9k1J07q5J1QM1L1n3k5o1O9k6N3LMn8J6
5838a3J6Rk0lj4k4O7m1j4K6k1NN2j3RM1p3M8kn5Km0pP8j7P3r7J6j4NM0Q4r2jm2
5873c2QQ6j02J5J4NM7q9R7j9l4l4K9Nm5N0n2K3L7nL1o8Q2l3%m5J2K8M8j02K4J5
5905dMn1J7J9L3J7l9%r3R1jL2m5Nj6jP9o6J7l3pJ34j0n6j9m1NK1l1Q3n6mK9o2
5939d9J31r2J0m5k4N7P1o5j9KJ9p2J17J8j4j6K4m3MJ1n3L4Rj6J1M1o6j7J19j50
5969f3R1l2RK4k8N1j7j17Q8m4N9J7j09P6j2J0k4R2o8ml1L6k7P3m3Kp9N4rrJ9l0
$$ plain form
6001 -45 -52 -21 89 10 60 -24 37 43 1 3 75 -45 -38 5 53 103 -68 -27 47 13 72 108 35 29 -5 36 -61 21 -39 -52 -4
6032 -4 48 -24 -4 -16 -20 5 -11 41 29 -23 -62 -29 5 10 -35 -49 -26 -43 6 -20 -70 -39 -83 -23 48 56 4 -49 16 53 24 32 -59
6065 -59 21 -33 41 3 -23 -41 -21 0 37 62 18 26 -34 32 -10 36 16 5 -36 26 59 -43 18 -27 -46 -52 27 7 -46 -12 -7
6096 -7 34 106 2 -34 0 35 7 -39 25 -70 -15 -40 17 47 6 3 -65 -59 16 74 22 -15 -19 -4 122 -32 -37 -10 -53 16 43
6127 43 71 35 -75 -46 12 13 -19 8 -55 -51 15 -17 21 -41 23 -6 92 -29 13 55 -14 -110 7 -15 65 8 -52 25 -16 15
6157 15 63 17 -1 81 30 -1 -43 47 -24 20 51 32 3 -7 -89 22 36 -36 -69 -69 21 -71 32 73 4 -20 -81 5 -15 46
6187 46 0 2 48 15 23 73 -18 -19 -64 -45 30 0 -29 -32 38 25 -36 39 -15 -6 -11 40 34 55 -5 -7 -37 -52 -1 -16 -83 -20 34 -5
6221 -5 -10 -27 -25 -46 -29 54 -37 -5 -51 8 -30 48 -84 -12 27 -25 -57 -36 -52 -83 -58 28 64 -7 -16 -35 16 -16 -34 -67 -81 -19
$$ packed form
6001d5pL1J10p9N0q4O1Om2KP2j20PM3M8N0j71M1P4l4N9L6p3ol4M1r7Q2o0j3M8
6032dN2p2K0j2mK5j6N2j2n2l9L3L4Nm5j4K3j7M9k6n0L1m4O0P1Qn2n3O5L7k9Qr1
6065e9Q0n4P4l8k6j8K0K1L7K5m4Qo0O6m2M6k0j1m1O2L3j02O1m5j9oP9k0n3L4N
6096gM1P2j04l6L4L5k8m6O4r5N5k5N7L0m1lo8OP5N8n2l7mJ5J26j54nK7m3O9K7
6127D3K8l6j10K9N8Jl2K7o3MO6l2L8o2O4k9R8j21M2M2o9r6J17k2Q0n7o0P7m1L1
6157A5M8m6j8Q2n1l1m2R0p1M4L1j9k9j0q2J11J4p2l3%R0r2J03M1o9k4o1Q6k0O1
6187D6m6KM6l3QN0r1jm5J9P5l0k9lP0j3o1P5n4RnN1oK1o0kl0j5N1j5o7O3N4l9
6221enj7Kk1J7Q3r1L2m6N9l8P8j32P2L9n2l2K1j6l1K5Q6L6p1rj9N1l2j8l3j4O2
$$ plain form
6253 -19 35 26 -10 -2 10 -11 17 8 38 -7 -21 -37 31 53 -11 77 5 -18 -8 -6 40 29 -25 -83 -47 66 -43 -28 3 -19 -20 51
6285 51 16 -19 25 -28 -7 15 0 -30 -76 53 8 33 42 -29 23 -37 97 -17 -1 -40 11 28 58 38 -31 -33 6 -6 52 40
6315 40 16 -53 -7 15 33 49 40 -21 26 -50 20 33 2 -60 -24 5 48 57 34 14 -22 -17 8 60 64 -11 4 -12 -12 -11 -14 -18 -13 30 -12
6350 -12 27 -66 -63 23 -11 78 65 -70 -60 -20 28 -36 56 -10 -40 4 53 62 11 38 -23 29 35 7 -34 -24 -15 56 62 4 -25 15
6382 15 -86 -4 -5 58 -50 -56 -25 -9 39 -9 -38 -106 -45 -3 96 -27 31 -35 -6 13 -8 2 -75 -26 -23 -35 -16 -2 58 48
6412 48 -43 39 -19 7 -11 -63 -41 -40 14 6 21 -5 -27 8 -29 -35 -12 3 3 15 10 -7 8 4 50 1 0 -13 9 11 49 26 21 -8 -13
6447 -13 34 74 -28 12 -79 28 6 -12 42 -60 -21 -36 38 58 -31 -29 22 -34 11 -61 75 -15 30 -27 -2 13 41 32 -26
6476 -26 -46 -62 60 14 -48 -5 47 9 -39 -5 -46 -67 -7 42 76 -64 16 -13 6 90 39 79 -71 27 92 32 13 -36 -91
$$ packed form
6253a9N4rl6QJ2k1K8rL0m5j4j6O8K2o4Q8p2k3J0KM6j1n4n8L6J13j09J5L1k2jP1
6285E1l5l5M4n3K1K2j5l0m6J29m5K5Rp1N2o0J34j14J6l9N1J7L0k0o9kL9j2N8j2
6315D0k4o9M6K2J8J6ro1M7p6P0J3l1o2L6K9M3Rk3k0l6NK5N2Mp5J5j6%JlmNM3m2
6350a2L9r3LQ6l4Q9j3j35J0M0M8o4R2o6l0M4M9Rn1K7o1N2Ok8m1J0RP1On8k9M0
6382A5j01Q2jO3j08oL1J6M8m8k9o8O1M2R9j23N8o6K9J9k1J0p7M9Lj2J9J4O0j0
6412D8r1Q2n8K6j8n2K2JN4qJ5k6k2L5l7oK3J5%J2nj7J5mM6m9jj3K2KL8k3nk9n
6447a3M7M0j02M0r1J07k2j8N4j02L9j5P4K0q9KN1n6M5p2J36r0M5n7K5J5K8rn8
6476b6k0j6J22m6o2M3N2l8m8L4m1k1O0M9L4j40Q0k9J9Q4n1M0j50R8O5o0j9m9n5
$$ plain form
6505 -91 -15 52 -38 -44 -61 -20 -23 31 9 -39 -15 -43 -8 -5 58 -46 22 -62 -54 5 9 8 -19 -66 -88 83 28 3 -12 -57 -70 14
6537 14 49 -1 -12 32 48 12 86 15 10 39 21 40 42 -3 -81 -23 13 -34 -33 -19 -56 9 12 26 -16 56 -99 -29 14 43 -23 -10
6569 -10 -45 -26 36 17 6 -95 -47 1 45 -38 -38 44 -33 22 55 44 0 -30 -56 -1 82 3 -6 -56 -41 43 66 72 57 -76 -34
6600 -34 38 34 30 -25 -27 5 15 -33 23 -43 14 11 -12 9 32 -31 27 -15 1 27 -26 -11 -32 17 49 18 50 -27 -12 -32 40 -1
6632 -1 11 -34 -15 -43 -29 33 -10 0 -51 5 19 -39 -88 -40 -10 50 -10 -25 -40 -45 -10 -4 15 -40 -18 -87 -52 30 -15 39 -52 23
6664 23 12 -45 9 -15 -2 13 -51 38 18 -32 -57 2 -52 14 7 -24 22 -34 26 -27 58 15 -71 25 1 -27 -1 36 20 -8 7
6695 7 -9 -18 -11 19 26 -21 -58 -42 -75 -57 -23 58 33 -50 -28 20 30 49 -17 5 -17 -68 74 28 56 -8 -65 33 10 -23 1 -65
6727 -65 -53 10 5 41 -26 -20 1 -56 49 15 -23 42 -78 -26 41 49 -18 -12 7 -12 4 0 28 -3 7 9 -55 29 -95 -23 19 1
$$ packed form
6505i1P6O7r0oj7M1lN4k2m8K4k8L5LO3j04O8q4QN9Mjk7m7k2J71n5k5j5m5j3Q4
6537A4L5n0j1M4J6l6P4p1nK9j8J9Km5p8N8L6m7JJ4l7O5LJ4m2P2j55P0M3K9o6J3
6569a0l5J9O2j9j1j01M8M8M4q3%Q2p7N5L3j1m4l0k6N5Q3p9rn0J5Q4K3Oj5j33M2
6600c4P2mmn5kL2J0m8N6o6N7lk3K1K3o3N8m2J6K6n3J5k1M9L2l1L2p7J5k0P2m1
6632aJ2m5J9k8J4O2m3J0n1N6J4n8m9M8L0O0o0j5j5nL5OJ9n5K2o9L5Q2m5N4r1P5
6664B3j1n7N4k4J3J5o4Q9k0n0k5N9n4O6pl1M6n6O0n3Q5m3q6R6k4k8K6L7j6k8J5
6695Gj6rPL0Pm7l7J6l3J8L4Q1k5q3K2M8J0J9o6K2k2n1J42m6K8o4n7R8k3l3K4o6
6727f5J2O3nL6o7OK1n7J05l4l8O5j20N2O7Qo7OJ9j9J6mK8l1J0Ko4Q4j24P2M2j8
$$ plain form
6759 1 61 43 -60 19 -31 -47 18 -26 -48 -80 -19 26 41 3 -69 -75 -23 -3 61 4 -71 -51 52 23 17 53 7 -9 43 56 49
6790 49 -40 -40 -17 23 16 -22 42 -6 -44 -15 35 8 18 4 -83 -13 44 -20 -18 31 -29 -60 49 -39 7 -16 4 54 -7 24 -3
6821 -3 -84 80 -11 46 -31 -78 -60 -36 15 -34 -50 -51 25 -13 36 -14 23 11 3 39 72 76 -38 -94 -20 69 61 -61 19 -44 17
6852 17 12 14 15 46 39 60 55 46 33 -7 -72 10 22 -42 -11 -37 23 -55 44 41 11 -13 36 -32 6 9 37 -56 -16 -11 2 -1 39 -43 -15
6887 -15 79 -2 18 -7 -1 3 24 15 -16 14 -22 73 58 63 -27 -18 -20 29 66 7 21 -43 -44 5 34 -31 3 -36 0 4 98 59 -24 25
6921 25 22 23 23 -4 -82 -55 14 -15 39 -9 22 -79 -2 34 50 -13 -68 -2 10 24 -22 -47 -45 -39 -8 -43 9 34 -31 -59 -12 0
6953 0 26 -32 4 0 2 30 24 23 -18 2 41 50 12 -22 -25 -41 46 86 11 -21 9 -5 19 79 15 -51 -45 20 69 41 -1 -37 -1 -32
6987 -32 67 2 13 -31 -12 40 -35 51 39 -34 -6 73 37 13 -4 -38 -6 6 40 5 -40 -52 24 30 14 -19 -38 -28 35 31 56
$$ packed form
6759AO0j8j03P9n0j6O5m4k2l2O1M5J5l8p2oN2K0O4n7p5K0J03k9oL6m6j6N2J3p
6790D9q9%K3M0pl8O4m8l8K9N0k7J0j4q7P0N7o4KM9o0l1J09q8M6k3K0N0o1L1k7
6821cq1J64r1N7p7m7J8K4N1m9j6jP6l8M9n0L7j2qL6L3Mj14n6P4Q9qj22Q0o3O1
6852A7nKJL1pK1nrj3m0o5Q2J2o4L1k6O0p8R9ll0k4M9o8L8LK8r3M0NJ3lM0q2K8
6887a5R4q1K0k5OMK1rl1L0l6R5j5Nr0RkM9L7n9J4o4jM9K9o5L4l9L6MR4l9q3M9
6921B5lJ%k7p8K7O9k9N4m8L1j01P7L6J6o3n5O6J2J4m6k5KOL1l5N2K5o5k8M7J2
6953@K6n8L6mKK8ojm1K0L9Rl8l4lj6Q7M0p5l2L0j4K4O0o4o6OO5M9k8m2l6L6l1
6987c2R9o5J1m4J9N2p5Q6j2p3K8P9l6k4j7l4L2J2L4l5m5j2P6Oj6l3j9J0O3mK5
$$ plain form
7018 56 -36 -15 -38 -9 36 -54 -3 34 29 70 21 -4 30 -27 -10 2 19 35 -124 16 -29 41 36 31 -43 -68 37 50 -26 -31 -10
7049 -10 -35 -24 76 82 41 22 -14 -34 -7 -21 57 -62 -9 7 58 64 -1 -8 -53 -18 43 47 -18 36 4 -1 82 76 13 -3 2 -54 5
7082 5 41 15 -18 12 -25 68 -9 -14 -42 -7 33 49 -29 -46 -41 13 -16 97 -32 6 -3 -9 66 33 -16 17 -37 -15 48 -12 -37 -68
7114 -68 20 77 35 -24 71 -39 -29 -25 51 32 -38 4 -75 20 2 -47 41 -21 -20 10 26 52 -2 5 2 -10 14 54 -7 -13 29 -3
7146 -3 9 14 -27 46 12 -4 -14 15 11 14 -13 16 -8 -66 2 81 40 48 13 -33 -17 10 33 -52 -22 -67 -18 -59 27 24 3 1 -8 24
7180 24 61 27 32 -22 2 15 25 -17 -12 -51 0 22 33 76 -39 -44 24 11 19 42 8 16 -6 1 30 1 -8 -48 -25 -2 7 5 -25 7
7214 7 11 -11 14 56 48 -20 21 16 70 10 -54 -13 17 31 -46 -25 -58 8 41 39 5 -17 -18 -2 -21 128 109 -38 -27 50 -15 -6 7
7247 7 -18 6 -8 29 -13 30 31 -40 -18 -3 -16 11 33 14 -41 53 14 44 27 22 -1 -68 27 -29 -24 -1 4 0 35 -27 2 -35 -18
$$ packed form
7018E6r2K1k3K9M5r0N1L7nM1m9k5L4n7J7J2J7J6j59J40m5P0nnp4k5J05J3p6nK1
7049a0k5J1J00Om1j9l6k0K7j4P8j19N3J6N1Oo5pm5L5O1Mo5N4l2nQ3oo3j6Nn6N9
7082EL6k6l3L0l7R3p7nk8L5M0J6p8j7NN4k9J13j29L8roP5l3m9L3n4K2O3o0k5l1
7114f8Q8N7m2n9R5j10J0MP6j9p0M2p9R5j8m9Q8o2JL0J6K6n4Plj2K4M0o1oM2l2
7146cJ2Nm1P3l4j6j0K9mLk7K9k4n8O8P9m1Ql5m6J6K7K3q5L0m5M9m1Q6lk1krL2
7180B4L7l4Nn4K4J3J0m2Nl9N1K2J1M3j15nO8j3QK3l4Qk2PK9k9rm0K3K3Rkl0L2
7214GMk2K5M2qo8M1nN4o0o4M1L0J4p7K1l3O6L3kl4k2jJ6j9J49j9j47J1P7o5RJ3
7247Gk5K4j4L7m2M3Jp1K2J5j3K7K2j9n5R4l9L0j7nk3o7R5n6NK3NmL5o2K9l7J7
$$ plain form
7280 -18 6 41 -2 28 -41 -30 43 -22 -74 11 25 -11 22 35 -8 -35 -26 52 20 44 -24 -9 -22 -21 73 -62 -18 -9 -36 21 43
7311 43 -19 -22 9 -9 56 39 -34 -39 -50 18 42 72 94 12 -61 17 33 45 25 -71 20 29 43 -51 -30 -112 -20 26 23 -27 -51 23
7343 23 20 65 -32 -80 -38 -34 -10 22 -21 5 -42 -32 68 21 6 -57 -70 11 -21 44 -15 -28 23 10 11 1 3 -58 -13 -2 3 63
7375 63 21 -21 -27 -21 -6 20 -28 -11 -44 -39 11 21 -12 39 -44 6 68 -31 63 -9 -7 -26 -6 -32 -5 -23 -54 0 47 -3 33 -4
7407 -4 -14 -17 -53 44 -81 2 8 -33 5 -19 -91 -48 -39 -42 50 -59 -7 -8 5 19 52 46 -57 3 -18 14 32 -19 -15 -34 -39 75 41
7440 41 -16 8 -72 -20 51 73 -3 0 -2 -8 10 -11 -38 -49 -40 -2 62 -15 -10 -42 -60 -1 12 -31 16 -41 -18 89 -4 53 23 -37
7472 -37 7 50 39 -33 35 13 -10 5 28 17 -26 -34 44 73 46 -28 -7 33 89 17 17 -32 -32 58 -13 64 43 -5 -4 -52 40 34 16
7505 16 -34 26 4 -15 9 61 -39 1 24 6 58 9 4 -30 -5 9 19 -92 -30 -44 8 -6 48 46 1 -44 -31 34 0 -6 -57
$$ packed form
7280a8K4L5m3L0o9J1P3o5n2Q5J4l6L3J3m3k7RP8l2K4o8J5j3JR4j35M4Rk7N7K2
7311D3o2lL1j8O5j7p3nj1O8K4L0K2q2p3P8J6J2k0r6R1RJ4r4K1q2R2M6ln0k4P4
7343B3lM5r7m8M2MK4L2m3K6m7J0J00m7j5o3j3Q1l2O5n9j3N1j3Jj0Ko1M5J1NO0
7375F3m2m2oOJ5K6m8J7l3NN0J0l3N1q3N0O2r9R4p2Kj9K0k6K7j8l1N4M7n0L6l7
7407dj0ll6R7j25Q3Om1L8k4p2M3RlR2j09N2jJ3J4L3oj03O0k1L2J8n1Mj9nJ14l4
7440D1n7K4q0N2P1K2p6LkoJ8k1k7j1RL8O4p7Nl2j8N9J3m3M7n7K3J07r3N7l0o0
7472c7M4M3j1p2O8k2k3J5K3j1m3qP8K9k7p4K1M0N6p2%m9%R0p1P7k1m8Jm8R2oj8
7505A6n0O0k2j9K4N2j00M0K3j8N2m9nl4K5J4J0j11O2j4N2j4N4km5m5J3O5l4on1
$$ plain form
7536 -57 50 -23 1 -58 -19 -107 45 -5 -16 -6 -5 -29 5 57 -31 28 10 29 2 43 8 -64 13 3 49 8 -6 -34 -32 12
7566 12 28 6 -42 15 -18 -19 -10 106 8 -68 -61 -8 48 10 40 -104 -35 6 40 -5 -6 -20 -38 99 6 70 -16 -24 -5 24 14
7597 14 54 -20 -39 66 -26 28 -12 -34 -42 -21 24 7 81 -41 -41 -42 15 18 -19 40 -14 -12 50 -8 18 15 13 -9 36 -13 -43 -33 -54
7630 -54 56 45 -39 22 38 11 -48 65 39 -47 -3 -45 77 37 45 33 -22 -20 33 63 -21 -1 38 29 21 -23 -18 -34 -9 2 -27
7661 -27 31 86 -5 -37 -27 44 20 -18 -15 -85 -4 -10 44 16 -12 48 -22 5 88 -28 -8 11 46 22 77 -26 0 -45 8 26
7691 26 -38 -49 -27 5 25 -17 -23 -23 -40 -8 39 14 -31 -43 -80 -55 -25 -5 -28 -60 -9 -57 6 5 -5 -48 -9 8 24 -4 -4 -10 -32
7724 -32 5 41 130 26 1 -38 58 40 61 20 -9 -36 21 66 -36 42 24 -9 9 4 8 -52 54 12 -24 15 -35 0 -30 24
7754 24 95 -1 0 -59 28 88 54 26 -43 -30 -35 -21 -12 12 -27 -81 15 -27 33 13 37 -10 -13 -31 59 2 -31 -49 -8 7 65 -28
$$ packed form
7536e7J07p3K4n9L9q8J52n0j1J0Jk4L4N2q8N9j8J9k7M1l5p2P7j0M6m1j4k8KM4
7566A2J6k2m8N7l3jRJ16r8p6PN3N6l8L0j44O9M1L4m5jj4j8J37r3O4q6qJ9K9j0
7597A4M0p4j9J05r2N4m0k2qK1M5j7P4j22%jN7Ll7N9n4KO2n8K6lkk2M5m9l0J0k1
7630e4J10j1q4O1J6k7n9J13k6q6M4m2J22m0Qj2n5KN3L0q4K0L9rqm4Nj6K5J1k9
7661b7N8N5r1l2J0P1k4l8Lp0Q1oN4k8k8O0p0K7Q3j16K0J9L5k4N5j03K6m5N3J8
7691B6o4j1K2L2K0m2o%j7L2M7k5m5j2l7K5L0K0k3l2N1m8O3jj0m3L9J7J6k8%ok2
7724c2L7L6Q9j04k5l9R6j8K1m1k9k7N7M5j02P8j8l3J8nMo0J06m2l6L9n0L5l0N4
7754B4P1r6Jn9Q7O0l4k8o9J3nJ4RK4l9n4R6m2O0k0K4m7lj8R0n7l3j8M1J5N8r3
$$ plain form
7786 -28 -93 35 9 -34 -5 -54 29 -18 -17 16 38 -13 -5 6 -18 28 32 22 -10 10 -66 127 27 -3 6 -70 -18 -16 2 52 -6
7817 -6 -15 -18 30 -31 -10 -13 -23 27 21 13 -76 -36 -31 13 13 9 -14 -39 -4 22 5 11 -28 -15 46 2 -39 27 -81 -56 -3 23 -11 -60 -8
7852 -8 -30 -13 17 -54 31 -28 -15 -10 47 56 4 33 -20 14 20 39 -19 -47 11 22 24 -8 -55 3 9 21 32 -22 -16 46 -25 12 13 9 -34
7887 -34 -64 -23 69 -6 -25 -47 19 73 -5 21 -74 49 2 38 70 -3 -5 -2 26 35 14 46 -14 -8 83 46 54 29 -16 -27 21 10
7919 10 27 -2 -5 -54 19 11 5 29 -58 10 -37 17 9 -30 -25 -83 -27 20 -26 -36 16 -72 -7 10 -2 -18 -17 -3 63 22 2 -30 -42
7952 -42 21 24 36 -33 -9 1 -69 31 62 1 27 -63 -8 108 28 -8 -3 -22 13 63 44 -33 -26 -17 -10 27 65 12 5 -33 18 55
7984 55 16 -38 2 0 30 20 -7 -36 -25 -41 -5 26 4 -48 -3 -20 23 43 -13 -2 -45 -55 -2 -13 36 -75 -18 5 5 16 47
8015 47 -25 8 -2 -30 42 -56 -26 -34 80 52 -2 6 77 -10 33 8 -37 -14 15 24 70 44 27 79 -44 -15 48 25 7 -57 -48
$$ packed form
7786b8o5J28k6m3K9m9Q3m7JL3K2n1QJ1k4M6Mj0l2K0p6J93j00l0Rp6N2KJ8N0n8
7817frlM8o1K1lj0N0oqq9M0NM4%mk3k5L5K6j7Ol9J3O1m4m1O6j08K5N3K6l4m9N2
7852hk2J7L0p1Q5n9J3NN7Rn2K9n3L4OJ9n8k8N8J1Kl2m7N8OJ2J1n4OO2p1L7Jmm3
7887c4l0M1R2p5j9k2O6N4p8K6r5J23m7L6L2p3kLK8Rk1L2o0OR1l7Qk5m5j1M8j1
7919A0J7k9lm9P3qoK4q7O8m7N4ql9Nn8N6M7m6j0N2q8O5J7j2j6JJ4O6m1k0l2j2
7952d2O3LJ2o9K4J0p0J00L1o1K6r0N5J16q0l6Nj9L5N0j9p7PRPL7L8n3pl8N1L7
7984E5l9n4M0kL0j0k7k9J1j6L6L1k2n2M5j7M3K0n6J1m3j0N3j1M9j11N7K3%J1L1
8015D7p2L3j0k8P2r8L0qJ14k8n4QP1q7M3k5m5K3K9RM6k6j7N2j23K9O3k3j8o4R
$$ plain form
8046 -48 -2 14 44 28 12 -10 -65 12 89 15 40 -61 -20 42 26 -4 -1 3 47 10 6 -45 -41 6 -28 70 -29 -9 10 -29 -31 -39 -52
8079 -52 -27 36 15 40 -18 13 29 -51 -5 -47 22 31 29 -9 61 75 4 10 -57 -18 49 -15 -48 -6 -21 -55 9 73 12 -1 -20 31
8111 31 -44 52 27 -64 -45 -38 -49 -40 -33 -24 -14 20 -7 -13 -32 -21 -68 17 3 -72 18 -74 -28 28 72 51 29 93 -22 -26 75 8
8143 8 -19 -23 -4 -11 36 33 -12 13 49 74 81 16 -47 -45 21 49 17 10 -29 -17 17 49 20 -3 -29 -108 3 9 59 3 0 -77 -23 62
8177 62 16 -7 -41 -54 -29 -11 106 36 -23 -39 -6 11 -28 -56
$$ packed form
8046d8M6J6L0j6j6k2n5P7P7p4K5j01M1O2j6l0LMM4l7mn1MM7l4R8r9K0J9l9kqj3
8079e2K5O3k1K5n8L1J6q0M6m2O9Rkl8P0J4p1Oo7L9O7o4l3M2j5l4O4O4o1j3j9N1
8111C1p5R6k5r1J9Pj1RPRJ0L4k7oj9J1m7Q5j4p5R0r2M6N6M4k1k2O4j15mJ01o7
8143Hk7mJ9pM7lm5K5L6K5Po5o3KO6K8l2pl9J2L4L2k9k3k6p9J11ON0n6lp7N4Q5
8177F2m6k3l4j3K5J8J17p0n9j6L3J7l9k8
8191e6
$$ Imaginary data points
##PAGE= N=2
##DATA TABLE= (X++(I..I)), XYDATA
$$ plain form
0 0 0 0 0 0 0 0 0 0 0 8 -8 8 -16 16 -16 24 -24 32 -36 40 -48 56 -64 75 -88 98 -112 128 -144 164 -185 206
32 206 -233 259 -288 323 -357 397 -441 487 -539 599 -661 733 -814 902 -1002 1120 -1252 1406
50 1406 -1593 1814 -2090 2446 -2912 3566 -4544 6172 -9377 18137 -91768 -315009 -153820
63 -153820 122705 280897 153782 -94584 -237137 -141156 62690 182179 113996 -38927
73 -38927 -130041 -88078 13100 79071 64489 8693 -41984 -55649 -35757 8594 50839 61637
85 61637 17450 -56209 -94716 -44677 61405 123355 65696 -67428 -148329 -88725 61287 159342
97 159342 107665 -47411 -160867 -126389 21741 145802 135787 8432 -118348 -137360 -42088
108 -42088 80217 128988 70892 -40160 -112874 -91550 2450 91378 103737 29671 -69671 -109732
$$ packed form
0@%%%%%%%%%Qj6J6k4L2l2M0m8N6o8P6q8J04j20J39j63J86k10K40k72L08l49L91
32B06m39M92n47O11o80P54q38R28j026J138j260J394j547J716j904K122k372K658
50A406k999L407l904M536n358O478q110J0716j5549K7514j09905k23241J61189
63a53820K76525J58192j27115k48366j42553R5981K03846J19489o8183j52923
73c8927r1114M1963J01178O5971j4582n5796n0677j3665J9892M4351M2245J0798
85F1637m4187p3659l8507N0039J06082O1950n7659j33124q0901N9604J50012R8055
97A59342n1677j55076j13456L4478J48130J24061j0015j27355j26780j9012R5272
108d2088J22305M8771n8096j11052p2714K1324R4000Q8928J2359p4066r9342m0061
$$ plain form
120 -109732 -52595 54235 113807 68477 -41818 -113760 -78157 33358 116403 90445 -23257
131 -23257 -117888 -101051 14556 120660 115227 571 -117162 -126978 -16513 113120 140543
142 140543 37414 -100832 -144645 -53897 85076 143511 71530 -59921 -129756 -79954 35838
153 35838 109437 81602 -9809 -77477 -70011 -9311 44519 53358 25089 -10128 -30747 -32412 -16978
166 -16978 11472 38679 39496 2943 -45121 -55494 -8222 55753 68545 7950 -69189 -80554
178 -80554 -5749 83832 93301 5028 -96304 -106133 -8942 100947 113843 15726 -97463 -117017
190 -117017 -27610 82299 110530 37875 -61503 -98016 -48564 33345 76585 53804 -6437 -54731
202 -54731 -58679 -20305 30858 57248 38141 -13691 -56755 -52592 -1106 53159 58074 6073 -53715
$$ packed form
120a09732N7137J06830N9572m5330j10295p1942L5603J11515Q3045k5958j13702
131b3257r4631J6837J15607J06104n433j14656j17733r816J10465J29633K7423
142A40543j03129j38246m3813R0748J38973N8435p1981j31451o9835M9802J15792
153C5838P3599k7835r1411o7668P466O0700N3830Q839k8269l5217k0619j665J5434
166a6978K8450K7207Q17l6553m8064j0373M7272O3975J2792o0595p7139j1365
178h0554P4805Q9581R469q8273j01332r829R7191J09889J2896r8117j13189j9554
190a17017Q9407J09909K8231p2655r9378l6513M9452Q1909M3240k2781o0241m8294
202e4731l948L8374N1163K6390j9107n1832m3064M163N1486N4265M915n2001n9788
$$ plain form
215 -53715 -61543 -8507 52652 59878 5850 -54311 -59666 -5755 51924 56115 5042 -48235 -52856
228 -52856 -9270 37081 44839 13918 -22807 -35228 -20236 4254 21237 24473 14466 -5652
240 -5652 -27023 -32693 -11108 26470 47639 27242 -22969 -58074 -41155 17343 64235 52955
252 52955 -9014 -64125 -59087 1964 60851 62005 5722 -53166 -59287 -9104 47195 56089 11698
265 11698 -40822 -50428 -10130 38933 48910 11460 -35946 -47067 -11775 35254 49145 17352
277 17352 -29247 -47349 -21959 22080 45241 28931 -9780 -36469 -30811 -1117 26295 31003
289 31003 12941 -11519 -24881 -19784 -1252 17682 24271 13586 -7411 -23421 -21430 -1649 20660
302 20660 26207 9338 -15426 -26383 -13842 10186 23989 15968 -5734 -20725 -16213 2613 17619
$$ packed form
215e3715p828N3036O1159P226n4028o0161n355N3911N7679M191n1073n3277m621
228e2856M3586M6351P758l0921l6725j2421J4992K4490J6983L236j0007k0118
240e652k1371n670K1585L7578K1169k0397n0211l5105J6919N8498M6892j1280
252E2955o1969n5111N038O1051N8887J154n6283n8888o121N0183N6299Q894m4391
265A1698n2520r606M0298M9063R977l7450m7406j1121L5292M7029J3891l1793
277A7352m6599j8102K5390M4039K3161j6310l8711k6689N658K9694K7412M708
289C1003j8062k4460j3362N097J8532J8934O589j0685k0997j6010J991J9781K2309
302B0660N547j6869k4764j0957J2541K4028J3803q021k1702j4991M512J8826J5006
$$ plain form
315 17619 15112 -1633 -16868 -16386 -420 16754 19096 2342 -19379 -25744 -8117 19547 31999
328 31999 14752 -19284 -39582 -24911 14296 42713 32276 -9632 -44892 -39743 1666 40817
340 40817 41329 3360 -36722 -41662 -8859 28819 36317 9672 -22691 -30609 -10404 14728 21234
353 21234 6956 -10350 -13949 -3908 6277 5958 -1362 -5573 -1789 4245 4720 -723 -5473 -4555 447
368 447 3501 1932 -832 -128 3007 2980 -2956 -9666 -8023 3904 16292 15842 -266 -19374 -23464
383 -23464 -5987 19644 30285 14891 -14397 -32032 -21767 8019 31262 27743 678 -25736
395 -25736 -28403 -5761 20897 27837 10250 -14096 -22641 -9290 11241 19211 8224 -8776 -14158
408 -14158 -3446 10885 13182 1012 -12388 -12470 1550 15792 15663 548 -15652 -17450 -3056
$$ packed form
315A7619k507j6745j5235M82J5966J7174K342j6754k1721o365J7627K7664J2452
328C1999j7247l4036k0298J4671L9207K8417j0437m1908l5260N149M1409L9151
340D0817N12l7969m0082m940L2803L7678P498k6645l2363p918K0205K5132O506
353B1234j4278j7306l599J0041J0185l19p320m211L784O034M75n443m750R18N002
368D47L054j569k764P04L135k7n936o710J643J1927J2388m50j6108j9108m090
383b3464J7477K5631J0641j5394k9288j7635J0265K9786K3243l519k7065k6414
395b5736k667K2642K6658O940j7587k4346q545J3351K0531P970j0987j7000n382
408a4158J0712J4331K297j2170j3400q2J4020J4242j29j5115j6200j798J4394
$$ plain form
421 -3056 14241 19027 7909 -8282 -16062 -10404 1902 10607 10674 4521 -2224 -6384 -7578 -5763 -393
436 -393 7465 12214 8212 -4097 -15318 -14995 -1537 14824 19185 6359 -13003 -21420 -10785 9264
450 9264 20117 11907 -7080 -18635 -12233 4976 15513 9309 -6460 -14653 -6973 7892 13465
463 13465 3107 -12555 -16389 -2958 14983 18836 3101 -17890 -23624 -7502 15953 24949 11054
476 11054 -12730 -25158 -15720 5952 20051 15587 -1106 -14077 -13545 -3312 5789 6972 2835
489 2835 -337 -377 -313 -3112 -6426 -5029 2587 10284 9735 -399 -11748 -13251 -2768 10494 14380
504 14380 5129 -8296 -12986 -5154 6569 10593 3560 -5873 -7064 900 8293 5888 -4785 -11752
518 -11752 -5502 9363 17799 9199 -10316 -22124 -13255 9869 26131 19459 -5047 -25069 -22254
$$ packed form
421c056J7297M786j1118j6191p780N658J2306Q705O7o153o745m160j194J815N370
436c93P858M749m002j2309j1221L23J3458J6361M361j2826j9362q417J0635K0049
450I264J0853q210j8987j1555O402J7209J0537o204j5769q193P680J4865N573
463A3465j0358j5662l834J3431J7941L853j5735k0991n734J6122K3455Q996j3895
476A1054k3784j2428R438K1672J4099m464j6693j2971N32J0233R101J183m137
489B835l172m0O4k799l314J397P616P697n49j0134j1349j503J0483J3262L886
504A4380r251j3425m690P832J1723M024p033r433j191P964P393k405j0673o967
518a1752O250J4865Q436q600j9515j1808Q869K3124J6262o672k4506k0022K815
$$ plain form
531 -22254 777 22736 23960 4585 -16509 -20488 -5720 12055 16291 5427 -7566 -9867 -1148
544 -1148 7351 6246 -2328 -7682 -3218 6565 10757 3711 -7903 -11997 -4152 8389 13164 5624 -6688
559 -6688 -11976 -5660 5047 9753 4802 -3371 -6130 -1922 2857 2172 -2293 -3767 1037 7226 6303
574 6303 -3185 -12714 -11070 2483 15851 15248 -707 -17711 -19460 -3452 15690 20247 5983 -13422
588 -13422 -19900 -8356 9032 15695 6816 -7283 -12716 -5361 5693 8596 1255 -7660 -8131 477
602 477 8849 7846 -2288 -11485 -10519 432 11704 12248 1108 -11961 -14782 -4647 9334 14616
616 14616 6553 -7010 -14044 -8431 3748 10953 7296 -2089 -7419 -4551 1396 3278 -100 -3132
630 -3132 -540 5241 6515 -536 -9855 -10540 365 13069 13949 1084 -13216 -14777 -1601 12945
$$ packed form
531b2254K3031K1959J224j9375k1094l979J4768J7775M236j0864j2993k301Q719
544a148Q499j105q574n354M464R783M192p046j1614m094P845J2541M775p540j2312
559f688n288O316J0707M706m951q173k759M208M779o85m465j474M804O189r23
574F303r488r529J644J3553J3368o03j5955j7004j749J6008J9142M557j4264j9405
588a3422o478J1544J7388O663q879j4099n433P355J1054K903p341q915m71Q608
602D77Q372j003j0134r197R66J0951J1272N44j1140j3069k821J0135J3981N282
616A4616q063j3563p034N613J2179P205l657r385n330K868N947J882l378l032
630c132K592N781J274p051r319o85J0905J2704Q80j2865j4300j561J3176J4546
$$ plain form
644 12945 14268 1467 -11426 -10990 1571 11498 7756 -4848 -11394 -3834 9446 13475 2788 -12012
658 -12012 -14687 -1241 15005 16962 2105 -14679 -16534 -2057 14158 16617 3702 -11178 -14212
671 -14212 -3338 9524 12077 3390 -6294 -7659 -1247 4982 4996 -127 -3994 -1974 3387 5511 1107
686 1107 -5461 -6926 -1061 6748 8873 3036 -6025 -9949 -4906 4692 9962 6141 -2856 -8362 -6112
701 -6112 959 5888 4606 -508 -4292 -3152 980 2973 361 -3326 -3463 786 4820 4231 -1515 -7481
717 -7481 -7338 -66 8518 9559 921 -9947 -12575 -3904 8494 13063 5365 -7943 -14097 -7092 6039
732 6039 12090 5261 -6412 -10286 -3114 6391 7277 -1569 -9722 -6692 5388 12863 5601 -9900 -16857
747 -16857 -6190 11751 18396 6090 -12784 -18815 -5796 12513 16986 3233 -12779 -13830 320
$$ packed form
644A2945J323j2801j2893M36J2561R927l742j2604o546P560J3280M029j0687j4800
658a2012k675J3446J6246J957j4857j6784j855J4477J6215K459j2915j4880l034
671a4212J0874J2862K553q687r684j365O412O229J4n123l867K020N361K124m404
686A107o568j465N865P809K125n837r061l924N043R598N270l821q997n506K250
701f112P071M929j282n114l784J140M132J993k612l687j37M249M034n89n746n966
717g481J43P272Q584J041q638j0868k628Q671J2398M569p698j3308o154P005J3131
732F039O051o829j1673l874P172R505Q86q846q153L030J2080P475p262j5501o957
747a6857J0667J7941O645j2306j8874o031J3019J8309M473j3753j6012j051J4150
$$ plain form
760 320 12710 9711 -4434 -13016 -6165 8386 13948 3647 -11627 -14475 -1190 14033 14848 411
774 411 -13894 -13720 -78 12824 12772 1144 -9694 -9760 -1055 6570 6728 1693 -2091 -2229 -726 -153
790 -153 -227 440 1874 2587 1473 -729 -1861 -1061 97 262 507 2112 3826 2367 -2673 -6471 -4037
807 -4037 3478 9119 6703 -2421 -9558 -7240 2496 9596 6783 -2480 -7730 -4011 3595 5885 734
822 734 -5115 -4135 3204 8134 3344 -7137 -11443 -3244 10015 14154 3818 -11366 -16297 -5488
836 -5488 10602 16338 6117 -9499 -15166 -6000 7553 11603 3332 -7149 -8677 -548 7268 5666
850 5666 -3866 -10082 -5265 6234 12003 4786 -8478 -14257 -6382 7649 13801 6376 -7002 -13082
864 -13082 -6411 5146 9603 3684 -4771 -6628 -1178 4020 2769 -2742 -5114 -729 5716 6041 -1258
$$ packed form
760C20J2390k999j4145q582O851J4551N562j0301j5274k848J3285J5223Q15j4437
774D11j4305J74J3642J2902n2j1628j0838o6Q705P625J58n035l784j38J503N73
790a53p4O67J434P13j114k202j132Q00J158J65K45J605J714j459n040l798K434
807d037P515N641k416r124p137K318R736P100k813r263n250L719P606K290n151
822G34n849R80P339M930m790j0481m306Q199J3259M139j0336j5184m931J0809
836e488J6090N736j0221j5616n667R166J3553M050q271j0481j528Q129P816j602
850E666r532o216M817J1499N769p217j3264n779P875J4031O152p425j3378o080
864a3082O671J1557M457n919q455j857N450N198j251n511k372M385O445L25p299
$$ plain form
879 -1258 -8758 -7697 1634 9823 8321 -1351 -9599 -8747 -148 7567 7672 1199 -4865 -5408 -1729 1677
895 1677 2422 1609 918 304 -578 -1513 -1449 -145 1292 1370 618 436 1206 1157 -1317 -4250 -3177 2715 8224
914 8224 6693 -2063 -10195 -8844 1955 12168 11215 -632 -11565 -10638 992 10971 9504 -932
928 -932 -8466 -5690 2992 7040 2216 -4886 -4884 2743 8719 4648 -5914 -11128 -4121 8546 13428 4806
944 4806 -8783 -13513 -4574 8425 12115 3479 -7320 -8923 -729 7155 5789 -2606 -7968 -3535
958 -3535 6066 9810 2612 -8673 -12190 -3511 9193 13461 4836 -8376 -13952 -6921 5872 12637
972 12637 7633 -3694 -10785 -8031 979 7573 6546 7 -5492 -5516 -891 3206 3005 -376 -2829
987 -2829 -1880 993 2269 453 -2697 -3597 -1161 2772 4123 1507 -3075 -5291 -3441 1195 4499 4012
$$ packed form
879a258p500J061R331Q189j502r672q248Q52Q599P715J05o473o064n43L679L406
895A677P45q13o91o14q82r35O4J304J437P8p52j82P70m9k474k933J073N892N509
914H224j531q756q132J351J0799J0213r53j1847j0933R27J1630R979j467j0436
928i32p534K776Q682M048m824p102KP627N976m071j0562n214P007J2667M882q622
944D806j3589m730Q939J2999L690q636j0799j603Q194P884j366q395n362M433
958c535R601L744p198j1285l517Q679J2704M268q625j3212n576P031J2793O765
972A2637n004j1327p091K754R010O594j027o539n499k4M625M097k01l381k453
987b829R49K873J276j816l150r00K436L933J351k616m582k216J850M636L304m87
$$ plain form
1003 4012 239 -3694 -4605 -2304 1400 3368 2586 401 -1486 -2204 -1924 -1068 24 1753 3270 2818
1019 2818 -716 -5009 -5925 -1315 5669 8503 3483 -5600 -10226 -5290 5321 11408 6582 -4795 -11360
1034 -11360 -6282 5241 11326 5589 -5692 -10397 -3470 7693 10727 1972 -9340 -10561 214
1047 214 11943 11919 -426 -12713 -12266 504 13082 13239 1191 -10907 -11871 -1922 8545 10082
1061 10082 3154 -4617 -6229 -2201 2221 3049 1328 105 635 1117 -352 -2499 -2535 463 3681 3738
1077 3738 275 -3348 -3679 -494 3023 3264 505 -2353 -2436 63 2254 1749 -914 -2754 -1677 1504
1093 1504 3661 2170 -2227 -5398 -3929 1730 6626 5792 -975 -8029 -8654 -1249 7888 10352 3208
1108 3208 -7666 -12263 -5953 5680 11899 6986 -4372 -11521 -8039 2525 9718 6959 -2368 -8825
$$ packed form
1003D012l773l933r11K301L704J968p82k185j887p18K80Q56J092J729J517m52
1019B818l534m293r16M610O984K834n020r083m626M936J0611O087m826j1377o565
1034a1360N078J1523O085n737j1281m705O927J1163L034q755j1312j221J0775
1047B14J1729k4j2345j2287M47J2770J2578J57j2048j2098r64R949J0467J537
1061A0082o928p771j612M028M422Q28j721j223N30M82j469k147l6K998L218N7
1077C738l463l623l31L185L517K41k759k858q3K499K191n05k663j840J077L181
1093A504K157j491m397l171J469N659M896q34o767p054o25P405R137K464p144
1108C208j0874m597O310J1633O219m913j1358p149L482J0564P193k759r327o457
$$ plain form
1122 -8825 -6382 1925 7338 4567 -3125 -7487 -4103 3279 6880 3072 -4238 -7422 -3340 3885 6892
1137 6892 3031 -3699 -6740 -3426 2587 5382 2968 -1560 -3772 -2401 206 1239 692 552 1520 1741
1153 1741 -538 -3967 -4549 -300 5817 7534 2139 -6233 -9520 -3699 6129 10784 5400 -4916 -10276
1168 -10276 -5578 4449 9775 5426 -3884 -8445 -3842 4814 8497 3266 -5279 -8160 -2267 6638
1182 6638 9348 2975 -6492 -9736 -3402 6494 10592 5101 -4814 -10058 -5937 3601 9874 7245 -1289
1197 -1289 -7986 -7135 -136 6394 6862 1660 -4050 -5187 -1727 2408 3436 1372 -1037 -1178 147 784
1213 784 -427 -1744 -1169 1434 3039 1676 -1717 -3765 -2156 1590 3545 1775 -1943 -3292 -911
1228 -911 2363 2795 -697 -3991 -3019 1821 5408 3317 -3298 -7691 -4827 3312 8930 5783 -3722 -10533
$$ packed form
1122h825K443Q307N413k771p692m362L384P382L601l808p310l184M082P225L007
1137F892l861o730l041L314O013K795k414m528k212J371K607J033n47j40R68K21
1153A741k279l429n82M249O117J717n395q372l287N821R828M655n384j0316n360
1168a0276M698J0027N326m349r310m561M603Q656L683n231q545k881N893Q905
1182F638K710o373r467l244O334R896M098n491r915n244M121R538O273k629q534
1197a289o697Q51O999O530M68n202n710j137L460M135J028k064k409j41J325O37
1213G84j211j317N75K603J605j363l393k048J609L746J955j770l718j349K381
1228i11L274M32l492l294R72M840L587k091o615m393K864Q139N618l147r505o811
$$ plain form
1244 -10533 -7779 2412 10649 8673 -1697 -10677 -9876 -133 9171 9452 939 -8053 -9038 -1894 5963
1259 5963 7037 1140 -5184 -5688 -330 4501 3927 -1165 -5095 -3551 1964 5599 3609 -2359 -6053
1274 -6053 -4131 1684 5586 4260 -593 -4483 -3926 -324 2692 2716 737 -752 -597 -219 -644 -1416 -775
1291 -775 1639 3612 2712 -1296 -4990 -4321 780 6005 6208 678 -5596 -6891 -1554 5271 7442 2958
1307 2958 -3954 -6695 -2781 3668 6216 2668 -2947 -4848 -1283 3860 4871 685 -4489 -4940 359
1322 359 6030 6135 220 -6229 -6847 -813 6406 7910 2194 -5247 -7511 -2877 4106 6672 3263 -2376
1338 -2376 -4919 -2624 1411 3170 1672 -849 -1264 4 841 -261 -1784 -1385 1103 3107 2101 -1486
1354 -1486 -4236 -3164 1182 4588 3567 -1038 -4702 -3817 393 3857 3081 -854 -3717 -2478 1319
$$ packed form
1244a0533K754J0191Q237j976j0370q980Q01R743R304K81q513q992r85P144P857
1259E963J074n897o324n04N358M831n74n092l930J544N515L635j990n968l694
1274f053J922N815L902j326m853l890N57L602L016K4j979j489J55L78m25p72O41
1291g75K414J973r00m008l694O69N101N225K03n530o274j295N337O825K171m484
1307B958o912k741L914O449K548l548n615j901L565N143J011m186n174m51N299
1322C59N671J05n915o449o18O034P219J504n716p441k264M634O983K566l409n639
1338b376k543K295M035J759j498k521m15J268Q37j102j523L99K488K004j006l587
1354a486k750J072M346L406j021m605l664Q85M210L464p76l935k863J239L797
$$ plain form
1369 1319 3246 979 -3012 -4148 -790 3875 4976 668 -5148 -6785 -2106 4943 7565 3106 -4627
1384 -4627 -8287 -4733 2851 7406 5064 -1799 -6628 -5328 525 4917 3958 -469 -3703 -2842 464
1399 464 2614 1330 -1471 -2376 -291 2418 2409 -661 -3424 -2729 876 3812 3194 -623 -3880 -3343 347
1416 347 3434 3015 -207 -2503 -1755 780 2043 578 -1548 -1749 817 3402 2679 -1442 -4879 -3547
1432 -3547 1930 6376 5274 -849 -6495 -6248 143 6730 7297 1071 -5850 -6825 -1227 5264 6531 1765
1448 1765 -4199 -5292 -983 4209 4722 503 -3820 -3508 746 4168 3222 -1107 -4079 -2721 1735 4645
1464 4645 2886 -1677 -4466 -2694 1576 4051 2735 -765 -2963 -2299 261 1814 1291 -110 -546 114
1480 114 419 -508 -1696 -1487 553 2632 2672 -37 -3538 -4139 -1155 3175 4817 1985 -2863 -5388 -3241
$$ packed form
1369A319J927k267l991j136L358M665J101m308n816j637M679P049K622m459p733
1384d627l660L554P584M555k342o863m829J300N853M392r59m427l234Q61L306
1399D64K150j284k801r05K085K709rl070k763O95L605K936o18l817l257N37L690
1416C47L087m19l222k296P48K535J263j465k126k01K566K585p23m121l437J332
1432c547N477M446j102o123n646K47O391O587N67o226o921r75N598O491J267m766
1448A765n964j093M309N192N13m219m323L12M254L422r46m329k972J358M456K910
1464D645j759m563k789J772M270K475j316l500k198O64K560J553n23j401m36O60
1480A14L05r27j188K09K040K079M0k709l501o01K984M330J642k832m848k525K147
$$ plain form
1497 -3241 1805 5101 3540 -1628 -5279 -3925 1088 4571 3269 -1476 -4791 -3271 1598 4762 2681
1512 2681 -2639 -5595 -2798 3048 5776 2542 -3653 -6616 -3258 3277 6635 3517 -3062 -6547 -3956
1527 -3956 1998 5385 3551 -1116 -4042 -2985 337 2376 1532 -338 -1043 19 781 -16 -1484 -1303
1543 -1303 590 2511 2204 -452 -3032 -2596 673 3433 2812 -688 -3289 -2512 1062 3617 2619 -1163
1559 -1163 -3629 -2154 1954 4300 2290 -2167 -4495 -1965 2859 5266 2585 -2793 -5551 -2912 2987
1574 2987 6355 3960 -2155 -6087 -4276 1406 5956 5153 -48 -4618 -4794 -681 3658 4418 1456 -2211
1590 -2211 -3314 -1331 1599 2685 1268 -1088 -1819 -495 1251 1527 230 -1327 -1453 45 1551 1457
1606 1457 -191 -1660 -1392 250 1407 1076 -419 -1108 -530 497 499 -589 -1204 -195 1717 1860 -564
$$ packed form
1497c241N046L296j561n168l651J354N013L483j302m745l315J520M869L164k081
1512B681n320k956K797N846K728l234o195k963L358O535L358l118o579l485K591
1527c956N954L387j834m667k926J057L322K039q44j870p05J062P62p97j468J81
1543a303J893J921l07k656k580M36L269K760o21l500k601P77L574K555r98l782
1559a163k466J475M108K346k010m457k328K530M824K407k681n378k758K639N899
1574B987L368k395o115l932J811N682M550q03n201m570j76M113M339P60k962l667
1590b211j103J983K930J086j417k356p31J324J746K76j297j557j26J498J506r4
1606A457j648j469K68J642J157l31j495o89N78J027Kj088o15J009J912J43k424
$$ plain form
1623 -564 -3426 -3215 463 4567 4366 -538 -5851 -6072 -451 5995 6716 696 -6231 -7256 -1467 5441
1639 5441 6583 1238 -5076 -6156 -1170 4515 5002 220 -4595 -4456 136 4367 3781 -757 -4547 -3872
1655 -3872 607 4234 3562 -396 -3825 -3472 -133 2911 3005 547 -2098 -2608 -962 1122 1889 1028 -195
1672 -195 -925 -865 -407 -103 336 884 1173 787 -543 -1875 -1734 172 2408 2943 868 -2099 -3362 -1447
1690 -1447 1945 3847 2283 -1306 -3491 -2128 1472 3583 2253 -1238 -3285 -1722 2018 3923 1896
1705 1896 -2263 -4258 -1723 3012 5131 2475 -2819 -5466 -2850 2877 6148 3723 -2260 -5972 -4038
1720 -4038 1827 5841 4360 -1007 -5026 -4056 561 4149 3419 -370 -3136 -2211 716 2311 931 -1371
1736 -1371 -1827 213 2205 1618 -1189 -2978 -1732 1485 3154 1479 -1720 -3067 -1146 1733 2393 175
$$ packed form
1623e64k862K11L678M104k01m904n313k21N621O446P21o020o927j025N789O908
1639E441J142n345o314j080M986N685M87m782m815J39M592M231n86m538l790O75
1655c872M479L627o72l958l429L53L339L044R4k458k645n10J646K084P67q61j223
1672a95p30O0M58L04M39N48K89l86j330j332J41J906K236N35k075k967j263J915
1690a447L392J902j564l589k185J363L600K111j330l491k047J563L740J905k027
1705A896m159j995K535M735K119k656n294k647K616N727L271k425n983l712J934
1720d038N865M014j481n367m019R70M617L588p30l789k766R25K927J595j380k302
1736a371m56K040J992n87k807j789J246L217J669j675l199j347J921K879O60k218
$$ plain form
1752 175 -2272 -2040 625 2577 1358 -1936 -3585 -1616 2355 4168 1585 -2967 -4966 -2362 2588
1767 2588 4954 2572 -2400 -5123 -3314 1392 4378 3305 -762 -3930 -3617 -330 2907 3145 558
1782 558 -2303 -2918 -956 1515 2213 702 -1473 -2010 -482 1520 1743 -36 -2028 -1980 54 2244 2262
1799 2262 23 -2386 -2385 -135 2176 2324 390 -1513 -1612 -137 1078 804 -149 -379 427 1096 279 -1417
1817 -1417 -1787 -3 2497 3093 484 -2929 -3781 -668 3517 4594 1370 -3280 -4639 -1408 3273 4830
1833 4830 1802 -2671 -4259 -1335 2907 4025 1126 -2719 -3411 -227 3351 3550 -3 -3605 -3450 265
1849 265 3929 3826 23 -3758 -3770 -304 3340 3641 818 -2488 -2994 -798 1685 2037 644 -883 -999
1866 -999 -119 444 54 -595 -335 671 1236 342 -1291 -1970 -748 1416 2271 826 -1577 -2589 -1317
$$ packed form
1752A75k447K32K665J952j219l294j649J969L971J813k583m552j999K604M950
1767B588K366k382m972k723J809M706K986j073m067l168L13L287L237K38k587
1782E58k861o15J962K471O98j511k175n37J528K002K23j779j992M8K034K190J8
1799B262k239k409JK250K311J48j934j903r9J475J215k74r53k30Q06O69q17j696
1817a417l70J784K500N96k609l413q52L113M185J077l224m650j359L231M681J557
1833D830l028m473j588K924M242J118k899l845o92L184L578J99l553l602J55L715
1849B65L664j03l803l781j2L466L644L01k823l306n06K196K483L52j393j527j16
1866i99Q80N63l90o49K60J006N65q94j633o79J222K164Q55j445k403j012J272
$$ plain form
1883 -1317 1224 2448 1263 -1184 -2584 -1513 887 2155 1067 -1207 -2450 -1239 1241 2472 1017
1898 1017 -1789 -3248 -1516 1880 3601 1884 -2145 -4490 -2733 1667 4624 3159 -1435 -4819 -3681
1913 -3681 730 4335 3648 -556 -4021 -3425 325 3374 2733 -537 -2892 -2075 718 2453 1362 -1224
1929 -1224 -2256 -587 1679 2051 67 -1967 -1747 373 2258 1805 -512 -2087 -1368 761 1967 1083
1945 1083 -864 -1424 -198 1530 1441 -425 -1931 -1278 1258 2979 1757 -1300 -3484 -2162 1510 4053
1961 4053 2937 -887 -3844 -3163 572 3820 3573 131 -3196 -3264 -221 2924 3189 376 -2358 -2562
1977 -2562 -196 2277 2484 231 -2132 -2165 103 2209 2096 -125 -2247 -1999 293 2323 2122 -78
1993 -78 -2205 -2065 -194 1857 1989 415 -1478 -1738 -428 788 1035 308 -454 -322 58 48 -545 -947
$$ packed form
1883a317K541J224j185k447j400J071K400J268j088k274j243J211K480J231j455
1898A017k806j459J732L396J721j717m029k345J757M400K957j465m594l384J138
1913c681M411L605o87m204l465N96L750L049o41l270k355Q17K793J735j091k586
1929a224j032J669K266L72j984k034K20K120J885m53k317j575P19K129J206q84
1945A083j947n60J226J728q9j866j506O53K536J721j222l057k184J322L672K543
1961D053j116l824k957O81L735L248k47l442l327o8L043L145K65k813k734k04
1977b562K366K473K07k253k363l3K268K106j13k221k122K48K292K030k01k200
1993g8k127J40J871K051J32j574j893k60J310J216K47p27p62J32L80j0n93m02
$$ plain form
2011 -947 -226 996 1634 407 -1617 -2376 -985 1469 2596 1116 -1720 -3054 -1498 1408 2836 1349
2027 1349 -1679 -3100 -1491 1586 2807 988 -1918 -2918 -923 1921 2769 486 -2458 -3100 -534
2042 -534 2598 3094 432 -2772 -3359 -821 2468 3354 1078 -2152 -3201 -1253 1511 2495 1230 -885
2058 -885 -1787 -935 505 960 322 -406 -277 433 708 39 -922 -889 176 1257 1322 80 -1300 -1327 35
2077 35 1477 1455 100 -1205 -1156 238 1404 1169 -277 -1350 -844 806 1874 1030 -1068 -2126 -923
2094 -923 1561 2745 1419 -1445 -3072 -1632 1617 3621 2305 -1171 -3448 -2370 921 3328 2689
2109 2689 -335 -2808 -2300 297 2419 1989 -240 -1850 -1280 621 1768 922 -872 -1689 -624 1259
2125 1259 1834 483 -1496 -1869 -389 1439 1738 366 -1337 -1706 -286 1177 1253 15 -1204 -928 220
$$ packed form
2011i47P21J222O38j227k024p59J391K454J127j480k836j334J556K906J428j487
2027A349l028j421J609L077J221j819k906j000J995K844Q48k283k944o42K566
2042e34L132M96k662l204n87K538L289Q86k276l230j049J948K764R84j265k115
2058h85r02Q52J440M55o38p28J29P10K75o69r61L3J065J081O5j242j380k7J362
2077C5J442k2j355j305M9J394J166k35j446j073N06J650J068q44k098j058J203
2094i23K484J184j326k864j627J440L249K004j316l476k277J078L291K407o39
2109B689l024k473N08K597K122m30k229j610N70J901J147q46j794q17J065J883
2125A259N75j351j979l73J480J828K99j372j703l69J420J463P6j238j219K76J148
$$ plain form
2142 220 891 288 -878 -1195 -67 1298 1277 -377 -2138 -1943 280 2313 2268 -209 -2782 -2985 -493
2159 -493 2422 2964 542 -2395 -3119 -935 1852 2563 679 -1733 -2331 -609 1547 1872 79 -1893
2175 -1893 -1825 221 2008 1745 -348 -2305 -2104 231 2322 2153 -113 -2225 -2270 -183 1859 2116 367
2192 367 -1452 -1762 -488 1081 1304 272 -696 -634 212 608 95 -563 -595 419 1324 951 -455 -1690
2210 -1690 -1219 650 2090 1672 -291 -1974 -1629 312 2006 1694 -194 -1683 -1274 585 1791 1115
2226 1115 -752 -1691 -757 1235 2150 862 -1331 -2242 -683 1738 2677 1011 -1550 -2589 -1189 1469
2242 1469 2704 1455 -1104 -2464 -1403 790 2139 1326 -499 -1555 -1038 334 1109 519 -419 -688
2258 -688 -77 633 474 -478 -1094 -624 631 1311 633 -808 -1575 -943 572 1416 720 -622 -1281 -670 378
$$ packed form
2142B20O71o03j166l17J128J365k1j654j761J95K223K033m5k477k573k03K492
2159d93K915N42k422k937p24K184K787P11j884k412n98J722K156L25j793j972
2175a893O8K046J787k63k093j957K01K335K091j69k266k112m5K087K042K57j749
2192C67j819l10J274J569K23j032r68O2Q46L96n13o58l2J014R05l73j406j235
2210a690M71J869J440m18j963j683L45J941J694l12j888j489M09J859J206o76
2226A115j867r39R34J992R15j288k193r11J559K421R39j666k561j039J400K658
2242A469J235j249k559j360J061K193J349q13j825j056N17J372P75n90r38k69
2258f88O11P10j59r52o16M70J255O80o78j441p67O32J515Q44o96j342o59O11J048
$$ plain form
2277 378 820 191 -810 -887 121 1042 785 -691 -1741 -1114 671 1878 1273 -840 -2372 -1845 437
2294 437 2283 1945 -386 -2428 -2251 -62 2008 2059 208 -1789 -2041 -292 1477 1522 48 -1299 -1228
2311 -1228 216 1255 843 -610 -1504 -865 822 1776 804 -1042 -1917 -935 1042 1812 893 -766 -1652
2328 -1652 -795 724 1353 471 -607 -775 107 829 535 -442 -938 -242 1090 1520 391 -1308 -1648 -247
2346 -247 1609 2135 538 -1447 -2065 -612 1697 2325 946 -1288 -1973 -645 1308 1897 822 -1042
2362 -1042 -1614 -408 1158 1543 285 -1245 -1325 68 1519 1565 60 -1698 -1765 -1 1829 2011 369
2379 369 -1579 -2001 -557 1385 1814 610 -1012 -1559 -587 746 1138 276 -730 -722 63 736 404 -532
2397 -532 -933 -322 825 1183 94 -1235 -1494 -307 1223 1413 169 -1469 -1642 -354 1177 1396 116
$$ packed form
2277C78M42o29j001p7J008R21k57j476j050O27J785J207o05k113j532N27K282
2294D37J846l38k331k042J77K189K070N1j851j997k52J749J769M5j474j347P1
2311a228J444J039m12j453q94O39J687R54r72j846q75R82J977P70r19j659q86
2328a652Q57J519O29q82j078j68Q82P22k94r77m96O96J332M30j129j699l40J401
2346b47J856N26j597j985o18J453K309O28j379k234o85J328J953N89j075j864
2362a042n72J206J566L85j258j530q0J393J451M6j505j758o7J764J830J82j642
2379C69j948m22J444J942M29j204j622n47R72J333L92q62j006QP85O73l32r36
2397e32m01O11J147L58j089j329k59J187J530J90j244j638j73J288J531K19j280
$$ plain form
2414 116 -1402 -1434 -43 1234 1036 -403 -1504 -1052 542 1524 901 -949 -2148 -1192 977 2263 1194
2431 1194 -1091 -2438 -1598 787 2314 1535 -699 -2173 -1483 465 1750 1181 -532 -1509 -828 475
2447 475 1276 551 -769 -1146 -216 851 1028 -23 -1050 -971 216 1174 982 -172 -1175 -840 256 1153
2465 1153 916 -131 -831 -604 195 790 487 -183 -487 -50 620 668 -32 -755 -596 361 1201 1059 -76
2484 -76 -1198 -1198 4 1378 1667 417 -1130 -1613 -397 1156 1643 656 -946 -1424 -522 964 1343 394
2502 394 -920 -1091 -51 1195 1086 -67 -1227 -1123 296 1528 1088 -460 -1593 -1132 464 1597
2518 1597 1069 -567 -1509 -939 455 1209 689 -476 -1089 -413 482 630 -121 -844 -606 372 1096 471 -786
2537 -786 -1493 -677 816 1635 705 -981 -1790 -941 658 1550 755 -866 -1618 -805 618 1270 477 -853
$$ packed form
2414A16j518l2J391J277j98j439j101M52J594R82o23j850j199R56K169J286j069
2431A194k285j347Q40K385J527p79k234j474O90J948J285n69j713r77O81J303
2447D75Q01p25j320l77R30J067J77j051j027P9J187R58j92j154j003L35J096Q97
2465A153k37j047p00K27P99N95l03o70l04M37O70M8p00p23J59R57Q40j42j135
2484g6j122%J202J374K89j250j547m83J216J553M87r87j602m78R02J486L79r49
2502C94j314j71J040J246j09j153j160J04J419J232m40j548j133M61J596J133
2518A597n28j636r42N70J394P54n20j165o13O76Q95J48p51p23K38R78P24o25j257
2537g86p07Q16J493Q19r30j686q09Q49J599Q92p95j621p52Q13J423O52p93j330
$$ plain form
2555 -853 -1310 -459 841 1134 106 -1066 -1256 -159 1050 1160 68 -1231 -1393 -161 1162 1307 162
2572 162 -1118 -1400 -369 958 1245 479 -704 -1116 -435 504 761 261 -374 -481 25 475 354 -202 -613
2591 -613 -212 564 954 370 -603 -1034 -433 727 1340 645 -644 -1191 -441 734 1350 569 -711 -1086 -283
2610 -283 935 1214 205 -1001 -1075 176 1486 1296 -314 -1542 -1200 535 1825 1427 -410 -1850 -1440
2627 -1440 494 1968 1549 -275 -1772 -1449 263 1606 1157 -219 -1283 -838 422 1072 555 -573
2643 -573 -913 -218 774 966 50 -939 -907 -12 896 899 25 -926 -914 -80 731 653 -51 -659 -585 33 544 341
2665 341 -308 -654 -267 335 567 90 -720 -879 -168 740 916 55 -962 -1295 -430 834 1280 431 -948
2684 -948 -1525 -776 750 1419 720 -647 -1377 -746 468 1099 449 -661 -1120 -397 679 1005 227 -970
$$ packed form
2555h53m57Q51J300K93j028j172j90J097J209J10j092j299j62J232J323J45j145
2572A62j280k82J031J327K87p66j183m12O81R39K57n00o35j07N06M50j21n56m11
2591f13M01P76L90n84r73m31O01J160O13o95j289n47P50J175O16p81j280l75Q03
2610b83J218K79j009j206p4J251J310j90j610j228L42J735J290l98j837j440M10
2627a440J934J474m19j824j497L23J712J343m49j376j064M45J260O50n17j128
2643e73l40O95R92J92r16r89L2Q95R08Lq74r51J2Q34Q11p8p04o08P4O18N11k03
2665C41o49l46L87O02K32m77q10j59P11R08J76q61j017l33Q65J264M46q49j379
2684i48n77P49J526O69o99j367p30O31J214O31o50j110m59P23J076L26p78j197
$$ plain form
2702 -970 -1128 -252 966 1085 109 -1051 -1245 -203 1049 1157 165 -826 -990 -195 795 839 106 -541 -587
2721 -587 164 628 343 -303 -430 -1 643 601 -229 -840 -578 444 1190 783 -373 -1146 -825 469 1340
2740 1340 937 -321 -1230 -724 449 1148 664 -453 -1028 -379 717 1172 392 -711 -1152 -281 901 1332
2758 1332 397 -871 -1278 -515 810 1302 653 -572 -1159 -599 508 1084 636 -301 -879 -572 202 750
2776 750 392 -180 -504 -243 188 323 21 -364 -332 66 433 278 -243 -718 -380 229 643 347 -384 -892
2796 -892 -479 305 701 262 -545 -776 -248 554 643 -74 -941 -875 44 1062 927 -244 -1316 -1145 181
2815 181 1285 1147 -230 -1446 -1446 34 1405 1336 -100 -1353 -1335 -66 1196 1146 42 -1071 -1093 -6
2833 -6 986 848 -39 -928 -666 230 841 563 -313 -884 -545 399 910 468 -335 -785 -434 354 683 379 -289
$$ packed form
2702i70j58Q76J218J19r76j160j94J042J252J08r92r91j64P95R90M4p33o47m6
2721e87P51M64k85o46j27M29O44m2q30o11K62J022P46m07j156p73L21J294Q71
2740A340m03j258r09N06J173O99m84j117n75O49J096M55p80j103m41Q71J182M31
2758A332r35j268m07P63J325M92o49j225n87N60J107N76m48r37n78L07P74N48
2776G50l58n72l24K61M31J35l02l85L2L98L67j55n21m75L38O09M14k96p31n08
2796h92M13P84L96m39q07k31N28Q02Q9p17q67O6R19J018j35j171j072J71J326
2815A81J104j38j377j216%J480J371o9j436j253J8J269J262n0j104j113k2J087
2833fR92j38q87q89K62Q96O11k78q76n71L39R44N11m42q03m50L51P88L29l04o68
$$ plain form
2854 -289 -485 -184 304 401 30 -297 -196 258 509 220 -409 -642 -138 627 851 324 -652 -1028 -249 729
2874 729 1192 440 -727 -1120 -441 751 1258 651 -611 -1082 -503 685 1237 546 -518 -1059 -397 658
2892 658 1165 470 -683 -1086 -274 781 1185 389 -743 -1129 -477 731 1174 519 -568 -1060 -508 488
2910 488 847 415 -312 -659 -293 242 356 85 -341 -306 100 315 128 -357 -509 -54 491 493 -162 -693 -636
2931 -636 119 636 546 -186 -829 -733 88 728 651 -247 -874 -605 287 784 488 -408 -1012 -557 479 1061 545
2952 545 -571 -1288 -791 445 1269 786 -381 -1187 -982 211 1041 860 -150 -965 -798 17 788 675
2970 675 -47 -694 -535 134 549 346 -228 -480 -257 233 399 94 -172 -289 23 311 351 -39 -334 -263 169
2991 169 439 271 -172 -354 -42 293 398 -27 -364 -419 188 712 564 -180 -787 -567 254 1120 882 -89
$$ packed form
2854b89j96L01M88R7l71l27J01M54K51k89o29k33N04P65K24n27r76l76P79R78
2874G29M63p52j167l93O79J192N07o07j262m71N79J188N52o91j064n41O62J055
2892F58N07o95j153m03Q12J055M04p96j132l86O52J208M43o55j087m92N52R96
2910D88L59m32p27l47L66N35J14k71m26L5M06K15j87m85j52M55N45Ko55n31N7
2931f36P55N17r0p32o43R6Q21O40p7q98o27K69Q92M97k96q96o04M55J036N82n16
2952E45j116p17M97J236Q24m83j167q06K05J193Q30j81j010q15J67Q15P71j13
2970F75p22o47J59O69M15k03n74k52K23M90J66l05k66j17L12K88M0l90k95P1M32
2991A69K70j68m43j82L12L35J05m25l37n5O07N24j48p44o07K20Q21Q66k38r71
$$ plain form
3011 -89 -1055 -940 75 1142 1101 131 -920 -1008 -74 928 1076 227 -898 -957 -109 874 959 65 -806 -821
3031 -821 -23 799 763 2 -784 -749 -24 731 639 -203 -703 -599 37 574 547 -50 -525 -493 37 302 202 -74
3053 -74 -176 -132 186 61 -227 -303 -111 290 514 113 -604 -783 -298 516 825 265 -550 -979 -430 492 864
3074 864 413 -598 -974 -434 558 897 277 -612 -996 -429 655 998 313 -733 -1146 -361 658 1037 351
3093 351 -698 -1121 -521 626 1108 559 -518 -1064 -590 376 941 549 -294 -789 -452 184 512 315 -82
3112 -82 -363 -167 265 257 -1 -256 -149 167 403 226 -157 -343 -89 340 416 136 -344 -340 75 496 464 -78
3134 -78 -433 -324 232 660 536 -195 -692 -406 406 919 601 -361 -977 -623 453 1059 729 -305 -1071 -776
3154 -776 200 1006 848 -81 -912 -794 6 835 722 32 -671 -637 59 527 510 -97 -544 -480 147 582 453
$$ packed form
3011h9r66J15J015J067m1r70j051q8R34J002J48q49j125n9Q48R83Q5q94q71j5
3031h21P98Q22l6p61p86L5P25P55r2q42n00J04O36N37k7n97m75L2N30K65j00k76
3053g4j02M4L18j25k88p6J92M01K24m01p17j79M85Q14L09n60q15m29N49R22L72
3074H64m51j011l76N40R92L39o20q89l84N67J084L43o85j046m13P85J019L79o86
3093C51j049m23O00J147M82n49j077n46M74R66N65l92q43m95L37O36L28j97l97
3112h2k81J96M32qk58k55J07L16K36j77l83j86K54M29P6k80m80MM15M21l2n42
3134g8l55J09N56M28j24p31m97K86Q12N13l18r62o16L54J076O06l30j034p66K95
3154g76R76Q06j58r29q31J18Q00Q29j13o90p03L4O96M68j7o07m47O4O27M35j29
$$ plain form
3175 453 -190 -516 -295 124 380 255 -95 -408 -252 74 200 137 2 -151 8 75 1 -144 -290 5 261
3196 261 250 -110 -544 -495 127 545 538 -79 -724 -739 -4 660 770 115 -717 -905 -274 680 799 106 -656 -803
3218 -803 -126 628 733 115 -682 -773 -12 664 761 37 -668 -796 -75 697 724 161 -628 -735 -134 542 648
3239 648 161 -419 -465 -107 344 398 81 -171 -202 4 140 87 11 -40 183 238 130 -263 -294 -111 355 539 188
3262 188 -299 -482 -185 348 614 243 -327 -614 -196 455 654 213 -437 -673 -154 488 795 196 -581 -784
3282 -784 -222 595 925 446 -476 -909 -456 473 927 455 -337 -924 -568 254 754 589 -243 -691 -539 125
3302 125 598 402 -134 -431 -311 177 329 147 -293 -355 -132 281 274 -18 -321 -324 -5 295 226 -134 -355 -172
3324 -172 177 169 10 -307 -318 108 413 290 -219 -612 -374 278 695 481 -346 -860 -573 247 802 617 -265
$$ packed form
3175D53o43l26K21M19K56j25l50l13J56L26J26o3j35j53J59O7p4j45j46K95K56
3196B61j1l60m34M9O22M18po17o45j5P35O64J10o55q32j88O31R54J19o93p62j47
3218h03O77P54J05o18p97r1P61O76R7p24p05j28P21P72K7n63p89j07O01O76J06
3239F48m87n80m6L58M51N4l17k52l1K06J36n3p6n1K23N5j08l93l1J83M66J84l51
3262A88m87j83K97N33K66l71n70k87M18O51J99m41o50k36N19O42L07n99p77k03
3282g84N62Q17L30m79r22m33M53R29M54m72p92n87L56Q22N00j65q32m48J52O64
3302A25M73j96n36k97J20M88J52j82m40o2K23M13pk92l03lL19L00o9l60k21J83
3324a72L49qj59l17j1M26L05j23n09l93K38O52M17k14q27n14K87Q20N55j85q82
$$ plain form
3345 -265 -901 -673 154 868 648 -131 -821 -690 65 672 577 3 -608 -569 -21 604 526 26 -514 -438 90
3366 90 573 456 7 -491 -438 89 422 470 43 -383 -404 -51 297 336 92 -182 -213 -47 94 91 34 69 152 184
3390 184 -36 -195 -288 30 311 418 54 -265 -362 -45 447 632 173 -457 -487 -139 462 696 193 -467 -631
3411 -631 -135 530 711 143 -487 -623 -85 603 686 114 -626 -687 -136 586 734 205 -551 -773 -257 458 753
3432 753 307 -374 -593 -269 270 421 242 -212 -290 -84 82 104 -35 -119 -105 51 38 -108 -210 -219 44 206
3454 206 89 -187 -342 -178 166 272 29 -269 -322 -115 248 402 11 -270 -491 -102 362 532 61 -544
3474 -544 -576 -189 528 656 321 -411 -725 -399 315 722 426 -217 -727 -498 188 698 479 -176 -602 -454
3494 -454 176 537 397 -79 -499 -307 108 399 333 -110 -403 -276 171 378 229 -133 -351 -156 148 307
$$ packed form
3345b65o36K28Q27P14k20p79o90J31P55O07r5n74o11L9N48O25p8n00n40P6N28
3366I0M83j17m49m98N3N27L33M8m27m26k1L53L48L9k44k74l1J66J41ln7L5Q3L2
3390A84k20j59r3L18K81J07l64l19r7L17M92J85m59o30l0L48O01K34n03o60j64
3411f31M96O65J81n68o30j36N38O88Q3n72p40o1N51P22J48n29p56k22N16P15K95
3432G53m46o81k19L24N39J51j79m54p8K06J66K2j39q4J4J56j3j46j02rK63J62
3454B06j17k76j55J64L44J06k43k98n3K07L63J54l91k81k21L89M64J70m71o05
3474e44l2L87P17J28l35p32l14L26P14M07k96o43n10K29O86N10k19o55m26J48
3494d54O30L61j40m76m20J92M15K91o6m43k93J27M47K07j49l62k18J95L04J59
$$ plain form
3514 307 6 -121 -124 39 216 81 6 -97 32 275 202 -96 -407 -154 182 497 323 -196 -598 -320 260
3535 260 704 554 -104 -562 -496 160 636 585 -57 -624 -515 113 585 517 -84 -600 -501 48 591 447 -72
3556 -72 -621 -461 58 563 519 -76 -479 -484 -43 457 523 42 -420 -515 -91 330 364 137 -242 -338 -153 84 154
3579 154 65 -87 -135 -45 50 -92 -117 -124 64 83 100 -197 -308 -199 128 283 105 -222 -342 -117 210 348 98
3602 98 -337 -424 -50 317 386 32 -397 -518 -105 429 577 139 -487 -626 -205 416 604 210 -440 -644 -271
3623 -271 377 641 362 -284 -554 -351 321 455 308 -137 -383 -147 280 287 143 -146 -168 -88 214 216 29 -123
3645 -123 -197 36 183 118 -9 -93 -53 46 102 -14 -167 8 135 200 82 -129 -224 -58 209 386 215 -216 -425
3668 -425 -92 289 515 214 -273 -427 -256 251 561 317 -170 -576 -354 137 453 363 -87 -539 -357 104
$$ packed form
3514C07l01j27lJ63J77j35p5j03J29K43p3k98l11K53L36L15j74n19m02K78N80
3535B60M44j50o58m58O6O56M76n1o42n67J09O28M72o8o01n16R9N49N43j44n19
3556g2n49J60N19N05m4n95m03nM41N00O6m81m62r5M24M21L4k27l79r6J85K37P0
3579A54q9j52m8R0R5j42k5pJ88J9J7k97j11J09L27J55j78l27j20K25L27J38k50
3602I8m35q7L74L67O9l54m29j21M13N34J48m38o26j39M21O21J88l94o50k04L73
3623b71O48K64k79o46k70K03O72J34j47m45k46K36M27Pj44k89k2Q0L02Kj87j52
3645a23p4K33J47o5j27q4M0R9N6j16j53J75J27O5j18k11r5J66K67J77j71m31k09
3668d25L33L81K26l01m87j54J71N07L10k44m87m06K22M91L16r0m50m52J82M61
$$ plain form
3688 104 478 333 -108 -432 -290 129 390 304 -115 -415 -281 72 370 191 -134 -336 -274 6 225 203 -75
3709 -75 -233 -147 101 129 41 -133 -29 -39 7 -58 -150 -224 74 166 210 -87 -313 -250 70 336 237 -57 -382 -401 7
3734 7 378 374 -18 -402 -369 26 419 360 -78 -410 -309 117 483 337 -93 -522 -390 33 495 369 -44 -496
3756 -496 -461 9 409 405 -17 -408 -352 -64 308 355 49 -211 -235 -42 228 203 8 -115 -156 26 155 116 -71
3779 -71 -77 1 150 114 -56 -155 -130 71 209 216 -73 -265 -126 170 305 105 -158 -296 -67 252 328 65 -267
3802 -267 -298 -113 364 424 50 -290 -449 -62 262 487 157 -296 -532 -186 254 522 219 -277 -473 -198 164
3823 164 355 219 -114 -398 -223 171 280 146 -106 -249 -138 229 298 121 -132 -221 -99 143 129 49 -74
3844 -74 -201 -64 71 108 -29 -111 -76 26 83 -73 -138 -116 42 164 108 -175 -281 -103 73 331 160 -157 -390
$$ packed form
3688A04L74j45m41l24J42M19K61q6m19l00J34L53K98j79l25k02O2K80K19k2k78
3709g5j58Q6K48K8q8j74J04j0M6o5r2p4K98R2M4k97k26O3L20K66r9k94l25j9M08
3734GL71ml92l84L3L95L93n9m38l32J01M26L66j46m30m29J32M23M62j26m13m52
3756d96L5M70M00mm22l91N6K88L72M7l06k60k4J93K70k5j95j23m1J82J29l9j87
3779g1oP8J49l6j70r9K5K01J38Pk89j92J39K96J35k00k63j38K29L19P6k63l32
3802b67l1J85M77O0l74l40j59L87L24K25l30m53k36L46M40K68l03m96j96K75L62
3823A64J91j36l33k84J75L94J09j34k52j43J11L67O9j77k53q9J22K42j4q0j23
3844g4j27J37J35L7j37q2L5J02N7j56o5K2J58J22n6k83j06J78J76K58j71l17k33
$$ plain form
3867 -390 -306 63 282 179 -145 -316 -251 87 349 277 -121 -400 -215 152 307 242 -94 -366 -217 116 373
3888 373 207 -70 -332 -241 96 334 289 -3 -292 -267 51 261 247 42 -189 -191 17 189 183 78 -48 -29 8
3911 8 44 -33 -82 -3 56 74 28 -114 -200 44 116 155 34 -140 -117 -4 296 212 26 -216 -182 15 308 270 -1
3936 -1 -295 -241 27 276 256 -17 -273 -288 44 332 346 -58 -323 -396 22 355 355 -3 -285 -287 -58 267 280 39
3960 39 -255 -267 -68 128 122 16 -203 -124 -15 143 109 -38 -211 -102 14 68 50 -81 -152 -13 -11 59 7 -140
3984 -140 -75 21 125 35 -74 -159 -108 121 139 3 -123 -201 -80 220 271 82 -268 -292 -105 239 300 153 -257
4007 -257 -326 -101 183 343 171 -191 -318 -212 115 336 131 -189 -302 -179 212 380 178 -134 -317 -112
4027 -112 173 300 74 -116 -230 -111 115 216 111 -39 -166 -11 148 147 29 -69 -80 -27 61 49 -5 -47 -11
$$ packed form
3867c90Q4L69K19j03l24j71O5L38K62p2l98k79J85L67J55o5l36k72J49L33K57
3888C73j66k77k62R1L37K38m5k92k89K5L18K10j4k05k31kK08J72oj05j26J9L7
3911HL6p7m9P9N9J8m6j42q6K44P2L9j21j74K3J13L00q4j86k42L4J97K93l8k71
3936ak94N4K68K49k0k73k56j5L32K88J4m04k65p3M18L33%l58k82kK29L25J3k41
3960C9k94j2J99J96oj06k19P9J09J58l4j47j73J09J16N4j8j31p1J39KP0n2j47
3984a40O5R6J04r0j09q5N1K29J8j36j26p8J21L00N1j89l50k4J87L44O1j47m10
4007b57o9K25K84J60j72l62j27J06L27K21k05l20j13J23L91J68k02l12j83K05
4027a12K85J27k26j90j14J19K26J01j05j50j27J55J59jj18r8j1N3Q8j2n4m2L6
$$ plain form
4050 -11 89 59 26 -94 -73 74 113 116 -36 -186 -204 51 212 193 -48 -227 -85 25 271 222 -14 -244 -131
4073 -131 59 219 236 -51 -236 -277 -4 279 191 -86 -270 -217 12 293 196 -98 -307 -233 -2 147 160 -53
4095 -53 -247 -226 -62 155 234 62 -172 -134 -70 66 105 -68 -115 -57 72 1 -11 -99 -61 -14 30 26 -48 -85 -49 33 84
4122 84 -3 -92 -215 -64 149 120 -13 -138 -195 -33 230 212 36 -202 -173 31 270 234 75 -225 -258 54 250
4145 250 283 31 -265 -260 -31 185 233 17 -185 -190 -115 93 199 66 -110 -198 -13 63 174 51 -122 -100 -28 99
4169 99 37 -2 -110 -87 1 89 83 3 -53 -52 43 -2 -22 -66 -78 70 51 93 -13 -85 -7 98 151 92 -30 -120 -54 176
4197 176 233 106 -99 -204 -56 190 188 163 -182 -238 -102 84 221 150 -161 -307 -151 88 262 53 -157 -272
4219 -272 -142 116 226 53 -198 -267 -194 98 153 71 -96 -179 -119 44 154 74 -57 -133 -74 27 30 45 -110 -78
$$ packed form
4050a1J00l0l3j20K1J47L9Lj52j50j8K55J61j9k41j79J42J10K46m9k36k30J13
4073a31J90J60J7k87j85m1K73K83q8k77j84N3K29K81r7k94k09P4K31J49J3k13
4095e3j94K1J64K17P9j72k34L8O4J36L9j73m7N8J29p1j2q8L8M7M4mp4l7L6Q2N1
4122H4q7q9j23J51K13k9j33j25n7J62K63j8j76k38K9K04K39l6j59l00l3L12J96
4145B50L3k52k96NK29K16M8k16k02nP5K08J06j33j76q8J85P6J11j23j73K2P2J27
4169I9o2l9j08K3Q8Q8oq0n6JR5m5k0m4j2J48j9M2j06p2P8J05N3n9j22r0O6K30
4197A76N7j27k05j05J48K46kk5l45n6J36J86J37p1l11j46J56K39J74k09k10j15
4219b72J30K58J10j73k51o9P3K92N5q2j67q3O0J63J10q0j31p6N9J01LJ5j55L2
$$ plain form
4243 -78 10 148 -10 -35 -107 -52 106 114 15 -106 -131 -47 147 81 11 -149 -207 34 195 153 -31 -127 -237 19 142
4268 142 161 -91 -168 -120 26 241 165 -12 -176 -214 -4 180 204 -60 -227 -146 -74 170 296 15 -195 -163 -76
4291 -76 142 201 53 -133 -151 -29 169 123 53 -112 -92 7 109 158 -20 -87 -68 53 34 37 -18 -41 -42 55 90 17 -40
4318 -40 -103 50 69 9 -2 -125 -85 72 113 25 -102 -46 -81 62 155 65 -85 -211 -28 221 207 11 -130 -201 -54
4343 -54 106 179 60 -54 -163 -88 129 176 19 -153 -193 -115 27 88 87 -116 -200 -86 70 78 -30 -107 -89 -7 54
4368 54 54 27 -99 -88 9 63 22 -15 -53 54 18 -33 -62 26 -68 23 73 100 10 -123 -30 66 109 51 -49 -142 -64 108
4396 108 104 150 -46 -126 -117 9 155 97 -31 -175 -123 0 111 122 -57 -125 -103 37 143 85 -67 -200 -112 20
4420 20 151 106 -54 -123 -113 53 160 127 -42 -96 -21 47 72 111 -80 -66 18 71 60 11 -47 -162 12 62 62 -29 -112
$$ packed form
4243g8Q8J38j58k5p2N5J58Qr9j21k5Q4J94o6p0j60n8K41J61m2j84r6j10K56J23
4268A42J9k52p7M8J46K15p6j77j64l8K10J84K4k64j67Q1P2K44J26k81k10L2Q7
4291g6K18N9j48j86j8J22J98m6p0j65K0R9J02M9j78o7J9J21j9Ln5k3jR7L5p3n7
4318d0o3J53J9o0j1j23M0J57M1q8j27N6l5J43R3r0j50j26J83K49j4j96j41p1J47
4343e4J60P3j19j14j09P5K17M7j57j72m0P8J42O1jk03q4J14J56Qj08p7J8Q2O1
4368E4%k7j26J1R7N4m1l7l8J07l6n1k9Q8r4R1N0K7r0j33R3R6M3n8j00r3P8J72
4396A08mM6j96q0RJ26J46n8j28j44N2J23J11J1j79o8K2J40J06n8j52j33Q8J32
4420B0J31m5j60o9J0J66J07l3j69n4P5O8K5L9j91J4Q4N3j1m9n8j15J74N0%r1q3
$$ plain form
4447 -112 0 57 107 56 -52 -98 26 110 49 -31 -79 -65 18 105 81 -9 -88 -150 -24 113 183 -57 -134 -133 -24 142
4473 142 77 -28 -169 -169 -22 108 153 40 -146 -169 -4 92 191 -11 -85 -110 -74 66 139 68 -74 -63 -22 119 58
4498 58 -14 -66 -22 3 100 32 -60 -72 -74 9 24 41 -38 -110 -17 1 13 -60 -71 -39 -25 111 7 -70 -113 -78 15 105 43 -58
4528 -58 -72 -42 94 142 54 -79 -201 -95 82 125 129 -51 -73 -45 150 65 34 -12 -101 -39 17 129 77 -37 -109 -103 98
4555 98 126 54 -12 -80 8 84 74 70 -23 -66 -95 48 20 -12 2 -50 -24 95 -5 29 -86 -10 15 58 13 -28 -56 2 65
4584 65 107 -83 -34 -80 35 96 92 -24 -45 -77 -41 145 56 -69 -89 -71 0 153 23 -10 -145 -100 113 161 119 -68
4610 -68 -131 -131 13 101 97 52 -68 -113 -42 29 52 -30 -94 -68 1 37 24 28 -76 -71 2 12 50 -11 -53 -10 4 41 6 -33 -52
4641 -52 0 89 70 -30 -47 -45 -36 48 -6 -45 -75 -2 57 9 -11 -91 -145 -1 66 151 100 -127 -105 -67 143 142 8 -149 -101
$$ packed form
4447a12J12N7N0n1j08m6J24Q4o1q0m8J4Q3Q7k4r0p9o2J26J37P0k40p7JJ09J66
4473A42o5j05j41%J47J30M5j13j86k3J65R6R9k02p4k5L6J40P3p1j42J1M1J41o1
4498E8p2n2M4K5R7o8r2j2kQ3J5J7p9p2R3J8J2p3j1L2J4J36j04p7m3L5R3R0o2j01
4528e8j4L0J36M8q8j33j22J06J77M3Mj80k2K8J95q5l1m6q9O2N6J12n2j14p2OK01
4555I8K8p2o6o8Q8P6j0mr3m3k9J43k8l2J4n2K6J19j00L4j15P6K5M3m5m1k8N8O3
4584F5M2j90M9m6J15O1mj16k1l2L6J86q9j25k0J8P1J53j30l3j35M5K13M8m2j87
4610f8o3%J44Q8mm5j20m5P1P1K3q2o4K6O9L6j3Mj04NP3J0L8o1m2M3J4L7l5l9j9
4641e2N2Q9j9j00j7KRQ4n4l9l0P3N9m8k0q0n4J44O7Q5n1k27K2L8K10jj34j57M8
$$ plain form
4670 -101 23 165 128 25 -52 -107 -82 72 111 120 -32 -108 -37 62 119 9 -64 -44 8 92 76 -2 -2 -24 6 45 98 20
4698 20 -39 -57 -5 47 62 36 -38 -2 5 58 48 -8 -15 35 27 -20 -51 -99 -49 -15 96 42 -9 -1 -14 42 182 90 -33 -90 -78
4729 -78 43 160 79 9 -140 6 9 130 148 -21 -122 -47 41 70 51 -55 -21 -66 9 88 83 -67 -106 -64 38 80
4755 80 -35 -17 -71 -71 65 30 46 -4 26 -38 11 49 -10 -68 -26 20 33 62 23 -81 -27 85 33 -23 -27 -119 45 15 24
4784 24 32 -42 -61 -74 90 33 37 -53 -72 37 93 70 -15 -66 -62 77 62 139 13 -57 -15 18 71 59 14 -103 -66 -75 72
4813 72 84 4 -62 -59 -32 91 62 -34 -81 -89 -2 77 -18 -19 -69 -85 32 33 29 -12 -6 -7 15 33 -19 -9 -54 -31 21 15 -21 22 -23
4846 -23 39 33 -3 -62 -56 18 30 89 38 -36 -23 -23 46 81 -7 -105 -92 -69 31 88 1 -72 -93 -52 49 109 -3 -14 -117 -23
4876 -23 0 40 92 -62 -74 -38 100 67 29 -48 -26 -37 22 35 -26 13 2 -104 20 6 -20 -62 21 -31 -36 51 -41 -34 -15
$$ packed form
4670a01J24J42l7j03p7n5K5J54L9Rj52p6P1R9N7j10p3K0N2Q4j6p8%k2L0L9N3p8
4698B0n9j8N2N2J5k6p4L6PN3j0n6pN0qm7l1m8N0L4J11n4n1Qj3N6J40r2j23n7J2
4729g8J21J17q1p0j49J46LJ21J8j69j01P5Q8K9j9j06L4m5P5P9nj50l9M2J02M2
4755H0j15J8n4%J36l5J6n0L0o4M9L8n9n8M2M6J3K9l9j04N4J12n2n6mr2J64l0R
4784B4Qp4j9j3J64n7Mr0j9J09N6k3q5n1MJ39j5P7j26p0M2L3N3j2m5j17L7rJ47
4813G2J2q0o6LK7J23k9r6m7qQ7P9r5jn0j6J17Jmm1OjK2J8n2J0m5K3N2ol6M3m5
4846b3O2ol6n9OP4J2N9n1p4J3%O9L5q8r8J3K3J00N7q7p3k1M1J01O0j12j1j03R4
4876b3K3M0N2j54j2L6J38l3l8p7K2j1N9J3o1L9j1j06J24j4k6m2Q3n2nQ7r2PJ9
$$ plain form
4905 -15 -25 -5 10 -81 -51 45 18 29 -16 -31 -42 98 126 17 8 -96 4 3 45 -13 -24 -67 -54 13 40 127 -13 10 -83
4934 -83 1 111 73 -3 -93 -9 13 69 87 34 -39 -46 28 4 75 -14 -47 -45 -9 20 5 -53 -31 -99 1 51 133 2 13 21
4964 21 52 24 -31 -69 -51 43 -6 32 -7 -28 -63 35 70 38 -23 -47 28 -17 -8 14 -33 -76 85 62 28 17 -10 -58 -6 37
4994 37 33 20 -73 -106 -66 76 79 -11 -25 -100 -30 112 118 48 -27 -140 -43 -28 34 -18 17 -69 -39 26 42 -36 -43 -8 -23 39 76
5025 76 -22 -33 26 -24 -56 73 64 -10 18 46 -21 -32 -11 -28 15 0 48 -13 -41 -35 13 39 -12 -50 -100 24 -4 42 2 -62
5055 -62 -103 -88 50 51 41 26 -3 -26 20 35 46 -51 -102 -43 -14 80 53 -52 -58 -21 -21 21 54 -7 28 20 36 -23 73 -29 -21
5086 -21 -37 7 76 21 -3 -6 -26 -20 66 41 38 -57 15 9 51 -78 74 45 40 -11 6 40 -43 -38 38 0 -16 -46 -51 -18 25 24 73
5119 73 -77 -54 45 34 23 -65 -6 2 5 115 78 -15 -111 -68 -71 89 81 41 -24 -89 -38 28 74 -17 -62 7 -35 0 39 -26 -24
$$ packed form
4905a5j0K0J5r1L0R6k7J1m5j5j1J40K8j09rj04J00jM2n8j1m3J3O7K7Q7j40K3r3
4934h3Q4J10l8p6r0Q4K2N6J8n3p3pP4k4P1q9l3KL6K9j5n8K2o8J00N0Q2j31J1Q
4964B1L1k8n5l8J8R4m9L8l9k1l5R8L5l2o1k4P5m5RK2m7m3J61k3l4j1k7m8N2M3
4994C7mj3r3l3M0J42Lr0j4p5P0J42Op0p5j13R7J5O2n2L5q6L0O5J6p8pL5j5O2L7
5025G6r8j1N9n0l2J29rp4K8K8o7j1K1j7M3j5M8o1k8OM8K6n1l8n0J24k8M6m0o4
5055f2m1J5J38Jj0j5k9k3M6J5J1r7n1N9K9R4k7j05oL7%M2L3o1L5qJ6n9R6j02Q
5086b1j6M4O9n5k4lk0OQ6k5lr5P2oM2j29J52k9nn1J7L4q3NP6l8j6l0nL3M3jM9
5119G3j50K3R9j1j1q8N9QLJ10l7r3r6M3lJ60qm0o5o5N1O6M6r1m5O9m2L5L9o5K
$$ plain form
5150 -24 -73 -43 -2 10 15 29 -11 52 16 18 -23 64 -49 -39 67 56 -6 13 -13 13 39 40 -20 -84 7 34 -35 35 -32 -55 -9
5181 -9 75 -28 -9 -48 -46 14 6 0 -44 -70 -9 19 -6 -20 -1 -106 -24 97 96 48 -71 20 -39 50 39 16 -43 -38 -37 49 41 -19
5213 -19 -49 -31 -82 10 21 25 -5 -11 -40 -49 -4 -30 23 -24 -55 -33 -19 -67 -15 68 -38 -15 -27 25 -21 19 41 14 -45 -53 32 -1
5245 -1 24 55 -16 5 -32 28 7 -9 -11 -88 -36 19 26 16 -5 -14 -101 5 25 47 10 -34 -28 -103 42 20 57 -20 -26 2 -19 62
5277 62 -21 -53 -68 -4 23 -11 -21 17 -21 30 -6 16 -53 21 -15 -15 53 42 -33 31 -34 -104 -31 1 -34 -18 27 0 -27 1 -4
5308 -4 -86 33 2 -2 -33 32 -66 6 45 36 -104 -22 9 34 50 -8 -27 -38 24 -17 68 47 -37 -22 9 41 69 9 16 -26 -52
$$ packed form
5150b4m9L0M1J2NJ4m0O3l6Km1Q7j13J0J06j1o2J9k6K6K6Jo0o4R1K7o9P0o7k3M6
5181iQ4j03J9l9KO0qom4k6O1K8k5j4J9j05Q2J21jm8j19R1n9Q9j1k3n9NJQ6qo0
5213a9l0J8n1R2J1Ml0ok9rM5k6N3m7l1K2J4m8N2Q3j06K3j2N2m6M0K2k7n9qQ5l3
5245aK5L1p1K1l7O0k1j6kp7N2N5Pj0k1rq7J06K0K2l7m4Op5J45k2L7p7oK8k1Q1
5277F2q3l2j5O4K7l4j0L8l8N1l6K2o9P4l6%O8j1p5O4o5p0P3L2l5J6M5k7k7K8n
5308dq2J19l1ml1O5r8P2L9rj40Q2L1K5J6n8j9j1O2m1Q5k1q4J5L1L2K8o0Pm2k6
$$ [...]
8191A5
##END NTUPLES=NMR FID
##END=
