##TITLE=1H_BAU-18K
 CDCl3, 8 sc, 
 25.6.2019
##JCAMPDX= 6.0         $$ Bruker NMR JCAMP-DX V2.0
##DATA TYPE= NMR FID
##DATA CLASS= NTUPLES
##ORIGIN= UXNMR, Bruker Analytische Messtechnik GmbH
##OWNER= root
$$ XWIN-NMR		Version 3.5
$$ Tue Jun 25 14:30:05 2019 Russian Standard Time (UT+4h)  she@DPX200
##.OBSERVE FREQUENCY= 200.13155
##.OBSERVE NUCLEUS= ^1H
##.DELAY= (6, 6)
##.ACQUISITION MODE= SIMULTANEOUS
##.ACQUISITION SCHEME= undefined
##.AVERAGES= 8
##.DIGITISER RES= 18
##SPECTROMETER/DATA SYSTEM= spect
##.PULSE SEQUENCE= zg30
##.SOLVENT NAME= D2O
##.SHIFT REFERENCE= (INTERNAL, D2O, 0, 15.7039)
##AUDIT TRAIL= $$ (NUMBER, WHEN, WHO, WHERE, WHAT)
$$ ##TITLE= Audit trail, XWIN-NMR		Version 3.5
$$ ##JCAMPDX= 5.01
$$ ##ORIGIN= Bruker BioSpin GmbH
$$ ##OWNER= she
$$ F:/spectra/data/she/nmr/H-F/1/audita.txt
$$ ##AUDIT TRAIL=  $$ (NUMBER, WHEN, WHO, WHERE, WHAT)
(   1,<2019-06-25 14:28:57.59 +0400>,<she>,<DPX200>,
      <created by zg, POWCHK disabled, PULCHK disabled
       configuration hash MD5:
       00 E9 B6 7A A2 85 ED C7 34 08 36 98 17 FE 4E 26
       data hash MD5: 16K
       2A 74 3E 20 DE 4C 6F 7C D7 0E D1 72 AA EE 5A AA>)
$$ ##END=
$$ 
$$ hash MD5
$$ F6 D4 75 2F D1 B3 68 5A 9A E2 80 CA 62 91 54 2E
##$RELAX= 
##$RELAX= 
##$RELAX= 
##$RELAX= 
##$RELAX= 
##$RELAX= 
$$ Bruker specific parameters
$$ --------------------------
##$DU= <F:/spectra>
##$EXPNO= 1
##$NAME= <H-F>
##$PROCNO= 1
##$TYPE= <nmr>
##$USER= <she>
##$AMP= (0..31)
100 100 100 100 100 100 100 100 100 100 100 100 100 100 100 100 100 100 
100 100 100 100 100 100 100 100 100 100 100 100 100 100 
##$AQSEQ= 0
##$AQ_mod= 1
##$AUNM= <au_zg>
##$AUTOPOS= <>
##$BF1= 200.13
##$BF2= 200.13
##$BF3= 200.13
##$BF4= 200.13
##$BF5= 200.13
##$BF6= 200.13
##$BF7= 200.13
##$BF8= 200.13
##$BYTORDA= 1
##$CFDGTYP= 0
##$CFRGTYP= 5
##$CHEMSTR= <none>
##$CNST= (0..31)
1 1 145 1 1 1 1 1 1 1 1 1 1 1 1 1 1 1 1 1 1 1 1 1 1 1 1 1 1 1 1 1 
##$CPDPRG= <>
##$CPDPRG1= <>
##$CPDPRG2= <>
##$CPDPRG3= <>
##$CPDPRG4= <mlev>
##$CPDPRG5= <mlev>
##$CPDPRG6= <mlev>
##$CPDPRG7= <mlev>
##$CPDPRG8= <mlev>
##$CPDPRGB= <>
##$CPDPRGT= <>
##$D= (0..31)
0 1.2 0 0 0 0 0 0 0 0 0 0.03 0 0 0 0 0 0 0 0 0 0 0 0 0 0 0 0 0 0 0 0 
##$DATE= 1561458536
##$DBL= (0..7)
120 120 120 120 120 120 120 120 
##$DBP= (0..7)
150 150 150 150 150 150 150 150 
##$DBP07= 0
##$DBPNAM0= <>
##$DBPNAM1= <>
##$DBPNAM2= <>
##$DBPNAM3= <>
##$DBPNAM4= <>
##$DBPNAM5= <>
##$DBPNAM6= <>
##$DBPNAM7= <>
##$DBPOAL= (0..7)
0.5 0.5 0.5 0.5 0.5 0.5 0.5 0.5 
##$DBPOFFS= (0..7)
0 0 0 0 0 0 0 0 
##$DE= 6
##$DECBNUC= <off>
##$DECIM= 24
##$DECNUC= <off>
##$DECSTAT= 4
##$DIGMOD= 1
##$DIGTYP= 9
##$DL= (0..7)
0 120 120 120 120 120 120 120 
##$DP= (0..7)
150 150 150 150 150 150 150 150 
##$DP07= 0
##$DPNAME0= <>
##$DPNAME1= <>
##$DPNAME2= <>
##$DPNAME3= <>
##$DPNAME4= <>
##$DPNAME5= <>
##$DPNAME6= <>
##$DPNAME7= <>
##$DPOAL= (0..7)
0.5 0.5 0.5 0.5 0.5 0.5 0.5 0.5 
##$DPOFFS= (0..7)
0 0 0 0 0 0 0 0 
##$DQDMODE= 0
##$DR= 18
##$DS= 0
##$DSLIST= <SSSSSSSSSSSSSSS>
##$DSPFIRM= 0
$$ [...]
##$SUBNAM2= <"">
##$SUBNAM3= <"">
##$SUBNAM4= <"">
##$SUBNAM5= <"">
##$SUBNAM6= <"">
##$SUBNAM7= <"">
##$SUBNAM8= <"">
##$SUBNAM9= <"">
##$SW= 24.9336996594482
##$SWIBOX= (0..15)
0 0 2 0 0 0 0 0 0 0 0 0 0 0 0 0 
##$SW_h= 4990.01996007984
##$TD= 16384
##$TD0= 1
##$TE= 0
##$TE2= 300
##$TE3= 300
##$TEG= 300
##$TL= (0..7)
0 120 120 120 120 120 120 120 
##$TP= (0..7)
150 150 150 150 150 150 150 150 
##$TP07= 0
##$TPNAME0= <>
##$TPNAME1= <>
##$TPNAME2= <>
##$TPNAME3= <>
##$TPNAME4= <>
##$TPNAME5= <>
##$TPNAME6= <>
##$TPNAME7= <>
##$TPOAL= (0..7)
0.5 0.5 0.5 0.5 0.5 0.5 0.5 0.5 
##$TPOFFS= (0..7)
0 0 0 0 0 0 0 0 
##$TUNHIN= 0
##$TUNHOUT= 0
##$TUNXOUT= 0
##$USERA1= <user>
##$USERA2= <user>
##$USERA3= <user>
##$USERA4= <user>
##$USERA5= <user>
##$V9= 5
##$VALIST= <valist>
##$VCLIST= <CCCCCCCCCCCCCCC>
##$VD= 0
##$VDLIST= <DDDDDDDDDDDDDDD>
##$VPLIST= <PPPPPPPPPPPPPPP>
##$VTLIST= <TTTTTTTTTTTTTTT>
##$WBST= 1024
##$WBSW= 4
##$XGAIN= (0..3)
0 0 0 0 
##$XL= 0
##$YL= 0
##$YMAX_a= 314154
##$YMIN_a= -458161
##$ZGOPTNS= <>
##$ZL1= 120
##$ZL2= 120
##$ZL3= 120
##$ZL4= 120
##$ABSF1= 10
##$ABSF2= 0
##$ABSG= 5
##$ABSL= 3
##$ALPHA= 0
##$AQORDER= 0
##$ASSFAC= 0
##$ASSFACI= 0
##$ASSFACX= 0
##$ASSWID= 0
##$AUNMP= <proc_1d>
##$AZFE= 0.1
##$AZFW= 0.1
##$BCFW= 1
##$BC_mod= 2
##$BYTORDP= 1
##$COROFFS= 0
##$CY= 11.3945322036743
##$DATMOD= 1
##$DC= 2
##$DFILT= <>
##$DTYPP= 0
##$F1P= 18.9103706918063
##$F2P= -1.10871071338519
##$FCOR= 0.5
##$FTSIZE= 0
##$FT_mod= 4
##$GAMMA= 1
##$GB= 0.15
##$INTBC= 1
##$INTSCL= 1
##$ISEN= 128
##$LB= 0.24
##$LEV0= 0
##$LPBIN= 0
##$MAXI= 10000
##$MC2= 0
##$MEAN= 0
##$ME_mod= 0
##$MI= 1.114404
##$NCOEF= 0
##$NC_proc= 0
##$NLEV= 6
##$NOISF1= 3.799351
##$NOISF2= 2.8
##$NSP= 1
##$NTH_PI= 0
##$NZP= 0
##$OFFSET= 15.70392
##$PC= 1
##$PHC0= -8497.796
##$PHC1= 14.00097
##$PH_mod= 1
##$PKNL= yes
##$PPARMOD= 0
##$PSCAL= 0
##$PSIGN= 0
##$REVERSE= no
##$SF= 200.130013532006
##$SI= 16384
##$SIGF1= 3
##$SIGF2= 2
##$SINO= 400
##$SIOLD= 16384
##$SREGLST= <1H.CDCl3>
##$SSB= 0
##$STSI= 0
##$STSR= 0
##$SW_p= 3612.71676300578
##$SYMM= 0
##$S_DEV= 0
##$TDeff= 0
##$TDoff= 0
##$TI= <>
##$TILT= no
##$TM1= 0
##$TM2= 0
##$TOPLEV= 0
##$USERP1= <user>
##$USERP2= <user>
##$USERP3= <user>
##$USERP4= <user>
##$USERP5= <user>
##$WDW= 1
##$XDIM= 8192
##$YMAX_p= 0
##$YMIN_p= 0
$$ End of Bruker specific parameters
$$ ---------------------------------
##NTUPLES= NMR FID
##VAR_NAME=  TIME,          FID/REAL,        FID/IMAG
##SYMBOL=    X,             R,               I
##VAR_TYPE=  INDEPENDENT,   DEPENDENT,       DEPENDENT
##VAR_FORM=  AFFN,          ASDF,            ASDF
##VAR_DIM=   8192,          8192,            8192
##UNITS=     SECONDS,       ARBITRARY UNITS, ARBITRARY UNITS
##FACTOR=    0.0002004,     1,               1
##FIRST=     0,             0,               0
##LAST=      1.6414764,     0,               0
##MIN=       0,             -458161,         0
##MAX=       1.6414764,     314154,          0
$$ Real data points
##PAGE= N=1
##DATA TABLE= (X++(R..R)), XYDATA
0 0 0 0 0 0 8 -8 8 -8 16 -16 24 -24 32 -48 56 -64 80 -95 112 -129 152 -177 208 -237 273 -313 357 -407
28 -407 461 -521 589 -661 741 -829 927 -1033 1151 -1277 1416 -1571 1741 -1927 2131 -2361
44 -2361 2616 -2903 3222 -3587 4006 -4491 5060 -5742 6574 -7621 8971 -10802 13431 -17556
58 -17556 24983 -42508 169398 -51676 -408359 33946 154488 -65525 5598 264514 -22203
69 -22203 -340233 -94421 249800 104869 -59823 10806 -39354 -199210 -10055 244185 83618
80 83618 -167192 -58459 41346 -83883 -28289 201621 84027 -200393 -120336 97136 35730
91 35730 -17533 101337 27848 -187776 -86600 150921 82631 -63749 14332 22116 -140060
102 -140060 -68779 189817 132724 -136410 -116394 61404 15524 -36613 112217 96002 -152666
113 -152666 -135348 129296 114476 -72567 1072 86701 -99125 -130722 146076 172215 -112971
124 -112971 -135132 79726 48871 -82873 30993 113782 -62578 -130607 45662 83431 -48348
135 -48348 -15620 72288 -53341 -127804 66386 136038 -74612 -107402 87713 41744 -141819
146 -141819 -9788 177682 1367 -171459 -3199 106853 -33692 -40771 92744 10432
156 10432 -131012 -11727 114881 4028 -55544 51294 18111 -115917 -12166 158212
166 158212 34202 -134345 -13381 98003 -36380 -65232 105739 71099 -126719 -59318
176 -59318 117851 25191 -86717 42498 77859 -93185 -71961 113511 54714 -107944 -15143
187 -15143 98949 -34934 -101396 63898 92277 -81354 -74843 80950 27498 -97637 10118
198 10118 102401 -52089 -110194 68765 82391 -95141 -49614 109550 1729 -129483 29676
209 29676 127038 -53065 -106463 66266 66766 -78852 -19361 96406 -11410 -96485 37792
220 37792 88315 -47698 -50336 77184 21763 -96530 13218 120502 -26707 -110520 51899
231 51899 90169 -74695 -52734 106480 26154 -118622 528 109997 -27219 -82203 59745
242 59745 50709 -91199 -29192 102489 6222 -98795 14906 76726 -51878 -66688 75488
253 75488 50311 -94797 -41436 86192 6807 -81871 26895 68441 -66699 -64800 78886
264 78886 39921 -83795 -6587 77340 -35921 -73948 66632 66472 -76364 -42544 80536
275 80536 13945 -75024 25486 81382 -42591 -69082 61626 56897 -65060 -20737 83488
286 83488 -4538 -88617 34832 92013 -51026 -70872 73204 44038 -90042 -12720 101300
297 101300 -13242 -98712 32063 78020 -53241 -53445 67361 23414 -83232 -7332 79832
308 79832 -14953 -73837 28413 50797 -54779 -37271 68702 16083 -81780 -2821 72880
319 72880 -24018 -61764 46888 40973 -69475 -23421 77225 1467 -70503 25228 58827 -47850
331 -47850 -40420 68871 29099 -69874 -5572 72335 -12363 -60478 40772 60370 -52519 -45052
343 -45052 67260 31300 -67527 -85 74942 -24439 -71225 47828 63006 -61124 -40440
354 -40440 70009 10509 -77128 14805 74855 -36832 -68690 44846 45704 -57803 -26952 59738
366 59738 959 -68101 10563 58620 -29542 -51325 39014 29158 -55977 -13117 61540 -8673
378 -8673 -63338 27574 52457 -46461 -35328 61191 16173 -65665 7197 65307 -23473 -51081
390 -51081 44596 40447 -52052 -19593 62177 8081 -57302 13882 57468 -26634 -45537 46339
402 46339 38852 -54091 -21792 62578 5932 -60417 16773 54760 -36472 -43439 49862 26227
414 26227 -58248 -9011 54120 -14779 -50564 28962 36256 -46707 -29235 48298 10789 -53896
426 -53896 -715 46304 -19957 -45946 30520 35256 -45612 -26534 50183 9339 -53653 9374
438 9374 50861 -27896 -42635 44626 32413 -50107 -12879 55105 -1103 -47453 21390 43802
450 43802 -27776 -29092 39199 19846 -37724 -1287 41105 -9009 -35692 25006 32456 -33280
462 -33280 -19163 44193 5992 -49925 10576 51174 -26292 -45411 38145 30351 -50889 -15785
474 -15785 54497 -3884 -58203 14026 47480 -30038 -40286 36004 23119 -48469 -15533 48932
486 48932 1043 -51587 6486 43370 -21933 -37221 32816 25114 -42350 -12962 45719 -791
498 -791 -40192 19053 34017 -30117 -19202 43006 10099 -41116 7357 42513 -14774 -31599
510 -31599 30032 27545 -33822 -15481 41213 9277 -38449 4860 38200 -16266 -32729 29582
522 29582 26176 -38806 -16458 41444 -120 -42284 14675 36357 -31456 -32833 35628 18217
534 18217 -40518 -6444 35258 -12637 -37046 19773 29123 -28859 -24573 28746 9781 -35209
546 -35209 1048 37368 -13111 -39787 20300 32886 -26778 -20706 35422 8238 -39483 5469
558 5469 41095 -11811 -28476 23476 18729 -27455 -2777 36193 -2088 -29527 12892 26138
570 26138 -17181 -14468 28888 11130 -31632 -3798 33217 -2197 -28750 14156 23128 -27103
582 -27103 -18769 33333 9089 -37535 -216 31508 -16921 -29845 25504 20586 -35638 -17065
594 -17065 32562 3254 -32887 4522 26425 -16686 -25962 19858 18982 -24302 -12046 24103 706
607 706 -26806 10551 27473 -18127 -22702 25332 15040 -28216 -511 33303 -8257 -29177 19817
620 19817 27140 -21020 -12823 28217 4729 -27073 8140 30632 -10871 -24585 18076 19632 -22026
633 -22026 -10552 29283 4731 -33584 778 32066 -9494 -27847 17010 17974 -28359 -12852
645 -12852 30009 1580 -31308 4247 21332 -17997 -17797 22194 8913 -28590 -6887 23981
657 23981 -2671 -22543 8931 18604 -17508 -17416 20779 13014 -21867 -4129 22902 -5353 -21388
670 -21388 17850 21771 -21688 -11948 27516 4878 -25493 10197 28653 -15236 -21853 23007 18588
683 18588 -21741 -6763 26085 94 -24955 7906 24968 -12398 -20758 18194 14324 -24713
695 -24713 -8322 28169 -908 -30569 7182 25719 -18253 -22378 22447 12049 -28969 -6560
707 -6560 25337 -5746 -24435 10652 16873 -18678 -13813 18851 5006 -21047 374 20228 -7790
720 -7790 -20150 12793 18054 -15846 -11735 20819 5215 -22001 5044 24877 -9528 -18485 18189
733 18189 13369 -19256 -337 25619 -4151 -22118 12485 20930 -13640 -11722 19220 6970 -21728
746 -21728 -1184 23528 -1686 -21930 6209 16984 -13948 -13303 19673 7300 -26110 -3950
758 -3950 22974 -6758 -21584 13563 14008 -23718 -12677 23509 4207 -24110 293 17279 -10459
771 -10459 -16081 14420 12739 -17236 -10212 15610 3814 -14906 4913 17145 -10743 -16460 15971
784 15971 15308 -15629 -5243 19827 -1675 -18352 11891 20909 -12490 -12687 16217 6039 -14614
797 -14614 5105 18434 -8379 -15437 11821 13181 -12154 -6243 15438 -238 -19723 2568 20598
810 20598 -6395 -19644 8783 11258 -17635 -7622 21328 -86 -25687 2018 18647 -11015
822 -11015 -14381 15971 5903 -23372 -4573 21691 -355 -19022 4351 13275 -11479 -10792 16206
835 16206 10091 -16166 -6124 15966 551 -12704 9704 14403 -13951 -10606 19771 7700 -16712
848 -16712 3880 18989 -10052 -15454 17145 14641 -16224 -6248 17235 -221 -16141 7579 16515
861 16515 -10932 -14557 11745 8551 -14676 -3116 16720 -4395 -21644 6233 18446 -11680
873 -11680 -15554 14519 5269 -22223 -1029 22018 -6045 -21722 8184 12389 -15046 -6690 18221
886 18221 604 -21245 1750 18179 -5522 -13831 10596 11088 -15206 -7141 19794 6660 -17236
899 -17236 713 17389 -5826 -12698 15520 12038 -16464 -4770 18706 43 -14280 10409
911 10409 14021 -14598 -9782 17036 6409 -15710 136 14378 -6409 -14315 10115 12623 -14025
924 -14025 -11129 13529 3104 -17531 1502 17437 -9984 -20252 12121 14058 -17800 -9824 18589
937 18589 -3 -22396 4154 19513 -9262 -16314 10853 9349 -14518 -3617 15978 170
949 170 -15335 3910 14296 -5790 -9643 12203 8124 -14541 -2112 18546 450 -15304 7670
962 7670 14319 -10892 -7969 17443 5001 -16400 2267 16264 -7014 -12284 12784 9262 -15148
975 -15148 -5415 15905 1071 -16502 2170 14680 -7849 -14494 9991 10035 -15228 -8356 15196
988 15196 720 -18192 3483 14522 -11254 -12823 14232 6627 -18300 -2183 17452 -4514
1000 -4514 -16227 8731 12542 -11903 -8960 14633 5706 -14168 -401 14748 -2428 -12177 8907
1013 8907 12499 -11109 -7444 15816 4992 -14901 2440 16485 -7117 -13095 12966 10370 -14029
1026 -14029 -4158 15018 -1745 -13914 7050 11781 -10361 -8684 11171 3550 -13207 74 12825
1039 12825 -5561 -14943 6417 11430 -11715 -9902 13173 3120 -17687 -205 16395 -6461
1051 -6461 -15845 9496 9315 -14653 -5037 16275 -538 -16554 4395 13834 -7856 -10068 11989
1064 11989 7567 -13031 -3450 14993 2182 -12561 3421 13017 -6533 -8957 12474 8461 -13096
1077 -13096 -2382 14908 -1908 -12087 9495 10952 -12485 -7115 14665 2955 -13586 2220
1089 2220 11449 -7385 -9938 9646 6913 -11730 -5110 10342 -1425 -12452 3851 11179 -9386
1102 -9386 -12434 9835 7300 -14329 -3813 14623 -3348 -16920 6496 13832 -10603 -10195 12498
1115 12498 3928 -14500 933 15540 -4428 -12737 7483 9923 -8770 -5109 13253 4070 -13143
1128 -13143 582 15232 -1325 -11697 7336 10381 -10218 -5440 14478 3604 -13692 2149
1140 2149 12363 -6792 -8691 11794 5333 -13742 -2327 12796 -2169 -11616 5310 8243 -10109
1153 -10109 -7603 10210 4110 -12097 -2282 10614 -4005 -12428 6548 9932 -11910 -8618 12744
1166 12744 2682 -15258 1617 14284 -7586 -12713 10767 9420 -12679 -4230 13667 601
1178 601 -12059 4575 11674 -6202 -8357 10032 7277 -9830 -2386 12590 464 -11325 5132
1191 5132 12032 -7626 -9077 11677 6410 -12452 -758 13207 -3846 -11778 7384 8183 -10641
1204 -10641 -4762 10724 87 -11893 2517 9213 -6732 -8924 7657 4929 -11095 -4370 10099
1217 10099 -425 -11825 2785 9954 -7457 -9511 9958 5949 -12716 -2032 12981 -2998
1229 -2998 -12094 7235 9922 -9803 -5932 12017 3219 -11498 1543 11865 -2813 -8909 6596
1242 6596 8277 -7022 -4149 10034 3171 -9917 1493 11470 -3781 -8782 7743 6778 -9881
1255 -9881 -3109 11934 -760 -11678 4055 8983 -7899 -6202 9043 1757 -11384 -171 9360
1268 9360 -3780 -9339 4552 5776 -8482 -5280 8620 1782 -11448 -913 10248 -3513 -10058
1281 -10058 6275 7606 -9625 -5022 10965 1624 -10521 2750 9834 -6039 -6820 9077 4508
1294 4508 -8866 -224 10270 -1542 -8263 5049 8556 -5477 -5332 8344 4789 -8515 -952
1307 -952 10517 -1482 -9657 5125 8828 -7742 -6368 9843 2149 -11278 989 9867 -5499
1320 -5499 -9140 6714 5199 -9111 -3364 7986 -1122 -9226 2322 7106 -5585 -7184 5645
1333 5645 3784 -8335 -2284 8722 -1751 -10087 4292 8841 -7622 -7031 9772 4241 -10345
1346 -10345 502 10952 -3439 -8599 7038 7642 -7685 -3517 9419 1927 -7808 2196 8857
1359 8857 -3281 -6723 6203 6251 -6760 -3606 8423 1322 -8552 2058 8305 -4994 -6996 7145
1373 7145 3976 -8536 -1183 8577 -3437 -8417 5060 5590 -7943 -4186 7834 431 -8665 238
1387 238 7012 -3382 -7263 4310 5376 -6785 -4251 7686 1776 -8868 1086 8617 -3676 -6993
1401 -6993 7006 5327 -8308 -2109 9941 -264 -7686 3946 7339 -4926 -4009 7758 2709
1414 2709 -6524 37 7467 -851 -5678 3653 5476 -4879 -3928 6635 2838 -7771 -399 7695
1428 7695 -2490 -7392 5014 4859 -7591 -3814 7678 -229 -8067 1725 5936 -5533 -5006 5798
1442 5798 2163 -6867 -1563 6029 -1518 -6395 2468 5474 -4788 -5233 5509 3256 -6290 -931 7427
1457 7427 -1501 -7194 4437 6937 -5290 -3294 7334 1302 -6855 2798 8073 -2780 -5561 5249
1471 5249 4559 -4808 -982 6098 164 -6197 1624 6192 -2191 -4696 3791 2905 -5933 -1556 6710
1486 6710 -742 -7543 2016 5765 -5188 -4326 6612 1287 -8032 68 6461 -2826 -5744 3876 2708
1501 2708 -5966 -2510 5892 509 -6260 680 4846 -2429 -4706 4329 4464 -5981 -3075 6711 1435
1516 1435 -5945 1917 6684 -3775 -4867 6621 4013 -5929 -428 6422 -832 -4896 4193 4590 -4194
1531 -4194 -2993 4944 1742 -4387 533 5152 -1564 -5245 2644 4423 -3983 -3164 4616 248 -5974
1546 -5974 791 6085 -3379 -5811 3918 2728 -5899 -902 5728 -1551 -6220 1886 4241 -3707 -3311
1561 -3311 3932 1049 -5100 -523 5183 -559 -4698 1771 4380 -3212 -2921 5260 2626 -5729 -708
1576 -708 6369 -702 -4411 4028 4264 -4483 -2035 5732 1009 -4109 1622 4017 -3097 -2692 4193 2286
1592 2286 -4023 -1498 3372 -51 -3997 1228 3894 -2963 -4193 3207 2354 -4352 -1551 4123 -1738
1607 -1738 -5442 2553 3537 -4012 -2909 4179 63 -5084 1086 3934 -2709 -4326 2792 2572 -3291
1622 -3291 -1474 3855 337 -4040 817 4667 -927 -3565 3018 2826 -3512 -1057 5342 518 -4464
1637 -4464 1807 4399 -2173 -2541 3996 1738 -4106 39 4221 -879 -3002 1775 2614 -2207 -1631 2712
1653 2712 992 -3616 -661 3430 -675 -3773 1759 2929 -3764 -2472 3828 970 -4182 471 2978
1668 2978 -2697 -3019 3300 1482 -4028 -408 3154 -1138 -3080 1847 2450 -2703 -2067 2807 1529 -2738
1684 -2738 -152 3643 -353 -3549 2059 3800 -2220 -2271 3866 1690 -3776 538 4478 -1889 -3452
1699 -3452 2756 2629 -2826 -591 3665 14 -2876 971 2843 -1058 -1800 1450 1034 -2517 -757 2774
1715 2774 -117 -3271 89 2214 -2316 -2280 2483 840 -4198 -591 3384 -1196 -3196 2135 1974 -3373
1731 -3373 -1463 3302 256 -3215 865 2751 -1392 -1905 2305 2217 -2356 -1441 3006 1227 -2757 977
1747 977 3632 -1172 -2625 2357 2500 -2516 -454 3898 -389 -3219 1947 3212 -2174 -1847 2380 322
1763 322 -2769 204 2575 -812 -2691 725 2066 -1560 -1727 1701 658 -2759 -941 2437 -620
1778 -620 -2765 976 1495 -2780 -992 2593 -226 -3235 619 2313 -1993 -1883 2178 928 -2555 -360
1794 -360 2380 -335 -1842 1196 2132 -1219 -1164 2087 1694 -2054 -229 3224 94 -2921 1519 3450
1810 3450 -1906 -1988 2854 1431 -2892 148 3056 -935 -2355 1219 1322 -1836 -1233 1703 106 -2351
1826 -2351 -113 1616 -650 -2001 613 1058 -1856 -1107 2062 391 -2594 -102 1530 -1505 -1769 2102
1842 2102 777 -2431 -133 2413 -866 -1560 1653 1346 -2034 -702 2041 984 -1814 215 2124
1857 2124 -366 -1304 1220 1874 -1384 -1368 2494 1123 -1946 645 2736 -998 -1707 1925 1684 -2328
1873 -2328 -508 2395 -396 -2350 828 1914 -1447 -1345 1162 461 -1560 -583 1275 -165 -2266 43
1889 43 1298 -873 -1558 1197 311 -2204 -602 1861 -517 -2137 1244 1211 -2119 -755 1762 75
1905 75 -1624 578 1472 -977 -823 1684 898 -1115 -265 1492 312 -1119 410 1885 -551 -1294 1446
1922 1446 1501 -1807 -267 2402 -79 -2081 1135 1871 -1544 -916 1857 254 -2054 -90 1546 -790
1938 -790 -1550 574 1074 -1184 -787 1496 57 -1744 -662 1297 -150 -1507 685 1214 -1530 -1227
1954 -1227 1524 459 -1912 225 1249 -1186 -1172 1429 345 -1371 261 1498 -435 -950 1403 1013
1970 1013 -988 -502 1595 626 -1191 -104 1934 -38 -1495 1155 1600 -1074 -1146 2023 623 -1892
1986 -1892 521 2190 -866 -1784 1272 1063 -1660 -461 1543 -379 -1774 289 1157 -561 -1252 355
2002 355 348 -1347 -857 996 -94 -1495 337 1268 -924 -1469 1426 695 -1930 -23 1511 -598 -1248
2019 -1248 965 859 -1463 -319 1445 248 -1325 477 1058 -336 -572 938 1117 -1080 -489 1338
2035 1338 841 -1296 582 1439 -678 -1209 1243 1123 -1421 -379 1567 -109 -1509 921 1316 -1286
2051 -1286 -777 1257 355 -1402 -227 1028 -360 -1211 51 942 -929 -901 1076 399 -1496 -147 1274
2068 1274 -455 -1227 584 930 -1183 -685 1648 153 -1702 578 1215 -395 -647 1241 1031 -952
2084 -952 52 1319 141 -749 452 1069 -544 -974 1168 618 -1126 -218 1295 -222 -1352 473
2100 473 1273 -930 -695 1505 44 -1450 409 1386 -684 -1122 607 919 -905 -566 702 -190 -1150
2117 -1150 -45 846 -294 -1011 383 996 -1031 -140 1484 133 -1524 175 1071 -761 -497 1359
2133 1359 102 -1351 134 1476 -455 -1152 722 782 -739 -194 1157 41 -878 45 1208 -561
2149 -561 -691 927 753 -594 -778 1234 241 -1227 4 1126 -706 -1349 719 967 -1127 -70 967
2166 967 -362 -1251 511 588 -938 -1055 761 83 -976 -231 356 -620 -865 549 847 -673 -666 733
2184 733 317 -1098 174 1496 -551 -683 1303 876 -840 -109 1448 61 -987 614 981 -437
2200 -437 -286 975 469 -904 -200 827 84 -880 145 687 -640 -408 512 222 -1436 41 1217
2217 1217 -534 -819 790 615 -799 -553 1188 217 -1047 261 463 -773 -512 642 375 -861 -19
2234 -19 817 49 -1167 163 847 -620 -565 858 846 -730 -363 964 431 -901 513 710 -668 -361
2252 -361 1027 369 -795 813 828 -428 -480 825 202 -680 -212 854 73 -813 178 607 -413 -1201
2270 -1201 413 331 -838 -241 654 -255 -1256 199 735 -573 -672 625 98 -1020 13 531 -549
2287 -549 -869 120 864 -625 -214 77 155 -616 427 579 -341 -581 610 239 -521 -42 900 165 -776
2306 -776 335 689 -386 -224 482 115 -638 433 721 -557 -625 -31 161 -427 -213 535 176 -412 49
2325 49 992 -86 -525 442 429 -826 -493 611 44 -681 324 635 -746 -250 533 -121 -951 -179 640
2344 640 -215 -651 359 398 -146 -614 466 205 -675 6 440 -106 -439 588 405 -360 -474 717 -3
2363 -3 -491 437 713 -379 -267 511 335 -205 15 656 -241 -331 186 551 -458 -192 366 12 -282 -49
2383 -49 357 134 -666 551 293 -529 -778 477 -121 -372 69 517 -316 -518 560 -96 -363 10 353
2402 353 -275 -477 124 359 -489 -136 498 364 -373 -46 494 -122 -433 282 462 -317 -341 359 274 -387 384
2423 384 307 -132 -546 316 101 -692 144 505 -142 -619 97 300 -461 -550 693 164 -455 -129 476 -98
2443 -98 -661 462 354 2 -345 408 -60 -450 63 779 -284 -577 685 90 -461 -96 278 -194 -323
2462 -323 127 185 -255 28 520 300 -546 84 712 -259 -542 443 382 -225 -389 666 29 -413 156 534
2482 534 -217 -311 621 134 -405 93 261 -259 -738 325 280 -479 -120 326 5 -572 -135 413 -263 -500
2502 -500 205 158 -124 -274 600 -168 -480 -31 619 -554 -554 306 131 -306 291 284 -199 -396 246 330 -522 -480
2524 -480 367 303 -330 240 345 -25 -295 224 215 -173 -462 183 94 -273 513 411 -344 -454 360 289 -580 -141
2546 -141 234 -192 -583 433 429 -182 -365 76 13 -333 -7 223 -158 -147 488 112 -326 -113 523 -127 -426
2567 -426 182 516 -640 -451 532 64 -711 239 462 -182 -439 410 345 0 -138 258 -163 -426 145 522
2587 522 -302 -484 441 264 -588 -62 659 197 -678 -85 494 -281 -327 481 53 -540 265 427 -274 -443
2607 -443 272 -199 -650 -68 161 -191 -394 -35 318 -20 -312 456 272 -308 -79 518 -147 -477 329 329 -409
2628 -409 -228 389 -94 -590 85 601 -87 -446 370 641 -184 -170 382 102 -538 -229 234 -49 -148 198 126
2649 126 -444 -194 493 169 -358 139 422 -92 -646 155 279 -464 -43 532 -88 -176 -33 232 -484 11
2669 11 244 -153 -569 171 424 -10 -344 -122 71 -685 -45 520 49 -399 312 547 -238 -264 646 443 -746
2690 -746 70 798 -357 -371 587 319 -389 -107 452 -24 -507 23 405 -57 -543 383 646 -685 -188 573
2710 573 -17 -948 88 386 -588 -267 291 59 -860 76 659 -500 -628 412 561 -379 -152 440 -220
2729 -220 -518 283 182 -114 -533 246 337 -663 -194 533 96 -602 -35 394 -210 -577 506 516 -562 -85
2749 -85 779 325 -268 246 660 -38 -136 442 131 -453 -25 342 -200 -588 217 642 -101 -314 515 195 -715
2770 -715 16 755 -416 -678 507 221 -405 -198 627 -96 -410 174 397 -681 -366 287 239 -524 -4
2789 -4 640 33 -304 57 586 -72 -319 641 451 -605 -53 705 -71 -416 393 342 -589 65 873 163 -523
2810 -523 230 600 -73 -288 764 398 -680 -371 390 -48 -267 -68 335 -304 -644 592 26 -636 -284
2829 -284 766 -470 -589 527 314 -621 -217 367 123 -559 199 518 -772 -350 224 -273 -442 -78 300
2848 300 -260 -628 529 419 -84 -483 520 252 -441 -247 646 147 -615 666 719 -589 -5 688 145
2867 145 -866 339 409 -202 -521 437 111 -624 -64 419 -217 -514 77 334 -180 -563 326 360 -593 -507
2887 -507 225 102 -792 296 545 -753 -721 693 117 -480 236 441 -313 -347 297 378 -609 3 665 -39
2907 -39 -484 209 700 142 -634 423 715 -668 -160 778 464 -862 335 695 -449 -700 776 211
2925 211 -797 138 851 -197 -565 282 327 -477 -390 427 51 -294 30 362 -144 -677 223 486 -515 -624
2945 -624 1089 4 -541 64 488 -449 -381 583 19 -665 56 739 -127 -577 380 355 -120 -212 581 477
2965 477 -396 179 854 96 -363 508 551 -622 -128 658 308 -521 127 963 -138 -626 980 599 -638
2984 -638 -338 555 -153 -977 286 501 -502 -291 438 359 -409 -285 527 17 -817 29 342 -163 -399 542
3004 542 437 -568 -134 939 -327 -744 603 709 -615 -186 737 -2 -656 767 862 -101 -147 747 206
3023 206 -430 90 717 -31 -635 -102 802 -163 -739 641 418 -842 -350 954 -43 -1121 340 621
3041 621 -768 -154 725 -193 -981 15 178 -355 -584 139 199 -527 -633 308 118 -548 -200 550 -199 -604
3061 -604 508 552 -668 -669 589 -14 -701 234 871 -594 -28 779 242 -621 135 722 -264 -652 406
3080 406 509 -32 -172 76 63 -589 -185 905 30 -632 301 684 -458 -354 683 101 -1182 65 892
3099 892 -378 -333 480 -47 -966 -211 567 -196 -720 29 236 -124 -214 95 428 -535 -702 691 40 -934
3119 -934 264 762 -901 -441 939 375 -1018 228 859 -265 -509 905 419 -648 267 774 -86
3136 -86 -487 274 436 -252 -405 582 553 -494 -319 581 26 -794 165 739 -444 -753 525 212 -775 -48
3156 -48 850 -603 -493 390 300 -891 -335 394 -24 -517 56 426 -86 -505 318 258 -389 -401 692 161
3176 161 -961 153 787 -504 -505 621 568 -973 10 1069 -31 -274 520 558 -551 -107 745 255 -405
3195 -405 519 371 -5 -598 134 487 -525 -440 504 350 -564 -122 720 -623 -1174 572 313 -772 -319
3214 -319 923 -69 -627 160 405 -750 -538 405 36 -371 -114 353 -177 -433 96 292 -236 -222 413 291
3234 291 -192 -201 846 93 -575 425 702 -583 -519 703 105 -584 351 932 -337 -274 743 304 -690
3253 -690 219 680 -38 -519 302 500 -492 -502 449 484 -706 -123 847 -149 -905 279 437 -693 -470 878
3273 878 -204 -1120 -32 578 -565 -584 460 442 -552 -65 440 288 -335 -208 538 27 -336 577 437
3292 437 -195 -408 641 166 -470 441 779 -398 -444 903 382 -970 86 1034 -143 -730 794 372
3310 372 -590 -155 461 294 -490 49 309 -182 -576 265 741 -431 -423 797 402 -1043 -245 870 -574
3329 -574 -894 502 322 -847 -180 520 -338 -827 218 362 -591 -362 429 232 -214 -127 501 9 -604
3348 -604 256 442 -482 -648 670 183 -227 500 1188 -17 -413 889 433 -393 -243 1188 346 -676
3366 -676 459 234 -480 -52 591 38 -403 66 636 -116 -772 30 160 -453 -686 410 105 -1124 177
3385 177 622 -256 -1116 415 700 -1058 -443 758 125 -530 378 770 -432 -43 400 122 -487 -173 506
3404 506 58 -470 31 717 -32 -641 490 498 -558 22 1137 -165 -506 214 515 -368 -289 816 90
3423 90 -702 792 736 -399 -584 363 233 -365 -174 495 213 -528 -248 767 -426 -570 148 291 -532
3442 -532 -344 525 217 -1085 174 793 -825 -509 732 362 -891 -37 524 -417 -501 720 246 -535
3460 -535 -412 401 299 -211 4 538 241 -441 192 934 -911 -221 995 101 -493 416 870 -327 -647
3479 -647 911 -22 -650 321 1061 -155 -575 278 483 -293 -322 404 251 -760 -30 551 -34 -818 -41
3498 -41 790 -692 -1047 575 228 -1019 -176 644 -375 -783 506 235 -700 30 752 -152 -696 369
3516 369 208 -332 -262 220 623 -388 -305 681 316 -591 165 730 -2 -459 790 699 -665 16 801 -349
3536 -349 -571 630 643 -687 -53 738 -24 -696 411 339 -486 -724 -1 357 -477 -479 668 153 -870 -135
3556 -135 704 -410 -1088 643 333 -1098 -111 891 -268 -890 424 769 -629 -415 850 124 -753
3573 -753 173 549 118 -60 354 283 -68 -302 789 121 -510 46 586 446 -493 575 500 -689 10 960
3593 960 11 -635 492 786 -772 -307 400 172 -653 32 276 -448 -672 168 353 -586 -586 31 332 -622
3613 -622 -270 625 -257 -1160 650 651 -533 -459 690 381 -1246 520 769 -535 -659 822 549 -239 128
3632 128 599 -60 -480 267 583 63 -332 419 511 -428 -94 856 361 -539 525 508 -458 -527 838 411
3652 411 -1084 84 622 -496 -509 647 205 -639 -193 645 -431 -305 -93 321 -417 -674 205 240 -499
3671 -499 -464 679 -9 -972 -79 805 -839 -645 573 206 -614 -197 437 -553 -549 697 298 -367 -67 437
3691 437 30 -249 208 935 146 -422 295 601 -93 -224 835 185 -609 82 791 -174 -739 624 388
3710 388 -902 -29 751 -352 -429 562 232 -511 -295 459 -55 -781 -151 261 -171 -463 157 364 -757
3729 -757 -820 245 217 -833 -89 868 -371 -310 499 558 -835 -17 757 -145 -871 671 696 -540 -39 634
3749 634 385 -136 -77 590 -27 -302 262 680 11 -292 340 149 -689 -139 832 -39 -467 286 553 -537
3769 -537 -94 1016 -324 -637 242 301 -692 -393 189 -11 -746 -372 518 -165 -558 -160 338 -175 -785 490
3789 490 646 -1030 -219 700 225 -1165 91 628 -433 -185 528 27 -567 85 1088 -321 -114 539
3807 539 416 -435 89 603 237 29 158 742 402 -423 157 654 -691 -252 359 -399 -848 213 659
3826 659 -397 -425 608 246 -1111 81 326 -465 -535 18 -51 -710 -315 97 -265 -710 -142 255 -364 -640
3846 -640 375 474 -495 -494 733 125 -688 118 893 0 -475 941 341 -527 375 800 -180 -472 296 551
3866 551 -33 -55 401 157 -487 130 508 383 -630 172 228 -157 -500 273 75 -716 -99 699 -334 -813
3886 -813 373 19 -707 -229 543 -349 -508 -54 183 -574 -324 183 49 -603 -58 464 38 -706 -167 623
3906 623 -221 -475 487 490 -368 -159 764 -90 -707 762 578 -594 -420 776 273 -610 439 505 13 -168
3926 -168 317 576 -65 -432 617 294 -308 -260 635 -101 -608 676 117 -538 -200 574 -498 -545 302 353
3946 353 -992 -398 683 -294 -377 120 278 -47 -46 -11 288 -368 -44 276 114 -551 -6 534 -57 -650 317
3967 317 620 -315 -206 1010 180 -794 403 566 -340 -214 768 86 -817 215 559 237 -67 176 232
3986 232 -260 -99 252 112 -292 -427 553 -118 -619 143 625 -679 -421 880 -62 -819 213 593 -600
4005 -600 -671 717 -53 -577 10 323 -357 -367 161 -78 -426 -380 416 91 -99 -329 878 133 -412 497
4025 497 850 -52 -406 799 -41 -995 444 940 0 -169 611 403 -472 192 670 -40 172 100 203 210
4045 210 -129 182 225 -200 -508 184 72 -562 -16 318 -627 -583 545 301 -719 -167 345 -654 -724 239
4065 239 132 -1137 -327 251 77 -273 237 -59 -466 -177 292 234 97 -107 383 -11 -695 -335 805 -9
4085 -9 -536 559 511 -293 184 871 -10 -405 596 596 -124 -211 319 198 -163 405 473 101 -40 223 289 -243
4107 -243 -684 -171 360 -658 -340 647 -420 -807 188 231 -788 -319 508 -168 -1225 216 -44 -572 -351
4126 -351 468 61 -657 -75 520 -93 -85 7 658 -24 -331 517 586 -363 34 761 82 -617 328 865 -371
4147 -371 -284 641 88 -607 242 731 -130 37 351 -26 -101 150 321 -211 -404 -23 490 -372 -411 114 46
4168 46 -357 -521 407 -167 -807 190 516 -642 -704 559 134 -873 47 438 -751 -539 429 -209 -451
4187 -451 90 226 -100 -174 265 559 66 -224 317 678 -109 -116 777 792 -448 -160 849 -158 -451 659
4207 659 349 -501 246 701 -376 -398 802 329 -306 -215 258 -62 -252 -181 232 -152 -628 127 53 -546 -463
4228 -463 269 287 -787 -518 318 -511 -509 238 45 -650 -302 503 -484 -542 333 70 -49 151 233 161 -357 -283
4250 -283 517 -64 -205 263 332 -232 -184 760 475 -423 168 958 26 -216 342 590 -541 -177 452 -25
4270 -25 -716 230 306 -375 -206 -101 -107 -386 -193 293 175 -263 -194 97 207 -738 164 238 -330 -327 452 103 -920
4293 -920 229 -7 -964 -269 393 -324 -594 379 117 -21 -27 363 233 7 -184 379 555 -432 -21 427
4313 427 175 -236 403 439 -366 178 452 -12 -591 548 585 -609 -324 675 209 -721 -19 456 -369 -287
4333 -287 295 -35 -187 -369 -91 108 -609 -583 138 -36 -530 -61 331 -573 -503 664 152 -808 -121 367
4353 367 -532 -363 470 12 -338 -36 349 -420 -154 514 343 366 -111 365 392 -360 -60 444 -96 -400 201
4374 201 795 71 -695 491 503 -616 -13 735 -270 -247 578 81 -765 -116 465 -360 -218 62 111 -158
4394 -158 -269 176 54 -162 -259 36 78 -426 -317 407 -461 -645 378 410 -766 40 343 -127 -278 642
4414 642 143 -359 75 487 -369 -254 49 157 -108 63 409 649 266 -333 714 413 -163 395 913 64
4434 64 -596 418 301 -379 -6 863 -78 -278 347 217 -331 -74 116 -131 -92 196 41 -634 -361 13
4454 13 26 -285 -287 -22 79 -336 -462 385 -102 -841 103 277 -284 -344 668 207 -528 436 333 8 34 504
4476 504 56 -186 295 468 317 170 347 433 -471 -393 456 439 61 -240 430 22 -346 -81 674 -655 -141
4497 -141 697 206 -720 42 360 -564 -243 123 -13 -324 -15 -86 -221 -218 -79 -113 -151 -352 -333 618 -132 -344
4519 -344 83 -174 -523 255 596 -542 -359 612 161 -613 353 739 -105 -442 399 -15 -496 188 371 31
4539 31 193 321 461 322 -18 184 441 -292 -231 523 -46 -294 182 467 -149 -193 583 297 -829 18 218
4560 218 -191 -445 112 91 -469 -96 67 -43 -241 77 96 -203 -319 -111 310 -129 -431 160 62 -381 196
4581 196 652 -58 -556 478 766 -706 -286 700 18 -245 706 212 -355 336 338 320 -100 -101 408 199 74
4602 74 -31 322 -374 -513 647 609 -718 -291 478 -75 -724 402 431 -644 -287 429 -513 -872 -11 -116
4622 -116 -267 -150 472 -205 -363 -476 109 123 226 -223 12 -140 -538 480 472 -514 -296 229 151 -397 249
4643 249 362 -289 321 510 32 -387 601 478 -375 -60 334 -62 38 337 458 231 24 291 365 -66
4663 -66 -351 360 593 -516 -319 688 8 -567 255 484 -197 -664 352 -180 -425 60 350 -294 -243 172
4683 172 96 -135 -395 -140 61 -262 -103 386 18 -708 113 477 94 -506 691 211 -297 121 462 -122
4703 -122 -112 867 37 -346 318 576 -333 -262 298 221 -81 -51 432 187 -55 -46 240 387 -569 -307 313 -187
4725 -187 -513 169 143 -760 -249 631 -446 -697 134 152 -532 -215 131 -254 -780 -56 -167 -271 -114 43
4745 43 127 0 -168 42 166 -500 64 203 154 -214 292 304 -630 -86 663 -154 -378 516 589 -186 130 443
4767 443 5 105 272 464 12 -46 268 287 115 -113 48 162 -428 -33 348 -29 -801 212 -46 -789
4787 -789 -215 350 -82 -474 -31 254 -809 -595 518 -228 -259 83 279 -113 -290 -87 130 198 -447 5
4807 5 162 -182 -166 527 110 -256 246 674 -178 19 643 192 132 345 331 -274 24 486 1 -122 317 134
4829 134 59 -113 28 176 -367 -154 184 235 -105 -536 177 -73 -522 217 324 -406 -538 198 -202 -642 417
4850 417 278 -402 -618 -91 -200 -476 -98 206 -166 -447 -95 144 -151 -130 203 527 190 -160 371 218
4870 218 -646 -182 770 -82 -287 765 138 -383 290 460 192 -227 594 432 -154 210 81 -33 -337 234
4890 234 111 -49 -262 -114 311 -291 -297 275 -3 -682 335 507 -100 -481 291 -62 -917 -145 172 -171
4910 -171 -581 81 213 -546 137 -22 28 181 327 131 -162 5 -253 290 -11 -255 393 176 -125 -82 530
4931 530 -70 -44 630 556 -137 50 625 46 -319 344 126 -180 108 428 86 -313 166 123 -115 -393 -168
4952 -168 468 -137 -597 141 566 -427 -372 278 -326 -681 148 199 -481 -50 519 -281 -455 60 97 -351 -192
4973 -192 39 -140 -204 -92 198 387 12 87 520 417 -188 447 544 -197 -125 460 84 -765 225 351 -562
4994 -562 -229 878 215 -226 217 468 -228 -29 644 327 59 76 -50 -140 -173 -190 45 -213 -613 -115 45
5015 45 -257 -148 354 70 -738 -224 568 -336 -666 149 36 -500 -49 165 -243 -79 84 44 4 98 350
5036 350 95 205 -122 362 211 -279 487 401 20 -154 570 325 -638 234 583 -230 -308 464 254 -363 63
5057 63 170 -360 -64 245 427 -569 -396 11 182 -119 -336 -255 -49 -390 -238 378 -40 -543 23 49 -618
5078 -618 -9 544 -97 -459 460 132 -429 -316 293 4 211 376 90 -112 148 121 63 180 201 91 341
5099 341 -119 -190 532 280 -422 374 163 22 140 678 -122 -524 277 244 -268 104 436 -18 -257 136 472
5120 472 -220 -258 -57 27 -354 -170 163 -181 -385 -194 515 -242 -799 -207 153 -434 -225 612 -161 -832 409
5141 409 246 -206 -200 443 -324 -155 452 215 -276 -58 468 111 270 188 137 -2 -146 -40 445 56 -79
5162 -79 391 605 -152 -224 469 -244 -224 255 388 -316 -174 309 -283 -107 -194 281 -199 -238 180 -266 -534 -203
5184 -203 -43 -64 -197 -312 119 -18 -494 29 415 -477 -609 284 -27 -300 92 -62 -228 -233 409 98 -22
5205 -22 267 283 -112 39 104 252 76 243 -71 90 139 -530 521 426 -124 175 337 -29 -365 383 63
5226 63 -401 -251 -25 -142 -154 486 327 -401 -105 125 -333 -380 -168 -270 -75 -344 -165 -259 -175 -722 160 248
5248 248 -507 -86 212 -83 -420 371 160 -485 253 542 -2 -108 410 -124 -237 -125 449 36 -321 443
5268 443 218 -51 124 53 243 -62 108 411 323 -69 -192 745 -328 -308 379 101 -403 -146 577 -241 -66
5289 -66 8 107 -201 -310 316 -117 13 152 -246 -304 -106 -297 -70 -189 -116 -42 115 -482 -329 249 -142 -437
5311 -437 132 201 -481 38 590 76 -558 359 320 -224 18 354 303 -17 61 308 86 33 47 264 348 -134
5333 -134 230 314 -100 52 300 257 -457 46 345 -408 -370 156 347 -566 184 44 -525 -205 532 46 -35
5354 -35 77 141 63 121 -385 93 279 -252 -154 -51 -274 -434 356 57 -507 -1 455 -140 -214 626 444 -12
5376 -12 264 539 -48 167 458 -59 -77 69 6 67 103 346 507 78 -457 95 285 -82 -219 -52 198 -614
5398 -614 -163 358 -234 -336 189 77 -608 110 303 -294 -458 175 -162 -503 -350 19 -151 -359 98 108
5418 108 -233 -146 102 10 -120 -155 532 177 -844 39 432 -118 -48 320 288 -168 30 477 200 40 504
5439 504 370 -27 126 285 122 -74 201 308 76 -84 64 502 22 -309 105 180 -335 -110 400 -325
5459 -325 -214 50 106 -763 -106 122 -196 -524 197 -241 12 -132 -43 -62 -153 -86 202 -160 -105 -60 297 -292
5481 -292 -303 79 278 -130 -306 467 64 -373 320 730 -532 316 403 108 -379 307 154 -17 -19 224 66
5502 66 -35 59 229 66 -195 67 -105 -154 -401 208 313 -248 -326 449 124 -578 429 243 -452 -254 68
5523 68 -142 -316 118 -144 -552 -237 121 4 -140 69 113 -187 -352 -197 414 50 -59 92 189 -155 -97
5544 -97 757 282 -539 68 327 -226 -390 572 10 17 285 508 -146 -94 179 207 -28 190 289 427 6 -35
5566 -35 -134 159 -366 93 458 -115 -97 154 183 -423 154 36 -262 -632 260 -88 -417 -109 426 -110 -396
5587 -396 38 -93 -341 31 271 -31 -91 -411 30 156 -86 -217 356 13 -543 648 395 -375 147 550
5607 550 -56 -44 234 235 -206 394 431 -273 -296 201 184 189 -241 -10 96 -259 -321 292 152 -364 -371 452 -87 -402
5631 -402 433 132 -356 -268 184 -489 -243 13 -15 -767 -243 441 -105 -623 -149 293 -212 -88 73 67 157 -393
5653 -393 4 335 60 134 455 182 -283 446 438 -152 -185 437 -21 -182 352 535 -107 -257 302 305 131 289
5675 289 8 53 52 -51 60 80 -169 43 -99 -513 -266 0 -111 -743 44 245 -457 -208 372 -88 -482
5696 -482 129 167 -273 -74 68 181 -33 140 96 125 -242 -47 -60 -68 77 183 350 -224 -144 537 504 -244 29
5719 29 475 307 -419 599 34 -129 68 466 -151 -313 158 79 -253 -72 362 -157 -290 -126 150 -127
5739 -127 -174 -135 89 186 -413 -75 141 -334 -21 31 -643 -497 118 339 -636 -262 653 -297 -379 159 -108 -511
5761 -511 179 150 -353 68 -123 95 137 -78 39 330 115 -304 88 167 -46 93 525 -295 -543 328 355
5782 355 -315 -595 316 -238 -414 49 171 -253 56 182 -152 -42 51 -12 -37 -25 11 325 -362 -207 -152 -257
5804 -257 -330 -302 259 25 -661 140 17 -598 -429 438 -137 -423 250 66 -181 -341 298 -60 76 147 182
5825 182 160 -350 371 406 -143 84 -35 421 -484 -66 461 173 -123 289 241 -418 -392 338 -162 -30 384
5846 384 164 31 -196 167 -368 -310 12 52 -62 -204 -460 -44 23 -291 -155 -110 -385 -194 107 -95 -631
5867 -631 102 114 -246 -259 306 186 -303 -155 212 -111 -158 512 -19 48 -205 241 15 -7 70 335 32 138
5889 138 129 261 -233 -124 483 94 -267 115 430 49 -263 140 -40 -355 213 178 -100 -88 -71 -63 61 196
5911 196 149 7 -22 -354 1 61 -208 -390 299 -118 -324 301 -55 -394 22 217 -120 -256 271 203 -246
5932 -246 400 238 -176 -9 150 40 -17 200 35 429 562 -76 142 346 32 62 523 4 -103 382 147
5953 147 22 1 397 -26 -426 160 87 -58 -140 420 -48 199 -155 -356 -250 114 -109 -158 -383 -212 -227 -341
5975 -341 -297 -234 -8 -189 -246 30 260 -360 -328 216 -4 -51 40 36 -174 319 210 -169 81 299 51 -205 124
5998 124 249 35 508 248 -24 -176 -146 -165 343 69 -132 272 -24 76 -35 220 269 -141 217 230 -124
6019 -124 -164 129 -67 -28 -31 -272 -103 -140 253 -1 366 81 -482 12 -34 -85 30 -38 -373 -205 392 -110 188
6042 188 233 -16 -274 193 380 -140 -176 253 300 -228 366 -128 -107 196 72 -146 525 282 -105 249 154 79
6064 79 235 318 -349 198 252 -62 -54 484 241 -324 156 484 -423 -105 43 -354 -204 81 231 -487 49 -194
6086 -194 -321 -371 -362 -39 -52 -60 -3 197 58 -262 -105 112 74 -151 33 149 -312 120 114 -79 -133 491 -200 -182
6110 -182 368 387 38 -20 268 377 51 -121 96 -252 105 -324 -10 107 26 -65 337 104 -172 485 178
6131 178 -169 -101 414 -167 -79 109 127 -292 5 86 168 -246 -307 -167 -7 -123 80 -140 195 -241 -249 139 -181
6154 -181 -59 237 -45 -258 95 13 7 17 94 -365 -287 351 213 144 257 451 97 -122 296 74 91 112 159
6177 159 154 136 51 105 62 -362 -299 247 203 -484 -67 50 -465 -195 4 -115 -199 -260 334 -155 95 155 45 -158
6201 -158 -153 -181 169 -95 -251 138 -120 21 -215 101 -93 -231 120 -36 -180 -90 355 -208 112 315 240 -11
6223 -11 370 366 -61 -43 423 242 181 241 108 303 105 -302 154 232 -295 -24 391 -382 -437 142 187 -239 -94
6246 -94 173 -191 -415 14 -42 -280 -328 184 124 -466 192 -157 -288 227 6 -279 -177 -284 58 78 -199 96
6268 96 322 327 -23 145 224 -368 -26 264 77 -19 187 200 22 149 463 -35 -14 280 258 -60 404 -58 51
6291 51 1 -121 -42 -37 446 -104 270 -7 -10 156 241 207 12 181 100 -275 -92 40 -206 -381 7 -340 -44
6314 -44 78 -36 60 -299 192 -474 14 -52 -102 -73 43 307 125 -247 226 -184 229 -93 78 138 -2 -364
6336 -364 334 207 -248 69 296 99 -241 545 58 124 82 -146 84 -36 -78 -128 54 -146 28 142 99 -4
6358 -4 82 215 -155 -337 194 12 -165 -20 149 -209 -152 276 -217 -124 -81 -143 -389 -202 202 -342 -544 -178
6380 -178 -366 -300 -2 -95 104 149 -35 -247 310 182 134 161 259 95 12 300 -476 26 496 -126 -62 132 139
6403 139 129 79 -56 -45 173 192 -149 113 218 28 -109 124 -259 -431 115 46 -196 52 129 -218 175 112
6425 112 -419 -444 134 -226 -243 -235 -46 -163 -257 164 71 99 -44 72 69 335 -112 -12 -97 96 76 374 126 -390
6449 -390 95 159 -323 143 335 -102 -126 -10 68 87 -94 127 -11 -53 127 34 209 -236 -3 5 83 -115 253
6472 253 376 -97 -322 -340 5 -233 -124 86 -152 -134 5 -167 -9 351 -53 -82 142 95 62 -215 350 34
6494 34 214 136 13 -57 28 106 0 164 113 -127 185 59 -183 -68 156 -193 -40 399 -76 -39 216 83
6516 83 -139 200 190 -79 -22 17 -281 -347 -54 -79 41 133 189 -120 159 -222 -179 -59 200 -214 -63 -187 -196 -357
6540 -357 -5 146 -418 179 57 -218 -146 -174 -59 -22 -41 -20 -12 13 -81 -358 200 27 5 30 -109 59 -210 449
6564 449 -22 149 241 176 -112 205 164 -14 -211 45 -366 282 159 100 -24 208 129 379 -92 84 -66 4
6586 4 -154 -368 -121 -124 -258 1 -83 -336 -90 242 -50 -85 106 36 -244 145 56 -143 -115 340 -60 -131 131
6609 131 210 -11 -36 -86 -13 -148 -374 125 -86 48 -3 142 224 34 265 320 328 -305 -15 235 10 256 510
6632 510 -98 -80 134 -161 173 -251 225 287 -187 -171 45 -171 8 -152 225 -237 -102 -132 60 -358 -293 -189
6654 -189 -231 -166 -62 140 155 -176 -118 203 -33 -210 -2 -37 -27 114 -26 206 141 -97 366 -130 22 277
6676 277 13 -41 185 420 34 -98 38 320 -164 268 92 -222 59 168 -168 -243 -58 53 -297 -231 -114
6697 -114 148 -323 -78 -215 -162 124 -191 -57 134 119 -327 -121 -210 -97 -58 112 -44 77 118 -276 282 184
6719 184 6 -132 66 9 -319 426 12 -63 129 -43 -24 45 391 -190 176 76 -22 -119 162 -10 138 58
6741 58 426 -45 175 322 -198 -10 63 -99 -319 -104 -125 -208 -118 -14 -188 -112 86 -321 -148 -100 -35 16 90
6764 90 -69 -198 -259 72 -304 27 223 -160 172 252 -115 163 319 113 -240 -29 -89 -50 -138 178 60 -67
6786 -67 133 110 -117 23 111 -197 75 -172 -35 268 126 -175 -74 -232 40 180 11 76 -17 58 159 -363
6808 -363 93 133 -187 24 -22 -21 169 -129 -175 -122 -79 -317 -75 172 -166 -53 -36 49 -329 77 89 -399 -199
6831 -199 -148 87 -101 -11 -2 -207 -114 227 38 89 201 -62 -250 343 36 239 499 288 -36 -110 -68 62 12
6854 12 112 188 -160 81 -55 -72 368 132 -250 33 -34 21 -117 -139 -86 65 186 -74 -476 -50 -21 79 2
6877 2 -108 54 -61 -144 -46 -71 258 -199 -178 70 96 4 -130 -174 -54 -115 91 -229 136 97 -27 -51 194 125
6901 125 -109 -48 -259 -102 -69 255 -197 -107 14 150 314 179 -94 -302 252 -198 -273 27 158 -143 -134 178
6923 178 -382 -20 90 -364 -249 18 227 -110 -84 88 -123 45 -4 16 112 -201 41 -95 -91 -71 -412 363
6945 363 366 -258 -139 199 15 -101 -394 174 -123 336 147 92 186 270 275 66 17 11 20 82 -102 -248 127 59 -39
6970 -39 67 97 -85 53 12 88 100 -185 -258 -36 -459 14 -176 254 279 -232 -12 43 257 87 112 331 -67
6993 -67 -213 -142 -426 158 -119 -94 31 -138 -62 156 134 -375 -234 284 133 -451 20 205 -114 71 93 119
7015 119 -299 -1 11 274 96 305 82 58 -110 61 139 127 127 -161 64 -152 68 46 64 139 -119 113 -70
7038 -70 -158 -150 127 -33 -19 -282 -152 -148 50 -42 249 133 -308 137 215 -180 218 -173 19 133 -50 -48 86 175
7062 175 -5 55 -425 -93 181 138 -245 -59 112 56 -41 141 -223 96 425 8 -113 133 100 40 -124 253
7084 253 -139 -275 -304 -175 -58 16 23 -35 233 -19 -54 35 -157 -62 202 48 64 -84 -101 306 -314 -124 -69 207
7108 207 -32 41 -3 -11 55 310 188 -80 -82 3 88 467 60 135 -6 -77 195 92 166 -138 172 -166 -140 24
7132 24 22 -10 -55 288 -103 -36 -200 -12 157 250 -157 -155 133 -117 -238 -2 -56 -260 -58 -206 259 -29 201
7155 201 25 148 3 -12 -95 -231 216 -75 74 88 171 107 23 -16 14 179 -39 -76 -277 -287 -49 -78 -99 499
7179 499 8 -79 -28 266 88 33 119 57 -11 -86 -300 -60 121 16 -45 85 156 206 82 -143 -233 71 -69 -304
7203 -304 226 -214 -38 240 -43 -295 145 -123 -237 -157 -351 -40 133 -455 -6 -60 -201 14 274 116 53
7224 53 76 -171 68 -7 -155 -132 -22 191 58 -68 -117 370 -298 210 -44 201 156 -253 182 7 126 6
7246 6 -63 -92 -191 -125 -238 316 251 214 -6 405 79 -53 217 -16 -385 -29 219 -176 -71 87 -128 163 -123
7269 -123 66 258 59 -215 -67 -283 -140 28 -49 110 1 195 55 108 -235 77 67 -117 -65 46 378
7290 378 -9 156 18 243 187 -37 149 128 92 123 -59 -216 -127 -50 -98 -3 -192 38 -240 45 60 -34 -112 -79
7314 -79 -119 -103 157 78 -88 -14 -45 75 -57 -106 -24 485 -235 103 -23 30 74 -59 6 69 -110 64 154 -43
7338 -43 235 -275 63 -117 112 -281 130 -115 57 65 177 -29 38 -73 -111 -164 53 -8 244 -208 320 -35
7360 -35 235 207 -119 -144 -6 -150 -63 145 216 45 18 53 22 -87 78 -158 -99 -163 286 -32 114 -226 -35
7383 -35 -92 -103 -248 -3 -91 255 38 -189 143 -284 189 -177 -175 -25 95 58 23 -241 -20 -291 -209 -7 -335
7406 -335 60 -298 -83 150 78 -156 47 -45 -171 -34 362 -132 -261 69 132 -89 -35 -113 -56 11 347 55
7428 55 94 70 200 206 -242 6 -296 -145 -38 -97 -51 -66 -52 -70 -119 -140 -6 117 -31 106 28 358 -44 -297
7452 -297 -191 11 -143 -34 49 115 -85 -139 159 237 187 41 16 252 -106 176 489 -7 62 -62 -201 -6
7474 -6 421 7 -150 29 -56 -174 145 -207 218 -46 -365 -99 -16 -177 170 -229 -24 133 -80 77 -157
7495 -157 -202 -230 51 2 -332 -288 -75 348 115 42 290 51 101 80 -46 -38 -2 -242 56 -248 -95 -212 279
7518 279 -124 -279 18 57 -43 -113 52 123 -182 -76 -129 248 59 -14 -201 -175 253 131 44 135 -55 84 -40
7541 -40 -235 -256 -72 -38 -18 -21 -63 119 224 -307 -133 -65 -136 4 -37 31 196 -175 68 -83 7 -41 138 -158
7565 -158 -109 20 173 -97 174 229 -18 163 177 121 -13 11 -198 40 333 -13 49 130 -21 47 133 44 25 -50
7589 -50 169 260 211 -52 187 22 -165 -28 -124 -172 366 -56 230 -127 8 -125 -185 -89 -89 343 -113 88 -127
7612 -127 -109 -109 217 98 95 229 131 313 82 -69 406 -8 70 -255 332 164 -45 84 29 86 -7 -362 -56
7635 -56 -100 105 -287 179 55 20 -8 -3 99 -213 -175 164 4 -76 346 91 37 197 221 65 -155 14 121
7658 121 256 -276 -323 135 -303 -85 -233 -175 -169 -118 14 -106 -115 79 105 -53 -279 258 -185 -163 104 -26 -225
7681 -225 45 80 181 -141 -98 82 294 54 42 -375 -39 -55 -88 -8 41 81 -153 18 35 -145 -76 -55 144 140
7705 140 -37 -2 -5 108 156 11 -26 -100 -95 232 -158 -151 -147 26 61 -279 70 -215 83 -187 91 23 -66 -109 5
7730 5 -15 293 -65 65 174 90 -231 90 -211 -244 -11 25 -145 -62 125 113 181 -99 -118 -56 -32 -231 -39 149
7754 149 144 28 -11 -201 100 -44 293 -136 75 -127 -77 22 -51 310 -185 180 -9 20 303 -129 104 10 65
7777 65 -94 -33 59 29 165 326 20 -195 -136 186 319 85 -234 142 -89 -37 47 -145 141 -187 51 -330
7799 -330 6 194 45 86 72 -45 -162 -60 62 126 -132 -265 -63 -217 101 -239 -52 -129 -73 -81 -95 -26 217
7822 217 -155 -342 58 71 -57 119 112 -75 43 132 -71 31 333 186 59 19 121 24 -147 -240 -82 -71 -67
7845 -67 93 -174 37 11 -70 12 -224 -92 -324 48 -11 165 -52 -11 226 222 106 -67 -243 72 -90 -25 157
7868 157 113 108 8 124 194 9 -201 70 -40 264 -92 19 79 -102 54 -83 -311 34 -146 -306 6 69
7890 69 -18 -240 -313 -418 260 -76 69 116 152 98 195 -36 42 7 -38 -218 -181 -126 17 -95 -21 117 9 194
7914 194 -124 73 -204 326 19 304 170 -193 220 -44 -166 -259 65 53 44 -30 -27 124 -65 -13 -34 188 253
7937 253 -18 -23 -88 -133 -146 62 -39 116 -72 -205 36 215 181 112 44 104 -352 113 44 117 -91 -226 -21 -84
7961 -84 22 -83 64 -121 -4 -184 -232 -55 53 53 -112 49 -55 119 277 73 68 -296 -64 -20 -150 -176 -124
7984 -124 -74 -83 356 206 -139 29 -36 -116 2 185 208 107 -54 -90 -260 -146 84 -30 -134 319 -58 -252
8006 -252 -247 -95 -25 -18 -129 235 48 29 -134 129 -168 269 -69 -370 121 -27 61 -91 -85 121 267 -63 220
8029 220 -46 -59 -107 -15 585 -178 40 -89 -111 233 -44 -12 -119 -569 -112 41 177 134 68 -95 173 65
8051 65 -181 16 -298 -46 -148 88 51 -58 -69 -35 214 30 64 52 303 13 -337 26 66 158 281 -57 78
8074 78 -157 -273 22 -57 -111 3 -252 140 5 105 -220 -139 -352 317 -144 -57 173 22 183 -263 -39 76
8096 76 14 138 32 -296 47 -29 80 58 -60 -82 176 203 116 61 -38 280 -116 84 -90 -256 -107 386 -105
8119 -105 44 294 34 344 -40 -53 2 32 -53 -12 79 -10 50 360 -208 -198 -72 205 -243 58 -161 -58 -96
8142 -96 -115 48 -58 192 289 -9 76 366 10 41 166 34 -44 -121 143 -109 255 -212 -2 -145 76 -400
8164 -400 -10 243 -104 80 16 116 149 34 44 -124 110 17 -122 42 -39 61 45 235 -34 -149 -30 109
8186 109 13 -204 198 -10 -168
8191a68
$$ Imaginary data points
##PAGE= N=2
##DATA TABLE= (X++(I..I)), XYDATA
0 0 0 0 0 0 0 0 0 8 -8 8 -8 16 -23 24 -24 32 -40 48 -56 64 -73 88 -100 114 -132 150 -172 193 -217 247
30 247 -278 310 -348 389 -432 483 -534 591 -658 730 -806 891 -988 1093 -1212 1348 -1497
47 -1497 1673 -1876 2111 -2393 2740 -3166 3720 -4460 5501 -7088 9759 -15091 29742 -148909
61 -148909 -458161 46817 273301 -23666 -67920 162736 -45613 -325946 -42701 314154
71 314154 112268 -155752 -68716 -10657 -114972 28075 239735 53830 -220707 -88272
81 -88272 97377 -4141 -20019 155313 52712 -216371 -112519 155884 92737 -46131 33818
92 33818 13286 -156828 -55712 183954 99243 -105205 -41553 34430 -78106 -34178 181361
103 181361 108397 -169703 -134595 98942 76817 -35540 55524 62918 -142652 -120946 148829
114 148829 136754 -97925 -63252 70235 -57495 -108525 129520 154656 -138552 -166958 89270
125 89270 91196 -79965 -8195 93973 -57767 -131746 52992 110979 -45517 -53015 54184
136 54184 -24952 -102044 64286 138044 -70091 -126902 78092 76007 -111201 -18774 166277
147 166277 5122 -179677 -2215 146130 -7193 -67917 65513 22951 -114714 -6304
157 -6304 132761 15116 -84216 21313 34322 -82496 -8578 145208 25638 -151263 -28783
168 -28783 116764 -7492 -78004 72611 65543 -123127 -69455 124484 44772 -103637 5046
179 5046 77392 -73819 -77958 104770 63172 -115443 -39984 99801 -13668 -102291 49443
190 49443 96125 -76410 -88275 79340 50823 -89218 -8504 100130 -32580 -108243 62216
201 62216 100004 -80267 -65879 104073 27452 -117975 18749 134282 -39524 -116686 63789
212 63789 91580 -69340 -39434 91149 5099 -95692 28106 96774 -41069 -70123 62482
223 62482 36242 -87018 -2814 109822 -21590 -119862 37112 100256 -64361 -73857 88955
234 88955 35880 -117632 -15168 114681 -15404 -100269 40733 63270 -79101 -41488 96783
245 96783 15691 -104515 1469 86504 -34406 -72106 63729 57066 -88219 -47191 92169
256 92169 26090 -83558 10737 76083 -46781 -65241 77430 56469 -80666 -22382 83164
267 83164 -11849 -72368 56594 74350 -70745 -53323 81629 31181 -75412 8540 79694
278 79694 -34424 -75929 53482 65217 -63541 -40117 73297 6521 -88293 18591 90095
289 90095 -45374 -85562 59645 55920 -84522 -30502 94283 -3387 -104357 20775 87832
300 87832 -44912 -68094 58893 36281 -77731 -15909 82086 -4997 -79039 20690 62715
311 62715 -41315 -43508 62993 27556 -75650 -8699 80216 -8295 -65986 37469 53719
322 53719 -57545 -30137 78004 15510 -72770 13565 67719 -34586 -47428 62136 36724
333 36724 -69271 -16514 72793 -2256 -65858 27315 60578 -48260 -54467 59437 37958 -68959
345 -68959 -18253 69416 -14503 -76027 34720 66080 -57654 -55630 63224 23364 -76244 468
357 468 74807 -28873 -74815 40038 56468 -52696 -36881 58402 12838 -64734 5526 64695
369 64695 -19686 -55094 35305 42356 -46502 -19973 61640 4066 -61795 20274 61002 -35393
381 -35393 -41991 56967 28011 -62780 -2650 68758 -13870 -57396 35695 47373 -47728 -29292
393 -29292 58508 14108 -60322 2659 57517 -21121 -52734 35664 41409 -52332 -32972 57459
405 57459 12179 -63958 3263 55899 -29068 -51620 42252 33378 -57344 -19853 55309 -4373
417 -4373 -54372 21100 42801 -39340 -33565 47392 20232 -51326 -5391 50967 -8649 -45473
429 -45473 26440 42066 -36700 -29438 50392 20733 -50166 2241 55122 -16601 -45277 39073
441 39073 39986 -46290 -21210 54874 7346 -50780 12621 46968 -25147 -36608 34431 24384
453 24384 -38911 -10975 38920 -5325 -40460 15644 33022 -31095 -27951 37499 11298 -49327
465 -49327 619 49112 -20194 -50887 30600 36684 -46473 -24683 52173 3908 -58499 8828
477 8828 53108 -22834 -44760 32922 31500 -42332 -18538 50006 9485 -49574 3975 49581
489 49581 -12593 -38590 29360 33281 -35944 -17403 46983 7762 -42121 11919 39592 -23373
501 -23373 -25540 38654 15645 -42357 -585 42822 -11466 -37627 22716 29126 -33229 -22337
513 -22337 36702 11231 -41548 -3854 37086 -12221 -37147 21380 27655 -36763 -23305 38817
525 38817 6809 -43836 5553 38537 -24840 -35960 33112 25417 -38890 -13534 37293 -3070
537 -3070 -35776 17184 33923 -24310 -26635 29563 18902 -30261 -2695 37976 -5987 -37536
549 -37536 18379 39038 -21485 -25954 33075 16096 -36170 519 42547 -7614 -34355 18796
561 18796 24515 -25060 -9832 32676 -232 -34145 6716 28118 -15673 -21385 21936 11413
573 11413 -32279 -9167 31642 -350 -33092 5692 23978 -22424 -22856 29166 12779 -37823
585 -37823 -6537 33488 -9210 -31713 21390 24999 -32086 -19001 34763 10687 -32277 1684
597 1684 30212 -10263 -25501 19836 24299 -21042 -14230 25763 7891 -23794 6988 29028 -12945
610 -12945 -24200 23841 20769 -25789 -6643 32164 -3480 -31018 15207 29166 -20576 -20559 24817
623 24817 8492 -28257 1309 28364 -10899 -28867 13355 20933 -21100 -16563 23976 5837
635 5837 -33761 -3648 31787 -6223 -32058 11178 21744 -24017 -16466 29198 6278 -31740
647 -31740 552 26419 -11248 -19175 21047 13685 -25625 -7188 27454 3312 -21812 7194
659 7194 21513 -12060 -16442 21054 17587 -20227 -7395 23757 709 -20794 13719 23242 -19273
672 -19273 -16768 25797 9733 -26513 3128 27603 -13500 -26380 19480 20078 -23275 -13143 23184
685 23184 1971 -27168 2588 24014 -11107 -24852 13492 16174 -22898 -12576 25428 2516
697 2516 -31377 2627 27705 -13510 -24776 20290 16980 -26726 -9156 27636 453 -24717
709 -24717 8947 21183 -14365 -14226 20048 10615 -18991 -1107 22024 -2854 -18931 11769 21235
722 21235 -13481 -14282 20106 10192 -20524 925 24934 -6573 -21385 14492 16774 -18731 -6929
735 -6929 22470 -2457 -24855 7966 21080 -14364 -17328 15405 7659 -22111 -5220 21503 -1831
748 -1831 -24390 1969 18351 -11126 -15885 15641 8954 -24396 -6801 24225 -1893 -22956 9819
761 9819 17800 -19477 -13241 25060 9054 -23703 -1842 21263 -4650 -15542 14182 15569 -15628
774 -15628 -10428 17742 8511 -13842 1728 16917 -6890 -16035 14805 17523 -14875 -10041 18335
787 18335 2385 -18822 7417 20228 -12694 -17630 14036 8798 -16305 -837 15844 -8613
799 -8613 -18758 9029 13618 -12785 -10795 12212 1173 -18931 712 19486 -5740 -21762 6471
812 6471 14625 -13791 -10119 19431 3375 -24363 752 22695 -6188 -16232 14199 10196 -19490
825 -19490 -4463 23675 3463 -19466 2974 16714 -6656 -10441 15516 11716 -15293 -7166 17295
838 17295 4998 -13192 5446 14549 -11958 -12743 18127 10091 -18266 -2130 18011 -7566 -17804
851 -17804 14006 14899 -18211 -11404 16109 2042 -17613 3561 15271 -10849 -16952 10277 10594
864 10594 -14270 -7026 14438 -1728 -20326 4608 20239 -9455 -17735 12480 10402 -18187 -2936
877 -2936 22985 -2339 -21605 7670 17706 -11073 -8376 17992 4276 -19221 1883 21308
889 21308 -2116 -15216 9156 13594 -12013 -7744 18575 8277 -18178 -3030 18056 -2559
901 -2559 -14669 11196 12444 -16644 -9139 18043 2145 -17446 4756 13768 -13544 -12753 15386
914 15386 7233 -17987 -4461 13869 -4301 -15175 7638 12757 -13201 -12948 12621 6911 -16053
927 -16053 -1350 17272 -6288 -19719 11193 18068 -15005 -11947 18834 5505 -20187 2762
939 2762 22438 -6194 -17370 11154 13870 -11575 -5486 16102 2860 -15004 2757 15995 -3732
952 -3732 -11472 9899 9819 -12911 -4750 17272 1998 -17073 3491 14837 -9867 -11361 14072
965 14072 5973 -17944 -2353 15789 -5610 -15051 8816 9606 -15396 -8833 15046 2387 -17260
978 -17260 -423 14547 -5724 -15279 8004 11847 -12706 -9676 14708 4692 -16854 1546 16742
991 16742 -6925 -13730 13376 10654 -15834 -3743 18841 -356 -16088 7442 15159 -9572 -9782
1004 -9782 14373 8515 -13579 -2100 15536 -167 -13021 6050 13077 -9437 -9718 13372 6795
1017 6795 -15843 -1536 15811 -5392 -15947 9648 11460 -14749 -8327 13881 394 -15328
1029 -15328 3888 12121 -9965 -11349 10212 5061 -13274 -2225 12641 -3654 -14815 5935
1041 5935 12908 -9506 -10887 12154 6635 -15056 -1368 17847 -2348 -16068 8424 13692 -11731
1054 -11731 -6371 16509 3225 -15923 3639 16431 -5679 -10979 11142 9379 -11870 -4725 14866
1067 14866 3648 -13707 836 13021 -4629 -11045 9378 8733 -13083 -5866 13803 100 -14121
1080 -14121 4858 10910 -11814 -10201 13200 4380 -15013 -1392 11783 -5774 -11982 8099 7956
1093 7956 -11903 -6901 10332 1728 -11656 2622 11996 -7098 -12136 9887 10776 -12182 -5336
1106 -5336 14879 722 -15984 5800 17103 -7437 -11723 12625 8214 -12846 -228 15852
1118 15852 -2104 -13632 6417 12192 -7581 -7426 11516 4676 -12948 -1403 14567 -997 -13257
1131 -13257 4031 10885 -9136 -8395 12337 4333 -15204 -1817 12471 -5095 -11035 8619 6125
1144 6125 -14064 -4334 12857 -717 -12744 3294 9214 -8448 -8524 10295 6069 -12002 -3837
1157 -3837 11440 -258 -11149 5455 11461 -9054 -8838 12820 6696 -13296 -24 15237 -3849
1170 -3849 -12772 10409 11958 -11315 -5811 13922 3251 -12549 2738 12638 -5259 -9661 8620
1183 8620 8232 -9948 -4630 11030 1169 -12212 2314 11505 -7235 -11095 9043 6783 -12722
1196 -12722 -4267 12635 -2264 -13540 5006 9377 -9903 -7614 10196 1943 -12126 857 10151
1209 10151 -4820 -9221 6995 6845 -9596 -4868 10663 2257 -11388 1668 12088 -4536 -9837
1222 -9837 9375 8202 -11021 -3326 13696 341 -12184 5772 12136 -7700 -7346 11585 4964
1235 4964 -11222 -427 12142 -1822 -10286 5092 8770 -6744 -6401 8441 3399 -10444 -1194
1248 -1194 10226 -2846 -10547 4980 7314 -9470 -5465 10812 -4 -12799 1859 9762 -6293
1261 -6293 -8293 8025 3806 -10821 -1216 10574 -1876 -9686 4116 7535 -6181 -5483 9108
1274 9108 3936 -9790 -1089 11518 -819 -9717 5566 9645 -7622 -5975 11383 4294 -10100
1287 -10100 1213 11030 -3948 -8118 8027 6477 -8821 -2320 9710 -221 -9129 3573 8388
1300 8388 -5628 -7085 6700 5115 -9004 -3421 9296 -594 -10895 2542 8688 -7231 -8359
1313 -8359 8099 3856 -11325 -1055 10052 -4027 -10243 5550 7176 -8428 -4671 8616 1053
1326 1053 -8666 1965 8234 -4222 -6898 6091 6246 -6692 -2614 9027 1333 -9049 3581
1339 3581 10405 -5258 -7546 9036 6014 -9524 -997 11033 -1687 -9695 5615 8685 -7348
1352 -7348 -5455 8775 2764 -8746 165 8251 -3005 -8082 4400 6362 -7000 -5352 7231
1365 7231 2039 -9055 -277 8196 -3826 -8452 5593 4950 -9068 -2893 8199 -1536 -9158 3636
1379 3636 6674 -6944 -5159 7607 2176 -8224 -302 8019 -1837 -6872 4313 6594 -5263 -4262
1393 -4262 8010 3790 -8046 -32 9378 -2087 -7653 6213 7127 -7606 -3150 9544 1447 -8500
1407 -8500 2228 7976 -4362 -5483 6520 3363 -7358 -1710 7094 -767 -7262 1884 5088 -4433
1421 -4433 -5113 5713 2939 -8080 -2166 7408 -1579 -7933 3270 5887 -6703 -4418 7386 1670
1435 1670 -8060 938 6936 -3778 -5555 5535 3613 -6595 -1681 6856 292 -5365 2331 6335
1449 6335 -3281 -4874 5446 4957 -5222 -1804 7173 114 -6696 3469 7422 -4347 -4842 6676
1463 6676 2774 -6979 578 7572 -2784 -6979 3914 5143 -4629 -3317 5338 -30 -6331 388
1477 388 5431 -2096 -6169 2263 3321 -5411 -2684 5910 254 -7638 1168 6574 -3734 -5147 5423
1492 5423 2669 -7400 -691 7266 -1277 -5821 3558 4021 -4809 -2074 6145 1615 -5477 -28 6071
1507 6071 -1174 -4425 3802 4601 -4687 -3489 6924 2807 -6544 778 6620 -2541 -5549 5467 4272
1522 4272 -6129 -2338 6223 -573 -5705 3099 4729 -4677 -4290 4139 2082 -5166 -951 4333 -1493
1537 -1493 -5431 1438 4565 -3560 -4383 3530 1464 -5762 213 5873 -2283 -6195 3358 4562 -5125
1552 -5125 -1903 6150 -383 -6442 1770 5827 -2530 -3387 4048 2328 -4308 -400 5838 507 -4859
1567 -4859 1422 4645 -2161 -3041 4451 3030 -5589 -1132 6179 -44 -5267 2562 4499 -4666 -2981
1582 -2981 5400 1320 -5154 329 3894 -2543 -3553 3066 2327 -4324 -2172 3119 429 -4374 28
1597 28 3536 -2862 -4516 2965 3158 -4251 -2208 4304 -636 -4646 2025 4490 -3418 -2963 4277 1657
1613 1657 -4249 454 4665 -1316 -3414 3124 3720 -2657 -1726 3998 1465 -3372 503 4595 -255
1628 -255 -3881 1900 3292 -2997 -1867 4625 872 -4851 875 4387 -2258 -3669 3246 2017 -4545
1643 -4545 -1055 4096 -464 -4281 940 2522 -2617 -2824 2095 1246 -3491 -1449 3239 -351 -3684
1658 -3684 950 3097 -2890 -2792 3540 1636 -4141 -189 3999 -1606 -3079 3209 2190 -3341 -632
1673 -632 3948 -184 -2672 1796 3013 -2092 -2014 3101 2160 -2471 -547 3639 374 -3316 1525 4135
1689 4135 -1924 -3410 2902 2005 -3656 -366 4180 -994 -4424 2032 2866 -3468 -2186 2916 -209
1704 -209 -3903 500 2848 -1335 -2813 1113 1079 -2285 -1399 2302 237 -3080 -53 2787 -1230 -2514
1720 -2514 2265 1474 -3587 -570 4349 -285 -3244 2147 2584 -2917 -1099 3942 1174 -3157 628
1735 628 3330 -823 -2046 2192 2417 -1775 -1372 3135 1408 -2326 -131 3502 -1116 -3033 2133 2426
1751 2426 -2503 -1632 2923 -132 -3695 810 2719 -2334 -2406 2054 849 -2978 -574 2319 -807 -2675
1767 -2675 540 1973 -1438 -2002 1556 1076 -2532 -739 2630 303 -2935 804 2370 -1964 -1487 2785
1783 2785 595 -2585 798 2924 -1174 -1355 2358 1551 -2125 -342 2970 53 -1969 1081 2445
1798 2445 -1104 -1530 2127 1873 -2186 -827 2957 527 -3220 706 2907 -1896 -2738 2204 1143 -2957
1814 -2957 -581 2716 -463 -3123 1045 2004 -1768 -1548 1400 179 -2201 -458 1566 -657 -1934
1829 -1934 706 1559 -1477 -1094 2078 744 -2515 34 2415 -556 -1844 1997 1649 -2146 -151 2723
1845 2723 11 -1817 1911 1927 -1553 -791 2343 1278 -1679 -114 1953 -56 -1523 1267 1714 -1142
1861 -1142 -1571 2017 1334 -2318 -619 2612 -832 -2666 1250 1752 -2309 -1487 2214 -97 -2354 409
1877 409 1528 -1546 -1798 1080 763 -1483 -594 1254 34 -2013 -97 1704 -840 -1379 1142 1212 -1841
1894 -1841 -724 2170 353 -1922 706 1848 -1201 -477 2389 695 -1635 785 1905 -284 -663
1909 -663 1316 783 -1519 -129 1845 541 -1375 371 1644 -448 -1329 932 1293 -1909 -1332 1732
1925 1732 -21 -1996 204 1789 -1659 -1684 1666 555 -2334 -472 1620 -605 -1939 520 1020 -1289
1941 -1289 -1177 1019 715 -1589 -557 1415 189 -1630 141 1093 -941 -925 1870 602 -1442 101
1957 101 1762 -508 -912 1643 1351 -1224 -54 1800 80 -1064 1031 1031 -600 -567 1359 712 -1130
1974 -1130 -475 1424 -52 -1831 592 1549 -891 -1585 1359 1106 -1975 -182 1648 -654 -2055 1292
1990 1292 1261 -1680 -990 1374 163 -1822 224 1087 -577 -1342 720 867 -1318 -931 1377 350 -1355
2007 -1355 164 1571 -252 -1318 1086 1008 -1162 -85 1864 44 -993 855 1308 -1236 -548 1760
2023 1760 552 -1425 179 1345 -243 -1018 816 775 -1093 -818 1117 126 -1638 -85 1270 -743
2039 -743 -1695 799 1044 -1651 -666 1522 -280 -1771 256 1486 -1341 -1189 1077 639 -1459 -268
2055 -268 1204 -85 -1106 250 1206 -377 -671 629 798 -1040 -219 1621 28 -1113 631 1324
2071 1324 -956 -669 1660 619 -1261 147 1359 -466 -884 993 465 -1210 -180 1135 82 -1094
2087 -1094 554 738 -618 -1098 670 631 -1284 -1015 1293 -251 -1643 631 1114 -905 -1186 1025 206
2104 206 -1233 -213 1475 -502 -1223 1149 860 -1167 -743 935 -25 -875 119 1324 -160 -927 544
2121 544 1064 -734 -274 1131 134 -1195 111 1729 -149 -980 798 277 -1154 -25 1645 -111
2137 -111 -845 688 1175 -729 -454 1111 -39 -1013 5 846 -289 -1123 393 552 -959 -880 1006
2154 1006 21 -1537 -30 1050 -359 -1520 858 813 -1225 -371 1040 -450 -879 644 843 -943
2170 -943 -500 541 546 -731 14 1106 -105 -763 409 599 -442 -636 897 700 -855 163 982 -37
2188 -37 -1076 938 907 -837 -125 1132 135 -1162 121 1041 -593 -548 724 374 -881 -375 921 -42
2206 -42 -1189 283 701 -485 -786 527 624 -1280 -394 497 -610 -1104 507 818 -1138 -725 1277 -66
2224 -66 -1288 330 800 -529 -620 768 618 -632 57 832 -37 -611 328 695 -12 -774 710 1137 -630
2243 -630 -288 992 259 -1097 491 662 -456 -607 803 173 -841 -122 866 -63 -784 346 283 -380
2261 -380 -458 603 -34 -855 -82 526 -616 -889 334 339 -772 -536 680 120 -1056 129 611 -396
2279 -396 -472 805 329 -858 -38 679 -63 -635 465 642 -432 -209 495 136 -748 98 956 -194 -648
2298 -648 334 604 -435 -169 693 263 -700 356 828 -307 -313 852 103 -869 -46 738 -470 -684 93
2317 93 250 -549 -225 346 -2 -877 122 414 -327 -820 220 242 -1124 -454 852 129 -833 482 527 -318
2337 -318 -505 444 363 -871 -229 872 -107 -428 268 738 -82 -344 647 332 -500 -193 644 38 -170 450
2357 450 819 -385 -262 702 201 -674 -33 499 -481 -747 690 331 -381 -170 488 -287 -574 497 319
2376 319 -438 -435 538 -99 -420 -225 344 -179 -710 210 353 -246 -455 718 299 -400 207 884 -460 -599
2396 -599 573 504 -293 -76 651 -193 -542 478 503 -75 -283 195 159 -381 -268 447 12 -175 -45 508
2416 508 -403 -318 519 400 -701 313 528 -420 -366 260 375 -480 -63 553 -39 -720 300 164 -206 -386
2436 -386 340 336 -670 18 623 -307 -539 339 350 -349 -314 313 208 -648 -107 1051 -170 -354 627 449
2456 449 -394 -62 707 -149 -402 336 211 92 -182 534 104 -406 90 286 163 -495 -14 234 -293 -273
2476 -273 591 171 -426 -87 659 -95 -133 568 21 -514 -176 341 163 -519 174 552 -390 -220 338 145
2496 145 -293 90 218 8 -468 205 384 -240 -337 493 86 -454 81 754 -221 -68 365 586 -501 -301
2516 -301 641 321 -246 146 108 -518 -23 207 292 -471 -73 702 17 -470 277 175 -400 -381 199 75 -463
2537 -463 -74 301 -271 -520 559 -25 -441 111 421 36 -294 309 398 -454 -525 435 -305 -209 46 489 -156
2558 -156 -228 319 271 -358 -131 530 -37 -677 97 435 -217 -345 617 319 -431 33 612 -78 -341 172 445
2579 445 -78 -197 133 -15 -493 -153 464 -101 -427 149 381 -493 -154 338 -125 -566 -223 400 -210 -456
2599 -456 319 129 -75 -206 248 -315 -592 660 171 -415 63 651 52 -447 132 430 -143 -82 159 438
2619 438 -702 -59 487 196 -338 76 425 14 -94 549 368 -548 -238 546 47 -633 315 213 -414 -619
2639 -619 329 40 -634 -114 733 -145 -677 506 317 -540 -197 41 33 -519 -238 450 -197 -377 154 402
2659 402 -523 -187 532 -162 -462 390 116 -498 -362 591 276 -302 75 291 -77 -408 308 771 -340 -463
2679 -463 433 13 -493 135 842 -505 -602 546 299 -835 -57 603 55 -590 107 454 -477 -382 310 -103
2699 -103 -270 -148 80 -232 -471 144 373 -204 -550 504 304 -591 43 585 -202 -693 134 262 -298 -162
2719 -162 558 -296 -759 150 240 -300 -283 587 159 -438 -34 404 -40 -225 505 369 -282 -295 640 232 -473
2740 -473 77 543 -265 -478 561 120 -427 -307 458 129 -703 441 332 -387 -377 533 133 -715 81 620
2760 620 -428 -650 169 356 -347 -710 415 230 -745 -76 536 -331 -580 637 344 -276 -280 526 -118 -458
2780 -458 290 750 -220 -508 671 347 -694 -17 549 -15 3 353 589 -260 -444 398 427 -564 -507 567
2800 567 -141 -744 228 539 -512 -584 429 -262 -619 100 510 -65 -436 431 177 -781 -188 465 -20 -336
2820 -336 199 629 -721 -638 456 562 -510 -253 398 -131 -541 206 545 -489 -431 899 77 -591 502
2839 502 634 -569 -464 602 536 -435 -69 833 -100 -230 154 602 -473 -375 454 392 -651 -409 986
2858 986 30 -861 -60 705 -675 -663 487 -85 -693 14 779 -141 -565 466 132 -227 -514 509 155
2877 155 -870 59 337 58 -334 273 164 -325 -594 742 205 -588 166 531 -357 -412 554 192 -616 258
2897 258 695 -278 -285 553 653 -586 -12 1125 108 -673 120 633 -107 -726 438 624 -178 -523 853
2916 853 303 -675 -99 771 -610 -624 608 475 -855 -228 701 -124 -743 222 422 -520 -541 210 -22 -550
2936 -550 -423 388 -79 -918 111 742 -185 -230 498 328 -663 74 640 -302 -586 703 591 -776 -109
2955 -109 867 92 -711 170 522 -164 -457 608 592 -391 -202 457 307 -482 206 403 -520 -553 621 398
2975 398 -897 -363 755 94 -893 782 541 -702 -618 712 73 -840 -70 236 -656 -516 432 256 -155
2994 -155 -343 158 59 -634 87 822 -32 -667 416 803 -480 -105 831 -31 -784 560 777 -470 -253
3013 -253 679 99 -680 364 586 -487 -393 323 301 -523 -286 441 284 -440 -42 276 -249 -551 217 711
3033 711 -777 -559 616 150 -934 -142 535 -830 -680 802 -222 -1065 -44 541 -261 -713 93 226
3051 226 -594 -468 468 289 -447 -142 435 -107 -549 463 630 -301 -709 812 244 -586 371 884 -258
3070 -258 -764 681 633 -628 259 366 -49 -664 355 533 -363 -312 646 405 -502 -120 415 0 -913 206
3090 206 640 -455 -479 449 106 -942 160 889 -387 -632 451 455 -626 106 704 -310 -449 287 441
3109 441 -227 -146 374 163 -652 -479 540 98 -735 246 946 -230 -189 1017 424 -1055 116 855 -143
3128 -143 -306 552 257 -456 -263 612 -28 -525 100 236 -356 -410 273 378 -391 -417 132 -99 -727 68 591
3149 591 -458 -781 589 208 -1021 -283 1158 -49 -769 528 423 -644 -537 651 306 -540 21
3166 21 539 -189 -520 39 520 -61 -344 591 380 -591 246 874 78 -354 744 445 -585 -473 924
3185 924 7 -832 206 752 -299 -357 704 276 -687 199 728 -164 -577 -131 259 -543 -401 290 318 -500
3205 -500 -319 721 -217 -943 157 708 -747 -785 771 143 -519 185 691 -542 -704 700 318 -396
3223 -396 106 400 182 -346 199 278 -126 -454 374 677 -252 -265 725 38 -707 349 801 -511 -310 509
3243 509 416 -709 415 793 -566 -578 382 428 -639 -254 347 -232 -462 -125 607 -412 -761 112 241
3262 241 -472 -462 596 -6 -1392 -20 1053 -602 -598 368 278 -721 -14 904 -405 -428 495 449 -57 -291
3282 -291 748 327 -325 72 698 48 -564 384 834 -374 -594 1132 488 -616 163 874 -502 -425 587
3301 587 296 -806 -346 516 -44 -722 647 395 -547 -327 435 221 -450 36 472 -359 -644 -29 517
3320 517 -265 -588 296 153 -791 -38 727 -408 -923 607 973 -599 -160 741 -63 -848 435 775 -337
3339 -337 -552 345 132 -293 136 620 350 -305 400 825 -72 -394 546 566 -771 -441 1178 -94 -668
3358 -668 473 391 -691 -271 638 -243 -459 332 329 -594 -423 229 28 -519 -300 531 -181 -819 119 299
3378 299 -347 -847 560 1072 -784 -195 739 49 -1098 536 723 -597 -621 1007 315 -608 239 800
3396 800 -137 -299 397 463 -235 -91 390 245 -444 56 568 63 -658 254 917 -508 -315 691 125 -558
3416 -558 503 333 -522 -496 728 132 -976 116 566 -291 -623 326 119 -583 -509 208 -126 -617 -771
3435 -771 493 61 -892 48 618 -564 -534 738 230 -982 56 974 -178 -410 865 508 -261 -54
3453 -54 822 -90 -587 333 459 -385 -120 581 670 -364 -28 694 401 -775 156 728 -406 -479 833 518
3473 518 -880 -60 687 -211 -789 600 537 -883 -160 313 -95 -542 118 260 -333 -526 461 294 -513
3492 -513 -288 283 85 -1067 -84 228 -330 -331 525 432 -924 -13 1192 -60 -361 905 502 -525 -17
3511 -17 979 321 -554 313 781 -378 -282 529 710 -99 -158 471 251 -679 222 648 -281 -840 414 457 -890
3532 -890 -246 790 -175 -1149 335 322 -700 -328 451 -289 -547 210 419 -185 -663 320 231 -405 -208 627
3552 627 163 -547 1 848 6 -647 306 964 -228 -438 1242 23 -1006 369 788 -578 -137 506
3570 506 255 -431 -126 632 133 -371 263 529 -168 -173 499 238 -663 -147 667 195 -626 185 768 -700
3590 -700 -505 499 -151 -562 -25 435 -663 -578 698 -43 -716 -486 68 -340 -503 69 235 -709 -444
3609 -444 249 327 -597 -364 675 142 -615 465 771 -595 -885 897 145 -603 380 944 -227 -396 646
3628 646 639 -254 -74 697 7 -455 446 254 -84 -384 -41 634 -438 -272 623 149 -756 -12 643 -372
3648 -372 -581 399 495 -975 -215 613 -395 -566 167 -23 -804 -91 648 -328 -705 126 389 -375 -148 354
3668 354 550 -359 -555 610 490 -497 144 1082 -192 -344 664 792 -530 190 812 30 -713 744
3686 744 838 -258 64 639 -207 -275 41 761 -262 -547 29 380 -211 -483 345 -9 -876 59 557 -506
3706 -506 -759 78 354 -1013 -197 771 -433 -975 83 334 -710 -21 550 -213 -420 -259 674 113 -398
3725 -398 201 674 -559 40 383 497 -502 114 997 182 -704 671 847 -541 -93 985 423 -659
3743 -659 477 806 -555 -264 613 230 -493 -112 417 76 -316 145 399 -178 -457 64 259 -533 -495 228
3763 228 -170 -807 151 408 -694 -367 874 111 -1009 11 573 -457 -828 528 -32 -581 -232 210
3781 210 -320 -483 -131 585 23 -243 516 513 -431 -56 1120 328 -541 24 814 -374 -377 489 155 -642 415
3802 415 942 30 -686 692 548 -187 -300 498 63 -476 -15 281 -71 -818 73 448 -776 -538 574
3821 574 -43 -1151 -113 566 -454 -672 701 146 -770 -139 551 -352 -350 486 179 -390 -340 351 349 -551
3841 -551 229 404 -200 -295 330 747 -122 -593 608 377 -436 267 938 -185 -748 550 489 -318 136 591
3861 591 -118 -436 355 476 -288 -242 449 219 -563 1 562 -235 -272 -246 134 -434 -557 24 347 -1063 -172
3882 -172 528 -532 -558 440 411 -826 -119 687 -231 -629 151 127 -527 -287 613 147 -499 442 662 384
3902 384 -224 201 851 189 -144 869 744 -431 -165 593 158 -603 151 557 -429 -279 684 165 -310
3921 -310 413 609 -417 -208 261 84 -272 -733 318 95 -617 -231 248 -186 -656 -136 301 -618 -369
3940 -369 630 -268 -841 19 465 -441 -434 636 -44 -577 -257 527 -186 -334 399 448 82 -92 546 218 -336
3961 -336 51 403 233 -344 222 667 -188 221 1029 160 -796 146 268 -394 -475 947 337 -617 280 385
3981 385 -304 -563 30 238 -285 -258 -309 216 -253 -247 408 -77 -368 -96 261 -607 -515 343 160 -1056 195
4002 195 339 -842 -400 432 476 -565 -293 440 -161 -254 197 148 -454 -11 280 609 -128 220 366 246
4022 246 -221 179 362 -275 -503 723 179 -835 47 571 -250 -562 397 235 -557 -417 431 -318 -895
4041 -895 49 58 -283 -549 -250 -54 -427 -735 203 106 -587 -286 755 -34 -804 121 334 -587 82 486 -157
4062 -157 -618 377 717 -566 -293 918 215 -472 372 377 59 -77 42 218 -224 -341 656 539 -740 -70
4082 -70 597 136 -637 530 555 -428 -517 790 -220 -1034 308 326 -416 -481 447 -263 -497 -204 29 -271
4102 -271 -528 -331 105 -283 -434 48 248 -808 -479 246 203 -649 204 603 -488 -340 536 152 -681 218
4122 218 931 -263 -244 696 159 -259 355 716 34 -224 583 478 -42 -269 303 520 -359 30 615 189
4142 189 -591 4 869 -689 -604 477 89 -617 2 255 -370 -614 343 99 -508 -142 305 -171 -389 -177
4162 -177 171 -14 -501 -156 159 -199 -480 -14 282 -320 -131 762 -153 -486 453 409 -525 415 631 -105
4182 -105 -442 760 556 -351 413 400 243 -144 162 384 152 -23 335 529 -308 -258 602 235 -769 -230
4202 -230 778 -61 -347 739 266 -896 -306 581 -462 -616 43 430 -328 -184 -40 -39 -329 -17 424
4221 424 73 -619 -294 388 -190 -593 535 531 -521 -215 427 -62 -265 494 460 -509 37 526 204 -574
4241 -574 630 760 -425 -85 306 384 -156 -13 439 73 -289 -85 585 12 -353 252 522 -437 -159 376
4261 376 -258 -832 -65 472 -753 -601 355 -224 -727 -411 174 -510 -372 411 214 -211 -238 -106 -300 -333
4281 -333 -241 330 -86 -165 -247 635 -143 -325 568 373 -508 125 577 -359 -108 123 104 -291 183 328 -60
4302 -60 108 491 88 101 -294 416 206 -286 -114 374 383 -233 125 504 -504 -579 651 66 -466 -92 363
4323 363 -475 -649 449 -158 -667 -281 52 -321 -409 52 110 -215 -421 -91 247 -191 -154 195 227 -699 -56
4344 -56 753 -23 -726 299 355 -532 28 876 -251 -335 574 206 -558 93 800 -179 85 206 502 151
4364 151 -319 222 97 -117 -70 35 285 -388 65 331 -133 -423 393 285 -537 -14 441 -188 -664 163
4384 163 117 -950 -136 412 -110 -472 -74 145 -259 -362 131 347 -323 -113 171 301 -136 -103 593 -147
4404 -147 -249 266 348 -269 -343 852 -43 -589 503 876 -496 299 608 15 -312 197 500 86 -212 185
4424 185 82 -136 -95 140 449 -420 -65 230 81 -1017 121 304 -588 -352 434 -158 -839 -29 624 -507
4444 -507 -241 385 -307 -234 26 329 -42 -246 -181 249 -9 -465 214 257 -143 -391 676 231 -373 218 670
4465 670 -350 -180 682 560 -548 120 853 -423 132 720 21 -296 308 417 -279 -78 111 342 349 -347
4485 -347 519 87 -578 -376 200 290 -595 -83 290 -515 -826 492 59 -915 40 328 -661 -315 672 -5
4505 -5 -507 17 68 -190 26 83 188 -35 -483 -84 293 -77 -410 546 250 -280 255 845 31 -243 614
4526 614 362 -498 283 929 -278 87 276 327 -547 -357 244 72 -270 -85 176 152 -203 9 335 -192
4546 -192 -286 340 194 -832 -107 479 -374 -454 180 206 -740 -286 534 -263 -751 67 398 -474 -112 250 65
4567 65 -350 266 369 85 78 -116 203 -167 -309 107 321 -554 229 550 168 -399 456 599 -393 -12 841
4588 841 -251 -393 -17 226 -276 -49 173 -155 -486 217 24 -95 -189 -133 409 43 -347 183 151 -531 -514
4609 -514 277 82 -939 171 283 -460 -273 548 12 -614 195 499 -314 -192 404 229 175 78 174 89 103
4630 103 264 499 107 -77 233 560 -2 -315 249 410 -342 305 793 -379 -385 642 125 -40 274 537
4650 537 -291 63 362 347 -270 1 127 -207 -516 -196 342 -91 -441 333 175 -65 -274 170 -61 -709
4670 -709 140 442 -737 -708 458 21 -561 -15 220 67 -390 416 336 -120 48 96 38 192 -27 181 294
4691 294 -162 218 374 108 -132 396 412 -230 0 495 -234 -372 560 37 -577 -29 448 -319 -354 200 221
4712 221 -399 -220 159 23 -189 -285 141 -133 -400 -504 176 -154 -513 377 -17 -726 -198 576 -189 -506
4732 -506 279 199 -822 -140 547 -71 -148 8 180 -245 -96 441 254 -27 -77 441 263 -62 19 428 112
4753 112 -212 291 696 -362 -142 667 -85 -336 202 349 -532 -56 39 -120 -598 104 27 -189 -321 -105
4773 -105 150 -221 -453 83 69 -219 -465 431 -205 -690 145 402 -453 -621 462 -107 -794 235 759 -262
4793 -262 -84 431 -40 -318 201 605 142 -213 -48 412 92 -495 354 264 103 43 451 205 -176 61 603
4814 603 -170 -429 468 316 -343 275 435 -132 -60 363 31 -569 55 -187 -106 -66 -16 -49 -197 -810 355
4835 355 108 -396 -346 -27 191 -585 -286 194 -350 -459 508 111 -823 358 637 -277 -168 735 263 51
4855 51 19 70 11 -17 208 -10 -84 178 174 274 -61 -110 179 295 -474 256 541 97 -334 806 353 -449 26
4878 26 496 -20 -526 10 60 -495 91 190 -479 -426 -30 -121 -175 -459 77 -102 -470 -355 78 327 -809 -239
4900 -239 464 45 -469 346 415 -441 -149 725 -28 -480 284 264 247 122 592 198 -56 418 263 197 -161
4921 -161 2 151 192 -67 163 592 -347 -127 413 148 -683 125 557 -525 4 369 -200 -925 57 65 -332
4942 -332 -401 171 -266 -532 -248 -215 -292 -450 -523 222 -236 -553 216 -2 -506 -320 288 239 -655 100 376 -68
4964 -68 -407 728 94 -576 165 562 71 49 516 -47 252 166 352 -55 42 353 218 187 -341 299 558
4985 558 -152 -128 360 186 -797 -182 431 -422 -212 463 -20 -741 -175 118 -586 -308 30 2 -826 58 197
5006 197 -401 -282 -377 146 -46 -420 -131 115 -44 -307 209 159 -198 93 734 58 -617 508 184 -576
5026 -576 206 661 35 -128 576 200 -203 368 84 165 101 122 200 132 -55 -123 229 47 -177 97 152 -660
5048 -660 -118 595 -91 -196 303 484 -492 -334 364 -609 -243 7 -242 -493 -228 85 -353 -306 -379 -82 61
5069 61 -269 29 515 -205 -279 289 387 -371 60 429 -393 -277 742 338 -393 267 411 -36 -311 439 147
5090 147 -258 29 319 10 -221 3 262 241 -311 219 323 -188 -420 -95 292 -27 -255 504 113 -554
5110 -554 -61 -84 -268 -182 124 -331 -467 -193 52 -131 -218 335 3 -198 -261 -211 -10 -432 -250 334 -232 -337
5132 -337 182 458 -378 -233 495 156 -420 381 598 -163 -65 458 320 -236 181 375 -189 -191 276 106 147
5153 147 -404 330 42 -432 -200 263 -11 -253 -208 192 -221 -665 423 -40 -710 165 253 -401 -416 266 -190
5174 -190 -692 146 -103 -195 206 127 44 -149 -300 123 224 -483 -240 67 468 1 150 336 -61 -398 595
5195 595 152 -273 226 625 -88 -86 550 258 -335 -21 354 -9 -60 12 180 201 37 146 348 -64 -253 186
5217 186 114 -351 -86 188 15 -399 142 -28 -481 -8 329 -653 -341 200 -57 -456 -15 149 -562 -377
5237 -377 -198 69 -12 -7 218 100 -263 -218 297 410 -129 -118 767 -57 -178 419 551 -178 208 380 -154 -286
5259 -286 117 387 -74 -88 -71 433 -205 -30 -133 -52 -99 -3 -184 -59 -222 -100 -111 -466 -134 741 -209 -1029
5281 -1029 -44 50 -478 -559 372 -298 -459 184 119 -749 -219 242 -431 -49 -367 114 -96 -292 122 27 -45
5302 -45 -236 258 183 -334 -41 435 229 -192 199 401 -177 26 616 337 -527 56 85 -151 -101 127 105 -31
5324 -31 -138 350 95 -147 54 6 -243 -288 87 15 -169 -251 239 -100 -460 -181 221 -488 -580 374 105 -647
5346 -647 -117 439 7 -434 234 -303 -66 356 31 -137 110 -146 27 101 -74 120 450 -15 111 378
5366 378 290 -222 249 595 179 -261 344 251 -447 -1 445 -3 -175 -189 188 -29 -245 -91 -119 -320 4
5387 4 68 -161 -594 -408 226 -227 -71 139 89 -458 -255 128 -294 -334 164 -308 -705 24 220 -14 -496 -37
5409 -37 -11 -422 199 37 204 -73 175 387 32 80 -101 257 42 -66 424 320 -362 -182 635 139 -226
5430 -226 386 174 -458 -172 2 421 -424 84 176 -232 83 -9 162 -18 -173 -400 -164 -352 -256 -297 -300 -458
5452 -458 62 107 -399 -317 596 -59 -553 -110 253 -345 -427 342 -58 -296 92 51 63 181 -150 122 318 164
5474 164 277 592 -159 -82 206 158 -158 183 600 167 -136 234 -110 -258 244 449 -159 94 492 -233 -374
5495 -374 55 114 -214 -85 138 -257 -426 -177 -3 -188 -65 -52 -278 -112 -392 -277 341 -98 -205 197 -30
5516 -30 -723 -128 288 -294 -446 122 212 -375 533 16 -227 32 245 286 131 17 -62 -4 176 -236 139 203
5538 203 -112 87 359 -28 90 451 276 -646 -60 732 229 -542 224 192 -546 -250 320 -200 14 166
5558 166 -103 -272 7 -207 -8 -223 -578 63 76 -676 -94 69 -131 -291 77 389 -241 25 265 -161
5578 -161 -267 497 227 -281 -133 368 -185 -156 225 165 172 252 409 394 204 -198 340 262 106 -174 350 63
5600 63 -235 172 675 -220 -54 76 -196 -427 418 175 -550 -199 38 19 -37 -72 -5 57 -92 -282 -237 -414
5622 -414 -240 -60 233 -178 -145 359 -348 -587 225 -69 -380 -435 553 -305 -524 75 180 -446 30 694 -116
5643 -116 82 550 414 191 232 -70 67 91 346 72 506 -199 -294 122 247 -283 161 405 -26 -230 112
5664 112 20 -314 196 339 -63 -39 194 34 -229 -43 -60 -135 -421 -186 -158 -235 -267 22 -77 -112 -577 101 -204
5687 -204 -301 -176 65 -190 -152 482 -157 -224 136 266 -200 -42 476 375 -266 138 455 174 19 23 136 227
5709 227 17 -102 263 66 145 -64 38 -317 111 388 -451 -433 609 234 -604 -132 535 -432 -438 29 -125
5730 -125 -253 -45 -166 26 -305 108 -117 -128 -216 -46 88 -32 -318 -3 224 -292 34 -61 -79 -208 192
5751 192 -166 -198 -97 318 -133 -273 326 -56 -168 -35 302 21 -159 64 7 173 -231 177 280 238 -154
5772 -154 -140 383 -459 -165 336 -178 -115 215 -65 -562 183 226 -216 -423 175 120 -176 63 152 -43 -345 -304
5794 -304 -96 59 89 -171 188 -193 -262 -316 92 -381 -247 350 -162 -547 210 360 -219 61 304 174 -255
5815 -255 282 259 -72 208 518 317 -214 115 306 277 -75 8 122 401 -331 156 139 -94 -364 451 91
5836 91 -625 -177 145 -459 -411 224 15 -415 162 99 -422 -36 117 -245 -449 -100 -98 179 -291 -115 137 -25
5858 -25 -300 -84 344 -249 -299 196 190 -410 188 363 127 -229 287 288 14 40 454 -148 -94 338 53 2 322
5881 322 15 365 22 -136 151 92 -58 -152 439 120 -279 -58 -79 -221 -197 538 -176 -555 284 199 -424 -328
5903 -328 200 -203 -242 213 -123 -180 95 -114 -52 129 -13 -21 24 -238 -183 212 12 -464 284 147 -309 -316 278
5926 278 -217 -260 -97 472 -237 -118 181 -29 8 250 268 -105 0 360 -32 45 -189 -288 182 -227 328 277
5948 277 172 -309 -8 238 -156 -335 -157 282 -73 -32 113 -451 -193 389 -324 -528 181 66 13 -285 -96
5969 -96 -196 -62 93 -48 -174 106 186 -93 161 -391 138 225 66 87 547 38 -150 170 487 -237 2
5990 2 238 -133 -326 34 265 156 -2 92 -157 140 -474 -195 36 14 -115 -168 -26 -96 -253 5 -253 -306
6012 -306 414 81 -528 -78 315 -609 -221 111 -102 -43 104 32 1 13 201 -72 64 95 297 353 -145 -266
6034 -266 -164 276 -135 -38 280 -35 -153 448 97 -266 150 195 -146 -279 343 -14 89 68 515 -145 52
6055 52 -264 -43 -19 -93 34 -174 228 -395 207 108 -327 4 81 -11 -87 -8 107 -508 -228 77 -319 -318 55
6078 55 347 -81 133 103 -338 -13 253 -467 -273 62 -179 164 237 65 452 150 -146 -94 231 -146 -164 163
6100 163 97 35 110 322 -103 -130 211 18 -215 -160 -77 -85 28 350 134 -240 -18 -230 -22 -150 -244 13 377
6123 377 -400 -321 -104 -230 -276 -73 237 -465 -247 281 -169 -233 -65 130 -426 14 476 2 413 -139 151
6144 151 -42 -33 190 35 -73 369 -32 164 8 -346 267 17 -85 281 395 -60 204 199 -367 -215 87
6165 87 -116 -188 95 209 -77 -400 76 142 -5 -299 -32 -32 -361 -168 140 136 -97 -251 -5 -44 -27 -3 165
6188 165 -286 -154 362 -271 -266 -34 280 -201 -186 116 -11 154 218 50 14 47 -126 -3 87 161 142 247 280
6211 280 24 305 206 -206 213 483 209 41 500 88 -247 -217 208 47 -295 588 -54 -281 122 -27 -328
6232 -328 -97 -51 -143 4 -457 81 65 -225 -325 -137 -25 -315 -180 111 -8 -392 63 -136 -426 62 -160
6253 -160 -76 -336 45 252 -96 19 195 30 -34 -54 111 190 91 71 493 375 -113 86 273 -269 55 471
6275 471 145 -284 330 203 -110 -235 176 -106 -286 77 -65 19 144 3 -250 -11 120 -259 -267 -160 31
6296 31 -134 -6 -264 -145 77 -85 -352 52 -278 -335 84 -168 -270 -303 102 -73 -80 -31 -212 -76 38 84
6318 84 -18 -9 145 210 55 224 -54 5 -45 252 249 244 -53 -177 248 14 -218 14 139 -27 226 -30 71
6341 71 -457 15 -74 -113 410 28 -111 107 111 -105 86 -86 -261 -194 -118 -355 -270 56 86 -211 -5 -154 -121
6364 -121 116 134 -188 -35 314 424 -285 -174 120 271 -246 -169 123 176 -44 -105 200 89 412 -87 405
6385 405 -205 175 325 -105 -151 241 255 -320 262 153 65 -147 138 -131 -39 101 -75 -179 -329 -26 -133
6406 -133 -108 -33 -305 -332 -345 -62 -95 -239 -29 -299 -224 97 85 -93 -119 -305 -171 48 -39 -261 210 89 35
6429 35 267 194 -10 -157 -38 -44 100 111 178 431 223 -87 154 20 33 19 98 458 -36 257 25 -107 73
6452 73 186 -234 -184 204 44 -438 249 -25 -240 -208 -109 73 -243 -111 -88 -263 -20 31 -374 -50 51 -92
6474 -92 225 95 -197 103 -13 -63 -215 110 206 -280 -76 73 -458 119 41 170 48 -47 -27 -225 8 123
6496 123 -8 -56 101 -86 -228 -296 -121 333 342 -272 12 77 32 -315 183 92 -326 -217 193 -107 -226 0
6518 0 -181 -94 208 38 180 -195 118 33 -98 -272 -107 196 -37 -302 -4 99 29 210 232 154 31 307
6540 307 -89 -197 89 6 204 -114 -13 24 -317 -187 219 162 -83 -13 45 119 141 12 23 372 156 85 -262
6563 -262 73 106 17 -236 57 257 -57 -327 -60 -51 -146 133 -17 -385 -115 -143 206 -2 -127 172 76 237
6585 237 -57 -280 122 65 181 198 502 10 -186 133 -29 -144 67 237 57 19 19 32 -124 -12 37 -20 -63
6608 -63 -9 205 -76 25 99 106 248 -106 -48 345 -92 75 278 -242 -393 205 8 -298 -183 250 -436 -10
6630 -10 248 -123 -298 -4 33 -315 -67 -33 211 -229 54 -291 -214 5 -6 72 415 -154 -178 288 67 -133
6652 -133 44 87 -181 18 297 -315 -147 -106 397 209 -141 376 -31 214 89 40 153 165 -68 123 -98
6673 -98 -126 -45 183 45 -130 283 -62 -259 109 -345 -119 -3 -193 -216 63 163 -138 -122 -45 291 92 -24
6695 -24 87 -78 -40 -22 57 -66 4 -166 329 280 104 145 133 130 139 45 164 88 36 99 232 -288 -44 -207 32
6720 32 -113 209 253 -109 -110 32 114 157 -272 283 162 11 302 221 -187 -210 85 138 -78 183 -294 -60 -78
6743 -78 -114 85 -151 49 -254 -177 157 214 -57 -148 207 49 -180 -70 -96 151 -171 -168 208 -4 376 -62 329
6766 329 272 180 -63 -41 -121 -124 41 -128 -382 -291 210 170 64 20 146 39 -23 -108 20 -81 -36 -156 171 185
6790 185 60 138 100 -251 1 -77 -51 -86 191 -146 -27 -172 -333 -25 -94 7 -7 -314 0 16 -135 110 487
6813 487 -116 18 66 53 -142 116 189 296 -342 -199 31 -192 -100 144 -217 17 -164 90 155 138 94 200
6835 200 236 201 227 215 -126 -49 119 122 240 -85 -112 58 125 356 258 -126 -1 53 221 -255 57 44 -4 -237
6859 -237 146 -456 -415 108 315 -112 -101 -322 -215 -39 150 -344 -350 147 -159 -93 -168 42 141 19 63 36 106
6882 106 264 -30 -196 162 297 -109 34 373 27 -68 -77 110 108 133 78 183 66 379 81 -7 30 159 -70
6905 -70 -20 -249 -27 -356 294 -114 207 -53 -198 -61 -140 -201 -247 -79 -218 -209 31 -272 -103 56 22 244 95
6928 95 88 -11 -160 -70 -78 -89 354 227 -82 239 -47 -191 -65 -49 252 -73 123 -151 143 182 -186 -145 199 41
6952 41 -124 62 302 95 17 -32 -15 -212 -62 -161 -28 -76 -63 -32 -299 -54 157 29 -212 -267 107 -11 3
6975 3 14 81 -26 -156 61 -176 -99 -374 -106 -235 175 6 47 -153 201 -92 -191 177 56 -62 67 66 124
6998 124 429 -90 94 -68 -19 -42 141 252 -314 -186 -28 192 121 -154 74 146 239 356 -238 -265 -182 -255 -84
7021 -84 166 8 -55 -33 -178 -153 -155 375 -226 191 70 -192 16 -30 -357 -27 13 19 -268 61 -189 -143 -192 -112
7045 -112 249 16 -69 -156 97 -231 -32 -397 202 -227 160 69 -22 79 325 445 -80 -33 -33 -207 -150 163 172
7068 172 125 -10 61 -7 19 -88 -170 -116 438 -18 -127 -50 260 -109 60 -246 38 19 283 91 284 3 -6
7091 -6 -435 -168 -58 -188 -65 -175 -88 53 215 -143 47 49 299 212 -245 9 51 162 -85 -92 263 -79 -57
7114 -57 -97 -44 -107 20 186 46 -125 11 -191 -41 140 -5 -172 42 -40 -284 6 139 312 -58 -88 -69
7136 -69 148 97 -13 140 214 -8 8 98 2 -101 -100 -143 -160 161 93 -274 -181 -130 177 -196 13 187 56 -2 -105
7161 -105 119 -97 233 137 -26 71 212 114 -32 36 -366 211 -77 -129 320 311 31 -175 -252 163 -316 -56 326
7184 326 -148 217 34 67 -6 -23 -86 -133 189 107 -4 -131 -78 144 90 9 -283 -59 -156 26 -229 79 32 -48
7208 -48 65 -248 11 -110 300 -70 -109 155 -16 206 -135 244 -22 283 -80 -1 32 196 5 200 1
7229 1 -166 49 36 13 128 118 55 201 -93 44 -10 75 243 -94 -189 -159 132 -80 -42 -40 -33 -14 82 -175 33 187
7255 187 320 1 -14 180 -196 -225 -96 -39 -275 -17 -183 76 192 62 357 121 61 -185 144 -237 -76
7276 -76 92 219 298 -19 195 -478 33 -33 2 23 82 -353 189 492 0 172 111 76 -169 305 16 89 -32
7299 -32 -61 -139 -394 -50 120 19 214 -101 204 55 248 70 -14 -218 151 -68 -110 104 -37 -2 233 -58
7321 -58 -45 15 2 -166 114 -143 -147 -220 -35 -305 -81 2 128 17 -266 -116 98 266 -236 -114 139 107 39
7344 39 238 -47 -142 -157 -25 206 300 -96 -95 -5 -31 -8 65 7 209 -174 -36 -181 -50 107 -112 157 107 14
7368 14 69 104 165 114 21 -105 164 96 75 -305 -176 132 -36 163 -132 161 29 -32 69 -134 -230 40 -75
7391 -75 -199 82 -32 -72 71 215 75 -196 -3 136 -110 -160 231 189 17 -259 200 185 -410 284 172 -240
7413 -240 -68 -78 176 -98 -110 -47 -292 21 298 -230 -8 -168 -119 -190 0 -21 50 -7 47 195 106 -132 -250
7436 -250 -41 8 115 247 117 27 103 192 117 381 -253 -24 189 211 -116 -150 -66 -67 138 -59 -131 -71 229 -95
7460 -95 -235 33 -162 173 144 43 163 56 91 91 -123 40 141 -38 -48 35 -110 -304 182 -56 83 -339
7482 -339 -40 -41 -64 -166 -21 -67 -198 61 91 -43 224 -26 33 -147 -161 3 22 26 26 36 60 -52 -154 5 92
7507 92 15 354 -36 -3 129 203 5 118 258 -448 -172 -103 207 36 -398 -181 186 -65 -255 -68 23 -33
7529 -33 -135 -116 -126 38 73 123 -69 173 -62 0 69 364 188 180 45 -165 384 222 -125 228 -133 90 51
7552 51 310 124 342 69 54 -223 -148 62 -73 38 125 -69 -285 -23 141 -197 -26 -30 -216 -6 76 32 32
7575 32 232 251 23 25 -52 -38 31 -65 15 -379 248 -117 181 -79 126 -38 64 -176 -184 89 -46 97 86 147
7599 147 -202 -40 12 162 47 150 -181 44 -24 -203 116 169 -192 233 194 -163 120 -158 -212 128 166 -127
7621 -127 -88 -126 -159 24 245 80 195 325 -110 -126 57 300 180 44 61 -29 143 -4 -107 -31 304 -142
7643 -142 -191 40 -105 234 -247 203 259 110 -242 115 -333 -154 138 -262 -70 59 -140 -124 46 -1 -63 44
7665 44 25 27 -125 105 -79 14 153 120 38 161 -10 -188 84 176 58 266 -111 -163 -122 -59 -108 23 -343 98
7689 98 280 89 244 11 6 -22 182 -244 118 76 -36 -222 204 -2 69 -113 109 145 -24 137 -209 57
7711 57 -100 149 -215 220 176 159 54 -32 155 103 361 -9 17 -45 -169 167 26 -46 61 17 -60 39 -135 173
7735 173 183 115 230 -98 -158 -109 247 323 -65 84 -72 105 4 -147 297 71 -147 -188 265 -165 -468 -77
7757 -77 -72 305 -23 -9 -16 158 188 186 145 89 53 -162 141 -121 132 422 -46 -358 -66 40 -87 -105 -176 472 -18
7782 -18 -118 29 -80 -63 -159 -215 -138 67 -60 -311 166 178 11 221 -185 -128 -180 2 -378 -179 79 -51 41
7805 41 61 62 236 -40 -183 212 -20 153 -187 20 179 44 -203 -254 2 -46 -24 120 114 169 -7 377 104
7828 104 51 116 -149 134 100 -259 -64 -260 -79 -144 59 -12 14 -121 124 -44 -68 -223 -487 -114 -69 34 -30
7851 -30 87 -98 -265 166 -44 -343 -80 -72 -63 161 -80 -114 18 -343 20 -69 -167 40 203 71 227 -123 91
7874 91 -33 78 117 2 -135 -36 -305 -574 139 113 266 -3 -160 -201 -184 -463 196 -65 -293 70 -45 244
7896 244 197 140 188 -155 -160 22 -217 142 -197 -168 161 20 321 151 -58 -249 98 80 71 65 -160 -193 92 192
7920 192 -368 -51 -140 -59 -188 -170 108 139 126 49 -196 -165 127 -143 -84 198 64 87 -105 169 -286 115 181
7943 181 57 216 305 156 -13 254 -89 -22 -75 35 202 -214 -263 -245 -239 -75 259 65 -117 72 -112 38
7965 38 80 -153 -108 -72 -239 115 -177 213 -191 -96 285 149 21 18 171 143 -233 194 -247 294 200 206 -152 544
7989 544 195 196 -64 -33 -499 -25 -259 -51 115 200 177 83 151 -158 12 -20 231 82 170 -13 61 169 5
8012 5 -211 -17 -79 -13 -290 71 154 -326 -49 -230 121 -45 33 72 -296 -208 182 31 -68 43 33 -156 -95 386
8036 386 -45 -118 -28 -29 -108 -271 -301 -126 132 -110 -263 262 -202 -13 154 73 -329 15 109 -53 -6 250 278
8059 278 8 65 93 -56 -90 186 92 -195 74 288 -13 -36 -57 -427 -268 99 -29 -18 -223 -535 33 -115
8081 -115 -234 383 102 100 123 -95 -12 274 -137 -17 186 -129 -89 512 47 -57 -102 -33 80 178 95 -53 -56 275
8105 275 -4 414 119 -88 16 70 -103 14 -175 -90 -56 -57 -157 15 -169 -61 -428 98 29 118 82 -57 -46
8128 -46 55 19 -318 49 292 79 -277 25 -71 255 -54 6 -49 129 53 -181 103 -44 -435 -231 -161 -60
8150 -60 15 94 154 -21 85 161 334 55 156 164 28 106 -1 131 183 -237 146 -186 82 -14 -85 181 -90 302
8174 302 267 191 -52 -34 185 2 101 62 -230 157 42 177 -159 -88 -132 54 -3
8191c
##END NTUPLES=NMR FID
##END=
