##TITLE=1H_BAU-1601
 CDCl3, 8 sc, 
 16.1.2019
##JCAMPDX= 6.0         $$ Bruker NMR JCAMP-DX V2.0
##DATA TYPE= NMR FID
##DATA CLASS= NTUPLES
##ORIGIN= UXNMR, Bruker Analytische Messtechnik GmbH
##OWNER= root
$$ XWIN-NMR		Version 3.5
$$ Wed Jan 16 15:32:04 2019 Russian Standard Time (UT+4h)  she@DPX200
##.OBSERVE FREQUENCY= 200.1313
##.OBSERVE NUCLEUS= ^1H
##.DELAY= (6, 6)
##.ACQUISITION MODE= SIMULTANEOUS
##.ACQUISITION SCHEME= undefined
##.AVERAGES= 8
##.DIGITISER RES= 18
##SPECTROMETER/DATA SYSTEM= spect
##.PULSE SEQUENCE= zg30
##.SOLVENT NAME= CDCl3
##.SHIFT REFERENCE= (INTERNAL, CDCl3, 0, 15.7039)
##AUDIT TRAIL= $$ (NUMBER, WHEN, WHO, WHERE, WHAT)
$$ ##TITLE= Audit trail, XWIN-NMR		Version 3.5
$$ ##JCAMPDX= 5.01
$$ ##ORIGIN= Bruker BioSpin GmbH
$$ ##OWNER= she
$$ F:/spectra/data/she/nmr/H-F/1/audita.txt
$$ ##AUDIT TRAIL=  $$ (NUMBER, WHEN, WHO, WHERE, WHAT)
(   1,<2019-01-16 15:31:11.78 +0400>,<she>,<DPX200>,
      <created by zg, POWCHK disabled, PULCHK disabled
       configuration hash MD5:
       00 E9 B6 7A A2 85 ED C7 34 08 36 98 17 FE 4E 26
       data hash MD5: 16K
       F6 1C 52 49 98 45 4C AE D4 89 F2 67 CE E2 BC CA>)
$$ ##END=
$$ 
$$ hash MD5
$$ 36 9C 72 19 58 21 90 95 DD 22 6E 34 FE 71 1A 83
##$RELAX= 
##$RELAX= 
##$RELAX= 
##$RELAX= 
##$RELAX= 
##$RELAX= 
$$ Bruker specific parameters
$$ --------------------------
##$DU= <F:/spectra>
##$EXPNO= 1
##$NAME= <H-F>
##$PROCNO= 1
##$TYPE= <nmr>
##$USER= <she>
##$AMP= (0..31)
100 100 100 100 100 100 100 100 100 100 100 100 100 100 100 100 100 100 
100 100 100 100 100 100 100 100 100 100 100 100 100 100 
##$AQSEQ= 0
##$AQ_mod= 1
##$AUNM= <au_zg>
##$AUTOPOS= <>
##$BF1= 200.13
##$BF2= 200.13
##$BF3= 200.13
##$BF4= 200.13
##$BF5= 200.13
##$BF6= 200.13
##$BF7= 200.13
##$BF8= 200.13
##$BYTORDA= 1
##$CFDGTYP= 0
##$CFRGTYP= 5
##$CHEMSTR= <none>
##$CNST= (0..31)
1 1 145 1 1 1 1 1 1 1 1 1 1 1 1 1 1 1 1 1 1 1 1 1 1 1 1 1 1 1 1 1 
##$CPDPRG= <>
##$CPDPRG1= <>
##$CPDPRG2= <>
##$CPDPRG3= <>
##$CPDPRG4= <mlev>
##$CPDPRG5= <mlev>
##$CPDPRG6= <mlev>
##$CPDPRG7= <mlev>
##$CPDPRG8= <mlev>
##$CPDPRGB= <>
##$CPDPRGT= <>
##$D= (0..31)
0 1.2 0 0 0 0 0 0 0 0 0 0.03 0 0 0 0 0 0 0 0 0 0 0 0 0 0 0 0 0 0 0 0 
##$DATE= 1547638271
##$DBL= (0..7)
120 120 120 120 120 120 120 120 
##$DBP= (0..7)
150 150 150 150 150 150 150 150 
##$DBP07= 0
##$DBPNAM0= <>
##$DBPNAM1= <>
##$DBPNAM2= <>
##$DBPNAM3= <>
##$DBPNAM4= <>
##$DBPNAM5= <>
##$DBPNAM6= <>
##$DBPNAM7= <>
##$DBPOAL= (0..7)
0.5 0.5 0.5 0.5 0.5 0.5 0.5 0.5 
##$DBPOFFS= (0..7)
0 0 0 0 0 0 0 0 
##$DE= 6
##$DECBNUC= <off>
##$DECIM= 32
##$DECNUC= <off>
##$DECSTAT= 4
##$DIGMOD= 1
##$DIGTYP= 9
##$DL= (0..7)
0 120 120 120 120 120 120 120 
##$DP= (0..7)
150 150 150 150 150 150 150 150 
##$DP07= 0
##$DPNAME0= <>
##$DPNAME1= <>
##$DPNAME2= <>
##$DPNAME3= <>
##$DPNAME4= <>
##$DPNAME5= <>
##$DPNAME6= <>
##$DPNAME7= <>
##$DPOAL= (0..7)
0.5 0.5 0.5 0.5 0.5 0.5 0.5 0.5 
##$DPOFFS= (0..7)
0 0 0 0 0 0 0 0 
##$DQDMODE= 0
##$DR= 18
##$DS= 0
##$DSLIST= <SSSSSSSSSSSSSSS>
##$DSPFIRM= 0
$$ [...]
##$SUBNAM2= <"">
##$SUBNAM3= <"">
##$SUBNAM4= <"">
##$SUBNAM5= <"">
##$SUBNAM6= <"">
##$SUBNAM7= <"">
##$SUBNAM8= <"">
##$SUBNAM9= <"">
##$SW= 20.0189088683792
##$SWIBOX= (0..15)
0 0 2 0 0 0 0 0 0 0 0 0 0 0 0 0 
##$SW_h= 4006.41025641026
##$TD= 16384
##$TD0= 1
##$TE= 0
##$TE2= 300
##$TE3= 300
##$TEG= 300
##$TL= (0..7)
0 120 120 120 120 120 120 120 
##$TP= (0..7)
150 150 150 150 150 150 150 150 
##$TP07= 0
##$TPNAME0= <>
##$TPNAME1= <>
##$TPNAME2= <>
##$TPNAME3= <>
##$TPNAME4= <>
##$TPNAME5= <>
##$TPNAME6= <>
##$TPNAME7= <>
##$TPOAL= (0..7)
0.5 0.5 0.5 0.5 0.5 0.5 0.5 0.5 
##$TPOFFS= (0..7)
0 0 0 0 0 0 0 0 
##$TUNHIN= 0
##$TUNHOUT= 0
##$TUNXOUT= 0
##$USERA1= <user>
##$USERA2= <user>
##$USERA3= <user>
##$USERA4= <user>
##$USERA5= <user>
##$V9= 5
##$VALIST= <valist>
##$VCLIST= <CCCCCCCCCCCCCCC>
##$VD= 0
##$VDLIST= <DDDDDDDDDDDDDDD>
##$VPLIST= <PPPPPPPPPPPPPPP>
##$VTLIST= <TTTTTTTTTTTTTTT>
##$WBST= 1024
##$WBSW= 4
##$XGAIN= (0..3)
0 0 0 0 
##$XL= 0
##$YL= 0
##$YMAX_a= 65581
##$YMIN_a= -58320
##$ZGOPTNS= <>
##$ZL1= 120
##$ZL2= 120
##$ZL3= 120
##$ZL4= 120
##$ABSF1= 10
##$ABSF2= 0
##$ABSG= 5
##$ABSL= 3
##$ALPHA= 0
##$AQORDER= 0
##$ASSFAC= 0
##$ASSFACI= 0
##$ASSFACX= 0
##$ASSWID= 0
##$AUNMP= <proc_1d>
##$AZFE= 0.1
##$AZFW= 0.1
##$BCFW= 1
##$BC_mod= 2
##$BYTORDP= 1
##$COROFFS= 0
##$CY= 11.3945322036743
##$DATMOD= 1
##$DC= 2
##$DFILT= <>
##$DTYPP= 0
##$F1P= 18.9103706918063
##$F2P= -1.10871071338519
##$FCOR= 0.5
##$FTSIZE= 0
##$FT_mod= 4
##$GAMMA= 1
##$GB= 0.15
##$INTBC= 1
##$INTSCL= 1
##$ISEN= 128
##$LB= 0.24
##$LEV0= 0
##$LPBIN= 0
##$MAXI= 10000
##$MC2= 0
##$MEAN= 0
##$ME_mod= 0
##$MI= 1.114404
##$NCOEF= 0
##$NC_proc= 0
##$NLEV= 6
##$NOISF1= 3.799351
##$NOISF2= 2.8
##$NSP= 1
##$NTH_PI= 0
##$NZP= 0
##$OFFSET= 15.70392
##$PC= 1
##$PHC0= -9130.708
##$PHC1= 11.40004
##$PH_mod= 1
##$PKNL= yes
##$PPARMOD= 0
##$PSCAL= 0
##$PSIGN= 0
##$REVERSE= no
##$SF= 200.130013532006
##$SI= 16384
##$SIGF1= 3
##$SIGF2= 2
##$SINO= 400
##$SIOLD= 16384
##$SREGLST= <1H.CDCl3>
##$SSB= 0
##$STSI= 0
##$STSR= 0
##$SW_p= 3612.71676300578
##$SYMM= 0
##$S_DEV= 0
##$TDeff= 0
##$TDoff= 0
##$TI= <>
##$TILT= no
##$TM1= 0
##$TM2= 0
##$TOPLEV= 0
##$USERP1= <user>
##$USERP2= <user>
##$USERP3= <user>
##$USERP4= <user>
##$USERP5= <user>
##$WDW= 1
##$XDIM= 8192
##$YMAX_p= 0
##$YMIN_p= 0
$$ End of Bruker specific parameters
$$ ---------------------------------
##NTUPLES= NMR FID
##VAR_NAME=  TIME,          FID/REAL,        FID/IMAG
##SYMBOL=    X,             R,               I
##VAR_TYPE=  INDEPENDENT,   DEPENDENT,       DEPENDENT
##VAR_FORM=  AFFN,          ASDF,            ASDF
##VAR_DIM=   8192,          8192,            8192
##UNITS=     SECONDS,       ARBITRARY UNITS, ARBITRARY UNITS
##FACTOR=    0.0002496,     1,               1
##FIRST=     0,             0,               0
##LAST=      2.0444736,     0,               0
##MIN=       0,             -58320,          0
##MAX=       2.0444736,     65581,           0
$$ Real data points
##PAGE= N=1
##DATA TABLE= (X++(R..R)), XYDATA
0@%%%%%%%%%%%%%%%%%%%qJ6j6J6j6J6j6K4l2L2l5M3m8N6o4P2q0Q8j00J08j20J36
41G2j52J68j85K05k28K52k78L06l37L73m09M49m96N48o08O74p52Q42r48J077j234
62f61J433j692K048k567L395m918Q594l2619l1333R8987N824q4140k227P8015
76C8139n495o3287L833N2948l376l9265k207L0176O651k1376j5988J5234K3078
89A9065j1253l1992J1871L9001j3959m4260J9506M5738k5287m3914L2190L8678
101C5384l6733k9989M0092J9031l9738o858L5465o226k8114J6292J6453k3647
113h588k690K6499j1433k5094K3537J9021l2631r747L8484K56l8472J0119L4638
126B3899j8537k6893K3712J6203k4767m556K0890o334j3056J3657J611j7330J0104
$$ y = [0, 0, 0, 0, 0, 0, 0, 0, 0, 0, 0, 0, 0, 0, 0, 0, 0, 0, 0, 0, -8, 8, -8, 8, -8, 8, -8, 16, -16, 16, -19, 24, -24, 32, -32, 40, -40, 48, -52, 56, -64, 72, -80, 88, -97, 108, -120, 132, -146, 160, -177, 196, -213, 236, -260, 288, -320, 354, -398, 444, -504, 573, -661, 772, -920, 1128, -1439, 1956, -2962, 5632, -26987, -58320, 40667, 46491, -37649, -39876, 38139, 32644, -30643, -26810, 26138, 22762, -16503, -18710, 11466, 18117, -3259, -19247, -4013, 19065, 7812, -24180, -12309, 26692, 12733, -31527, -12021, 33717, 8430, -35484, -3294, 35384, -1349, -31338, 8754, 27785, -11953, -18811, 16654, 10428, -17686, -1394, 15059, -8588, -11278, 15221, 3788, -21306, 2231, 21252, -11379, -21126, 17358, 17614, -20858, -10739, 23899, 5362, -21531, 2181, 18384, -6383, -10939, 9951, 3617, -9439, 4218, 5829, -11501, -1397]
139a397J5559k1139r969K9376J814l3190Q474L3836j8020l0282K6446K3689l2100
152f903j4205L5039M036l4197N330K8943j3762k1912J8443J2931j9930m203J8102
165G712l350j3756Q775P929j1498r34J2211n207r691J1014N694j4624m8J5898
179A0125o274j5186J1387J1862j5642p508J7843K074j8771K830J7399p734j4357
192a1952J2248J0529j4656m798J5772r97j4333O663J1112j0741o280J2959R24
205F450j3440L607J1690p895r543J0332O118j1872k516J2052j019j0467M467P748
219E712o576l474P609o51o225N139L775q273l67R663l867j0242P323Q974j0610
234b090p025J2529L924j3595p48J3092k274j0963M957Q358n792m621N869J650
$$ y = [-1397, 14162, -6977, -16946, 12430, 14244, -18946, -10472, 23364, 5344, -24938, 1508, 25197, -6903, -21108, 13931, 17967, -16230, -10900, 18043, 4281, -17631, 812, 13743, -6187, -10390, 7712, 4362, -9394, -619, 7310, -4188, -5122, 7089, 1882, -7809, 3205, 8899, -5725, -5773, 10125, 3851, -11335, 52, 11914, -3728, -11236, 6607, 8681, -10090, -7260, 10139, 2405, -11952, 296, 10825, -3831, -8629, 7143, 6146, -8187, -1524, 9588, -1153, -7433, 5526, 6450, -6990, -3383, 8307, 412, -9131, 1201, 7319, -4553, -7069, 4983, 3964, -6503, -2036, 5712, -864, -4338, 3271, 2620, -3605, 1534, 5309, -2964, -3331, 6332, 2465, -7777, -454, 8520, -2090, -9115, 3414, 7338, -6257, -7005, 6087, 3813, -7150, -2193, 6165, 373, -4248, 1621, 3271]
248C271m477R79K415k783n8L615k544l982M628K970p062k032Q284j6q820K218
264c394Q481l698o811M855N155m602l170M077K072k662j112J486N23m70m86j014
280g70qJ936l99l305P84M079j703m507K614M338l161l580L731L293l237k389L178
297H94K159k740j886K250J427j928j384J083J116o53j599k35J776M24k308n19
313b123K726P93k624o32K995J103k962j094L423J237l479r56L389N87l133q30
329a580K165P85j906j667J437K153j517k501J754K643j630k323J639K473r50k261
345a286Q88K630o18k683N72K429p23k305K16J718N4j802q99J676J226k055j470
362b432K323J741k230j518K557J889k278j746K458J827k369j622K132J305j817
$$ y = [3271, -1206, -227, 2188, -595, -653, 2962, 418, -3564, 1064, 4034, -3028, -5060, 3224, 3208, -5612, -3394, 5087, 1389, -5422, -567, 4588, -14, -3184, 893, 2965, 303, -809, 677, 1200, 730, 244, -770, -778, 1158, 759, -2546, -1762, 2317, 614, -3893, -1279, 3059, -102, -3682, 49, 3342, 105, -2284, 894, 3053, 313, -1573, 677, 2104, 176, -1208, -125, 991, 338, -1261, -1496, 280, 704, -1604, -2123, 603, 1396, -1228, -1860, 1135, 2238, -724, -1818, 1605, 2842, -637, -1593, 1796, 2383, -750, -1580, 585, 1370, -536, -2203, -766, 1387, -130, -2631, -877, 1766, 136, -2187, -548, 1925, 975, -1286, -398, 2232, 1614, -1069, -497, 1932, 1209, -1096, -880, 838, 892, -910, -1809, -133, 1093, -962, -2432, -109, 1632, -598, -2116, 441, 2330, 52, -1694, 764, 2591, 222, -1400, 732, 2037, 220]
377B20j406R67J184o28j727o9J832L19k034n42K203J052k080j293K530J927k652
394a97j798L273J711l413j237L128O01k826o12J931L87j592p29R77O89o53p53
411a113J72R51O80j038j104J943J840k577j708L535J442m123q76M276J28m384
427a956J96L832r09l601J039K740j396j840J412Q35q43M41J95j052J163J721k169
444a92j533L377J283m244p41M733k19n304R32N007k264m632L132L417l874j885
460c007L912K66l087J394K074k080l09K707j023k486K518K022l790j336M689O6
476B530n574J160N497k992n098M246L667n205j866N348J19m469J778L345k777
491b91j400L617m36l596K546L141m470k111N845K42o950J521O771l728o121N261
$$ y = [220, -1186, -219, 965, 337, -1390, -1459, 373, 692, -1342, -1884, 319, 1371, -709, -2002, 528, 2455, -197, -1995, 1278, 2989, -424, -1661, 1467, 2068, -758, -1370, 561, 948, -644, -1373, -396, 293, -360, -1113, -941, 10, 690, -348, -1452, 491, 2331, -246, -1954, 1581, 3023, -1100, -1976, 2300, 2428, -1956, -1760, 2072, 1163, -2438, -1399, 1341, -55, -1895, -483, 352, -491, -50, 145, -907, 256, 1977, -192, -1725, 1652, 2935, -1309, -2050, 2683, 2464, -2840, -1908, 3099, 835, -3797, -665, 2752, -1122, -3007, 905, 1171, -1916, -522, 1552, -528, -837, 1870, 847, -1639, 879, 2901, -889, -2225, 2464, 2530, -3044, -1884, 3613, 621, -4477, -231, 3436, -1769, -3635, 1713, 1832, -2637, -859, 2486, -291, -1691, 1926, 1490, -2106, 440, 3581, -889, -3000, 2845, 3087, -3863, -2342, 4429, 701, -5420, -159]
507a59M552o308k572O635O64o035J489N118k928l169M259J120m576J402M044l835
523b99k754N426L50o422J995N970m443m977O116L069p238q71P710j273p092L725
539a008O128n508m020P088J560p572J326O994m115n536N991L036p254o36P108
554C582k019o354L966M747n358k489O125J92n725K452M674m442k315N974l03o275
570c568L209N427n910l864P631J327q827J175Q682m040p833O418N964q196l279
585e684R257L79q879K816P717n091n255O716K572p171J68O453k701n140M404K940
601C501n687p11N722j997n049M357L432o123q28P083j931o581M945N321p034k885
617d465Q452J63q786K592Q070n234o741P062M415q552j961Q764q90q104L442O441
$$ y = [-159, 4393, -1915, -4487, 2148, 2812, -3223, -1734, 3384, 456, -2713, 1546, 2666, -1910, -508, 3536, -299, -3053, 2373, 2723, -3699, -1704, 4266, -177, -5154, 962, 4031, -3207, -4078, 3632, 2359, -4733, -1008, 5120, -388, -4408, 2680, 4240, -3332, -2006, 4988, 873, -4663, 1328, 4364, -2890, -3526, 3582, 1563, -4791, -825, 3922, -1436, -3925, 2200, 2392, -3333, -881, 3793, -649, -2964, 3010, 2707, -3568, -359, 5068, -842, -4706, 2925, 4252, -4575, -3400, 5282, 1242, -6591, -173, 5791, -2405, -5684, 3573, 3952, -4927, -2111, 5606, 515, -4740, 1976, 4548, -2623, -2455, 3998, 1297, -3843, 561, 3501, -2186, -2897, 2825, 828, -4221, 136, 3568, -2555, -3383, 3700, 1769, -4812, 133, 5454, -1580, -4465, 3987, 4150, -4636, -2044, 6026, 792, -5949, 1113, 5528, -3024, -4985, 3779, 2889, -5215, -1773, 4668]
633D668n279l911O348J314o089J564N199l611l306N157J034n849J393N478l860
648B50m458N602K276o893J15O876k785n916N048M068o489j522P285q78o823L428
664h16N935n342m239O843K136p624K01P392k722o561M569M534n968k298O204j37
680B107n598K229M232l562k233M451L23m255J817L717l534k314M882M63n589J563
696a301N249l757m430N259K630o300p30O409j334n813L129M699m356k894N335
711A795J091n345J040M886k801l604M155J842m842p0M538j815l841K972K429l835
727a405j039L997m89l677J962L080l045j745L994L70m134J398L787k807k725L820
743A342J195m324K52L959j798l372K740K260l542j144L832j06l677J407L274k324
$$ y = [4668, -611, -4522, 1826, 3140, -2949, -1385, 3814, 203, -3103, 2054, 3088, -2761, -1368, 4110, 250, -4208, 1394, 3670, -3223, -3108, 3768, 983, -4933, 115, 4183, -2306, -3828, 3457, 2579, -4244, -816, 5119, -223, -4462, 2381, 4517, -3107, -2906, 4486, 1764, -4797, -228, 4306, -1662, -3960, 2244, 2107, -3491, -1262, 2970, -592, -2825, 1626, 1949, -2306, -489, 3228, -306, -2620, 2262, 2725, -2864, -1301, 3948, 191, -4239, 1020, 3650, -2650, -3380, 3029, 1695, -4118, -989, 3710, -646, -3540, 1795, 2886, -2459, -1419, 3467, 666, -2938, 1217, 3059, -1783, -1853, 2685, 870, -2971, 1, 2430, -1405, -2444, 1553, 1064, -2613, -651, 2429, -616, -2361, 1633, 2003, -2131, -733, 3054, 247, -2478, 1342, 2537, -1787, -1535, 2424, 626, -2746, -6, 2254, -1288, -2432, 1400, 1294, -2383, -976, 2298, -26]
759b6k187L147J098l201K89K907j379k121K100R92k563LK380j166k142J948J358
776A437k716n03L075n11k950J694K565k401j607K985P64k904K15K629r03k115
792a246J286J405j643q51J570k4j536O54J021j352l17J750m96j669J420J461j890
809d57p67K296K92k191K69K012o58j758Q74J271j213r01J159J83j184L34P90q65
827e14k66J176k64j068Q56J013j068n82J358L84j336p4J316k54j221M37Q56p58
845io00O70M2o10K46K37m65J40N54l64m04O81M95p08l47R73L75j077k01J181o5
866G44j266K22R39m73p42L20K93j86j58j21J03L48o1l54J61N28L8m57k1O70J17
887F44p76j6P86j57q04J85N00l26m21J13K01p5j83n7J89J56o5j05J25K96M0l04
$$ y = [-26, -2213, 934, 2032, -1169, -880, 2027, 648, -1473, 627, 1619, -944, -941, 1439, 273, -1869, 79, 1437, -1279, -1782, 1293, 782, -2168, -474, 2091, -310, -1917, 1068, 1832, -1072, -857, 1772, 869, -1246, 40, 1445, -198, -1049, 521, 497, -1039, -385, 636, -716, -1033, 717, 221, -1448, -28, 1433, -457, -1224, 1072, 1364, -827, -558, 1454, 796, -962, -88, 1183, -30, -931, 228, 411, -773, -439, 351, -514, -780, 396, 132, -936, -80, 933, -135, -717, 641, 1025, -311, -385, 931, 677, -544, -107, 749, -9, -609, 61, 103, -507, -261, -24, -489, -349, 205, -159, -563, 118, 613, -95, -442, 531, 906, -171, -372, 809, 744, -522, -300, 639, 166, -576, -256, 37, -149, -307, -428, -325, 23, -38, -392, -231, 297, 335, -122, -143, 527, 644, -132, -148, 638, 481, -323, -138, 362, 36, -385, -272, -71, -146, -329, -386, -197, -41, -106, -211, -86, 210, 250, -54]
909e4Q1N10j32n29K76M18m24l61K68J21k86k11P3J57p1k19P5K20nl0RO2K75M3
933B66l51J73N19l23m41M25K16n14j16L03j17k60J9P3j02q0J33M8j90J19L81j87
955fk63N08K36n45P5N67k59m25L67J67n10p1L70j93m75K62L48m81k92O59J01o96
977e56K69P36m29m64P59K65p20P2O97k83n83L94L58n80l21O03j7p78K60O55o74
998c37m34R73O1j026N00J007p87o05J124L57j113J4J070k94r92M86P41q50n33
1017f38R33J4j111M43R22r91n46J360R9j405N12J388q64j004J272P12j392k44
1035e40J449k56j391P00J016j228o20J383j04j481O95J167j214p00J554K06j564
1052i28M32J595q43j288J400R58j708m04J884k76j867Q90J373j522q06J684n3
$$ y = [-54, 27, 537, 405, -124, 152, 570, 146, -215, 53, 174, -112, -323, -250, -93, -164, -383, -308, -88, -93, -123, -114, -52, 223, 266, -85, 88, 607, 284, -157, 268, 484, -30, -146, 157, 40, -220, -201, -128, -230, -310, -177, -129, -319, -200, 181, -6, -269, 239, 475, -70, 5, 572, 313, -112, 255, 422, -88, -159, 211, 18, -457, -195, 153, -328, -620, 39, 140, -556, -287, 449, 20, -444, 315, 580, -140, -68, 629, 346, -237, 157, 515, -65, -386, 217, 200, -578, -318, 337, -337, -771, 202, 263, -763, -263, 744, -43, -648, 476, 833, -280, -266, 804, 510, -482, 4, 745, -105, -638, 295, 309, -802, -359, 563, -428, -974, 386, 485, -920, -408, 980, 116, -888, 384, 1096, -296, -540, 909, 653, -738, -38, 978, -250, -870, 513, 409, -1072, -377, 790, -424, -1124, 430, 636, -928, -496, 1099, 256, -1032, 368, 1326, -382, -786, 1098, 822, -1045, -155, 1218, -304, -1110, 574, 521]
1069E21j679P37J296j324p37J738J92j820N40J931j096j648J786J235k239n29
1085a096K429l20k327J015J747j714j067J866J82j893N75J567j231j019J776M11
1101I01j966M75K070j220j646J984J062k434k41K551p27k349J384J754k012j166
1117a580K241L00k302M55K054j161j523J860Q32k136K26K205j123j721J967J036
1133A630k441j62K508p69k344J424J774k080j185K342L50k474N00K278j331j685
1149a665K083R12k351J81K377j070j870J893J146k351k96K419o69k278J362J733
1165A556k091j121K441K15k568P14K332j517j651K179Q60k318J58K274r58j782
1181a277J670J142k137l91K288n29k281J266J818k056j211K442L03k544O33K258
$$ y = [521, -1158, -421, 875, -449, -1186, 552, 744, -1076, -536, 1395, 299, -1349, 437, 1672, -567, -1096, 1333, 1013, -1314, -299, 1448, -266, -1333, 533, 715, -1178, -603, 964, -267, -1286, 490, 901, -1065, -590, 1480, 260, -1386, 598, 1660, -774, -1015, 1536, 809, -1540, -156, 1598, -414, -1580, 661, 961, -1341, -886, 1168, 7, -1516, 344, 1176, -960, -734, 1471, 348, -1373, 594, 1630, -811, -973, 1535, 766, -1578, -154, 1620, -460, -1645, 697, 1047, -1427, -927, 1351, 20, -1665, 418, 1330, -1021, -840, 1537, 467, -1403, 490, 1636, -715, -1011, 1408, 739, -1539, -177, 1556, -535, -1656, 785, 1000, -1568, -854, 1478, -39, -1690, 489, 1349, -969, -811, 1463, 505, -1277, 393, 1535, -602, -993, 1295, 766, -1515, -249, 1569, -487, -1698, 744, 1047, -1497, -864, 1394]
1197A394j380j542J936Q31k061J22K010q25j632J478J101j985m24K173m83k188
1213a475J240J709j993j082K358J84k419P01K153j361j527J901R20k019r7K033
1229A226n74j718J218J188j710n21J857l63j835J037J356j680p81J969M3j979
1245a267O39J814j152j338J654Q51j818j31J900n41j639J188J119j664m99J773
1261H89l02j727Q51J310j372q27J576K65j583K91J504p21j150J232P64j460j11
1278e71J582n00j366J054R01j482l72J523l04j461P35J118j177p34J377L08j439
1295h08J97J435o00j120J056P83j222k41J276k51j071O43O82r67l08R95j78j037
1313g36N03Q47q75o29J130L12j246J61J268n17r66R00O49r84j92R96j99q39M50
$$ y = [1394, 14, -1528, 408, 1239, -822, -700, 1310, 485, -1147, 331, 1432, -553, -977, 1196, 713, -1475, -235, 1474, -519, -1601, 757, 941, -1478, -777, 1376, 15, -1512, 389, 1309, -710, -807, 1226, 652, -1066, 152, 1340, -370, -891, 966, 603, -1232, -195, 1161, -519, -1300, 669, 712, -1267, -628, 1186, 34, -1304, 350, 1201, -617, -748, 1152, 611, -1028, 160, 1279, -385, -884, 889, 587, -1140, -289, 1021, -351, -1178, 398, 663, -920, -629, 875, 154, -996, 236, 1000, -460, -571, 1011, 511, -855, 199, 1100, -382, -754, 769, 465, -996, -261, 857, -320, -1054, 323, 631, -808, -611, 824, 224, -896, 160, 943, -279, -520, 756, 505, -566, 77, 759, -208, -516, 479, 301, -736, -233, 614, -261, -890, 240, 552, -694, -533, 735, 218, -748, 152, 801, -183, -375, 621, 422, -417, 33]
1332C3N68o92l70P39L9q69K23P73n58o03Q09L43r26R8R34l82o87O96M48p39j42
1353b65P39r8o75K69M94m87l67N22R0o44J37N59m22l93O22J86o62J30O86k69m87
1374c35M48L98m96k22N39M6n66J06M49l51l74M34R9n39R9M48k80l12M23J72l85
1395a99J1M14n7k99J93K83k43k09L38N1m11M8L51k98k98L59O9m15P7L20k06j70
1417b91K68J23k37L0K87k0k45J53K61k40j90L09N3l73L4K60j91k26J86P0k17N
1439a91J70n4j18J25J51j33n2K36K4k09J15J89j84q8J95n1k15R7R1j98q4J56M
1462b4j71j1J92mj75R7K05j03j05K23L5j59J03J03j66RJ32j26j51J45K3j91k7
1485a46J33k2j53J9J86o0j54J70J35j58rK24l1j44J20O2j20KO2q7o1O3k9j39R
$$ y = [33, 601, -91, -461, 278, 317, -552, -329, 444, -114, -717, 92, 435, -491, -393, 541, 159, -528, 168, 616, -123, -265, 474, 376, -299, -30, 464, -23, -390, 132, 222, -422, -285, 274, -148, -541, 81, 267, -395, -265, 421, 152, -335, 113, 511, 15, -207, 332, 378, -188, -82, 367, 16, -358, 76, 175, -364, -265, 183, -97, -409, 14, 186, -199, -188, 226, 169, -130, 63, 346, 103, -106, 232, 283, -128, -80, 271, -27, -325, 34, 103, -312, -235, 85, -121, -291, -23, 100, -137, -107, 180, 160, -85, 68, 329, 89, -101, 208, 261, -112, -78, 182, -9, -235, -49, 21, -196, -191, -21, -75, -193, -68, 83, -50, -102, 134, 158, -51, 64, 253, 69, -19, 176, 125, -90, 7, 98, -100, -184, -28, -24, -195, -206, -14, -18, -193, -96, 109, 6, -99, 124, 159, 0, 103, 206, 40, 49, 181, 55, -96, 49, 72, -119, -146, -13, -35, -188, -169, 17, -43, -197, -27, 108, -50, -59, 165, 134, -10, 110, 172, 52, 54, 116, 29, -32, 31, 2, -137, -128]
1510a28J46r9j74J55J75j99r8L12O7k70R0K36r3j31J40M6j25rO2q2p6P3J1j78
1534a49j0J96r6k28K09K04k73p2L62j5k69J64K26j88j10K04L3k09J3J46j14j51
1556a27J24M5k33J4K52j61k16L06J35l50K2M22r9l44K31L01k41k35L08J14l20
1577e2l6K58j18k47J96P8k96N1K72k20j83L37R0l51P1L91j34l19K52L07l24j93
1599a70L75Q7m64M8M06k49l42L33J24m03L3L45j86k36L27J21l15K6L86j28l33
1620b15K78L09l86k03M89K8n26J00M34k94l52L61J37m10J8L57j67k56L03J78l50
1641a67j1M53j02m40L14L63m43k16N22ln52J73M16l32l32L83J66m37k8M23j16
1662C4l39K88K78l85o1M75j07m32L29L32m87j60N45o6n64K15M36l68l65M21J95
$$ y = [-128, 18, -81, -255, -100, 75, -124, -222, 90, 157, -113, -23, 213, 120, -11, 129, 175, 50, 41, 103, 21, -55, 18, 29, -149, -159, 37, -59, -287, -78, 126, -147, -219, 143, 128, -141, 23, 249, 61, -49, 155, 188, -21, -8, 138, 24, -127, -3, 42, -191, -177, 75, -86, -302, 4, 139, -211, -189, 233, 134, -210, 21, 322, 81, -154, 154, 268, -52, -88, 170, 52, -195, 1, 79, -217, -166, 106, -114, -297, 40, 130, -221, -150, 241, 107, -212, 40, 347, 23, -170, 205, 292, -172, -124, 282, 33, -309, 24, 148, -255, -222, 123, -63, -299, 28, 149, -166, -140, 246, 118, -215, 63, 372, -14, -217, 272, 300, -226, -126, 308, 14, -338, 23, 160, -250, -232, 125, -42, -298, 5, 183, -167, -178, 275, 173, -267, 47, 410, -33, -249, 273, 270, -282, -109, 307, -25, -357, 26, 192, -245, -273, 150, 34, -305, -17, 261, -124, -185, 290, 183, -249, 80, 412, -75, -235, 310, 244, -320, -105, 331, -37, -402, 19, 214]
1683B14m72n1M76r7l92K72L21l76q8M65p7m32L00L09m26j77M85j4n13J36M16l12
1705c3l63L99K13m70l0N00j33m20L37L16m17r9M70o5m07K44L07l69j89M09L1m84
1727b53J06M01k86l63M05K20n14j1N22j49m20L50K92l92j05M51l7l95J99K95l07
1748Ik18L60P1m46M2M08k41l48L61K00m27k9M58j39l40L01K53l36j07M12l1l88
1770a75J45L56k90k67L46J04m14J6L72k09k96L01J56l58j3L81j00k88K25K69k91
1791c0j33L74K1l78J03L40k63k42L24O9l90L9L39j82k69K53J57k83l0L03n0k42
1813a70J54K41k14j30L04K7l37R2K95k36k25K73J02l43lK78j03k35J67J59k07
1834a11n6K45Qk27J25K29k01j32K81K4k85P4K22j56k01J89P9k24k1K03m5j96J12
$$ y = [214, -258, -309, 167, 70, -322, -50, 271, -105, -193, 272, 195, -237, 63, 372, -54, -231, 254, 240, -273, -137, 279, -33, -396, 3, 216, -254, -284, 216, 83, -337, 0, 316, -101, -200, 270, 205, -202, 42, 349, -20, -209, 200, 231, -253, -147, 254, -32, -395, 10, 230, -284, -295, 227, 78, -342, 8, 300, -92, -197, 254, 217, -178, 21, 316, 9, -209, 151, 222, -224, -182, 226, -15, -363, -2, 198, -229, -258, 200, 61, -279, 22, 275, -61, -168, 244, 213, -175, -30, 326, 36, -231, 115, 219, -195, -179, 193, -16, -312, -11, 145, -213, -226, 155, 55, -233, -8, 261, -30, -163, 211, 232, -146, -43, 297, 34, -208, 116, 185, -205, -166, 173, -9, -278, -25, 132, -151, -181, 122, 72, -170, -16, 225, 11, -119, 185, 212, -125, -33, 262, 26, -199, 74, 176, -167, -170, 108, 5, -230, -63, 96, -111, -167, 78, 86, -141, -16, 213, 12, -120, 161, 185, -100, -26, 196, 40, -161, 28, 107, -117, -138, 65, 20, -176, -64]
1857f4J61j61q8K29K5k12J04K10j84j08K15J9k06L7J82j23j73J45R6j93o9J99
1879D1rj99O8J95j31j12J88M4j56N6J52j09p4J51J6j76K6J51p5j63R5J06j57q5
1903a57J87J0j90O5J69j17o2J40J9j07M9J19p0q3R0N6j16l2J14n1j38P4R3j48
1927h6n0J50pj38P2J20r4m1J05L9q4NJ02j3r6M3P2q1n6R0j9j09N5P0j18m2J30
1954A9j1j14N7R6m2o3Q2N1p3j0R6j2q5K4P3r2l1O4j0r2L0M8p2k2P3jn6L3N6j2
1984Dn3P8N9r9mJ10j3j15N5O7r3l4N9k1m0J0K2l7k2M0J3n0J7P7j8n2N4P1o9j7
2014aP7j1r4N5L1n6l4L6ql8pL6k9l2M1K7m0jP7j8l0O0J8o6L4N4m6n0M3L7n9l5
2046b9M0pn0qO0k3m6L7K9m1J7N4m0oO5jm6L0K1k2l3J9J4l7l2L2j3m4J2L4m4kN6
$$ y = [-64, 97, -64, -152, 77, 102, -110, -6, 204, 20, -88, 127, 146, -60, -23, 159, 36, -137, 8, 104, -89, -158, 41, 32, -167, -99, 96, -35, -147, 41, 85, -71, -15, 137, 28, -46, 105, 121, -55, -29, 122, 47, -116, -21, 85, -72, -157, 30, 40, -150, -85, 84, -33, -95, 45, 64, -43, 6, 125, 55, -28, 62, 118, 2, -30, 84, 33, -105, -31, 62, -86, -136, 14, 7, -131, -59, 61, -33, -74, 31, 70, -14, -9, 93, 80, -16, 27, 99, 18, -38, 52, 33, -76, -21, 49, -69, -111, 19, 8, -106, -49, 47, 5, -58, 24, 75, 2, -8, 88, 76, -9, 15, 88, -4, -35, 29, 19, -73, -43, 5, -67, -89, -16, -17, -73, -40, 16, 4, -49, 29, 88, -11, -15, 95, 82, -33, 22, 89, -4, -38, 21, 0, -40, -30, -8, -45, -67, -27, -14, -64, -47, 30, 12, -40, 14, 85, 16, -1, 76, 65, -29, 26, 57, 1, -33, 3, -5, -43, -50, -14, -43, -75, -34, -7, -47, -48, 29, 11, -19, 41, 59, -7, 27, 81, 35, -15, 28, 65, 6, -29, 11, 4, -46, -54, 6, -17, -63, -26, 3, -38, -21, 33, -7, -13, 52, 51, 5, 35, 56, 34, 1, 20, 34, -3, -35, -3, -16, -60, -48, -14, -58, -60, -4]
2079dMn1M2M8m3qO1Mm0J8K6k1m3K5J8m2l5M7ro4L0L9m2j9O4j2k1M3K3l4RM0j7
2112C6l4K6K8l9m1N5Qq8JN7l4m8N4J3p1K5N1j4k5L5L5k9j0N3%l4OM5m8l8N4Kp4
2145d3K5M3o1k9O0J3q2L9M9j9l8N0K4k6j4N5jn4K0N7o3l8O1Oq6K8M6o7k8N6J8
2176Am4PN5k1k2M6K7n4JO3j1p6N5M0p1j5O8l1p3M2L9n7l5O2J0n8QQ2l0o1O4M3
2208E4o1rQ2k0q1N2M0n5k9N5k6n3K9L9m8l6O7J4o7J0P5l8l3N8L9q1J0P6l2o0M7
2239A8M8p6k8P0j7p3L2M9m6l4N9J5p1K7P0m2m1O0K7o8J4O9l4o0M4K7m8m3N5Op1
2270f2K2O5m3l4O6%n9K5O7l9l6N7L1n6jM9j6m9L0L0m7l7O6pp7K3O3n3l5O7Ro3
2302d4K4O2l6k7M4L1o0LM7j0o4K4N4n9l0M7Jp1M4L3l4j6N2j5l5K6M9j8m2N2K4
$$ y = [-4, 0, -51, -9, 39, -4, -12, 49, 53, 13, 31, 57, 36, -7, 18, 36, -6, -41, 6, -3, -67, -37, 2, -40, -59, 5, -7, -28, 15, 38, 4, 13, 53, 36, 2, 28, 56, 17, -24, 31, 39, -49, -48, 9, -25, -73, -19, -6, -77, -52, -1, -15, -40, -5, 30, 1, -9, 44, 44, 10, 16, 61, 13, -25, 29, 31, -43, -18, 25, -36, -65, -5, 8, -74, -35, 14, -5, -43, 7, 31, 5, -9, 46, 45, -9, 11, 68, 5, -33, 28, 34, -52, -24, 22, -45, -73, -17, 1, -43, -36, 19, -2, -24, 22, 49, -5, -4, 59, 48, -28, 27, 67, -4, -19, 49, 18, -55, -13, 26, -31, -66, -4, 6, -52, -44, 38, 8, -53, 11, 54, -7, -16, 66, 46, -35, 17, 57, 2, -27, 28, 2, -51, -22, 17, -31, -67, 0, 14, -53, -43, 32, -6, -39, 19, 58, -23, -13, 63, 31, -29, 18, 66, -10, -38, 32, 15, -58, -26, 23, -23, -57, 2, 17, -54, -27, 43, 1, -40, 20, 47, -21, -7, 62, 28, -32, 12, 39, -9, -52, 3, 9, -62, -40, 25, -18, -52, 14, 14, -45, -20, 47, 8, -28, 29, 60, 4, 3, 52, 36, -13, 17, 47, 0, -37, 29, 22, -55, -32, 31, -22, -57, 10, 19, -44, -20, 42, 6, -21, 23, 54, -6, -3, 44, 34, -30, -6, 48, -11, -41, 6, 7, -64, -20, 13, -21, -37, 15, 0, -35, -9, 40, 22, -20, 32, 56]
2333E6n5j1N7po2L6L6m4m0O0k8m3L1K2k8k3L7K2m1PM1ll6L6J8m2PL1j5l7K3J6
2365B1m3j0K9pl7K2M2k8l0L8L0m3J0L4nl4L5K1l8ML3j6m9L5Nl5qL1nm2K1L1k4
2398a2j8K5J8k3LL2rk6L6J1l4OJ4k2mJ2Kk8lJ4Ql7K7K3j4l2L1J7l3OL6Km1K9K0
2433C6k0nK1j3j6JJ6k3k3L2mk8jL2j2k4K8J6k7J0K3prNJ9k3%J7j0j6LK0k2k1J6
2468iJ5l3J7J5j8lK9Jk2LK2%r%K1j3k1K3J6l9J0Rk4%KJ2j7QPqoQJ6k3nK3MnmJ7
2508A9k2PjJ1j8j2K7j5njJ1j1J0QjnOJ1j2JJ1Rj7J1qJj1PqnMQj9pK7j2lpJ5%o
2549bLJ2k1LJ6lj6J6qKrJ0Kj4LOqmKJ7k1J5Rj3%OJ0lj1J2Jj2J8npj1KjnnJ7j4
2591a1jPJ5j3j1K2orJ5Nj3Q%Nj4kJ2Npj1J1j6OKLmkMj6K0JpLLJ9qj0QpqRMojK
$$ y = [56, 1, -10, 47, 40, -22, 14, 50, 6, -34, 26, -2, -45, -14, 8, -20, -43, -6, 16, -25, -18, 23, 20, -16, 20, 38, -4, 3, 34, 19, -18, 5, 21, -22, -32, -3, -10, -47, -25, 17, -11, -41, -3, 27, -16, -6, 28, 23, -11, 24, 45, 7, 11, 44, 28, -21, 14, 19, -16, -24, 7, 2, -40, -19, 12, -12, -30, -5, 13, -10, -7, 25, 16, -10, 26, 37, 3, 9, 23, 1, -3, 9, 11, -17, -20, -6, 2, -35, -8, 15, 1, -31, 0, 17, -16, -10, 26, 28, -13, 16, 36, 16, 11, 32, 19, 3, 4, 20, -3, -26, 6, 2, -26, -27, 5, -7, -31, -3, 13, -14, -4, 19, 12, 3, 8, 27, 4, 4, 21, 11, -5, -2, 18, -4, -25, -9, 6, -27, -10, 5, -13, -16, 13, 14, -8, -5, 17, 17, 8, 8, 29, 16, -5, 18, 34, -5, 5, 14, -10, -10, -8, 4, -13, -5, 2, -6, -12, -4, 12, -11, -16, 7, 11, 6, 2, 19, -3, 4, 3, 14, -4, -16, 11, -4, -9, -10, 1, -10, 0, 8, 7, 2, 8, 19, 7, 8, 19, 28, 11, 22, 14, 15, 4, 11, 3, -2, 2, 10, -9, -16, 11, -1, -4, -11, 4, 4, -2, 1, 13, -8, -5, 11, 8, -8, 8, 0, 2, -7, 3, 5, -9, -6, 0, -8, -12, -10, 7, -14, 1, 10, -3, -3, 3, 13, 10, -1, 11, 12, 0, 18, 13, 6, -5, -3, -4, -9, -14, 3, -11, -12, -5, 10, -3, -14, 8, 2, -7, 8, 13, 0, 8, 8, 13, -1, -3, 9, 14, 7, -4, 7, -9, -3, -1, 2, -2, -4, 0, -16, 4, 5, -2, 1, 4, 23, 15, 5, 13, 6, -2, 7, 11, 5, 4, 6]
2636FOk6P%%%OLj2J4oMmqJ3pPMLj2LJ1oj0JNmJKjokJ1MqK8j5%ljRoKj0Pj6PKm
2685aK%rnORj4J2roJ3jJ%KJQqjk%Rn%MKnj1J5pj0MjQkJ1lqkJ6pmPloLrJ5l%oL
2737Cj3LRk0J1j0J2qjJ8j1J6%ol%%Q%J1j7J4op%jkKnJkKRkKrQkj0PPj2jPmOJM
2785Ij5QJqPqjJj1J1RlkJ0omJN%oOOj4J3kj0J1j1J8j1LOj0Qj6Rj2J1Qj1j0J6q
2828bKJ1jj9J0Rj5jKKL%mNllMKkKJjJQnmJ0lmOoJ1rmLjJ0Kpj0nJ7jj0%klKpQl
2879d%QpjNRk2J4rRj0MJ1k0J6NqQl%jqQlMrJ3nm%MoNJ0j8J1KOopMlOj3PmK%Jl
2929bOrLpMJ1k2K1pk%lJ5KoLjMolJ1olLkMrOlQnJPjj0mMOOqqPjkOqnOJmj1J7l
2982Aj6jJ1ppJ5OmnJ6ooQRknNprJ0%j3MLRj3RMj4J4j0OmmJ5j8J7rklJRNql%%n
$$ y = [6, 12, -14, -7, -7, -7, -7, -1, 2, -10, 4, -2, 2, -2, -10, 3, -4, 3, 7, 10, -2, 1, 12, 6, -4, -3, 2, -2, -1, 1, 0, -6, -8, 3, 7, -1, 27, 12, 12, 9, 8, 17, 11, 13, 3, 10, -6, 1, 3, -1, 1, 1, -8, -13, -7, 2, -12, 0, -9, -15, -2, -3, -2, -2, 0, 1, 9, 1, 0, -2, -2, 7, 2, 2, 6, 8, 3, -8, 7, 0, -10, -6, -7, 1, -1, 10, 7, -1, -3, 13, 6, 2, 9, 6, 0, 3, -6, 9, 6, 6, 0, 3, -10, -7, 2, -18, -7, -17, -5, -13, -14, 4, -7, 9, 9, 3, 0, 0, 0, 8, 8, 19, 2, 16, 10, 3, 3, 2, 0, 2, -3, -2, -4, -2, 7, 5, 7, -2, 6, 4, -6, 1, 8, -4, -5, 2, -2, 4, 5, 9, -6, 2, 3, -5, 2, -6, -7, -6, -17, -6, 3, 0, -2, 8, 2, -2, -1, 4, 4, -2, 4, 10, -4, 9, 7, -3, 8, -3, 15, 4, 7, 13, 3, 11, -5, 4, -8, 3, 11, 0, -10, 6, -2, 0, 11, 10, -9, 1, 10, -5, -6, -4, -2, 1, 1, -3, 2, -1, -4, 0, 2, 0, 2, 3, 2, 3, 11, 6, 2, 12, 9, 5, 11, 5, 16, 7, 3, 6, 5, 15, 17, 10, 0, -5, 12, 11, 1, 1, -1, -4, -2, -9, -1, -4, -4, 4, -3, -4, 1, 10, -12, 2, -7, 2, -8, -4, 7, -13, 3, 8, 0, 8, 5, 5, 4, -4, 4, 1, 5, -4, 9, 4, 0, 0, 4, -2, 3, 13, -5, 6, 8, 14, 8, 1, 5, 2, 8, -5, 2, -2, 0, 0, 1, -2, 4, -5, -2, -9, -5, 6, -16, 5, -2, -4, -4, -7, 8, 10, 4, 7, 6, 10, 4, 1, 12, 6, 3, 6, 4, 8, -1, 5, 2, 10, 5, 6, 13, 12, 2, -2, 2, 8, 14, 6, -2, 5, 4, 2, 8, 0, -5, 1, 2, -2, -13, 4, 1, -15, -16, -5, -12, -19, -4, 2, -2, -7, 9, 3, -3, 5, 14, 12, 7, 12, 5, -4, 6, 6, -7, -3, 0, 9, -4, 5, 9, -5, 9, -1, 5, 1, -3, 12, -6, 11, 2, 0, -3, -2, 7, 12, 4, 1, 1, 1, -4]
3030dJKqPoRj4J2kOmJ4omOJPKj0j%k%kmJ0j%M%koJnPj8OJ0oJOkMpPj0LJ4j3j1
3080hJ0mjj0J1Lj3J2KJm%Oj1J2J5j5jlJ0oNpLNKoOqLoKJk%j2PMqNK%oMqJJ0lo
3129fM%J4nnkQj%MrKpQkklJ3pOkj0J0NkoMlklQj1j0J2qJjKpKlLNNkJ1k0MMj2K3
3180Gp%LJ%%%kmNKoJjJ0rJ2qrJ4j5P%k%LNpJk%NlqqJ8qqOKJ4j9NM%kOLj1RJjQ
3233A2LrkLKj2NLNj3nJ6jj6%J8qJ%pKOokmJ7nk1RJ2r%Rjj3OKLmJRqlJ4j2jNJ3
3281A4j0NmPOj0kPj3KJ9k1OPjj1J0LnrPkkNJjJrOj5%J1j2J2nLj0J5J3j5oJ5qm
3325@LL%oQj1J0jMonjNR%onjOJ5j3kJLlkNpNj0Rkj5J0nJ2j2pJ4kNrlJ2qjLNLj0
3375cJ2JnoJ1oNk%%okOrLLPrJ1qJ6j5KK%Kj2oNQqLMqlNpJ0pj4J0J9j2NLomJ2r
$$ y = [-4, -3, -1, -9, -2, -8, 1, -13, -1, -3, 3, -1, 13, 7, 3, 9, 10, 17, 19, 9, 8, 8, 6, 6, 4, 0, 10, 9, 9, 13, 13, 11, 5, 6, 1, 8, -10, -4, 6, 0, 1, 7, 5, 9, 2, 9, -1, 2, 16, 3, -8, 2, -2, -3, -13, -2, 1, -12, 0, 2, 3, -1, -1, 5, -6, 6, 21, 6, 5, 2, 12, 6, 11, 4, 7, 12, 14, 8, 14, 6, 9, 3, 5, 6, 4, 4, -8, -1, 3, -5, 0, 2, 2, -4, 0, -8, -7, 3, 0, -6, -2, -2, 12, 7, 2, 0, 8, 7, 7, 11, 2, 4, -3, 5, 3, 1, -2, 11, 4, 10, 8, -2, 8, 13, 11, 5, 9, 6, 4, 1, 9, -2, -12, 0, -8, -7, -8, -6, -13, -11, -14, -11, -6, -1, -3, 8, -12, -8, -4, -16, 7, 0, 0, 3, 4, 4, 4, 4, 2, -2, 3, 5, -1, 0, -1, 9, 0, 12, 4, -5, 9, -6, 1, 1, -1, -1, 2, 7, 0, 1, -1, -1, 4, 1, -7, -15, 3, -5, -13, -7, -5, 9, -10, -5, -1, -1, -3, 3, 6, -5, 4, 5, 4, 12, 15, 6, 4, 7, 9, -3, 2, 5, 10, -3, -8, 8, 7, -9, -9, 9, 1, 2, 2, -5, -3, 3, -3, -5, -9, 8, 3, -18, -9, 3, -6, -6, 3, 2, -11, -5, -3, 0, -4, -3, 6, -2, -5, 9, -3, -4, 1, 14, 4, 9, 5, 12, 18, 8, 6, 13, 0, 2, 21, 0, 6, 13, 12, 1, 11, 14, 9, 0, 7, 5, 3, 8, 9, 8, 9, 0, 6, -9, -9, 2, -10, 2, -3, 0, -10, 5, 18, 3, -3, 12, 4, 0, 3, 6, 6, 0, 8, -3, 7, 6, 10, 4, -1, -2, 3, 12, 12, 6, 1, 0, 6, 21, 8, 6, 7, 10, 7, 5, 10, 3, 8, -2, 7, 5, -10, 0, -5, 7, -5, -12, 2, 0, 5, -4, -7, 5, -3, -4, -1, 4, 7, -3, 9, 10, 5, -1, 10, 4, 9, 7, 7, 7, 1, -1, 5, -4, -1, 2, 9, 0, 11, 3, 19, 4, 6, 8, 8, 10, -2, -8, -3, 5, -3, 0, 4, -4, -7, -2, -9, 1, -6, -20, -10, 9, -3, 2, 5, -1, -5, 7, -2]
3424bMONjj1MNolOjk1J9Kj6P%J3j2NkJKMJooRplMJ0j7J0JmkLJrJRqjQPq%J5j1
3474EN%J4j6KNJj2%J0jj3QprNj0J2LJ8k6kQNnLOrKlQLj2lJ1j5MjMj1MJ8j4KnJ5
3520GPj2J4LoNKOk0J3mpkMMj0NJrKlNnpJ4j1OMr%jJ4kqQj0JRlkoNJ7j8rJ2lj0
3568iQK0k0RjLpmJ6MrljPj3ROk5PQj9J7KnnNOmj5J4pLKJNnJjJ%qJ7j4KJ1nRkl
3617Hj2J4kj2J1klO%NnNKlj1KNj5mJ0Oj3QlJ1j2JnJ0lmJ3qOJnpJ0Qj9J2NpoJO
3663EjNJ0k1J2%Qj1lJ1njJKmj4J2opJ2o%m%J9j5llQqkQKkJ4rqMjKLnJ4j5LoNj
3711ajJ0j1PQmPnQnnJ1j3pR%okLojoJ2rLl%lJJJJJ3j2Pj0R%MMj1MoJ4j7LNoLj2
3761a4J5jnpJ5kOM%KJ0olkmLj6J3joj0RrKj0J5j3MkJ3j6LJ3JkJ1nk%lJ3rnRNj5
$$ y = [-2, 2, 8, 13, 12, 1, 5, 10, 4, 1, 7, 6, -15, 4, 6, -10, -3, -3, 10, -2, 3, 1, 2, 4, 8, 9, 3, -3, 6, -1, -4, 0, 10, -7, 3, 4, 0, -2, 1, 2, -7, -6, 3, -5, -6, 2, 9, 1, 1, 16, 5, 10, 10, 24, 8, 10, 15, 16, 4, 4, 14, 13, 0, 8, 1, -8, -3, -13, -1, 2, 20, -6, -8, 0, 5, 0, 3, 9, 0, 2, -1, 7, 10, -2, -5, 6, -9, -5, -6, -2, -13, -9, 9, -5, -3, -8, 7, 14, 2, 16, 19, 13, 18, 20, 26, 6, 19, 15, 8, 6, 10, 14, 4, 9, 10, 1, 3, 0, 5, 0, -7, 7, -4, 2, 6, -3, -3, -4, 10, 8, 0, 8, -2, -1, 8, 5, 3, -3, 2, 19, 1, -8, 4, 1, -9, -1, 19, -1, 8, 7, 10, 3, -1, 15, 19, 10, 7, 6, 13, 0, 9, 15, -10, -3, 5, -14, 3, 5, 0, -5, 0, 6, 2, -13, 1, -6, -3, -1, 0, 5, 0, 1, 0, 1, 1, -7, 10, -4, -2, 9, 4, 13, 11, 8, -4, 10, 8, -4, 7, 5, 2, 8, 8, 13, 8, 13, 15, 12, 1, 3, 8, -7, -11, -1, 5, -8, 0, -3, 8, -4, -3, -8, 2, -1, -5, 8, 0, 6, 7, 2, -5, 5, 13, -6, 6, 11, 4, -2, -1, 5, 4, 9, 19, -2, 10, 10, 18, 7, 4, 15, 10, 9, 10, 12, 8, -6, 6, 0, -7, 5, -1, -1, -5, -5, 14, -1, -4, -7, 1, -7, -9, -1, 1, -1, 13, 4, -4, 0, -1, 1, 4, -1, 13, -2, 1, -5, 0, -1, -2, 8, -3, 4, 12, 8, 15, 10, 18, 13, 8, 19, 6, -1, 8, 8, 2, 0, 3, -3, -4, -10, 2, -7, -4, -7, -7, -10, -9, -8, -7, -6, 7, -5, 2, -8, 1, 1, 5, 9, -2, 2, -4, 10, -7, -4, 1, -5, -2, -14, 1, 0, -5, -12, 3, 1, 7, 11, 11, 13, 23, 17, 14, 12, 8, 11, -5, 8, 7, 1, -9, 0, -9, -7, -17, -2, -15, -11, -13, 0, -16, -13, 0, 1, -1, 10, 5, 3, 3, 0, 13, 4, -1, 8, 13, -2]
3807bLLmKjNj0LRJoNNlq%J4j7RMqlOqj2PmnoNMKj0J0J1nJ3Kj0mJ6j0jQj2oQJj0
3856iMJJ5j4LPojJLmjRQj3J1nKj3KJrJ1mkm%nNqLKmkROJJ2pOj5KK%mKMrRjpNJ3
3909A2j1MkqmPRj1MMoqJ2kpRmKlnqPqKJ9j3mK6qj7QJ4j8jK1j5lmRn%J1j1KKkR
3956Ej0mRNJm%qRPjj4NkknJ1mnLjj1%J2nnPJj1K3j1LjMnPj0J0nLOlKoPooJQoq
4007a0J6Oj5QrjJ1mJ3j1p%MkmJ2j3mJKk0J2%mjQR%oJ3pj0J7NrjRlLmRj5nJ3no
4053e%MjpJ1nlkJ4LmpMOjmLqJkrOrKjlLkJQMrMNNmNJ3j5kJ2nj3PJ3j7J2lnkJ2
4104A0mkj0KJ7j6K%MpjJ4qlNpmJ3kkpmjnLNmj0OJ3ojJ0k%KRMj7J3jpM%oLKjj1
4153hLQpnKKpRJ0qkLLOj5J6j2qNNlpRkj7J8PrjMKmJ2%oLlPmJKQj4QNj5KjJj5O
$$ y = [-2, 1, 4, 0, 2, 1, 6, -4, -1, 8, 9, 3, 8, 13, 10, 2, 2, 16, -1, 8, 12, 4, 1, 7, -1, -13, -6, -10, -15, -21, -16, -12, -10, -20, -10, 1, -4, 9, 11, 1, -3, 13, 3, 2, 10, -2, -8, 0, 1, -9, -5, -4, 11, -3, 0, 7, 1, 0, 1, 4, 0, -1, 8, 16, 3, 14, 9, 11, -2, 0, 1, -8, 3, -1, -3, -7, -7, -12, -7, -15, -12, -10, -14, -16, -7, -1, 0, 12, 5, 11, -4, -2, 0, 0, -4, -2, 2, -7, 2, 1, -6, -1, 12, 1, 5, 3, -5, -9, -2, 7, -4, 0, 4, -2, -10, 2, 0, -7, 2, -2, 0, -3, -8, -16, -9, -17, -15, 4, -9, -13, 13, 5, -12, -4, 10, -8, -9, 12, -3, -6, -10, -1, -6, -6, 5, -6, -4, -2, -4, 5, -5, -9, 0, 5, 6, 2, 2, -6, 3, 10, 9, -5, 0, -2, -4, -9, 2, -2, -7, -4, -5, -16, -16, -4, -9, -14, -7, -6, -17, 6, -5, -2, -3, 1, -4, 3, -7, 3, -2, 1, 7, 4, 6, 0, 7, 1, -5, -4, 4, -2, -10, 6, 12, -3, 5, -4, -5, 6, 2, 15, 4, -3, -3, 1, -1, -5, 7, -6, -10, -9, -7, -27, -15, -15, -19, -20, -12, -3, -3, -9, 4, -3, -13, 4, 9, 0, -1, 8, 5, 8, 4, 13, -2, -7, 6, 1, -5, -5, -1, -2, -9, 2, -3, -6, -8, 6, 9, 5, -2, 2, 8, 7, 3, 6, -2, -1, -3, -12, -6, -15, -13, -14, -17, -14, -16, -15, -7, -3, -12, -8, -3, 2, -2, 3, 16, 1, -1, 11, 6, -7, 0, 13, -4, 8, 5, 0, -2, 10, 6, 4, -6, -4, 13, -3, -1, -1, 3, -4, -5, 9, 1, -2, 3, -4, -8, 5, 3, 1, -6, -10, -11, -16, -13, -8, -12, -22, -16, -3, -9, -10, 0, -2, -2, 0, 9, 13, -4, 9, 8, 1, 5, 5, -1, 2, 4, 3, -8, -5, 3, -4, -9, -7, -5, -12, -3, 7, -1, -3, 0, 3, 9, -6, 10, -2, -10, -5, 0, -3, -10, -1, -3, -20, -2, 5, -4, -5, -1, 1, -3, 9, 9, 3, 6, 3, 10, 6, 7, 9, 17, 3, 11, 16, 1, 3, 2, 3, -12, -6]
4204fkOkkLLKNqOnNjmJlj0OLmKRj1kNQnmJ0LqnKN%JKMoJ2Lj4nJ3j1kOk%j6R%j
4257ePOMpkJrJ%nJOjlLJjKoPoj0J6PrPLjpJ0MnNLmj0RLqmPj1rJ1kn%J5npRLpl
4311aoJ0mjNnojMj0J4j0J8j0LnjJ2%KpMKNqKmLjOllnJlLmjjQj0OPLlKp%PmLjr
4364d%mJ2j4LNjrNJ3j2jjjO%JJ6mLj1RLmmJ6j1pp%QqoOmJOqJKmJ2j5J2O%mNj3
4413fj%J4Lj1LJj4R%Nk%NpKJ1kj5K1j2knJ6jnjKnLk6RJ5oMj2OnomOKQkj2J3%o
4461a0J1ojKOmkkNMoJ2j7JPKlOjMmJNNlKj0Oknj6QpJ5nMj0rJ4kKkmOk%JKKmLm
4513eOlJ2j1KmKnJ1jpPRpJqqJ7%pOqJ9om%j2Qj0NJkkoPj2KRmj3QJ5j9J0RkrRl
4562cJ3j8J3pOpJJ4j4NM%KJLKpJ0nmQpj0nJ6j5MJKj0Op%nJ6ljJj%j3NJ2pJLpQ
$$ y = [-6, -8, -2, -4, -6, -3, 0, 2, 7, -1, 5, 0, 5, 4, 0, 1, -2, -12, -6, -3, -7, -5, 4, -7, -9, -4, 4, -1, -5, 5, 8, 0, -5, -3, 2, 2, 3, 5, 9, 3, 15, 18, 4, -1, 12, 1, -1, 5, 3, 3, -13, -4, -4, -5, 2, 8, 12, 5, 3, 4, -5, -4, -4, -9, -8, -2, -3, -6, -3, -2, -3, -1, -7, 0, -6, -16, 0, 7, -2, 5, 8, 7, 0, 10, 14, 9, 14, 17, 13, 3, 12, 15, 7, 3, 10, -1, -10, 1, -1, -6, -6, 9, 4, -3, 6, 9, 2, -1, -7, 3, -1, -2, 3, -2, -8, -9, -5, -15, -1, -11, 7, -3, 0, -5, -6, 6, 6, 8, 1, 5, 7, 12, 4, 6, 2, 5, 4, 10, 7, 4, -1, 0, -3, 0, -4, -5, -6, 2, -8, -2, 5, 8, 5, 7, 0, 0, 7, 3, 6, 5, -4, -4, -8, 4, -10, -7, -2, -3, -12, -7, 6, -6, -7, -8, -9, -3, -3, -2, 14, 10, 13, 2, 11, 14, 10, 6, 22, 11, 4, -3, -3, 5, -3, -9, -3, -7, -6, 0, -8, -7, -5, -9, 3, -12, 0, 6, 6, 2, 7, -6, -7, -7, 7, 10, -1, 2, 3, -11, -2, -2, 3, 1, 1, 6, -1, 1, 12, 10, -5, 16, 4, 2, -3, 13, 12, 7, 6, 8, 3, 6, -20, -11, 4, -2, 2, -10, -4, -9, -15, -19, -13, -11, -3, -5, -17, -4, -4, -10, 1, -5, -6, -4, 2, -2, -4, -6, -1, 3, -3, 9, -8, -7, 0, 2, -1, 5, 4, 8, 4, 5, 10, 15, 12, 14, 4, 10, 8, 3, -13, -5, -12, 3, -2, 2, -8, -17, -3, -5, -3, -5, -9, -3, -5, -5, -4, -2, 0, -4, -1, -5, 1, -2, 10, -1, 1, -3, -1, -6, 5, 4, -3, 4, 13, 6, 7, -1, -9, 8, 8, 1, 7, -1, 18, 12, 8, 8, -4, 4, -6, -1, 0, -2, -4, -10, -3, -15, -13, -4, -8, -21, -13, 2, -17, -7, 2, 0, -9, 0, -3, 10, -8, 5, -2, 4, -3, -2, 12, -2, 3, 7, 7, 9, 10, 13, 15, 8, 18, 13, 9, 17, 10, 0, -5, 11, -4, 0, 1, 3, -7, -1, -8, -8, -13, 3, 0, -1, 0, -1, -1, -14, -9, 3, -4, -3, 0, -7, 1]
4610ANqnLRmloJ0LrKQOJj2J0jJ6j2KNj2Oj4Nj0Jj3J4j2J0p%NMKjj8K1qlPLm%N
4657BnKNoJnQkj8RJ2rQmkJ3lOklm%KOj%krkRqlMjLkj6MjLJMJ0j5KOKQrKKj%Rj
4712IlqLKNMlLj2jRj5NQKJlOKj7PkOj3JJ6k7J4qKjNqJOrKJ2%jnJ1oKP%jJkJ5j6
4763FpOKnMq%JLJklPqlPJ1j4Pj1jJ3j9J5joL%Mj3LNpJ2kn%nJ1MJMKmlRoL%rJ2
4814A4jolj0J2LjkkOj1MJ0j1kJ0k1J2PMj6Pj4NOmLmkQkjkLJ2oPmjpJ3pj%NklO
4862A1NoqJ0Nk0J3mnRLj1mLQLk0lqLLJ1KrMlqJ0jklJ2Lj8J5JmjJ2lqJ3%qJnqR
4910aJJ4jj4QnmJ4mj4K9j7KmlJpPrPj1P%j1J9mj0NnKPljPJ2j8J3jJPj0jK%mPn
4957EmJ1Kk0OMnkmJ4Mj2Nj0LQNpkKj1MPpjjJoQKprJ4j4J2RMjlLJjOqJ1ppKLkQ
$$ y = [1, 6, -2, -7, -4, 5, 1, -2, -8, 2, 5, -4, -2, 6, 12, 13, 1, 11, 10, 26, 14, 16, 21, 9, 15, 1, 6, -4, -3, -16, -2, -14, -4, -11, -11, -6, -2, 0, -1, -19, 2, -6, -9, -2, 1, -3, -3, 2, -3, -1, 4, -2, -1, -6, 2, 0, -18, -9, 3, -6, 2, -2, -4, 9, 6, 12, 10, 7, 3, 3, 5, 11, 10, 10, 8, -1, -3, 6, -2, -5, -1, -2, 1, -1, -17, -13, -14, -11, -10, -6, 4, -11, -9, -3, -1, 7, -2, 0, 2, 1, 1, 10, 9, 6, -2, 1, 3, 8, 12, 9, 12, 0, -1, 8, -7, -2, 6, 8, 9, 6, 12, 14, -3, 4, 2, 8, -5, -4, 12, -15, -1, -9, -7, -8, -3, -11, -10, -4, -13, -11, 1, 1, 0, -5, 6, 0, 2, 9, 9, 8, 9, 7, 22, 6, -1, 5, 7, 2, 6, -2, -2, -1, 2, 3, 1, -2, 5, -3, -6, 1, 12, -2, 5, -6, -7, 6, -13, 2, 1, -5, -2, -2, 2, -11, -8, -3, -10, 2, 0, -5, -5, -10, 1, 5, 6, 10, 12, 8, 5, 14, 8, 11, 11, 2, 14, 13, 7, 4, -6, 6, 9, 8, 6, 4, 10, -1, 3, 13, 2, 0, 10, -11, 1, 8, 12, -4, 3, -11, -6, 0, -4, -1, -5, -7, 1, -1, -2, -4, -1, 11, 5, 12, 8, 7, 0, 13, 6, 5, 5, 10, 8, 5, 11, 16, 10, 2, 12, 17, -3, 10, 6, 1, 10, 13, 2, -2, 1, 9, 12, -8, -11, -19, -16, -13, -2, 0, -9, -5, -8, -16, -6, -7, -9, -12, 0, 3, -15, 0, 1, -3, -4, 8, 5, -3, 10, 10, 2, 3, -2, -10, -1, 0, 14, 13, -1, 7, 2, -2, 12, 8, -6, 23, 6, 8, 4, 1, 2, -5, 2, -7, 0, -11, -4, -4, -15, 4, 0, -10, -5, -10, -8, -1, -4, -5, 2, 14, -4, 9, 8, 9, 16, 6, 5, 7, 7, 3, 10, 5, 1, 12, 14, -6, 0, 4, -1, -3, -7, 7, 11, -1, 4, -6, -3, 5, 10, 3, 1, 3, -8, -4, 3, -4, -5, -6, -5, -11, -3, -1, -8, -17, -3, -17, -5, 4, 8, 7, 4, 7, 8, 7, 13, 5, 16, 9, 2, 4, 7, 5, 13]
5008A3j2N%j1J5j1mOoLMMk%rQlnQkkjKjMj1Lj0nJ0mJ1jjJ1mPlOlnjJ2onoQklJ0
5058A1j0k%oROj6OqMOKj0J2r%JpLJ1nOj1J0j7OP%NpLNKrNJ0qKoJ2oLKqK%MPj4
5107CMoJ2looKlj4J2Qj1lJ1plJ3LrlPjmJ1j9Rj6J2J0j2J3KLJj3LJ0%pj0J2qJ1
5150HoMlOjj3NKoJ1j1J1qJNpkJokK1j6J2j5MpjLjJ2Rj3%nJ1OJ0k3lJ4J2rMnj8
5195iJ5jLj3J4oNroJ2Nj7RNqJ%lJLJjo%MJjJlj1OMJoRKPoQpLlj0J8%pK%mMj5J5
5247GM%%mj2NKKj1kOQKk1J5nlKjKNklRj4PjJrKlJ2j1jMQMJkLRj1Qj1LRjn%%mJ
5299DKrJ0okKpQj0NkoK%JLnJ2jj2PJ6j6LQqJ1j6%MKLLnJmJ5olOJJ5k5MKlOmMj
5349Ij0Qmjj3J0PrnOjj4RlOKjQoQJrOkmJJ0nj0JJ5qNPMmpLkpPNoj0J7rMm%Lol
$$ y = [13, 1, 6, 6, -5, 10, -1, -5, 1, -5, -2, 2, 6, 4, 4, -5, 3, 0, -5, 3, 1, -1, -2, 0, -1, 3, -8, -5, -15, -20, -10, -14, -3, -4, -5, 6, 2, 9, 6, 12, 9, 4, 3, 15, 9, 4, -2, 6, 4, 1, 11, 1, -1, -1, -7, 2, 8, -8, -2, -10, -6, 0, 2, -8, 4, -5, -5, -4, -11, -8, 3, -2, 4, -7, 3, -14, -8, -1, -1, 4, -3, 0, 5, 7, -2, 3, 13, 5, 7, 1, 13, 7, 10, 12, 4, 6, 6, 10, 17, 3, 7, 1, 13, 10, 4, -2, 0, -3, -17, -5, 3, -8, -11, 0, -7, -10, 3, 6, -3, -6, 1, 0, -4, 7, -12, -3, -19, -7, 3, -9, 4, 6, 9, 10, -3, 0, 10, 10, 3, -7, 5, -3, 8, 2, 6, 3, 9, 8, -5, 0, 2, -4, 7, -4, 7, -1, 0, 5, -2, -4, -3, -9, -11, 10, -6, 6, -9, -5, -12, -13, -10, -11, 1, 10, -3, -3, -8, 3, 9, 19, -4, -7, 7, 19, 10, 14, 9, -9, 6, 5, 8, -5, 9, 3, 8, -1, -7, 5, 10, -7, 2, 7, -1, 0, 0, -3, -2, 1, 2, 1, -5, -5, -1, 0, -1, 0, -3, -14, -8, -4, -3, -9, 0, 2, 9, 3, 11, 4, 7, 4, -6, 12, 12, 5, 7, 7, 3, 7, -8, 7, 11, 11, 11, 7, -5, 0, 2, 4, -7, -9, -3, 5, 7, -14, 1, -4, -7, -5, -6, -4, 1, -1, -4, 5, -9, -2, -3, -2, -11, -9, -12, 0, -11, -12, -8, 0, 4, 5, 3, 6, 15, 4, 12, 1, 4, 13, 12, 7, 7, 7, 3, 4, 6, -3, 7, 1, -1, 1, -6, 2, -8, -3, -5, -11, -9, -9, -8, -5, -10, 2, 1, -11, -4, 12, -4, -1, 7, -1, 10, -6, -6, -2, 0, 3, 6, 1, 2, -2, 13, 7, 4, 10, 11, 26, 1, 5, 7, 4, 10, 6, 10, 9, -1, 7, 3, 2, -11, -1, 6, -3, -8, -2, -3, -17, -8, -11, -5, -3, -4, 4, -2, 6, 7, -2, 4, 2, -2, -1, 9, 4, -6, -5, 10, 2, 7, 14, 18, 14, 7, 10, 8, 1, 8, 13, 7, -3, 14, 5, 9, 5, 5, 8, 2, -1]
5401aPmJj1LmoRojPkKPJmkKKpJ1kKRjj5J3nPMj5RNpJmJ0j3oLMJmJJ0lmojll%j
5454a0Qj2LPj5J6mmLLLOlj2RpMQJOj2lJ6l%Qj3OjlPKj7NjOj4PKj0Mj3J8%j5J7
5500Cj4Rkj0P%lMJ1j1KJ1j1Oj1J4j1QjrMJPKr%J0MrPQomNmmjQj9J5Pj9JmRnJk
5548eo%%lMJ0onNRj4J0JlNlmRpjOLlKmKL%lJ4komllJ0kLj4J7rKqj2J2J0j8nRj
5598hjmNMLrQnKLPqJ0jJj3RPpjNlJ8j5J2pLllj0MJLlJ3j7mMJjK%jkM%pj1QPj6
5649a6K3rpJ%PpkNMKjjLnRJ0MoNpOnj0PmJ1o%jj3%NLj5J%J8j8J6Jj3J0rLmj0K
5697a3J2j0RjNj1jJ3oJ0j0OLrO%LMOj4J0nOm%OJj1OjJ1j4mmJOqOlqjNNllnPjm
5746gJ0knJJ1p%mKRoNrOnPj3J1%lONKj1J1j2OJmJOkmNqo%MJjnKpJ2j1kPnKnLJ1
$$ y = [-1, 6, 2, 3, -8, -5, -9, -15, -6, -12, -13, -6, -8, -6, 1, 2, -2, -4, -2, 0, -7, 4, 2, 4, 13, 12, -3, 10, 5, 12, 16, 1, 10, 15, 8, 9, 5, 15, 2, -4, -1, 3, 4, 0, 1, 11, 8, 4, -2, -3, -6, -9, -9, -10, -2, -14, -11, -4, -19, -3, -7, -11, -8, -5, -2, 4, 1, -11, -2, -9, -5, 3, 4, 10, -2, -5, 11, 8, 8, 16, 3, 9, 8, 5, 12, 14, -3, 2, 1, 7, -7, 0, 2, -8, -4, -17, 1, 1, -14, 3, -11, -2, -4, -14, -7, -7, -10, -6, 5, -6, -4, 7, -4, 2, -9, 5, -6, 2, 1, -8, -4, -3, 4, 6, -3, -3, 7, 11, 2, 9, 17, 11, 7, 12, 8, 4, 3, 11, -8, 7, 14, -5, -4, -8, 1, -4, -3, -5, -11, -11, -11, -14, -10, 0, -6, -11, -6, 3, -11, -1, 0, -3, 2, -1, -5, 4, -3, -4, 2, 5, 2, 4, 0, 2, 5, 5, 2, 16, 14, 8, 4, 1, -2, 8, 6, 9, -5, 12, 3, 5, -3, -15, -3, 7, -11, -16, -7, -8, -9, -13, -8, -4, -1, -10, -2, -7, -5, -2, 5, -3, 7, 6, 7, -6, 3, 10, 3, 2, 7, 4, 22, 7, 19, 12, 15, 12, 9, -1, 3, 4, 7, 4, 17, 0, -4, 0, 1, 0, 2, 2, 1, -1, 3, 3, -4, -15, -7, 0, -16, 7, -2, -9, -8, -8, -1, -8, -10, -5, -1, 1, 0, -1, 2, -3, 6, 16, 20, 14, 19, 12, 18, 13, 3, 10, 6, 17, 11, 11, 10, -3, -3, 2, 5, -10, -9, -9, 9, -9, 7, 8, -5, 5, -4, -1, -5, -15, -13, -1, -11, -2, -3, 2, -9, -10, 3, -3, 7, -3, 3, 6, -3, 3, 3, 6, 10, 16, 2, 12, 7, 13, 9, 9, 15, 16, 5, 11, 10, 21, 7, 3, -1, 0, 6, -2, 4, 1, -7, -8, -3, 2, -1, -4, -9, -2, -3, -7, 3, 1, -4, -3, 8, 1, 1, -3, -1, 8, 2, 7, -2, 4, -1, 6, -7, 4, 4, 1, 7, 12, 14, 3, 14, 2, 8, 9, 5, 6, 12, 10, 6, 11, 3, -3, -3, 1, 2, 1, -4, -2, -9, 3, -8, -10, -3, -8, -6, -11, -8, 3]
5798CoJ5lj4J5oQnJ%%j7K0m%KkOj1RrjpJ7%poJ4jLqoJ1j5JKkqJ1MmrKMrLPjJN
5848CJ1rpOJ1mr%J0pKJ%%mJ1oNj3OLj0J4plOmjnJ0pj3J1j1QnmJ5j3MnOJJ1j1l
5894fMJrJ1qOKjJ1J%kJnJ3oLjlj2kJ3nrLRj6NmQlKmKLj4PkRoJNj2J6rMLKl%JJ0
5946A4mMlllmQJRj1Kj1J8Mj2J0nj3Qj9RlJ4Mk2J0lJ1j4KMnOj1QoJMk%J4j2mJ5
5990A0pRlj2J6Nj6MmKJ3j1K%MKnLLojNj4J7j2MJ0k1MOpLLnLlmJ1j4Oj6PMPPj1
6036bQpPQJj1RKkj2%RKnN%Lj2PKKjj1KRnjkjMpNKnnJ1MrmK%lrJ4Jk0K1mj4J5J3
6087A6j7PJKRJkmnJJ1j4J1Jjj4OqNMqKKlNmj1J3rmJ0pJ1%lklJNqlPj%JKmOpPL
6138HmKMklJlJ0JQj0POk4jL%J0qLlpPpjKQj2JQn%kqJ6j3POqjNqJ7%rPpJ7plKm
$$ y = [3, -3, 12, 9, -5, 10, 4, 12, 7, 8, 8, 8, -9, 11, 7, 7, 9, 7, 13, 2, 11, 2, 1, -6, 11, 11, 4, -2, 12, 11, 14, 6, 0, 11, -4, -3, -1, -3, -11, 0, 4, 0, -9, -7, -3, -12, -9, -2, -3, -2, 3, 14, 5, -2, 4, 15, 11, 2, 2, 12, 5, 7, 8, 8, 8, 4, 15, 9, 14, 1, 7, 10, 0, 14, 7, 4, 10, 6, 5, 0, 10, 3, -10, 1, -10, -2, -7, -11, 4, -9, -5, -10, -4, -3, 8, -3, -6, -2, -1, -10, 1, -7, -1, 1, 0, 11, 12, 12, 10, 11, 6, 19, 13, 16, 15, 12, 0, -2, 11, 6, -3, 0, 9, -7, -2, -6, 2, -1, 1, -3, -1, 2, -12, -5, -7, 2, -4, -3, 2, -10, 6, -3, 1, 4, 6, 3, 3, 4, 14, 10, 14, 11, 8, 5, 1, 9, 10, 19, 8, 10, -1, 17, 21, 9, 19, 14, 1, 9, -10, -1, -4, 10, 14, -8, 2, -1, 10, -4, -2, 2, -3, 3, -8, 0, -6, -5, -1, -3, -3, 11, -1, -5, 10, 3, 12, 9, -3, 13, 18, 2, 6, 2, 4, 17, 6, 8, 8, 12, 14, 9, 12, 15, 9, 8, 13, -1, 16, 4, 8, 18, -3, 1, 7, 0, 3, 6, 1, 4, 1, -3, 8, -6, 0, -16, -9, -5, 2, 9, -2, 6, -1, 6, 14, 15, 4, 13, 15, 13, 1, 1, 10, 12, 7, 12, 12, 15, 3, 10, 12, 14, 13, 2, 4, 13, 8, 7, 5, 4, 8, 1, 6, 8, 3, -2, 9, 13, 4, 0, 2, 2, -1, -10, 4, 5, -15, 6, 2, -12, 3, 16, -1, 6, 7, 9, 18, 19, 17, 13, 8, 9, 20, 6, 17, 18, 17, 3, 9, 1, 6, 10, 2, 4, 6, 3, 8, 4, -7, 6, -3, -7, 3, -4, 7, 7, 4, 2, -1, 0, 5, -3, -6, 1, 0, 0, 1, 3, -1, 5, -2, 5, 8, 4, 6, 10, 8, 5, 6, 3, 13, 14, 22, 12, 19, 25, 1, 0, 3, 3, 13, 5, 8, 5, -2, 5, -2, -3, -1, 7, -5, -4, 4, -1, -1, -3, -11, 5, -8, -1, 5, -3, -4, 1, -7, 10, 10, 1, 8, 1, 18, 11, 8, 10, 6]
6190FPmj0J5lnPPkkLj1Pj0OlLqKoMpj0J3konJ0pJ5j3NoQkKoOJNPqLnRj2RKpJ2
6240A4kjj2K1qrMmPpOrJ4rpKJ2j3MqJ0mnMoOj0J3j3kJ8j7mJ4%kRnJ1JnKK%pJ1
6286A6j7J2pJJ4j4KLJ%Mkj3J2j4%J1oj4MQJKj6J5j1Pkj2PmJ9pj5J5qLQlPolQl
6330CNJolLMOj2J5j3RKNj4lKlOnkj0OPj4OKloNlRlJ2kLqpKlO%kjJ1kpJ1%jnPn
6382EoJ6krRJoJKMj3J1jqJ4j6%qJ1j7RrlJ1OJlkqJ3PkkkpQJJ%pJ4mJpJ1qjKkk
6432DR%lNpRrOPj7O%lKlj3MKJMl%rmJ0MnNqNNnJ0j6mJ4Rk%Oj2J7j3j%j1PrJ6l
6482GkmJ0lPj7OQj4K1j1Lj0pJ4p%JmONj3oQoOMrMlJ2KkMJOmnM%Q%qJLj0K2j5j3
6531@J2pJ2%j8RMk%j6KOKomkRj0RjKkjOk1J4mJ0j8QJ5JomORjj3J3j3J1NnlJMj0
$$ y = [6, 13, 9, -1, 14, 11, 6, 13, 20, 18, 16, 19, 8, 15, 5, 11, 8, 11, 3, 5, -1, 3, -4, -14, -1, -3, -9, -14, -4, -11, 4, -9, -4, -10, -2, -4, -2, -8, -2, -1, 4, 11, 3, 6, 1, 10, -2, 7, 9, 2, 14, 12, 11, -1, 20, 12, 3, 7, 3, 10, 3, 9, 0, 14, 5, -2, 0, 12, -1, 3, -5, 5, 1, -4, 0, -6, 0, -10, 3, -10, -12, 6, -11, -15, -1, -1, -3, 6, 1, 12, 13, 8, 10, 12, 12, 5, 16, -1, 11, 4, 5, 19, 5, 7, 10, 11, 11, 15, 13, 0, 12, -2, -2, 9, 3, -11, -7, 1, 2, 4, -12, 3, -8, -1, -3, -15, -8, -12, 7, 0, -15, 0, -8, -5, 3, 0, 7, 1, -2, 6, 3, 8, 9, 3, 0, 3, 7, 13, 1, 16, 3, 12, 14, 19, 5, 2, 4, 1, 7, 2, 0, -10, -4, 3, -11, -5, -3, -6, -12, -7, -10, -1, -4, 8, 6, 9, 1, -6, -4, -7, -1, -1, -3, -4, 7, 5, -2, 9, 9, 8, 3, 10, 5, -1, 15, 13, 4, 13, 14, 8, 9, 11, 15, 2, 13, 12, 4, 18, 2, 2, -6, 5, -12, -3, -12, -15, -4, 2, 3, 0, -2, -10, 3, 10, 8, 6, 4, -3, 5, 6, 7, 7, 0, 14, 10, 11, 4, 15, 7, 6, 8, 6, 4, 13, 13, 10, 15, 8, 17, 8, 14, 21, 4, 10, 10, 7, 9, 6, -7, -3, -1, 0, 4, 1, 1, -8, -12, -2, 2, -3, 2, -6, -1, 4, -1, 9, -7, -11, 3, 12, 10, 10, 16, 4, 21, 8, 7, 7, -4, 3, -6, 10, 7, 5, 1, 11, 8, 15, -2, 4, 12, -2, 19, 8, 11, 1, -6, 8, 1, 1, 2, -2, 4, 9, -4, -10, -2, -8, -2, 2, -7, -3, -6, 6, 8, 6, 10, 11, 17, 13, 8, 12, 12, 20, 20, 12, 13, 16, 6, 28, 13, 0, 12, 5, 17, 17, -1, 8, 12, 10, 10, -6, -4, 2, 4, -2, -6, -8, 1, -9, 0, -1, 1, -1, -2, 4, -17, -3, -7, 3, -15, -7, 8, 9, 3, -1, 5, 14, 13, 0, 13, 0, 11, 16, 11, 8, 9, 13, 3]
6578CJ2kmjNm%j%rJ4j1Jj3J1jn%KQqJJ0j4lOJj0J0LJ3%j3lRjmKMlMoMKrJ2nLj
6627IjOmN%ojrLMj1%Plj5J7j1PjJ0j4QoQqLnJ2jkpJ6rJ%jP%joMpJ0NkjOlJ0j8
6677ENKMj5J1Lj2OoMrrJ3oj2K0j0LK%Mlj0J4mrKpJ7oPjkJJ2j5PoJ3%njoJJRlJ
6725A0OklkpoRoPj0RknpQONmk3J1l%jNJ1olmOJ0oJMnPKJPRKk3J2rJ1onjmjlMJ
6777GNj4lnK2j5KJ4j5oOoQkkJJ0o%nO%mMlQmOJLJ%KrPJ%pjOmO%%pKj2J2roQoR
6830Fnj3MLlmRnJ0%j%KpLMkO%lj3K0qQmpjJ0NpJ0j0KklPknJlKRmrJ3j2J1qMqn
6881eOqjMkLnJ2joJQjl%jpJ7rJJ1j3J1mOjk1J6Om%mO%Lqj2J0MkokKNMopJOklm
6933e%j0K0MMqqj1J5nMJ0%lkJ3rR%joKJJmNmnJlRj1PJKroMJ1prQkoNjplJ4kj2
$$ y = [3, 15, 13, 9, 8, 13, 9, 9, 8, 8, -1, 13, 2, 3, -10, 1, 0, -5, -5, -3, 5, -3, -2, 8, -6, -9, -3, -2, -12, -2, 1, 14, 14, 1, -2, 7, 6, 2, 4, 8, 5, 9, 3, 7, 9, 0, 12, 7, 10, 9, 8, 14, 10, 15, 15, 9, 8, -1, 2, 6, -5, -5, 2, -1, -16, 1, -10, -3, -4, 6, -8, 0, -6, 2, -6, -3, -8, 4, 3, 1, -6, 10, 1, 2, 2, 1, 8, 8, 7, 1, 5, -2, 8, 13, 11, 10, 16, 13, 23, 5, 10, 12, 16, 1, 12, 15, 3, 9, 3, 7, -2, -11, 2, -4, -16, 4, -6, -3, -1, -1, 3, 0, -10, 4, 0, -9, -7, -14, 3, -3, 4, 3, 1, 2, 14, -1, 6, 0, 13, 13, 8, 7, 1, 2, 3, 12, 9, 10, 16, 14, 11, 9, 2, -4, 5, -1, 6, -4, 5, 3, -2, -9, -1, 5, 10, 6, -17, -6, -9, -9, -10, -5, 6, 0, -3, -7, -1, 9, 3, 4, 8, 3, 10, 12, 13, 20, 29, 31, 8, 20, 11, 22, 16, 11, 10, 6, 5, 2, 6, 7, 12, -2, -5, -10, 12, -3, -1, 13, -2, -8, -2, -8, 0, -2, -4, -3, 7, 1, 1, -4, 2, 2, -2, 2, -1, 7, 3, 9, 10, 13, 14, 14, 16, 7, 14, 15, 15, 8, 7, 13, 9, 15, 15, 15, 8, 10, -2, 10, 1, -5, 3, -3, 6, 1, -12, -8, -5, -8, -12, -3, -8, 2, 2, 1, 1, 3, -4, -1, 3, 1, 7, 7, 4, -9, 11, 3, 11, 7, 0, -1, 9, 14, 7, 17, 7, 9, 7, 4, 11, 9, 4, 5, 2, 4, 13, 9, 0, 13, 1, 12, 4, 8, 0, -5, 1, -7, -8, -4, -6, -3, -8, 4, 3, -3, -2, 6, 5, 2, 2, 1, -6, 11, 2, 3, 14, 1, 12, 8, 14, 13, -8, 8, 14, 10, 10, 6, 12, 12, 15, 7, -5, 5, 9, 7, 1, -1, 1, 6, 10, 4, -3, -2, 4, 2, -1, -5, -5, -15, 5, 9, 13, 5, -3, -14, 1, -4, 0, 10, 10, 7, 5, 18, 9, 18, 18, 17, 11, 13, 14, 15, 11, 16, 12, 7, 8, 5, 14, 3, 10, 11, 13, 4, -2, 2, 13, 6, -3, 5, 3, -3, 2, 1, -6, -9, 5, 3, -9]
6984iO%KkJ1qKmKlOLOqmJ3LljKmOqLnMkno%JLJlJ2pkKqMokJ0j3K8qj7LlOLPqr
7038iJ3loJ1nJ1qNMoJKNj0QnNrPPqkPnmkJjpLJj0%%KkLLjLkNMj%Rj2jQj1ORj0
7091CPpJNJ%%pj%POrmJ0njKRj6RnlrOJ2j8j%qQrpJ5QrRPmlj1J7j3J4LKj0J2jl
7141I%NjJ2j9QnOLq%oNpJ3pmJ4pnoQnjJOk3J1nKLj0J0pJkPJ3%j1JJ0qlJ1oNNj1
7190BN%O%NnqJ2qJ1rmnOqJKlmJJ5j1lLmKjkjkLnkJ6kJj2J0LKj7RMLjoJ5qPpR%
7242A5jKmKOqpJ%Oj1Qj0OknlRNqPj2LqNLJ2qpJ3j1RoOoPj3LNMKkjkRJ2rlnRj0
7293GJJ0j2PnQj6J3jqOj4NkkkMj0JRpPmmJ3n%JlJ0pJ0JmjRmnKNj4OmNKRjpRnJ
7344A4Pk0ONj4K0j5J1qnJjkQqqJ0rjMo%OQLnj1J5KllJ7j3Nj0J4pKpRKj1RNknp
$$ y = [-9, -3, -3, -1, -3, 8, 0, 2, -2, 0, -3, 3, 6, 12, 4, 0, 13, 16, 13, 12, 14, 10, 16, 8, 11, 6, 10, 8, 3, -3, -3, -2, 1, 2, -1, 11, 4, 2, 4, -4, 0, -6, -8, 2, -11, 17, 9, -8, -5, -8, -2, 1, 8, 0, -9, 4, 1, -5, 6, 1, 12, 4, 9, 13, 7, 8, 10, 15, 5, 13, 8, 13, 4, 11, 18, 10, 8, 15, 10, 6, 4, 5, 4, -3, 0, 1, -9, -9, -9, -7, -9, -6, -3, -4, -1, -3, 2, 6, 5, 5, 14, 2, 1, 9, -2, 4, 13, 3, 10, 3, 4, 9, 10, 10, 10, 3, 2, 2, 9, 15, 6, 2, 12, 7, 6, 8, 17, 1, 10, 5, 2, -7, -1, 11, -7, -8, -8, -16, -8, -17, -24, -9, -1, -10, -1, 6, 2, -1, -12, 5, -8, 6, 9, 11, 1, 13, 12, 9, 9, 14, 13, 25, 6, 14, 9, 15, 18, 10, 10, 4, 9, 2, 15, 8, 4, 18, 11, 6, 0, 8, 3, 2, 3, 9, -14, -3, -8, -6, -3, -13, -3, -10, -9, -11, -4, 9, 9, -2, -1, 9, 1, -2, 9, 3, 8, 13, 2, 7, 7, 13, 13, 18, 13, 5, 17, 9, 20, 11, 7, 2, 8, 0, 1, 3, 0, -4, -3, 12, 1, -2, 1, -3, -1, -2, -4, -5, -7, -4, -9, -11, 5, 3, 4, -8, 2, 5, 7, -10, -1, 3, 6, 5, -1, 14, 6, 13, 6, 15, 15, 14, 16, 12, 14, 20, 12, 5, 6, 6, 12, 1, 9, -1, 5, 3, -2, -5, 4, 9, 1, 8, -4, -1, -9, -4, -1, 11, 3, -4, 9, -2, 7, 1, 7, 1, 8, -5, -2, 3, 7, 9, 7, 6, 4, 13, 25, 16, 13, 8, 17, 7, 8, 18, 6, 13, 8, 16, 0, 13, 12, 4, 10, -4, 1, -1, -3, -5, -1, -11, -10, -1, -8, -1, -5, -9, 4, -1, -1, 0, -3, 7, 0, 10, 11, 7, 6, 15, 11, 6, 8, 13, -1, 5, 1, 6, 8, 17, 16, 9, 18, 13, 14, 21, 1, 7, 12, -2, 18, 3, 14, 6, 1, 2, 1, -1, 7, -1, -9, 1, -8, -9, -5, -11, -11, -5, 3, 6, 1, -10, 5, 7, 4, 1, 18, 5, 10, 0, 14, 7, 9, 2, 11, 13, 2, 11, 16, 14, 9, 2]
7391BJ3j6MMqjOMj4JJ1Rk1LmJ2j5pJ7j4%J4j0Nj1NMPoLnJ3mPOj0J1opMlNJnjq
7437eJ7j1Oj3MJoNOoMOk0K2j0lRkrrRmJOpJ0j0RMplJ4LPj9rRNOmL%PkmRppJMn
7488EQj6J1j3PJnLjj0PLnPqpQNL%p%mOljJNQkkj2OJ1nqQ%mJ8j9J2%jpPonLLRk0
7540fPJjoNJ0j4LnNKn%jlOkMJKLk%J5j0NrnJOoJ5JMj2LJoRj1mOqJ8j7J2Kk0J2
7589FOk0OPj2J5j3klnJ1JQlLn%KPqNJL%j1K3oJpJ1l%kkjJjLjknpJ9j6Mj6J8no
7638a%JNrMj0J1mLj4RRj2Pn%MRr%J0pJ1jnlJ7pL%p%RplJ6j2oLLLKj1Onj1J3qj0
7687iNOJJrLpJ6j5RlnLMLpJ1j1%J1mJ1knLMqJ2j6QNkRkjjjlLrJ1j0pOplRj3KJ3
7737Ij1PkjqJ%OoKrJ1mKJ1jqJ4mKpjnQJLjkjlJ6j3LJ8j1j1Rk%kk0K6j1j1RPqj
$$ y = [2, 15, -1, 3, 7, -1, -2, 4, 8, -6, -5, 6, 15, -6, -3, -7, 5, -10, -17, 0, -14, -14, 0, -10, -5, -16, -11, -7, 0, -6, -3, -8, 5, 1, 8, 14, 4, 15, 9, 2, 6, 3, 8, 9, 4, 3, -5, 12, 1, 7, -6, -2, -1, -7, -2, 4, -2, 2, 8, -12, 10, 0, -3, 6, 4, -5, -14, -5, -9, -8, -2, -9, 1, -9, 0, 4, -3, -6, 8, 11, 18, -1, -10, -1, 4, 10, 6, 9, 9, 16, 14, 10, 19, 12, 5, 6, 10, 5, 13, -3, 8, -5, 2, 3, -2, 1, 0, -10, -3, 0, -5, 2, -6, -13, -5, 0, 3, 3, -4, -4, -8, -2, -5, -6, -5, 0, 8, 6, 4, -8, -2, 9, 4, -4, 4, 4, 0, 18, -1, 11, 11, 10, 3, 10, 4, -1, 2, 5, 14, -6, 1, 2, 1, -5, 0, 10, -4, -1, -6, -1, 1, -4, -4, -5, -8, -2, -4, 0, 1, 3, 6, 4, 4, 19, 9, 14, 5, 0, 1, 7, 1, 16, 17, 21, 9, 12, 13, 7, 16, 5, 1, 7, -1, 17, 0, 12, 14, -6, 6, 12, -8, -2, 5, -7, 8, -5, -7, -10, -15, -4, -3, 5, 2, 5, 0, 0, 2, 9, 1, 6, 7, 10, 10, -1, 22, 16, 17, 10, 21, 18, 18, 16, 14, 13, 14, 13, 16, 15, 13, 8, 1, 20, 4, 8, -8, 10, 5, -1, -1, 0, 5, -4, 0, -10, 1, -3, 0, -14, -5, 4, -8, -1, -6, -6, -2, 7, -2, -2, 8, 1, 12, 11, 6, 3, 20, 13, 16, 16, 9, 9, 18, 11, 8, 24, 12, 6, 9, 12, 15, 17, 6, 12, 7, -4, 9, 1, -9, -4, 2, 3, 4, -5, -2, -9, 7, -8, 1, -2, -7, -4, 0, 3, -4, 7, -4, -4, 7, 3, 14, 12, 7, 10, 14, 6, 18, 2, 10, 15, 13, 22, 20, 19, 18, 17, 14, 17, 8, 19, 9, 2, 8, 1, -2, 7, -6, -4, 9, -2, 5, 3, 2, -6, -5, -5, 1, -5, -3, -12, -1, -5, -3, 8, 7, -1, 13, 9, 11, 4, 3, -2, 6, 7, 10, 9, 7, 6, 3, 19, 6, 9, 27, 16, 5, 14, 12, 12, 10, -10, 16, 5, -6, 3, 10, 2, 1]
7785AJmqLJ4rjlPj1J3JNkJRj3LklN%%JMKpJNLMpkKmOmjPj0kMqLj4kRjKpJ4j4N
7838dOp%NroRO%qlJ0OjNQj1%J5j8QkLooJ1J0k0OJ%KkpMkJ1k1K0k3RJ3j1JMj0N
7885ANj0N%J3k2OlM%Oj2NNNnLNMj5PJNoO%%KKMlrnQllj6KjJ0j6jK2j6QMj0%Jm
7935a1RM%o%MLPj8J1jONp%Ojj0KjOjJ%%O%nO%%lnkoNMj3LrJkQOpM%%oOpKJ3Lj5
7990eJ3qkJ3%jnNKqKjj1J1NoOj2J2qNjPq%oNqJ0j5J0jnPj5lJ0kJMmMpMmNj3J5
8038cOO%jLqpJ0LkkmlKPMqlJ1oQkomoQlRj3Pjj7KJ2%nl%Pj7J2J8j8mJ2lqPJ4n
8088FjMqNmNMjJnkJ2lj2OOrQj4OOj2MLLj0LLj4K%J4j7LJORj5NjlPrJ5j0QMj4j
8137f%LRJkKpMmOoRmNo%lJ1m%pNlLNj8Qr%J%nJ1j0kLKPMpOrOkP%mJ0j5J8lLjr
$$ y = [1, 2, -2, -10, -7, 7, -2, -3, -6, 1, -10, 3, 4, 9, 7, 8, 17, 4, 7, 5, 2, 7, 7, 7, 8, 12, 14, 7, 8, 13, 16, 20, 13, 11, 13, 9, 15, 11, 10, 17, 7, 5, 9, 1, 4, -10, -12, -3, -4, -2, -9, 5, -9, -4, 2, -5, -5, 0, -9, -15, -6, 0, 0, -8, -11, -1, 5, 4, 9, 17, 6, 6, 21, 3, 11, 9, 12, 6, 0, 11, 21, 1, 7, 8, 8, 10, 8, 1, 5, 3, 14, -7, 13, -10, -1, 12, 1, 2, 6, -4, 1, 6, -4, 1, 1, 14, -8, -2, -5, -1, -1, 5, -7, -2, 3, 8, 3, 6, 11, 15, 0, 7, 8, 13, 7, 13, 13, 13, 15, 17, 21, 18, 9, 4, 12, 9, 6, -10, -8, -9, 1, -15, -16, 6, -10, -2, 2, -8, -8, -7, -11, -2, 2, 2, -4, -4, 0, 3, 10, -8, 3, 2, 8, 13, 6, 6, 12, 11, 1, 3, 2, 8, 7, 8, 8, 8, 14, 14, 9, 15, 15, 15, 12, 7, 5, -1, 4, 8, -5, -2, -11, -10, -12, -4, 2, -5, -1, -1, -1, -7, -1, -8, -6, 7, 10, -5, 8, 0, -2, 11, 11, 10, 5, 10, 12, 4, 6, 5, -6, 5, 10, 4, 10, -2, 10, 2, 7, 6, 13, 5, 5, -1, 4, -4, 6, -9, 1, 0, -5, 2, -13, -16, -6, -8, -7, -3, -7, -3, -10, -6, -10, -5, -18, -3, 3, 9, 9, 8, 11, 3, -4, 6, 9, 7, 5, 1, -2, 0, 7, 11, 3, 0, 11, 5, 13, 11, 5, 1, -5, 3, 0, 9, -4, 3, 2, -15, -13, -1, -1, -6, -9, -9, -2, -19, -7, 11, -7, -11, 1, -2, -10, -3, 11, 6, 5, 9, 1, 6, 2, 7, 11, 10, 11, 6, 4, 16, 13, 1, 7, 13, 4, 12, -2, 4, 10, -2, 2, 5, 8, -2, 1, 4, -10, -8, -8, 6, -11, -8, -7, -1, 8, -7, -2, -3, -6, 1, -8, 7, -3, 5, 9, -5, -6, -6, -3, 6, 7, 5, 7, 0, 4, 0, 6, 0, 9, 5, 10, 4, 4, 1, 12, 8, 8, 1, 6, 3, 6, 11, -7, 1, -8, -8, -7, -7, -12, -1, -11, -13, -10, -8, -1, 3, -4, 2, -7, -1, -3, 4, 4, 0, 10, -5, 13, 10, 13, 12, 3]
8191C
$$ Imaginary data points
##PAGE= N=2
##DATA TABLE= (X++(I..I)), XYDATA
0@%%%%%%%%%%%%%%%%%qJ6j6J6j6J6k4L2l2M0m8M8n6O8p6Q8j01J12j25J41j59J80
39I6k00K22k48K74l04L37l73M12m53M98n52O08o68P39q16Q99r93J102j226J366
59G20j530J726j963K257k629L125l820M857o613J0318l0885M8893M1125j10504
73d4923p122R4295J948q9252J4651O8312j5055n2787J7630L1521q109j7504j144
86g539M026J7184l36l1861j174M5575o786n3979J6166N7977k8456n4032L8470
99d765M5689m6339l2223M9446J8648m6549k645L9707j0251k9106J9755J4887k5108
112h854m66K5399j3670k1893K4090J4493l1588o262L4183k589l3454J0250K9953
125A9592j5152k3005J8991J5712j8969p125J6314o48j0494O949K806j0347N648
$$ y = [0, 0, 0, 0, 0, 0, 0, 0, 0, 0, 0, 0, 0, 0, 0, 0, 0, 0, -8, 8, -8, 8, -8, 8, -16, 16, -16, 24, -24, 24, -32, 36, -40, 48, -53, 59, -66, 75, -84, 96, -104, 118, -130, 144, -160, 177, -196, 216, -237, 261, -291, 317, -351, 388, -428, 471, -522, 580, -646, 720, -810, 916, -1047, 1210, -1419, 1706, -2114, 2743, -3870, 6448, -24437, 24456, 65581, -44923, -52045, 42250, 44198, -45054, -30403, 37909, 22854, -29933, -12303, 19218, 11109, -6395, -7539, -3513, 13671, 13335, -18526, -19700, 25875, 19089, -34890, -18724, 39253, 10797, -43235, -4765, 40924, -5415, -37638, 11808, 30456, -16093, -18738, 20969, 10718, -18388, 1367, 16254, -8854, -9320, 16079, 2409, -19484, 4606, 19099, -12489, -18751, 15432, 12843, -20611, -10361, 19592, 4440, -18565, 426, 16138, -2831, -9956, 6358, 5710, -4784, 2165, 4971, -5376, 272]
138B72R906j4905p961K1187K557k5977L880K8223j0940k7837J8065K5153k4024
151b401j9408K9264J2481l1181l421L0970m863k7113J2062K0499j7403j3157J8903
164E232M491j8228K848J4240r132q835J2512J587j3361O084J1799j1903o393J6886
178G827J45j8329P206J7136j3583j3114J8489P248k1386r88K1075o184j9256J1657
192b057J4333j6390q226J8454J188j7485O101J4356j1331q648J4852K714j4945
205g084L737J3637q293j0469J1112O192j2888k580J2258j549j0856M425P610o722
219a470l883P182l76n996M596L895p044o1R023l151q939O647Q153r311o567J1024
235C722M208j2145j961J1742j049j1107K742Q679m330o072M794L625l969r34K993
$$ y = [272, 10178, -4727, -12688, 8499, 11056, -14921, -11041, 17182, 6242, -21595, -3530, 21623, -2401, -21809, 7455, 19936, -11245, -14666, 16304, 11441, -15672, -3610, 16889, -514, -13671, 5232, 9723, -8505, -5657, 8583, -549, -9384, 3128, 4715, -8646, -2562, 9237, -2666, -9059, 7827, 7972, -10357, -3151, 13985, 402, -12712, 5777, 13025, -8361, -9349, 11726, 5542, -13714, -2057, 12276, -4114, -12340, 6114, 7302, -10183, -4082, 10274, -1057, -9705, 5147, 7861, -7084, -3347, 10290, 1997, -8472, 2640, 8832, -4056, -6636, 5622, 4073, -6783, -2358, 5252, -1470, -5353, 1829, 1453, -4543, 53, 3948, -3096, -3157, 5866, 2715, -6224, 423, 8576, -735, -7302, 3722, 7930, -4215, -6176, 5566, 4517, -6590, -3848, 4831, 501, -5571, -777, 2848, -1121, -2055, 938]
250I38o35j022K271n40k782K826L211m821k882O543J421q256q8Q370k158q115
266e719L478O649m399n041M371L509l660j975L081J397j549j41O59k41R12M91
282A822k619l75L851p01n043J666M964l164m853L643L817m062k924L990K349l325
298i64j401L056J247k063p06J426Q55l60j053l91J574O53k561j115K735N86l320
315a802o74L220N84l170o28L285Q63l159o04L357Q23k714n23K392J000j768j653
332a171J383K143j718k839J756K651k201k655J848K131j581k047J105K280m82
347F03k186O27K573k53k222K89K104J38j921o34J886R44k246j470K172J251k550
364h95j507K305J485k218j607K281J873k100j679K265J804j757j387J520J504
$$ y = [938, 303, -719, 1552, 1012, -1770, 1056, 4267, -554, -3436, 3107, 4528, -3728, -3816, 4554, 2396, -5719, -2241, 4408, 9, -5032, -661, 2848, -812, -2787, 294, 1691, 142, 1, 660, 419, 1331, 1822, -797, -1172, 2679, 1978, -3065, -1399, 3565, 401, -4452, -809, 3008, -1054, -3978, 12, 2361, -964, -2365, 691, 1938, -125, -831, 595, 1450, 1090, 37, -354, 1220, 1873, -688, -1803, 932, 1518, -1802, -2476, 744, 1328, -1842, -2470, 815, 1678, -1481, -2085, 1272, 2095, -619, -1142, 1250, 2250, 482, -1171, 212, 2355, 637, -2202, -446, 2205, 4, -2651, -803, 1328, -253, -2300, -1195, 1085, 603, -1583, -956, 1617, 1364, -858, -569, 1535, 1673, -248, -882, 1004, 1948, -298, -1768, 404, 1655, -895, -2402, -97, 1388, -830, -2437, -156, 1717, -383, -2062, 203, 2007, 250, -1137, 383, 1887]
379A887q78j622K78J704j54k100m33J893N53k059j231K046J659k429j965L023
395A72K100l229j448L591J147l009n33K552M32j893n06J267N01r70p58K19N70
412B05J80j026j081J418J658k218j791L299J776l860j021M463N77m301K10M187
428B675o41l729R70K999j429k399J272J128j255k11M44q40N07J433j681j527K943
445F59J516l680p95M618L79m926O28N123j623m903K604L964l618k809L769R65
461A871l671M67K535j785j206K477k55k458J894K409l006j621M337Q45n113N36
477a744N605k057n447L547M356m942l025N239R05n119P94L993k330k419L351O01
493A308l608J580L624l401k606N337J361o431O13O952k725o675M464N306o003
$$ y = [1887, 1009, -613, -335, 1369, 1215, -885, -1318, 575, 1128, -931, -2162, -116, 1543, -886, -2851, 172, 2272, -957, -2405, 1186, 2333, -676, -1209, 1343, 1775, -118, -624, 643, 1144, 174, -584, -365, 205, 385, -641, -1722, -304, 1354, -864, -2655, 644, 2420, -1440, -2461, 2002, 2579, -1722, -1512, 2675, 2034, -1695, -725, 2274, 845, -1554, -282, 846, -409, -620, -176, -1016, -509, 924, -757, -2284, 659, 2175, -1505, -2300, 2318, 2697, -2229, -1601, 3522, 1899, -3004, -400, 3564, -54, -2863, 906, 1871, -1800, -1333, 1202, -583, -1789, 688, 433, -2025, -131, 2278, -728, -2349, 1988, 2833, -2280, -1744, 3861, 1804, -3643, -96, 4260, -682, -3707, 1532, 2437, -2682, -1888, 2105, -225, -2644, 707, 1308, -2300, -720, 2904, -497, -3103, 2234, 3595, -2836, -2223, 4729, 2004, -4671, -207, 5099, -904]
508i04l711O475J527o518L94N606k286m200L775K294m408L01M609k581l403M810
524A780J642o044Q25O299l350n651N281L947o889k122P426l20p558K503O697m618
540a52n077O490K938p330qP494k678o255N243M407o723j843P232q14o934K938
556a072N469m842l767N742J294o083J140N307l463l547N407J162o144J900O086
571D589m490m649O897K675q362j30Q797k714q463N177O906p512m800Q754J777
586D452r257J231Q475l987o497O155M074o986j061P030j390n847L684M094n132
601i62j891N747p31n644L125M256n478k297O680n86o990L498O128o046m114P978
617B673J655q637J347Q652l885p454O263N656p966l300Q707M34q675K128P271
$$ y = [-904, -4615, 1860, 3387, -3131, -2737, 2869, 583, -3617, 158, 2452, -1956, -1655, 2954, 373, -3030, 1780, 3422, -2622, -1797, 4502, 1152, -4499, 782, 4729, -2160, -4282, 3144, 2824, -4734, -2231, 4466, -152, -5229, 1261, 4199, -3131, -3139, 4355, 1677, -4578, 665, 5072, -1651, -3494, 3738, 2924, -4010, -1072, 4397, -445, -4212, 1530, 2824, -3259, -2119, 3188, -275, -3822, 1585, 2747, -3397, -1497, 4589, 99, -4550, 2347, 5022, -3340, -3470, 5327, 2613, -5850, -673, 6233, -1279, -6079, 2675, 4452, -4805, -3574, 4901, 914, -5583, 572, 4646, -2340, -3401, 3629, 2239, -3608, 76, 4170, -962, -2853, 2894, 2163, -3481, -356, 3900, -1578, -3875, 2805, 2219, -4771, -1273, 4855, -1191, -5305, 2673, 4328, -4309, -2962, 5690, 1805, -5649, 614, 6270, -1696, -4996, 3711, 4145, -4530, -2402, 4869]
632D869m568n321N894K584o340J78N779k579m245M608K324n507K95N848k609n049
648c839M819L438o386j181O947j562o652L887M968n961k906O957L10p154K217
663b098O539m366n072O278L335p228q97P679j427p045L739N576n442l533O124
678B162R63o126J145M902l046l319M054J276m423P99M146k628k981M380J557n239
694b378O10N591k659m951M588L565n932j800O371m29o279K173N248l876l884M891
710H49K015n394N8N287j882m228L651K866m524q86M834q87m258K437L125l562
726d99j834L892J66l991J163L350k589k473L555J126m099N81M121k044l233L489
742F81K085m085l88M246j059l732K272K782l261j810L639M39l892O73L468j922
$$ y = [4869, 301, -5020, 874, 3458, -2882, -2704, 3075, 496, -3749, 859, 3183, -2324, -2029, 3819, 1210, -3839, 980, 4418, -1968, -3149, 3798, 2236, -4416, -529, 4439, -1522, -4428, 2529, 2839, -4315, -2098, 4441, 75, -4997, 1281, 4616, -2612, -3509, 4170, 2743, -4302, -563, 5013, -429, -3962, 2162, 3125, -3001, -1856, 3046, 0, -3319, 735, 2011, -2412, -1613, 2533, -95, -3076, 1304, 2861, -2378, -1768, 3823, 1164, -3787, 801, 4366, -1566, -3366, 3005, 2576, -3703, -1530, 3718, -158, -4042, 849, 2864, -2530, -2472, 2815, 933, -3295, 356, 3222, -1302, -2188, 2646, 1759, -2499, -62, 3063, -499, -2333, 1559, 1725, -2266, -1103, 2247, -342, -2815, 740, 1866, -2233, -1652, 2469, 425, -2808, 681, 2766, -1319, -1707, 2539, 1480, -2252, 20, 2802, -459, -2269, 1370, 1809, -2083, -1410, 2058, 136]
758A36k814K785J714l190l22L210p79k470J884J654k329m52K537n91k339J550
774A84J713k437j059K850r4l145J050K749k086k122K770J242k936j86K879m80
790H92k309J204J851j430j108J632M23j631K72J250j116p87J509j71j840R22J574
807A137j725j120K172N77k209R3K203l92j808Q35J601j014j079J187N41j254J7
824b38R55p17o22R55q6j205N34J031r99p66J263N49j281j46J423oj201M06J122
843I71n89p35P26K92p18N4L47m73j28M48l25n40N04M20o88l88Q82M06r42k10J247
864E61J56j168J99J141l48q49M08M56l19k92l3M5J50j65m22P0M21n4m71LO15J49
886B53o46MQ86pp53K50O83k53m77J96K55j69k56q2J00L4j80j89N8J79j8k80N0
$$ y = [136, -2678, 107, 1821, -1369, -1691, 1519, 740, -1730, 154, 1808, -521, -973, 1564, 973, -1366, 184, 1897, -540, -1599, 1251, 1157, -1988, -938, 1811, -275, -2397, 373, 1615, -1321, -1507, 1372, 892, -1417, -213, 1638, 208, -900, 732, 1155, -476, -204, 1046, -70, -857, 652, 481, -1359, -437, 1137, -588, -1708, 464, 1041, -1168, -1075, 1128, 736, -1072, -237, 1364, 350, -729, 458, 999, -255, -238, 717, 0, -622, 333, 247, -958, -424, 607, -392, -1158, 105, 654, -627, -773, 650, 644, -557, -151, 971, 382, -353, 373, 665, -53, 1, 348, -125, -253, 195, -130, -670, -166, 254, -434, -822, 60, 466, -476, -686, 561, 717, -451, -252, 889, 541, -308, 100, 556, 237, -55, -88, -43, 107, -58, -480, -410, 11, -43, -514, -511, 104, 253, -393, -389, 497, 490, -263, -13, 670, 417, -60, 136, 391, 222, -34, -116, -16, 18, -162, -351, -293, -114, -132, -412, -362]
909c62M82m3m56K79N72k95l30L86K59k79j77J39J09j33k58j0J58j15j83k7J2J27
931a45K7k94J18N17j73m20M66M07m41j07M40Nk94N1J12j24j33L1j4k34m0K35j86
954a96l30L46K94n07k5O41j22m33M22L62m04p6M66p0m51J92L65m27l86M90J33
975B84p51J8P07l71o16O12L95o97k6P66j12n54M17N31m61l15N84J66p31R2O76
996F14n32o39P74J87j087J83J007o77q25R95N29j067j09J161p7r88M50R26o25
1015B00o31Q90K78j082J64R96q00q26J135K52j447J85J405p25j189J123R03j288
1033d57m28J519M2j363N25J275r60q38J344K28j511L60J287j035j019J359L92
1050G20j629Q5J600o46j442J173J182j511o45J907J19j861O33J701j230j105J617
$$ y = [-362, 120, 77, -379, -100, 472, 177, -153, 233, 492, 213, 36, 175, 284, 151, -107, -117, 41, -74, -257, -284, -272, -145, -118, -412, -294, 223, 50, -370, 96, 503, 62, -45, 395, 400, 106, 157, 269, 145, 12, 43, 29, -205, -245, -10, -196, -526, -180, 114, -393, -418, 223, 101, -332, 90, 452, 48, -28, 438, 368, -83, 109, 474, 47, -339, 151, 284, -467, -449, 258, -113, -729, -117, 278, -419, -445, 321, 209, -345, 72, 603, 142, -173, 411, 577, -154, -62, 614, 82, -557, 217, 404, -683, -500, 507, -170, -995, 0, 529, -538, -647, 514, 437, -551, -101, 825, 200, -431, 459, 737, -345, -181, 815, 15, -811, 324, 576, -871, -686, 719, -6, -1195, -72, 831, -457, -885, 634, 676, -687, -162, 1113, 153, -685, 659, 887, -624, -264, 1023, -12, -1031, 328, 720, -909, -824, 776, 130, -1312, -139, 1043, -468, -1113, 794, 913, -948, -315, 1386, 156, -949, 668]
1067F68L61j765L60J452j115j095J505M18j836J50J917q27j777J512J511j996
1083e57q43K445J63k379P27K095j383j449J808N83j971J65J704r91j378J476O88
1100I03j920mK053q20j855J655J448k191n95K591j97k454J098K114j749j466K111
1117G22P07k342QK162q83j870J495J163k047l21K239o56j974J623J465k204n31
1134a244K570k76k436J142K101j793j518K194P34k495K0K366r88k066J700J286
1150A297k275l61K442o30k126J585J590k119o59K467j49k352J031K046j761j483
1166a457K267O33k587J88K435j179k059J845J253k293l43K365n33k019J372J554
1182A442j880p19K271j6k307R03K086j696j578K239P22k598J05K395j078j974
$$ y = [668, 1029, -736, -376, 1076, -39, -1134, 371, 789, -1047, -897, 1020, 193, -1584, -72, 1439, -557, -1400, 1045, 1208, -1171, -444, 1651, 268, -1181, 627, 1210, -761, -596, 1108, 117, -1261, 215, 903, -1017, -1021, 1032, 212, -1643, 12, 1460, -731, -1326, 1265, 1068, -1386, -288, 1826, 77, -1389, 722, 1429, -913, -905, 1257, 374, -1496, -1, 1162, -885, -1206, 1033, 377, -1597, 26, 1491, -713, -1244, 1326, 1050, -1386, -244, 1857, 64, -1454, 740, 1474, -1021, -1001, 1365, 377, -1689, 11, 1297, -978, -1339, 1103, 473, -1653, -68, 1522, -597, -1256, 1211, 1062, -1290, -259, 1787, 26, -1457, 810, 1443, -1144, -956, 1479, 300, -1759, 86, 1339, -954, -1297, 1068, 535, -1484, -112, 1442, -438, -1157, 1114, 1098, -1209, -306, 1780, 84, -1494, 745, 1467, -1131, -1026, 1369, 291, -1683]
1198a683J681J189k037l42K108m38j814J225J442j706p28K148J0k206Q69J977
1214A695j665j465K192N88k497K08K290j083j910J658J228j997m87K094j99j857
1230a207R49J541j441q34J849J10j872O95J606j421j116J808L69k066K53J882
1246A105r42j608J420J096j754m70J929j65j757R26J467j422p88J793J06j780
1262h44N86J516j177j114J455N00j652j6J527n44j375R95R86j345m34J607j44
1279E27j467Q35J205j262o18J555L7j536N07J294j007r91J259M72j477j04J449
1296F78m28j327Q45R93j140m81J313L5j148N18R21q07m68J025O0j038L27R17p30
1315F5p88R72M20j234j04J246l66j140P34Q53r54l80J066K3q89L68P60n79m56
$$ y = [-1683, -2, 1187, -850, -1192, 916, 478, -1336, -111, 1331, -375, -1103, 1045, 1055, -1151, -282, 1695, 30, -1435, 757, 1345, -1152, -944, 1346, 263, -1647, 11, 1239, -758, -1245, 849, 650, -1207, -258, 1283, -158, -992, 857, 967, -905, -210, 1396, -25, -1141, 667, 1036, -1030, -777, 1105, 163, -1445, -25, 1071, -683, -1153, 776, 611, -1146, -220, 1247, -175, -963, 830, 936, -844, -258, 1258, 81, -1033, 422, 922, -730, -746, 781, 237, -1138, -143, 843, -502, -936, 671, 527, -940, -105, 1100, -162, -780, 775, 812, -724, -217, 1077, 70, -921, 338, 810, -667, -771, 678, 250, -1077, -232, 761, -379, -860, 453, 488, -660, -142, 779, -28, -496, 529, 589, -449, -122, 795, 65, -723, 249, 669, -565, -669, 577, 211, -929, -195, 658, -296, -676, 390, 413, -476, -108, 652, 73, -383]
1334c83P33K06q18O4P87m32p52O59M50r34j49R27k67q20N87N88p10k49Q03M5o71
1355c36K41O09l58m11N07K21o28lN91l17n52M96K76o96m7O68k01n95L90M79m51
1376a17k79N63J80n17O3N35k19m19L95K25n25k6M64k51m22L19K16m43q4L92k0
1397C0l57J45L31j77k13L18J84l52M1M22j86l17L18J60m36kL30j97k84K11J17
1418H6k77m9K55j7k52J14K83j53k15L25J78l34RL42j06k67J91J21k50o3J57n4
1440B4j93O3J07j32j16J85N4j95O3K42j19j15K50M6j85Q3J90j56j01J78J1j97
1462a3m7J36k0k11J3J81j20j58J71R4j70N3J75j12rJ85n9j16J56R0j77l9J55k9
1486A29j88j4J45p0k04Q9J39j82p9K14Mj57J08J50r6oJ40k2m9P4K4r1j5J10o4
$$ y = [-383, 350, 556, -262, -198, 589, 157, -595, 64, 514, -420, -569, 358, 91, -729, -142, 446, -264, -513, 290, 335, -336, -95, 514, 156, -255, 252, 473, -155, -158, 433, 116, -436, 60, 336, -360, -407, 261, 60, -535, -145, 334, -117, -396, 167, 347, -170, -107, 428, 209, -210, 185, 410, -115, -141, 323, 72, -350, -31, 185, -258, -342, 50, 30, -327, -182, 149, -28, -241, 77, 261, -91, -50, 372, 186, -131, 187, 347, -89, -91, 239, 42, -242, -31, 86, -191, -240, 15, -2, -254, -140, 143, -10, -225, 100, 278, -56, -47, 295, 189, -78, 113, 234, -16, -79, 78, 24, -169, -106, 1, -131, -247, -62, -8, -203, -140, 102, -17, -132, 118, 164, -21, 62, 252, 96, -5, 173, 184, -13, -60, 76, 56, -155, -142, 39, -81, -239, -68, 26, -144, -91, 84, -28, -37, 148, 89, -27, 129, 219, 42, 3, 158, 129, -59, -73, 72, 2, -202, -113, 26, -156, -235, -21, -17, -174, -66, 84, -12, -18, 122, 100, 51, 125, 149, 58, 43, 153, 89]
1511H9j95R5J57k21j75K53O8k92J3K72q4j77J70J19q8nJ13j5o7Q4M0j35l6J79
1535A62o8k64J31J80k76j61L11L9l31J15K67j61j48K43J04j82J6J86l2j47J25
1556A09R4j92n3K23j15k57K11J50l65o8L77o1l83J85L34k14k37K94J96k79o9L29
1578B09l7k54J59J46k56m0K59j64k51K50J10l70j0L68j02l57K21L25k61k21L87
1599A11J67m06J7M61j54l82K92K29m17p1L76j45l30K39J67l42n1L37o2l47K07
1620a04L48l08k45M66J52m83L2N15k02m24L30K41m14q5L72j21l45K26K09l63r8
1641c01M19l4m20K09M36l56k58N07J32n24Q2N13k43l99L61K17m34j11L94o3m06
1662b79J85K91l34j89M35Pm50K25M21l85k32N45O8n48J40N19l04m10L80K63m70
$$ y = [89, -106, -11, 146, -75, -250, 3, 71, -221, -208, 64, -20, -197, -27, 92, 4, -1, 112, 97, 30, 114, 154, 19, -17, 162, 94, -170, -39, 141, -135, -296, 15, 54, -277, -162, 105, -56, -204, 39, 143, -39, -23, 163, 131, -16, 109, 203, 11, -42, 181, 66, -191, 20, 170, -195, -263, 114, 53, -330, -145, 189, -25, -262, 32, 228, -51, -120, 209, 172, -82, 77, 223, -33, -73, 186, 22, -229, 21, 131, -239, -249, 119, 17, -340, -119, 206, -55, -276, 111, 278, -128, -111, 350, 196, -186, 106, 335, -82, -153, 223, 78, -252, -13, 154, -188, -239, 98, 36, -311, -104, 244, -64, -309, 157, 309, -174, -142, 373, 171, -253, 77, 318, -96, -181, 191, 70, -275, -49, 160, -203, -301, 118, 84, -336, -127, 309, -47, -305, 202, 334, -190, -108, 405, 162, -237, 124, 341, -93, -204, 190, 127, -279, -94, 197, -137, -326, 109, 116, -334, -109, 312, -73, -305, 240, 308, -240, -100, 419, 115, -295, 85, 348, -122]
1683a22j58M58m0m54J64L61l29k16M50Qm31K19M00l39k34M93Q5m94R1M87k44m20
1705b65L45K68m61j56M79p5m85K23L69l99j90M56K8m34J91L81k84k25L91J13m23
1726a53L8M53k08m23L45K84m89j53N10q1m86K32L68l76j89M39L0l88J65L60k43
1747C5k44L68J56m13qM22j48m14K93K59m31j25M24q6m02J99K98l20j68L89N8l74
1769b32J10L97k22k79L17K07l93m0M07j30l63K42K04l49r3L36n9l33J63K80k58
1790h8j84L49J02l58O9L73j63k98L23J76l75k8L59j25l25K10J79k88j09K72k0
1811E1k91J03K64j84j84K82J05l02L6L41j50k50K63J66l16m2K95p0k74J18J86
1832A47k07j25K18L1k58O9K35j49j70K76R3k88M7K76j00k20J86J50k16o3K01j8
$$ y = [-122, -280, 178, 138, -316, -152, 209, -120, -336, 114, 122, -309, -90, 310, -29, -263, 230, 315, -179, -88, 399, 155, -265, 80, 348, -113, -269, 210, 135, -350, -127, 242, -157, -347, 109, 137, -297, -106, 275, -9, -234, 157, 270, -153, -115, 338, 130, -293, 52, 336, -153, -306, 204, 123, -363, -131, 237, -139, -328, 111, 141, -247, -82, 278, 35, -209, 159, 315, -98, -106, 316, 168, -246, 47, 306, -125, -250, 174, 88, -314, -115, 183, -137, -305, 84, 142, -232, -122, 275, 53, -226, 91, 298, -95, -135, 272, 142, -221, 21, 225, -124, -217, 119, 60, -273, -110, 170, -88, -272, 77, 179, -179, -110, 263, 100, -198, 125, 301, -74, -102, 257, 132, -193, 17, 196, -92, -201, 71, 51, -240, -137, 127, -57, -241, 41, 146, -156, -120, 221, 71, -179, 84, 250, -66, -108, 187, 117, -157, -39, 147, -60, -185, 33, 64, -194, -125, 110, -39, -209, 67, 160, -128, -81, 195, 95, -125, 61, 211, -5, -68, 133, 115]
1854A15k22N6J78j66j47K04M8k53O3K20j45j45K34P5k18L9K18p2j71J38J20j67
1876Bq9J84J6k17K4J74j00j58J50O3j74L1J61q2r0J56N5j46J1J71m0j57R7J29
1900A71j45j00J58K6j97K1J38j01j22J21N7j27%J30l9q1Q0Q6r7l0J31Nj29O5J10
1925A31j22p9J23K9j72L8J20j03r7J06O5j11rJ05Qq0M0R7n5m5R2K7j24M9Q0r7
1951A6p5J22qj35K0R0o5q1O4O4p8l1J02J4p3L4R6o1m5R3J8r1L0N7o6m0O0j4o0
1980d3nN9l4o3N2O1p9l2J08K1q9M4R6o3m1P6No5J6K4l3l3K3Qo2j0M2j2q4N5P5
2011A7p6k6J06Pp9M9P3n7k5O9om4JM1l3m1K7Nm1j8M6j6n3M9L8n3J0Q1k3m2N7N0
2043I3o5l2N4K7o5j3M9k2o3J9J4o7QM4j5n3N6K6n1L0M8j2k5L2L9k7j7L7Ll8jK9
$$ y = [115, -107, -51, 127, -39, -186, 18, 66, -187, -124, 96, -49, -194, 40, 115, -103, -64, 154, 82, -89, 49, 169, 2, -87, 97, 113, -104, -80, 94, -6, -164, -14, 49, -125, -94, 67, -15, -105, 51, 106, -40, -29, 142, 102, -55, 42, 171, 26, -74, 84, 110, -87, -66, 72, -29, -151, -30, 27, -100, -100, 30, -9, -90, -10, 76, -21, -51, 80, 85, -44, 21, 131, 9, -70, 53, 82, -90, -52, 68, -35, -132, -26, 39, -72, -81, 24, 32, -48, -8, 89, 34, -11, 81, 108, -16, 33, 113, 16, -59, 63, 55, -80, -60, 30, -35, -116, -52, 12, -66, -97, 5, 19, -54, -20, 76, 15, -30, 63, 81, -10, 20, 77, 11, -29, 31, 17, -43, -48, 11, -23, -86, -34, 27, -52, -84, 24, 45, -44, 0, 96, 33, -8, 68, 73, 8, 24, 48, 15, -18, 5, 13, -49, -59, -17, -29, -113, -58, 17, -59, -85, 21, 28, -51, -2, 71, 14, -11, 58, 52, 8, 9, 50, 17, -24, 3, 8, -33, -51, -5, -21, -74, -25, 13, -40, -30, 51, 28, -14, 43, 93, 28, -4, 50, 77, 12, -1, 48, 26, -37, -18, -4, -71, -63, -19, -34, -87, -31, -5, -56, -26, 22, 10, -15, 17, 56, 29, 12, 49, 52, 14, 13, 42]
2075D2n2k5N3qo1J1N4m8l5O1J7m0LN8j7j3L1K3j3k7M0lo5J6L8n6k5L5on7K6K8
2107a5m3mN6pl3K6M2j3l7N4M3o4qP2k2o5N4J8p4j8P0k9n4K8L1l7qL6J7l2LN8j7
2140B8l7M3K0m9RM9m8n3N6J1p9PO1n0m7M6J9l9k2O3J7m2J7N9l1m7Q2J1o4J3N6
2171E9l9m4M2K7p1kM5k5m7M1K0l5j2O1ro0N3O1n9l4O7Oo5L8L9o4k8M5jm8nL9j4
2204a9o0L2O3o5j7P1Ro0L0O5m5k3O9mn4K5M5n2l0L2J7n9j3N0j0o1N1L1o7pQ9j7
2236A6o4N3M7n2l1P3%o9J6M7k8n6L8K3p1nO8l2n4O2L5p0J1O8j1n2N2L5m2k1N3
2267C9J1o1oO3l5m6N5J7p8J6M7l0n4N7M3o5QM5ol8K1M5m4l3O5Jo2pP6n0n2M7K5
2300A4q0J2O3l3l5L9L6n5RN7om8K9P3o2l7P3J2p0J4M8m2l8L6Lm2PL7k5l2M0K4
$$ y = [42, -10, -35, 18, 10, -51, -40, 14, -34, -69, -8, 9, -31, -28, 30, 13, 0, 31, 54, 41, 14, 54, 51, -14, 2, 40, -16, -41, -6, -12, -69, -43, -15, -58, -62, -6, -13, -46, -20, 22, 9, -28, 26, 69, 5, -3, 69, 47, -18, 36, 54, -20, -38, 32, 3, -51, -23, 8, -29, -37, -1, 16, -16, -13, 45, 28, -9, 34, 54, 5, 14, 63, 15, -38, 18, 29, -50, -43, 18, -32, -79, -33, -14, -53, -75, -12, 5, -37, -20, 39, 8, -39, 43, 54, -10, 3, 59, 20, -24, 18, 45, -26, -28, 17, -8, -55, -14, 6, -29, -41, 20, 11, -49, 4, 65, 6, -28, 39, 45, -20, 18, 57, -7, -35, 10, 9, -39, -44, -5, -19, -79, -47, 16, -49, -66, 5, 14, -46, -16, 49, 4, -19, 50, 46, -8, 17, 62, 10, -20, 12, 29, -30, -43, 7, -3, -64, -13, 18, -49, -56, 33, 16, -48, 5, 52, 0, -31, 42, 42, -27, -11, 36, 8, -48, -10, 13, -58, -63, 5, -27, -81, -19, 16, -54, -43, 25, 14, -38, 14, 49, 7, -14, 39, 50, -11, -17, 46, 11, -35, 20, 37, -41, -25, 22, -8, -62, -5, 38, -27, -19, 26, 20, -18, 3, 48, 4, -29, 36, 37, -25, -32, 44, -6, -58, -11, 14, -66, -54, 9, -24, -59, -20, 16, -39, -30, 27, 21, -27, 2, 75, 13, -24, 49, 61, -9, 5, 53, 11, -27, 9, 12, -30, -23, 14, -11, -43, -3, 21]
2332B1m1k3P0Jo3L3N5n8k0N3ln0J7K0k7k1J6Nk8oL8qk6K3L9m1mM3jk8K6M5l7l5
2366a5N4Mn1NL9k3l6J6L0m4j1L5nk2J7L4m4j5M8ml5K7J8j1k2K7Ql9mJ8j0l2RM2
2400Hl6k2M5Om2L4J4j6kK4J3l6K6K5k9rJ9ok2kL6j8m1K1L7l9k3L8qk6K2J7j8n
2434a5K8kk5NJ7j0k0L0Kl1LK3k0k7K2K0l0mK9rnQK6j6lML0j5j1K2Qk7LJ0j8j4
2470a2K7j1j7J3kj2j1J6Pk0%K6j4j1J3J6j2nJ3jk4K7Mk8RJ3k3nJ5olKK2Jj6OJ9
2507A6qoJ1Nj3oL2j4j1kJ4j9KNpj5MRqqK0qoONkj5K0jrjJ0nj1J0jKnQlKlL1l1
2551fjJK3k4J8J0qj3K3j1jRmj0nlK2l3nK6qk5J4J2mjMj4MMLOqJ6k2kJ4Lj3lJ3
2592Ammj0J0Qj8J5lKlJ8qRMqJ3jlkmnJ4oj4L%pqMNqRMj9mJ0nRpOOPJmKKMpoOk
$$ y = [21, -20, -43, 27, 28, -35, -2, 53, -5, -25, 28, 25, -25, -8, 12, -15, -36, -20, -15, -43, -49, -11, -19, -45, -22, 17, -24, -28, 15, 14, -14, 12, 57, 20, -15, 39, 43, -8, -3, 36, 13, -23, -7, 23, -21, -32, 3, -2, -24, -7, 27, -17, -32, 16, 12, -23, 4, 22, 11, -11, 16, 24, -15, -19, -1, -11, -43, -34, 8, -28, -50, -5, 1, -41, -7, 7, -9, -11, 13, 26, -10, 16, 41, 12, 3, 22, 16, -6, -8, 28, 10, -31, -10, 27, -12, -35, 3, -5, -31, -9, 8, -10, -15, 13, 11, -14, -9, 8, -2, -22, 8, 10, -21, -18, 5, -15, -42, -20, 0, -30, -34, -5, -14, -19, -11, 15, -1, -4, 0, 30, 15, 4, 26, 34, 7, 10, 20, 2, -12, 15, 4, -13, 0, -2, -14, -25, -9, -2, -22, -22, 4, -10, -21, -8, 8, -4, -9, 4, 3, -21, 6, 10, -18, -9, 4, -19, -24, -9, -15, -18, -16, 6, 7, -9, -3, 16, 8, 2, 13, 18, 5, -1, 31, 17, 6, 4, 18, -1, 1, 6, -1, -16, -12, -3, -11, -19, 1, -7, -13, -7, -2, -4, -19, 1, 0, -9, -10, 0, -5, -16, -6, -7, -5, -10, -2, -5, -3, -6, 25, -6, -7, -6, 17, -7, 11, 21, 13, 0, 23, 12, 11, 20, 16, 6, 1, -2, 20, -13, -18, 8, 0, -25, -11, 1, -3, -4, 0, -14, -10, -6, -3, 3, -5, 11, -11, -13, 1, 4, -9, -12, 1, -3, -7, -17, -7, 1, -17, -2, -5, -3, -6, 12, 4, 13, 17, 9, 22, 21, 18, 16, 12, 7, 21, 15, 1, 4, 4, -3, -11, -7, -2, -10, -1, 3, -16, -20, -10, -15, -6, -13, -7, -1, 6, 7, 3, 5, 7, 11, 4, -2, 4, 2]
2643BpMJjNj1J4rOJ1qJ0nPlnkJ6j8%J2j7lNnkMj5J1j7LRlKlJ0r%MOnJ0okRNpO
2691IrPj1QqmJ6j3J4j4RLPKoP%kOj6k%joJ3j3JmnN%JL%j2PlNoK2k0RQpOQj5N%
2740DkmJMjLjK%jJ7j1lPk6K2jq%NmJnnMj8LJPKMj0KKrnOJ5ojMJqJ1J1k2J8kkJ0
2790A2j3jRjlOoJ0qMoJ2qNQj1J%lj4NOmlmMml%%oJ2rjMnNQl%J2nmmQKkJ4qj8J5
2841EkJ3pOqRqJ2j0k%mjmJ4j9NPj2%POj5Mjj1Q%KjMj3JKKqJ6mK4j3mQk0J5nJ0
2887HLmlJ2lqLRnJnj%lkQpnQj2MJ1j3lJ0%j7OLj1KJ1j0lMJ2lrNJ4j9J3KMqKJr
2935gLJ0KoJ8j5J0j2OllRJ0j7nkPrJO%koNj4nJ5%qqJ1Jk0RLNLOpJ3oJ1Jj4J0N
2981A1j3JJ0pJRrOnQoj8J9KpKRj6qJ2NjrjOrMJ1j2j1PqkmNPrJJ0jnJ7LoNMj0o
$$ y = [2, -5, -1, 0, -1, 4, -7, 7, -2, 4, 15, 7, 17, 12, 19, 16, 11, 9, 25, 7, 7, 19, 2, -1, 4, -1, -3, 1, -14, -3, -20, -17, -8, -11, -9, -12, -2, -11, -11, -7, -1, -6, 4, -2, -4, 5, 10, 3, 9, 0, 7, -4, 4, -4, -8, 8, -5, 9, -5, 4, 7, 14, 16, 10, 17, 17, 15, 21, 5, 3, 3, 2, -4, 9, -4, -3, -7, -12, -7, -7, -6, -3, -3, -15, -8, -11, -6, -12, 10, -10, -1, 7, 0, 6, 14, -1, 4, 4, 2, -2, -1, 3, 2, 5, 4, 6, 6, 5, 22, 11, 8, 15, -11, 11, 10, 2, 2, 7, 3, 4, -1, -6, -2, -20, -17, -16, -9, -7, -3, -13, -11, -9, -18, -23, -17, -2, -8, -9, -5, -4, -12, -1, 10, -12, 6, 4, 2, 12, -1, -2, 7, 6, 3, 9, 3, 13, 5, 9, 3, 15, 7, 12, 20, 9, 10, 10, 7, -7, -2, 4, 0, -3, -7, -3, -7, -10, -10, -10, -16, -4, -13, -14, -10, -15, -10, -2, -5, -5, 7, 2, -2, -6, 2, 4, 2, 16, 8, -10, 5, 3, 16, 9, 15, 7, 16, 8, 20, 10, 8, 8, 4, 3, -1, 13, -6, -1, 6, -6, -6, 1, 7, -8, -4, -5, -16, -8, -8, -6, -7, -3, -16, -15, -13, -11, -19, -3, -7, 17, 4, 0, 8, -12, 3, -2, 8, 11, 7, 4, 16, 13, 5, 8, 17, 12, 13, 8, 7, 7, 4, 2, 10, 3, -2, 6, -6, -2, 9, -4, -7, 3, 3, -14, -8, -5, -16, -14, -3, -13, -16, -12, 0, -3, -12, -7, 7, -12, 1, 3, 7, -1, 1, 2, -7, -4, 6, 8, 2, 20, 5, 15, 3, 9, 6, 3, 12, 22, 5, 0, -2, 5, -4, -3, 3, 3, 1, -5, 0, -14, -19, -4, -4, -12, -20, -9, -8, -28, -19, -16, -11, -8, -2, -9, 4, -2, 9, 10, -4, 6, 11, -2, -1, 9, 2, 3, 12, 3, 9, 4, 12, 6, -12, 7, 9, 2, 4, 13, -3, -11, 1, 6, 5, -4, -5, 1, -8, -4, 7, -5, -16, -9, -17, -19, -23, -18, -11, -20, -19, -9, -10, -15, 2, 5, -1, 4, 8, -2, -8]
3029hQJ0j2J8Lj0J%n%J2qnKO%olqJ0mj2Rj0J3jj0J4lpqJ4j0nQkPmmJ3KrJLnKO
3076CKnOnJ0JOkj1lJ3qKLrJ1j3kjKqOlkMLr%NmpJ3j2PrJ0QrMj1ljJ1J1qJlJjO
3126@l%J2pmPMLojJ2kj3QKj4JRj1rjJ6nm%mOj6J3JQ%jlpNRj0LJ2j1kJ0Rj8K0j5
3173CMK%KrNoPoPjOLknj0%J0%pnoPjknMko%L%nJ4kQmqJ2kpJ9lj1jRnnJ1Lpj3J2
3226EPj2oK3roMNj2KMRj3j0J1LqpRjLLlj3Qkj7J9Oj6QQmkJ2JJj7J4kJ2rNK%kK
3273A5rmLLl%OjjpJ2kmQj2kjnj1KJ5j1%JPj1QOo%rJ4jj1PK5j8oJ6pllJ7j5NJ2
3319A9j3OJmjmmPkkJ9qj2PopKkqLJ0Jj2Pj1Rj4J0kL%mJ2rJ2%j2jRQqPLojOJkk
3368ENoKJ0mnJNKqNljlJj8Q%KlJKkn%J2j8lNJ1%j3MJ4ojJ0jqJ1KK%LkKqorJ1N
$$ y = [-8, 0, 10, -2, 16, 19, 9, 10, 10, 5, 5, 17, 9, 4, 6, 12, 12, 6, 3, -5, 5, 1, -11, -2, -12, 1, 0, -10, 4, 1, -6, -14, 0, -10, -15, -7, -9, -2, -6, -10, 3, 5, -4, -3, 0, -5, -3, 3, 5, 0, 6, 1, 11, 12, 18, 16, 5, 2, 15, 7, 9, 12, 3, 14, 1, -1, -2, 0, -8, -2, -5, -7, -3, 0, -9, -9, -4, -8, -15, -2, -14, -7, -16, -6, 2, -7, -3, -14, -17, -18, -7, 4, -4, -3, -6, -5, -6, 0, -3, -3, 9, 2, -2, 5, 9, 12, 6, 5, 17, 15, 2, 10, 12, -2, -1, 8, -3, -12, -13, 3, -2, -6, -6, -10, -4, -20, -7, -6, 2, 2, 1, -2, -9, -4, 5, -5, -2, 10, -1, -3, 7, 16, -2, 18, 3, 7, 9, 9, 11, 2, 7, 1, 8, 2, 9, 8, 14, 17, 15, 10, 0, 0, 10, 10, 3, -2, -8, -1, -2, -4, -9, -5, -7, -13, -13, -10, -10, -15, -1, -3, 5, 1, -7, 5, 3, -4, 15, 12, 1, 0, 9, 4, -1, 10, 13, 6, -7, 5, 12, 0, -6, 17, 8, 2, 6, 11, -1, 1, 5, 14, 1, -9, 2, 5, -3, -10, -1, -2, 1, 4, 1, -12, -4, -6, -23, -4, 2, -14, -6, 2, -2, -4, 8, 9, 10, -7, 7, 5, 17, 8, 13, 15, 15, 13, 15, 6, 2, 5, 8, 5, 5, 11, 10, 9, 2, 14, 12, 8, 16, 4, 2, 1, -4, -15, -13, 2, -9, -9, -8, -1, -12, -4, 2, -4, -4, -13, 1, 0, -11, -4, 21, 3, -3, 13, 6, 3, 0, 17, 2, 7, 19, 6, 12, 13, 9, 8, 4, 0, 7, 5, 3, 22, 14, 2, 9, 3, -4, -2, -4, -12, -9, 1, 2, -10, -3, -14, -5, -19, -9, -11, -8, -8, -12, 0, -9, 3, 3, -9, -10, -1, 7, -1, 6, 9, 3, 2, 8, 9, 7, 5, 10, 4, 6, 16, 12, 7, 8, 13, 15, 7, 12, 9, 8, 5, 6, -12, -4, -4, -2, -5, -4, -2, -4, -9, -9, 3, -15, -18, -13, -2, -2, -15, -11, 3, -3, -4, 6, 5, -3, 8, 10, 12, 12, 15, 13, 15, 7, 1, -8, 3, 8]
3419HlpNj%nJ1pmQmOj0jOpOlj2kjRrLPlnRkNjKj0J6oJ5mLKrQj0J6n%LmnM%mOn
3472IKj4lKJ4pKqrQK1j3j1J%%rK0qlLqLj1K4j5lQJ3rKKJ2j3RJ0oLnMmjmJ5j9j4
3518a0PMkJ0lrJ0or%J0%j4MJ0j3%LJ2qqRnmjKQnLJ1j4J8mJj4J8pmK0Jj0%Ojj2
3563DqJ7pjj5K6j2pPLr%Nj7QJKOlRj3JmJ4j6NNnj6J4J5j1Oj0J0mmJ4%ojQj1NJ1
3608A6Jj3J0Prj1%OoQLrj2K2j4j1OJ4j7j4J5Kjj0J9llnJ9j0kNjmnJ0j0PJ5rJj
3650FMoJKJ2Lj5QK%j0OoMpJkj1QkNjKj3P%Qj2J5pj7NJ8j5LMJrrJ7KnlQkkJ1jJ
3699IRLj5J8nj3PkNqJ1j8Qj8Rnj1mJ8kLKNj2joQkLJk%oJ6pkPj1%kJ3nj1R%jJJ7
3747A3j5J7oPj4J7kKoj4NJnLl%j0NljJMqoJ0koRPkOjKomJ5j3J7j7NpNRj0%kRK
$$ y = [8, 5, -2, 3, 2, 2, -3, 8, 1, -3, 5, 1, 7, -3, -4, 2, -5, 1, -2, -14, -16, -17, -8, -17, -14, -7, -10, -15, -6, -8, -3, -4, -2, -12, 4, -2, 13, 9, 12, 14, 5, 13, 3, 19, 14, 14, 17, 13, 8, 12, 12, 8, 14, 9, 11, -3, -6, -4, 10, 3, 5, -3, -12, -4, 17, 4, -7, -6, -6, -6, -15, 5, -3, -6, -3, -11, -8, -19, 5, -10, -13, -5, 8, -1, 1, 3, 15, 2, 11, 21, 15, 18, 13, 17, 13, 12, 8, 23, 4, -10, -3, 1, -1, 9, 6, -3, 7, 1, -8, -8, 2, 2, -12, -8, 2, -11, -11, -8, 4, -4, -12, -3, -8, -12, -13, -11, -3, -8, -5, 6, -8, 10, 6, 7, -7, 11, 4, 0, 20, 21, 11, 11, 17, 16, 4, -4, 13, 6, 5, -10, 16, 4, -3, 4, 7, -2, -2, 3, -14, -6, -5, -3, 3, 0, 9, -4, -3, -7, 7, -9, -4, 1, -4, -20, -6, 9, -2, 4, -6, 4, 0, -4, 10, 10, 4, 3, 11, 0, 5, 16, 17, 4, 14, 21, 12, 1, 1, 7, 1, 9, 12, 3, -9, 13, -1, -12, -6, 8, -9, -23, -8, -6, -7, -17, 2, -1, -4, -9, 10, 0, -2, 3, 2, -2, -7, 3, -7, 0, 15, 6, 7, 6, 10, 4, 5, 7, 19, 22, 7, 15, 17, 17, 7, 13, 7, 11, 4, 5, 3, -8, 0, -2, 3, 2, 4, -9, -2, -2, 6, -6, 9, 2, -15, -10, 8, -7, -4, 0, 1, -8, -17, 0, 2, -3, -6, 2, 0, -2, 9, 8, 9, 18, 21, 6, 24, 19, 6, 13, 11, 16, 8, 19, 1, 9, -9, 0, -5, -16, -20, -2, -4, -1, 1, 6, -6, -7, -13, -5, -7, -4, -3, -5, -5, -11, 5, -2, -4, 3, -8, -8, -10, 3, -2, -13, -4, -4, -5, -4, 13, -2, 15, 9, 16, 2, 19, 17, 19, 13, -1, 4, 5, 0, 3, 0, 0, -10, -5, -8, -9, -8, -4, -12, -18, -8, -10, -16, -7, 0, -2, 4, 3, 5, -1, -5, 10, -3, 14, -3, 2, -5, 0, 9, -1, -1, -3, 6, 8]
3795HoKOnPmMj3J6JpqJ4j4RRj9j2J1Mj6RlJnJOjKNlLJKJj4J0Oj2MP%j1MNj0kJ2
3843EnJ0rpOnJ8pJOlOj6OjrMkj2RjKMk3JRRj0MKP%nlNK0j3qoJ7lJ4Nj7nmJ3oK
3892EpRrRn%kJ1Jj4PKj1mJ3%krJ1j8QmPj3OoKmJ1J3j6%OMj3kJ2J7j7Qj1PkJ6k
3937A4j3PmMlMrjPKOj4J3Mj3KJ0oj1OnkOj6Kj0LJ0jrQnj0J7P%qOnJ5oNNj4J1M
3983A3nj3K0opPm%PNomMjkkJ%lqPjKrNk4J4jkMPLomOnjJ3%KnQLj3P%NoN%j2Qk
4036D%Op%Pj0J2%JoKorNLj0J5%j0qRj9jQK2oj4QLLpJ4lplJ1oKJ0MpmPKooLj0Q
4085DkmOJ1j1joJPj0QRLrkmjkMj0oLjqNMkknJ5rLJ3rLKJ3lMnKJnP%jjKj1MNpj5
4138a3LJ5jnJPlj2K3lpr%OKpKj1jLojONqJ1lKMQj3OLMJoPKOrJ3j3nQrlQJNj6q
$$ y = [8, 2, 4, 10, 5, 12, 8, 12, -1, 15, 16, 9, 1, 15, 1, 10, 19, 0, -12, -1, 3, -13, -4, -7, -6, -11, -10, -4, -5, -3, 2, -1, 2, 3, 5, 6, -8, 2, 8, -4, 0, 7, 7, -4, 0, 5, -5, -7, 5, 0, 10, 1, -6, 0, -5, 13, 6, 7, 13, 10, 16, 0, 6, 5, -4, 0, -2, -14, -5, -6, -4, 0, -23, -22, -13, -4, -14, -10, -8, -1, -1, -6, -9, -4, 16, 3, -5, -11, 6, 3, 17, 22, 5, 0, -4, 9, 3, 5, -2, 7, -2, 7, 2, 2, 0, 11, 12, -2, 5, 7, -4, -8, 5, 5, 3, -6, 5, -13, -5, -9, -2, -15, -9, -15, -13, -17, -6, 7, -9, -9, -3, 1, -12, -14, -2, 15, -2, 6, -5, 2, 0, 16, 14, 1, 8, 4, 8, 5, 9, 0, -1, 6, 8, 14, 0, 13, 17, 4, 6, 16, 10, -1, 5, 0, -2, 4, -12, -10, -20, -17, -7, -8, -17, -9, -14, -24, -7, 0, 0, -8, -2, -7, 8, 2, 7, 12, -2, 9, 13, 8, -5, 15, 9, 2, 9, 5, 5, 12, 17, 11, 7, 11, 10, 8, 6, 7, 7, 4, -4, 3, 2, 4, -5, 0, -24, -10, -11, -13, -9, -2, 1, -5, -9, -3, -8, -9, 4, 4, 6, 1, 9, 12, -1, 6, 6, 11, 5, 10, 10, -2, 6, 4, 4, 10, 3, 3, 10, 0, 12, 12, 13, 7, 9, 3, -6, -1, 2, -8, 7, 7, -3, -11, -2, -21, -22, -14, 8, 2, -12, -4, -1, 2, -5, 9, 6, -1, -4, 7, 1, 3, 13, 17, 10, 6, 13, 15, 9, 3, 6, -4, 4, 2, -2, 4, 15, 4, 3, -3, -2, 5, -5, 3, 12, 15, 6, 4, 0, -1, -3, 1, -9, -15, -12, -13, -21, -16, -12, -14, -16, -21, -6, -15, -12, 1, -8, -5, -3, 10, 7, 11, 6, 8, 9, 4, 11, 11, 10, 9, 11, 0, 4, 9, 2, -13, -10, 5, 4, -1, 0, 7, 4, -8, 15, 12, 5, -4, -4, 2, 4, -3, -1, -12, -13, -10, -16, -17, -11, -6, -14, -3, -6, -4, 0, 8, -5, 1, 4, 8, 9, 3, 10, 12, 18, 9, 22, 9, 4, 12, 3, 0, 8, 9, 14, -2, -10]
4189a0PNnMpnNRkk%Mlp%Lj0jM%KM%jKKoKJ5lklJ3nNPj2kkOj4J1j4J8j0Lj7J7n
4238@oQJqjOpoMOnO%onMMpmMnJ4%rJ2J1lLj0J6mnmJ5onoJ2nLk0J4ooJ9jj4J1l
4287FqmjJ1j3J4j2jNOj1NnppQJJ2j7RPQqJJONnQj7J1OllJ0j0Lj0MjjjLnJ3k1N
4334cJqjJ4NmqrJ6jJjmnnNJj4POJjj2RLJ1l%qJ3NolJ0PrPj2J2j1kKrjNmJLjjl
4385dLlnONJ%qMj2RNj6%MLJlJ0jrNoJ9k%Oj0jJ3JNQmnnj0KKLj3koJ0KnrJ3k%k
4436clnJ8LqJ0j4Jj0RMklOLpnOMq%J7j1rK5j0RJj2PnJ5mmnj0JJj0jQlKLp%JmR
4485@momJ4Nn%mJ2j6J3oRJqkoJPLJKJjLqNO%%%Mj5J6j2k%joj0K2orpQj6J2jRp
4535hJ3mj3JJ9oj0K0j8OnPmLkPmRqnNJ5qQj0ONj8J6LnnLnoRj0OoKjqN%mj3NPn
$$ y = [-10, -3, 2, -3, 1, -6, -11, -6, 3, 1, -1, -1, 3, 0, -7, -7, -4, -14, -15, -11, -11, -9, -5, -5, -6, -4, -2, -8, -6, 9, 6, 4, 1, 14, 9, 14, 21, 9, 7, 5, 11, -3, 8, -6, 12, 2, 5, -12, 5, 0, -6, 2, 3, -5, -6, 0, -7, -13, -9, -3, -8, -2, -2, -8, -13, -9, -5, -12, -16, -12, -17, -3, -3, -12, 0, 11, 8, 11, 1, 17, 13, 8, 4, 19, 13, 8, 2, 14, 9, 12, -8, 6, 0, -6, 13, 12, -2, 9, 6, -2, -6, -7, 4, -9, 5, -7, -8, -3, 3, -8, -3, -8, -15, -22, -14, -13, -1, -18, -9, -2, 6, -2, -1, 0, 6, 11, 6, 14, -3, 8, 14, 11, 8, 18, 8, 11, 1, 5, 4, 3, 2, 5, 0, 13, -8, -3, -2, -10, -11, 3, 8, 4, -4, -13, 3, 2, 3, 2, -2, -7, -12, -7, -6, -20, -13, -7, -6, -7, -19, -10, -7, 4, 1, 1, -7, 6, 11, 5, 2, 12, 19, 10, 17, 5, 17, 6, 4, 6, -3, -4, 1, -3, -2, 1, 0, -1, -4, -1, -4, -9, -3, 2, 3, 3, -5, -1, -13, -4, 1, -15, -15, -11, -8, -7, -10, 0, -1, -10, -5, -11, 8, 6, 6, 12, 2, 1, 14, 15, 20, 28, 24, 19, 14, 4, 6, 8, 11, -2, -4, -10, 0, 2, -3, -12, 1, -1, -1, -3, -6, -11, 7, 10, 2, 12, -2, -1, -11, -2, 2, 0, -3, 3, 6, -1, -6, 0, 4, -4, -4, 13, 2, -7, 18, 8, 17, 18, 6, 13, 8, 23, 19, 15, 10, 0, 1, 2, -8, -9, -1, -4, -2, 1, -6, -6, -5, -9, 0, -4, -10, -14, 0, 5, 0, 0, -4, 8, -8, 5, -1, 8, 9, 1, -1, -7, -6, 1, 4, 5, 7, 8, 7, 10, 2, 7, 13, 13, 13, 13, 17, 2, 18, 6, 4, 4, 3, -3, -13, 9, 3, -6, -13, -5, -21, -9, -10, -1, -8, 5, 1, -12, -11, 8, 2, -8, 12, -6, 0, -5, 2, -2, 1, -1, 6, 2, 11, 3, -2, 3, 18, 10, 18, 8, 14, 19, 1, 17, 20, 15, 10, 13, 8, 2, 11, 1, 7, 1, 3, 2, -6, -1, -1, -5, -18, -13, -6, -11]
4584a1KJ1j0j0J1OLpJ2nj5NPjQKj2LJ2nRmMK1k6pQjLkRk5J9jpljmlO%kj7J0LJ1
4630Fj5J1Oj8RJJ2nkqKK0j4Lo%nMLjPj1nOMRJ0j2JOlml%Mj0JOpoMnjnLlJjMJJ
4681eNOj1MJ3pJ1j5PJmrJ0j5MRLmnJ1lNkmnJ1Qj1lOOj1kRkj3%mOo%%jMpqJ3mL
4730fpLJ1oJ3qPOlJjnj2J2j1%RnRJrJ4oKjj1LJ6k7J7MmnLKojjKqPqJ1k1%J0Mm
4778ikJ2qkJ5oJRj7KJ0kLqMkL%mL%N%lPNj9PL%l%Qj0njQj2MOrJ3j0oPnNJpMPn
4830cjQMlQJkmj1J3Kj4J2mLnNmLO%j0Oj0J0oqJ6nrLJomLLj1J8k1%QOJkMpJ0mK
4879BMqJNoJ5j4J0mOnjnJ2kpj2K2j2Pj0Qkj2J6QpkNo%l%oOljj2J4JmOmkLKmPl
4928CPjpLK%jkQ%lmQnmJ4j4LjJkQojJj1NoNlM%mlJ0m%jkoJ8j1KllR%ojNQJ%jO
$$ y = [-11, -9, 2, -8, -18, -7, -1, 2, -5, 7, 2, -13, -8, -1, -2, 6, 8, -4, -1, 11, 6, 15, 11, 15, 36, 10, 3, 11, 10, 13, 11, 20, -5, 14, 13, 6, 3, 2, -2, -5, 1, 1, -1, -18, -8, -5, 6, -9, 2, 8, -10, -1, 0, 12, 7, 5, -3, -1, 19, 5, 8, 2, 2, -3, 1, 4, 3, 10, -1, -6, 0, 4, 13, 23, 11, 12, 18, 15, 11, 8, 8, 12, 2, 3, 9, 2, -4, 0, -5, -6, -11, -8, -11, -10, -11, -7, -6, -5, 0, 6, -5, -1, 12, 5, 16, 1, 8, 9, 5, -4, 6, -9, -5, 4, 7, 3, -2, 9, 6, 11, 9, 5, 0, 11, 19, 8, 5, 11, 17, 6, 4, 13, 11, -2, -2, -6, 0, -6, -6, -6, -7, -3, -10, -18, -5, -9, -6, -13, -10, 1, -5, 8, 0, 7, 13, 10, 11, 10, 5, -7, 5, -6, -6, 3, -2, 7, 8, -1, 13, 7, 9, 8, -3, 0, 16, -11, 6, 10, 6, 1, 4, 6, 0, -1, -2, 0, -8, -1, -9, 2, -19, -19, -9, -5, -9, -11, 1, -7, -9, 6, 0, 1, 10, -7, -5, 5, 3, 6, -2, 2, 0, 3, 3, -1, 2, 2, 7, 7, 4, 11, 16, -3, 4, 7, 7, 4, 4, 12, 2, -3, -4, 4, -8, -4, 2, -7, 6, -4, -10, -3, -8, -3, -2, -9, -5, 2, -3, -4, 4, 8, 5, 13, 14, 12, 8, -3, 10, 12, -2, 10, 6, 9, 4, 9, 5, 8, 14, 14, 4, 10, 0, 10, 4, -4, 12, 7, -2, 1, 2, -4, -8, -5, -2, -13, 5, -16, -16, -8, -2, -1, -3, 1, -6, 4, 0, 2, 6, -2, -1, 4, -2, 13, -1, 9, 5, 11, 6, 5, 0, 12, 10, 3, -9, 13, 1, 8, -2, 6, 4, -8, 8, 16, 9, 7, 12, 6, 6, 3, 3, -3, 3, 0, -1, -13, 1, 2, -2, 4, 0, -2, 1, 3, -1, 6, 3, 10, 9, 2, 5, 7, 7, 6, 4, 12, 12, 9, 5, 13, 8, 4, 18, 4, 7, 6, 7, 5, 13, 7, 6, 7, -4, 1, -5, 0, -3, 1, 1, -3, -6, 4, 0, 0, -1, -3, -9, 9, -2, 0, -3, -6, 3, 3, -3, -4, 1, 9, 10, 10, 9, 15]
4983A5j5LNPKj3OKpLqMkjOoMj4J3olJ1j2J6jnlKjjJpMr%%OKPlkPmNMJ0pj2RMl
5034A3lOj5kOlN%mMmlpLqPMLpPpRlKkMj5J3qLNrQNqPOj8J9knOjj2J5oNJoJ3j2
5085IJ6rj2RJj7K1kj4PoJ3j7J0kllNLnkqPmoJ0oJ0lKOpm%NMMoPq%MPpPoqJ1nJ
5135IlJLnJ3j1mOj3J4rKlkJmj4J6oPkMkMj0J1j1LMkJNNlJL%%OpLJoOlKj0rJ5o
5185AQj%%Nk1OJ2rLoPPojj0lPonRpRj0J2MkmjLNoPPlnKLpJ5j2NOj%j9NJ1j1Jk
5236B%NJPmrmjQMj7NJ0oMjnkOj1KKQj7OOKNj3J8p%LQj1JJ3poNlRlj5MMjqNLj0
5287eLnNKOrjKLLnNkNMj5PKplJ1mkQkmjLqJ8j6J4MPj8QlkLPokrKj1J6lrNj1J3
5338Cj0JMlMRj3LjNn%%QqQJj0LJ5moRj2J2j1QkKj6J1J0m%pMkJKNoOqRj1Jj0Rj0
$$ y = [15, 0, 3, 8, 15, 17, 4, 10, 12, 5, 8, 0, 4, 2, 1, 7, 1, 5, -9, 4, -2, -5, 6, -6, 10, 9, 4, 1, 3, 2, 1, 2, -5, -1, -10, -10, -10, -4, -2, 5, 2, 0, 7, 3, 8, 12, 22, 15, 3, 12, 16, 13, 10, 16, 1, -1, 5, 2, 7, 7, 3, 7, 3, 0, -7, -4, -12, -5, -1, 2, -5, 2, -5, 4, 1, 3, 1, 5, -10, 3, -5, -2, 3, -6, 2, 7, -1, 6, 12, -6, 13, 11, 6, 12, 11, -1, 14, 8, 13, 14, 8, 21, 9, 25, 16, 4, 13, 14, -3, 18, 16, 2, 9, 3, 16, -1, 9, 7, 4, 1, 6, 9, 4, 2, -6, 1, -3, -9, 1, -5, 5, 2, 4, 10, 3, -1, -1, 4, 8, 12, 6, 13, 5, 5, 9, 16, 9, 16, 10, 2, 13, 8, 9, 6, 7, 10, 5, 18, 7, 3, 9, -4, 10, 1, 3, 0, -2, -1, -5, -19, -3, -9, -2, -4, 0, -2, 2, -8, 3, -8, -5, -1, -3, -2, 3, 8, 5, 6, 9, 9, 9, 15, 8, 11, 12, 6, 12, 9, 11, 1, -8, 7, 1, 9, 8, 8, 8, 13, -8, -2, 10, 1, 4, -2, 5, 12, 6, 5, -5, -8, -1, -7, -12, -3, -10, -1, -11, 1, 5, 3, -1, -2, 1, 6, 0, 7, 14, 11, 6, 8, 11, 4, 19, 7, 12, 18, 17, 17, -2, 3, 14, 3, 4, 2, 2, 7, 8, 15, 11, 2, -2, -3, 5, 9, -8, -3, 7, 1, 5, 4, -1, -3, 3, -8, -6, -4, 4, -13, -7, -1, 1, 6, -7, 11, 4, 4, 7, 15, 4, 5, 18, 11, 5, 10, 7, 16, 13, -2, 2, 6, 5, -3, 2, 5, -5, -2, -7, -2, 0, 6, -3, -4, -2, 1, 4, -1, 4, 2, 7, 11, -4, 3, 5, -2, -5, 6, 2, 0, 8, 6, 2, 1, 4, -4, 14, -2, 12, 16, 23, 5, 13, 10, 8, 11, 18, 12, 10, 1, 3, -8, 8, 5, -4, 1, -10, 3, -7, -6, -2, -5, -1, 8, -5, -2, -3, 2, -3, -3, -3, 5, -3, 5, 6, -4, -1, 14, 10, 4, 13, 1, 13, 2, 10, 8, 10, -6, 5, 15, 11, 11, 4, 8, 6, 7, 9, 14, 8, 14, 6, 15, 4, 5, -5, 4, -6]
5387fjRqNLkLJ1Jj1j2J2%nN%MlOqMkmM%J1j3KkOPqLj7J6%LMj7NpLJNKllqO%kP
5439Fj0Mj1J2J8j3oKRrN%qM%NOj3RKJ0JrjkKoJ5j6lJ2j1oJ3JnQj2mLKoJ4j3Jl
5485cLJNmqQKnJRqKlKnNOKmJPj0MJKmmNpjJ0qQJpkJ0%j2jM%JnLk%p%QQj1KNjp
5541cLNkoLRj6JJ0mJ6j4J2qmJ2rLOkoNnPj0J1mJ%mLrNj0J0Qj8pOJ0j1J0kjLj1
5587gNj3J2Jj4J7oOQj2J1KKmlojJ6j3NJ2j7QpJ3j1kMNj2J7pjjj1J4j3lJ3pLqM
5630amNlLmlNj4RRJPpoNOPnkkqkJ9jplJ4oj3qQJ1%jmj1J9j1OLpprJ3JJ0j2Njp
5680cRj4J1nOnmJ1Nj8J6jMJonPJQmkKj6J5k%Pj1kJ2j3Mj1RKnJOj1NkQj7J1nNp
5727cNOrlKjPqKN%KMpOjKJJ3k0LLn%KnJ3pJ3nrJ1rj0PJNj1jjljNkrROpJRNj5N
$$ y = [-6, -7, 2, -6, -1, 2, 0, 3, 14, 15, 4, -8, 4, 4, -1, 4, 4, 8, 5, 11, 3, 7, 5, 1, 5, 5, 16, 3, 5, 3, 9, 16, 8, 11, -6, 10, 10, 13, 17, 0, 5, -2, 1, 2, 7, 9, 6, 3, -5, 1, 1, -1, 6, -4, 0, -11, 1, 19, 6, 0, 2, 11, 2, 7, 7, -1, 3, 3, 8, 14, 1, 10, 12, 22, 23, 14, 13, 11, 13, 7, 22, 6, 3, 15, 4, -2, 11, 12, 7, 15, 3, -1, 2, 4, -2, 12, -1, 0, -3, 0, 1, 6, 2, -6, 2, 4, -1, 0, 9, 1, 3, 0, 2, -3, 2, 8, 10, 6, 7, 14, 4, 8, 9, 11, 7, 3, 8, 1, 0, 10, 2, 10, 11, 4, 2, 12, 12, 0, -1, 3, 3, 4, -1, 2, 0, 0, -7, -7, 1, 9, -2, 0, 5, 4, -3, 0, 5, 3, -3, 0, 9, -7, -6, 4, 0, 16, 2, 14, 6, 2, 14, 5, 8, 14, 12, 6, 11, 6, 13, 3, 14, 10, 11, 11, 7, 10, 1, 6, -4, 6, 14, -4, -11, -5, 5, -6, 4, 2, 1, 4, -7, -2, -15, -3, -2, -16, 1, -5, 1, 9, -3, 8, 10, 12, 8, 5, -1, -2, 14, 1, 6, 18, 1, 9, 2, 15, 4, 2, 6, 11, -1, 16, 9, 8, 7, -4, 10, -3, -6, 7, 0, 3, -5, -1, -5, 0, -3, 0, -4, -7, -2, -16, -7, 2, 3, 10, 3, -3, 2, 8, 15, 10, 8, 6, -2, -4, 15, 14, 7, 4, 18, 12, -1, -9, -1, 10, 10, 9, 5, -6, 13, 2, 8, 11, 4, -3, -12, 1, 2, 12, 0, 5, 4, -3, 6, -8, 3, -2, 4, -1, -5, 6, 11, -7, 9, 8, 12, 13, 7, 2, 9, 10, 18, 14, 12, 14, -2, 13, 11, 11, 18, 7, 5, 17, 4, 8, -3, 6, 8, 3, 4, 10, -1, 4, 2, 10, -7, 4, -1, 4, -3, 2, 8, -1, -4, -2, -3, 4, -4, -2, 3, 3, 5, 9, 2, 8, 7, 9, 10, 23, 3, 6, 9, 4, 4, 6, 1, 14, 7, 20, 15, 6, 17, 8, -2, 5, 6, 11, 0, -1, -2, -5, -6, -1, -3, -12, -3, 3, -4, -3, 6, 11, -4, 1]
5780AMOqj4J6pPjOj1J0KqJ1lpOkNMr%lNK%Kn%J0j2oMj1J3omJ%llKJ2j2N%NrMN
5830DnPMkqRKj1RrJ1kJ1j1PLnmjmKjOj4J0J0j2moJ0MrjJ1j7J0JmPj0j4K1kqkL
5876djJ5j4OKMloRLmkJ1jj0kPQmj%Jj2n%jOMnjNMk1J6kpLJj1J2n%kLMnRj4J0J
5926AMOrJkQKj4QjQPj0QmjOLj3JPk0Qj0PLRj1PLj3MmRj7J4j2J1njNj1OQjpjKO
5975EJpNoKmNOjMj4QlJ3rOlNo%jJKrNJnJ5j4JrLkKLrQrLRkPn%MRj4J2j5J6lJ3
6027B4k3KlJ0lj1J6nMmP%oLnM%Lj0LJ0j6jNlkLQk1J8plkKOKn%QoqJ1k%k%J1j0
6075BMJ4j8LMmJpJ0lRmknJ5oj2J0qOlpOLjoKjl%J0oKj4J4onlK5j0rJ0mqKJ1oJ
6123CJj2J5qNRj7J5lLpNKrQmoJlRlKqOp%jLPLmoLpJ1j1J0nm%J0Jj1mJ6mLPj2O
$$ y = [1, 5, 11, 3, -11, 5, -2, 5, 4, 10, -1, 9, 11, 3, 14, 11, 4, 10, 8, 13, 17, 8, 8, 5, 10, 12, 12, 14, 9, 9, 19, 7, 1, 5, -6, 7, 1, -3, -2, -2, -5, -8, -6, 6, -6, -1, -1, 4, -5, -1, 4, -1, 6, 10, 8, 0, 9, 11, 0, 9, 0, 11, 9, 20, 9, 16, 19, 14, 10, 9, 5, 7, 6, 12, -2, 8, 18, 6, 2, -4, 6, 10, 1, 0, 11, -6, 4, 5, 1, 8, -2, -16, 5, 3, -5, -7, -4, -5, 10, -4, 2, 4, 8, 5, -1, 8, 11, 7, 5, 16, 15, 5, 3, 10, 18, 14, 13, 13, 14, 2, -3, -3, -4, 2, 6, 1, 0, 5, 9, -12, 4, 2, -5, -2, -1, -12, 0, -5, -5, -7, -4, 0, -5, 4, -10, 0, 1, 5, 11, 2, 3, 1, 9, 11, -3, 5, 4, 12, 19, 9, 17, 13, 12, 18, 21, 8, 9, 16, -4, 4, -6, 1, 4, 13, 2, 9, 12, -1, 3, -1, 8, -9, 5, -7, 4, -1, -2, 3, -8, -2, 6, 5, -2, -3, -1, 5, 6, -1, 4, -2, 0, -4, 1, 7, 6, 10, -4, 4, 1, 14, 5, 11, 8, 13, 7, 7, 6, 7, 9, 0, 5, 6, 1, 16, 2, 3, -6, -3, -5, -3, 0, -9, -1, -10, -7, 2, 0, 7, 2, 2, 6, 15, 1, 13, -2, 14, 11, 24, 1, 3, 0, 10, 7, -4, 12, 7, 11, 7, 14, 14, 8, 11, 6, 10, 10, 13, 3, 6, 16, 0, -1, 4, 1, -1, 2, 10, -11, 7, 0, -3, -5, -3, 3, 5, 0, 0, 8, 2, -6, 5, 3, 3, 1, 1, 12, 2, 6, 20, 2, 5, 9, 5, 6, -1, 9, 6, 15, 11, 9, 4, 19, 13, 1, 11, 3, 9, 6, -1, 5, 8, 7, 1, 3, 2, -1, -1, 9, 3, 5, -9, 5, -1, -6, -9, 16, 6, -3, 7, 3, -5, -3, 8, 2, 3, 4, -8, 7, -1, 4, 13, -4, 11, 8, 11, 4, 9, 11, 2, 10, 6, 0, 1, -2, 7, 4, 6, -2, 4, -3, -3, -4, -1, 6, 9, 5, -1, 2, -5, 6, -5, 5, 0, -4, -4, 6, 7, -4, -8, 8, 4, 7, 14, 2, 8]
6173Hj1J1oOJ3j0lLj2J0Mj5QKnmJ2j1j1K2mkojKlPj0NlnNNpP%j0QPRnj%pkJ4j1
6220CnOnRjjRKj1KLnmKkJ3mQj7LKnLoKpOkjPj4K%PJlRrOJlJ5j3jjQJj3RoNqQj
6274DKlJ2k0J4Mj0LkJMLnPj1LoMRpQj6KMJoqNLM%mRpLNNrNkJ1j4nJ1nQpO%qRm
6326A0Kj8J6jKjJqj0QMLnlJ1Kj0LQolqRJj2J4Kj2QNknKPjoJ3qLk%MkoJJlMmlk
6377CKOLrLjj5KJ4LqomJ3KkKJpKjKjlPpJ2oj%Mmn%QLrJ1rJ5qmJlOkNjqNNj3KK
6431GrJ7j2%KojOrMmJ0rMKJLK%NqnMRoLj3MNkQrK%MJKj3KJ0%mkMqPNj3J0qjj2
6483a1J2oMlNjj0J2oJ1mrNKMM%QoojLMoQpMkqNJLj1PQj1JnjJ9qKj0MPjllkj1R
6534@PokmKOlmKPpP%oJPpMLLLLpQk0J6lmJ1j3J0KmrlmLoNJ0Lq%LKKnMRj0pmPk
$$ y = [8, -3, 8, 2, 8, 21, 11, 8, 11, -1, 9, 13, -2, 6, 8, 3, -1, 11, 0, -11, 11, 7, 5, -1, -2, 0, -3, 4, -6, -1, -4, -9, -4, 1, -6, 1, 1, -9, -1, 6, 15, 10, 9, 9, 2, 0, 14, 3, -2, 4, -1, 8, 7, 6, 15, 17, 6, 8, 11, 6, 2, 4, 2, 15, 11, 19, 2, 5, 7, 2, 5, -1, 1, -6, 0, -2, -3, 4, -10, -8, -8, -1, 0, -3, 6, -3, 3, 4, 1, 16, 3, 2, 1, 9, 10, -3, 6, 0, 5, -3, 5, 4, 6, 3, 15, -5, 9, 13, 3, 6, 4, 5, 9, 12, 7, 14, 3, 6, 0, 4, 13, 6, 14, -2, 0, 4, 5, -1, -9, -4, -1, 3, 3, -1, 8, 1, 4, 9, 14, 5, 10, 8, 19, 5, 0, 11, 6, 14, 7, 13, 13, 5, 14, 10, 12, -6, 10, 9, 11, 10, 11, 3, -7, 1, 5, 8, 3, 0, 11, 13, 3, 6, 14, 8, 5, -3, 6, 7, -5, 9, 11, -1, 7, 12, 10, 5, 7, 14, 13, 7, 20, 12, 15, 13, 13, 17, 15, 9, 10, 11, 8, 12, 8, 5, 3, 5, 11, 14, 5, 8, 7, -8, -6, 8, 11, 3, -3, -7, 6, 8, 6, 8, 9, 2, 4, 3, 5, 4, 1, 8, 1, 13, 7, 6, 6, 10, 6, 1, 1, 9, 12, 3, 14, 5, 20, 12, 8, 9, 6, 12, 10, 15, 14, 6, 11, 16, 3, 5, 7, -2, 15, 3, 3, 5, -1, -2, 4, -5, -1, -5, 5, -4, 0, 2, 3, 6, 8, 8, 13, 5, 0, 4, 13, 7, 10, -3, 1, 6, 4, 12, 3, 5, 5, 9, 10, 12, -1, 1, 11, 11, 7, 5, 9, 1, 8, 13, 0, 10, 2, 1, -11, 1, -5, -1, -4, 1, 0, -10, 2, -4, 7, 3, -6, -1, 1, 5, 9, 9, 17, 11, 5, 4, 7, 11, 5, 13, 6, 10, 8, 0, 5, 6, 9, -2, 5, 13, 2, 3, -2, -3, 16, 8, 10, 0, 4, 11, 10, 7, 4, 2, -9, 0, 7, 1, -1, -5, -3, 3, 0, -4, -2, 5, -2, 5, 5, -1, 0, 7, 0, 4, 7, 10, 13, 16, 9, 17, -3, 13, 10, 6, 17, 4, 14, 16, 12, 3, 0, -4, -1, -7, -2, 8, 11, 3, 3, 6, 8, 10, 5, 9, 18, 8, 1, -3, 4, 2]
6588BMlKjJ2qJj0J2nJjJLkKpJ6j8MlRmjkL%jMlj0LLrK0pp%J%j3J3N%mOj1KJ3K
6638A4j2PljjOnMk%Mj%pJ0lpLkjJmMnM%kkkJ2lqJ1j1MJKqLpNKj0K4j3NqP%oJ2
6689A1j7J9j0LnkJ1J2j4j0NPJnnN%PqlJLkk%oRj1QKj3NJ3j2LkNj0LJnnK0j2No
6735fKJ0qQmqJ6jLLj2MJ2rjLMnnjONj3jJlRnPrOLrMnpR%Qm%nJMrNJj1J9rOj0P
6788FmnJ2KlKOnJJ%Lkj5J0jjMoOmj8J4%LOj2rJ5NrlmJ3jKpLLMMrJ4j4rJ7mOpr
6838AJ2j2N%lJ0JqO%%kOMj6P%nQj3J0j0jrQNqJ1nKqJ2jNj2LMj3N%MLkqOlKJ4p
6887Hkj0J1Nj0LlJ%%PkKp%%RkLQj2LknlmNj%pNpOKJ3j2LqMjQnM%LlJJ2j5J0j4
6938A%jMPrLJ%kJ0kj3J6lpMrRj4MJ0rMkJjlMKj0K4j0qJMJ%jjoJ0kJ2j0PjKj2N
$$ y = [2, 6, 3, 5, 4, 16, 8, 9, -1, 11, 6, 7, 6, 7, 10, 8, 10, 3, 19, 1, 5, 2, 11, 7, 6, 4, 7, 7, 6, 10, 7, -3, 0, 3, -6, 14, 7, 0, 0, 1, 1, -12, 1, 6, 6, 2, 8, -3, -1, 12, 14, 2, 9, 6, 5, 4, 10, 5, 9, 7, 7, 11, 10, 10, 3, 13, 10, 3, 6, 4, 3, 4, 0, 4, -1, 3, 3, 1, -1, -3, 9, 6, -2, 9, -2, 2, 3, 5, -3, 0, -7, -2, 0, -10, 14, 1, 6, -2, 5, 5, -1, 11, -6, 13, 3, 6, 1, -1, 10, 22, 8, -2, 3, 10, 11, 6, 1, 6, 6, 13, 5, 2, 3, 6, 4, 2, 2, -4, 5, -6, 2, 4, -9, -4, 9, -3, 0, -2, 3, -7, -4, -3, -8, -13, 7, -5, 0, -6, -4, 6, -2, 6, 2, -6, 10, 9, 12, 15, 3, 7, 19, 10, 9, 12, 16, 11, 6, 5, 11, 16, 3, 2, 3, 0, 9, 4, 11, 2, 8, 11, 2, 6, 1, -6, 3, 3, 11, 7, 7, 2, 3, 7, -2, 3, 4, -7, 12, 3, 9, -1, 6, 2, -3, 9, 11, 8, 10, 16, 11, 12, 13, 13, 16, 14, -1, 9, 8, 7, 11, 5, 11, 7, -11, 3, 3, 6, 12, 0, -9, 6, 11, 2, -1, -5, 8, 7, 9, 2, 5, 8, 12, 16, 7, 21, 7, -2, 15, 11, 17, 10, 1, 13, 1, 6, 6, 3, 13, 14, 6, 12, 12, 12, 10, 16, 20, 4, 11, 11, 6, 14, 1, 11, 1, 0, -9, -1, 4, -4, 7, 2, 4, -4, 8, 7, 12, 0, 3, 7, -6, -1, -1, 3, 6, 4, -4, 2, -1, 1, 15, 8, 6, -4, 7, 12, 2, 5, 2, 3, 3, 3, 10, 8, 10, 3, 3, 3, 12, 10, 13, 21, 9, 12, 10, 5, 2, -2, 3, 2, 2, -5, 0, -7, -1, 1, 14, 2, 5, -3, 1, 0, 8, 3, 7, 7, 10, 7, 8, 20, 5, 15, 1, 1, 0, 4, 11, 2, 5, 6, 6, 4, 14, 12, -1, 15, 12, 5, 9, 0, 9, -5, -1, 9, 0, 4, 2, 3, 2, -1, 3, 5, -5, 19, 9, 1, 2, 6, 7, 7, 6, 5, -1, 9, 7, 19, 9, 16, 15, 17, 5, 10]
6987A0Pj2NqRoKOj0MoOM%lj0PnPpNkoNMlpK0j0%%j1QolJ2nNpRkLnJJJ5j4P%Kr
7038GOpPkj6ROlJ1plj0lRPj0%L%PoMqPJMnMoOpl%KkJ2k%rJ3j1nJ6lplJ4jpJJ%
7090A1j1OpKNjpJ2m%okojJ7j3mJ4KlLj6J4j%jmJ5qNj4PqJ1Mjk%mKMmnJ2nkj0L
7138aRj0J3%oqLo%J1moQo%KloJ0jLKj0LOlLjLm%OJ0j7lJ7omjJ2j4OrNNpK%NqK
7189BKmQlKpPkj1J0LMj4l%J0J1j1jJKrNnJ1q%NlLlLPkjjJlOnj0J6q%JJKj2OJ%
7240DK%%j0J1JnJlJ0rjJNj0J1K%Jk%mjOj1J1lnRLqJ2p%%LqRnknNJj5LOOlj1PR
7291A1qllMjMLoNJj1PKmJ2j0R%j2%J7j3Oj5MLOnmQlNKlJ0j7QNj0%%QkrKK%j0%
7340eJ3j0pLPkjJ3lj5RlKR%j5J5kMJojmkLMOJJrL%Qoj0J3j5NnJ4nOjlj1K%%oO
$$ y = [10, 17, 5, 10, 2, 11, 5, 7, 13, 3, 7, 1, 7, 11, 11, 8, -2, 5, 0, 7, 0, 5, 3, -3, 2, 6, 3, -4, 16, 6, 6, 6, -5, 3, -3, -6, 6, 1, 6, -1, 8, 6, 9, 4, 5, 6, 21, 7, 14, 14, 16, 7, 13, 6, 13, 11, -5, 4, 10, 7, 18, 11, 8, -2, -5, 4, 11, 1, 1, 4, 4, 11, 5, 9, 1, 8, 9, 13, 8, 12, 6, 12, 5, 2, 2, 4, 2, 14, 12, 12, 3, 16, 5, 0, 16, 13, 6, 3, 17, 16, 9, 10, 11, 11, 0, 6, -1, 1, 6, 5, -2, 10, 6, 6, 0, -2, -8, -9, 8, -5, -9, 5, 7, 4, 7, -9, 5, 4, 4, 3, -1, 14, 6, 11, -3, 4, -4, 7, 11, 10, 8, 8, 4, 6, 10, 6, 1, 13, 8, 6, -4, -1, 8, -2, 11, 11, 5, -3, 0, -6, -6, 5, 1, -5, 3, -3, -3, -1, -4, -10, 0, -1, 2, 4, -6, -3, 3, 0, 3, 2, 5, 1, 1, 7, 17, 0, -3, 14, 8, 4, 3, 15, 1, 7, -2, 3, 8, 1, 3, 3, 8, 0, 2, 4, 0, 8, 5, 7, 0, 7, 5, -6, 4, 7, 11, -3, -6, -6, 4, 15, 4, 3, 4, 6, -3, 2, -3, 8, 0, 0, 5, 2, 5, 2, 5, 12, 10, 9, 8, 9, 6, 12, 7, -3, 13, 5, 5, 6, 7, 9, -3, 3, 4, 4, 6, 6, 6, -4, 7, 8, 3, 4, 1, 11, 2, 1, 2, 7, -3, 8, 10, 10, 11, 9, 9, 5, 4, 10, -1, 10, 7, 2, 11, 14, 6, 18, 11, 11, 11, 14, 6, 15, 10, 8, 3, 8, 9, -6, -3, 3, 9, 6, -5, 2, 11, 3, 0, -3, 1, 0, 4, 7, 1, 6, 7, -4, 3, 5, 1, 13, 3, 12, 12, 0, 0, 17, 4, 10, -5, -1, 2, 8, 3, -1, 7, 4, 9, 11, 8, 18, 1, 9, 14, 4, 4, 4, 12, 10, 1, 3, 5, 5, -5, -5, 8, -2, -9, -6, 1, -1, -2, 11, 8, -7, 2, -1, 1, 10, 10, -5, 10, 8, 12, 13, 7, 6, 2, 0, 3, 7, 13, 14, 15, 6, 9, 9, 17, 11, 1, 14, -1, 4, -1, 13, 8, 14, 13, 10, -1, 1, 1, 1, -5, 1]
7390AOkjjmlOL%nJ5ppJJMKkKlRnolJ1j2NJjKMMk3PJMmMmNPLrKnJJKnOKqOrMPj0
7447@Lm%kJ7qqJ5rlOlNlQMpNNj2k%olQJj%JqMMOj0lQj2LQrLjLrJ2j3J3%jPrMJ
7500HJj4QljONj%%noJ2nlLlnMLj1J6nNomKLljj3OJ4pjKL%Mj6J5QkJj6Rj1PoJ4
7550A1Jr%%RojOrpNnkJ8qJ2oj0J3jjrOKlj0Pj0NJ2mookJ0ko%jJ1J1j0lJ3Kj0R
7597A6j3J4joJkmKMqjKKL%knJPnpO%kM%kNjnOj0PoOoPjpP%Noj0RJOj0J2nj1J4
7649A1jKLOlqMmMj2KQj8J2Kkj0OJlMmnRLKnJJNj6J0lL%mQj2J4qjolJ3nKjkOJ3
7699A9j1J1nmmMnQj1KjPkjj4OJ3rj4J2jqJ6rLQ%j5PKkljNL%k0J8MokQmqJ0j2J7
7746A1Kj1J2j5PlMMpKPNkj1%Roj1QNoRj0nLjJkNkojQjJ4j6K0j0k%jKj0J0Nklk
$$ y = [1, 7, 5, 4, 3, -1, -4, 2, 5, 5, 0, 15, 8, 1, 2, 3, 7, 9, 7, 9, 6, 15, 10, 4, 1, 12, 0, 5, 6, 5, 7, 11, 15, -8, -1, 0, 4, 0, 4, 0, 5, 12, 15, 6, 8, 3, 4, 5, 7, 2, 8, 10, 2, 8, -1, 3, 10, 0, 3, -1, -1, -3, 14, 6, -2, 13, 4, 1, 7, 4, 9, 6, 14, 18, 11, 16, 21, 9, 7, 7, 1, -2, 6, 7, 6, 6, 7, -1, 3, 7, 13, 3, 0, 8, -4, -1, 7, -2, 1, 0, 3, -6, 6, -7, 6, 6, 5, 12, 3, 7, 8, 9, -5, 3, 0, -1, 5, 10, 9, 9, 9, 4, -2, 10, 5, 2, 5, 2, -3, 1, 4, -7, 9, 4, 9, 3, -1, 1, 4, 1, 0, -13, -7, 7, 0, -1, 1, 4, 4, 8, -8, 7, 15, 13, 14, -2, 7, -4, 3, -3, 11, 12, 3, 3, 3, 12, 6, 5, 11, 2, -5, 0, -5, -7, 11, 3, 15, 9, -1, 12, 11, 10, 1, 7, 9, 6, -4, 3, -7, -2, 10, 6, 0, -6, -8, 2, 0, -6, -6, -7, 4, 15, 5, 2, 15, 17, 7, 16, 3, 17, 16, 10, 11, 9, 5, 7, 11, 3, 2, 4, 6, 9, 9, 7, 2, 3, 10, 5, -2, 4, 4, 2, 6, 6, 4, 9, 8, 3, 9, -1, 6, 0, 6, 0, 7, 6, -1, 6, 6, 11, 5, -5, 4, 5, 11, 1, 13, 8, -3, 11, 10, 12, 15, 21, 18, 10, 14, 10, 14, 2, 4, 12, -6, 6, 8, 6, -4, 2, 3, 0, 4, 0, -5, 4, 7, 9, 4, 5, 6, 11, -5, 5, 2, 5, 5, 1, 9, -3, 11, 3, 2, -4, -7, 6, 1, 3, 2, 0, 6, 19, 8, 19, 14, 10, 6, 10, 5, 13, 2, 4, 3, 10, 8, 7, -7, -1, 12, 3, -11, 1, 0, -8, 8, -1, 2, 10, 10, -5, 2, 4, 2, -1, -2, 3, 6, 6, -14, 4, 8, 2, 0, 8, 4, -4, 6, -6, 11, 13, 2, 14, -1, 6, 3, 7, 11, 4, 6, 13, 18, 16, 5, 5, 14, 8, -3, 5, 10, 4, 13, 3, -2, 1, 0, 1, -1, 4, 2, -4, -5, 3, 2, 16, 0, 20, 10, 8, 8, 7, 9, -1, 9, 14, 12, 9, 7]
7794GlNrJ6j0KJoOmJ0j3Oj1J3L%molkMMRj3nJ2KmlljMOoQKLj4J0mRj9J1K%Oj3
7842EKMj0QmQ%j0OoJMlNj2J0LknrJ7jkmMnmJ1kj2QnOj3J8j3J5j9QKPj0ORj5jR
7889IknlMLrKOjJ0pLmqQpKNnjQlPrJoRQj1PJpOnj%pJ0Kj4J6nj2J1qOnjjMOKJj
7943IpjJ1jj0MLj0lK0j1poNJ2qqPrJ3lRk0J8nNjlLJ0oj3J5%nNJj3%KJlJ1j0%O
7989G%jqOOnlRrQKqLLrJrJ1qrQMRj2jMkJ4j7J2MlQj4J2pQrJ3j6QmPnnoMPjKqM
8041ELnPjqkMKRj1J2Kj5jnK2j5J0j3nJ0Nlj0QMmMrJ0nMpjJLlLNmKOmj0%KK3k1
8089DnJ5%k1RKlJ2n%p%j0J4LpRKmpQJJmJlPlkMqJNpNj0J6j3RnQmMmpJ1lj%Mq%
8141DoLkKqJ1lJOrNjmLKjkJ1qNlnJjMMjmklQ%mQj0kRlrJ3Lj3MRpJPpkp
$$ y = [7, 4, 9, 0, 16, 6, 8, 9, 3, 9, 5, 15, 2, 8, -3, 10, 13, 13, 9, 3, 0, -2, 2, 6, 15, 2, -3, 9, 11, 7, 4, 1, 0, 4, 10, 4, 12, 14, 17, 3, 13, 9, 18, -1, 10, 12, 12, 18, 5, 7, 11, 1, 9, 5, 13, 13, 3, 9, 3, 4, 8, 5, 10, -2, 8, 11, 9, 4, -5, 12, 11, 9, 5, 9, 4, 0, 11, 9, -3, 5, 0, 6, -7, 11, -2, 13, -6, 2, 4, 11, 1, 7, 16, 1, 0, 9, 7, 2, -1, 3, 6, -3, -1, 5, 4, 14, 7, 10, 6, -2, 6, -1, 1, 6, 1, 0, 8, 5, 12, 3, 4, -2, 7, 15, 4, 11, 12, 5, 11, 6, 5, 5, -2, 8, 10, -4, 12, 7, -5, 6, -2, 4, -1, -2, -3, 1, 7, 9, 10, 9, 2, 1, 12, 11, 1, 5, 8, -2, -5, 15, 4, -3, -9, -4, 8, 0, -8, -1, -10, 3, 0, 9, -11, 7, 2, 7, 6, 3, 6, 16, 10, -3, 12, 12, 7, 12, 13, 0, 0, 2, 3, 0, 11, 1, 1, 7, 7, 6, -2, 4, 10, 5, 2, 11, 2, 10, 12, 4, 7, 10, 1, 2, -7, 4, -4, -13, -5, -1, 8, -4, -5, -1, -3, 11, -6, 6, 10, 7, 15, 1, 13, 6, 14, 5, 18, 2, 10, 6, 13, 8, 3, -3, 1, 8, 7, 9, 1, 5, 8, 3, 10, 9, 1, -1, 3, 5, 14, 3, 15, 17, 2, 1, -4, 18, 3, 13, 0, -5, 5, 10, 7, -3, 5, 9, 5, 9, 0, 10, 5, 9, 2, 1, 2, 5, 2, 5, 10, 6, 8, 14, 10, 0, 0, 2, 25, 4, -1, 14, 14, -7, 2, 4, 1, 13, 8, 8, 1, 1, -9, 5, 8, 1, 10, 12, 8, 1, 9, 10, 11, 7, 8, 5, 12, 9, 7, 11, 3, 4, 9, 2, 7, -3, 13, 0, 9, 4, 12, 8, 12, 8, 1, 12, 9, 8, 8, 12, 4, 4, -2, 1, -1, 1, -7, 4, 1, 2, 8, -1, 4, 3, -1, 2, 4, 3, 1, 12, 4, 9, 6, 1, 2, 1, 5, 9, 8, 4, 2, -1, 7, 7, 3, 11, 1, -1, 8, 5, -4, 9, 12, -1, 3, 12, 5, 6, 13, 6, 4, -3]
8191c
##END NTUPLES=NMR FID
##END=
