##TITLE=1H_BAU-15.01
 CDCl3, 8 sc, 
 18.1.2019
##JCAMPDX= 6.0         $$ Bruker NMR JCAMP-DX V2.0
##DATA TYPE= NMR FID
##DATA CLASS= NTUPLES
##ORIGIN= UXNMR, Bruker Analytische Messtechnik GmbH
##OWNER= root
$$ XWIN-NMR		Version 3.5
$$ Fri Jan 18 14:27:21 2019 Russian Standard Time (UT+4h)  she@DPX200
##.OBSERVE FREQUENCY= 200.1313
##.OBSERVE NUCLEUS= ^1H
##.DELAY= (6, 6)
##.ACQUISITION MODE= SIMULTANEOUS
##.ACQUISITION SCHEME= undefined
##.AVERAGES= 8
##.DIGITISER RES= 18
##SPECTROMETER/DATA SYSTEM= spect
##.PULSE SEQUENCE= zg30
##.SOLVENT NAME= CDCl3
##.SHIFT REFERENCE= (INTERNAL, CDCl3, 0, 15.7039)
##AUDIT TRAIL= $$ (NUMBER, WHEN, WHO, WHERE, WHAT)
$$ ##TITLE= Audit trail, XWIN-NMR		Version 3.5
$$ ##JCAMPDX= 5.01
$$ ##ORIGIN= Bruker BioSpin GmbH
$$ ##OWNER= she
$$ F:/spectra/data/she/nmr/H-F/1/audita.txt
$$ ##AUDIT TRAIL=  $$ (NUMBER, WHEN, WHO, WHERE, WHAT)
(   1,<2019-01-18 14:26:11.79 +0400>,<she>,<DPX200>,
      <created by zg, POWCHK disabled, PULCHK disabled
       terminated by command 'halt'
       configuration hash MD5:
       00 E9 B6 7A A2 85 ED C7 34 08 36 98 17 FE 4E 26
       data hash MD5: 16K
       A3 F8 D1 0A 72 55 69 01 DB 76 12 1F 27 C6 93 31>)
$$ ##END=
$$ 
$$ hash MD5
$$ B5 75 86 A1 71 55 B3 48 95 CF 56 6D F7 FE 9E F0
##$RELAX= 
##$RELAX= 
##$RELAX= 
##$RELAX= 
##$RELAX= 
##$RELAX= 
$$ Bruker specific parameters
$$ --------------------------
##$DU= <F:/spectra>
##$EXPNO= 1
##$NAME= <H-F>
##$PROCNO= 1
##$TYPE= <nmr>
##$USER= <she>
##$AMP= (0..31)
100 100 100 100 100 100 100 100 100 100 100 100 100 100 100 100 100 100 
100 100 100 100 100 100 100 100 100 100 100 100 100 100 
##$AQSEQ= 0
##$AQ_mod= 1
##$AUNM= <au_zg>
##$AUTOPOS= <>
##$BF1= 200.13
##$BF2= 200.13
##$BF3= 200.13
##$BF4= 200.13
##$BF5= 200.13
##$BF6= 200.13
##$BF7= 200.13
##$BF8= 200.13
##$BYTORDA= 1
##$CFDGTYP= 0
##$CFRGTYP= 5
##$CHEMSTR= <none>
##$CNST= (0..31)
1 1 145 1 1 1 1 1 1 1 1 1 1 1 1 1 1 1 1 1 1 1 1 1 1 1 1 1 1 1 1 1 
##$CPDPRG= <>
##$CPDPRG1= <>
##$CPDPRG2= <>
##$CPDPRG3= <>
##$CPDPRG4= <mlev>
##$CPDPRG5= <mlev>
##$CPDPRG6= <mlev>
##$CPDPRG7= <mlev>
##$CPDPRG8= <mlev>
##$CPDPRGB= <>
##$CPDPRGT= <>
##$D= (0..31)
0 1.2 0 0 0 0 0 0 0 0 0 0.03 0 0 0 0 0 0 0 0 0 0 0 0 0 0 0 0 0 0 0 0 
##$DATE= 1547807171
##$DBL= (0..7)
120 120 120 120 120 120 120 120 
##$DBP= (0..7)
150 150 150 150 150 150 150 150 
##$DBP07= 0
##$DBPNAM0= <>
##$DBPNAM1= <>
##$DBPNAM2= <>
##$DBPNAM3= <>
##$DBPNAM4= <>
##$DBPNAM5= <>
##$DBPNAM6= <>
##$DBPNAM7= <>
##$DBPOAL= (0..7)
0.5 0.5 0.5 0.5 0.5 0.5 0.5 0.5 
##$DBPOFFS= (0..7)
0 0 0 0 0 0 0 0 
##$DE= 6
##$DECBNUC= <off>
##$DECIM= 32
##$DECNUC= <off>
##$DECSTAT= 4
##$DIGMOD= 1
##$DIGTYP= 9
##$DL= (0..7)
0 120 120 120 120 120 120 120 
##$DP= (0..7)
150 150 150 150 150 150 150 150 
##$DP07= 0
##$DPNAME0= <>
##$DPNAME1= <>
##$DPNAME2= <>
##$DPNAME3= <>
##$DPNAME4= <>
##$DPNAME5= <>
##$DPNAME6= <>
##$DPNAME7= <>
##$DPOAL= (0..7)
0.5 0.5 0.5 0.5 0.5 0.5 0.5 0.5 
##$DPOFFS= (0..7)
0 0 0 0 0 0 0 0 
##$DQDMODE= 0
##$DR= 18
##$DS= 0
$$ [...]
##$SUBNAM2= <"">
##$SUBNAM3= <"">
##$SUBNAM4= <"">
##$SUBNAM5= <"">
##$SUBNAM6= <"">
##$SUBNAM7= <"">
##$SUBNAM8= <"">
##$SUBNAM9= <"">
##$SW= 20.0189088683792
##$SWIBOX= (0..15)
0 0 2 0 0 0 0 0 0 0 0 0 0 0 0 0 
##$SW_h= 4006.41025641026
##$TD= 16384
##$TD0= 1
##$TE= 0
##$TE2= 300
##$TE3= 300
##$TEG= 300
##$TL= (0..7)
0 120 120 120 120 120 120 120 
##$TP= (0..7)
150 150 150 150 150 150 150 150 
##$TP07= 0
##$TPNAME0= <>
##$TPNAME1= <>
##$TPNAME2= <>
##$TPNAME3= <>
##$TPNAME4= <>
##$TPNAME5= <>
##$TPNAME6= <>
##$TPNAME7= <>
##$TPOAL= (0..7)
0.5 0.5 0.5 0.5 0.5 0.5 0.5 0.5 
##$TPOFFS= (0..7)
0 0 0 0 0 0 0 0 
##$TUNHIN= 0
##$TUNHOUT= 0
##$TUNXOUT= 0
##$USERA1= <user>
##$USERA2= <user>
##$USERA3= <user>
##$USERA4= <user>
##$USERA5= <user>
##$V9= 5
##$VALIST= <valist>
##$VCLIST= <CCCCCCCCCCCCCCC>
##$VD= 0
##$VDLIST= <DDDDDDDDDDDDDDD>
##$VPLIST= <PPPPPPPPPPPPPPP>
##$VTLIST= <TTTTTTTTTTTTTTT>
##$WBST= 1024
##$WBSW= 4
##$XGAIN= (0..3)
0 0 0 0 
##$XL= 0
##$YL= 0
##$YMAX_a= 204647
##$YMIN_a= -195714
##$ZGOPTNS= <>
##$ZL1= 120
##$ZL2= 120
##$ZL3= 120
##$ZL4= 120
##$ABSF1= 10
##$ABSF2= 0
##$ABSG= 5
##$ABSL= 3
##$ALPHA= 0
##$AQORDER= 0
##$ASSFAC= 0
##$ASSFACI= 0
##$ASSFACX= 0
##$ASSWID= 0
##$AUNMP= <proc_1d>
##$AZFE= 0.1
##$AZFW= 0.1
##$BCFW= 1
##$BC_mod= 2
##$BYTORDP= 1
##$COROFFS= 0
##$CY= 11.3945322036743
##$DATMOD= 1
##$DC= 2
##$DFILT= <>
##$DTYPP= 0
##$F1P= 18.9103706918063
##$F2P= -1.10871071338519
##$FCOR= 0.5
##$FTSIZE= 0
##$FT_mod= 4
##$GAMMA= 1
##$GB= 0.15
##$INTBC= 1
##$INTSCL= 1
##$ISEN= 128
##$LB= 0.24
##$LEV0= 0
##$LPBIN= 0
##$MAXI= 10000
##$MC2= 0
##$MEAN= 0
##$ME_mod= 0
##$MI= 1.114404
##$NCOEF= 0
##$NC_proc= 0
##$NLEV= 6
##$NOISF1= 3.799351
##$NOISF2= 2.8
##$NSP= 1
##$NTH_PI= 0
##$NZP= 0
##$OFFSET= 15.70392
##$PC= 1
##$PHC0= -9054.397
##$PHC1= 12.80004
##$PH_mod= 1
##$PKNL= yes
##$PPARMOD= 0
##$PSCAL= 0
##$PSIGN= 0
##$REVERSE= no
##$SF= 200.130013532006
##$SI= 16384
##$SIGF1= 3
##$SIGF2= 2
##$SINO= 400
##$SIOLD= 16384
##$SREGLST= <1H.CDCl3>
##$SSB= 0
##$STSI= 0
##$STSR= 0
##$SW_p= 3612.71676300578
##$SYMM= 0
##$S_DEV= 0
##$TDeff= 0
##$TDoff= 0
##$TI= <>
##$TILT= no
##$TM1= 0
##$TM2= 0
##$TOPLEV= 0
##$USERP1= <user>
##$USERP2= <user>
##$USERP3= <user>
##$USERP4= <user>
##$USERP5= <user>
##$WDW= 1
##$XDIM= 8192
##$YMAX_p= 0
##$YMIN_p= 0
$$ End of Bruker specific parameters
$$ ---------------------------------
##NTUPLES= NMR FID
##VAR_NAME=  TIME,          FID/REAL,        FID/IMAG
##SYMBOL=    X,             R,               I
##VAR_TYPE=  INDEPENDENT,   DEPENDENT,       DEPENDENT
##VAR_FORM=  AFFN,          ASDF,            ASDF
##VAR_DIM=   8192,          8192,            8192
##UNITS=     SECONDS,       ARBITRARY UNITS, ARBITRARY UNITS
##FACTOR=    0.0002496,     1,               1
##FIRST=     0,             0,               0
##LAST=      2.0444736,     0,               0
##MIN=       0,             -195714,         0
##MAX=       2.0444736,     204647,          0
$$ Real data points
##PAGE= N=1
##DATA TABLE= (X++(R..R)), XYDATA
0@%%%%%%%%%%%%%%jRj6J6j6K2l0L2m0M8n5O3p2Q5r6J10j26J45j65J86k10K36k66
$$ 0 0 0 0 0 0 0 0 0 0 0 0 0 0 0 -1 8 -8 8 -8 14 -16 16 -24 24 -31 32 -40 45 -51 59 -67 78 -87 99 -111 125 -141
37a41K99l36L76m18M64n14N70o33P01p73Q52r39J034j138J254j383J525j685J864
$$ -141 158 -178 198 -220 244 -270 300 -333 368 -405 447 -492 542 -596 658 -725 800 -885 979
56I79k065K297k568K883l259L719m290N027o024P448r665J3648k3102R0318J15283
$$ 979 -1086 1211 -1357 1526 -1733 1986 -2304 2723 -3301 4147 -5518 8130 -14972 75346 190629
71A90629J138J2880p0739n7595p2787q1989o0642k5521l1088K5419N9362M6626
$$ 190629 191767 204647 133908 76313 3526 -78463 -139105 -164626 -195714 -170295 -110933 -64307
83f4307N9795Q4826M0144K1524J7739k4778m7879l4830o4276o1996j9674j8431
$$ -64307 -4512 80314 120458 141982 159721 134943 87064 52234 -12042 -74038 -93712 -112143
95a12143j6799L1646L6431K7812N0354L8923J0403K3396L150l4187j7249j3512
$$ -112143 -128942 -97296 -60865 -33053 17301 56224 66627 90023 93173 58986 41737 28225
107B8225m2850k3551k302j5893K030J8747Q99J6146K9580k860j83K2196n831j4918
$$ 28225 -14625 -38176 -40478 -56371 -54341 -35594 -34695 -18549 11031 8171 7988 30184 24353 9435
121I435J0515m879j1662R267m522j1500J3549l171j9771P638J068k0086L415O427
$$ 9435 19950 15071 3409 12676 8154 -3346 10203 7032 -12739 -5101 -4033 -24119 -20704 -14277
135a4277j0793J0731J3529p063J3829J9304r634J567J3658j3448r127M847j6095
$$ -14277 -25070 -14339 -810 -7873 5956 25260 15626 17193 30851 17403 8276 13123 -2972
148b972r507P681j3255q132J6868k846q451J7895N350n895J4044L144o686J3810
$$ -2972 -12479 -4798 -18053 -26185 -9317 -12163 -20614 -2719 2631 -3264 10780 13924 7238 21048
162B1048Q22j6606P575J934k2219k808K728j7753j291P451p329R980J9570j134
$$ 21048 21870 5264 12839 14773 -7446 -10254 -7526 -25279 -26570 -19119 -26448 -16468 3102 1968
176A968J1700K3951m207m280R558j5666j9731l846k1132k0207N163n713o085K3681
$$ 1968 13668 37619 33412 29132 38690 23024 3293 -553 -21685 -41892 -36729 -42442 -48527 -24846
190b4846J6326O162K6987J6714k134J0616k649k5013q088j0733l1809r719L345
$$ -24846 -8520 -2358 24629 41343 39209 49825 47176 22163 14075 3342 -28467 -38186 -34841
203c4841j1292O831K1555O008J6815K4573j245K760J0932j7640j9122j0j7819
$$ -34841 -46133 -39302 -17747 -11739 5076 29649 28404 31164 42096 24456 5334 5324 -12495
216a2495j9051N256k009k009K0125J0477K717K1557P628j1152N151l063k2674
$$ -12495 -31546 -26290 -28299 -30308 -10183 294 3011 24568 32196 21044 26195 23132 458
229D58n702m993j8185J430Q362n948J1453K0066r30P125J4642p348n812L235j6091
$$ 458 -5244 -10237 -28422 -26992 -18630 -24578 -13125 6941 6011 13136 27778 20430 14618 17853 1762
244A762j2177M046j1676q754J4449K827j689J7845P656k692J1306n88j3195J971
$$ 1762 -10415 -6369 -18045 -26799 -12350 -9523 -11212 6633 14289 11597 22903 22315 9120 11091
258A1091n869k0107J56R51j3449N415J1511k637J0735J5056k856O767J0818j0857
$$ 11091 5222 -14885 -14729 -13778 -27227 -21812 -10301 -12938 -2203 12853 9997 16764 27582 16725
272A6725m875M837j4068j0855L940r930p100J0161k094k715J5309L316m085J2949
$$ 16725 11850 16687 2619 -8236 -4296 -14226 -21326 -11165 -13259 -15974 -665 2651 -1434 11515
286A1515K719q808O358o69j2342L521K9j3108L824N561r671M069R416n878L477
$$ 11515 14234 5426 11784 11115 -1227 2294 2323 -10785 -6961 -1400 -11071 -7002 2414 -3464 13
301A3R417o338N83Q267r050l832Q069q721p322P745m316o964Q513j028m062J0825
$$ 13 9430 3092 3675 11942 2892 -940 7129 -1592 -8914 -1169 -5485 -12449 -3936 -4964 -9026 1799
317A799J057n369J1319K922q628O500K437j1147K117J686j2340P31L891j0300
$$ 1799 2856 -2513 8806 11728 3100 9600 12037 890 3007 4693 -7647 -6916 -3025 -13325
331a3325J772R204n953K889J1292l758Q76J0444o325m239Q099q181q810O443m906
$$ -13325 -11553 -2349 -8302 -5413 5879 2121 2997 13441 7116 2877 10976 2795 -6015 428 -4478
346d478q163Q005L70m221J0648L167m732R875L001j0582L953J388j2991j146J841
$$ -4478 -12641 -4636 -4266 -8487 2161 5328 596 10471 13472 2890 6843 8231 -4760 -5906 -4065
361d065j0445Q44O559n468M860J1995k663L894J1760m030l011O724q248r005L209
$$ -4065 -14510 -13666 -7107 -12575 -7715 4280 1617 5511 17271 13241 10230 16954 8706 -299 2910
376B910q083j0043N440k497n856R714M276k298J1141N472m363P451K854j0320
$$ 2910 -5173 -15216 -9776 -12273 -18129 -8415 -4139 -6437 4704 10176 5813 13264 16118 5798
390E798J106J091j2685k075K725r042K50P272m227L999J1188k968J417J0840l646
$$ 5798 6904 7995 -4690 -6765 -4040 -13082 -12832 -5560 -9787 -5788 5400 2432 3849 14689 11043
405A1043m985O052o266q683K918n690q732N255j250n296R128M238l304R813O672
$$ 11043 6058 12110 5844 -2839 79 -5611 -14343 -9088 -10338 -15634 -6506 -2268 -5572 4241 10913
420A0913m133O168M223q552O22J833j1613l221J385j0117k799N410n624R22J0320
$$ 10913 6780 12948 17171 8619 9241 11074 -539 -3760 -2375 -12492 -15291 -9881 -15505 -14583 -4263
435d263o42K287J2335R78j156Q631k323o949K711o281j1180Q29m973r323M688
$$ -4263 -4905 -2618 9717 10695 9539 18170 15847 8898 11609 5328 -5852 -5023 -9996 -19319 -14631
450a4631K956l593R243R689j191Q670Q002m843J006J414j1965n538j418j2296
$$ -14631 -11675 -15268 -6025 3664 2473 11143 19145 14302 15308 16722 4757 -781 -2199 -14495
464a4495m948M484m178J588J2780L129M207J3696J967k039N950m882j0989j335
$$ -14495 -19443 -14959 -19137 -17549 -4769 -1640 2567 16263 18230 16191 22141 17259 6270 4935
478D935q000j2388O46j472o038P797P972o51R975R922k490L517L751q423k946
$$ 4935 -3065 -15453 -14807 -16279 -22317 -14520 -6548 -7199 2776 12698 10208 13725 17476 9053 6107
493F107k38j0390l504L476o022m45R232j056P75R028r98l286M747l991o654L275
$$ 6107 5869 -4521 -8025 -4549 -10571 -11016 -1784 -2840 -2065 6963 5965 2679 7426 3435 -3219 56
509E6k996o098N403J725l686P185M277m666N011K727p666N90J673q248k14L112
$$ 56 -2940 -9038 -3635 -1910 -5596 1589 5866 1200 6211 8938 1272 1862 3535 -4713 -4927 -1815
525a815n196J672O678k762J474P235l896k200N231n079n032L840l528m566N745
$$ -1815 -7011 -5339 1339 -1423 51 7286 3390 1190 6421 1342 -3690 150 -3378 -7944 -2199
540b199n61k691P183J313l578N627J394o266L322J126p023J815K667n670K176
$$ -2199 -2760 -5451 1732 3045 -533 5094 6488 222 3544 4670 -2353 -538 2129 -3541 -1365
555a365M225n379O77M099n682j307M240n076j421O195j912l92Q738L68j448P241
$$ -1365 2860 -2519 -1842 2257 -3425 -4732 -492 -5568 -6989 -794 -2706 -3098 5640 6008 4560 11801
571A1801j599m941K470m321q732N73l048p077L971K871k618P257P682p70N048
$$ 11801 10202 5261 7731 3410 -5322 -4749 -7797 -14874 -10903 -8032 -10650 -3393 4289 3519 8567
586H567N767m487n40J276r302m197J039p754k735N042k092N30Q980J434M17Q090
$$ 8567 14334 9847 9307 10583 1281 -2916 -1877 -9631 -12366 -7324 -9416 -8886 94 1528 1945 10035
602A0035k89l610L833l004p094J625k871o976K322N56m987M233L706l295M597
$$ 10035 9746 6136 9969 6965 -129 1496 -1375 -8351 -6029 -5473 -10460 -6227 -2521 -5816 -1219
617a219N494l201L111N329l969P58L956n337k227K509o865m597K550n418l989
$$ -1219 4275 1074 4185 9514 5545 6303 10259 4922 2695 5204 -1661 -6258 -3708 -9126 -13115
632a3115M989j305m90Q217K906P54Q432K832l375L771j118q687j314l150r347
$$ -13115 -8126 -9431 -9921 -1704 1202 1956 10388 13220 9845 13616 12498 3811 2497 -653 -10000
647a0000j211O72m692L747O620n7O149Q190q98K223M419n895m062L06p888n923
$$ -10000 -11211 -10539 -15231 -11484 -4864 -4921 1228 9418 8520 10743 15162 9267 5205 5511 -2377 -8300
663h300J647m198l181O423J339M37Q389L099r98O192P31n492K097j261q049J16
$$ -8300 -6653 -10851 -14032 -7609 -6270 -5833 2556 5655 4657 10849 11580 6088 8185 6924 -1125 -1009
679a009p01o636N56K327l965K234M942k542K823O550k139J106N644k437j594L731
$$ -1009 -1710 -8346 -7790 -5463 -9428 -7194 -2252 -4794 -1971 4579 2440 3546 9190 6753 5159 8890
695H890l919m242K137m348n328K227k116m241M896J605j821O581L988j436M894
$$ 8890 4971 729 2866 -1482 -6810 -4583 -6699 -10940 -6044 -4439 -6260 321 4309 2873 7767
710G767K862m560M90J73p502j796R3o474m80L759k573K523P163j15J945O585j459
$$ 7767 10629 6069 6559 6732 -770 -2566 -2473 -8947 -9427 -5668 -8241 -5718 1445 1330 3275 9860 8401
727H401k193K890m601n712J034m130n694K762m09k560N993L712j269O069L921
$$ 8401 6208 9098 4497 -1215 -181 -4311 -10005 -7243 -7652 -10212 -4219 -507 -1776 4293 8214
742H214k959K636J468n746n39Q0o496j209K169m718Q5M767k148P48N804j199m82
$$ 8214 5255 7891 9359 3613 3074 3154 -3342 -4551 -2382 -7100 -7015 -2248 -4396 -3648 2156 957 475
759D75M601j479k805L314k042l861L379j853l682L674L30l625L503J719l185K406
$$ 475 5076 3597 792 4106 2064 -1797 1582 -271 -3953 -279 51 -3574 -71 1648 -1537 869
775H69K073l859J627K079m034O76K267m280J88L203l548m12M347k579p83M894
$$ 869 2942 -917 710 2789 -1245 -569 1698 -2582 -2394 809 -2739 -3151 1196 -1383 -2166 2728
791B728j812j407M255j498k160L620j315l581K757p35m167K591K67l526K650J457
$$ 2728 916 -491 3764 2266 106 3726 2411 -1170 1587 852 -3315 -724 -457 -3983 -1333 124
807A24l269K342K572l343K073K670l673J203K777m021j62L303l234j009L911k464
$$ 124 -3145 -803 1769 -1574 499 3169 -504 699 3476 -545 -707 2596 -638 -1647 2264 -200
823b00j496L803j813j894L394j551k856L220o24l343L140M72l438L196J124k715
$$ -200 -1696 2107 294 -1600 1794 243 -2613 607 -17 -3360 -220 252 -3186 10 1134 -1581
839a581K520J845l362J875K291m116R77K317l829l91L294l482q38L727k709r03
$$ -1581 939 2784 -578 1297 3588 -528 449 2766 -1063 -1454 1840 -1642 -2480 1247 -1462 -2365
855b365L423j548j407L496j555k277L885j325k717L556L7l042L109J319l483K470
$$ -2365 1058 -490 -1897 1599 44 -2233 1652 327 -2390 1166 1203 -1839 1270 2589 -894 1576
871A576J290l740J715J661m171O08K072l854K51K888l061P2M067k330l31L904
$$ 1576 2866 -874 841 2502 -1669 -1061 1011 -2843 -2592 296 -2765 -2693 1374 -956 -1287 2617
887B617j503j356L589j724k600L233j611k933K898m66k970L194O80l074K710J510
$$ 2617 1114 -242 3347 1623 -977 2256 645 -2288 610 144 -2826 368 1048 -2026 684 2194
903B194l413J770J526l551J090J647l489J08K806k987P3L588j961j50L621j685
$$ 2194 -1219 551 2077 -1474 -384 1263 -2226 -2118 688 -2299 -2226 1362 -599 -749 2872 1187
919A187r15L355j596k060K857k013k926K610j074l299K779K16l078K805J333k444
$$ 1187 272 3627 2031 -29 2828 815 -2111 499 -575 -3874 -1095 -879 -3957 -1152 181 -2263
935b263K751J790k603J992K076l026R16K394l883m70K068l516r97K723k592r83
$$ -2263 488 2278 -325 1667 3743 717 1633 4027 144 -326 1742 -1774 -2771 -48 -2640 -3623
951c623L416r69q39M019o76j532L711n88l137K813j152l999J744j75l417J762
$$ -3623 -207 -1176 -2015 2004 1328 -204 3507 2919 -218 2595 1443 -2556 -812 -987 -4404 -2642
967b642J764k502K853K875j981K454L192l419M28J412m088k123J518m203j741
$$ -2642 -878 -3380 -527 2348 367 2821 6013 2594 3022 4434 346 -1777 -259 -4462 -6203
982f203K450j683k97M549N21L17N371L64j380L071p97m176N89j921n031O80m86
$$ -6203 -3753 -5436 -5733 -1184 -663 -346 5025 5389 4009 7080 6283 2107 2696 775 -4256 -3576 -4062
999d062l207K205K417j331L412L965j505K162K762l298p12J081m461k072J132
$$ -4062 -7269 -5064 -2647 -3978 -566 3399 1894 4056 6818 3520 2808 3889 -572 -2644 -1512
1014a512l163j257L119l62L12M410J159q45L750j3l200J506j324m901O43m24m057
$$ -1512 -4675 -5932 -2813 -3175 -2863 1547 2706 1861 5611 5598 2398 3904 2580 -2321 -1678 -2102 -6159
1031f159J308J860j858K828L516j132J897L276k658p2J651l454j366J304k890
$$ -6159 -4851 -2991 -4849 -2021 1495 363 2260 5536 2878 2806 4457 1003 -363 941 -1949
1046a949j535K535j130q74L552m99r16L054o17k288J742l54l223J563M55k267
$$ -1949 -3484 -949 -2079 -2953 599 100 -816 2238 1621 -667 1075 721 -2502 -939 -484 -2751
1062b751K141J600j964K463K088k563J185J196l253n21J145l244q63K226j949
$$ -2751 -610 990 -974 1489 3577 1014 2199 3395 142 -379 766 -2478 -3341 -1115 -3064
1077c064j08L343n65K18L371p62j316K311j894k740J575j417l106K174K69j511
$$ -3064 -3172 171 -394 -176 3195 2433 1117 3428 1534 -1206 369 -1048 -4154 -1980 -1711 -3222
1093c222K830K045j373K755J723k451N66R69m134r94M95l383o13J881j415L18
$$ -3222 -392 1653 280 3035 4758 2307 2873 3842 -292 -1286 -791 -4174 -4787 -2906 -4321 -4003
1109d003L789K70Q31L693q52p84K242j702l019P74j713l326J286l77j907K608
$$ -4003 -214 56 887 4580 3728 2944 5186 3484 465 1239 -474 -3800 -2514 -2891 -4798 -2190
1125b190J856j127K799J886j871J323J378l495k10P68l522m19J504k016N63K748
$$ -2190 -334 -1461 1338 3224 1353 2676 4054 559 349 1117 -2405 -2824 -1320 -3336 -2773 -25
1141b5k87L66L125o55o43K357j798k584J456j815k976J389j34k273K703J085j117
$$ -25 -312 54 3179 2524 1881 4238 2440 -144 1312 -503 -3479 -2090 -2224 -4497 -1794 -709 -1826
1158a826K845J624j836J780J168k920M05L80l245l7J268k344M30K468j156N12
$$ -1826 1019 2643 807 2587 3755 835 1240 1620 -1625 -1662 -394 -2738 -2308 160 -996 -484
1174d84K871q86o90J994j510k100J178j471k258J752l49j480K612J324j098K885
$$ -484 2387 1501 811 2805 1295 -805 373 -1098 -3356 -1604 -1953 -3433 -821 503 -595 2290
1190B290J309j926J469M69l261K4K35l323j42J162j818N35K667r57J038K945p97
$$ 2290 3599 1673 3142 3611 350 374 609 -2714 -2856 -1694 -3512 -2977 -310 -1267 -229 2716 1919
1207A919m04J777j810j745J263j629k311J908p02j155K614Q48j074K470R99k193
$$ 1919 1515 3292 1482 -263 1000 -629 -2940 -1032 -1734 -2889 -275 573 -501 1969 2968 775
1223G75J760ok904N09J76l175M17J403k343R41K355q24M80K709q51l52K024j293
$$ 775 2535 2529 -375 134 310 -2865 -2448 -1045 -3388 -2447 -92 -916 -436 2273 1422 1070 3094 1801
1241A801j579J867j919j726J587j082j569K365Oj549J887N97j862J654R47k095
$$ 1801 222 2089 170 -1556 31 -1051 -2620 -255 -249 -1798 89 686 -1176 478 1425 -670
1257f70J239R92k374P89J294k341M08J469j915J60J882j435lJ968j353m48K113
$$ -670 569 1561 -813 -24 1270 -1071 -663 806 -1109 -949 933 -502 -505 1463 110 -338 1775
1274A775j215r09J635j072j870J623o88j926K025J23j626J963Q57j336J833J196
$$ 1775 560 -349 1286 214 -1656 -33 -721 -2647 -622 -499 -2125 -162 695 -641 1192 2388
1290B388j657R09Q60k362R3Q42k367k47J581j879j01J986q90q8K072r04o03K094
$$ 2388 731 1640 2500 138 231 1073 -1294 -1541 40 -1839 -1940 46 -844 -932 1140 236 -367 1727
1308A727r91j296J666p88j542J583l6j260J375L76j464J350M71j694J148O24k052
$$ 1727 736 -560 1106 318 -1224 359 323 -937 438 814 -650 700 1171 -523 625 1249 -803
1325h03M41R77j917M78J280j348Q4J517j369L5J526j051o19J730p00q75J809l85
$$ -803 -362 615 -1302 -824 456 -892 -808 709 -660 -625 901 -150 -769 961 261 -614 1195 810
1343H10j167J492k16j501J526j26k147Q66J66j604Q77P76j244R53J267j365P60
$$ 810 -357 1135 919 -582 944 818 -1329 -463 -297 -1901 -1024 -248 -1492 -539 728 -637 123
1360A23J624j398J29J411j759l78J124j393n65J563r14o27J604m40r23J952n04
$$ 123 1747 349 478 1889 130 -248 876 -517 -1082 481 -433 -1060 544 104 -819 1133 629
1377F29j258J277k41j550J118K23j585J386N82j801J290J082j573N57J161j336
$$ 629 -629 648 407 -1143 -25 198 -1387 -1 581 -1220 70 1152 -421 136 1297 -39
1393c9n0J322j361k60J549j556l66J503j032p71J305n54j303J928l92j292J682
$$ -39 -89 1233 -128 -388 1161 -395 -761 742 -290 -1061 244 -310 -1613 315 -77 -1369 313
1410C13K63j039J619M11j633J274K1j762O00M88j938Q27N98j381P45R12q62L10
$$ 313 576 -463 1156 1567 -66 1208 1229 -533 67 555 -1383 -556 42 -1339 -594 318 -544 -234
1428b34J294j006k17J253j309r33J657j048p17J383j27p44J841k08p06J385j07
$$ -234 1060 54 -163 1090 -219 -1152 505 -543 -1260 123 -4 -748 1093 885 179 1564 1457
1445A457j535O01k28j503P83J86j587Q54J302j633J049J166q10L25J246j538j71
$$ 1457 -78 523 295 -1208 -425 -239 -1826 -972 330 -1303 -254 912 102 427 1673 135 -36
1462c6P58j427l41J318o08n13J635l43n28J418k98j090P39n85j503Q75j79r87
$$ -36 722 -705 -1046 272 -336 -849 786 443 -85 1333 1035 -55 684 99 -1404 -529 -708 -1695
1480a695R96O20j006J251R37q75Q40R01j528k19Q76j605k61J025j296J46J210
$$ -1695 -699 -79 -1085 166 1103 228 1068 1969 441 222 1098 -507 -768 257 -1039 -893 317
1497C17o60j58J490n99l80J203q53j369J371o36j082J171j47n60P12P28q30R27
$$ 317 -343 -501 989 390 10 1213 360 -1009 362 -274 -1356 -185 -332 -892 -180 548 -282 645
1515F45Q00j496P29O59j730L52P56j447j52J114j032r5J334r05l88J269n96o98
$$ 645 1445 -51 678 1337 -393 -41 715 -732 -884 230 -802 -897 437 -468 -856 413 -183 -881
1533h81J387n75m95J230k9q32J301j30r38P67p2j368O24O8j367O14P85j168N06
$$ -881 506 -69 -564 666 637 -195 1106 976 38 805 733 -635 -11 57 -1310 -696 89 -1079 -573
1552e73J407j439N49J370r37k44R08j160n06J060r98n24J369m07p52J679k48n54
$$ -573 834 -605 -56 1314 377 133 1041 -119 -625 435 -563 -1087 282 -125 -877 802 554 0
1570@R20j13j050Q51r5j232P03K02j311P16K18q11N89P78p90J44J197j135M06
$$ 0 920 807 -243 608 513 -719 -16 186 -1125 -409 -191 -1002 -413 365 -425 -281 916 -219 187
1589A87P41o44j19J058q22m80J082r69q22Q48p58q26R93j48o50J177L82m37R65
$$ 187 928 284 165 1223 401 -79 1003 34 -788 60 -698 -1524 -531 -679 -1329 -152 230 -207 758
1608G58L62o55O17M90j649K80Q3j511J78O90j053M74J271p32M75J209n99N4P80
$$ 758 1120 465 1082 1572 -77 203 286 -1225 -1047 -357 -1410 -936 335 -397 78 1287 688 742 1522
1627A522o41r09L76q22j178R53l93o07J438K55l54J403M46q61R89O8j502M02q6
$$ 1522 881 -28 348 -474 -1652 -699 -1092 -1699 -261 -6 -360 1043 1489 628 1617 1685 183 585 499
1646D99j527M71L44j174M12R46p97K88J254r17oJ108m41m28P19n94m59J152l18
$$ 499 -1028 -557 -213 -1387 -975 -29 -826 -538 716 -201 -207 901 460 32 751 157 -302 850 532
1665E32r73R06k91o59M89N2j053Q95L7r79J095M69o77P77K24p16L71L85j248j61
$$ 532 -441 465 174 -485 4 56 -997 -102 -65 -1044 51 520 -157 620 844 128 499 884 -364 -525
1685e25O07o54k78O12l37J89Q50m8N9O76n4p53M25k84j092M41n42p44N36J59n46
$$ -525 82 -572 -850 -238 -575 -386 464 416 475 1151 1097 344 769 485 -607 -166 -708 -1452 -916 -757 -1303
1706a303J281M21l60N87P06p64p5M46r26k42M87o25l67P56l88m28J014k77k43
$$ -1303 -22 399 39 626 1332 568 493 939 13 -229 258 -367 -734 22 -366 -794 220 -57 -300
1725c00R01n82n30O97l26n16P91j4n17Q92M1o88P74N6p58L89j0q79N39j47k98
$$ -300 601 19 -511 186 -140 -656 135 121 -396 496 537 -151 623 679 -79 310 300 -579 -40 -187 -485
1746d85J64N42n29R5N28l05n5M15n16m28O13p21kR55l65k13J065p7n38P91m70
$$ -485 -321 221 -308 -213 315 10 -45 370 -146 -574 39 -682 -684 271 -94 -307 758 681 143 934 464
1767D64p24O91j56q58M48K16o75J00R93q86J58P48o98J65M50m81j80L38m88j54
$$ 464 -260 431 275 -583 -135 81 -594 -494 499 -387 -229 519 -179 -14 436 -45 -225 113 -375 -529
1787e29Q36j43j48J022k61n59O57k64q84L45k18r38O43K6o51Q65J14k77R17K83
$$ -529 307 164 16 1038 777 218 875 611 -273 72 -146 -1084 -441 -415 -1066 -201 -87 -364 553 836
1807H36p83K38M40r06K15K66r45J07N60n91N14M71l19l49J532r68m26O08o73o24
$$ 836 53 291 731 -175 40 306 -639 -532 28 -563 -49 422 103 -246 1286 318 -108 500 -173 -797
1827g97O97k30n17P51J69m27O25M58p64M02N31q93j47N00o60k22P92n16q0J016
$$ -797 -100 -330 -847 -96 73 -354 271 729 -35 367 898 5 -142 358 -302 -524 268 -248 -328 688
1847F88o67J68O47p39k89Q18n61o27M87k15n05Q36n7m37R70l5m61P53n9o08K74
$$ 688 21 189 836 97 -192 626 65 -562 -75 -290 -795 41 -16 -453 517 482 21 774 715 107 381
1868C81n0q81N4K85n24Q8N18n49J22J033o06J81N65l89j2L53o77k99P41n42m15
$$ 381 331 -550 -496 -211 -735 -647 -129 -678 -556 477 -129 52 617 228 216 569 -108 -407 334 -208 -623
1889f23P68j29m05P49l56n42O94P9l41K59K40m63J38L41p95R5M32p36L2N15o39
$$ -623 145 16 -389 360 4 -538 156 235 -106 153 393 -70 68 409 -386 -291 141 -595 -563 -48 -687
1910f87L71O52l59K04Q48n68j85O39k02q89M08l63o21M52k72k24O06P1l59N22
$$ -687 -316 336 -23 181 1029 461 276 915 713 -176 232 -131 -752 -300 -572 -796 -190 -119 -478 44
1930D4M95m92K44K35o43L87r7n20P3M86n20R1P01o62M8P62p12q8L98l56l38O71
$$ 44 539 47 291 526 -117 270 173 -347 -274 212 -308 -217 484 -178 -130 632 -80 -168 230 -126 -464 207
1952B07k46l42L17J79m14P46j45k09K65m4n69K30J64q41M06J98m88L82M57l45
$$ 207 -39 -381 -64 115 -299 447 302 93 358 314 -255 -25 139 -702 -296 -98 -586 -204 253 -92
1972i2M07L36l32j26L28o60l34M94n12k47L03k59K31O97o1k7N87j06m28N54k84
$$ -92 315 651 319 193 521 -139 -473 21 -491 -738 -435 -694 -463 234 173 146 733 627 199 753 469
1993D69n17j38Ln00J0K10l40L36O78m09K74P49m71j03N34o15p0J70l23k94M38
$$ 469 -48 -186 -183 -683 -673 -463 -803 -467 211 -198 76 825 354 251 785 170 100 270 -53 -347 91
2014I1k19l41O53j59m3J77m7j08J11Pk58L19k07l82L21J9n80M59L45l56K08K48
$$ 91 -128 -469 184 25 -18 159 112 4 115 122 -136 183 -24 -406 -85 -66 -646 -187 158 -198 10 258
2036B58k00K26L56o55k29N75m29o2K06k04m37O64m37J94K10q2j40L96l08O6K45
$$ 258 58 284 640 -15 -244 331 -98 -160 46 -158 -595 69 -368 -174 36 -46 -186 210 -98 -32 213
2057B13j26o26M78L55n97M75K24o20M49P4k84K7L37m37j54L13n46j48N15l79q9
$$ 213 87 -539 -61 294 -303 172 396 -224 225 299 15 42 379 -58 -212 101 -445 -593 -78 -457 -546
2078e46O84m35L45K19j66p6M75k23k91L08k69n05M44J20n00N23L8j48K75K01l00
$$ -546 138 -297 48 267 101 25 500 277 -14 294 25 -480 -36 84 -416 107 145 -3 272 473 173
2099A73P0N2l89j35L47m67nM10m41K86K15R3j18O11j73l59J59m57k96M23k59j54
$$ 173 243 295 -94 -229 118 -349 -354 56 -385 -99 116 209 91 702 529 170 329 -128 -424 -1 -260 -414
2121d14L98Q3l83L45L74m91L37R2m75O0O7m84k13N61m17K60N90k46K12M68k66
$$ -414 -16 67 -316 29 403 -88 249 341 -134 -74 -7 -491 -704 -143 -560 -300 290 44 256 724 458
2142D58k14O83n89n29J27l48m34M84r8n01P53M74l55O92L0l39J55rk26k18K25
$$ 458 244 927 338 -191 -64 -412 -846 -362 -460 -961 -208 266 -89 603 633 294 449 440 214 -4 221
2163B21p85L89L35n41j97N82j5J60J93r8j2m8k05l78O52o76k98N22k0J6L48j77
$$ 221 -564 -175 160 -381 -578 4 -11 149 342 244 232 184 -21 -399 253 -423 -721 -199 -219 -203 145 -32
2185c2j57M29K63n73K62R0o41L73n1j94KM34l92K82J67n02L7L40k61j08K84k19
$$ -32 -189 240 503 -70 192 282 -359 14 -37 -231 -229 205 -187 95 262 -240 -203 137 -124 -232 52 -167
2207a67q0N65j24k30M36j32j18J10L1l77L92j07k73K9K29l83L8J63k46L29J46
$$ -167 -247 318 194 -36 400 268 150 260 291 -86 306 199 -74 -45 184 -199 -161 2 -244 85 231
2228B31n33J10N65k57o5N05k96n6L59o00l5K40k21m44N25j25k4q4J33l26P55J22
$$ 231 -302 -192 373 116 51 556 260 204 563 -37 -72 168 -53 -497 28 -97 -121 -205 -72 -398 357 479
2250D79l99M10L7n46j10K53n95P6L43n70K12L06j94L17O52m89K86N01n13j45k24
$$ 479 80 490 527 -19 -129 124 -471 -395 -52 -622 -410 -104 -298 19 671 182 468 969 456 311 87
2271H7j25m24P5m53L3N04kM1M93J02k1J84M69o84J5J9k47k38j19k86M5L18k51
$$ 87 -38 -462 -387 -840 -807 -303 -305 -264 229 331 310 494 963 279 294 313 66 -172 -291 -577 -532 -214 -465
2294d65N66J62l32R6M18k49j0Q7k30j71J91k05l70M10k0M9L33j19j59L26j76j46
$$ -465 101 263 -69 27 445 196 186 273 43 -128 63 -142 -512 -102 -122 -73 260 141 -18 308 132 -14
2316a4K19r2l56J89M0j20j12M55n70M04ml05Q8L68l03J61J5j09J24J22j10j22
$$ -14 205 113 -243 -54 -14 -134 -246 209 -361 43 39 -266 -178 190 -113 48 63 -46 78 200 90 -32
2338c2N88m86p5K5J03l42L40j32m83L32K7k37L96p2k20Q8N66n03M7L51q6j49K43
$$ -32 556 70 -5 20 123 -219 121 -11 -494 -162 -135 -372 24 -48 -268 -180 386 -117 -70 281 195 46 289
2361B89l98k89O54m91K5K37M7j76J64k46k5L66k53N3J13K26j97N9n6j57j44L92
$$ 289 -109 -398 256 -235 -210 27 74 -102 62 -184 -209 157 -96 -43 70 296 99 158 102 -55 -199 193
2383A93l66R5P2j19R0L06o8J71l6m59L75j38l85J17K50l54k06L39l7j98K19K11
$$ 193 -173 -78 -6 -125 -35 271 203 374 338 -121 254 116 -269 -152 98 -256 -462 -123 -160 -358 -139 72
2405G2k27O11l64k3K24K86o17j37L88l20J84j77j81L09J94l52oN00o25L41K73
$$ 72 -155 456 92 69 293 579 -38 -175 213 -107 77 -100 -281 28 222 -130 -136 364 -261 80 353
2426C53l53m8J36l56n7M98l46K4L47oj82N50k22k4O0l09j39L3p5k77P9R6j33R3
$$ 353 0 -48 88 -268 -325 173 -173 -149 198 192 10 560 338 314 374 65 -74 -41 -116 -393 -314 -218 -351 -258
2450b58O61m89L92J69l13J26nl37j5J92m79Q3Rq4K38K12J32j01L34J67m15K18
$$ -258 403 -86 306 475 162 288 283 -54 -69 123 -356 -273 -264 -348 -110 102 234 133 467 634 219 437
2472D37l85j77K48m76k99J17J32J74l4M86k86J75M12m37L08l7l15Q2j68k23k59
$$ 437 52 -125 123 -353 -652 -535 -403 -229 -263 223 -63 112 524 87 395 358 43 125 -43 -266 -525
2493e25L55p3j69M23j99Q2K54kj21L19l15N8K28l95l0J19n9j62J4K68j73M8J21
$$ -525 -170 -243 -412 11 -188 -106 148 146 25 344 29 87 315 -80 -110 9 -50 -212 -198 70 -103 -55 66
2516F6QJ58j36k25K00O0k91J64M43o37RJ53q3k82K25K15l01J54K18K22j72Oj86
$$ 66 74 232 96 -129 71 131 -160 4 447 -190 -181 -28 -111 -393 -168 47 -254 -100 118 340 168 174 -12
2539a2P6J58m9k25J97k98J34j55J6k17L37OK2L66o39L61K7j05k20L46J09k52J05
$$ -12 64 222 173 -52 145 -153 -19 -174 -158 -375 -38 -32 -10 356 -283 78 105 0 -220 126 235 -17 88
2562H8j92P5J48k82k8M49j08m53M09j56J2N6J26k18k24N60l29j89M11j61k23L65
$$ 88 -104 -29 119 -163 -191 258 150 -303 106 -50 -38 18 144 -74 -298 262 -67 -256 155 -6 -229 136
2584A36m03J40L17k5P3O9l82ML70k88k06L70k70j29K74l00j8J32q0Q2K31j2J9
$$ 136 -267 -127 190 165 238 307 -75 -71 299 11 -195 175 -95 -224 50 -250 -268 -136 -216 -134 97 85 104
2607A04K4J64k92K64K2k36p3O6m0k65Q2l8L22j25Jj0L19m38o4K66j02l2l8J80
$$ 104 128 292 0 264 286 50 -23 43 3 -262 -180 -218 104 -21 -20 -30 289 -149 -213 53 -49 -81 -119 61
2631F1k00L03o3j57K17J64m72Q4L28m05J50J23l23J77J34m62L85j14j65L34K79
$$ 61 -139 164 101 -56 161 325 -147 -63 265 -140 10 133 -190 -13 121 -341 44 -70 -235 99 378
2652C78m98J62K46q2l12P7j14kK53j3j95J65J09m57L56r2k17K61O2j11L1P1l19
$$ 378 -120 42 288 206 -106 -29 -143 -145 108 95 -100 65 174 -283 73 -19 -236 25 87 -24 7 78 -241
2675b41K01J24j69J91J61n81L89K44l57J68R7j13j38J47J88m60R0k19M5K41J20
$$ -241 -40 84 -85 106 267 -314 75 319 -38 130 227 114 -24 123 311 -149 -59 -278 -233 8 128
2696A28j94J81k25m9K09O9k04R3K85m15L69j51Jj33K30j70j49M82k45j56J12j03
$$ 128 -66 115 -110 -159 50 119 -85 8 293 -122 247 96 97 -36 194 24 -125 357 112 -44 68 -35
2718c5l03M21j36k65N28k40o4P0l6mJ05J92m78K06M13l18m2J47l83K69j08oj23
$$ -35 -338 83 -53 -318 210 -30 -94 -24 -60 -64 41 233 -245 -39 374 56 14 161 -222 47 -61 -67 -190
2741a90M74l71j09L74k96l6M09k12j23M15k93j41J88Pl16N10m33m4J62J02l73
$$ -190 284 -87 -196 178 -118 -154 255 43 -80 335 42 -99 89 96 -220 290 -143 -187 -25 77 -296
2762b96M67P1m78K24O4l3K7K96m12j81M33o18K27L1R8k14L50K1j47L94k26j94
$$ -296 171 242 -236 -12 52 19 46 342 -70 -251 182 -436 -209 -178 -80 -294 56 77 -70 324 98 -96
2784i6N8m5J08K39k26l58K16N5k23L06J26l19O7K73k47J6M46m15j27L60l45J37
$$ -96 -38 -83 25 264 38 -320 -104 -49 -272 34 160 -159 -92 181 -66 -50 396 -19 -146 214 -131 6
2806FN1j28pRk27KN85m76J99N3Q5j50K26o0j48Jk23j32K49j7k2o9K39j59J01J97
$$ 6 57 -71 -78 -69 -296 -294 291 -185 14 67 152 2 228 168 20 21 -202 -334 -85 -102 -124 -193 46 -113 -12 185
2832A85j28M8J28q5l9J70j42j6k3j31j92O8k29K50J14k97k32N68R8j28M16k74
$$ 185 57 105 233 148 109 279 137 121 98 -33 -225 -157 -386 -136 -22 -319 -551 17 115 -13 403 129
2854A29J33j61P6k62j09K48k35p7L6J53j67J41k24K20K60l96L99l7J00j35J53
$$ 129 262 101 177 -85 -194 54 -181 -258 -222 -69 -236 -95 -319 -99 161 -235 164 127 227 92 245
2875B45l84K18K8k52l8J95m8k62N14j42k7R7J15j0J03N3k98p5k71L0q5L34n93
$$ 245 -139 79 107 -145 -183 12 -36 -298 216 74 47 144 259 249 352 405 107 32 -239 -209 -294 40 -553
2898e53K94N36m99K78K64J3k7j09J24r8j26J66k19j50j35j72M03l32j1M31o3j48
$$ -553 -259 277 -222 56 320 333 306 197 321 223 97 263 44 -106 -241 -413 -10 -342 -353 78 15 -133
2920a33J91J52j49K20j28l76K94q1k54j86N90m49K38R2j66r5J84L70k81L22k49
$$ -133 58 210 61 281 153 -223 71 -10 -264 -450 140 -309 -71 21 -145 -240 -56 314 33 355 106
2941A06ML7j32j42J19q9k99J87K45l03M75p5J57K4n1l80J46J16n30M45J26k12
$$ 106 110 147 15 -127 -8 -97 -396 -209 36 -267 208 133 290 314 263 -117 29 145 -385 60 186 -26
2963b6m28K65m0MJ11J59j4j6J04r3J45k7j73K74q3m21N21j68k11J90j13J04L36
$$ -26 -454 -189 -229 -225 -114 45 31 15 119 26 171 144 -29 245 162 -259 262 94 -117 73 -40 64 400
2986D00j01n57L00rp1%J79l49j5L26k89K54P7j05k2l3J9j61K72K33k64J42j69
$$ 400 299 -258 42 33 -38 -38 141 -208 -223 103 -186 68 145 40 18 -15 4 -157 115 348 84 226 57
3009E7j85k3J24m62N01J61o40O29j36L7o9K93k74k86M22j85%J53q5k12M78k73
$$ 57 -128 -151 -27 -489 12 173 -467 162 26 63 -6 287 13 -273 149 -36 -36 117 32 -180 298 25
3031B5J98l3j18k07M15k07k28K09Rk64J26M4r8J32K05m39L30p5j25R9j3j47J33
$$ 25 223 190 72 -135 280 73 -155 54 63 -201 -75 -31 -129 3 208 -231 99 24 -101 -2 -15 -162 -29
3054b9M85m22j24L35k79n0L59k91j01kL4j46M11l19P6J5J01N2j43K08l05L19j43
$$ -29 456 34 -90 245 -34 -84 275 -16 -117 -119 -85 -231 180 -139 -63 -48 53 105 -38 170 -135 184 41
3077D1j00m6K19k50K30k2o1M4n7m1n5L30l88M0L13l69k2L28j63m03M34nr2K04
$$ 41 -59 -105 114 -136 94 72 11 55 -2 -43 -98 232 -156 -116 197 -172 -194 134 -29 -432 2 -3 -95 109
3101A09n4m7J67J52n27K72K00l81p3K15k47j67M38j62MR5K1j29L01k35J43K51
$$ 109 55 8 175 327 -200 72 272 -109 -182 33 -214 -381 57 -105 -101 -6 15 -114 187 -48 95 346
3123C46k80k00K90l22l0M49k83j44K95r0J99Q2j21k84J95p3k1j04j7l46L45M04
$$ 346 66 -134 156 -166 -196 253 -30 -174 121 31 230 312 191 -93 102 29 8 -96 -113 -459 -114 290
3145B90m25J51K85k45JM2p0j75l7K37l58N13l66j08N88k53L9J18p3l57L8K11k77
$$ 290 -135 16 301 56 57 99 29 -146 -183 54 -304 209 -157 -265 323 70 109 227 154 -203 -165 46 -231
3168b31K80j96r3L62k06K5J47L37l73K77j23k5r4o4P9l6K03j87k57L16j88j30
$$ -231 49 -147 -240 122 -84 -59 88 425 52 329 206 181 87 23 102 66 269 82 -175 141 -47 -177
3190a77j80L39k23J77Q2m20L76l3O6k2J96r8P2r4J35Q3l3l00M2R0n3Ln1l03L27
$$ -177 -357 -18 -241 -64 18 -402 -26 -59 7 -15 181 83 155 61 196 279 246 -54 -12 78 25 28 -23 -326 1
3215AJ67m67L41j5q9R5O7j35l28N49r1m9j20R0k79L55M0m61M15m9k41J44J5R5
$$ 1 168 -299 42 27 -62 33 100 -35 -363 186 95 46 -74 16 -263 92 132 -329 86 37 -204 -60 -45 50
3239E0j4J29n01M92O2n01L01J08j85j24L34k90J62R0r7j30L24l8j64J63l4k30
$$ 50 36 165 -336 156 218 -283 18 126 -59 -183 151 -139 23 113 16 -114 210 172 8 171 137 -93
3261i3K40j74k33J90o6j87K63j34jL49J24k83J65L22k35j78J58l69M9J11k75N1
$$ -93 147 -27 -260 -70 -136 -323 -60 -194 -195 154 278 -5 160 482 247 69 227 -142 -93 18 -257 -206
3283b06M09m15J73L21j18p0Q9k70K31N2k08n2j44M8k39J15J82J09j48M06j94p0
$$ -206 203 -212 -39 282 164 94 183 -87 144 196 -12 -64 -208 -160 -399 -284 -102 7 -141 265 71 1
3305AK95k79k0M7l6l81N28l90j3J89j17o8L15q9K5K35O0m17K91k34k83K92J42
$$ 1 296 17 -3 44 8 -373 155 -235 -248 -59 -176 -244 71 -18 7 242 302 -115 176 -58 -341 -49 93
3328I3j02J50J58k89l6lj00L03M1n31M5L57l47n8M38l56J93k35K68q0K13K22n62
$$ 93 -9 141 299 10 -26 -29 -129 174 215 -316 -271 86 -261 -319 119 -237 -44 -279 -11 -91 122 344 -218
3351b18O36l04l01L57j04j99j28K11j42L0J34j99J66K42m13L98Q4l27M7K94k11
$$ -218 418 114 -187 170 66 -133 -261 -50 -192 -162 -28 -227 -61 181 -232 166 250 -77 -30 264 53
3372E3k01K03L6j46O3j07l2J79m51M06M8J01j14R1O9l17M71k61k26p9K22l19J36
$$ 53 -148 55 91 -55 8 -99 -131 48 -403 3 51 152 38 129 198 -119 352 91 -135 -214 8 -311 -175
3395a75nK16k1K88k56K35j8l78L60K64n29j0O6j52l92M89k1rj18P7L6Q7J37l94
$$ -175 -180 36 15 303 47 282 264 -114 246 510 -19 -29 37 -115 -507 -18 -39 -48 -166 -89 -53 34 171 -223
3419b23L48l8j88J05J41k13J31K81l47J4J16k53K35M0k19L9K49k37j36L72r2k40
$$ -223 125 87 -101 4 145 -68 63 344 -3 11 127 -126 109 149 -70 -31 218 -19 -155 217 125 -115
3441a15K73l82L63j37q7k44M94j51l10L87mj35J75k9J56k33J67k95L31j15k08
$$ -115 158 -224 139 2 -85 -329 165 14 -296 91 87 -48 127 98 254 21 188 -107 224 109 -99
3462i9j25K24k49J90RN1j97M84j70j22M68m07m5M93n00J42j23o8k50J40J6l07
$$ -99 -224 0 -249 -59 -50 1 -196 288 118 -4 464 57 12 505 5 147 24 -44 -294 -154 -138 -445
3484d45M64N7k9j72L49m52O25J8m90P5J5k49r2K09m40L35K85m16M65J67m8j47
$$ -445 19 76 47 -125 224 -228 397 415 -75 0 15 -234 -326 -117 -557 -222 63 -353 112 279 231 84
3506H4J72j34j11J47k15n7J28P9k34M20k22l17L87j67R7N9P3m54L93M5k57J22
$$ 84 256 122 11 158 -57 -114 14 93 -141 279 57 -260 127 -40 57 116 189 -265 128 173 -84 38
3528C8J00l59J2J96k52O0J98j34%K41k6l55N03l42LL15J60l48P9J33n91L32K53
$$ 38 138 -221 -209 -13 -265 -205 -7 -141 -141 100 74 -281 222 -120 -117 198 358 10 89 222 -369 -37 216
3551B16l37M04j57m26K35K20k41L37j78q3j24K68l5k84J78j37k66M71j36qK38
$$ 216 -121 283 126 -300 -65 155 -86 251 73 -10 -134 134 99 -185 -7 -144 -410 61 -75 -83 155
3572A55o3j24K11r0k78M99j40k63J83J9j37J40m23J5J29K90l21M12k49j13J14
$$ 155 92 -32 179 89 -189 310 170 -93 90 109 -28 112 -311 -296 -167 123 -198 214 -35 -148 -34
3593c4L23l88K24k77q4R1R7n4K77J7l04Q1M59m90j6J57J36l58J53m2k28L38m5
$$ -34 289 -99 125 -152 -236 -145 -48 -102 175 192 -112 -31 428 -62 -78 79 215 -143 10 -32 -260 78 33
3616C3j84J85O7j37R1K66l83J5M07m49j64M21Kj68l5l7M8m2L08j47j53k07p2M93
$$ 33 -151 34 101 -36 55 321 -62 -47 360 -89 -253 168 170 2 -33 -70 -22 -64 244 97 -56 -263 -335 158
3640A58j60k70M50N5m12J99K5m0L8k9R0k89L24m18K47J36j53J23np9n0K99l85
$$ 158 -2 -272 178 233 -179 20 45 5 43 14 104 -185 139 -279 -32 104 -49 74 69 -10 -60 239 -146
3663a46L4K06j49j55M56n56J29K58n2k88L36M7m73O08k77l85L42P2l71L45L29
$$ -146 -112 94 -55 -210 246 -310 -181 77 25 -263 73 120 -353 255 -22 -407 -65 7 -364 -19 310
3684C10n02O9K26k27J60K46k95k52J99k83J50J26kj68K78K79l74K66j52O0J73
$$ 310 -192 -123 103 -124 36 282 -13 -265 -66 -349 -199 -73 -75 -243 35 314 -60 206 54 114 287
3705B87j15n6j07r4p3L36k58k4K40r2j61J76K86m22J97R2k52J66O8k25l20M91
$$ 287 172 116 9 -85 -158 178 -80 -104 136 44 -117 59 345 -77 120 212 -40 126 194 -31 -351 140
3727A40k24l25L58K1j47K97j76j29M52j73M9j82l2O0q6J05j58M1L19k33M0L08
$$ 140 -84 -409 -51 -30 -177 120 -56 -185 267 94 143 -39 -71 -11 -97 8 -150 -109 210 -23 17 325
3749C25n52N16n0j61j36K09k74K96N3k16k70N44k78j50O21o09J5J85k64O6J03
$$ 325 -227 289 239 78 -58 151 -123 173 226 10 -260 284 6 -144 477 -132 -117 68 -196 -130 -27
3770b7J90l26L43j57j85J67l9Q8J2mj73j0J00k20K85J11l33R4N06n70J52M32o97
$$ -27 163 -163 180 23 -162 5 -34 54 66 62 -111 -121 -21 -241 44 155 -178 -84 422 -148 4 436 -261
3793b61L29j00QN0J8QM2j11n2J27J73J78n40K59K28n28L42k00k37J72l9l0J66
$$ -261 68 -32 -24 26 44 52 94 -17 -69 58 231 409 -131 128 356 -172 170 -30 -267 -95 -134 -164 2
3816Bl9j19J00K21l12L01J23j71o8K2O4n30O46k18l33L07j50r9J80l8j26M70m89
$$ 2 -37 -156 -56 165 -147 154 277 106 38 60 124 -406 240 22 -311 -4 -154 -253 -73 -111 -237 233 -256
3839b56O2M89R6o05K50J47r7n6J5k46P2L18k51k7j10R2K1L67l07j30N60m56k48
$$ -256 -194 295 391 -214 36 183 86 30 45 -201 -129 189 -62 -89 -199 -107 -86 281 -26 -156 404 -52 -300
3862c00J04J9n3J06l1j72K08K73k20K28j20j25L41k33J19n9j44m2j56L05j49k7
$$ -300 -196 -177 -230 -124 -155 -327 -119 154 -66 162 42 -83 258 25 144 85 -59 -101 -257 48 -101 -128
3884a28L0O1j57K94J17j29M6o9k31K88P0k83L02n1k34J18M9j73K42M6k95K44p5
$$ -128 -98 -37 -194 100 217 88 134 65 -166 122 192 -91 211 160 -74 44 93 -80 162 208 -87 157 82
3907H2k22K51r7p2M4J2j93j09L26r7J35K27l69p2K16j22J11P6j77q7L24j05k73
$$ 82 -140 111 14 -58 -14 -2 -195 -304 22 -75 60 287 -82 -154 62 -60 51 127 -50 -137 187 82 -191
3930a91K40q7k34K04Q5j30J61j33qJ17J62k77K14Qj60j99M29j74n4K39j27q5n9
$$ -191 49 -38 -272 -68 17 -113 48 -85 -93 24 186 -91 123 131 -29 -228 201 27 -27 212 85 0 -59
3953e9Ok8l9J22m86N54n3l63M59l20P3J01R7J72j54k8k42K86jK1k26J60q5Q2J37
$$ -59 -53 -81 -120 2 -484 70 17 -346 113 -207 -134 -33 64 236 82 54 -188 98 97 118 -108 52 -33 49 186
3978A86l98J41J56K4n6q4n2n9L17k30o8K37J73n57L50Jj25L07p1k79L27k55p9
$$ 186 -212 -71 85 109 53 -31 -83 -142 175 -55 -123 114 287 -270 80 81 -44 263 192 -87 240 -15 -94
4001i4K02J01l19J57J58j00j56P4N5o2K56k99n07N13k87K73J96k5p7J81j30K4
$$ -94 108 209 -110 47 205 105 -51 23 78 16 272 -27 -534 -21 -308 -35 161 136 59 240 110 134
4023A34J35k36M5M8m8j31O3R2l31K50q3j40K38L7j23J6l0k84R8M48l31O1P7Q1
$$ 134 269 33 78 126 78 -53 10 102 -229 21 -62 -202 36 73 -50 -34 -64 -348 -250 198 -133 -72 5 86
4047H6q6k2J52p6K57j19m10K59j11j66M06j86j22J36J21j63J50Pm30P1M30n56
$$ 86 0 -22 130 54 311 192 -218 41 -70 -236 170 -16 -138 -2 119 -44 106 113 -317 -246 184 -372
4069c72M66K0r9K49nj11j7J34l09R0j43K74n25L31j62j53K93j0j44K52J0k31K24
$$ -372 94 114 15 264 259 148 131 265 -44 46 -97 177 -348 -17 -179 -332 -39 -49 -193 59 69 -162 62
4092F2l4l58M02L78m82J43j51j90L36L11n81J53L24l46n4J24j35j69N27l86q2
$$ 62 28 -330 72 450 -32 111 -40 -230 106 417 -164 -11 313 -33 -87 37 -98 -267 260 -126 -208
4113b08J35k08K01j09K09k80L62J38k51K41n9k49J39n0p3J16J4l27J16j96J3J97
$$ -208 -73 -281 -80 -189 20 -260 102 240 -11 230 171 -78 61 11 -62 54 68 -259 -143 -339 -326 -129
4135a29J04j24Q6J33o3K24j96l61K01J75kk4K05j13r0J60j70k9q4j50J61K51j21
$$ -129 -25 -149 -63 70 7 231 35 -326 -125 50 48 24 229 116 26 186 16 -13 -97 -247 -86 165 44
4158D4k03j35K69Kj87M39n10J51L29k27rJ93l62R3K30q4m5L34m04J58j02j9j00
$$ 44 -159 -294 -25 -23 -210 229 -281 -130 199 -28 -37 156 -206 -113 117 33 -12 322 -82 76 -26 -45 -145
4181a45J28kk80J87J10NK66k68o9J55K35l00R7j16q5K47k8r1r9J13k96J66K72
$$ -145 -17 -19 -299 -112 -2 3 269 1 -68 87 322 22 119 3 -82 165 137 46 -53 60 -236 -70 202
4204B02j19j97M8M7j90L43j82k02L96j09p6K26j00j26J59N3j62K90j95k02K18
$$ 202 83 -114 -66 -19 -209 134 -48 -250 146 37 -39 187 87 -39 120 173 11 301 106 -96 122
4225A22qK9j97j24p0L36j41k08L87lk63j42M08k19m4J70k75K46J51k56j22K80
$$ 122 114 143 -54 -178 -248 88 -53 -261 126 123 -140 -282 126 -93 -137 33 -242 4 155 -101 -223 57
4247E7J03j76J93M9l10R3p6jJ58M8l80j4L20r3Q4O1l36K35K3j08J2J89j96j23
$$ 57 160 -16 177 226 -84 9 -67 -68 90 138 -242 -256 64 -29 55 116 -220 15 38 -70 -58 131 -65 -188
4271a88M53l93r0M90j80j60J8J0k11K73O4m02L28mk37J57R9k46L37m64K59OJ75
$$ -188 265 -128 -218 272 92 -68 -50 -40 -251 22 86 -316 12 8 -229 -72 27 -219 118 -346 -87 -81 94
4294I4k35J52k8k10M74k45L1j9K34q8k10J76j09k89L73k38O7j22O4J55q3J5qK28
$$ 94 -141 11 -17 -227 247 2 33 14 248 160 -50 126 17 -272 101 -137 -70 -192 -128 27 -56 -41 -49 179
4318A79R7j33j43O6j50K43j37k91L19J84l73J04J04M9m07L69k55P9J46j08j53
$$ 179 276 143 0 66 -84 159 22 -269 50 234 -139 -35 69 118 -289 80 -175 -96 50 -58 -211
4339b11M57l95N2K33k74kM04k02l18M99j96k62K10pj09J40J25l05o3L61j73k07
$$ -211 246 -149 -97 136 -138 -140 264 62 -256 243 47 -215 -5 -12 -121 19 144 -161 -224 137 -36 -243
4361b43K82k87P1M34l29J6J9j54K83M5j34L3n5J73%k59M7j15M32j85l12K69K6
$$ -243 39 -248 -177 257 -72 -56 -37 -191 92 137 3 36 -19 154 154 -105 -58 -173 259 74 -238 31 57
4384E7p0j6Ql14L53m5j89K53O6k48J8J73k05K49J78n79L56J16j2l69N6Mj6O7J60
$$ 57 -13 -29 -21 -335 18 -27 -216 37 103 -145 -127 46 -159 90 268 -311 45 161 149 -220 -164 -160 -176 -109 51
4409E1j21L27j28k58K34M3l62J57M5P5L4m9k40L30k9j28L67j66k52O0K78n16J80
$$ 51 -70 257 129 -129 105 148 -214 -57 -12 63 97 48 -192 138 109 -19 348 182 -70 -10 268 -248 -68
4432f8J42j45j23L34k69j84L90k3o0K51j49l01N96p8l75oN3q9J0j06J57k2j6R5
$$ -68 74 -71 -194 140 -129 -313 77 54 -6 245 96 -205 391 313 -62 -68 -15 -104 -94 -200 -43 -65 -81 14
4456A4qL70m81L7M8j39p4K24l50K75m9K22j83J08j6q9K38J55l59K10L6m16K71
$$ 14 6 376 -105 -68 -20 -159 -233 -9 -359 -84 -133 89 -94 14 -2 -91 147 302 -57 153 189 -227 44
4479D4O6n24M03k69L6J91q5K47j50K14l52J76K72J54m91P1j15j16L14q3j19O3
$$ 44 110 -414 -11 -280 -244 -53 -138 109 -41 173 -179 -3 269 423 -68 3 -112 -228 86 3 -116 -53
4501e3j1K07j87L08l41P8J28k93L40k99j92M11j36o3j5J51j59J04L22j23p3J51
$$ -53 -64 143 -44 264 -77 1 129 -164 176 -123 -315 96 -40 -103 -118 33 -126 -22 300 177 104 255
4523B55p44N04J68q8o3o5k23M8L35p4k63K77j87J91k6%k02K91j59J48Nj79R5r1
$$ 255 -489 15 183 95 32 -33 -256 -208 127 53 -210 67 -120 71 45 45 -157 134 -25 123 128 -51 44 -47
4547d7R3r7K78j09N5q1M5k88JL33j89O5J51l22K41j82J25j41L41j50j02J10l72
$$ -47 46 -51 227 118 173 92 137 -151 -150 183 -6 59 210 -112 129 -53 72 -69 272 122 20 130 -242
4570b42K51n4k4r2M10ol79%J93j36J62j57j37M83j79k26K29l8j65K02R3l77K06
$$ -242 9 -45 -69 -161 249 243 -136 -136 57 -79 83 -74 -211 272 93 -133 96 58 -107 95 188 -189 17
4593A7K00j39j29K16l02O0K96k29l2O5ml04K25J42k40K14J3j2q2n5o5K92p3k61
$$ 17 217 78 -51 165 -137 -77 219 -10 -42 23 19 -285 -60 82 -158 56 69 57 -25 -80 -145 147 74 -187
4617a87J75K51m41K43O7k35J59LK2J22j78j44J29k9J43j45N9L2j12O9J9j06K58
$$ -187 -12 239 -202 41 108 -127 32 35 57 179 1 -143 -14 -43 100 -45 14 46 -66 3 22 -84 174
4640A74k01j8K9K34l36J52L9l17K78M4j47qJ7J11k15K08R4l52K53k24K47K52l38
$$ 174 -27 -45 -16 218 -118 34 73 -244 34 78 -69 -77 -60 51 -164 44 138 -214 39 -185 62 314 -24
4663b4KJ75m4m1j88j63Q1O0K75k85K23jk75L11Qj83J21J22q7j73J50r4q7n0QR5
$$ -24 -22 153 109 68 -120 -283 -202 -142 133 -152 71 70 -205 106 114 -69 52 174 87 -86 64 -30 -117 -167 -159 -64
4689f4K54j43k40K88k65K33k2k4l0L62n49J60J2l8p5J15K02k93L42l37K7O9P2
$$ -64 190 47 -193 95 -170 63 41 17 -13 349 -200 -40 -28 -66 -141 -26 176 -117 225 -112 -85 -16 56
4712E6l16J26Q7J42J35k9Nr3K21l06K5k90J66p9POq6K34j44M8K76j54m7J81j66
$$ 56 -260 -134 -47 95 230 201 206 113 334 28 53 -237 -71 -150 -143 -137 -223 11 -133 -85 191 37 -10 171 5
4737Ej19O0k45P2K35J54k69p1K93M7l78L69j26J7J89l05K9J74l84J90N9j72J30
$$ 5 -114 -54 -299 -227 8 162 -107 -178 115 162 -216 153 27 44 233 -72 -43 131 -253 -63 -4 -176 -46
4760d6P2M7k24K06m2R8K35j67j26K10l50O1L4J43l32J08J60Pj36J10k31J33j21
$$ -46 26 73 -151 55 13 111 346 179 53 263 -87 -26 8 151 -181 -73 87 94 -42 68 -163 -30 -151
4783a51K85j62J71k05J67J78l87J16q9j34m5M08j61j37K32r0l0K74N8l20J3M5
$$ -151 134 -28 143 -62 105 283 -104 12 -77 -211 -256 152 -9 -146 86 -4 -34 240 298 -22 -9 36
4805C6l49L20O5k48J43J75j29J58K6j92k18K59j57l9L02j98k0K22k24m6N1N8k8
$$ 36 -313 7 72 -176 -33 142 13 171 197 5 -213 46 -111 -150 152 -46 -66 156 -68 -114 -63 -5 -33
4828c3K13j36k45o9K62j41j04J72j02J16J73j49J27K1j08k88N87l03R4J0L7j98
$$ -33 180 44 -201 -270 -8 -149 -253 -81 -183 -67 106 -43 84 105 -3 -291 296 -7 87 97 134 -64
4850f4J75j96Q1Q0j97k00K63j51J77K06j86r9L06k38j52K74jo4p8j3L9J65q0j70
$$ -64 111 -85 -4 76 -121 -321 -58 -209 -32 174 -12 -111 195 -43 -195 79 78 14 -64 -77 -38 127 47 -123
4874a23J66mp5M4M1r9p3j7NK30j4l05j38M55j26j62J39J80J01q0l16J22J77J70
$$ -123 43 39 -36 8 49 -50 -123 -140 -135 95 81 -224 -362 93 -33 -195 -56 124 225 145 -171 -49 128 298
4898B98k28j0M2j41M0j1j26q4K72n5QJ02k53j4K31p1KK19l75M1J32j09r9K60M8
$$ 298 70 60 102 -39 1 -10 -136 -220 52 -3 5 107 -146 -160 71 0 2 221 -154 -113 19 -90 -189 71 119
4923A19k50J06n1k7K12r0r1J97P9k71OR2R7j58l4lK43J32j65j85n3K34L19n32
$$ 119 -131 -25 -76 -103 109 19 -72 125 204 -67 -61 31 128 -30 -64 -67 176 308 143 -42 -95 139 458 -74
4947g4J3J53J8j24j89J50j28J66j15L90k49L0k59k10M02j8K00k1k8l6O7J2j71
$$ -74 -61 92 110 -14 -203 -53 -181 -15 -130 260 11 41 -218 -428 -26 -44 156 135 107 71 138 150 -21
4970b1N3J50k82O7K06l41K72j18q4M6l0k99J73L83k91k7K51J07k59K40o5j17L07
$$ -21 32 182 -100 -33 173 -168 104 -14 -98 -52 -82 -381 -208 175 -116 -143 108 215 -44 196 131 14 321
4993C21l73o6M95k35k40J62j32k18J93J75j02J15K1k42RL33m90K83o9j91L60j11
$$ 321 -52 -118 377 142 -98 64 -68 -286 -93 82 -20 95 116 -126 -117 216 -274 9 -60 -251 109 -2
5015bK2j48J72K29j2n42J32J36J0K6j50K13j37M1j79J34j99K10m4J3Q9J48j02
$$ -2 20 -128 44 273 261 -281 -149 -13 -3 23 -127 86 -51 -10 -189 -55 -254 -44 -88 -75 14 162 60
5038F0q7N6J5j01J7L89l22P8l66K15L96m61P9o3L07r4J09l35J59J22n01j49N22
$$ 60 -27 29 44 -57 -40 349 27 105 -261 -46 350 -111 -32 -95 212 118 227 -108 51 173 -328 -477 45
5061D5k48K49K2j26K01j53M0j00L67k09K2K1q0j97J22J48k13RJ81l31J49J16K
$$ 45 -203 46 68 -58 143 -10 30 -70 297 88 110 131 51 -146 -24 124 -89 -80 101 -230 -81 35 37
5084C7j56J89k31O1J54Ml38K69o2j88L55k01R3j90L42j32L9J29k15J07j4m2J90
$$ 37 -119 70 -161 -100 54 58 -280 -11 -73 -261 94 -107 -14 -204 138 6 45 174 -41 66 52 10 200
5107B00l07P0q6K63k06K4K4J56j69jL79m19K69K40p30L34O5r0j9QK8o7r6J53k0
$$ 200 -107 -37 -123 140 -66 -42 -18 138 -31 -32 347 -72 197 437 -293 41 106 16 -3 5 33 -34 -130 23 3
5132Cl5k06L8L40K77m92J39j80K44R4m10J06J38n8m7J08j64n8J19J02j79J33o7
$$ 3 -32 -238 -200 140 417 -75 64 -116 128 222 -188 -82 56 -2 -49 59 -105 -163 -44 58 -121 12 -55
5155e5k34K42M7L7j86K31k13OK27k74K8L58l51j40L74l25L30j75O3j26J76J1m
$$ -55 -289 -47 0 37 -149 82 -131 -125 102 -172 -144 214 -137 -277 97 -228 102 -73 -10 -136 40 51 47
5178D7l7l8j02J72K66n99N63l90p3L09o7k34L28m09M49j8j27j60J3O3K04l48M08
$$ 47 10 -28 -130 42 308 -291 272 -118 -191 118 51 -183 145 -264 185 167 40 -120 -107 -44 160 -188 220
5201B20m30M1L57m35J03K90l5m8k5K2k72L57j78P6K71o8k08J03K1k44Q3J5n7k
$$ 220 -210 -169 188 -247 -144 146 111 63 38 60 -212 145 -33 43 314 246 38 141 162 -82 1 16 -41 -43
5225d3K46k14J36k37J27k06L18k91R7R0j10N9j79J30j10K88j11J33O1k15J33J43
$$ -43 203 -11 125 -112 15 -191 127 -164 -67 23 -87 -28 -207 -77 -187 101 -10 123 184 -31 102 245
5247B45k10l04K71j41K8K38j66L4K23l67K77j32k8j74QJ66k17K38J6Q9P4J96m48
$$ 245 35 -269 2 -139 -111 127 -39 -5 218 -149 128 -4 -32 -206 -198 -32 -249 -11 5 94 168 364 -84
5270h4K39j61P0k19K95k52j92L72j51o7J25q8Q9J35O9l32K66K12l87Q9j6p8O9
$$ -84 155 -6 64 -155 140 -112 -304 68 -83 -150 -25 -113 -24 111 180 -152 114 326 -61 28 12 -66 3
5293Cq2k2q7J39j8j84N27m35M41j87j29OO7O5k91J39R3k63mJ96P0K06l93J69J26
$$ 3 -79 -101 -188 -49 -67 -251 276 -159 282 95 -34 -28 39 104 -187 -48 45 -218 -222 -26 44 250 -143 26 152
5318A52j0k49K65j63j17J76o2r3K37j58j96J18J36k07K54p1kn1J80j42p3J41j40
$$ 152 142 -107 158 -5 -122 54 -8 -101 136 -22 -218 -100 36 -171 83 12 10 -41 139 -3 -76 65 -75
5341g5J53k35n3R5J29J75j00M4r2l10K11R0k1J50r7j43J60K20k48j37J62j17j58
$$ -75 78 -157 -210 -115 14 189 89 133 41 -269 -58 32 11 161 64 -79 81 301 53 -84 78 -39 -197
5364a97K74j15Q3P1K2o6K19k24R6o2j83J15J91l82M5Q6M6k09M35l12P2PO4Q4j86
$$ -197 77 -38 45 116 138 72 291 67 163 101 -82 33 224 -158 -113 -27 19 -190 245 -67 5 12 76 160 -26
5389b6Q8p9l8O5L0N2j6Qj53j19J2M4K28Q0m41J98J67q3jj35J27K55j64j00J27
$$ -26 62 -17 -55 10 40 92 76 84 -69 -188 -176 -132 96 176 -265 -67 100 17 16 -119 8 263 99 -1 126
5414A26j60J92Mj99l7J9P5ql70M82L9j81j6R6k3J71k50j31J41j19K19j04j09J41
$$ 126 -34 158 162 -37 -74 -55 20 12 -358 124 163 -18 -34 62 39 210 -40 -171 -30 -149 70 -34 -143 -2
5438bM6Q2j30J80j84o4L46k58j71K11Pk49L28j7n4j81K41m68L86J03j96oL12k73
$$ -2 44 126 -4 176 -8 -72 274 16 -155 56 63 -186 142 125 71 -110 131 -337 49 152 -44 -50 262 -11
5462a1m6j4J3K88q0j32N0R0j76k8o0Q1k85L30K2J33k43L4M6j6j42K04Jj7o3K00
$$ -11 -57 -71 -58 230 150 18 68 158 -18 -46 -106 -25 -310 20 42 175 -68 -34 12 -4 -146 58 59 42 -21 179
5488A79q7m2J85j84m22M70N0k59Q7j9J61k19J88n9n1Pj50l3J78j22J61n5P4mJ99
$$ 179 92 50 235 51 -371 99 149 -110 -23 -42 119 -100 88 29 -22 -15 -165 -198 -20 -142 19 -36 38 34 233
5513B33k52p3j3L39k62K28n5k87J76J46k21J97m5p2L6l03J89NL9Q9K7K2j01k67
$$ 233 -19 -92 -105 234 -28 200 145 -142 34 180 -41 156 111 39 75 -228 -39 -34 5 94 121 143 42 -225
5537b25J98p5O4K19k12J17K0Q0k23P1n7j52J72j06n3J45J41p3j18J01l5o5n3j45
$$ -225 -27 -102 -38 181 -31 86 106 186 -37 34 -23 -175 -3 -109 -162 -17 124 51 -67 34 -1 -66 -119 -264
5561b64L24J00j92J87q7m18M17J67j60Q8m17J71J16KQ3k52M5J66k41N8J82o0j17
$$ -264 60 160 -32 155 68 -350 67 234 74 162 -255 -84 32 34 117 -135 -90 76 -165 -107 75 15 -102
5584a02L82k58k01M56k25r9lK33r4j32k9K86N8l99J88J16j09p3pJ39j56O2j58
$$ -102 280 22 -179 277 52 -47 -50 183 89 -43 -72 214 272 -127 61 177 68 -5 -12 127 -29 33 -125
5607a25P4J56j75L4j5K68l07jQ1q6k7J67r8OJ65j30M3J56j49k04K15j21L4K06
$$ -125 -51 105 -70 -36 -51 217 -90 -91 -10 -96 -123 44 -54 -48 117 -13 30 186 37 -167 48 -73 -39 167
5631A67o1j0JP1j06mj35J1O4L6J29K6j64j0j16O5J12j67J4K26j96J96r7j32R6
$$ 167 106 96 97 168 62 58 -77 -66 -2 34 163 189 25 15 -101 -36 76 -91 -77 149 -47 149 52 -80 16
5656A6L2M8K6j14p4M1L6k8L8j72J81rJ48k16K98k04K66k19P1j96J76l68J43R1
$$ 16 48 96 122 8 -66 -25 11 -17 21 -151 30 21 169 -47 251 47 313 94 165 -31 145 -223 -80 11
5680A1m0m0p3J10Mj98J18j18J70J05l34N12k14RRj03n8K4k2R6j11J35N4p0m3K72
$$ 11 -29 -69 -142 -32 -28 -226 -108 -226 -56 49 -285 227 13 22 31 -72 -130 -106 -128 -32 -143 -8 46 -24 -67 205
5706B05l71K28k07K2M28l35j08J87J57m55L19J35j22Q4m01L99j66J51j56nO8k79
$$ 205 -166 62 -145 -123 305 -30 -138 49 206 -249 70 205 83 167 -234 165 -1 150 -6 -11 57 -222
5728b22J20M2K5k67L19j44j6j04J57J34j31J69q7Q2j96J60j8L10m61J51j90K8
$$ -222 -102 -60 -35 -302 17 -127 -143 -247 -90 44 -87 82 -5 77 -119 41 23 333 -128 23 -167 -139
5750a39J25K04n43J23J59J86k29J45O9j3LJ16p6j01j99m0J85j21J69K27j14k35
$$ -139 -14 190 -353 -230 -71 115 -114 31 100 87 90 206 130 29 -170 -210 -25 -146 23 250 136 -99
5772i9J58j88J30n7J92qj56R6k16n7K64p9M2j9j23R1J85j40P9k06J72P0Q8J51
$$ -99 59 -129 1 -56 136 128 -28 68 -148 -205 59 -20 22 3 -120 -29 156 16 95 -111 61 131 219 370
5796C70l11J05k01j0k14M96j78j4K03k97k5L1m4K60k36J46NR6k51J09j61J48k9
$$ 370 59 164 -37 -47 -261 235 57 43 246 -51 -76 -45 -89 171 -65 81 86 182 -69 40 -121 27 -2
5819bJ38j44l07J84J55j4J90Nk43J8n9J47J22l08J7N1p3k3J18P0j01rK22k60J79
$$ -2 136 -8 -315 -131 24 10 200 205 -38 -20 -79 68 190 -118 -101 -50 -123 -146 -28 42 -59 -68 154 -106 73
5844G3k13J55J34k20%q1J7K00j7q0l3l63N13j0l83N02k54j72L25j09m0O3j57J7
$$ 73 -140 15 149 -71 -71 -152 -135 65 48 -32 -65 -428 85 75 -308 194 -60 -232 93 -16 -56 7 -150 -133
5868a33qJ16%j30L80r6qj96J34k9r5j30J44M6O4N8K5k08j7K94j56k1q7l4J25n7
$$ -133 -141 -25 -25 -155 225 129 121 -75 59 30 -65 -195 -51 -5 59 117 142 -66 -83 211 55 34 -53 -87 38 -19
5894a9j41L0N5J24j92M4M9l2L0K45k88J37J65j87J58k74N2j56J07l9k3Q4J48j65
$$ -19 -160 -130 -75 49 -143 -99 -50 -82 -52 193 -95 42 207 20 178 -96 -44 -200 -93 -132 -155 -71 77 -88
5918h8J50o4r2k7J31NN6j18N5L09k61m12M44j6j61M0j19K98k22J83n4j6Q9r3R8
$$ -88 62 -2 -94 -121 10 15 71 -47 8 317 56 -356 88 72 -89 -49 -168 130 -92 91 37 21 110 17 115
5943A15LKp7n6j05O4J08J37j82K42k75r2J19p5N9J84r8j33N0O7k90K22n5lK2p9
$$ 115 118 120 43 -13 -118 -54 54 191 9 251 -24 -116 3 -72 -13 171 73 -60 -10 57 -233 -11 -66 -69 -47 -126
5969a26m0M04j69j42jj32M34k95J69R0k03j7K70n31K23p6p1M33j77J8l4k29J07
$$ -126 -166 238 69 -73 -74 -206 228 -67 102 192 -11 -28 242 -289 -66 -142 -213 220 43 61 27 -202 -95
5992i5Jk05J8J99K5l1K21k13k7J99N0O3j79mm8K92k12K22k23%j44K7o9L8P3K11
$$ -95 -94 -299 -281 -82 -57 -88 133 -80 -107 92 142 205 26 22 -26 266 54 276 53 53 -91 -64 -133 -95 -22 189
6018A89k25K90j73j84L08m3j31N1J1m8o6o8J83k66k3K65q3n1j15n0K48q6M5m6
$$ 189 -36 254 81 -103 205 162 31 82 93 45 -21 -89 94 -172 -195 70 -13 -64 -179 -229 19 -67 -22 -68
6042f8k51K57o3qJ79R0j19j20l1P8N4j88J63K16k81K57q2K6Pq9J29j54j64J45
$$ -68 -319 -62 -125 -133 46 136 17 -103 -134 -56 -2 -190 -27 189 -92 165 83 109 116 27 156 2 -162 -17
6066a7m7n7k4K72K1k17PJ64J09j37Q5J7j37M6k61Q3N0Q2r4j11P0Q9j63K36l7R9
$$ -17 -64 -121 -145 127 148 -69 -62 102 211 74 159 176 39 85 -176 -93 -43 39 -55 -166 -96 -7 -170 66 29 128
6092A28m2j63l6J57j28nK29rM2k39j11K02Q1k80L07o5l6k07M3M7j77K26J41r4
$$ 128 86 -77 -113 44 -84 -89 140 131 173 -66 -177 25 106 -174 133 68 32 -175 -132 -85 -262 -36 105 11
6116A1J55l19k5K99k38J8L26k33J36m16L10L7PN5l21K09l6n9J96l14J54j27K22
$$ 11 166 -153 -178 121 -117 -99 227 -6 130 -286 24 61 68 123 -198 11 -25 -84 112 -202 -48 -175 47
6139D7n2r5K06j92K68l31K41n2R3l71J51NQ5j51L18k43j6R1k09k0M32k01j74K03
$$ 47 -5 -100 106 -86 182 -149 92 40 133 -238 -87 -82 3 -148 170 -73 -89 2 -207 -227 205 4 -170 33
6163C3J12O9l78K27p5q2K68j31j41Q5j65J66Q9j64m5L2j8M6K31o2j08P5J98l94
$$ 33 145 214 -164 63 -12 -94 174 43 -98 -13 -178 -12 77 -87 -132 -100 -118 -72 159 97 -11 64 262 -132
6187a32O9OK2l9j23R2L03m4l5o5k5p8J47Jj41J11r6j15K02j33k8J35L7k61J51
$$ -132 -63 -57 -35 -74 -197 -105 198 154 119 54 29 -49 98 99 -42 69 -27 -142 60 -73 -101 34 71 -190 -39
6212c9J60j97J43n4J3l8L8q3K43l99J52L7j9K2p6l8M21m14J28r3NJ30j02l4K66
$$ -39 121 -76 67 13 26 -12 26 -57 186 -213 -61 -24 -43 -21 -97 -135 286 -128 0 -93 -88 42 -60 -94 172
6237A72N1n17N03j75M4K14j55n2J2r1O2J38j19m8N2k3k2rJ5Q9r8j39J04m8J37
$$ 172 223 -294 209 34 78 292 137 85 97 6 68 206 87 39 91 68 46 37 52 141 43 -96 8 -40 97
6262I7j25k02M87j38j10Q1q7J42j58j45K22P2l56N9J03P8kj8k1N5j4M7J05j97
$$ 97 -28 -230 257 119 9 90 3 145 -13 -158 64 136 -220 -161 -58 20 18 0 -21 34 20 67 172 -25
6286b5j28J86j06N7J6P8p6O9p9J17r3j55L21q6l45L42j71P6M2O2j09J33R8k0k05
$$ -25 -153 33 -73 -16 0 78 2 71 -8 109 16 -139 182 96 -249 93 -78 -2 40 102 -7 126 224 204 -1
6311aj80L21r0%P5j28N6j22q6K66K2j51J35j55O5o9J97k97LJ45K31k23m4o8L9
$$ -1 -181 140 50 50 125 -3 53 -69 -155 111 133 -18 117 -38 27 -42 155 -142 -139 6 237 14 -30 -98 -59
6336e9j22J38o0q9K44N4%R2j9J50m02P8J86k79j02M03k07n5O1j72m1K07pj53J90
$$ -59 -181 -43 -103 -192 52 106 106 198 179 329 -73 5 191 -88 -190 213 6 -49 12 -160 -201 6 -1 -154 36
6361C6kq0p2J66J18k9k48OJ05o4J88k96L44j21n7J64o0L6j51n1J6L7P8n8K26k98
$$ 36 34 -46 -118 48 166 137 -111 -105 0 -64 124 -172 172 51 -6 158 98 134 -17 -68 -52 -15 63 5 231 -67
6387f7J34L8r6m03M85j81P8o0j26K50j99K66j62J32j36N2K1j41j2J86J23k76J02
$$ -67 67 105 9 -394 91 -90 -12 -72 -198 52 -147 119 -43 89 -47 5 26 -115 -127 59 182 -94 8
6410Hk4Q7m2p5L72m18J41P6P4k18J90p8j79K1%P6o9n8K20k30J51k21L36m58L24
$$ 8 -16 71 29 -46 326 -92 49 125 199 -19 171 93 -86 -65 -65 11 -58 -116 104 -126 25 -196 140 -318 6
6435FK8j95K79k54J07p2N8n7m3L08k14J03Q9j77L1J26j56j81M23r5j39k67K09
$$ 6 34 -161 118 -136 -29 -101 -43 -100 -143 165 -49 54 143 -34 -3 123 -33 -214 209 114 -25 -292 -83
6458h3J56j64k58L51q4j40J57J90j6jm8j05j20K40mmp7J03p3j57j40L49j90j7
$$ -83 73 -91 -349 2 -82 -222 -65 125 109 108 60 -45 -165 75 71 67 -10 93 20 -137 -277 72 -118 -135
6482a35J61j51J44k20J67R3o0k01K93k42R3J27K8j79K15m9k22K72M4j09k5k2J83
$$ -135 26 -125 19 -201 -34 59 -1 -202 91 -151 -58 69 97 -82 133 84 -138 134 178 69 44 22 205
6505B05j21o8L5mp9K6o6L3O8O5k87K85j15J87k67N5J63j11K4q3N1J34j88K11k8
$$ 205 84 16 51 47 -32 -6 -72 -39 29 94 -193 92 -23 164 -103 -48 115 4 28 -55 -4 130 -58 153 125
6530A25k95kJ80J97l97M35M6k55l7Q4Jl9J4j94K28j23n1L28j58L8n2J66j05k6
$$ 125 -170 -172 8 205 -192 243 289 34 -3 81 82 43 57 -137 91 -32 -83 245 87 125 73 239 134 108
6554A08l32J86J53k22J04O0kk11N4l6k7L27j61J42k39L2J40j78J0O1J14k00L13
$$ 108 -224 -38 115 -107 -3 57 55 -156 -102 -138 -165 162 1 143 -96 -64 76 -102 -92 -31 83 -117 196
6577A96j62L1P6K4k23q7N5K2J72K1j50k7M9K5j7n5r5J4Q4Q8j4l5j1k54K93k20
$$ 196 34 65 141 165 -58 -145 -90 -68 104 125 -25 -52 -3 22 5 -50 -145 -131 -47 41 27 -8 -19 -273 20 -200
6603b00K01J49l3j84K3J05l55M28%j01j38J56k09o0J03L63k78LJ79j07k47R3J40
$$ -200 1 150 117 -67 -44 61 -294 134 134 33 -105 51 -158 -218 -115 248 -30 -27 152 45 -202 -109 31
6626C1r1Q1k9k9K42l91P7J35LJ06k34j0K4J28p9k3PJ0K58j42J09l6q3j85J69r
$$ 31 -60 21 -8 -37 205 -186 -109 26 29 135 -99 -109 -85 43 -36 -59 -52 -42 216 74 183 147 64 -121 48 39
6652C9J48l57L44k78L49j61k31R7%J51k12K24j95p4K01l05J78J17R1K2j30L1o2
$$ 39 187 -170 174 -104 245 84 -147 -50 -50 101 -111 113 -82 -156 45 -260 -82 35 126 148 18 49 -13
6675a3m0j00R8J95j58M7O9j90J14l22K69K83m94J63qJ83j57J41j3p9O4K8l7lj38
$$ -13 -53 -153 -55 140 -18 29 98 -92 22 -300 -31 252 -242 -79 -87 96 -61 80 67 -12 52 80 43 40 -98
6700i8k5J27k7p8J84q2m0oj53L05l5J1J93k56J8n7J85j60J14M4J01k49n7j2p4
$$ -98 -123 4 -23 -101 83 1 -39 -45 -198 107 72 83 276 20 38 -19 166 6 120 164 265 16 -41 -53 -127
6725a27K65j22l8j92L86r2j15K44j60prp1j53J11j5k00K26J63j45k9N6j2J44k80
$$ -127 138 16 -22 -214 172 80 -35 209 49 42 33 -38 -191 -80 -95 -295 -69 94 -51 -80 -24 -36 108 -172
6749a72n0K72n9j37j0p8L62o1n9j21OJ25k22L14j21n1pPJ79j17k58R0R6L35m11
$$ -172 -222 50 -9 -146 -156 -234 128 67 8 -113 -107 18 -204 110 -11 -62 -69 -62 117 0 -258 -168 -72 263 -148
6774a48Q3M8o4J1q0K7K12k45L67j83M7j73J8o1J14K82k75L9j5J94lk41q9K24k09
$$ -148 -65 -17 -81 -70 -150 -123 89 -156 211 28 75 -98 -80 -141 -27 255 -20 19 4 198 195 -46 -135 89 -120
6799a20K27m9q2R9j00P7l43J54J20j77L14J14m66L18l9j73L0J16l0j57J59p4J03
$$ -120 107 58 -24 75 -25 52 -291 -137 -17 -194 120 234 -232 86 47 -126 -96 20 -10 -167 -8 -82 21
6822B1m2j69J12L16k86K67l63J71J20j83q8K37m43M24k11N1J36k47K74k31J25
$$ 21 -21 -190 -78 238 -48 219 -144 27 147 -36 -124 113 -330 94 -117 -66 70 -177 97 -134 -9
6843iP8k42R4J13k22K27m4J90k85N6Q2j38J48P9j72j02R7k5J92J77l05J02M2j52
$$ -9 69 -173 -79 34 -188 39 -5 185 -100 -44 38 -100 48 127 -45 -147 -50 -75 117 294 -11 91 133 -19
6867a9M7J60m47L92J03k36J34j43J44N5J4p2j52J16p9j44L91k63q3qM0j34K48
$$ -19 28 188 -259 133 236 0 134 -9 135 190 204 132 -20 96 17 -127 264 1 -82 -90 -50 -184 64
6890F4%j41J06J66j95r8K8Q6N3j04L4r0J27J16k25N7m3J05k38L13p8rm2j89K70
$$ 64 64 -77 29 195 0 -98 -70 16 69 -35 -1 -91 36 152 -73 -16 -59 46 -192 121 43 34 -8 -197 73
6915G3j03J06j61L3R4o2L9l2j86l4K68n9Lk9L12k74R8l0l10R0R1P6K47j22K10
$$ 73 -30 76 -85 -52 42 -20 19 -13 -199 -233 35 -24 -21 -50 262 -12 86 56 -254 -164 -73 3 250 128 338
6940C38l95mq6J48m9j20J32P8K5j44J97j5j1j31M3qL9J9o1q5K3Q7l61K70J44J8
$$ 338 -57 -61 -147 1 -48 -168 -36 42 67 -77 120 105 94 -37 6 -2 37 56 -5 -90 -67 20 -341 -71 73 91
6966I1j38j05K05m8J31j98LL81l45J28N3o0l52K69J75m46L10N0P9k07J97k44o5
$$ 91 -47 -152 53 5 136 -62 -59 322 -23 105 158 98 -254 15 190 -256 54 104 183 -24 173 -71 -136
6989a36k7K39l37M57J58l86j25l4K51O7j67l4K55j99j56N4K48J4r6j56L39l43
$$ -136 -163 76 -261 196 354 -32 -157 -191 60 127 -40 -74 181 -18 -174 -120 128 142 46 -110 229 -114
7011a14J42J67q4j17j4L2Q8k41L2Q2K43k02j3j07j38J33L15k66kJ24j03PJ02M3
$$ -114 28 195 111 -6 -20 12 100 -141 -109 -27 216 14 1 -106 -244 -111 204 -62 -64 60 -43 -36 66 109
7035A09l53J47J08n8J0J75j30J07j7k81Q9J79k6J7n7k7r0J66l4K87m33j58K0J68
$$ 109 -244 -97 11 -47 -37 138 8 115 98 -183 -94 85 59 76 19 -8 -98 68 34 321 -112 -270 -250 -82
7059h2K10l80J51J42j63q4J37jJ28M1J19kq8k17L8P3l18M32j7k56K83l07J61p7
$$ -82 128 -252 -101 41 -122 -206 -69 -70 58 99 218 216 128 -89 -51 22 -296 136 119 -137 146 -161 0 -77
7083g7K6J76j54j86M52j45l28M02j02Rj87j7K30J45l73J26J18l3l18J11J53n3
$$ -77 -51 125 -29 -215 237 92 -236 166 64 73 -114 -131 99 244 -129 -3 115 82 -236 -125 28 -25
7105b5O8j09K38M3k95N3J81N4j81j32J98l25nM42k89N4O3Or3m3J93n2l8j05j91
$$ -25 43 -66 172 215 -80 -27 154 208 27 -105 93 -232 -237 205 -84 -30 33 39 -54 -97 96 44 6 -99 -290
7130b90L96j5j55L5j52P8k12J51NM63l04r2J91k43K59j89n2L59k25j7j7j03m1
$$ -290 106 91 -64 -29 -181 -103 -315 -164 -159 304 0 -92 99 -144 115 -74 -126 233 8 -9 -26 -129 -170
7153a70O5n7J6j30L45R9j36N3m1J45p0k4rJ24l06L59k64j18KL5J44k56P5J69R2
$$ -170 -105 -162 -146 -276 69 168 32 85 44 189 119 95 86 210 -96 263 -1 -119 -117 -82 62 -194 -119 50 142
7178A42k34N5k16J60O4J3J2l7J05m07J87K48k45J89p9J00O9k03O6j68K69k36J4
$$ 142 -92 -37 -253 -93 -29 -16 -4 -41 64 -343 -156 92 -153 36 -43 57 126 -77 -11 -179 90 -146 -132
7201a32K25r4PO9j3K4oJ04k44J80l55J34P6l1Q1k42K79Jk00J69j17M1j19J52l0
$$ -132 93 -1 6 75 62 86 80 184 -60 120 -235 -101 -25 -56 25 -217 62 63 -137 32 -85 -44 -163 -11 -41
7226d1j12J19P4p0J18j46j60M42k01N2o6j25P7J17r4nK6J6J36k72o2K63l70J89
$$ -41 -153 -34 40 -30 88 -58 -218 224 23 75 9 -116 -39 78 -16 -21 5 21 157 -115 -177 86 -284 -95
7250i5j15K22K54j63j80J44k30L36k76lr7K83j00j19oM36l49o2J25n8J56j48K72
$$ -95 -210 12 266 103 -77 67 -163 173 -103 -106 -203 80 -20 -139 -145 291 -58 -120 5 -53 103 -45 227
7273B27k25J93k89P3p2J48j01p3M6Q5j56J90l63J35L82L2r6j99J53o6J59j97J35
$$ 227 2 195 -94 -21 -93 55 -46 -119 -73 12 -144 46 -317 -182 200 232 136 -63 90 24 183 -14 121
7296A21o7k01K11k6J27l76K78J79l35K30k42K52k47J47K0j22J72j79L13k51k18
$$ 121 54 -147 64 38 165 -211 67 246 -89 141 -101 151 -96 51 71 -51 121 -58 255 4 -214
7317b14M38k11j39J47O2o0j5P7k15J88j03O8J23m0k23N3j31J22K10o4m3j05J22
$$ -214 224 13 -126 21 83 23 8 85 -130 58 -45 23 146 106 -117 -64 -195 -73 137 73 30 -75 47
7340D7J4Pk9r7N4R5q9n7k7P3r1j3L73k23Jl36L39k51R0L25k08l3K03J14m42k6
$$ 47 61 68 39 -58 -4 91 2 -55 -82 -9 -100 -113 260 37 38 -298 41 -210 -120 205 -3 -36 167 281 -161 -187
7366a87J12J97J5k29n2K57j22j6k9J60j37J36Jk4k80J56j30L78K8j76j88J32m3
$$ -187 -75 122 137 -92 -144 113 -9 -25 -54 106 -31 105 106 82 -198 -42 -172 206 234 58 -130 2 -41
7389d1J8p8Q2J64J1l06K86j84r5K05j59Q0J95k89K49k18K71j78j13n6L05mk50
$$ -41 -23 -101 -19 145 156 -150 136 -48 -143 62 -97 -17 178 -111 138 -80 191 13 -100 -156 149 145 -105
7412a05J02n5K5J5R6Q3j01q7j4J49o6k53J89j27J9K67k3j76j8N4q5L2J11mj52
$$ -105 -3 -58 -33 -18 78 161 60 -27 -41 108 42 -211 -22 -149 -130 137 114 -62 -80 -26 -111 -79 32 28 -124
7437a24K47j46r3J40m4j90kJ00K25k39J99q9K37m9r7j41j8l8K67k01M7m7j21l7
$$ -124 123 -23 -116 24 -20 -210 -212 -112 113 -126 73 -16 221 172 75 -66 -84 -122 145 -56 -9 -56 -177 -214
7461b14J44J67K2l04J43J6o9K55l33K96k9j53K59J8j42j37L4L9mr1R2l29L37p6
$$ -214 -70 97 119 -185 -42 -26 -95 160 -173 123 94 -59 200 218 76 -61 -27 12 8 -83 9 -320 17 -59
7485e9J06J65J19k95L6Q2o8L4q9Q9l14J21m9K35j99o2q1L21j08l3KK0Q8n4O4P7
$$ -59 47 212 331 36 72 154 86 120 31 120 -194 -73 -122 113 -86 -148 -229 92 -16 -49 -47 -27 61 7 71 148
7511A48j95l8N6j23O5M6l0j18K90J04j52j82J3Q5K6p9L7k15L03j2r6j41L86k45
$$ 148 -47 -85 -29 -152 -87 -41 -71 -189 101 205 53 -129 -116 -31 -5 -84 -47 -262 41 29 -67 -208 178 -67
7535f7P9J14j26j15O9J25lJ55j76r1J29j01Lj58M7N4J15j79l4J82j45R9k50N7
$$ -67 12 126 0 -115 -46 79 76 231 55 -36 93 -8 -5 -163 -116 -62 53 -126 -160 22 -123 -24 -274 -217
7559b17o0M19k37J21j02j07R8R0J60r3j43Rj39K93k0nmpk78L18J96l57K1K37k87
$$ -217 -277 142 -95 26 -76 -183 -85 5 165 72 -71 -62 -201 92 72 67 63 56 -222 96 292 -65 -44 193 -94
7584i4j34K22J55j49M4m81N51k63k1Q0Q0k67J68r9M94m38K3M7nK55m10J38J08
$$ -94 -228 -6 149 0 44 -437 114 -149 -170 -90 -10 -277 -109 -208 286 -152 -129 -82 -87 168 -242 -104 4
7607DJ9K1j25J50J5Q8j03j53J29p2PJ08j7%k57R1l0K1J30m6q4L9J21k24K88J91
$$ 4 23 44 -81 69 84 172 69 -84 45 -27 -20 88 71 71 -186 -95 -125 -104 26 -20 -104 -65 56 -168 120 311
7633C11l52J00k10M38k42lN6k63J82M8o2M6J70k18m4J55o1k89L68l57K55j39L0
$$ 311 -41 59 -151 287 45 42 98 -165 17 65 3 49 219 1 -43 112 51 -238 130 -227 28 -111 -81
7656h1J72r8j46L55k57P7k09K52m1j99L67m21K30J69j72k0J34l9r7J75l2J8p8
$$ -81 91 -7 -153 202 -55 22 -187 65 24 -175 192 -229 1 170 -2 -22 112 73 -24 151 119 137 59
7679E9J64j86n2q6L59k54j51J47k30M84l60L9J65k2j4j22K32j31K93l27p1n3M3
$$ 59 223 37 -15 -101 258 4 -147 0 -230 254 -106 -67 98 76 62 -60 172 41 334 7 -64 -117 -74
7702g4K00l23J72l5J20J91m06L09j27k57M16l6j9p1j74N6K0o2J05J7k53K62r6
$$ -74 126 -197 -25 -60 60 251 -155 154 27 -230 186 150 131 60 -114 -58 -38 -100 5 22 -231 31 -65
7725f5k2n1J45RJ6K2j27K1j35L93j51j53J70j28O6J66o3LJ31k20Q8n5k01J72m5
$$ -65 -87 -138 7 16 32 54 -73 -52 -187 206 55 -98 72 -56 10 176 113 116 247 27 115 60 -141 31 -14
7750a4K39l00J52O4j46j53J93j54J03N7r3J54k8j55j31M8K03j93J36O4j35J36
$$ -14 225 -75 77 141 -5 -158 35 -119 -16 41 -52 102 74 -81 -212 -164 39 -154 -18 46 -89 47
7772D7m7j43J63K28k12l41L89j86L10j78j50K1k5J29lJ04k74K94J37j47r5O8j2
$$ 47 0 -143 20 248 36 -305 84 -102 208 30 -120 -99 -124 5 2 106 -168 126 263 116 21 89 77
7795G7k24p9K26q0k5K66k42n8L96k95J51k18K51m7q4j60K42j59L1j28K13j92L37
$$ 77 -147 -226 0 -80 -105 161 -81 -139 257 -38 113 -105 146 99 15 -145 97 -62 -31 -159 54 -138 199
7818A99k79O2L6n1j31r8M88j75n5J08n0j77J01J93k30J84M0j01j59K06q9k10N3
$$ 199 -80 -18 18 -33 -164 -262 226 51 -4 104 54 -123 -22 171 -59 125 165 64 -95 111 22 -188 -135
7841a35P2J18J28j18k96O7J95n2r8LL09j28r6j22J31j0p9J3M7j76L63j20K18m1
$$ -135 -63 55 183 65 -231 -164 31 -21 -119 -116 193 65 -31 -153 -22 -32 -111 -98 -51 -227 136 16 234 193
7865A93l75J28o0J73l4j13K3q7K93O7j95J21k19J31n7k9l8J10J41n4k02j1r9K5
$$ 193 -182 -54 -114 59 25 -88 -65 -152 141 208 13 134 -85 46 -11 -40 -78 32 173 119 -83 -94 -193 -168
7889a68K14j44J84k3Nj52J68l7J1J26j87K00j88mj34K69l24R7L7K37m27l1L25
$$ -168 46 -98 86 63 68 -84 84 47 58 184 -3 197 9 5 -129 140 -184 -87 -50 187 -240 -271 54
7912E4k74L06j24P1j02l6P8Q2j63K17j21K1l2J39q9q1L3l9J21m2J39r8p3j17J75
$$ 54 -220 86 -38 33 -69 -105 -27 55 -108 109 -12 9 -23 116 27 -54 -21 -60 61 19 158 60 -13 -130 45
7937D5o4p2J5O7o6O3O9k6o9j97K85n7j87L02q8K49m83L39l4k24L55j46L8l05K90
$$ 45 -19 -91 -76 -9 -75 -12 57 31 -38 -235 50 -7 -194 108 20 269 -214 125 91 -133 222 76 114 -191 99
7962I9k03L77n89J59K51O8k23K86j88j28Q7KL9K9r3k5J21Ql77J53J64Q5L0n6j28
$$ 99 -104 273 -316 -157 94 162 -61 225 37 -91 -4 -2 37 66 -27 -52 69 77 -300 -147 17 102 132 76 -52
7987e2M1l5N2qPj0j7R4kJ1j75J62Rj49j12R9k0M8kJ09M0j02j3j24O2m0L21j7m17
$$ -52 -11 -46 6 -2 5 -5 -22 72 70 81 -94 68 77 -72 -184 -85 -105 -57 -59 50 90 -12 -25 -149 -87 -127 194 177 -240
8016b40J87N0q7K64j49N9j24k9J38o4j6Qj62J08j0L5K66%J2l08p8J40J14l7QP2
$$ -240 -53 -3 -90 174 25 84 -40 -69 69 5 -11 -3 -165 -57 -67 -32 234 234 246 -62 -140 0 114 77 85 157
8042A57j26J68k1N8l05J27N3n5l09K39K9L8L2R2l29L74k02l3L7J91m2k68J37j12
$$ 157 31 199 178 236 -69 58 111 56 -253 -14 15 53 85 177 -152 222 20 -13 24 215 173 -95 42 -70
8066g0n0p7K45j52n4J84N9l10L69p5M0j93J69J4N2Lr3J00m6n9j58k5J3N6M9l3
$$ -70 -120 -197 48 -104 -158 26 85 -225 144 69 109 -84 85 99 151 154 61 161 115 56 -102 -127 -114 -58 -9 -42
8092d2J84N3j07M7k32K30j98o3q2J50j89K33l9O3N6k8J14n5j07K22j32r6J12r7
$$ -42 142 195 88 135 -97 133 -65 -128 -210 -60 -249 -16 -55 8 64 36 150 95 -12 210 78 -18 94 -3
8116ck27M54l62K56j48j73J10P8O4j17J79k11O8R8j20L7lLJ29nJ42j36l8K9j27
$$ -3 -230 224 -138 118 -30 -203 -93 -15 49 -68 111 -100 -32 66 -54 -17 -20 -17 112 107 249 113 75 104 -23
8141b3J77k62K94k31O3jM01o34r8K27M2K40j26k88r7L28Q8L6Jj06L72l39Rj63
$$ -23 154 -108 186 -45 18 17 418 -216 -314 -87 -45 195 69 -219 -316 12 100 136 137 31 403 64 73 -90
8165i0p7J8K78j43q5k7J61k07K36R2l64M46k72K48k21J21k26J34R5M2l25L20j18
$$ -90 -167 -149 129 -14 -99 -126 35 -172 64 156 -208 238 -34 214 -7 114 -112 22 117 159 -166 154 36
8188C6M2j73J00
$$ 36 78 -95 5
8191E
$$ Imaginary data points
##PAGE= N=2
##DATA TABLE= (X++(I..I)), XYDATA
0@%%%%%%%%%%%%%oJ4j6J6j6J6k4L2l2M0m8N6o7P5q8J04j20J36j53J75j99K25k54
$$ 0 0 0 0 0 0 0 0 0 0 0 0 0 0 -6 8 -8 8 -8 8 -16 16 -16 24 -24 32 -35 40 -48 56 -64 72 -81 94 -105 120 -134
36a34K86l22L58l99M46m96N51o10O76p46Q21r09J003j102J215j340J477j628J797
$$ -134 152 -170 188 -211 235 -261 290 -320 356 -390 431 -478 525 -577 638 -702 775 -853 944
55I44j989K205k453K740l076L477l965M574n360O415p917J0248j4396K4024r0852
$$ 944 -1045 1160 -1293 1447 -1629 1848 -2117 2457 -2903 3512 -4405 5843 -8553 15471 -75381
70g5381l5779J28663N1164O9604M9696J2293k6387k8565q0914p3705n3961o4829
$$ -75381 -111160 17503 68667 138271 187967 200260 173873 145308 64394 -9311 -63272 -128101
82a28101m9915J5040J6247K8747O8608O4898M3496N7076K2567j3759o540k8352
$$ -128101 -178016 -162976 -146729 -117982 -49374 15524 59020 116096 138663 124904 118364 90012
94I0012o6112m0725l1720m4380j2085J1742L343L3449M5681J7266K8842L8540
$$ 90012 23900 -16825 -48545 -92925 -105010 -93268 -89925 -56476 -10795 6471 35313 73853
106G3853m422j0389L400k4010k8709r294k3911j5997J1134o670p010K6183R564
$$ 73853 69431 59042 62442 38432 9723 429 -23482 -39479 -28345 -35015 -42025 -15842 -6278
119f278q812J6921R532j0873Q299L503j1255J1232P618j5284Q315J2331j7474
$$ -6278 -15090 1831 11363 490 8789 12292 1037 12269 19887 4603 12918 25249 7775
132G775l210O491j7694p784M613j6181k960J6588o921o32K3941K749k472J7957
$$ 7775 4565 11056 -6638 -14422 -9809 -25990 -28950 -12362 -19283 -19915 4026 6775 4303 22260
146B2260p6p907J0441q066j6898Q290m698k0730O211M084j4606N800P151p601
$$ 22260 22184 14277 24718 16652 -246 8044 3346 -17384 -11173 -7089 -21695 -15895 -8744 -16345
160a6345J0695J0959r085J1062J6857j0769R81J3552j2717r631K631j7115j2135
$$ -16345 -5650 5309 -3776 7286 24143 13374 14355 27907 15190 5559 8190 -8925 -21060
173b1060L608j3850o667J8571K446J008K7050J3441M80J7760J540j4866L9j2681
$$ -21060 -17452 -31302 -37969 -19398 -16952 -15944 11106 24547 25027 42787 44327 29461 29500 16819
187A6819l0777p407p972k2241L041J3173Q6K0110K6306N509J6858J9757j1516
$$ 16819 -13958 -21365 -29337 -51578 -48537 -35364 -35278 -15168 11138 16647 33505 53262 41746
200D1746p610J875k4891k3031m465j7448j0459J1862Q76N586K8300J1237J179
$$ 41746 34136 36011 11120 -11911 -16376 -33824 -44283 -32421 -31545 -25959 2341 13578 14757
213A4757K0506K951j6496r20q573k3814m885n136j4712R688J2663k104J6152K1130
$$ 14757 35263 38214 21718 20798 12225 -11589 -16474 -21610 -36322 -26634 -13971 -16075 77 21207
227B1207k543N304R469j3934r396m3k0045j1633N724r020l703J8045M444K848
$$ 21207 18664 23968 33437 19503 10107 10064 -9981 -21614 -15890 -24910 -28613 -10568 -6124 -3276
241c276J8648L385m184R648o172j7385K085o103j8567L402M702p118J1152J2596
$$ -3276 15372 18757 14573 24221 18049 664 2749 -3354 -21921 -18519 -13817 -20935 -9783 2813
255B813j366J2241J1733r372J289N189j7344r220K036j4721p287P379n256J357
$$ 2813 1447 13688 25421 16049 17338 22527 5183 -4037 -2001 -16722 -24009 -16630 -21886 -20529
269b0529J6856J514J474J8122J435o222R165l617j3511K726n817j4570M117r1
$$ -20529 -3673 -2159 -685 17437 18872 12650 21815 18198 4687 7413 1596 -12974 -8857 -8948
283h948j0667P781Q618o253Q101R681o007N101P304j0611q44O816j1732n021P673
$$ -8948 -19615 -11834 -3216 -9469 -1368 8313 2306 7407 14711 4100 3256 10072 -1660 -6681 992
298I92p710m153R593l958k137J1682k044l847J1978j762q453Q713o37j1129M279
$$ 992 -6718 -10871 -1278 -5236 -7373 4309 2265 -1582 10396 8634 181 8894 8257 -2872 1407
313A407l76j0629M126J681r765O233O485p588N903J0222o199L431R257p312j097
$$ 1407 1031 -9598 -5472 -3791 -13556 -7323 -838 -8426 -2523 7699 1500 4931 14188 6876 5779
328E779O763r766n473O212q964o693P960m351m344J1245P8l605J2277J596o924
$$ 5779 12542 2776 -2697 3515 -5449 -12142 -4182 -8533 -12877 -1632 -1554 -5159 7118 8714 1790
343A790Q022Q34j1166K832q2j1246K286L083q804N949Q565n934N712J1264n613
$$ 1790 9812 10646 -520 2312 2230 -9016 -6730 -3647 -12451 -6502 2063 -3871 1841 13105 7492
358G492K35P166q276n523L404j0410o769N321o118m377J0868Q49j103J3211L746
$$ 7492 7727 14893 6617 1094 4498 -5912 -12681 -7360 -13478 -17855 -6987 -6138 -7241 5970 9716
373I716k881R514J244r342L178k122j3255l62m96j0914J985N127n626N994J0403
$$ 9716 6835 16349 17593 8251 11429 9307 -3948 -4310 -4806 -15720 -13735 -8608 -14234 -8240 2163
388B163l246M817J0748m962j770O746p865o863L323q269o613N471m274m075J0706
$$ 2163 -1083 3734 14482 9520 7750 14496 6631 -232 3091 -5178 -11791 -6320 -10594 -14669 -3963
403c963J674k693J1206M064m630P212J455q878J922q01j1887k72O62j0418J297
$$ -3963 -2289 -4982 6224 10288 5658 12870 14325 5447 7369 6568 -5319 -5591 -4929 -15347 -14050
418a4050N962n337M055J0199k123L815J1012k951k72P441n870o044L197p755q924
$$ -14050 -8088 -13425 -9370 829 -1294 2521 13533 10582 10310 17751 11881 5837 9034 1279 -7645
433g645K790n762p846O282M42l677J0140O465j301R520O152l944M619J077j0597
$$ -7645 -4855 -10617 -18463 -12181 -11739 -15416 -5276 1189 -112 9408 15560 11616 16235 17312 6715
448F715j729j455j3056l492K176q107P07R717P2N423J2920J006K407Q555m664
$$ 6715 4986 3531 -9525 -13017 -10841 -18948 -18241 -8524 -8452 -3029 9891 10897 13304 21859 17195
463A7195p149J225r439j2240Q0n859p597O864M089n83J2693R206L67R165N256
$$ 17195 10046 11271 1832 -10408 -10328 -16187 -23784 -16920 -12831 -13414 -721 8485 8852 18017 23273
478B3273p597j59j836j3774m693j343j1323j477O456l044M303J1468J417L165
$$ 23273 15676 15517 13681 -93 -4786 -6129 -17452 -18929 -12473 -15517 -11214 254 1671 4836
492D836R394k836l197L785o669q266L079m477o578O056J769l219P633L838l951
$$ 4836 14230 11394 8197 11982 5313 -2953 126 -4351 -10929 -4873 -3104 -6323 1310 5148 1197
507A197M902J020p289J044N35q792J477L675n189K922P400l309K159P017m226
$$ 1197 6099 7119 -170 874 1409 -7383 -5906 -2231 -7420 -4498 2902 -407 1752 8769 4543
522D543k245M259n858m575M076m305l655O674p96k153P843J157m495N425J8o683
$$ 4543 2298 6557 699 -3876 200 -4105 -7760 -1086 -1882 -4035 3808 4965 470 5895 5913 -770
538g70K435n94p390K841J576n532L865N128m715L284N721n145K79M800n245j266
$$ -770 1665 1071 -6319 -3478 -1902 -7434 -3569 1559 -3156 128 5849 704 983 5783 538 -728
554g28M994m558j272O108k995k413N261l040n378L910k968o494M262j45m003O459
$$ -728 4266 -292 -1564 4544 1549 -864 4397 1357 -4021 -111 -3079 -9573 -5311 -5456 -9459 -3000
570c000M318k122P521M901l757L344J464q405j779r21r951k685K584m988R54P906
$$ -3000 1318 -804 6717 11618 7861 11205 12669 4264 2485 1564 -8387 -11072 -8488 -13476 -12522 -4616
586d616%L431R840j78k38N781m041o278J667n522p954J804j845m817N714L380
$$ -4616 -4616 -1185 8655 8477 8239 14020 9979 3701 5368 -154 -8108 -6304 -8149 -12966 -7252 -3872
602c872j793P555M754k719M445K831o030M27J383q168j421K257o517j218L929
$$ -3872 -5665 1890 6644 3925 8370 11201 5171 5598 6981 -1187 -2608 -351 -6868 -8086 -4157
617d157m034j50O049j701K2P466n68l46P064n72l108M870k069o886J194l592p874
$$ -4157 -8191 -8341 -2292 -3993 -3971 3495 2927 2581 9645 9073 5965 10835 8766 1880 3074 -518 -8392
634h392Q5j024n515L845M343j510P067P639n79M735N370m743j443M24q546n811
$$ -8392 -8307 -9331 -14846 -11001 -6658 -8168 -1101 6538 5959 10694 16064 11321 9878 10302 1756 -4055
650d055j18p246l401M753j055J432R199K680J569Q295O07m127L329k937q752n15
$$ -4055 -4173 -11419 -14820 -10067 -11122 -9690 -491 2189 3758 12053 12660 8533 11862 8925 173 -342
666c42l446p455J699J005l453N107N682j440N424O036k715J746L587n272j951
$$ -342 -3788 -11243 -9544 -8539 -11992 -6885 -1203 -2643 2781 8817 6102 7848 11435 6163 4212
681D212J727o301l054K098m976k798M380k302k117O145O40j241O812J713j892
$$ 4212 5939 -362 -3416 -1318 -6294 -9092 -4712 -7014 -9131 -2986 -2346 -3587 3225 4938 3046
696C046N388Q84m452K487o68o877j19p75p072J82K147m097K431O050j212L435
$$ 3046 8434 9318 4866 7353 6685 -192 -311 -1086 -8158 -7976 -5829 -9926 -7495 -1445 -2657 778
712G78O858j419N08M028m610l865J599o289m973K317l056k651N701J904m95P038
$$ 778 7636 6217 6725 10753 6143 2278 3877 -2412 -7385 -5068 -8124 -10775 -5074 -3170 -3665 3373
728C373L484j444M244Q02n797Q99j707p937p57M19n924J193M278k164L043O293
$$ 3373 6857 5413 9657 10459 4662 5561 3854 -4083 -4840 -4421 -10345 -9152 -4874 -7038 -3995 2298
744B298p66K083N268k874j100K987m708l912K357l903l877L725j164k871M807
$$ 2298 1532 3615 8883 6009 4909 7896 3188 -724 1633 -2270 -6147 -2422 -3586 -6457 -1650
759a650J052k431M425J566l337L104J303m451J652J124m761J173K515m038J123
$$ -1650 -598 -3029 1396 2962 -375 2729 4032 -419 1233 2357 -2404 -1231 1284 -2754 -1631
774a631L460l259K46M079k702m63L886k769j593L546k687k645L785j851l156L573
$$ -1631 1829 -1430 -1184 2895 193 -270 3616 847 -746 2800 113 -2532 1253 -598 -3754 -181
790a81o66l181L591O98k697L971J109l447L092J679m031J445K190m529N40K223
$$ -181 -847 -4028 -437 261 -2436 1535 2644 -803 2289 3968 -63 1382 3572 -957 -417 1806
806A806l832j00K855l080m06L720k438p33M548k458j601M334j847k508L688p54
$$ 1806 -2026 -2126 729 -2351 -2757 963 -1475 -2208 2340 -118 -1719 2615 768 -1740 1948 1194
822A194l209L592l12l168L415M63l351K998P27m089J986J548m110Q76K205l549
$$ 1194 -2015 1577 1265 -1903 1512 1975 -1376 1622 2349 -1740 246 1794 -2316 -1440 765 -2784
838b784O98K828k921M91L555k372m06L976k157j164L499k136k445L560j338k978
$$ -2784 -2086 742 -2179 -1688 1867 -505 -911 3065 908 -256 3243 1107 -1338 2222 884 -2094
854b094L127m18l212L200J08l275K879Q13l690K316J492l660J494K416l557Q46
$$ -2094 1033 615 -2597 603 711 -2564 315 1128 -2562 -246 1246 -2414 -920 1496 -2061 -1215
870a215L258k942P76L387k694k51L521k999j714L546l070k480L329j524k907L749
$$ -1215 2043 -899 -123 3264 570 319 3840 841 -873 2673 -397 -2877 452 -1072 -3979 -230
886b30o22k509L962P20k989L342Q11l640K681R87l884J383J760l794J008K461
$$ -230 -852 -3361 601 1321 -1668 1674 2485 -1155 1526 2513 -1371 12 1772 -2022 -1014 1447
902A447l165O58L525k621o6L196k629j291L217k693k081K887j734k145L216n74
$$ 1447 -1718 -1060 2465 -156 -222 2974 345 -946 2271 -422 -2503 384 -1350 -3495 -279 -853
918h53k301L756M96k352L373Q05k722K581J162l894J276J034m161Q12J271l498
$$ -853 -3154 602 1098 -1254 2119 2924 202 2783 3945 51 1327 2361 -1800 -988 283 -3215
934c215L11K738l026O34L165k231M15L814j659o98L760j722k007L048k001k988
$$ -3215 -2904 -166 -3192 -2558 607 -1624 -1209 2605 946 248 4008 2286 279 3327 1326 -1662
950a662K415j173l149K520j94k466K994J486k388L017K228k743J387J753m045
$$ -1662 753 -420 -3569 -1049 -1243 -3709 -715 771 -1617 1400 3628 885 2272 4025 -20
965b0j31J302l764q53J812k708K08L936j204O81M559l08n88L385j505k928J493
$$ -20 -151 1151 -2613 -3466 -1654 -4362 -4154 -218 -1422 -741 3818 3510 2922 6307 4802 1874 3367
982C367k491m625P20j268l255K561J254j692M241L547j402L559K806k779M21R44
$$ 3367 876 -3749 -3029 -4297 -7552 -4991 -3737 -5429 -1188 2359 957 4516 7322 4543 4964 5908
998E908m563j722L42m565j283K341k200P51M435J1N46M620j51j426K713j992l728
$$ 5908 1345 -377 -35 -4600 -5883 -3542 -5742 -4991 -556 -545 1 4621 4470 3044 5757 3765 37
1015C7Q87k432l694J424K79k303L351K284j234L663K965k031J324J302l994p22
$$ 37 924 -1508 -5202 -3778 -3499 -5802 -2451 -167 -1401 2262 5227 3196 4520 5822 1828 1106
1031A106N80m557j132J762l006R1L739j091O11M264j30j098L070j155k542J667
$$ 1106 1686 -2871 -4003 -2241 -5247 -5156 -1417 -2508 -1897 2367 2237 1139 4209 3054 512 2179
1047B179j191l022J451j06k376K506J000k014K444J608k669R04J449l450j44J426
$$ 2179 988 -2034 -583 -689 -3065 -559 441 -1573 871 2479 -190 714 2163 -1287 -1431 -5
1063ek711m0K754j696L22L705j312Q0K975j604j733J889k348k572J741j352j990
$$ -5 -2716 -2756 -2 -1698 -1376 2329 1017 1097 4072 2468 735 2624 276 -2296 -555 -1907 -3897
1080c897K395O37j670L442J307j731K509P46l413N81N33l998j12J280k786R50
$$ -3897 -1502 -865 -2535 907 2214 483 2992 3738 325 906 1439 -2559 -2671 -1391 -4177 -3227
1096c227K816j282J710L629r94K24K449k038k043J061k630l020J117j625k005
$$ -3227 -411 -1693 17 3646 2652 2876 5325 3287 1244 2305 -325 -3345 -2228 -3853 -5858
1111e858K626R35r19M039J599j027K811Q01k851Q57N2l970k03L75l091L98K034
$$ -5858 -3232 -2297 -3216 823 2422 1395 4206 5007 2156 3013 3065 -905 -1108 -733 -3824 -3426 -1392
1128a392j462J063L430r12M97K930j703j212J360k503k152J488j619j926K342
$$ -1392 -2854 -1791 1639 727 1224 4154 2451 1239 2599 96 -2056 -568 -2187 -4113 -1771
1143a771K03j264L325J340j262K790Q65k501R72L0l413k70N75l177L09K052k054
$$ -1771 -1568 -2832 493 1833 571 3361 4226 1725 2697 2727 -686 -956 -381 -3558 -3249 -1197 -3251
1160c251J321K820j167P00K982j645n85J687k279j905J585j509j766K187q4j115
$$ -3251 -1930 890 -277 423 3405 1760 1175 2862 583 -1322 263 -1246 -3012 -825 -909 -2024
1176b024K867R18j419K533Q7k595J084k17l057K1O18k708R36J901j322J588K656
$$ -2024 843 1761 342 2875 2962 367 1451 1234 -1823 -1802 -1184 -3892 -2956 -1055 -2377 -789 1867
1193A867p99P29K603k151o36J254k475j728J060j691j665K033j06r03L110M81
$$ 1867 1068 1797 4400 2249 1613 2867 392 -1336 -276 -1967 -3632 -1599 -1705 -2608 502 983
1209I83j023K843L6k452J209k7l086L52N12k513J013J707j411J506K381j163Q22
$$ 983 -40 2803 2839 387 1596 1569 -1517 -1165 -653 -3166 -2153 -446 -1857 -351 2030 867 1689
1226A689K031k028o28J142k416j716J638j764j291K187o94o73K670L18p49K252
$$ 1689 3720 1692 1064 2206 -210 -1926 -288 -2052 -3343 -1156 -1850 -2523 147 465 -284 1968
1242A968J57j455J440j85k128R19J41k454R34J006k060N31J565j525O11J774j734
$$ 1968 2125 670 2110 1925 -203 716 857 -1597 -663 343 -1717 -1186 379 -1146 -535 1239 -495
1259d95J61J762j529n14J783j352q21J986r77j394J794p61r90J741M3j149K103
$$ -495 -334 1428 -101 -615 1168 -184 -1005 981 4 -1390 404 -357 -1347 394 437 -712 1391
1276A391J95j864J658L05k240Q51M35k618O22J029j967L10J877j660J023K241
$$ 1391 1586 -278 1380 1685 -555 296 731 -1887 -1265 -236 -2203 -1893 -16 -1676 -653 1588
1292A588j171L3J977j274p33J590j309j371J311j186j328J529l63j216K164Q4
$$ 1588 417 450 2427 1153 420 2010 701 -670 641 -545 -1873 -344 -707 -1923 241 325
1308C25j347J763K74j826J167P72k291J019O92j819N89J648j638M13J491j396
$$ 325 -1022 741 1015 -811 356 1128 -1163 -144 548 -1271 -682 966 -672 -259 1232 -164
1324a64P4J761j625p24J691j163q06J462o60j099J596k55j343J514m23j092J458
$$ -164 -90 1671 46 -678 1013 -150 -956 506 -154 -1253 343 88 -1255 259 -164 -1256 202
1341B02J16j576J424O41j374J239R84j448L73J133j966P8J066j922k29J387j456
$$ 202 318 -1258 166 807 -567 672 1656 208 581 1714 -252 -174 892 -1030 -1259 128 -1328
1358a328m74J852p35n93K045n33n24J575k80j328J481n48j447J149mj386J257
$$ -1328 -1802 50 -685 -1278 767 234 -290 1285 1005 -323 1158 610 -837 312 308 -1078 179
1375A79L24j398J104R46j679N46J002j664L75R77j585o8J451j487K1J687j137
$$ 179 503 -895 209 1155 -524 22 1024 -640 -265 712 -873 -941 510 -977 -956 731 -406
1392d06m6J436r55m65J482l73j012J641n27j454J478j77j530J075R0j578R86J86
$$ -406 -452 984 29 -436 1046 673 -339 1302 775 -679 799 622 -908 167 257 -1321 -335 -149
1410a49j576Q39J116j318P59J533j258O73J277j446n8R86j447p72J277r42o96
$$ -149 -1725 -886 230 -1088 -329 1204 -54 619 1896 450 392 1378 -69 -841 436 -506 -1202
1427a202J505o67n36J850k19j076J259l57j395J152m39j393R21N58j146P74R79
$$ -1202 303 -364 -900 950 731 -345 914 557 -838 314 -125 -1518 -597 -39 -1185 -411 568
1444E68r27J042J121j127J21Q59j638l59P05j530k40J314o83j35J647p40m01J701
$$ 568 -359 683 1804 677 798 1657 19 -340 365 -1165 -1405 -91 -774 -909 738 -2 -403 1298
1462A298p23q28R63q51p24Q44k09j104J488N20j131J376O96j219O59K93j434l0
$$ 1298 575 -253 710 -141 -865 -21 -230 -1334 154 674 -457 919 1615 396 1055 1348 -86 -116
1480a16N20j825R2P74q64J97J558l94l9J662o08p43J291j092q97R43p96r40J214
$$ -116 404 -1421 -1329 -555 -1419 -1222 336 -58 -97 1565 957 214 1505 413 -484 459 -337 -1277 -63
1499f3l51n45J362K17r96R87M74j427N69L50j688O47M79j218J24J308r15L86J601
$$ -63 -414 -959 403 620 -376 611 1085 -342 227 577 -1111 -464 15 -1203 -1079 229 -686 -300 1301
1518A301j244j8J320q27p82J560r49q09R52l51j157J588l94r58P86K60j419Q44
$$ 1301 57 39 1359 532 -250 1310 361 -448 504 153 -1004 584 190 -768 18 278 -1141 -297
1536b97M72j383Q32O23o01N10J180j177L24P94q17n43J021j527l75J115r56l56
$$ -297 175 -1208 -376 247 -354 156 1336 159 483 1277 460 -83 938 -589 -964 151 -805 -1161
1554a161J241n11l6J124k59m53J218p51o87O27k30j177Q05J45j050R27M77o85
$$ -1161 80 -431 -467 657 398 -55 1163 412 -275 352 122 -1055 -250 -105 -1155 -228 249 -436
1572d36P56R34j303P02M04j172j44R76j405k1Q39q79j78R19n67j90J263q04k85
$$ -436 320 1254 -49 653 1057 -115 -259 717 -688 -709 130 -749 -927 -8 -575 -765 498 -306 -591
1591e91J067m17k80J211j28p07J018k28r28N78j44j327K76J15j240O22O27q81
$$ -591 476 59 -221 990 862 155 1173 945 17 595 451 -876 -600 -485 -1725 -1103 -476 -1357
1609a357R37J230p36P00J033p32n94O52r85o29N09r60m35R55j84l34J483K03l37
$$ -1357 -420 810 74 774 1807 1075 481 1133 148 -481 28 -932 -1367 -412 -596 -930 553 756 419
1628D19J072J00j140O90l83j478j1Q6j167O07N95o49N28J398m11N24R17n54k38
$$ 419 1491 1591 451 1141 758 -720 -731 -645 -1812 -1205 -610 -1259 -731 667 256 780 1697 1143 905
1647I05L26j045l74N00q40l65O21l59n49J121Q5p52J163r1j120J286j22p78R66
$$ 905 1231 186 -188 312 -528 -893 -272 -631 -1180 -59 26 -726 437 346 -774 512 390 -388 578
1666E78K56r13O51L58j103L46L29r70j27O58r62m8J158n44R6J278p95q0R33o74
$$ 578 834 -79 572 930 -173 173 502 -468 -595 63 -899 -947 211 -333 -237 1041 246 166 1099 425
1686D25n19M94o96q18N97p3p92J116L32k90Q53N03p15P34K17j182p6M5r31m03
$$ 425 -94 400 -296 -1114 -517 -590 -1382 -266 66 -224 629 1132 417 1151 1368 186 110 155 -776 -1179
1706a179N36o14Q0Q70l77L55J135m10j05Q06o13o43J013o95o18O55k09o00Q64
$$ -1179 -643 -1257 -1177 -307 -684 -329 806 396 291 1097 484 -159 854 159 -459 196 -13 -613 251
1725B51o3o20N57K00q86Q62j23p84N5O63p17N86N29q01K41Q39p59J13N57q08l18
$$ 251 188 -432 125 325 -561 301 178 -606 -551 112 -605 -19 510 -291 -50 789 30 143 700 -108 -426
1746d26Q35o58l62J076n58r8P20n27l34R62k03q66K22j7n59M96K55m93J52O61
$$ -426 409 -249 -611 465 -93 -191 529 2 -332 630 427 -439 -217 -234 -793 -297 -42 -535 -383 278
1766B78m38P39K65q09K60N65p99m03P77r64J89N70m91q5P87k15m54O30m21o03
$$ 278 -160 579 844 35 295 860 61 -342 435 -529 -340 230 -261 -346 441 226 -228 402 -19 -622
1786f22Q06k85p84O96J88p58R01N19o64P28J10q35J40L65p10l08L96j023M42M02
$$ -622 184 -101 -885 -189 -1 -759 142 661 -3 725 835 0 140 505 -205 -513 -117 -1140 -698 -296
1806b96j71P3P04l02K43P24p17k85O22m13p09L92j60o30R55K90m97P39J54l85
$$ -296 -467 -394 310 8 251 975 258 -27 595 182 -527 -135 -295 -925 30 320 -177 562 716 331
1826C31K43Jr26R1J75n86j02L76q6K37N73k86K76K98l56j99M14n13m09P69m64
$$ 331 574 575 -351 -260 -85 -671 -773 -397 -483 -246 327 41 317 615 259 60 474 -39 -448 321 -143
1847a43n24P97j57k44N77L14n61K46j2n75J74k08o86N55K99o24N76M12l90N63
$$ -143 -667 130 -27 -271 306 620 59 305 293 -282 -108 -316 -1002 -447 -148 -772 -196 216 -174 389
1867C89O42p58l6N82o03k22J40l09l79M89j45m13L92M4k31O83l23j58P30k7p05
$$ 389 1031 273 237 819 216 -6 134 -175 -554 -65 -210 -623 -231 -187 -418 265 -58 -216 514 487 -218
1888b18N90Pn34K20K19q07M61L97p43L81K28m25L43L80k04j72M65l95n69P14n52
$$ -218 372 379 -155 65 284 -523 -62 335 -408 -27 201 -224 119 499 295 123 588 193 -376 338 -214
1909b14o84R41n74n69R09l26l8P59J45r6N29n3m93N10k99m98K1J73j096M46L40
$$ -214 -898 43 -531 -1100 -191 -517 -555 204 349 253 782 729 236 746 447 -51 -30 143 -953 -507 -167
1930a67l07N4N62m71K20N62k62m77Q04o61n5L42l48l7L51K7m25P23k31l50O23
$$ -167 -474 -420 142 -329 -109 453 191 -286 518 -143 -198 144 -204 -241 110 137 -288 435 204 -146 477
1951D77L0n75k6P0n05L60Mm82M56N33l68L16N09o88J09O7m94j75N95o81K44J50
$$ 477 507 -68 -94 -24 -529 -169 -165 -647 -191 342 -26 290 799 111 220 287 -207 -382 213 -468 -224 -74
1973g4j09J2P34j3m21O58k73p89N86l85j98j56m9n26O72K39k69M83M03q2K60K45
$$ -74 -183 -171 563 550 129 787 514 -275 311 -74 -272 -428 -477 -1003 -331 -92 -361 122 525 443 703 948
1995I48m17l51K70o30j04k7l96P3N40m52nR68l41k93Q58j39n38O87m91k05j03
$$ 948 531 180 450 -180 -284 -311 -707 -634 -94 -546 -551 417 76 -217 641 502 -36 651 160 -45 -148
2016a48J0m58O26j5l07L99K95o86M25N31q12nP03q89J11L20o23J42M47k25j55
$$ -148 -138 -596 30 15 -292 107 402 -284 141 672 -140 -145 558 -331 -220 100 -523 -381 66 -159 -314
2037c14P25l45j11L80j09l42M66j43j08J94l15l44L24j3l09M21N2k99M36n1k11
$$ -314 411 66 -45 335 226 -116 350 207 99 293 -22 -366 -42 -55 -364 57 109 -190 246 195 -16
2058a6j14K50l63m3L81l06j04O53n37J63O27j35n16O59k77m06N94m78k70J34p1
$$ -16 -130 120 -243 -286 95 -211 -315 338 -199 -36 591 456 -60 599 322 -84 510 32 -238 -104 -175
2079a75l63N22k01k24N29L06l95L84J34l05J82j9n43M8L58o16K86K85k66J11L37
$$ -175 -538 -16 -217 -441 88 394 -1 383 517 212 394 375 -168 -120 238 -378 -92 193 -73 38 375
2100C75K56n29K85k65j32J50j62l72M23l20k45M05L47l55K92K15k63M45k69l9
$$ 375 631 102 387 122 -10 140 -22 -394 29 -291 -536 -131 216 -139 153 368 105 550 281 242
2120B42k92L15q41K02O8j19K17N37l99J68L17l34K12P6m44l10K5j12k68O48O6
$$ 242 -50 265 -576 -374 -306 -425 -208 329 -70 98 415 81 293 369 -75 -385 -360 -472 -740 -92 -26
2141b6l15O68J94k71M76o4n44K19j02m62j20J79p41L48L27k81K84N77j34J88K69
$$ -26 -341 327 521 250 726 662 118 337 235 -227 -347 -168 -909 -561 -234 -515 -231 346 212 400 669
2162F69m58j17K39m84J25Q0l91j46M12q1L0L94J60l43L38L5m48J63L3n60Q8J35
$$ 669 211 94 333 -151 -26 54 -337 -483 -71 -152 -122 272 432 89 427 462 14 177 210 -350 -262 -127
2184a27p00N57K25k23L63M06n15J72M38m83r8M95n32K8K4k0l15O88n29K4L07m0
$$ -127 -827 -270 -45 -268 95 501 -14 158 596 113 15 510 -22 6 30 10 -305 383 -146 -122 185 145
2206A45m98K16q9m16N44K52l70J99K50l95L57K06l78pL41n58M14J40l16k43L32
$$ 145 -353 -137 -226 -642 -98 154 -216 -17 233 -162 195 401 23 16 357 -201 213 353 37 -206 126
2227A26k13j53M27n58j70N47j72M9N60l47J45N24m38j75L9k8k03K8j85k92M6L47
$$ 126 -87 -240 187 -371 -541 6 -166 -117 443 96 241 765 327 152 191 163 -40 -12 -197 -489 -443 -96
2249i6m27L94M20l82J93L52j11j48J75n46k3j8l67m8M39j44k35P34q4K5P03m6
$$ -96 -523 -129 291 -91 102 454 343 195 370 -176 -199 -217 -584 -632 -193 -337 -572 162 78 103 806 760
2271G60l00J21k49l72J74k83m74P5k0l8K60L85j31N46J79k32j16L40l81l83L25
$$ 760 460 581 332 -40 134 -149 -623 -548 -568 -606 -346 39 -92 454 633 401 285 625 244 -139 186
2292A86m51m3K54m42P2N66l91N8K85J96j65K32j39n63M05j16l29K97K3r6K10Q4
$$ 186 -265 -308 -54 -496 -424 142 -249 -191 94 290 125 357 218 -345 60 -56 -385 -88 -65 -161 49 133
2314A33k07J94L23m11J04K73k87j07K09l41K38K50m05k02M67k49j70K93j93j08
$$ 133 -74 120 443 32 136 409 122 15 224 -117 121 371 -34 -236 231 -18 -188 105 -88 -196
2334a96J34j71k0K98R6j34J1L44o45M03N8l61L78L24q65L68K34p31K91J15j40
$$ -196 -62 -233 -253 45 141 7 18 362 -283 120 178 -183 195 519 -346 22 256 -475 -184 -69 -209
2355b09j14N19q1m57O23j14j23L15n7l16J31K27m50L91k58l07L33N0j89J52o0
$$ -209 -323 196 115 -342 281 167 44 359 302 -14 117 344 -106 285 27 -280 53 103 -86 66 6
2376Fk76J80K30j65L32J40k87m15L33p7k17L71k21k15J99q5J11M11l49L16J1k17
$$ 6 -270 -90 140 -25 307 447 160 -255 78 1 -216 155 -66 -281 -82 -167 -56 355 6 322 333 116
2398A16j87L60j89l39K46l73n9J38J77k35K53K26k04L01J43m72J42K60k87m4j38
$$ 116 -71 289 100 -239 7 -366 -425 -287 -110 -345 -92 134 -70 231 374 -98 44 304 17 -27 -165
2419a65j68j39O23o8j16K51k16o9J46J57o35L37p5k94M93j46k09K95j71J2N01
$$ -165 -333 -472 151 83 -33 218 2 -67 79 236 -399 -62 -137 -431 62 -84 -293 2 -169 -157 344
2440C44J18k21J24J44l26j97R1k45j3Q0m57L52J69j15L16L16p3k22m3o0j07L23
$$ 344 462 241 365 509 183 -14 77 -168 -181 -101 -558 -206 -37 -152 164 480 407 185 142 82 -25 298
2462B98l92j77j1K98m18L21J76j09K55J42j19J3K55l16j02j50k12r1J2o7m3K91
$$ 298 -94 -271 -282 16 -402 -81 95 -14 241 383 264 277 532 216 114 -36 -248 -339 -327 -394 -437 -146
2484a46l97L44L48O0J50M11l14m31L27k82j57M49o37j72J54L00m34L50J58j75
$$ -146 -543 -199 149 209 359 770 456 25 352 70 -87 362 -275 -447 -293 7 -427 -77 81 -94
2504i4K89m2j44Q7K46l95J6J05j96k22J25L23j75J68j81J1K37l8n3P8lP0k1j99
$$ -94 195 153 9 96 342 -53 -37 68 -128 -350 -225 98 -77 91 -90 -79 158 120 67 145 142 212 191 -8
2528hn9L03k68k37J66J17k97O6M72m04R1J29k20J24L12l63Q8K05k73j02L81l27
$$ -8 -67 236 -32 -269 -103 14 -283 -217 255 -149 -58 71 -149 -25 287 -76 12 217 -56 -158 223 -104
2550a04j78L92l31Q3L2j10P8L82j24l33L21J5j14L1J08k83P4J81k62qM25m52K89
$$ -104 -282 110 -221 -138 -106 -216 -138 244 120 -213 108 123 9 40 148 -135 -61 120 -142 -150 275 -177 112
2573A12R7k56J79K6j70lL42k77j47K84k10j80L36o29K76M73m86Q5K53j3K8n0L76
$$ 112 209 -47 132 158 -12 -15 327 50 -97 187 -23 -203 133 -496 -220 253 -233 -148 105 92 120 70 446
2596D46l70j54K75j82j04J10m53L10J1l47K08P70o57K69O2m1l07K77J74m85L88
$$ 446 76 -78 197 15 -89 21 -432 -122 -111 -458 -250 520 -137 132 194 153 -154 123 297 -188 200
2617B00k92o5L83p5l72K55N8k77L4L68l90K81Q6k77L59k30k60J96J14l75J78L78
$$ 200 -92 -157 226 151 -221 34 92 -185 -151 217 -173 108 194 -83 276 46 -214 -18 96 -279 -101 277
2639B77m44q2N11k49Q4Lm3j04N9j14k09M86j33k60K48l2j30L34k25L5P6j9j53
$$ 277 -167 -249 262 13 97 100 57 -47 12 -102 -311 175 42 -218 30 -2 -132 202 -23 12 88 69 -84
2662h4m7L74l34K48q9n7J99m9q1q1P7m42J96J12Ll3r2nk68M99J9k88K59j62j19
$$ -84 -131 243 -91 157 68 11 210 161 80 -1 76 -366 -170 -58 -55 -88 -180 -185 -453 46 65 -223 36 -126 -245
2687b45M79l28JJ11K19j38k1J50k61K1p2k06L41O2j90o4J08P1q1R7j28R9J16j77
$$ -245 234 -94 -93 18 237 99 78 228 -33 -12 -84 -290 51 113 -77 -141 -33 38 -43 54 -74 25 141 -36
2711c6K8K06j47j44J96J26k75Q4j13j97L80R9k85P3m3k46M57j9k49l1P4j19o6
$$ -36 -8 198 51 -93 103 229 -46 38 -75 -272 108 207 -78 -5 -48 -294 163 144 -105 -136 -62 -181 -247
2734b47O23l65QJ55l77J80K05k24r3K23l01K95j18K77l96J18M9k50J66K6m4K89
$$ -247 376 11 19 174 -203 -23 182 -42 -135 88 -213 82 -36 241 -155 -37 12 -238 -72 -46 -90 199
2756A99k04k18L06j7j73J75j78j79j46Q40m54j9K78Rj86J36J73l52M0L7l17M0
$$ 199 -5 -223 83 66 -107 68 -110 -289 -435 405 -49 -68 210 219 33 169 342 -10 30 67 -250 -210
2778b10n3P6K34j01k13M05J9k37M68o6l20O8J00k06J14Nk83n8R4r0k25N39l68
$$ -210 -263 -187 47 -54 -267 138 157 -80 388 322 2 70 170 -36 78 83 -200 -258 -164 -254 -479 60 -308
2801c08L07J95j70lJ88j53l7K85k52J2M7l17J5K13o4J90j44K94n20L58%k85K76
$$ -308 -1 194 24 21 209 56 19 304 52 64 111 -206 -191 22 -42 148 4 298 -222 136 136 -149 127
2824A27K9l37K97k14k04J55J61j36j42K18j12K34P3n6M9K33j25k14K79k11j82
$$ 127 156 -181 116 -98 -302 -147 14 -122 -264 -46 -158 76 149 93 142 375 250 36 315 104 -78
2845g8k8J69j28k04p0N5N1j0P8R8J81k08J43O4p6J29P9l69k45N30k05k31K34j00
$$ -78 -106 63 -65 -269 -339 -284 -233 -243 -165 -67 114 -94 49 113 37 166 245 -124 -369 161 -44 -275 -41 -141
2869a41k08L52j87J21m5J61J60j03Nl31J63J94l23J21k5j11Q2K49j16q2K79k04
$$ -141 -349 3 -184 -63 -108 53 213 110 115 -216 -53 141 -182 -61 -86 -197 -115 134 18 -64 215 11
2891A1L06R0j38j40K98n22J40q4j29k08P6K68k13K04K20k12M36l4j61j80J23m14
$$ 11 317 407 269 129 427 -95 45 -39 -168 -376 -300 -32 -245 -41 179 -33 403 369 208 28 151 -263
2913b63K71j4j9M0k96J28j22L47k98J84J83j73j31J74J12l0J21j75k75K12j17
$$ -263 8 -6 -25 15 -281 -153 -275 72 -226 -42 141 -32 -163 11 123 93 214 39 -236 -24 -141
2934a41j35L66j90Q7p4J48n3L44R5m81J79L33l43l99L46k65j4L84l18K58m9j61
$$ -141 -276 90 -100 -13 -87 61 8 352 447 -34 145 478 135 -264 82 -183 -197 187 -131 127 78 -83
2956h3R1L3n5K4M15j71k11J29j42N8j7k36K64J9k69l5Q6j44j46N90j6l41J78J45
$$ -83 8 41 -14 10 425 254 43 172 30 88 71 -165 99 118 -151 -186 -100 -244 -390 200 184 -157 21 166
2980A66k45J64M6j30k51K04j2l58M55j27N2Q4k29kJ94J09j14r7l0k29K71K24k49
$$ 166 -79 85 131 1 -250 -46 -58 -416 39 -88 -36 48 -181 -183 11 120 6 -91 -121 -350 -79 145 -104
3003a04P6K10l29J54J75l88J84K01l18M1K7P3k02K08k21J74J79j83j51K87j29
$$ -104 -28 182 -147 7 182 -206 -22 179 -139 -98 -71 2 -200 8 -213 -39 140 -43 -194 93 -36
3024c6j86K98l21J26l6L07l41J30K52m30N58j25k46K29p7j15P3oj92J19q5j08
$$ -36 -222 76 -245 -119 -155 152 -189 -59 193 -237 321 196 -50 179 102 -13 60 54 -138 -19 -104 -212
3046b12K50Ok7k05M49k69q4J87n3J40O5k37L9n9k6R8l6o7q8L28n83K53K3Q7k58
$$ -212 38 44 17 -188 261 -8 -92 95 42 182 247 10 49 -10 -36 62 26 -41 -129 199 -384 -131 -108 -21 -279
3071b79L11J44l43k0L14j21o6R2l00K39J26k14J16k70J98j19N92k94m5L36l86
$$ -279 32 176 -167 -187 127 6 -60 32 -268 -29 97 -117 -1 -271 -73 -192 400 106 61 397 11
3092A1J62j07j36r7J56j91J37j99K15l2P0J64j1M8K26r0l46J76J6k82L85k45j99
$$ 11 173 66 -70 -167 -11 -202 -65 -264 -49 -81 -11 153 142 190 416 326 -20 156 172 -110 275 30 -169
3115a69M74l03j92M59l27r6M57l74J12QO2j98Jp0J91K2J26l96J58L76l91K05K09
$$ -169 305 2 -190 269 -58 -154 303 -71 41 49 111 -87 -86 -156 35 57 183 -213 -55 321 -70 135 344
3138C44l33q1K68j09j76K57j50j38j9k28O33j24j4k14L8K52m02M13k1l83K39O1
$$ 344 11 -70 198 89 -87 170 20 -118 -137 -365 268 144 130 -84 -46 206 -196 217 196 -187 52 113
3160A13j17JK40k72j61M29m32k03L54N8K0J34k42k4K84n27M50l7k29j01L97j78
$$ 113 -4 -3 237 -35 -196 233 -199 -402 -48 10 30 164 -78 -102 182 -345 105 68 -161 -262 135 -43
3182d3l2J67M3k53J33L54l79K57k54P0J77l83l6K47o8p1P2j7j51K01Rj35J66J83
$$ -43 -75 92 135 -118 15 369 -10 247 -7 63 240 -143 -179 68 0 -71 1 -16 -167 34 43 -92 74 257
3206B57m66L39J86ql64J0J03j37K25j61J87j17K7l18L32l48M0J45M8k9J21m7j71
$$ 257 -209 130 316 308 -56 -46 57 -80 145 -16 171 54 81 -237 95 -253 -213 -68 -20 -49 72 25 -146
3229a46L90j70l1r6O1oj32J77N2j46J57j14J57J15k38L6P0J91l62J57o8k09J33
$$ -146 244 74 43 -53 8 2 -130 47 99 -47 110 -4 153 268 30 66 136 327 -35 122 54 -155 -22
3252b2n9m0Q1l34K96L7L70k73J11J79r3J17m00q6j48L27k50o2J00M0k26L73K19
$$ -22 -81 -121 -40 -374 -78 -41 329 56 167 346 253 370 -30 -116 -264 63 -187 -249 -149 -109 -335 38 257
3275B57k51M08k52l58L96j52O2o1rj52j06M7p7J37K78k71J20J66j88K21J0k57
$$ 257 6 414 162 -196 200 48 110 49 40 -112 -218 -171 -248 -111 167 -104 16 182 -6 215 225 -32
$$ [...]
8191A93
##END NTUPLES=NMR FID
##END=
