##TITLE=1H_BAU-14.01
 CDCl3, 8 sc, 
 18.1.2019
##JCAMPDX= 6.0         $$ Bruker NMR JCAMP-DX V2.0
##DATA TYPE= NMR FID
##DATA CLASS= NTUPLES
##ORIGIN= UXNMR, Bruker Analytische Messtechnik GmbH
##OWNER= root
$$ XWIN-NMR		Version 3.5
$$ Fri Jan 18 14:36:17 2019 Russian Standard Time (UT+4h)  she@DPX200
##.OBSERVE FREQUENCY= 200.1313
##.OBSERVE NUCLEUS= ^1H
##.DELAY= (6, 6)
##.ACQUISITION MODE= SIMULTANEOUS
##.ACQUISITION SCHEME= undefined
##.AVERAGES= 8
##.DIGITISER RES= 18
##SPECTROMETER/DATA SYSTEM= spect
##.PULSE SEQUENCE= zg30
##.SOLVENT NAME= CDCl3
##.SHIFT REFERENCE= (INTERNAL, CDCl3, 0, 15.7039)
##AUDIT TRAIL= $$ (NUMBER, WHEN, WHO, WHERE, WHAT)
$$ ##TITLE= Audit trail, XWIN-NMR		Version 3.5
$$ ##JCAMPDX= 5.01
$$ ##ORIGIN= Bruker BioSpin GmbH
$$ ##OWNER= she
$$ F:/spectra/data/she/nmr/H-F/1/audita.txt
$$ ##AUDIT TRAIL=  $$ (NUMBER, WHEN, WHO, WHERE, WHAT)
(   1,<2019-01-18 14:34:42.21 +0400>,<she>,<DPX200>,
      <created by zg, POWCHK disabled, PULCHK disabled
       configuration hash MD5:
       00 E9 B6 7A A2 85 ED C7 34 08 36 98 17 FE 4E 26
       data hash MD5: 16K
       56 AA 87 28 9F FC FB C0 4B 3B 74 81 A4 6E 45 7B>)
$$ ##END=
$$ 
$$ hash MD5
$$ 64 AD 0B 71 5F CF 96 DE 95 A2 B6 47 F2 D2 57 33
##$RELAX= 
##$RELAX= 
##$RELAX= 
##$RELAX= 
##$RELAX= 
##$RELAX= 
$$ Bruker specific parameters
$$ --------------------------
##$DU= <F:/spectra>
##$EXPNO= 1
##$NAME= <H-F>
##$PROCNO= 1
##$TYPE= <nmr>
##$USER= <she>
##$AMP= (0..31)
100 100 100 100 100 100 100 100 100 100 100 100 100 100 100 100 100 100 
100 100 100 100 100 100 100 100 100 100 100 100 100 100 
##$AQSEQ= 0
##$AQ_mod= 1
##$AUNM= <au_zg>
##$AUTOPOS= <>
##$BF1= 200.13
##$BF2= 200.13
##$BF3= 200.13
##$BF4= 200.13
##$BF5= 200.13
##$BF6= 200.13
##$BF7= 200.13
##$BF8= 200.13
##$BYTORDA= 1
##$CFDGTYP= 0
##$CFRGTYP= 5
##$CHEMSTR= <none>
##$CNST= (0..31)
1 1 145 1 1 1 1 1 1 1 1 1 1 1 1 1 1 1 1 1 1 1 1 1 1 1 1 1 1 1 1 1 
##$CPDPRG= <>
##$CPDPRG1= <>
##$CPDPRG2= <>
##$CPDPRG3= <>
##$CPDPRG4= <mlev>
##$CPDPRG5= <mlev>
##$CPDPRG6= <mlev>
##$CPDPRG7= <mlev>
##$CPDPRG8= <mlev>
##$CPDPRGB= <>
##$CPDPRGT= <>
##$D= (0..31)
0 1.2 0 0 0 0 0 0 0 0 0 0.03 0 0 0 0 0 0 0 0 0 0 0 0 0 0 0 0 0 0 0 0 
##$DATE= 1547807681
##$DBL= (0..7)
120 120 120 120 120 120 120 120 
##$DBP= (0..7)
150 150 150 150 150 150 150 150 
##$DBP07= 0
##$DBPNAM0= <>
##$DBPNAM1= <>
##$DBPNAM2= <>
##$DBPNAM3= <>
##$DBPNAM4= <>
##$DBPNAM5= <>
##$DBPNAM6= <>
##$DBPNAM7= <>
##$DBPOAL= (0..7)
0.5 0.5 0.5 0.5 0.5 0.5 0.5 0.5 
##$DBPOFFS= (0..7)
0 0 0 0 0 0 0 0 
##$DE= 6
##$DECBNUC= <off>
##$DECIM= 32
##$DECNUC= <off>
##$DECSTAT= 4
##$DIGMOD= 1
##$DIGTYP= 9
##$DL= (0..7)
0 120 120 120 120 120 120 120 
##$DP= (0..7)
150 150 150 150 150 150 150 150 
##$DP07= 0
##$DPNAME0= <>
##$DPNAME1= <>
##$DPNAME2= <>
##$DPNAME3= <>
##$DPNAME4= <>
##$DPNAME5= <>
##$DPNAME6= <>
##$DPNAME7= <>
##$DPOAL= (0..7)
0.5 0.5 0.5 0.5 0.5 0.5 0.5 0.5 
##$DPOFFS= (0..7)
0 0 0 0 0 0 0 0 
##$DQDMODE= 0
##$DR= 18
##$DS= 0
##$DSLIST= <SSSSSSSSSSSSSSS>
##$DSPFIRM= 0
$$ [...]
##$SUBNAM2= <"">
##$SUBNAM3= <"">
##$SUBNAM4= <"">
##$SUBNAM5= <"">
##$SUBNAM6= <"">
##$SUBNAM7= <"">
##$SUBNAM8= <"">
##$SUBNAM9= <"">
##$SW= 20.0189088683792
##$SWIBOX= (0..15)
0 0 2 0 0 0 0 0 0 0 0 0 0 0 0 0 
##$SW_h= 4006.41025641026
##$TD= 16384
##$TD0= 1
##$TE= 0
##$TE2= 300
##$TE3= 300
##$TEG= 300
##$TL= (0..7)
0 120 120 120 120 120 120 120 
##$TP= (0..7)
150 150 150 150 150 150 150 150 
##$TP07= 0
##$TPNAME0= <>
##$TPNAME1= <>
##$TPNAME2= <>
##$TPNAME3= <>
##$TPNAME4= <>
##$TPNAME5= <>
##$TPNAME6= <>
##$TPNAME7= <>
##$TPOAL= (0..7)
0.5 0.5 0.5 0.5 0.5 0.5 0.5 0.5 
##$TPOFFS= (0..7)
0 0 0 0 0 0 0 0 
##$TUNHIN= 0
##$TUNHOUT= 0
##$TUNXOUT= 0
##$USERA1= <user>
##$USERA2= <user>
##$USERA3= <user>
##$USERA4= <user>
##$USERA5= <user>
##$V9= 5
##$VALIST= <valist>
##$VCLIST= <CCCCCCCCCCCCCCC>
##$VD= 0
##$VDLIST= <DDDDDDDDDDDDDDD>
##$VPLIST= <PPPPPPPPPPPPPPP>
##$VTLIST= <TTTTTTTTTTTTTTT>
##$WBST= 1024
##$WBSW= 4
##$XGAIN= (0..3)
0 0 0 0 
##$XL= 0
##$YL= 0
##$YMAX_a= 177702
##$YMIN_a= -163789
##$ZGOPTNS= <>
##$ZL1= 120
##$ZL2= 120
##$ZL3= 120
##$ZL4= 120
##$ABSF1= 10
##$ABSF2= 0
##$ABSG= 5
##$ABSL= 3
##$ALPHA= 0
##$AQORDER= 0
##$ASSFAC= 0
##$ASSFACI= 0
##$ASSFACX= 0
##$ASSWID= 0
##$AUNMP= <proc_1d>
##$AZFE= 0.1
##$AZFW= 0.1
##$BCFW= 1
##$BC_mod= 2
##$BYTORDP= 1
##$COROFFS= 0
##$CY= 11.3945322036743
##$DATMOD= 1
##$DC= 2
##$DFILT= <>
##$DTYPP= 0
##$F1P= 18.9103706918063
##$F2P= -1.10871071338519
##$FCOR= 0.5
##$FTSIZE= 0
##$FT_mod= 4
##$GAMMA= 1
##$GB= 0.15
##$INTBC= 1
##$INTSCL= 1
##$ISEN= 128
##$LB= 0.24
##$LEV0= 0
##$LPBIN= 0
##$MAXI= 10000
##$MC2= 0
##$MEAN= 0
##$ME_mod= 0
##$MI= 1.114404
##$NCOEF= 0
##$NC_proc= 0
##$NLEV= 6
##$NOISF1= 3.799351
##$NOISF2= 2.8
##$NSP= 1
##$NTH_PI= 0
##$NZP= 0
##$OFFSET= 15.70392
##$PC= 1
##$PHC0= -9053.815
##$PHC1= 11.20004
##$PH_mod= 1
##$PKNL= yes
##$PPARMOD= 0
##$PSCAL= 0
##$PSIGN= 0
##$REVERSE= no
##$SF= 200.130013532006
##$SI= 16384
##$SIGF1= 3
##$SIGF2= 2
##$SINO= 400
##$SIOLD= 16384
##$SREGLST= <1H.CDCl3>
##$SSB= 0
##$STSI= 0
##$STSR= 0
##$SW_p= 3612.71676300578
##$SYMM= 0
##$S_DEV= 0
##$TDeff= 0
##$TDoff= 0
##$TI= <>
##$TILT= no
##$TM1= 0
##$TM2= 0
##$TOPLEV= 0
##$USERP1= <user>
##$USERP2= <user>
##$USERP3= <user>
##$USERP4= <user>
##$USERP5= <user>
##$WDW= 1
##$XDIM= 8192
##$YMAX_p= 0
##$YMIN_p= 0
$$ End of Bruker specific parameters
$$ ---------------------------------
##NTUPLES= NMR FID
##VAR_NAME=  TIME,          FID/REAL,        FID/IMAG
##SYMBOL=    X,             R,               I
##VAR_TYPE=  INDEPENDENT,   DEPENDENT,       DEPENDENT
##VAR_FORM=  AFFN,          ASDF,            ASDF
##VAR_DIM=   8192,          8192,            8192
##UNITS=     SECONDS,       ARBITRARY UNITS, ARBITRARY UNITS
##FACTOR=    0.0002496,     1,               1
##FIRST=     0,             0,               0
##LAST=      2.0444736,     0,               0
##MIN=       0,             -163789,         0
##MAX=       2.0444736,     177702,          0
$$ Real data points
##PAGE= N=1
##DATA TABLE= (X++(R..R)), XYDATA
0 0 0 0 0 0 0 0 0 0 0 0 0 0 0 8 -8 8 -8 8 -8 16 -16 16 -24 24 -32 40 -45 48 -56 66 -77 88 -98 112 -128 144
36 144 -161 180 -202 224 -251 278 -309 341 -377 417 -460 508 -559 618 -678 749 -824 912 -1007
55 -1007 1115 -1237 1378 -1541 1736 -1969 2252 -2612 3083 -3730 4672 -6194 9051 -16418 80725
70 80725 165265 138323 177702 151885 120722 29134 -87145 -151074 -144118 -154541 -148348 -137994
82 -137994 -125886 -53178 72647 128774 133166 132988 122488 122107 128089 54953 -51662 -103228 -120073
95 -120073 -121618 -96724 -101694 -114006 -57968 25032 77711 114481 106819 70966 85339 107414 60571
108 60571 -5581 -58058 -96475 -82647 -54193 -75010 -88818 -59149 -24579 28006 79582 64231
120 64231 33789 52057 69082 62670 43843 -11438 -53929 -33007 -17077 -36161 -44840 -54214 -53965
133 -53965 -4857 31951 16496 8218 13447 17819 47271 57749 11512 -17259 -5993 -3695 -764
146 -764 -5135 -40864 -48798 -12103 1688 1520 8626 -3705 -2704 36321 46108 20233 7017 -7318
160 -7318 -12531 9511 896 -37640 -39079 -23274 -17865 4192 13695 -4759 4688 30616 31167 30875
174 30875 22473 -9432 -12777 6813 -7689 -26220 -24269 -30869 -19660 12444 11322 622 15110
187 15110 17375 14279 26804 13244 -15993 -13623 -12347 -22508 -13165 -13766 -25727 -2073 22315
200 22315 16266 22192 31027 16719 17696 21344 -2963 -16558 -17072 -35652 -37152 -18133 -24136 -22729
214 -22729 4757 12879 15316 34739 33489 23951 31080 18238 -5278 -3839 -12550 -33209 -27409 -23149
228 -23149 -30342 -12103 4165 -643 12104 26514 18951 24841 30814 7103 -5424 -1660 -13437
241 -13437 -17731 -12923 -28648 -29149 -3703 1232 466 15143 12709 10143 29231 27606 7731 4781
255 4781 -3546 -12715 351 -4239 -29696 -26627 -12414 -10547 2266 6738 -9612 -1288 19914 18222
269 18222 16996 15076 -4385 -1688 18467 8248 -8942 -11583 -19274 -12283 9327 -1391 -21416
282 -21416 -12627 -3153 4649 20091 9412 -11033 916 15352 13104 13393 -1055 -22546 -7478
295 -7478 12163 -26 -11156 -15151 -19178 2358 23098 6947 -6063 612 4037 17429 27791
308 27791 1148 -21643 -9609 -714 198 -1338 -22459 -32648 -4500 13862 8098 6038 -1561
321 -1561 -2211 25828 36464 11357 -4455 -8054 -9366 6824 7864 -23836 -35126 -17922 -5275
334 -5275 8521 10223 -11506 -9848 20108 27910 20530 11441 -10042 -12321 12399 11460 -12925 -23621
348 -23621 -26991 -14826 14516 13750 -10148 -7542 7729 18399 31003 19062 -13029 -13383 4184
361 4184 3977 -2938 -17411 -37188 -22948 8772 9338 -800 -2834 -3913 15636 40849 26958 -187
375 -187 -3477 -2060 3123 10951 -10816 -37452 -27672 -9188 -1519 4303 -6975 -17965 7030 31667
389 31667 24918 14235 3343 -6840 8300 20488 -1740 -21724 -23629 -21154 -3615 10014 -8298
402 -8298 -19121 -610 14228 22365 25220 4268 -8236 9187 15668 3300 -7560 -24313 -29764
415 -29764 -6276 4357 -9602 -13030 -9013 -716 23443 30954 9497 2286 10794 12290 15496 7892
429 7892 -18939 -25731 -10189 -7737 -10106 -11329 -22632 -15439 12560 19130 9903 8922 5609 9688
443 9688 25149 17922 -4466 -9216 -8651 -9644 -640 -6421 -24131 -17150 -349 2961 8411 7091 -3820
458 -3820 5059 21177 14833 5873 1253 -9980 -6609 5168 -5563 -17054 -12661 -11995 -5449 8665
472 8665 3826 -4586 6551 14069 13566 17488 8054 -5472 1824 4672 -6919 -9431 -13598 -22434 -11942
487 -11942 -863 -6499 -4107 3901 3788 13230 22045 11456 6722 11660 4515 -493 871 -11190
501 -11190 -18589 -9305 -9135 -11704 -2899 -2570 -3321 9445 12411 6341 10624 8830 -728 2645 1525
516 1525 -10050 -7766 -3833 -10431 -5513 2502 -1096 3234 11021 5235 5225 10609 1800 -2600 921
531 921 -7635 -11592 -2980 -5594 -9392 -1131 -5 109 11419 10364 1284 5227 4625 -2202 1892 -948
547 -948 -12907 -8121 -771 -3744 1054 4676 -1231 5106 14985 7904 2192 1187 -7419 -6828 464
562 464 -9373 -17226 -10126 -7107 -1211 10870 7669 1813 11237 15942 12592 12483 1916 -10731 -4547
577 -4547 -1297 -10862 -13302 -14247 -16331 -2661 9477 2530 520 6135 6586 14361 18237 1918 -7448
592 -7448 -1426 -1617 -1665 -945 -12968 -16880 -1120 5270 2299 2577 -2681 -3018 12534 15449 2460 -1771
608 -1771 -3837 -4075 6867 6528 -10581 -13602 -5874 -2649 3653 2771 -10867 -8570 6888 10392 9598
623 9598 7144 -3081 519 15856 12506 -607 -6275 -12111 -9598 1985 -3528 -17688 -15943 -8428
637 -8428 82 12201 8882 -2336 5324 17449 17611 15145 4284 -11119 -6655 2924 -4238 -13540
651 -13540 -18110 -20688 -6953 9661 5241 -1542 3518 8136 16382 22873 8262 -7698 -4214 -628
665 -628 -2413 -3897 -16045 -23452 -8225 5072 4123 3970 904 136 15581 23692 10282 -52 -3441
680 -3441 -6040 753 2172 -14157 -21124 -12549 -5812 1512 5236 -4359 -5171 10820 17312 14244 10117
695 10117 -743 -3705 7790 8128 -4582 -11004 -14505 -12635 765 2679 -9449 -8891 -656 4669
709 4669 12500 11477 -1833 -1782 8530 8297 5434 -361 -12869 -10511 2593 1008 -5613 -6148 -8334
724 -8334 -2066 11910 9660 -18 1290 3273 5202 10921 2706 -10939 -8481 -2427 -3519 -1887 -5862
739 -5862 -13350 -4000 7847 6702 5606 4470 -3 6248 13956 5403 -2967 -3420 -6651 -4079 1633
754 1633 -6698 -13317 -5762 -1038 1175 6138 1483 -3372 5500 9591 5376 4637 -844 -6725 483
769 483 3826 -3644 -5044 -3761 -5104 1567 6104 -803 -2283 3088 1926 3611 5371 -3214 -5689
784 -5689 785 -435 -2345 99 -4582 -5847 2591 3694 48 2774 1705 -20 5736 5335 -1781
799 -1781 210 981 -3301 -258 325 -6631 -4432 220 -2782 -924 2269 -2655 -854 4973 1253 684
815 684 4521 349 -1330 3571 201 -2984 1589 -227 -3519 1027 212 -3099 1734 1501 -3060 1418
831 1418 2199 -2339 325 1198 -4276 -1069 2625 -2009 -1514 1464 -2250 536 5840 1032 -839 3087
847 3087 154 109 4494 -679 -5057 -396 -698 -2702 718 -2529 -5804 1157 3151 -773 1468 152
863 152 -2933 3145 6086 -736 -1271 -35 -2392 2245 4946 -2392 -3628 1145 202 1320 3409 -3960
879 -3960 -5294 1953 1782 -1157 -117 -4398 -4851 3948 4787 -1095 -446 -1045 -961 6343 5683 -3038 -2545
896 -2545 219 -291 3351 1775 -6959 -5000 2152 1590 1418 356 -5681 -2802 6212 3619 -1054 -1490
912 -1490 -4448 -1844 6546 2738 -4764 -2646 -866 1491 7011 2597 -5159 -788 3955 3387 3749 -1138
928 -1138 -8571 -2862 3797 -111 -2808 -4492 -7314 -48 7910 2472 -1885 -292 356 5272 9337
943 9337 750 -5582 -1137 925 1479 2317 -5293 -9661 -1033 4055 1579 1038 -3371 -4918 4505 8500
959 8500 1087 -2118 -2829 -3142 3343 5131 -3976 -6675 -1586 428 4285 5038 -3494 -4232 3821 5429
975 5429 3638 1667 -5595 -6365 2683 3131 -2950 -4287 -5653 -3916 4978 4764 -2613 -1995 668 2419
991 2419 7333 4955 -4593 -3594 2578 1992 2155 -447 -7341 -4258 4199 2623 -508 -1505 -5196 -1723
1007 -1723 6256 2311 -4030 -2632 -1862 702 6132 2014 -4818 -737 3214 3345 4967 529 -6112
1022 -6112 -1178 3820 536 -932 -3093 -6836 -1071 4919 512 -1859 -471 -1210 2755 6718 121
1037 121 -4498 -624 -62 426 2373 -3184 -6604 2 3059 1865 3212 -18 -2184 4008 5882 481
1053 481 -785 -2280 -5035 -792 741 -5460 -5979 -2148 -1308 2521 5189 415 507 5930 5507 4589 4428
1070 4428 -1470 -4065 322 -1254 -5219 -4056 -5317 -5514 1299 2217 -950 2275 3627 2750 6406 4918
1086 4918 -1435 -985 365 -2776 -2010 -1943 -6398 -4208 684 -178 1024 4050 1738 2842 6676 3069
1102 3069 73 1327 -1956 -4376 -1689 -4255 -7198 -3293 -1877 -2513 2524 3329 1496 5558 6643
1117 6643 3303 4054 3524 -1665 -1763 -1420 -5619 -5116 -2726 -5062 -3508 475 -537 1308 5369 3031
1133 3031 2149 5146 2119 -481 1438 -1927 -4988 -1835 -1989 -3986 -602 -137 -1621 3307 5080 1694
1149 1694 3182 3063 -594 1048 1001 -4339 -4680 -2755 -4567 -2717 322 -2513 -1199 4138 3718 3378
1165 3378 4911 1261 -8 3760 1507 -2601 -1910 -4207 -4796 -302 -379 -3428 -1116 974 849 4388
1181 4388 3559 -1430 12 2710 61 97 -785 -5323 -3230 2127 654 -408 797 -1153 1092 5961
1197 5961 2772 -991 282 -769 -1287 1907 -1650 -6090 -2922 -713 -667 1816 -253 -3019 1778 5097
1213 5097 2939 2180 805 -2557 952 3685 -1084 -3030 -2238 -2990 121 2992 -1522 -3176 464 1154
1229 1154 2252 3810 -1234 -3845 716 2088 203 148 -2953 -4121 1573 3647 -205 -279 -621 -589 3983
1246 3983 4858 -830 -2179 -286 -443 1185 1073 -5066 -5145 -158 558 642 696 -2833 -1691 4586 4200 1527
1264 1527 1195 -995 -959 3869 2100 -3071 -3199 -2240 -1706 1846 634 -4150 -1531 1881 2098 3323 1739
1281 1739 -3110 -1018 3131 1354 -747 -1693 -4615 -2017 3003 730 -1603 74 28 2235 5805 2148
1297 2148 -2258 -109 767 64 1291 -2382 -6102 -2741 489 -420 380 -794 -2382 2316 5373 2131
1313 2131 696 805 -696 1512 3484 -1867 -4011 -1677 -1847 -39 1628 -1843 -3152 977 2454
1328 2454 1414 1972 -783 -2711 1531 2100 -933 -1140 -1876 -2395 1413 2514 -1391 -925 792 319 2701
1345 2701 3074 -1648 -1591 1014 320 407 596 -3243 -2956 964 281 -1398 -43 -1662 -1249 2844 1962 -480
1363 -480 742 825 531 3139 1901 -2223 -1095 442 -1003 444 -17 -3330 -1782 942 -786 -152
1379 -152 945 -1105 333 2708 956 -415 578 -666 -426 1822 -309 -2228 39 67 -449 1763
1395 1763 871 -1178 1042 1126 -265 762 29 -2497 -586 250 -2218 -1041 -63 -1364 169 2078
1411 2078 -209 473 2254 392 577 1910 -368 -1280 454 -874 -1829 276 -621 -1693 656 83
1427 83 -969 910 503 -800 665 497 -1425 84 448 -1236 21 1220 -262 706 1925 -530
1443 -530 54 1728 -201 -186 368 -1866 -1991 363 -637 -1534 536 -530 -772 1807 1442 -460 681
1460 681 571 -409 1339 593 -1977 -608 857 -405 892 863 -1316 17 1945 322 -3 86 -1967
1477 -1967 -1244 1037 -1113 -1633 -745 -1125 -293 2187 813 -991 1207 1641 945 1788 116 -2056 -10
1494 -10 607 -675 -324 -1080 -2648 209 1883 -290 -301 75 -850 733 2033 -574 -1376 133 -226 708
1512 708 1566 -1212 -1750 857 1197 483 1225 -800 -1588 1166 1465 -573 -304 -819 -1646 1179 1327 -1455
1530 -1455 -1342 -324 -619 1251 1374 -1728 -1400 1350 960 1380 1623 -1200 -947 1828 1065 -341 -263 -1891
1548 -1891 -1726 1104 7 -2248 -1364 -708 -327 2246 1174 -1109 89 1482 1408 1744 557 -2519 -1061
1565 -1061 1068 -219 -468 -781 -2032 -101 2499 1046 -242 304 -623 659 2378 -211 -2347 -873
1581 -873 -538 -299 860 -649 -2137 124 1777 1222 1802 526 -1012 1191 2198 -17 -912 -1253 -2018
1598 -2018 -97 1136 -1406 -1659 -556 -55 931 1925 -380 -1205 903 940 938 1130 -886 -1541 1218 1417
1616 1417 -207 -122 -840 -1309 862 1388 -1336 -1289 -548 -714 1019 1244 -1404 -1188 859 475 828 1015
1634 1015 -1182 -926 982 140 -322 -227 -1051 -422 1684 1081 -376 493 127 -27 1682 591 -1708 -1148
1652 -1148 -500 -1121 262 -171 -1811 -341 1122 695 1391 1386 -67 736 2105 506 -562 -324 -1332
1669 -1332 -1046 420 -848 -1876 -327 -365 -7 1496 544 -701 805 783 -170 619 -472 -1396 -59
1686 -59 560 -512 16 481 -548 872 1450 86 -23 374 -558 -464 377 -1033 -1263 -96 -434 -209 818
1705 818 153 -315 1231 663 -97 477 125 -821 136 275 -1010 104 313 -516 652 1147 -252 393
1723 393 699 -356 -351 157 -1048 -972 141 -1118 -743 549 128 252 1104 637 192 1361 608 -246 443
1742 443 -169 -957 -211 -584 -1371 -586 282 -345 622 818 -230 355 955 76 215 257 -928 -341 633 -114
1762 -114 -498 575 -264 108 990 24 -561 460 -185 -261 643 -558 -1153 -132 18 -394 215 73 -966
1781 -966 132 882 -207 -14 246 -732 327 1237 -344 -226 451 62 416 1033 -480 -1230 170 -85
1799 -85 -394 -11 -1035 -1362 119 459 -304 376 180 -97 1338 1280 -483 -280 -211 -544 579 203 -1308
1818 -1308 -938 81 -111 352 900 -697 -416 971 633 -56 -32 -1053 -945 670 137 -820 -173 -38
1836 -38 334 1812 1044 -280 108 430 -11 600 -292 -1739 -954 -117 -239 -176 29 -749 250 1627 989
1855 989 253 213 -457 211 1096 -248 -1361 -467 -714 1 767 -14 -518 485 849 524 747 -149 -1249
1874 -1249 64 182 -705 -946 -1004 -1252 235 1175 -175 -14 497 424 1302 1590 -140 -874 -81 -126 -357
1893 -357 -323 -1292 -1379 25 496 -137 114 3 -241 1193 1272 68 201 -70 -353 513 494 -962 -934 -487
1913 -487 -373 127 405 -577 -255 784 631 408 444 -473 -266 580 4 -688 -354 -857 -662 651 160 -467
1933 -467 -12 199 231 1242 663 -447 395 757 237 17 58 -1285 -495 243 -743 -881 -110 -683 57 997
1953 997 397 -30 743 198 422 974 169 -674 183 -153 -535 89 31 -722 -11 281 10 -3 27 -378 264
1974 264 467 -505 -269 -113 -569 -149 436 -474 -294 298 61 315 682 -19 -105 735 628 -146 415 -147
1994 -147 -847 112 197 -451 -19 -209 -323 156 465 -396 53 249 -413 161 366 -205 -183 516 -104 -243 426
2015 426 -97 -290 472 65 -530 289 -343 -398 223 -116 -403 47 306 -620 568 424 -171 325 681 -188
2035 -188 394 211 -509 37 42 -500 -261 232 -226 -81 293 71 -182 540 121 -265 186 -310 -253 331 -53
2056 -53 -513 142 66 -160 639 256 7 469 684 -31 -113 -166 -489 -363 200 -620 -571 -392 -370 179 278 -40
2078 -40 -162 557 276 119 593 -232 -667 316 82 -292 -262 -87 -249 400 448 -115 5 144 -203 185 261
2099 261 -808 -656 -240 -384 -59 309 89 -165 621 523 396 458 5 -42 335 173 -501 -646 -678 -840 349
2120 349 186 -547 -8 22 54 486 465 -186 -13 346 -198 11 -297 -970 -177 352 -13 -72 236 150 292 920
2142 920 577 -19 -13 -43 -393 317 -497 -906 -360 -43 -203 497 299 -176 472 1128 271 604 102 -332 -87
2163 -87 285 -351 -706 -300 -782 174 555 -107 -561 516 380 520 910 145 -324 246 186 -183 -467 -341
2183 -341 -501 168 300 -117 7 -79 63 303 429 -22 -429 -14 -417 -250 -109 -538 -469 25 -147 -25 185
2204 185 -129 16 782 554 -48 352 -90 -452 185 84 -901 -240 -127 -453 486 276 -394 -198 532 295
2224 295 262 273 -670 -630 404 -72 -133 208 -438 -65 611 247 -118 391 -84 -184 237 -219 -513 -156 -414
2245 -414 -364 11 -349 -640 -76 585 -16 284 304 -141 359 692 -6 57 -157 -314 -178 184 -449 -739 -277
2266 -277 29 -155 310 186 -409 475 413 -70 134 141 -304 84 119 -464 -155 -86 -554 37 370 -146 191 422
2288 422 -44 453 575 -91 -132 112 -528 -401 -181 -697 -538 -8 73 107 483 522 178 499 476 139 487 154
2310 154 -530 -81 -226 -922 -571 -4 -629 56 173 -204 105 645 63 164 472 -246 -326 -43 -324 -126
2330 -126 -69 -237 -411 104 132 -113 224 401 -18 408 62 -249 -63 39 -561 -106 -74 -462 -223 14 92
2351 92 -68 626 -7 81 382 207 34 438 -122 -296 263 -408 -315 94 -26 -259 160 141 90 370 30 -120
2373 -120 48 311 -352 78 259 -37 271 224 -158 -194 54 57 146 308 -465 -204 -79 -45 -249 126 -351 -361
2395 -361 0 105 -67 -9 -108 60 272 164 -64 251 209 9 309 103 -382 -452 81 -323 -91 256 -479
2416 -479 -309 426 28 -129 153 4 -106 411 290 -246 -141 -160 -49 454 -110 -188 42 58 96 417 130
2437 130 -293 11 171 -7 -43 -397 -537 -105 272 -219 -258 39 -470 198 686 342 -91 271 455 188 353
2458 353 7 -404 -31 -22 -360 -51 -262 -521 45 564 47 279 -154 39 339 579 -120 -61 342 -64 46
2479 46 402 -144 -191 -61 44 -38 276 -188 -153 398 281 -173 -138 -285 -282 162 140 -245 -477 -246 -134 228 402
2502 402 -72 -62 299 358 312 383 -154 -88 423 -195 -158 -39 -617 -362 -2 -35 -153 -10 -128 211 523 490 -84
2525 -84 -53 123 -95 165 -94 -510 -354 -157 -127 40 -265 -252 -47 244 5 48 191 -93 -183 418 -325 -272
2547 -272 -40 -278 -120 445 -154 -123 19 27 -13 418 276 -42 449 379 22 67 82 -269 83 -5 -386 -182 -67
2570 -67 -204 59 248 -125 170 289 407 387 301 128 5 67 -3 -86 -25 -331 -122 -63 9 -19 267 29 -137
2593 -137 432 182 -66 -37 42 -304 11 298 -310 -208 118 61 245 297 -83 35 208 118 -35 59 -367 -341
2615 -341 200 -23 -300 245 -3 -137 355 195 81 132 241 -37 223 247 -258 267 379 -273 96 -11 -387
2636 -387 -94 -58 -198 -120 294 50 -304 55 58 -49 236 43 -181 103 205 -199 62 -106 -178 105 333 -90
2658 -90 75 89 -375 147 14 -462 -358 -24 -117 -209 74 9 49 -51 94 -14 345 53 73 229 201 -352 4
2681 4 -15 -292 268 -118 -77 -87 98 -324 91 382 -90 124 365 -367 72 143 -15 -185 92 -84 66 67 -132
2704 -132 -255 356 161 39 -154 -223 -163 287 -43 -218 -2 -75 -194 -100 43 -411 182 105 60 189 428 -193
2726 -193 -72 334 137 -189 38 -238 1 320 -302 -66 28 -196 -77 72 -304 -370 8 155 174 143 30
2747 30 -306 243 233 -101 304 100 -189 70 306 -62 -24 -241 -152 214 50 124 -334 22 57 19 242 -252
2769 -252 -185 188 -8 -118 316 -25 -247 251 349 -32 -66 32 -96 -129 153 -353 -263 49 -12 -54 302 -181 -211
2792 -211 341 33 -70 -40 -297 -327 189 75 -317 -83 71 -262 187 80 107 229 -112 -167 290 -303 -428
2813 -428 -258 -206 -123 -97 -25 -577 -37 181 197 210 133 -5 -74 179 115 -202 121 -314 -163 -126 -221 -676 18 71
2837 71 -248 328 59 -7 477 99 228 80 0 -85 -7 253 -249 -35 -74 -163 27 754 149 62 91 -93 148
2860 148 128 -168 -135 -67 -166 -443 -208 -303 -305 8 77 6 366 283 31 411 519 -174 -359 20 -253 221 -236
2883 -236 -364 -248 -34 -120 175 17 -71 220 324 169 211 275 38 -23 249 -25 -297 -119 -64 -274 -52 31
2905 31 -97 -62 312 31 304 10 -410 -36 57 -12 -338 -56 -207 -196 30 -188 -124 128 69 -35 243 -48
2927 -48 84 374 132 -118 74 -310 -260 -135 -170 -385 45 -82 -225 91 291 43 76 172 -82 162 -41 -125
2949 -125 56 116 -172 -60 119 -125 110 288 188 -14 219 125 165 39 313 -70 126 -57 -185 192 106
2970 106 -228 -40 50 -89 -14 66 252 250 241 -154 128 334 -226 -98 71 -174 -279 107 -157 13 261 17
2992 17 191 214 -55 82 274 -332 -113 149 -49 12 228 29 -171 -53 -15 -55 158 188 29 -114 -175 -184 -203
3015 -203 124 -62 -173 55 -83 -89 177 -190 -108 212 172 -234 78 -58 -224 217 -106 -91 169 -308 -213 104
3037 104 261 -132 -284 138 -14 10 194 -256 32 120 -88 -66 68 -220 -136 217 -152 141 174 58 -211 312
3059 312 141 -49 225 -89 -194 71 80 -101 -158 -68 -14 185 128 -114 39 -101 225 7 73 -170 -63 193
3081 193 -42 -391 -184 -136 55 -23 -67 -176 -67 13 57 229 117 -264 67 32 -32 372 -147 -146 -41 -21 67 131
3105 131 47 -58 138 14 -6 -130 -203 93 -89 292 -152 -134 110 253 -52 243 132 -323 -90 195 205 209
3127 209 47 -130 301 407 -88 146 -117 -246 158 -66 -147 103 -152 70 50 267 -257 -64 157 114 149
3148 149 71 -207 -60 198 -7 -262 8 -224 -268 154 209 42 225 5 -36 -136 179 -249 -39 -164 -204 148
3170 148 225 -219 -75 140 -58 -69 73 75 70 130 52 -328 111 -10 -21 229 -142 -170 30 -39 -87 233 67 -238
3194 -238 128 158 -12 -88 22 -1 148 6 -32 88 182 -143 6 334 87 -100 49 103 118 257 126 -335
3216 -335 55 -108 -55 -113 122 -34 230 406 -34 95 34 -60 68 80 -132 -46 100 -448 -43 262 -28 -25 -60
3239 -60 32 -127 190 -96 234 245 111 -15 -160 147 -54 17 97 -200 -34 -83 -204 15 -125 -298 -17 -58
3261 -58 -160 -23 164 90 98 10 -258 -238 -14 -157 19 39 -50 41 24 141 191 -82 -36 67 20 -68 -305 -132 63
3286 63 -71 -86 -29 -248 23 201 44 -73 142 203 -37 258 -117 -69 265 -123 -211 138 -24 -342 -192 -292
3308 -292 -13 229 32 81 189 -215 -95 -21 3 -55 68 -177 92 56 -41 -144 22 162 -190 9 99 -134
3330 -134 122 -109 -62 -285 -55 -272 -8 216 -121 101 158 29 23 125 16 102 371 166 -37 108 31 6
3352 6 159 1 -321 -45 -146 53 -85 201 -50 115 52 -153 -44 56 -149 163 167 -80 123 111 238 -135
3374 -135 204 -46 -281 217 27 -110 50 96 -41 157 37 -147 -90 -123 -225 14 151 -8 -57 -9 224 108
3396 108 287 -252 -52 12 -57 -155 53 -112 0 -176 -64 -17 93 -19 -268 -10 196 -24 109 -94 -12 51
3418 51 -85 -154 95 123 -65 91 27 94 136 361 146 -78 111 -155 -188 -60 -258 -279 -106 -192 -190 81 292 79
3442 79 111 129 -23 -25 91 -119 22 51 -254 -64 21 -59 -84 -10 -101 -72 -144 -178 79 79 236 -106 -5 38 -194 176
3468 176 -141 0 -31 70 -124 111 12 -154 -123 87 -56 -102 -59 -124 68 -110 -118 -78 -25 -108 124 -54 88 71
3492 71 187 -9 75 138 66 149 272 -165 141 149 -199 52 108 -257 -61 -25 -292 -172 -126 -191 -155 182 68 -67
3516 -67 85 -93 156 60 131 -304 -72 -61 -87 243 92 -249 -162 -23 45 -26 19 -62 -72 -130 -63 -21 122 241 -146
3541 -146 161 246 -24 -155 241 -87 -44 -89 -40 31 131 -363 154 28 -154 -102 147 48 -194 33 -119 144
3563 144 -57 -214 -70 -158 -175 -145 147 -47 240 136 195 49 14 -86 -215 -163 -187 29 169 -60 111 134 -37
3586 -37 -195 0 226 -36 -93 136 -61 -126 29 -131 -100 62 140 -146 274 -26 -177 315 150 -147 114 57
3608 57 -141 57 28 -93 -20 202 -130 45 -19 -4 -34 130 98 -9 -108 -25 12 241 -14 -95 51 248 136 287
3632 287 -5 -30 226 116 -88 -106 -19 -29 2 -8 -59 3 378 105 -141 -196 -313 130 90 -50 80 209 56
3655 56 -26 106 -98 -108 102 19 -140 170 -116 14 116 53 119 138 -87 105 -105 178 120 179 -249 -197 44
3678 44 72 -193 121 -35 -166 8 -168 -122 -188 -36 60 45 106 -74 -28 -111 16 163 132 139 -218 198 -191 38
3702 38 78 -173 -111 143 -58 -71 -43 -251 -231 -121 -81 -48 254 40 -141 163 -90 -40 136 -72 -235 -82 -195
3725 -195 -32 73 -121 12 -243 4 115 -159 -342 -241 81 50 142 -206 121 175 -189 45 68 114 120 -9
3747 -9 -80 318 -98 68 63 21 57 196 -25 -99 -73 30 -35 36 49 -93 -254 217 167 24 -75 -126 -44 137 138 109
3773 109 113 10 49 242 -46 -367 -25 6 -145 -54 -37 -129 66 33 -85 41 9 151 4 361 72 -15 -152
3796 -152 188 -195 -102 10 25 -23 132 -105 -41 133 -236 0 -127 -107 -270 105 -38 188 38 117 106 226
3818 226 -57 77 65 320 129 225 -95 53 265 -149 -18 -67 -113 -91 130 -73 16 -28 82 -111 91 12 78
3841 78 -50 74 -209 -84 298 -145 -4 132 -83 20 281 7 274 178 153 -55 201 12 -30 -109 -93 -147
3863 -147 4 28 -217 -37 60 68 134 -210 57 152 29 133 23 139 -188 55 225 -60 -221 -84 224 24
3885 24 -192 -111 121 476 3 147 143 -49 -100 148 273 74 -12 -60 -182 -5 285 -222 70 17 -195 -27 112
3908 112 66 185 138 3 14 36 -27 -166 44 152 -1 73 56 6 100 208 -101 1 53 -68 -210 -143 -12 203
3932 203 -47 -49 130 46 -204 -21 128 74 -5 181 138 32 14 93 166 110 -189 155 192 153 -81 160 -18 -212
3956 -212 212 -28 -174 55 -154 -202 -149 5 -73 -83 -104 73 -21 163 -64 296 -94 -50 222 291 -246 8 -182
3979 -182 -112 83 -45 16 -215 145 -68 -6 180 59 -138 -155 -207 36 178 -95 -116 -43 42 -95 37 45 66 22
4003 22 87 -65 119 -91 -11 -44 74 -344 -277 221 -166 -144 225 40 -70 56 78 -69 164 94 9 451 -90
4026 -90 -198 115 7 -54 32 -189 -65 -39 56 -4 43 118 100 89 83 44 244 112 -124 -79 30 -80 -70 -183 126
4051 126 -5 37 87 -93 -69 -7 -107 -27 -38 9 211 94 1 -31 88 -70 201 -9 -9 -15 -128 -71 -116 93 313
4076 313 -97 235 51 -256 4 17 -70 -70 131 -225 177 23 -127 182 70 -121 204 15 44 13 -7 -135
4098 -135 45 323 205 100 -77 -40 -37 174 -223 -218 -63 -93 31 -104 -15 -126 -109 236 103 -5 -145 126 -27
4121 -27 -118 -84 -161 32 -109 -179 -43 12 -21 7 -226 61 99 -154 148 59 -144 104 240 -80 -17 -5 58 27 216
4146 216 119 -106 -84 -190 142 -183 -34 -94 110 -27 -175 80 89 -39 5 192 118 39 20 193 -100 106 -167
4169 -167 17 133 -36 134 357 34 203 70 52 -64 180 -239 60 135 -103 -73 123 23 -57 33 -18 -111
4191 -111 98 8 138 154 176 -106 -13 190 51 -56 122 84 -44 37 117 -125 -41 -204 -173 -44 100 62 -21 -96
4215 -96 13 -25 57 -245 245 -96 -46 127 68 296 30 -171 -399 9 -38 -61 -38 -133 -130 -35 -194 124 80 -12 -57
4240 -57 149 17 -2 127 -101 8 132 76 8 -130 43 -72 -98 -32 -121 -57 85 -141 -265 -159 14 -211 -120
4263 -120 54 -211 -114 84 136 93 17 -114 -48 -48 308 -161 25 -74 -85 137 258 12 -133 44 6 -52 43 -154
4287 -154 65 -26 158 -44 108 -155 -173 22 -166 169 -229 -82 -84 23 43 26 -149 60 80 39 -28 -73 -214
4310 -214 -127 228 150 64 -140 -152 -39 153 -91 -251 -125 118 173 -50 56 99 -111 -60 42 -239 -31 95
4332 95 73 -119 -82 34 5 -114 -59 43 -21 144 -173 19 106 -157 58 -35 -235 129 8 -17 178 -47 -81
4355 -81 199 340 -19 50 161 -84 99 159 15 -110 -64 225 71 -145 -278 56 136 -126 122 -11 31 -219
4377 -219 199 269 57 32 -128 -133 -31 75 -190 -119 -27 77 177 -33 15 323 53 -55 89 86 -94 -165 90
4400 90 -190 -32 -62 -135 -183 -60 196 -35 -192 88 90 97 -15 -140 171 225 249 31 166 137 85 110 3 -192
4424 -192 140 -9 -84 111 78 -141 106 -270 20 -87 2 250 116 -94 -200 -97 -74 68 -37 15 -47 242
4446 242 73 -131 57 -83 -172 -113 2 -132 195 18 -94 -31 -155 42 -43 299 -199 57 -26 258 81 -59
4468 -59 130 201 49 102 -87 -81 112 -57 35 66 87 -49 -89 -54 48 53 24 -22 -61 8 -66 36 -50 22 -154 -62 129
4495 129 -60 63 97 -7 -239 -16 13 -52 -137 -128 7 86 116 37 154 101 264 41 210 72 -66 172 -77
4518 -77 71 29 213 5 146 -116 -67 -7 31 39 -17 10 -249 185 164 298 -30 39 -43 -287 139 88 -54 51
4542 51 -38 108 226 228 37 -139 -98 -172 172 282 -4 146 -3 -88 -125 -14 -3 67 92 46 -49 170 97 -262 -22
4567 -22 -49 161 20 58 44 -212 -1 -71 320 4 -7 405 -68 237 -150 -142 -52 55 99 -256 -115 172 131 -324
4591 -324 179 212 -233 -272 114 -264 -14 154 109 2 38 25 -222 10 -87 -139 -214 -163 84 167 -25 -168 58
4614 58 -45 195 18 98 25 -74 48 -12 42 31 69 207 -109 -189 -95 122 -137 68 -81 -23 0 147 140 80 -179
4639 -179 -148 -241 -72 -60 -54 -27 23 42 -268 -194 6 -117 -46 165 129 47 -39 102 -141 -159 -38 26 -91 60 171
4664 171 -26 134 78 -87 -65 92 -38 94 52 -12 144 42 -46 -45 -51 37 -83 -54 -66 -258 -53 167 -24 187
4688 187 132 191 49 -72 4 123 112 -133 -322 154 -94 198 -134 -319 132 30 -60 -42 -150 37 7 -13 94
4711 94 17 36 -79 -46 -11 -34 -273 -165 51 113 35 -94 -136 -26 118 -84 -123 87 48 -123 72 -205 19 -164
4735 -164 -203 117 77 -102 96 -25 -28 -85 -88 133 -183 100 -124 -102 101 48 -270 114 -95 -237 232 -148 -200
4758 -200 159 159 154 280 -33 -61 146 -72 177 151 48 79 13 -170 -70 134 50 -78 -185 -96 -25 83 -9 95
4782 95 53 312 -33 -99 -92 20 60 56 -138 -79 41 -21 0 -8 -93 -88 5 44 -99 -81 -85 -49 -50 -105 1 -147 -140 184 8
4811 8 -37 -106 -27 -60 182 -80 136 -209 62 -128 -170 128 137 -111 -51 81 -99 -205 -65 318 52 40 -97 28
4835 28 104 214 -84 -28 2 18 5 -119 31 92 215 -37 -70 96 -33 200 146 65 75 54 -65 -309 -92 55
4859 55 81 186 78 48 258 -127 50 -19 95 -44 -14 257 -122 -34 1 87 57 -52 -54 -93 -74 106 191 25 -12
4884 -12 31 88 -108 -51 -44 -106 -180 159 251 -30 40 110 -96 93 -21 -268 -188 -45 -103 -76 -131 -50 -118 102 23 46
4910 46 171 156 47 44 85 -76 -23 49 -67 -109 -76 252 -86 67 26 -14 -213 -184 131 -72 -108 -73 106 -200 -186
4935 -186 -5 70 -48 -197 92 148 -36 -88 1 142 186 -56 -44 30 132 -3 207 -45 -102 -153 -23 79 -29
4958 -29 -17 25 199 92 94 -300 29 177 21 -31 11 97 -233 115 -116 -60 233 -95 69 122 -117 43 160
4981 160 110 10 -87 -8 -211 148 13 -282 38 -198 3 44 16 118 4 -4 -126 -36 -55 -19 52 47 -19 -146 105
5006 105 -153 78 92 37 -5 -266 90 -9 -11 -62 69 -12 162 64 100 212 -150 -79 -170 -6 -106 81 -175 -149
5030 -149 -94 123 250 -172 56 -197 203 7 105 133 2 -232 67 -96 -33 336 -79 114 -49 108 46 4
5052 4 -428 -19 -121 63 -255 -126 261 24 -2 -200 17 -233 36 -199 -55 -191 -9 -210 -48 -122 -128 52
5074 52 -14 -33 -9 -127 207 -11 289 -215 -73 108 -19 -48 -50 119 -185 342 -235 215 177 -116 -24 94 -67
5097 -67 22 -81 84 -140 34 4 39 328 84 76 -65 -88 -87 -122 -9 -18 -142 -118 88 -290 215 -63 -17 -18 -142
5122 -142 -59 9 24 -147 -63 -166 -144 -131 147 -83 -102 105 -71 33 55 -151 -170 277 86 -90 -19 -219 -188 24
5146 24 69 -56 -70 -19 117 -307 -71 -27 177 -41 -191 198 -195 53 104 -64 -23 115 -162 -98 -280 56 -206
5169 -206 -16 173 -34 -291 204 -113 -168 -48 -106 128 63 -49 -80 102 264 -55 -18 219 -122 -313 214 -137
5191 -137 -126 -164 160 54 -285 -49 17 -25 10 -59 -72 -84 -38 55 -83 -73 12 63 -231 -103 -182 40 331 -129 -330
5216 -330 -147 60 71 -26 42 -43 18 -266 59 54 175 114 -199 -57 -270 129 -52 -126 74 236 55 136 -41
5239 -41 -80 217 -56 -201 -59 179 109 260 35 -4 -154 48 -93 -170 155 -155 58 125 198 -24 -141 -50 204
5262 204 88 -30 226 -85 -188 -246 -57 36 -30 -94 3 -34 -299 24 -48 -164 -92 35 -148 -215 49 -40 81
5285 81 -86 58 71 -37 -31 -159 -73 194 -153 158 -40 59 -33 19 89 25 -86 -276 95 -95 -279 32 104 402
5309 402 44 82 -11 130 -128 -15 46 89 -55 -25 128 -213 -37 -65 240 -106 -66 152 -99 296 -68 -35 -2
5332 -2 79 -91 125 34 -61 158 -191 -43 136 -146 -89 -133 187 -257 -183 44 69 -26 -6 -24 96 363 135 76
5356 76 138 -110 -158 -120 -101 -43 -2 130 194 -59 62 -84 -100 -32 -246 -34 -14 -121 -257 -25 64 -88 -305 186
5380 186 175 -178 66 -281 -38 -130 -156 -90 89 -146 -72 54 -7 -1 238 134 -66 126 -18 142 -86 110 -44
5403 -44 -204 91 -148 -73 19 36 131 -254 156 219 -12 -223 58 -111 192 -58 -99 -40 -81 147 9 -71 34
5426 34 178 -9 -103 134 90 -66 -149 103 93 80 -58 318 87 -48 152 -51 226 27 -52 50 105 248 -93
5449 -93 -66 -118 -203 193 58 142 71 94 165 119 -6 104 63 65 -31 110 63 130 164 -164 -82 -88 33 47 145 -7 -24
5476 -24 -153 10 63 -136 -7 147 -113 -158 183 35 -85 -48 164 125 140 -108 -73 19 34 -50 -33 -128 -116 -48 -132
5501 -132 20 234 181 -74 147 -104 -32 -234 65 43 50 -118 14 80 -22 -30 97 75 -167 -221 29 -117 -169 -48
5525 -48 153 -64 -19 -21 -22 97 -63 226 29 -141 139 -95 -147 122 -84 -154 -34 45 -161 -178 -97 -167 57 -124
5549 -124 -255 -187 -112 127 -117 195 137 -33 13 -83 97 40 -34 -248 87 -206 -122 75 14 -90 -157 165 -89
5572 -89 -6 -41 -104 -142 -237 -84 -21 162 143 -66 -34 21 -13 -154 52 87 59 122 -144 -185 183 -137 -210 -223 -73 120
5598 120 -223 85 319 -91 -8 157 285 -78 99 -73 -22 -124 116 32 41 -15 114 -95 84 77 225 -86 -55
5621 -55 133 305 -24 -163 -18 -37 -11 -101 271 -290 120 75 10 3 -114 112 114 137 -243 -188 -100 188 -8 -181
5645 -181 103 -179 -19 15 99 162 156 -141 48 197 86 -109 -22 192 11 56 -243 -12 -106 -66 -34 -60 49 170
5669 170 13 64 -32 -31 -108 67 -9 -240 -86 -41 -332 -275 229 -106 -260 -101 -15 63 147 122 95 39 -68 2 41
5694 41 32 86 207 -109 -80 -125 -12 -21 29 -165 -53 -51 378 -168 118 -93 -200 -197 -65 134 -93 5 -4 -157 145
5719 145 -369 -95 26 -27 62 -9 41 50 192 -265 -38 3 154 -175 -184 -118 262 60 47 -71 181 -109 169 210
5743 210 69 -41 -83 -29 -189 -20 -149 103 14 -8 -273 184 -145 -46 -261 -57 187 -75 -253 -4 31 25 -22
5766 -22 -24 83 252 -47 -94 -124 21 -1 -80 73 -159 30 117 84 -219 22 -37 137 -4 -59 179 -79 73 5
5790 5 -39 -193 -85 63 -51 -64 6 50 16 -125 -6 14 -222 208 65 -42 -125 -72 -100 259 76 -39 137 -79
5814 -79 -25 29 19 60 -9 -143 -47 99 210 6 97 -170 -51 -113 159 -107 -23 117 -32 -116 -56 -74 78 -66
5838 -66 -64 96 -289 -68 -217 47 18 -189 -89 104 39 -7 -32 -19 190 -71 17 -135 79 101 17 -202 -74 88
5862 88 124 169 173 233 46 15 46 -116 56 -23 -42 132 -129 187 -114 -187 -191 -261 -41 -145 266 -13 -26 -32 -120 99
5888 99 -13 -94 25 -180 183 149 -22 11 -4 83 167 -38 90 17 -252 113 79 -61 -78 111 -43 -28 70 0
5912 0 -66 -126 75 63 46 82 -89 15 84 57 128 -218 -64 11 -84 61 -5 -11 64 -25 52 89 45 -75 81 -88 261
5939 261 -120 -93 -147 -96 44 -34 124 180 77 50 -215 -65 -83 49 -103 -131 -48 240 -31 -219 -209 -103 -204
5962 -204 -217 -2 45 -44 86 20 -13 -180 -28 180 150 35 50 66 -150 34 210 -131 60 -177 28 -58 15
5985 15 86 -93 -120 62 124 142 -29 -305 64 41 77 -112 134 6 -252 -230 -119 -91 -46 109 -178 115 120 -146
6009 -146 -33 302 4 268 -24 38 170 12 -109 -2 -1 -189 -44 42 53 61 135 -107 88 7 34 -98 175
6032 175 -65 -48 58 6 -76 -24 35 -43 243 203 118 125 -11 28 -170 -239 -124 -63 236 94 286 50 220 -61
6056 -61 -199 56 34 3 88 -393 52 -39 33 -115 -194 57 36 87 -113 176 45 92 -120 158 -165 -115 -135 4
6080 4 121 105 58 30 -146 -66 39 61 -12 152 222 5 93 67 111 -173 142 16 15 -40 17 64 -9 104 136 -52
6106 -52 -128 -75 97 58 1 188 -71 -190 162 182 -46 -40 -232 54 221 122 -80 -376 -152 172 -199 82 2
6129 2 -42 39 125 22 -85 -146 -64 63 -49 -111 -57 145 -115 -165 -49 -4 37 -150 -6 -136 18 -4 -103 193 -137
6154 -137 -119 -70 -6 -149 244 -49 190 -62 118 85 -124 111 -106 91 26 -3 181 -3 -25 108 -126 -174 -113
6177 -113 -43 -47 47 187 -143 -21 231 -23 15 60 -8 82 -8 -160 -8 55 -83 -62 69 7 -232 78 -9 -291
6201 -291 54 86 66 225 -80 -28 -112 -159 113 -146 -11 71 22 102 -238 -138 187 -65 7 -78 134 28 -64 11
6225 11 -229 -112 8 -164 93 111 -89 -26 43 -89 25 -45 130 13 95 -87 103 -7 -36 9 179 -21 -60
6248 -60 -193 -187 -106 -243 136 -86 220 9 233 35 -125 67 89 54 197 -37 274 106 150 50 -105 -52 -76
6271 -76 94 65 -89 21 271 83 -58 -94 88 50 41 75 -228 -210 -26 210 145 -4 -136 -6 122 -160 -122
6294 -122 149 -42 -69 6 -48 111 39 176 -45 -1 -252 -127 -31 -9 213 87 10 -53 147 49 36 -21 -127 -138
6318 -138 29 109 -214 -123 97 -222 -130 22 88 -219 137 200 296 -17 -225 -5 93 135 -222 90 -18 -38 23
6341 23 -126 -29 136 -166 134 -62 73 -43 178 21 -83 -58 18 218 113 -54 -65 -97 49 76 138 73 199
6364 199 -3 -178 -147 -41 -150 40 56 39 -173 -22 -68 -77 279 -132 17 -177 117 396 -220 10 -1 2 -23
6387 -23 35 152 -63 -115 -50 155 47 -68 -72 -158 -79 -21 86 -115 232 31 9 196 -252 2 31 190 191 -66
6411 -66 -161 -11 -172 -12 -42 -50 -79 10 2 -219 98 113 -34 -107 -60 -45 -81 29 31 -42 -122 131 -295 64 64 -26 64
6438 64 -1 20 215 4 257 128 -66 17 -259 -193 -220 5 -52 -174 -94 -96 24 -193 -122 -221 -149 27 87 -10 -60
6463 -60 0 132 18 -193 103 -173 42 10 -9 -18 -103 121 -92 -48 145 -117 -16 -27 -62 -26 -34 -83 21 -80 87
6488 87 -179 36 297 -17 -49 71 -275 -337 93 121 83 -95 -180 204 6 129 -205 -123 -249 84 -29 -83 -79
6511 -79 13 42 -99 -108 54 199 2 -329 68 111 145 -5 -306 2 -172 105 227 214 19 42 -82 99 36
6534 36 172 -183 -124 9 104 -132 21 44 2 -45 -87 -3 -182 -210 12 -60 -135 -197 38 75 14 161 -39 402 -99
6559 -99 47 151 93 74 16 205 31 34 163 -159 -83 31 -117 -78 74 -61 -55 26 138 82 -90 -177 -110 0 -134
6584 -134 4 -51 -35 -129 -55 163 267 63 -18 78 102 168 74 12 98 -101 107 -32 -205 156 219 -96 52 258
6608 258 162 75 168 143 36 -55 -54 -154 36 30 56 -51 -23 18 45 -8 337 -79 -12 -6 249 -62 -25 -78 -152 -121 -102
6635 -102 -285 229 -51 42 133 -34 -32 -140 32 116 68 -59 88 185 62 7 102 204 64 247 22 132 -13
6658 -13 60 176 -251 38 162 54 -76 -34 279 144 -67 166 44 47 -136 57 164 116 -103 -285 123 21
6680 21 3 -90 16 54 100 77 25 -51 -213 118 -38 -44 -60 -148 31 -13 -3 119 -91 -58 -55 32 -132 23 -159 149
6706 149 -12 75 4 103 -47 -206 86 -81 111 6 -193 29 -101 37 167 81 77 90 -415 -8 256 -46
6728 -46 248 -22 -61 -93 -127 -23 110 113 204 -31 -115 -139 -50 41 199 -61 -25 84 -133 -148 94 -9 -35 50 -52
6753 -52 -125 89 -58 36 -154 2 46 -134 133 184 -229 108 -107 15 97 -209 -74 38 -59 127 -171 57
6775 57 -46 -112 86 -52 155 -27 63 102 -37 11 37 226 57 -85 8 -91 -178 44 -16 34 177 -205 -99 -88
6799 -88 -120 -66 116 147 -12 -115 167 -159 12 115 88 -97 -219 146 191 54 146 133 -53 -1 17 -41 76 14
6823 14 -79 -26 25 40 22 120 164 248 -29 6 -26 -121 -111 20 113 -81 -71 140 113 -37 83 65 -94 151 116 -95
6849 -95 194 158 43 -158 -121 -57 199 90 -182 -81 69 -143 303 109 23 40 46 -21 263 170 39 -78 -150 -83
6873 -83 -124 131 -182 -11 182 -64 -35 17 28 -258 74 -69 -27 158 -101 108 -27 2 -47 -136 -45 -10 84 -31
6897 -31 -39 49 106 3 -4 13 139 -126 -273 -106 -58 -122 326 27 119 -75 124 123 107 78 29 -208 -111 7 -72 -62
6923 -62 -7 -59 51 -69 41 173 -100 113 83 -22 -62 -114 60 -65 -69 -119 -54 41 -49 -146 33 -6 58 51 48 -68
6949 -68 -246 -39 78 45 -156 -64 -281 82 -307 -22 -43 208 -73 -135 -20 -10 -83 16 -153 -346 -192 -19 116
6972 116 -2 36 160 -110 -120 -88 -69 -39 -238 108 -103 30 211 128 -234 39 163 20 -34 21 -106 20 16
6995 16 140 -59 -80 13 -29 -47 15 38 41 -43 108 -101 9 64 -84 189 180 48 16 24 -7 -263 -143 247 -51 167
7021 167 150 -234 21 44 4 -107 84 -249 -23 -6 -95 188 70 -149 43 153 262 -22 -132 -149 -178 161
7043 161 -251 -195 162 -46 -43 -171 -98 -201 -146 245 107 -94 79 176 -63 -248 -111 -78 190 77 -52 -38 132
7066 132 92 -129 -42 93 63 -173 41 -145 -39 42 53 151 -115 -65 -28 -175 114 25 -184 -292 -43 -58 176
7089 176 -58 -101 82 68 -114 -209 155 31 58 28 -38 72 -165 3 -135 -127 61 -122 38 111 -23 -33 -122 71
7113 71 41 -73 -48 226 15 -124 -172 170 3 -19 -198 -49 -87 52 17 20 -148 -62 204 -62 -78 -170 -44 167
7137 167 49 11 -150 65 -3 87 72 136 -34 236 -79 -260 -88 -68 194 43 66 -86 73 -28 247 136
7159 136 -98 309 -110 25 30 -206 134 185 -17 -49 -29 -31 87 153 150 -80 43 314 -68 -179 -2 10 53 79
7183 79 177 78 288 201 -146 87 95 210 150 63 -38 -47 -65 47 20 -237 -167 36 75 232 -176 -198 237 51 -156
7208 -156 -44 115 -12 209 -143 -70 74 -52 99 147 -128 -5 -153 -14 130 20 49 208 149 23 -97
7229 -97 -38 139 79 -276 -183 49 109 66 32 -110 -270 -6 -75 24 -40 -365 -2 10 -125 173 0 -108 -43 -23
7253 -23 -74 208 -67 -176 -263 -37 -100 11 -81 130 121 51 -83 10 -214 -126 -34 45 270 37 137 -10 65 -297
7277 -297 -64 64 85 102 -167 1 6 33 144 -73 -180 337 -95 35 71 -170 -60 -103 -102 -21 -192 -32 -237
7300 -237 271 251 -175 -202 -152 -15 -101 -17 158 -147 33 -100 -34 -43 -149 36 -18 81 -71 85 26 111 -23 -75
7324 -75 57 -76 -224 -17 -31 -16 -217 -207 124 95 -75 127 -25 -94 -34 87 -134 -47 35 61 79 44 53 -94 111
7349 111 -111 -14 44 -163 71 -62 287 71 193 -202 289 15 -249 -244 -9 25 -98 304 -188 26 32 -40 -250
7372 -250 -146 -43 -112 98 159 107 -172 -162 -72 40 -167 26 271 256 -205 91 36 148 95 -112 2 -144 -117
7395 -117 -254 86 40 -58 -163 -44 2 -57 11 -127 48 -59 -58 -127 208 87 83 112 -174 48 -70 110 44 -86
7419 -86 -162 151 63 22 -84 143 232 207 34 73 158 -8 27 102 -26 214 83 -27 122 45 -99 190 -301 -101
7443 -101 33 102 67 -138 -283 5 204 50 -31 -84 -23 -1 -97 -71 48 44 79 26 55 143 89 -169 -80 -163 -45 -109
7469 -109 -13 -215 -100 -6 85 -196 -9 51 28 148 -91 196 -37 -58 -46 26 -336 -6 -110 165 35 -49 170
7492 170 47 187 -65 -131 266 -122 -49 6 202 -18 85 -152 -161 117 -78 116 174 -279 -159 67 -73 332
7514 332 5 187 105 -53 177 23 -127 141 -361 -32 63 -92 -147 147 57 -70 239 238 56 33 84 -66 102
7537 102 -46 29 87 -58 -148 -242 -73 -22 117 -194 11 -168 256 123 -21 104 55 -206 -293 139 -51 89
7559 89 -144 -167 117 -102 -150 -76 -128 57 -257 -64 -309 -204 -76 116 6 -31 19 30 35 -30 -44 -90 20 35 1
7584 1 -121 237 160 -107 28 -64 2 -240 -68 204 -6 263 -157 53 -78 71 -7 -72 47 -92 106 22 -56
7607 -56 -14 -31 22 11 -51 48 147 41 -393 -42 42 -92 5 -21 -48 145 -8 -179 -67 43 61 57 -8 52 -137 157
7633 157 258 -99 148 -15 -209 2 7 -73 136 -34 -46 60 -2 57 2 74 26 196 -94 219 -3 38 8 -58
7657 -58 -153 -285 43 264 -125 26 29 302 -71 -18 69 -107 -42 151 -102 -11 41 -15 30 89 25 34 -15 31 -53 -214
7683 -214 178 83 165 127 -121 -30 -132 -139 5 104 -3 103 130 312 119 29 -38 -180 118 -46 -239 -106 -48 11
7707 11 246 304 36 63 215 -40 40 47 83 -137 67 190 -188 97 17 -75 15 176 -50 24 115 -113 35 -37
7731 -37 121 65 -137 141 135 131 56 22 -231 -61 99 15 -109 -142 -57 -127 48 30 5 136 363 126 -124 -24 -217
7756 -217 234 -40 -213 -136 -222 -31 88 -264 3 -123 -115 -1 106 -52 -8 -24 179 77 62 -7 39 -205 134
7779 134 -107 239 135 119 -82 37 128 61 -14 -156 240 -39 136 129 -79 -108 167 98 59 -10 -130 -58 115 -20
7803 -20 222 78 -59 -80 -40 -13 317 148 182 96 148 -211 -10 38 -76 379 -49 16 -129 7 -107 -105 72 -121
7827 -121 79 -93 -139 165 -166 128 14 66 -24 -188 -125 68 -111 -187 77 8 18 -52 -85 47 -39 34 -83 53
7851 53 153 227 -106 38 -108 -228 0 27 205 -32 18 -14 -65 25 -5 -51 46 -195 -118 5 93 56 0 46 -155
7876 -155 -186 -14 -47 -130 -26 -161 61 277 -5 97 -61 -60 134 -129 -29 35 -310 98 6 312 -124 -88 -213
7899 -213 -129 189 -253 51 59 -34 -59 -140 -75 202 149 -44 133 90 -11 207 -109 -27 125 60 -52 -115 45 -19
7923 -19 -9 206 148 -41 67 -17 -37 54 -96 186 195 -122 -88 -243 40 -6 -141 -1 182 -52 -16 48 -99 -22
7947 -22 182 -60 -86 1 -116 -79 -11 -157 -102 -141 140 102 167 154 28 70 106 273 -164 -9 142 -130 -147 250
7971 250 -14 11 238 77 50 -76 6 79 31 228 109 -45 -135 1 166 212 -45 -89 102 -48 -32 -152 62
7994 62 89 -4 103 251 -220 -223 151 -3 74 -149 18 204 40 -72 156 125 127 -150 -7 125 -37 82 58
8017 58 -20 -71 122 -178 -244 30 49 60 -114 -30 85 118 94 -73 0 92 50 -63 166 90 31 -102 194 -75 191
8042 191 133 -4 103 134 131 -133 21 33 -60 29 -131 51 74 48 69 -36 231 135 27 -181 -55 -27 -48 102
8066 102 24 -133 -39 -27 4 -188 121 -158 -184 -19 -33 -49 52 70 -231 -171 154 195 -51 -39 9 12 -199 -41 128
8091 128 109 -13 93 179 -166 74 61 -21 -184 163 -128 75 -10 203 116 90 -12 -129 133 -108 91 175 111
8114 111 -28 -168 -153 100 194 -190 51 20 171 -156 -71 200 32 -27 66 -171 -42 -12 -107 -48 79 -123 25
8137 25 4 -18 82 -52 72 -10 -163 -109 82 188 -84 -130 6 -75 61 -167 -9 -262 37 8 134 100 -173
8160 -173 -36 -97 310 135 108 -70 -58 -163 -89 21 108 -181 -26 -98 54 -82 -194 27 160 -44 -25 28 -54
8183 -54 -15 -287 144 32 123 -130 -100 -7
8191g
$$ Imaginary data points
##PAGE= N=2
##DATA TABLE= (X++(I..I)), XYDATA
0 0 0 0 0 0 0 0 0 0 0 0 0 0 0 -8 8 -8 8 -8 16 -16 16 -22 24 -32 32 -40 48 -56 63 -72 81 -92 105 -118 135
35 135 -151 170 -189 213 -237 264 -293 324 -360 398 -438 485 -534 590 -648 714 -788 868 -959
54 -959 1061 -1174 1302 -1452 1626 -1832 2077 -2379 2762 -3266 3956 -4971 6609 -9712 17702
69 17702 -86932 -145013 11287 88214 152221 165126 151061 144915 169465 116644 26999 -60106
81 -60106 -136132 -163789 -125489 -129269 -152215 -117851 -42342 40184 126108 139373 105359 112862 130455
94 130455 101537 56305 -19401 -105759 -122116 -94996 -98510 -99543 -88646 -70610 2293 90411
106 90411 100608 78797 80333 79917 83430 76818 8997 -61416 -71736 -69685 -66125 -50364 -67927
119 -67927 -82898 -29198 31831 49386 52756 38758 26690 60012 75890 32153 -5207 -22556
131 -22556 -37194 -18489 -5059 -41049 -60594 -37971 -17146 11502 30025 1357 -10357 26798
143 26798 44405 36497 26106 -5718 -20122 7207 8513 -20404 -28222 -35488 -34806 2080 17861
156 17861 -5530 -5316 11136 21711 43452 38878 -2699 -10558 5472 -4200 -11501 -16320 -41524
169 -41524 -38327 -5061 1432 1158 10251 3809 13451 43791 33765 4202 905 -5856 -13220 -1185
183 -1185 -12687 -36085 -22516 -5428 -3092 15408 20486 3574 14543 27654 12266 4739 -2870
196 -2870 -27195 -23589 -8216 -23259 -26541 -6492 -2846 8094 32279 28092 21993 32127 20388
209 20388 5910 9811 -9976 -34340 -26458 -27272 -38640 -22318 -10574 -9558 12598 25774 19200
222 19200 31710 37929 17451 12966 11567 -11741 -17922 -14594 -31896 -32083 -14483 -14536 -6344 14976
236 14976 10595 9112 28525 27233 17010 16901 -1221 -16358 -4381 -9191 -27821 -21909 -18031 -19888
250 -19888 1841 12425 962 7978 19764 17501 26927 24232 -3893 -7968 5645 -3179 -9109
263 -9109 -11034 -28422 -24764 -30 -461 -6893 -701 -5379 1653 26488 20786 116 3254 5724
277 5724 6814 18563 4540 -22470 -14853 -765 -2512 994 -7333 -25101 -8990 14491 9865
290 9865 5678 1811 -9071 7183 28278 10202 -10642 -9746 -10188 473 11713 -9472 -27216
303 -27216 -11556 1739 10063 19103 1562 -13399 9551 26907 17603 7804 -10005 -21539 -608
316 -608 9998 -11864 -23669 -23151 -18441 7189 20539 -1265 -8811 8142 18494 29708 28012
329 28012 -3736 -17120 1829 7501 -1004 -10822 -31826 -30931 1737 11119 -2077 -3760 -5169 3291
343 3291 31326 31166 1030 -9543 -4303 693 11870 260 -31819 -29847 -4912 4663 10199 5728
357 5728 -12314 -689 29494 29543 13377 688 -14519 -6525 13859 -283 -27338 -29949 -23436
370 -23436 -6887 15200 5186 -14766 -1388 20075 28109 31461 13631 -11099 -1843 14059 4509
383 4509 -9068 -24290 -35456 -14323 8880 -1909 -13608 -7868 -575 19418 35360 15339 -4924
396 -4924 1474 7080 10658 9520 -16353 -33859 -15132 23 -1824 -2405 -11363 -12531 14818 30722
410 30722 16839 7167 1891 -444 14295 15789 -12181 -26361 -20452 -15492 -2937 750 -17798
423 -17798 -18384 6202 18147 21387 20216 4273 2649 21070 19495 1896 -7982 -19882 -20819 -2268
437 -2268 -2739 -21203 -20598 -10954 -940 16347 16703 181 4044 16671 16069 16553 7994 -12828 -12016
452 -12016 2017 -3428 -10864 -12916 -19417 -9685 10402 7569 -968 3909 4687 10229 21707 11052
466 11052 -6198 -3121 -1446 -5368 -1509 -9636 -22434 -11839 -48 -1587 2364 3194 -1305 11729
480 11729 23157 12801 7543 7363 -1892 -372 4420 -10284 -19721 -13945 -14530 -10961 -970 -5107 -5796
495 -5796 9657 13337 11186 17270 11540 2869 8895 6260 -6476 -7276 -9728 -16411 -8356 -3130 -8802
510 -8802 -2950 5023 2210 8174 13900 4575 3474 7641 -1951 -6513 -1675 -8627 -10410 -2052 -4632
525 -4632 -4777 6476 5717 3110 10953 7930 1056 6824 2629 -8907 -6254 -5427 -10344 -3205 -735
540 -735 -7764 -510 8032 4694 8083 9461 -1664 -1287 5415 -3044 -7518 -5018 -10715 -6724 5881
555 5881 3123 -1125 6486 7368 8799 15654 5952 -7621 -4266 -4153 -9179 -6744 -11851 -19506 -7831
570 -7831 4323 3356 7477 8628 4547 14299 21450 8375 -415 -1688 -7941 -4954 -347 -13199 -19857
585 -19857 -10109 -3935 2330 9199 584 -3168 10231 14762 9618 7205 -2863 -9456 2033 4788
599 4788 -6615 -10100 -10418 -8957 5005 9564 -3420 -5374 2474 5525 12823 12122 -4652 -7720 4158
614 4158 5531 2729 -1533 -13985 -13260 1825 2387 -5529 -6697 -9503 -3193 14256 13711 898 1506
629 1506 5813 9949 17265 8851 -10110 -11216 -4006 -4471 -4740 -11263 -22957 -13150 4741 6749 4986
644 4986 4713 1748 11951 25292 15875 802 -3734 -6796 -3454 2628 -10495 -23869 -16444 -5885
658 -5885 1530 9269 2843 -4381 8892 20408 16179 9774 -1318 -10582 -1844 4331 -8061 -16870
672 -16870 -16892 -14419 424 11416 1364 -3514 5999 12474 18109 18254 1921 -8073 260 2186 -2739
687 -2739 -7009 -18057 -20315 -3757 3771 -2594 -3318 -3025 1288 16540 19522 5350 159 2435 2858
702 2858 8238 4514 -12584 -15480 -5534 -2678 -1643 -2529 -11466 -7414 8750 11248 5923 3931 -1720
717 -1720 1291 13291 8121 -5463 -7691 -7558 -5119 3216 -763 -11918 -7340 1925 5393 9933 6278
732 6278 -3098 2390 11564 6746 1463 -3477 -11768 -7055 2353 -3485 -10092 -7649 -6543 1011 10948
747 10948 5781 -505 4864 7519 7834 10484 1322 -8492 -2987 550 -3915 -4081 -7582 -11639 -1564
762 -1564 5639 1077 464 1276 -671 6203 10521 1058 -3539 -589 -1982 -223 2618 -4946 -7630 319
778 319 1608 1041 4169 -775 -2829 5409 5468 -176 445 -1977 -5710 620 1631 -5340 -3848 -1444
794 -1444 -3214 2236 4467 -1728 607 5413 2119 3057 4963 -1481 -1655 3218 -779 -3362 -340 -4218
810 -4218 -4852 1193 -640 -3479 1474 195 -1806 3453 2654 -1416 2439 2845 -2315 1106 1587 -2704
826 -2704 387 1766 -2957 -540 3137 -1344 -349 2837 -1560 -1087 3364 -1357 -3656 221 -2525 -2227
842 -2227 2450 -939 -4324 1199 1348 262 5035 2350 -2592 2641 4285 -226 927 -325 -4942
857 -4942 -95 2710 -3239 -3085 -1564 -3453 1070 4823 -1950 -3400 1214 395 2016 4724 -1941 -4463
873 -4463 2335 2643 955 2643 -2242 -4098 4405 4559 -1450 -1327 -2599 -3993 2937 3604 -4838 -4615
889 -4615 -1374 -1478 3931 3863 -4128 -3087 3560 3096 3632 3014 -4279 -3379 4858 3131 -1305 -1954 -5175
906 -5175 -2553 5948 3414 -3820 -2429 -1521 175 6306 2466 -6618 -3779 785 998 2963 -554 -7295
922 -7295 -1815 5868 3920 2349 288 -4047 1925 8957 2811 -3620 -3486 -4468 -543 4767 -2473 -8534
938 -8534 -4271 -680 2482 5682 -367 -5491 2499 7269 4638 3289 -1860 -5757 1875 5696 -1004
953 -1004 -4138 -5173 -5209 2725 6823 -1952 -4649 -467 982 4973 5987 -3330 -6646 380 2427 1248
969 1248 344 -6312 -6456 3689 6025 1209 320 -2348 -1255 7344 7498 -1924 -3766 -2439 -2016 3247
985 3247 1958 -7627 -6684 -135 1141 3172 1948 -5163 -2579 6478 5558 1866 239 -4503 -1705 6425
1001 6425 3649 -2841 -2980 -3005 -659 6010 1961 -5741 -3037 354 693 3186 -537 -7298 -2369 3882
1017 3882 2267 1846 -275 -4230 1146 7902 3124 -964 -846 -3274 334 5014 -1229 -6229 -2586
1032 -2586 -1336 636 4376 -905 -4485 1619 4353 2431 2706 -1519 -5605 295 3271 -1614 -2555
1047 -2555 -3125 -4174 2191 5910 574 -30 2795 1860 4425 5524 -2061 -4882 -868 -1931 -2887 -2084
1063 -2084 -6472 -6700 896 2348 914 3187 2060 1603 7302 6758 610 443 -441 -3174 -584 -1659
1079 -1659 -7007 -5348 -1732 -2279 773 3098 -980 1544 6547 3907 2677 2962 -2095 -2807 554 -2589
1095 -2589 -5273 -2611 -3878 -3078 2457 2158 406 4598 5184 3164 5292 3115 -2319 -1145 -1078 -5189
1111 -5189 -4361 -3861 -6848 -3495 506 -886 1655 5629 3264 4109 6829 2987 1158 2656 -1300 -4089
1127 -4089 -2195 -4629 -5510 -1942 -2364 -3005 1844 2636 1464 4507 4148 487 2944 2524 -2360 -1947 -1986
1144 -1986 -5284 -2325 -49 -3121 -1244 2494 1329 3432 6203 2050 329 3149 373 -1663 -717
1159 -717 -4688 -6043 -1598 -1975 -3499 -367 -422 -393 4914 5645 1417 2336 2512 380 2112 1339 -4553
1176 -4553 -3833 -1354 -2585 -727 423 -3086 -746 4429 2678 1328 1786 -1313 -811 3227 15 -3659
1192 -3659 -2318 -3200 -1781 2815 1194 -2188 853 2958 2518 4702 2044 -3113 -615 1835 -988
1207 -988 -1369 -2899 -5970 -1707 2400 -413 -1535 -6 -860 2432 6063 1375 -1914 401 329 1016
1223 1016 2715 -2115 -4873 -521 1192 107 1169 -1526 -3340 2235 4413 750 -465 -1406 -2529
1238 -2529 1488 2875 -2432 -3504 -1534 -1361 2007 3295 -1832 -2132 2453 3238 3118 2838 -2273 -2696
1254 -2696 2300 1644 -1334 -2135 -4777 -3957 1649 1490 -2296 -1521 -400 462 5152 4125 -1165 -634 1798
1271 1798 1474 1829 -11 -5199 -3358 1332 327 -573 -448 -3035 -498 4838 3043 -625 -272 -1304
1287 -1304 -308 3084 -110 -4717 -2781 -1242 -170 2595 239 -2889 937 4553 3119 2958 786
1302 786 -2622 265 2745 -580 -3055 -3121 -4359 -1514 2303 -1200 -2769 53 1042 2710 4817 801
1318 801 -1954 1618 2018 960 1099 -2432 -4363 -35 1646 -650 -421 -883 -1995 2204 3989 -392
1334 -392 -915 -85 -922 998 1621 -2752 -2995 198 34 470 1591 -1945 -1893 2800 2627 778 1224 -818
1352 -818 -1573 2258 1462 -1829 -1106 -1413 -2259 1072 523 -2981 -1326 608 90 1917 1650 -1344 315
1369 315 2951 1175 1152 1151 -1723 -1010 1787 -505 -1582 -612 -1649 -1279 1671 64 -1673 499 370
1386 370 59 2127 526 -1980 116 821 -1065 237 48 -2120 -20 1560 -97 724 1530 -414
1402 -414 729 2053 -465 -1084 -33 -1593 -1576 109 -1663 -1954 818 -37 8 1928 1034 -220 1797
1419 1797 1258 -689 1001 509 -1702 121 140 -1469 85 888 -909 233 917 -862 -9 992 -1142
1436 -1142 -799 647 -979 -1199 937 -777 -581 2031 878 304 1631 570 -524 1561 916 -1582
1452 -1582 -398 -588 -2017 111 514 -1934 -100 950 -184 916 1102 -1191 -367 1434 -288 -402
1468 -402 174 -1736 -580 2213 562 -307 1056 240 348 2335 461 -1660 -277 -560 -1156 145 -777
1485 -777 -3009 -658 1344 213 959 859 -958 1279 2983 572 45 -83 -1409 -49 1448 -1066
1501 -1066 -1848 -180 -555 281 1904 -840 -1740 719 1032 189 785 -1315 -2359 1004 1454 -380 251
1518 251 -386 -1214 1529 2364 -667 -570 128 -269 1281 1757 -1385 -1749 438 186 364 739 -2066 -2215
1536 -2215 938 1101 -662 53 -1482 -853 2291 1975 -71 437 362 66 2447 1309 -2039 -1227 -480
1553 -480 -758 400 -375 -3197 -1493 1231 896 665 623 -1017 177 2771 986 -201 -614 -1306 -691
1570 -691 1268 -100 -2263 -648 145 938 2536 742 -1551 548 1584 349 538 -1195 -3037 -809
1586 -809 679 -490 -1018 -691 -1277 1030 2891 521 -123 856 194 1371 2197 -857 -2140 -329 55
1603 55 -271 253 -1746 -2209 699 1248 35 518 -629 -927 1427 1731 -421 -520 -152 -318 1283 1383
1621 1383 -878 -1144 129 -1 495 430 -1666 -1548 916 661 152 397 -983 -764 1570 990 -639 11
1639 11 -781 -776 1137 184 -1592 -473 401 246 1646 1193 -1067 439 1537 367 500 -305 -2044 -1430
1657 -1430 279 -1135 -1450 -493 -787 -254 1953 713 48 1198 1010 766 1774 15 -1567 -215 -228
1674 -228 -1048 160 -575 -1436 216 1201 132 407 503 -749 310 990 -923 -926 -91 -840 91 853 -113
1693 -113 -492 1079 786 382 1290 -130 -660 571 -223 -911 -143 -562 -1450 201 523 -557 579 771
1711 771 -110 665 485 -629 -388 262 -690 -155 674 -293 10 1074 22 377 1204 253 -279 554 -499
1730 -499 -1205 -256 -992 -1352 -155 -291 -820 785 867 20 1232 1385 218 737 740 -646 -304 344 -711
1749 -711 -597 -89 -984 -649 802 -62 -137 491 -80 -63 996 38 -940 428 -262 -661 688 -78 -701
1768 -701 408 762 46 903 463 -603 179 611 -509 -185 -76 -1012 107 584 -556 -608 195 -382 261
1787 261 981 -526 -705 617 298 272 764 -1 -492 1022 1009 -51 485 -648 -982 328 262 -1188 -892
1806 -892 -655 -1074 330 730 -479 -26 1002 578 990 1006 -869 -632 495 -4 -378 250 -1010 -897
1824 -897 964 778 -48 151 -121 -119 897 485 -1151 -926 -560 -673 94 60 -1127 -372 996 717 1106
1843 1106 746 -379 75 1253 291 -922 -667 -1399 -650 790 -352 -870 -3 154 653 1492 366 -699
1861 -699 72 524 -169 239 -880 -1671 -346 928 226 200 -90 -124 1002 1602 410 -311 -325 -618 -409
1880 -409 228 -1217 -1724 -664 -221 296 692 -211 -425 1088 1275 772 985 -301 -615 406 390 -955
1898 -955 -815 -764 -1036 296 642 -543 -197 597 358 930 728 -360 -544 359 55 -73 -63 -843 -665 661
1918 661 333 -128 26 -202 50 1375 559 -321 9 -57 -230 668 94 -1379 -866 182 -366 140 206 -743
1938 -743 129 1086 768 527 644 38 207 970 -235 -473 -264 -530 -735 89 -410 -1125 -177 -2 -82 832
1958 832 389 -382 519 703 112 240 102 -739 98 363 -379 -527 -35 -335 15 778 -103 -256 268 -182
1978 -182 -72 382 -542 -739 49 4 -389 -42 -126 -310 580 506 -168 171 463 -190 584 517 -530 -387 -93
1999 -93 -409 -125 292 -639 -457 248 -51 -179 494 -393 -228 307 -39 -291 445 14 -102 339 267 -567 45
2020 45 246 -382 178 148 -480 -259 67 -688 -120 300 -285 -202 459 -317 97 532 -146 439 394 -167 -168 351
2042 351 -142 -570 201 -21 -55 201 -99 -417 358 356 -10 300 26 -464 -183 149 -423 -70 122 -344 -93
2063 -93 358 8 231 547 50 349 720 -220 -384 158 -56 -287 11 -370 -690 138 13 -1 314 153 -500
2084 -500 562 487 -275 52 169 -444 192 318 -348 -257 197 -64 393 505 -134 -144 102 -14 -336 46 -519
2105 -519 -647 15 -112 -153 315 29 106 1023 761 -85 156 220 -202 136 -262 -1023 -519 4 -323 36 270
2126 270 -364 80 878 468 214 126 21 -206 402 -103 -695 -228 -558 105 310 316 -185 219 652 311 811
2147 811 104 -461 5 159 -464 -142 -351 -710 -189 255 80 -161 207 265 390 974 363 -274 311 -77
2167 -77 26 253 -559 -911 188 -197 -335 214 -78 -616 180 741 92 -126 -329 -360 105 309 27 -374
2187 -374 -244 -129 233 575 -14 -222 446 266 130 402 -279 -638 242 -167 -431 -127 -498 -557 283 309 -341
2208 -341 163 191 452 688 430 -291 -297 28 33 132 201 -737 -142 282 64 112 318 -91 -13 579 177 -428 -160
2231 -160 -264 -478 216 0 -698 -138 -157 277 598 545 -136 181 534 132 173 -112 -650 -437 -30 -584 -372
2252 -372 -177 -404 -273 287 -119 -13 570 263 159 515 -205 -487 -15 -132 -495 -32 -92 -611 35 145
2272 145 -228 420 289 -126 344 251 -148 -231 43 -260 -130 335 -431 -169 141 -108 96 432 150 236 717
2293 717 272 172 298 -235 -363 116 -318 -729 -435 -319 -665 168 234 35 334 731 79 469 517 -32 -73
2314 -73 186 -245 -495 -35 -524 -540 -45 -231 -161 59 164 39 536 354 71 164 125 -418 -238 -227 -386 125
2336 125 255 -410 59 553 49 124 276 -56 25 216 -160 -300 -177 -275 -249 32 -384 -240 -85 149 18
2357 18 320 178 -135 334 330 -54 129 -10 -371 171 364 -214 -115 63 -342 0 169 -133 -207 117 -57 100
2379 100 408 -267 -339 99 -91 101 593 -123 -232 524 134 -44 34 -84 -212 344 291 -288 -130 152 -245
2400 -245 132 61 -412 -142 430 -125 41 474 -246 180 560 209 -186 30 -225 -345 370 68 -401 -182
2420 -182 -110 -256 558 50 -464 -25 -4 -265 157 -84 -401 -334 29 -218 -198 248 -241 78 702 133 311
2441 311 286 -236 208 532 -131 -471 -423 -306 -359 341 -30 -366 -25 82 98 399 221 -306 568 622 -15 136
2463 136 -112 -391 -164 178 -204 -411 -82 -252 -182 362 -57 -408 142 1 -122 381 -24 -491 346 -198
2483 -198 -75 -109 -287 -91 87 473 -107 69 153 -154 246 284 -378 -102 -133 -197 52 122 -316 -383 139 78 55
2506 55 240 -249 -124 575 487 -233 366 -101 102 260 4 -409 -328 -286 -130 17 -104 -212 18 262 151
2527 151 426 -74 -99 286 419 -26 34 -90 -477 -254 157 -87 -347 59 -156 -134 403 -148 -4 108 92
2548 92 34 138 -26 -337 14 117 -236 -26 88 -281 275 345 297 63 12 5 103 520 135 33 87 -74 -82 43
2572 43 -682 -450 -95 55 -6 68 -39 -136 413 292 -117 107 -20 -283 267 106 -516 -186 -19 -190 -73
2593 -73 63 -256 192 431 34 -8 103 -114 -361 -50 -203 -113 15 -99 16 363 408 -39 54 178 -163 307
2615 307 432 -143 -99 -64 -401 -13 144 -307 40 195 -113 48 168 -79 217 229 -64 -104 266 22 -319
2636 -319 314 -119 -167 59 -95 -103 -65 -32 -187 -137 125 -145 -158 347 -42 -51 164 -309 218 91 -223 -207 79
2659 79 80 -132 353 23 294 396 -106 -146 294 -99 -235 -43 -2 -302 84 19 -130 130 252 -170 216 -3
2681 -3 -14 489 36 -167 -27 -19 -292 -19 241 -71 -163 -52 31 -215 18 -101 -80 561 226 -419 -8 -158 -121
2704 -121 296 183 -84 219 162 -67 408 393 -274 169 183 -39 65 -302 -372 -83 323 224 -74 -9 -210 -19
2726 -19 339 29 -284 -104 -22 -151 386 -5 0 14 68 -116 457 -135 -242 75 112 40 -129 -214 -546 -115 245
2749 245 -111 85 -26 -365 55 280 69 -30 256 57 -27 387 -202 -109 292 351 71 107 -204 -246 228 140
2771 140 -117 132 -59 -224 214 284 -118 -14 266 167 376 318 -236 -237 -106 -280 -104 -143 -334 -236 74 90 158
2794 158 238 -209 -123 404 -64 -313 -114 -296 -231 258 79 -367 -163 318 56 335 101 -247 187 187 -53 54
2816 54 -1 -66 -134 -85 -81 -302 -181 -155 -173 250 312 -85 471 257 103 256 -13 -346 45 -141 -328 -403 -284 -517
2840 -517 -132 44 135 414 212 1 78 172 -78 -230 -129 -186 -95 34 -219 -380 -90 -270 44 403 137 -180
2862 -180 607 405 -207 206 -169 -201 146 -69 -360 -284 -207 -153 29 393 -84 110 487 220 194 458 -99 -77
2884 -77 86 17 -225 -139 -254 -51 256 -236 -217 23 151 -111 294 5 22 189 41 -71 -153 -87 -335 -170
2906 -170 151 -110 166 113 -47 140 298 134 40 5 -58 15 102 -74 -259 46 -263 -240 -142 47 -290 131 99
2929 99 274 246 166 220 66 269 -38 -102 -71 -254 -78 -246 -657 -222 79 -31 -39 130 -174 63 145 -7 -231
2952 -231 194 -121 -135 -36 -237 -290 -134 166 -163 -58 246 166 61 303 -110 -56 32 -131 -67 137 -247 4
2974 4 44 -10 -105 105 57 -137 107 132 -35 189 -164 -137 147 156 -99 -182 -280 -39 32 -75 -243 308 -22 22 212
2999 212 70 -45 30 103 35 -277 -138 18 6 239 83 157 94 -18 60 211 -278 -176 50 -83 -179 306 -138
3022 -138 -451 216 68 -197 292 104 8 160 331 -138 -38 -43 -189 -118 -83 -291 -199 163 -336 83 209 45
3044 45 230 -36 163 -66 -19 -41 -115 235 29 -217 120 -5 -94 48 283 61 138 -114 -89 188 126 -61 -167
3067 -167 115 -78 -270 -62 -54 -36 82 77 11 8 -220 -182 456 60 63 96 240 56 -89 99 -97 171 -126 -39
3091 -39 -32 -61 105 -4 214 -149 -41 23 -261 256 376 -104 69 73 -16 72 115 91 -21 -91 55 -70 124 -350
3115 -350 -63 -156 182 -180 157 -163 -257 -64 80 144 -30 -26 -135 241 241 -12 -177 -94 31 102 128 -161 -27
3138 -27 226 -105 -42 -77 -33 -383 41 115 128 -30 -67 -241 145 34 -7 63 91 -81 13 95 -146 -199 5 409
3162 409 -95 262 -251 -48 163 166 -33 89 -174 -105 132 222 -114 169 0 228 125 171 43 132 337 -93
3184 -93 302 29 -145 -50 130 -153 -31 1 -426 -38 115 182 -53 183 24 29 33 149 58 186 7 -13 160
3207 160 -167 -209 -75 268 -193 -72 -159 -134 145 -34 -318 -218 -72 -167 -149 36 -158 -186 309 -226 -13 189
3229 189 -90 -165 210 -46 1 290 -133 201 187 15 130 221 -194 -77 87 18 -162 80 87 8 239 -157 -46
3252 -46 101 81 -63 -230 -230 -11 19 -131 -177 -7 81 136 -31 -38 -85 293 112 15 52 100 -29 -94 159 -38 -140
3277 -140 165 -177 56 77 99 52 362 -13 33 -58 80 -9 -169 119 -147 -121 -5 -255 -106 438 -80 -95 19
3300 19 82 -51 237 -115 -135 -225 151 -12 127 85 -211 227 -79 64 87 -179 -216 76 126 -21 -105 -8 0 -46
3324 -46 160 -29 -36 359 -82 104 204 -62 59 254 -187 -249 105 57 -213 -67 -201 -6 -94 42 -29 38 175
3347 175 -106 61 -26 50 -68 85 -122 -34 245 -144 223 77 -256 -63 205 -104 21 -69 -255 77 82 -61
3369 -61 -155 142 460 101 -214 234 -143 -7 52 -189 -160 98 -89 103 168 159 -118 54 1 -127 137 -278 -186
3392 -186 -66 -225 57 79 109 149 310 256 190 88 240 -84 -3 22 -66 -107 1 -238 104 221 -105 -8 214
3415 214 109 29 36 -359 77 -219 30 -149 239 -238 -176 274 19 -174 65 -211 -60 109 77 -16 -190 118
3437 118 3 148 58 -128 -153 48 -26 21 32 46 -25 50 62 243 -15 10 -165 257 -28 -94 217 -151 -144 -60 13
3462 13 -51 -92 -51 37 -254 -283 -149 9 -181 74 -39 89 -220 43 221 132 -57 33 17 194 92 -114 -133
3485 -133 -38 -132 -14 113 -183 -211 298 -90 -77 59 63 -274 48 215 -129 97 141 -133 165 -78 149 -161
3507 -161 115 -85 146 27 -110 42 -58 37 3 -12 -130 28 204 -306 -137 116 45 -160 157 -108 21
3528 21 111 35 -64 11 34 27 61 138 -242 -30 149 110 -90 191 35 83 200 -79 -78 -222 -193 -44 270 142 48
3553 48 200 37 -191 49 22 -85 -185 188 -14 -1 -93 -30 37 -138 -61 -193 -192 18 82 15 -134 -127 240 58
3577 58 -126 -101 -228 -164 -82 -33 -35 30 -105 -225 -5 -88 -21 72 27 -99 97 76 -93 131 -33 66 122 -98 -234
3602 -234 130 124 16 89 -59 -175 114 92 60 -46 5 -226 79 37 -112 -79 -61 -69 -99 233 137 -111 140 -208
3626 -208 175 -1 134 109 71 114 -53 -81 43 -220 298 59 76 -92 -158 -210 13 382 -91 -126 -122 46 -92
3649 -92 -74 130 -166 237 -3 -41 -12 -282 134 36 69 -62 34 -34 -73 132 138 -86 248 1 144 -149 215 192
3673 192 -120 141 -333 21 17 -241 -86 68 -178 -151 -105 -61 -255 -95 0 10 199 -216 -60 198 86 -154
3695 -154 58 -263 -171 2 -5 -218 -148 23 -129 349 192 8 255 82 180 311 86 -101 72 148 149 -30 100
3718 100 309 321 7 -31 -123 -83 -78 21 -29 -11 -258 -117 73 -64 -211 178 -270 25 18 -168 -138 62 -51 284
3742 284 -99 -229 -186 137 -71 -23 32 -56 -37 135 -76 -12 17 138 -14 207 200 -64 150 -81 -69 -50 174 -170
3766 -170 -68 -71 -60 132 137 -225 68 88 52 114 130 -155 -160 159 68 -161 156 131 -202 182 -3 -50 -107 174 -40
3791 -40 2 -231 -307 -77 153 -174 78 -76 -203 -189 42 -324 -200 -174 -137 180 2 -32 -192 -12 -222 -197 177
3814 177 -211 -152 52 -89 -109 188 -132 -151 21 -30 9 -31 -24 -98 231 -193 111 109 -212 -142 -41 -118 78 151 161
3839 161 23 -70 302 150 -42 -33 26 -104 71 74 50 228 75 -42 -72 6 -260 149 73 -64 -35 178 -86 60
3863 60 56 -169 -10 -35 106 118 13 180 -44 152 192 55 -145 -100 -45 245 170 110 -28 -325 -157 89 -181
3886 -181 -158 -149 109 -26 -95 -145 99 -115 3 -287 113 103 120 55 260 -150 175 100 -247 -307 -74 7 83 342
3910 342 1 269 81 62 161 143 -175 -234 -53 192 -42 -124 20 18 87 52 -81 73 -119 66 236 101 -107
3933 -107 134 -113 -152 -201 150 5 -154 -207 -94 203 -3 68 9 -62 135 -160 63 -35 -368 147 50 -61 -81
3956 -81 -8 51 -164 -1 -62 28 193 -98 18 192 -221 -201 306 -88 71 167 -88 -159 70 178 -114 195 143
3979 143 89 1 269 14 -74 -253 -66 231 -58 -223 -117 176 -37 110 186 136 95 317 -80 31 244 -67
4001 -67 67 39 92 -115 46 -20 -36 222 128 -44 96 105 -175 -107 -70 -215 125 -9 34 193 112 -121 164 127
4025 127 55 -128 -15 -155 147 -201 -158 131 86 -31 -152 -118 120 27 5 139 230 189 -202 -12 -48 -176 -64
4048 -64 102 134 -69 -16 291 100 65 -20 100 235 -124 -90 4 -59 -138 -173 -66 -30 -6 147 -258 -51 19 -21 88
4073 88 166 -105 -79 21 105 -11 17 -82 -155 9 72 -78 85 -15 -158 94 70 23 26 -26 -195 85 -88 16
4097 16 38 84 -113 147 -42 -341 80 232 -100 5 -186 56 74 -179 -35 -52 190 -109 -114 -274 206 -269
4119 -269 -22 87 9 133 365 -119 123 14 -12 54 -82 -144 -56 222 38 41 -129 -69 -13 33 -134 74 -35
4142 -35 -21 -262 86 49 -172 82 33 -13 134 83 -32 563 -65 84 -111 94 -111 -120 -24 -189 46 168 -233
4165 -233 128 165 -114 99 -29 -63 -143 -22 87 21 -8 101 -8 56 -15 -33 150 180 -42 62 -167 96 94 88
4189 88 48 7 -85 -119 29 62 40 49 -55 67 -93 73 17 5 86 -126 -46 93 115 210 232 126 -194 -110 -131 126
4215 126 45 74 -13 106 28 -100 -270 -123 -286 25 96 206 194 253 -187 -30 216 174 43 -230 -61 -159 106
4238 106 -33 -95 27 -43 -60 1 148 -15 -38 79 -124 259 -324 393 119 74 31 82 130 -146 127 -53 123
4261 123 -21 -40 -35 -300 139 86 -166 -90 -335 -68 162 228 22 -46 15 -85 196 69 -10 70 -87 62 -90
4284 -90 -94 -29 236 49 -132 -111 -55 -113 -61 159 17 154 187 -155 -146 73 156 -175 38 45 -185 -56 53 99 73
4309 73 -43 42 164 6 -137 -74 -179 83 51 83 -209 -22 84 -179 25 -132 -221 -67 143 -217 107 236
4331 236 169 101 286 -134 62 69 39 47 91 -73 -43 46 246 15 90 -208 105 166 111 66 -1 103 -197 -145 64
4356 64 25 -108 -34 -105 50 -75 13 -91 219 66 -376 -29 -146 136 113 53 4 8 -13 -144 -94 -100 14 -178 -11
4381 -11 -48 -32 -106 -240 165 123 -42 -163 -21 101 -311 83 -150 -13 -100 122 58 228 20 6 -78 127 63
4404 63 142 70 17 -180 210 -243 -132 174 26 -153 -132 -4 -113 -100 -46 -16 -39 18 -17 104 45 72 130 -181 66
4429 66 379 120 15 328 15 -145 88 -93 38 36 -21 323 30 44 -101 123 -9 112 15 36 176 -75
4451 -75 85 120 47 -142 -179 -47 -167 -16 -137 -9 -33 19 -138 -100 -119 -19 -102 -197 -11 -223 41 -308 -184
4474 -184 115 -144 112 62 150 204 -47 100 -53 -141 85 83 7 66 -93 -149 -17 -300 -120 132 -116 -224 -187
4497 -187 28 -119 9 -36 88 93 37 -52 86 -89 159 -33 47 -49 -153 33 56 -121 216 279 36 29 -38 -79
4521 -79 -312 35 17 280 -60 -70 -207 185 -32 -153 14 -15 -166 -74 93 226 -221 133 -326 147 74 -1
4543 -1 44 -14 251 6 -210 -173 46 196 -76 94 89 -242 -288 197 -52 64 37 228 88 -8 13 -181 187 -17
4567 -17 -20 74 456 -115 143 159 -27 -13 246 34 1 -133 -90 70 49 -121 -198 173 -222 42 156 31 -68 200
4591 200 -81 -96 71 -137 -56 298 82 -103 13 -57 0 -207 -242 42 12 97 -152 63 -36 -115 -49 363 43
4614 43 -163 -183 -184 162 -26 -46 46 92 -160 22 -106 -67 -10 51 305 107 67 94 72 -184 -355 124 -91 -78 -145
4639 -145 -18 -137 -42 -76 4 -206 -44 39 23 36 24 18 -112 -18 -138 66 -58 53 170 160 -59 50 -90 63
4663 63 2 16 -171 18 188 119 172 105 2 21 -13 4 70 0 103 -87 11 232 173 -26 -255 -237 82 61 -288
4688 -288 -125 170 71 52 -31 -79 -52 -18 154 -8 -66 -4 -111 -141 -114 121 74 -198 100 -177 -78 -19 -180 26
4712 26 -88 -6 83 223 -267 -44 172 -177 109 -146 7 161 99 -120 49 146 -121 -64 149 -237 -8 -119
4734 -119 267 41 -121 -70 -180 215 102 215 -280 108 -67 -121 -286 55 -62 -156 -243 12 -57 78 132 142
4756 142 56 -48 -78 128 -107 169 63 -85 -19 -78 -40 -46 -90 213 257 47 -15 -94 -94 -95 59 1 98 42 -167 -114
4782 -114 94 95 -131 -26 262 46 182 67 -349 235 -4 -207 -13 -164 99 -11 -65 -184 -25 -139 -38
4803 -38 -47 103 -25 11 -143 -109 -217 42 29 144 306 197 -30 23 281 -55 106 101 -186 -69 -190 17 180
4826 180 143 -35 160 65 -170 -83 11 -181 1 169 -91 -108 -221 26 -57 259 -82 -71 52 46 -284 122 223
4849 223 -121 75 69 33 -13 27 -232 -72 -83 -114 226 -5 -77 100 -116 109 27 32 -20 21 111 -10 173 221 -109
4874 -109 119 95 -58 202 -15 154 83 96 -58 -128 -281 -144 66 68 -7 52 61 -46 70 108 -61 -128 42 120
4898 120 -67 163 94 -118 49 -169 -44 47 -66 -3 -23 -63 -65 135 -16 -101 -122 -4 157 -44 28 26 -20 18 25
4923 25 220 6 110 74 -73 151 -206 -40 45 133 -231 125 -11 -78 191 -149 -30 76 -237 -17 -22 233
4945 233 162 105 -49 -63 -197 88 15 23 -12 51 -266 -20 -134 36 256 59 54 280 -43 -44 13 84 -281 -118 -50
4970 -50 -130 240 -26 -78 -88 31 -19 373 114 -63 66 -174 -96 -176 38 68 242 177 -130 83 39 169 167 -9
4994 -9 2 -8 -234 -112 93 137 -11 -238 -187 2 -16 15 25 81 1 183 -110 -109 -175 -8 -67 -145 147 148 -37 46
5020 46 -152 218 -130 171 299 136 175 58 -130 21 -128 110 43 1 -152 -175 211 79 -196 14 -13 -61
5042 -61 10 4 -215 146 176 1 261 -79 -151 53 276 230 40 19 238 -199 48 -274 -160 -24 -95 -131 -139 -87
5066 -87 34 52 96 271 -18 -48 -59 -82 -112 9 -67 155 -18 -153 267 104 -321 39 -34 -216 96 21 -40 184
5090 184 -237 -131 180 -259 -178 23 -63 -95 176 -221 -189 -115 -106 49 49 -31 130 65 -39 -274 44 -107 349 -145
5114 -145 52 15 -30 37 -45 1 146 137 -206 44 -156 195 44 107 -58 -166 198 -43 57 62 88 -47 -1 -72
5138 -72 67 38 -128 -143 -61 -46 -60 -52 134 294 -53 76 -5 180 68 4 133 51 -36 101 109 34 4 23 80 -242
5164 -242 131 -69 117 98 41 -9 -186 20 -44 76 -173 279 -19 35 -7 -38 268 -7 30 -125 -4 -173 50
5187 50 128 -39 215 -35 113 -220 -100 -120 73 71 -204 -131 35 128 -1 84 7 -47 43 -33 63 23 157 -93 -30
5212 -30 -56 78 -38 -5 -22 1 -7 425 9 117 309 58 -101 -18 148 -81 167 -49 -60 -94 -104 11 144 -74
5236 -74 -206 -19 195 -213 -2 4 -166 -67 162 -4 168 155 -237 -71 -188 -54 -52 45 -40 186 -70 -30 -38 31
5260 31 -133 -72 -71 127 -202 26 95 -84 40 219 -232 97 -14 85 -1 38 -167 -81 168 94 99 49 118 200 -112
5285 -112 129 42 68 -181 -45 87 -267 149 -17 -108 143 82 21 -161 66 154 -55 24 -159 -177 -16 7 28
5308 28 225 -81 -33 199 -93 -182 -91 65 -63 62 152 124 -18 32 178 172 -107 -9 45 -65 -98 48 183 212
5332 212 -37 104 154 154 53 -17 21 -201 176 -126 59 337 -31 24 0 14 -113 50 -137 -117 -68 -97 4 -115
5356 -115 12 -178 217 -74 -333 90 -9 73 -59 35 -303 58 -28 107 41 183 33 -41 107 109 104 -71 0 -96
5380 -96 47 61 -31 139 -116 -185 72 57 97 -193 -160 -51 36 103 -32 145 117 -14 -34 153 126 -234 -27 -75
5404 -75 -88 172 79 -43 -66 -228 -82 -109 86 -104 67 71 68 30 -249 -213 -48 86 228 -157 -18 -101 83 42
5428 42 56 223 47 91 -122 -5 53 -56 162 -80 -86 -214 -156 72 -279 -366 -76 -74 233 277 -3 -120 -69 36
5452 36 46 -289 103 29 -21 -129 -133 -65 -115 7 -58 131 148 -52 -1 69 105 -80 42 144 195 -107 107 39 175
5477 175 161 67 19 -28 -49 167 -33 113 44 10 102 187 -3 -22 158 119 350 -58 101 141 91 20 19 -64 -104 27
5503 27 4 -13 109 180 220 -125 -2 -27 144 -131 -65 37 -63 207 -128 -142 -30 -304 16 181 201 -55 -1
5526 -1 -28 -161 14 -102 -274 149 42 67 -81 51 0 -25 -146 130 47 66 41 -200 86 -234 67 158 -36
5549 -36 42 170 183 -103 -52 -26 33 73 24 -90 121 -62 -83 38 98 52 87 -47 -29 7 -3 -3 36 22 -183 349
5575 349 -118 45 5 -67 62 -63 64 -246 186 162 34 25 -99 -6 -109 -164 50 52 -231 -88 -121 -48 -50 -59 48
5600 48 291 101 -62 -101 -20 50 -101 8 -33 63 -115 -74 -17 -97 110 137 17 29 -185 -73 -50 -18 263 70
5624 70 -72 -46 -97 -203 -86 155 103 3 134 28 -17 144 -34 40 -65 84 -135 -30 -140 88 15 -99
5646 -99 151 -161 77 -41 -297 192 224 -125 -14 -23 -67 88 103 133 -20 203 -156 -48 115 -45 13 -99 226
5669 226 -107 -49 149 68 -37 1 -167 -168 -18 10 -106 34 -314 -32 18 -41 -18 22 27 55 168 219 318 60 136
5694 136 74 127 -75 -36 -155 62 133 66 98 -302 95 147 -197 -57 -35 152 326 -129 37 72 -80 50 -39
5717 -39 -53 145 -34 -93 -92 -69 -14 119 50 -30 91 -180 -49 166 72 -78 167 128 109 -177 -63 -218 -49 20
5741 20 -106 100 -126 210 122 -115 -32 -77 85 -87 -2 108 -54 162 -149 67 43 97 -87 -9 115 -32 66
5764 66 -28 70 199 148 -73 -120 -100 85 -348 -111 -63 -4 197 193 99 -95 34 208 -58 -1 -19 94 11 -148 -48
5789 -48 51 -279 112 193 76 38 10 19 -67 19 -115 -50 -84 125 164 240 106 94 -58 150 -114 73 17 78 -53
5814 -53 144 -155 170 209 -213 -144 -105 -40 -34 -356 -174 -78 -109 -153 -249 148 -13 -110 45 -110 -22 103 -76 -398
5838 -398 3 117 -87 -83 161 -160 25 144 -180 153 -161 -166 80 162 -108 148 -19 135 192 97 -15 100
5860 100 -30 -66 136 -89 -13 228 273 -90 2 239 -125 -48 -10 92 79 -62 39 11 114 -90 -16 139 -180
5883 -180 61 150 268 -148 -40 278 -167 107 -35 -127 -105 -89 141 6 -137 191 142 56 242 -28 34 125 -60
5906 -60 -121 -182 -185 45 -25 67 69 -132 9 32 -159 18 -68 -78 117 274 -21 194 9 -17 -123 -69 -160 9 139
5931 139 -158 76 0 93 126 18 196 58 74 26 176 -61 131 -143 217 -13 -144 -228 -139 54 -27 -149 140
5954 140 131 81 -133 -22 106 -80 81 -111 102 37 -94 -45 167 -163 149 98 260 -73 -132 -193 -70 -44 18
5977 18 -25 10 13 267 14 -77 221 -256 -138 97 38 67 -129 14 266 -152 -136 51 -128 19 -189 -127 -23
6000 -23 140 1 -74 -246 -47 173 10 -234 -290 251 45 13 -83 116 -58 -148 -245 104 -67 91 -219 -8
6022 -8 -158 65 38 -54 -161 -15 -59 -50 194 -153 -106 -109 41 99 -95 2 57 64 -3 -36 86 -100 81 27 -241 -6
6048 -6 28 -153 24 238 147 -135 117 -120 -116 64 253 -30 31 -70 -106 -21 -375 -146 83 67 -24 144 79 -3
6072 -3 233 -66 0 -51 -40 -183 -26 -28 -38 41 30 -73 -38 -99 -30 31 7 36 109 -35 44 116 59 166 124 237 104
6099 104 -139 64 76 46 122 -202 -192 -136 112 -82 50 -432 161 43 -207 27 -240 5 24 -227 111 -139
6121 -139 39 -179 2 -117 105 -32 -78 -116 -77 115 -98 8 30 72 -6 -138 130 107 -80 -112 10 170 -66
6144 -66 -145 140 189 172 -124 -127 183 -56 178 70 31 -23 -78 23 264 -20 51 61 -11 -252 36 60 19 31 -44
6169 -44 327 -161 165 -36 -147 176 39 -123 14 -164 -114 -94 -12 2 17 -225 -26 107 96 82 160 -1 -30
6192 -30 42 98 -108 18 -32 78 -155 49 324 157 39 -82 -182 102 -93 -144 189 -77 -52 -176 128 158
6214 158 43 -45 -13 -9 -61 -43 66 -112 210 176 77 -96 -155 149 -214 179 -36 179 204 13 -79 -99 60 86
6238 86 223 86 -43 122 19 107 103 115 3 -12 -5 30 -6 110 -76 50 183 -140 -200 67 1 131 153 94 -109
6263 -109 -149 -65 63 -6 77 241 59 75 -63 25 85 -108 -63 -102 -65 20 25 -4 222 -65 -156 -86 90 92 -117 58
6289 58 -197 60 -139 -31 -283 -17 -37 -87 146 -186 95 75 6 59 92 168 -144 17 139 55 166 -35 -14
6312 -14 -92 -66 36 -224 -117 143 -25 241 26 -74 -82 -204 -27 -124 20 -129 -40 -27 -28 51 205 82 -61 165
6336 165 96 58 87 132 -65 -78 54 83 116 -53 1 -299 -36 35 158 -134 -181 106 124 92 59 96 -87 265 176
6361 176 -135 1 -33 97 -36 60 -15 -258 -74 29 48 -133 76 71 -10 21 180 19 68 -47 -255 -10 107
6384 107 -129 -85 204 209 -82 14 152 51 -169 28 30 -188 98 50 119 102 -3 -198 470 93 -61 110 -67
6407 -67 71 42 30 -258 127 77 165 -147 173 75 -175 182 -205 -26 -306 -171 29 93 57 196 71 176 -164
6430 -164 119 168 58 34 61 37 -187 184 42 140 -2 46 124 213 80 143 49 -31 -8 17 -28 -67 -137 -297 -5
6455 -5 194 -40 -62 57 39 94 156 -81 -91 113 67 -126 328 -156 100 -90 -7 138 197 -141 -75 46 -104 -111
6479 -111 75 -46 -75 -11 14 -89 -153 -337 138 -62 -111 65 46 151 -242 154 59 -33 -65 -9 176 254 138 -28
6503 -28 -76 134 49 188 -58 -41 4 -94 -156 2 41 54 89 -87 -60 -53 -230 1 344 -17 16 -44 164 107 -59
6528 -59 -32 -108 256 128 103 71 14 110 56 -155 -208 -17 72 182 -146 219 -2 133 -69 -255 22 -112 22
6551 22 -84 -44 -377 -218 -33 -160 -157 -135 -85 -104 200 27 88 -229 -93 240 57 -228 85 -8 6 129 -1
6574 -1 97 98 29 -126 -10 -76 -145 185 31 37 316 -20 304 -3 2 50 -1 95 104 -68 -49 149 106 194 -96 -228 -54
6601 -54 -53 -15 84 -42 -9 92 40 70 -173 -1 -79 30 -25 -2 -9 -50 -173 -248 -56 10 7 -208 71 -60 137 78
6627 78 37 30 67 21 -48 265 -143 -169 33 23 215 63 -267 37 15 47 145 -31 -129 -19 -126 -214 -75 -88 107
6652 107 35 72 131 249 -40 -36 81 214 77 110 -31 180 -85 -79 198 69 8 139 -94 92 -82 -193 60
6675 60 -190 102 215 -32 -40 -115 -14 34 49 -172 2 81 25 -2 94 171 33 99 -34 23 152 -67 125 12
6699 12 -76 -234 134 110 360 -133 86 -137 -30 -298 195 98 8 -123 -144 -58 154 228 -57 -189 77 108 -155
6722 -155 274 40 -2 -29 -100 -23 -52 51 117 -264 -36 -59 -23 48 11 -40 -90 -48 190 -47 101 8 -104 79 -108
6747 -108 9 125 -264 -30 59 -168 11 179 20 -215 -126 -11 83 1 128 87 -73 -31 -96 -24 98 -28 -280
6770 -280 308 50 23 126 -9 105 82 -82 97 32 30 -122 44 -64 -233 -31 -6 193 10 104 89 -145 -80
6793 -80 52 -15 117 -144 32 -51 16 -61 -201 -129 -91 -25 -184 -92 -82 -295 -41 386 -7 -70 -288 -163 -236 59
6817 59 -91 -285 113 147 10 41 -95 76 69 230 5 2 -24 -31 -69 14 130 -215 83 -66 -10 114 -70 -52 -8
6842 -8 3 -32 86 134 -80 -60 -33 44 148 114 34 -158 58 -46 192 -128 63 119 35 4 138 25 -106 100
6866 100 -88 -6 -211 30 -78 196 -138 30 76 -102 76 -81 -53 -54 -7 -112 -3 2 -179 46 -287 285 126
6889 126 48 -57 133 -52 -16 -4 -13 -134 71 166 -148 147 -38 136 -101 81 215 289 -77 -206 -14 -52 216
6912 216 34 -172 -51 -28 -72 260 16 -15 -167 14 92 50 -223 -138 -8 -143 -220 60 9 -163 103 -186 -44
6935 -44 -72 76 -42 22 256 203 -74 152 -94 -211 -2 -98 241 -56 -95 -152 37 -83 129 183 14 -27 70
6958 70 -88 30 -77 382 193 -92 0 -29 223 -124 -182 58 25 -234 -41 -9 180 -26 -166 -37 223 85
6980 85 -132 -80 -212 10 -177 -174 -86 -100 138 -17 -190 168 -55 176 255 -108 90 -106 7 -206 238 -142
7002 -142 126 -104 28 27 39 39 52 261 49 160 -75 -83 -205 -61 107 -112 -159 85 -133 101 39 -60 -175 202
7026 202 0 66 -13 -37 79 -68 -72 156 74 200 -190 -366 23 -167 50 -39 70 11 264 -27 -3 136 -4
7049 -4 -35 47 96 -239 -279 -42 64 -59 -240 164 -179 133 -62 51 138 -342 -108 -27 21 0 31 -202 61 -58
7073 -58 68 -158 -13 58 -13 -119 224 -219 101 -188 36 48 2 -277 55 -25 -164 100 63 -223 -178 56 -32
7096 -32 99 100 -240 -42 -25 -282 220 -58 9 -164 201 36 11 39 -2 -31 -41 -18 -210 27 -68 67 -89 -208
7120 -208 118 -70 -96 96 5 -132 98 101 -182 79 140 -128 8 34 -273 -122 99 -83 109 -73 -35 192
7142 192 194 -73 266 -194 155 -31 12 -134 81 72 -143 202 -113 -44 -55 -90 144 -146 -121 -109 165 -29 -216
7165 -216 2 -76 -60 -238 118 65 220 76 67 -181 -133 31 267 -125 -8 -103 -164 27 295 -61 -178 -87 -159
7188 -159 113 -162 135 5 -136 11 47 14 73 88 -92 -220 -172 22 41 353 29 20 45 19 89 -216 -41 127
7212 127 -3 143 113 35 -9 -133 124 89 1 -62 162 98 -142 55 183 -43 127 63 -10 117 -54 75 -138
7235 -138 -18 159 37 -139 -4 60 -81 -99 -60 167 25 -79 117 -67 11 142 90 -27 1 47 -70 130
7257 130 145 -196 -31 68 17 152 -144 68 15 14 -119 -150 23 -72 -222 -57 -95 122 -48 -32 27 26 -210 22
7281 22 1 -31 13 -143 2 -8 26 -113 -176 62 111 63 62 -167 -106 51 93 -134 80 251 37 264 -87 -18 9
7306 9 -37 15 86 -39 -39 -182 119 -98 -124 -65 126 -49 -23 5 -73 73 -42 0 37 -68 -52 59 36 1 -50 26
7332 26 174 -53 -112 -20 -228 -75 6 -19 -113 -45 187 -120 -102 44 -73 151 -112 -119 -30 72 113 34 55 -160 -11
7357 -11 -231 254 8 42 -188 -1 162 -151 -129 142 -87 173 93 80 -172 -211 -38 -209 -139 25 -29 77 59
7380 59 -109 -48 41 52 48 25 189 -80 -40 178 8 65 -13 240 109 -39 164 24 119 -69 -55 163 -14 107
7404 107 135 37 -1 9 100 0 -273 232 -167 -196 -53 -21 47 19 -208 -105 -170 -78 -125 -56 156 131 50 -63 -2
7429 -2 348 -47 1 -169 64 258 -128 132 -58 -138 44 181 -200 -36 -141 -284 -67 -57 133 -130 -19 127
7451 127 -16 -48 52 94 82 12 18 28 -103 182 -63 -173 15 -25 74 -8 251 243 -180 7 51 -27 -94 78 281
7476 281 84 34 -1 -151 -50 70 -232 -189 236 107 167 -212 -192 10 -232 -31 224 52 11 30 106 124 -173
7499 -173 -153 -92 193 -99 3 -245 55 167 245 88 -143 109 32 63 86 133 -81 -132 157 43 137 36 -133
7522 -133 -69 145 -103 -23 -4 -125 -30 -43 59 -129 139 58 49 -3 3 -24 25 184 83 -30 252 -57 78 -90
7546 -90 -15 55 -53 148 -166 -61 -225 -34 -108 -13 -9 -103 -51 172 -7 -10 84 -128 -3 7 -147 93 142 -50 -182
7571 -182 -16 137 88 -137 14 251 87 246 -143 152 -40 193 -108 -75 -78 -27 45 70 56 193 -45 -81 212
7594 212 11 47 -158 -208 66 -41 -58 19 -16 132 167 15 -83 3 20 193 -27 37 -141 246 -41 -111 -16 -2
7618 -2 250 -108 84 -119 242 126 -105 -4 -57 -161 137 201 -16 -17 67 -38 27 111 -41 137 147 51 -144 157
7642 157 152 -71 -67 -21 27 56 -32 149 -13 336 -144 18 22 -111 147 -40 -59 38 -148 -191 -10 106 -9 -128
7666 -128 -28 -107 94 -31 -77 -92 -69 55 33 176 -164 122 103 -44 -154 227 -204 174 -187 120 53 45 134
7689 134 71 61 -137 134 9 -114 57 -17 -114 110 -61 28 -108 7 -71 -182 -63 -116 1 -64 183 97 -57
7712 -57 -32 103 261 -75 -55 73 129 -96 235 116 -99 -36 -107 -134 -109 126 -97 -107 17 13 -337 -45 135 64
7736 64 3 239 -138 -107 59 -159 -3 103 114 -25 188 -249 -5 70 -23 -65 -80 -175 0 213 187 -34 248
7759 248 -41 -40 -60 38 31 56 -198 4 36 65 50 -14 107 -96 -16 -19 -88 -74 70 49 -28 -107 230 0 134 68 -243
7786 -243 178 16 -168 201 65 3 194 19 -59 -83 19 -123 270 170 -80 -120 -214 -41 128 68 76 -10 -77
7809 -77 14 69 -24 14 -85 -181 164 176 -47 113 70 68 36 29 -179 -36 -46 -67 -16 -44 162 10 265 -149 113 169
7835 169 0 54 160 21 -80 -223 -55 -328 -64 58 -122 -116 194 -32 -135 148 -177 -155 -128 -50 -11 -46 -133
7858 -133 -270 -86 70 -144 -30 30 -96 64 -184 27 31 115 -90 24 -71 98 -166 -25 36 165 -148 105
7880 105 127 66 115 -39 97 23 -276 -138 -5 117 218 -17 137 -300 -9 26 -46 -163 -14 -110 9 33 -106
7903 -106 -304 31 24 67 62 -38 113 122 193 104 164 32 -213 -161 -28 -27 41 -40 11 -58 226 -87 -41 53 -37 -25 30
7930 30 -68 -245 33 136 -37 332 -30 -149 72 131 184 -37 -148 169 -164 89 63 -55 221 9 -106 188
7952 188 106 61 127 -42 331 -2 159 84 75 -11 -71 -120 65 -72 -127 -6 -16 -59 145 73 71 -32 -108 197 57
7977 57 102 185 203 -141 -99 -168 -1 -20 -102 50 -186 115 5 144 81 -123 157 -252 92 72 -117 -254 177
8000 177 136 46 -14 101 117 14 89 55 -163 267 70 50 149 -117 -167 198 -87 274 176 -35 -51 16 59 159
8024 159 -53 25 -81 141 208 27 -8 127 -72 70 -104 53 87 -134 -27 111 38 -15 147 -82 -197 -140
8046 -140 22 125 49 -80 65 82 108 -191 27 -136 261 170 -140 -75 -218 -181 21 97 160 -97 -11 1 -57 56
8070 56 -207 -94 42 207 82 -35 -107 -101 3 77 -24 -71 -2 24 -175 -27 287 -391 -30 103 49 124 -101
8093 -101 -171 19 -139 223 -331 49 -11 148 101 -26 -25 31 75 -44 26 137 49 -114 320 37 36 -61 77 -69
8117 -69 -48 129 31 -165 280 50 42 -102 11 -43 -66 -127 16 161 76 30 -297 52 -55 123 46 -136 -215 -102
8141 -102 11 47 53 -100 136 65 47 92 -34 158 16 -13 -97 97 -44 -124 266 86 -151 52 -45 107 193 11
8165 11 132 -66 -35 -27 -46 -16 -170 -215 8 -109 -85 151 -23 32 68 54 -150 137 -9 -128 122 112 197 134 32
8190 32 135
8191A35
##END NTUPLES=NMR FID
##END=
