##TITLE=1H_BAU-13.OCH3
 CDCl3, 8 sc, 
 13.3.2019
##JCAMPDX= 6.0         $$ Bruker NMR JCAMP-DX V2.0
##DATA TYPE= NMR FID
##DATA CLASS= NTUPLES
##ORIGIN= UXNMR, Bruker Analytische Messtechnik GmbH
##OWNER= root
$$ XWIN-NMR		Version 3.5
$$ Wed Mar 13 14:44:53 2019 Russian Standard Time (UT+4h)  she@DPX200
##.OBSERVE FREQUENCY= 200.1314
##.OBSERVE NUCLEUS= ^1H
##.DELAY= (6, 6)
##.ACQUISITION MODE= SIMULTANEOUS
##.ACQUISITION SCHEME= undefined
##.AVERAGES= 8
##.DIGITISER RES= 18
##SPECTROMETER/DATA SYSTEM= spect
##.PULSE SEQUENCE= zg30
##.SOLVENT NAME= CDCl3
##.SHIFT REFERENCE= (INTERNAL, CDCl3, 0, 15.7039)
##AUDIT TRAIL= $$ (NUMBER, WHEN, WHO, WHERE, WHAT)
$$ ##TITLE= Audit trail, XWIN-NMR		Version 3.5
$$ ##JCAMPDX= 5.01
$$ ##ORIGIN= Bruker BioSpin GmbH
$$ ##OWNER= she
$$ F:/spectra/data/she/nmr/H-F/1/audita.txt
$$ ##AUDIT TRAIL=  $$ (NUMBER, WHEN, WHO, WHERE, WHAT)
(   1,<2019-03-13 14:43:16.14 +0400>,<she>,<DPX200>,
      <created by zg, POWCHK disabled, PULCHK disabled
       configuration hash MD5:
       00 E9 B6 7A A2 85 ED C7 34 08 36 98 17 FE 4E 26
       data hash MD5: 16K
       33 DE B1 FD 94 25 53 AF B4 5D F1 B8 F5 77 74 67>)
$$ ##END=
$$ 
$$ hash MD5
$$ 77 FF 80 C9 80 1F CA CB FB BC C4 D3 06 20 1F 10
##$RELAX= 
##$RELAX= 
##$RELAX= 
##$RELAX= 
##$RELAX= 
##$RELAX= 
$$ Bruker specific parameters
$$ --------------------------
##$DU= <F:/spectra>
##$EXPNO= 1
##$NAME= <H-F>
##$PROCNO= 1
##$TYPE= <nmr>
##$USER= <she>
##$AMP= (0..31)
100 100 100 100 100 100 100 100 100 100 100 100 100 100 100 100 100 100 
100 100 100 100 100 100 100 100 100 100 100 100 100 100 
##$AQSEQ= 0
##$AQ_mod= 1
##$AUNM= <au_zg>
##$AUTOPOS= <>
##$BF1= 200.13
##$BF2= 200.13
##$BF3= 200.13
##$BF4= 200.13
##$BF5= 200.13
##$BF6= 200.13
##$BF7= 200.13
##$BF8= 200.13
##$BYTORDA= 1
##$CFDGTYP= 0
##$CFRGTYP= 5
##$CHEMSTR= <none>
##$CNST= (0..31)
1 1 145 1 1 1 1 1 1 1 1 1 1 1 1 1 1 1 1 1 1 1 1 1 1 1 1 1 1 1 1 1 
##$CPDPRG= <>
##$CPDPRG1= <>
##$CPDPRG2= <>
##$CPDPRG3= <>
##$CPDPRG4= <mlev>
##$CPDPRG5= <mlev>
##$CPDPRG6= <mlev>
##$CPDPRG7= <mlev>
##$CPDPRG8= <mlev>
##$CPDPRGB= <>
##$CPDPRGT= <>
##$D= (0..31)
0 1.2 0 0 0 0 0 0 0 0 0 0.03 0 0 0 0 0 0 0 0 0 0 0 0 0 0 0 0 0 0 0 0 
##$DATE= 1552473795
##$DBL= (0..7)
120 120 120 120 120 120 120 120 
##$DBP= (0..7)
150 150 150 150 150 150 150 150 
##$DBP07= 0
##$DBPNAM0= <>
##$DBPNAM1= <>
##$DBPNAM2= <>
##$DBPNAM3= <>
##$DBPNAM4= <>
##$DBPNAM5= <>
##$DBPNAM6= <>
##$DBPNAM7= <>
##$DBPOAL= (0..7)
0.5 0.5 0.5 0.5 0.5 0.5 0.5 0.5 
##$DBPOFFS= (0..7)
0 0 0 0 0 0 0 0 
##$DE= 6
##$DECBNUC= <off>
##$DECIM= 24
##$DECNUC= <off>
##$DECSTAT= 4
##$DIGMOD= 1
##$DIGTYP= 9
##$DL= (0..7)
0 120 120 120 120 120 120 120 
##$DP= (0..7)
150 150 150 150 150 150 150 150 
##$DP07= 0
##$DPNAME0= <>
##$DPNAME1= <>
##$DPNAME2= <>
##$DPNAME3= <>
##$DPNAME4= <>
##$DPNAME5= <>
##$DPNAME6= <>
##$DPNAME7= <>
##$DPOAL= (0..7)
0.5 0.5 0.5 0.5 0.5 0.5 0.5 0.5 
##$DPOFFS= (0..7)
0 0 0 0 0 0 0 0 
##$DQDMODE= 0
##$DR= 18
##$DS= 0
##$DSLIST= <SSSSSSSSSSSSSSS>
##$DSPFIRM= 0
$$ [...]
##$SUBNAM2= <"">
##$SUBNAM3= <"">
##$SUBNAM4= <"">
##$SUBNAM5= <"">
##$SUBNAM6= <"">
##$SUBNAM7= <"">
##$SUBNAM8= <"">
##$SUBNAM9= <"">
##$SW= 26.0245685251456
##$SWIBOX= (0..15)
0 0 2 0 0 0 0 0 0 0 0 0 0 0 0 0 
##$SW_h= 5208.33333333333
##$TD= 16384
##$TD0= 1
##$TE= 0
##$TE2= 300
##$TE3= 300
##$TEG= 300
##$TL= (0..7)
0 120 120 120 120 120 120 120 
##$TP= (0..7)
150 150 150 150 150 150 150 150 
##$TP07= 0
##$TPNAME0= <>
##$TPNAME1= <>
##$TPNAME2= <>
##$TPNAME3= <>
##$TPNAME4= <>
##$TPNAME5= <>
##$TPNAME6= <>
##$TPNAME7= <>
##$TPOAL= (0..7)
0.5 0.5 0.5 0.5 0.5 0.5 0.5 0.5 
##$TPOFFS= (0..7)
0 0 0 0 0 0 0 0 
##$TUNHIN= 0
##$TUNHOUT= 0
##$TUNXOUT= 0
##$USERA1= <user>
##$USERA2= <user>
##$USERA3= <user>
##$USERA4= <user>
##$USERA5= <user>
##$V9= 5
##$VALIST= <valist>
##$VCLIST= <CCCCCCCCCCCCCCC>
##$VD= 0
##$VDLIST= <DDDDDDDDDDDDDDD>
##$VPLIST= <PPPPPPPPPPPPPPP>
##$VTLIST= <TTTTTTTTTTTTTTT>
##$WBST= 1024
##$WBSW= 4
##$XGAIN= (0..3)
0 0 0 0 
##$XL= 0
##$YL= 0
##$YMAX_a= 33998
##$YMIN_a= -66925
##$ZGOPTNS= <>
##$ZL1= 120
##$ZL2= 120
##$ZL3= 120
##$ZL4= 120
##$ABSF1= 10
##$ABSF2= 0
##$ABSG= 5
##$ABSL= 3
##$ALPHA= 0
##$AQORDER= 0
##$ASSFAC= 0
##$ASSFACI= 0
##$ASSFACX= 0
##$ASSWID= 0
##$AUNMP= <proc_1d>
##$AZFE= 0.1
##$AZFW= 0.1
##$BCFW= 1
##$BC_mod= 2
##$BYTORDP= 1
##$COROFFS= 0
##$CY= 11.3945322036743
##$DATMOD= 1
##$DC= 2
##$DFILT= <>
##$DTYPP= 0
##$F1P= 18.9103706918063
##$F2P= -1.10871071338519
##$FCOR= 0.5
##$FTSIZE= 0
##$FT_mod= 4
##$GAMMA= 1
##$GB= 0.15
##$INTBC= 1
##$INTSCL= 1
##$ISEN= 128
##$LB= 0.24
##$LEV0= 0
##$LPBIN= 0
##$MAXI= 10000
##$MC2= 0
##$MEAN= 0
##$ME_mod= 0
##$MI= 1.114404
##$NCOEF= 0
##$NC_proc= 0
##$NLEV= 6
##$NOISF1= 3.799351
##$NOISF2= 2.8
##$NSP= 1
##$NTH_PI= 0
##$NZP= 0
##$OFFSET= 15.70392
##$PC= 1
##$PHC0= -9022.768
##$PHC1= 24.80026
##$PH_mod= 1
##$PKNL= yes
##$PPARMOD= 0
##$PSCAL= 0
##$PSIGN= 0
##$REVERSE= no
##$SF= 200.130013532006
##$SI= 16384
##$SIGF1= 3
##$SIGF2= 2
##$SINO= 400
##$SIOLD= 16384
##$SREGLST= <1H.CDCl3>
##$SSB= 0
##$STSI= 0
##$STSR= 0
##$SW_p= 3612.71676300578
##$SYMM= 0
##$S_DEV= 0
##$TDeff= 0
##$TDoff= 0
##$TI= <>
##$TILT= no
##$TM1= 0
##$TM2= 0
##$TOPLEV= 0
##$USERP1= <user>
##$USERP2= <user>
##$USERP3= <user>
##$USERP4= <user>
##$USERP5= <user>
##$WDW= 1
##$XDIM= 8192
##$YMAX_p= 0
##$YMIN_p= 0
$$ End of Bruker specific parameters
$$ ---------------------------------
##NTUPLES= NMR FID
##VAR_NAME=  TIME,          FID/REAL,        FID/IMAG
##SYMBOL=    X,             R,               I
##VAR_TYPE=  INDEPENDENT,   DEPENDENT,       DEPENDENT
##VAR_FORM=  AFFN,          ASDF,            ASDF
##VAR_DIM=   8192,          8192,            8192
##UNITS=     SECONDS,       ARBITRARY UNITS, ARBITRARY UNITS
##FACTOR=    0.000192,      1,               1
##FIRST=     0,             0,               0
##LAST=      1.572672,      0,               0
##MIN=       0,             -66925,          0
##MAX=       1.572672,      33998,           0
$$ Real data points
##PAGE= N=1
##DATA TABLE= (X++(R..R)), XYDATA
0@%%%%%%%%%%%%qJ6j6J6j6K2l0L2l5M3m8N6o6P4q8J02j13J26j42J61j82K03k27
35a20K52k79L10l45L85m26M71n22N79o42P10p87Q74r76J096j232J394j594J842
54I90k163K596l210M165n881R912l7691l5643K6188L468P407k507m24p926N54
69d0165M225J0160R441J4397R425K916l790k202k740J427Q649J4702P553j145
83C2853m618l680o450m770J016M330R63k29k11m022r150p548k808q60j6L350K361
100E11l988o630k019P14r49l90L050K519l31M06K419N53q23J716K846J13l66K318
118A669J614q34J316M613J243m298l202L23j30p05L036M586K83l255k575k992
134F92l883l99M425M401K098J861j83n793p104r98L750L622M130N470J138n793
$$ plain form
0 0 0 0 0 0 0 0 0 0 0 0 0 0 -8 8 -8 8 -8 14 -16 16 -19 24 -24 32 -34 40 -48 54 -59 67 -75 86 -96 107 -120
35 -120 132 -147 163 -182 203 -223 248 -274 305 -337 373 -414 460 -516 580 -652 742 -852 990
54 990 -1173 1423 -1787 2378 -3503 6409 -31282 -66925 -40737 -37269 -29862 -32369 -32793 -40719 -40165
69 -40165 -35940 -25780 -16339 -1942 7483 10399 6609 4407 1667 3094 11743 26445 33998 32853
83 32853 28235 24555 18105 13335 14351 18681 19644 19415 19204 15182 6032 -1516 -4324 -5184 -5200 -1850 511
100 511 -3477 -10107 -12126 -11412 -12361 -12751 -9701 -7182 -7513 -7107 -4688 -4135 -4958 -3242 -396 -283 -649 1669
118 1669 3283 2449 3765 8378 9621 5323 2121 2444 2314 1609 4645 9231 9514 6259 3684 692
134 692 -3191 -3590 835 5236 7334 9195 9012 3219 -3885 -4883 -1133 2489 6619 12089 13227 7434
150G434o869l183j429M74N196O830K017l236m600n936o972k243N109O578K683
165A853P42p88n309p896l322K526M235N076N998K793l402n254k350p38J116N806
181A086Q274L915j222j685k011l966k256L597N839K751N54M5k951n731l453K87
197C073P03P09K190P92l772m787j789j106k376k29K845R85k230j382L64j118j666
214h794J158K214j36m19J661J197n75P80K816L36j711K74J875k5l70K629K939
231E849n17j864n44r78k042L06L230J752j46P6p23l990l779M86K521J232J426
248B295K508l75m587l800n92N4P91L534M068o9k702k460k639k989M00M416L676
265A529N97J92o68l940m722m85K998K385K310K746L61l772l740j045L7P21L477
$$ plain form
150 7434 565 -2618 -4047 -3573 1623 8453 10470 7234 2634 -3302 -10274 -12517 -7408 -830 1853
165 1853 2595 1807 -3502 -11398 -14720 -12194 -7959 -2883 3115 5908 2506 -2748 -5098 -5836 -4720 1086
181 1086 9360 13275 12053 10368 8357 4391 2135 5732 11571 14322 14876 14921 11970 6239 2786 3073
197 3073 3776 4485 6675 7467 3695 -1092 -2881 -3987 -6363 -6592 -3747 -2762 -4992 -6374 -6010 -7128 -8794
214 -8794 -7636 -5422 -5558 -5977 -4316 -3119 -3694 -2914 -98 238 -1473 -1199 676 651 281 2910 5849
231 5849 5332 3468 2924 1946 -96 210 3440 5192 5046 5122 4399 409 -3370 -2884 -363 869 2295
248 2295 4803 4428 -159 -3959 -4551 -4497 -3706 -172 3896 3827 1125 -1335 -3974 -6963 -6563 -2147 1529
265 1529 2126 2318 1650 -2290 -7012 -7497 -4499 -2114 196 2942 3303 -469 -4209 -5254 -5217 -4496 -1019
282a019M272O93k139j635j550k645n78L488L678N25j00K12j963l609r95J885J266
299b14Q30J943O02k493k472O9p2r97J082K807M89j911n46N84j091j202J476J804
317F88m07m78J141K43j272P2J545j99j232O94J302q84q20J568J216j558j401O14
335H32j41j468K67J982K80r83k0k30k106j490J248J620j65N48J613p72k880j018
353b883R82L06J94K217K095q25k017o13n27j256P57K899J318o26o0k51k438k420
371c148R45K127M97K52J288l55k834j970M38J85rJ870J985p74j794n02m45j345
389c589P1K615J808p14q3O46j173j959M89K103O10J23J234M74j643j168Q09K69
407I22o66J076J900l53j713M9N81j149q44J348J173r02n98O81l03j493j51J201
$$ plain form
282 -1019 3253 3946 1807 172 -1378 -4023 -4601 -1113 2565 3090 2990 3202 1239 -2370 -3365 -1480 -214
299 -214 616 2559 3161 668 -1804 -1735 -1807 -2804 -1722 1085 1574 -337 -883 -299 -1390 -2592 -1116 688
317 688 281 -197 944 1187 -85 -13 1532 1333 101 795 2097 1213 393 1961 3177 1619 218 832
335 832 691 -777 -510 1472 1752 769 749 519 -1587 -3077 -1829 -209 -374 174 1787 1015 -1865 -2883
353 -2883 -1901 -1595 -1401 816 2911 2086 69 -544 -1071 -2327 -1570 1329 2647 2021 1961 1710 -728 -3148
371 -3148 -2203 -76 421 673 1961 1606 -1228 -3198 -2760 -2575 -2584 -714 1271 497 -1297 -1799 -2244 -3589
389 -3589 -3518 -903 905 191 108 754 -419 -2378 -1889 214 824 947 2181 2655 1012 -156 653 922
407 922 256 1332 3232 2879 1166 1215 1796 647 -197 1151 2324 1422 824 1505 1202 -291 -442 759
425G59k93r61P65N27j206p34J108M02j421l25J285oj283J86J259k97r39M54O25
444i5r63n53J120N76q86P4J154m69j537J34J178n43o85R48Q70j149j185N68O8
463a375j006R1J287O6j046J57N02j083q93J203J126o64q7J307J64j382j18J268
481d83K91l24J019J273n27p47P97M42q45J82J498L96j168J86P80q94j347N26J002
500B057n99r00O57J65j459o09O17q9r27N08J023p39r91O21P24p08k77J405R37
519A416p39J21J250P5p92O11J352l7m82Q74N98j020m44Q34n8j079O2Q22o00j661
539A103r1M28j042j184L98L01j136o81M11k69j286jJ032k85o54Q49Q87o17n25
558b362J191Q12m07K72J626N55o90L20J033j23n23Q35J004o27m66O47q3j390m06
$$ plain form
425 759 466 -495 270 797 -409 -1143 -35 367 -1054 -1379 -94 -100 -1383 -1197 62 -235 -1174 -720 -95
444 -95 -1058 -1611 -491 85 -801 -727 427 -42 -1579 -1445 -267 -810 -1495 -547 323 -826 -2011 -1443 -1375
463 -1375 -2381 -2290 -1003 -937 -1983 -1826 -1324 -2407 -3300 -2097 -971 -1635 -1722 -415 -251 -1633 -1751 -483
481 -483 -192 -516 503 1776 1249 502 1299 1741 896 1078 2576 2972 1804 1990 2770 1876 529 1055 2057
500 2057 1458 558 1215 1380 -79 -688 -71 -160 -1087 -579 444 -295 -1286 -665 59 -649 -926 479 1416
519 1416 677 798 2048 2123 1331 1942 3294 3257 2775 3649 4247 3227 2783 3617 3559 2480 2542 3364 2764 1103
539 1103 1012 1440 398 -786 -388 -87 -1223 -1904 -1493 -1762 -3048 -3049 -2017 -2302 -2956 -2107 -1220 -1837 -2362
558 -2362 -1171 -359 -766 -494 1132 1687 997 1317 2350 2227 1704 2539 3543 2916 2450 3097 3014 1624 1218
577A218R41k57j254l1N23r60j485J33K33q57n68P81J19j155j85O39k75p98O62
596b576J118k98m81R41O47p51k48J228N78o71K20J061j44q09K95P27n60m88P74
615E63M17j113l98Q44o4j166J36Q62m12r17L25P55n40n68Q60M24p49j02Q70K08
635B35p62N45J041m75p19N20O82o93n38Q26N05q79n05O60m06j060J60O63n47o61
655a408N41K65j226o76P17K52q42K43J122j62j033K17P97l68l87J078R21l96j70
674e15P80j4r65L34J297l4n06O71P01q46r29N15O27n66q4R47l6j009k48N38n36
695A22o23O60Q77n66n47N07Q4j070j84J157K65o52J81O88m51r09K62P31n19r8
715h5P85J12r22k94O99k85q48L85R86l74p44N59L10p03l71Q59L67n35L6Q85j62
$$ plain form
577 1218 2159 1902 648 617 1140 180 -1305 -1172 -939 -1796 -2364 -1583 -1464 -2619 -2804 -2165 -2440 -3238 -2576
596 -2576 -1458 -1756 -2237 -1296 -649 -1400 -1648 -420 158 -513 -293 768 624 -185 110 837 277 -211 563
615 563 980 -133 -531 313 249 -917 -781 81 -331 -1248 -923 -168 -708 -1276 -416 8 -741 -843 27 235
635 235 -527 18 1059 584 -135 385 1067 374 -164 662 1167 288 -217 443 37 -1023 -863 -200 -747 -1408
655 -1408 -867 -602 -1828 -2504 -1787 -1535 -2377 -2134 -1012 -1174 -2207 -1990 -1193 -1561 -1948 -870 51 -345 -515
674 -515 265 251 -714 -380 917 883 377 1048 1749 903 -26 489 1116 550 466 1413 1377 368 120 658 122
695 122 -501 159 1036 470 -77 430 514 -556 -740 417 682 30 211 899 448 -461 -199 532 13 -85
715 -85 700 812 -110 -404 295 10 -838 -453 533 159 -585 -26 284 -419 -790 69 436 -99 -63 822 660
736F60p58L81P49l34m69Q60M75q51l18Q42O0r21j29Q12k30q25R4M64o65o63N60
757b06K03r16k72O96o7q57J71P26k75o99N34P28n10l75Q09N18n54o2Q02J73n23
778D4K09Q83l21n42O30N21p32n28P38K45p96j04O48j66q03R8N83m86n75N55N07
799F08o28l87P46N5p11R4R33m3o48M60P36m45o95N04N93m95k39O89%r22j19N15
821F01n70p79L70N16o30q58L29Q8r89l50O65K85o86N6P09l83o48N05O71j16J27
842a087J033M82m75j5R19J31l83N92J192L5n37L28K78o99m54O62K84o64j11L12
862A823o43j212k59L81n54n34M90L18r37p93L30k3o82K74J018K70m57L42M14m53
882h87j94R63P69j8K70J014K8q39j6P78P8m27N46N52o74q59J02j27q40l31N85
$$ plain form
736 660 -98 283 1032 698 229 1089 1564 713 395 1237 1297 376 247 1059 829 4 98 562 -103 -766 -206
757 -206 -3 -919 -1191 -495 -562 -1419 -1248 -522 -797 -1496 -962 -234 -744 -1119 -310 208 -346 -408 394 567 44
778 44 253 1136 815 273 903 1424 692 164 902 1147 351 247 895 729 -74 24 607 121 -454 101 608
799 608 -20 -407 339 394 -317 -223 710 667 19 479 1215 770 75 579 1172 677 438 1127 1127 205 86 601
821 601 31 -748 -378 138 -492 -1350 -1021 -933 -1922 -2272 -1607 -1322 -2008 -1952 -1243 -1626 -2274 -1769 -1098 -1214 -1087
842 -1087 -54 428 -47 -62 857 988 605 1197 2389 2424 1887 2215 2493 1794 1340 2002 2286 1622 1511 1823
862 1823 1180 -32 -291 90 -464 -998 -508 -190 -1127 -1920 -1590 -1613 -2295 -2021 -1003 -733 -1190 -848 -434 -887
882 -887 -1081 -118 651 633 903 1917 1945 1106 1090 1868 1946 1519 2065 2617 1943 1084 1186 1059 219 -112 473
903D73j82r77k69K20q42r06L05M85n60l94N94J14p57p3O92J68l16M48P75j50k35
924a387P45O49l80o6Q80L45o10J37Q06Q7n03K02M78n49p17K75M34m10j66N98j19
945G29r77k79L30m30l68O01Q88l49o67K48J22p81r4J039O21j16K65M59o14q75
965b48K11Q13KJ30R58K12j001p75K18j68m16N35J107o1q30k26k28j072k87P28
985c98O78j77N7K89n94j174j30P08J45M4Q19N68p77q11J85ql80M53J091L14o80
1006B22j7M2p12m90P40O67k83kM56j42j089j61O10N5k75L82N87m27n86K95K24
1027I6n13p1Q27N2o22J36O75k06n37M14M58m76m45N09L59m27l3O49j82p68j21
1048b26L37k47k94O90O89o27o12K12j33p27N4J026K51k67J14M2q21q48M26O96
$$ plain form
903 473 291 -686 -955 -735 -1577 -2483 -2178 -1693 -2253 -2647 -2053 -1939 -2696 -2769 -2077 -1909 -2225 -1777 -1002 -1152 -1387
924 -1387 -642 7 -373 -439 441 786 176 313 1119 1206 703 905 1383 834 117 392 826 416 250 848 729
945 729 -248 -527 -197 -627 -995 -394 494 145 -522 -274 -152 -933 -1027 12 633 517 782 1241 627 -248
965 -248 -37 776 778 908 1866 2078 1077 302 520 352 -64 471 1578 1517 687 461 233 -839 -1126 -398
985 -398 280 103 160 449 -145 -1319 -1449 -741 -596 -552 267 835 58 -753 -568 -576 -956 -503 588 902 222
1006 222 205 247 -465 -955 -215 452 169 167 623 481 -608 -769 -159 -104 -379 3 590 163 -423 -128 96
1027 96 -417 -488 339 391 -231 -95 580 374 -163 251 709 233 -212 297 656 229 196 845 663 -105 -226
1048 -226 111 -136 -430 260 949 322 -290 -78 -211 -938 -884 142 393 126 240 282 -539 -1387 -961 -265
1068b65K6K20Q63l6j105o88L17k0j05R53R10j85q39j67k56p45j26J124Q01j61
1088E16K3P9q83j100K26Q00J27K31P87J34j026q06J34J6j52O90J113O7p75j75
1108B6n8o44k31Q17P81j39JM06l82j115L1P72P4k06N61M79o18n72J91J90m83J43
1130B4P71o4n82O6L39l41n10K95M09m32m41O10K09n07l2N22j35p71J50L37k36
1151c19k08O80M05o51m08K85j56n29J60J005K86n34L4Q7p95n17N01N91mJ78N59
1172F50l32j084l12K88M1oQ96O79m40p87r2k24n57K00J076O58k97m4p7o99p33
1193a196L62Q38J91K14O48%j024o30L28K03j92Q36Q64k80p16j55L0o24r7J019
1213F19M88l40Q3J58n37q34K11O96k6j48N07J70p16m56K80R2l66J80N98j58o11
$$ plain form
1068 -265 -239 -19 844 808 -297 -985 -668 -688 -793 160 1070 885 46 -121 -377 -1122 -1248 -124 677 516
1088 516 539 618 -265 -1365 -1139 -339 -212 19 806 940 -86 -892 -758 -742 -894 -204 909 976 201 26
1108 26 -32 -676 -907 -90 691 552 553 959 577 -538 -507 265 339 133 694 1173 555 -17 174 364 -119 24
1130 24 795 731 149 215 554 213 -297 -2 407 -25 -466 144 353 -154 -186 336 201 -570 -420 -83 -319
1151 -319 -527 153 558 -93 -501 -216 -372 -901 -741 264 550 16 50 137 -658 -1175 -674 -83 -87 91 650
1172 650 318 -766 -1078 -790 -749 -755 141 820 380 -407 -499 -723 -1280 -1080 -4 654 357 313 236 -463 -1196
1193 -1196 -834 4 195 409 1057 1057 33 -597 -269 -66 -258 578 1442 1162 446 291 321 -303 -400 619
1213 619 1107 767 850 1008 471 -363 -152 544 518 370 877 1047 331 -125 155 247 -119 61 659 501 -110
1234a10O5L26n58l06L73L39n78j99M28J0n88P6M75k35n70K12M69k68j33N71K51
1255E0n48j98L74%l17L56Q32J4m54K92J55n80k63O15N16j05L5N03l98q57j05M05
1277C22k2l9O00L56o52o79J42j14o70L03R19K50n84l6J3o75m21N62N40K6J91L74
1299G06j31q28k21M65J18j96O72M97l74o95R7J2n18K6P62K40n82q1J03n37o06
1320a071J58N40k21k30L89K8p16k98N13j0l53L03N54k08l82K63L16l82j4O18L23
1341A20m22n3O18J7l69J81N36k53l46M32L16l63j94M76J04n66j09M26j81m54L30
1362B46M74k69n08L16J20n80j65N39J67l32R3L74l26o54L10M39k65j01N94R8n63
1383Gk97K82rn04K77O08j01o28J38J43n09k71M85K59l40k2M29r6o52J84M77j30
$$ plain form
1234 -110 -45 281 -277 -583 -210 129 -449 -648 -220 -210 -798 -722 -247 -482 -1052 -840 -371 -639 -772 -201 50
1255 50 -498 -696 -322 -322 -639 -283 549 563 109 401 556 -24 -287 328 844 739 774 1277 879 22 -83 322
1277 322 300 261 861 1217 565 -114 28 -86 -756 -453 466 716 132 96 109 -566 -987 -425 115 141 332 706
1299 706 575 -253 -474 -9 109 -87 585 1082 708 13 110 122 -396 -370 392 632 50 -31 72 -465 -1071
1320 -1071 -913 -373 -594 -824 -435 -407 -1123 -1421 -908 -918 -1271 -968 -414 -622 -1004 -741 -425 -807 -821 -203 120
1341 120 -302 -355 263 280 -89 92 628 375 29 461 777 414 220 696 800 234 125 551 370 -84 246
1362 246 720 451 -57 259 379 -201 -366 173 340 8 101 475 149 -505 -195 244 -21 -122 472 570 7
1383 7 -290 -8 -17 -521 -244 364 263 -365 -227 -84 -593 -864 -379 -120 -460 -482 -53 -149 -801 -617 -140 -270
1405b70k01M75L96l83k38M10J64l29M8O44J00l88O1M68l36l07L33L61l68k16L56
1426G80j7n79p4M34j77n13P6K68m03l50K91J79n62j42L65Rm78M4L82o5l84K15
1448g01L97l15k20M46K83l08nN28O5l91J21M70r7l05L20L79k79l11M63J77m96
1469B21o7M84L1m57Q5L51k08l68K55K52m35k25M03J00m86p3L57J9n05J34M17l03
1491a8m47M20K53k96k31L81L7m97N0L80j18l51M03K93l85l04L31K97m57K6N43
1512C10R2n26o3L12j37l69L50M01j95k51K94N0m84o9M64J6k48J04M14l28m87J63
1534a87L74k51k43M56K10m44j78K72K6l74J62M70k26k78L03K23m57j42M37J71
1554C24l66MM99k02l70J98L13j68l06L86K43m00j13M07J2m63N8L76j80m61K07
$$ plain form
1405 -270 -471 4 400 17 -221 189 353 24 72 716 816 428 489 957 621 314 647 1008 640 424 780
1426 780 763 184 110 544 367 -146 -70 198 -205 -555 -264 -85 -647 -789 -424 -415 -893 -849 -467 -532 -916 -701
1448 -701 -304 -619 -839 -393 -110 -418 -423 105 170 -221 -100 370 273 -32 288 667 388 77 540 717 221
1469 221 154 638 669 212 297 648 440 72 327 579 144 -81 322 422 -64 -137 220 239 -266 -132 285 -18
1491 -18 -465 -45 208 -88 -319 62 99 -398 -348 32 -86 -437 -34 259 -126 -430 -99 198 -259 -233 310
1512 310 402 -124 -187 125 -12 -381 -31 370 175 -76 218 268 -216 -285 179 195 -53 51 465 137 -350 -187
1534 -187 187 -64 -307 149 359 -85 -263 9 35 -339 -177 293 67 -211 92 315 -142 -284 153 324
1554 324 -42 -38 461 259 -111 87 400 232 -74 312 555 155 42 449 461 -2 56 432 252 -209 -2
1575bL87k69l09K84M0m00k51L84Nl88J32M46k35m69L3K52l53j68M51L70l64k66
1597f90L65j52m92J16N92J08j90L30J41m51l16L21L10k06K14N90l4n29kL21k50
1618I6j60N14N26k26l24K18j08m96K4N27J08k20J61K54m97n19J66K91k73J3M58
1639E33N4m57k90J85j59l60L92L96k74k78K55M7n15q0N15Q0k28j9L84k27m36K21
1661b61K93k75k24M17J85l30j98M00ql64J17L68k44l05K83L90k57k25K90J12m18
1682b54j35L81O6k41J06N15l39l87J08J31j68r1M62K14l07j82J89k20l97J83O12
1703B46j4j95K11J31o01k69L72K39j41K32N07k68n45L8J39o3j22N72M03l26l35
1724B11K00j26m45Q5N50J19k61K21Q8o01m01L48J37j80P5L73k3o27k37K45q3k42
$$ plain form
1575 -2 385 116 -193 91 131 -269 -520 -136 -131 -519 -387 59 -176 -645 -612 -360 -713 -881 -430 -60 -424 -690
1597 -690 -325 -477 -969 -853 -261 -153 -343 -13 128 -323 -639 -318 -8 -214 0 590 556 27 25 346 96
1618 96 -64 450 976 750 426 644 536 40 64 591 699 479 640 894 397 -122 44 335 62 75 533
1639 533 587 130 -160 25 -134 -494 -102 294 20 -258 -3 44 -471 -551 -36 44 -184 -203 181 -46 -482 -261
1661 -261 32 -243 -467 -50 135 -195 -393 7 -1 -365 -248 120 -124 -429 -146 244 -13 -238 52 164 -254
1682 -254 -389 -8 58 -183 -77 438 99 -288 -180 -49 -217 -308 154 368 61 -121 68 -152 -549 -366 246
1703 246 232 37 248 379 -222 -491 -119 120 -21 211 718 450 -95 -57 82 19 -103 469 872 546 211
1724 211 411 285 -160 -75 475 594 333 554 642 41 -360 -12 125 -55 20 393 370 -257 -494 -249 -332 -574
1746e74L35L68j91l11J49l1l97p3N58J05k54R7K13k01l28K31L38k38n7L36K27
1767C02n21N6K96o9l12J65L39k37k59K35K40k77k61L82M6m10L4L11j7k80K22K99
1789B84k96k90J32K08j43q2M99J11l21K6J85j44k60K96N04j71j08J24Ql92j68
1810BL60J27j50J95L75l98n07l9J93j92j19M92J34l95l01J00j94l06J13M76N1
1831A7k32Q9K7l74l38L35K32j52K26M25j31n18m2K85j29q1M71L85l59k43K26n1
1853F8k99R6M34Q1l09J87J01l40k96L07J35j93l3L49L1m69k9K67j28k00J76L48
1875B84k05l21K05J58k81j61M48N9k63m5L64j45k48J52K25k34k08K78J44k79L
1896g0L23K6l87Q8K47k21k64L36K53j90j34K63l0m49j7L96R4k67J96J18l28k48
$$ plain form
1746 -574 -239 129 -62 -373 -224 -255 -652 -725 -167 -62 -316 -219 -6 -207 -535 -304 34 -204 -261 75 302
1767 302 -219 -163 133 64 -248 -83 256 19 -240 -5 235 -42 -303 79 125 -285 -251 60 43 -237 -15 284
1789 284 -12 -302 -170 38 -105 -187 312 423 102 128 313 169 -91 205 709 538 430 554 562 170 2
1810 2 362 489 339 534 909 511 4 -35 158 -34 -153 339 473 78 -223 -123 -317 -623 -510 -34 17
1831 17 -215 -126 -99 -473 -811 -476 -244 -396 -170 255 124 -394 -436 -151 -280 -361 110 495 136 -107 119 68
1853 68 -231 -135 299 380 71 258 359 19 -277 30 165 -28 -61 288 319 -150 -179 88 -40 -240 -64 284
1875 284 79 -242 -37 121 -160 -321 127 186 -77 -122 242 97 -151 1 226 -8 -216 62 206 -73 -70
1896 -70 253 279 -108 -20 227 6 -258 78 331 141 7 270 240 -209 -226 170 264 -3 193 311 -17 -265
1918b65K03J10j68p5M15J11n01m7J41j43k87K27L26n0l06O0J07m15j40L30J04
1939b63j76J43L12k51l66R7L55k50QM37K13l43j27K45j06j54J49N44q7j91K36
1960D25J03k85j49K49J75j28P7K16j61l99K7J82q2k51K70K22k93j93J43p1l12
1981b35N7K91k6l00J45Q8k43k51K25K01k31p9K88M1l75RL49j72j41J82K02j91
2003a66j81K44J54k79m5L46L1k66%L70j42j76J91J82j65j80K55J42l48ML53Jk86
2026C9m5L26j34l05J70K65k60j49K02P5l32r4K85l9j83Q8K63k65k10J57J48k27
2048b25oL03J00k46p8K32j12j70K30L05p7j96K42M7l59l1L71J55k55O3J81q0m09
2071a5J21K49k23o5K58Q2k91j19Q2p2k36Q9K91j05k26J21K6k87j80K23K59k80
$$ plain form
1918 -265 -62 48 -120 -195 220 331 -170 -217 -76 -219 -506 -279 47 -3 -309 -249 -142 -557 -697 -367 -263
1939 -263 -439 -296 16 -235 -601 -504 -149 -399 -391 46 259 -84 -211 34 -72 -226 -77 467 380 189 425
1960 425 528 243 94 343 518 390 467 683 522 123 150 332 250 -1 269 491 198 5 148 77 -235
1981 -235 -178 113 87 -213 -68 20 -223 -474 -249 -48 -279 -358 -70 -29 -404 -395 -46 -218 -359 -177 25 -166
2003 -166 -347 -103 51 -228 -273 73 104 -162 -162 208 66 -110 81 263 98 -82 173 315 -33 -29 324 325 39
2026 39 -6 320 186 -119 51 316 56 -93 109 184 -148 -242 43 4 -179 -91 172 -93 -303 -146 2 -225
2048 -225 -231 72 172 -74 -152 80 -32 -202 28 333 256 60 302 349 -10 -41 330 485 230 293 474 394 -15
2071 -15 106 355 132 67 325 407 116 -3 79 7 -229 -140 151 46 -180 -59 -33 -320 -500 -277 -18 -298
2093b98Q0J99o3l53M3K62j18j53L65J58k39k34J71Q4k53N0L26R9j98jJ42k03j86
2116c20J88K38j33k4K78lk52l2K63p6j60K03K62k11j28J68J11k58k1K28Q3k42
2138A62p4K96o6l19R9J99k11j39R2N6k71n1L20j12k43j6K15j03k71J78J67k5j79
2161b96J97N2k38lL41N3j30M9K52n4k97R4J97n0r7L17Q1k90q6P4j03j27J11K32
2185B79j72k28Q8k6l31j43K23P2j58K6J93j71k85k2K25Mm4L08J98k29j62K29K1
2208a05j00J65M29J2j20P5J32k24r7K49K23k8j32K50j71k34l4R1o4j13J53J53
2230E10l28k30K0L4k67NJ86M1l37Q3J39k66j46J65K73k07J2J69K6k06k6L45j29
2253a34m3J20K43j01j93K06J50j62r3K36L3k51l6K69q7j73L5K38k22k37J67J36
$$ plain form
2093 -298 -218 -19 -82 -435 -392 -130 -248 -401 -36 122 -117 -351 -180 -96 -349 -299 27 126 -72 -73 69 -134 -320
2116 -320 -132 106 -27 -51 227 224 -28 -60 203 127 -33 170 432 221 93 261 372 114 93 321 404 162
2138 162 88 384 318 -1 98 297 86 -53 39 95 -176 -227 93 -19 -262 -278 -63 -166 -437 -259 -92 -117 -296
2161 -296 -99 -47 -285 -288 53 106 -24 25 277 223 -74 20 217 167 70 387 468 178 92 166 63 -64 47 279
2185 279 107 -121 -33 -59 -390 -533 -310 -238 -396 -370 -177 -348 -633 -655 -430 -426 -470 -162 36 -193 -355 -126 -105
2208 -105 -205 -40 389 401 281 356 488 264 167 416 639 611 479 729 558 324 290 381 317 204 357 510
2230 510 182 -48 -28 6 -261 -256 -70 -29 -366 -283 -144 -410 -556 -391 -118 -325 -313 -144 -118 -324 -350 -5 -134
2253 -134 -177 -57 186 85 -108 98 248 86 -7 229 262 11 -25 244 157 -16 19 257 35 -202 -35 101
2275A01k44J7K25m5k22j23K19n8k31K69K13j25j75J22L1k20N3L20J03k76R8J94
2297B46j81k18Q2K41j12l2K07J13l44j13K27j46p5J33K73j28j60O1P6l22p4K96
2319E0J89j60K6R5j20k59R6J45k1k9J50J95k93j27J06M7k18J30J53M7k10k3J32
2342A01k70j38J94J80k36K5J47o5j75m6K39r4r5P1K42k50j43J89J53j93K0J46
2364BJ61k56Q1J83q3j76J49J57j77p8J75P0k03j5J38rj75K4J64j41j54K23L9j30
2388c1j39J84j0j52m7L83j28o4M6Q5j33k02K14J63j18K0J31P9k46o9J75r9p6J38
2412A04K48j84j20j6M4k25KJ53Q8j16m6J25j89k34J29J62r8k6J75lj64j78J78
2435a91O0k01J97K04j5k86J98P6j37n1J48J21k3r2J68K3k99J87P8j2j23J25J61
$$ plain form
2275 101 -143 -126 99 54 -168 -291 -72 -130 -361 -92 121 -4 -179 -57 -26 -246 -193 127 230 -46 52 246
2297 246 65 -153 -71 170 58 26 233 346 2 -111 116 -30 -105 28 301 173 13 74 150 -172 -246 50
2319 50 239 79 105 200 80 -179 -83 62 41 12 162 357 64 -63 43 90 -128 2 155 202 -8 -31 101
2342 101 -169 -307 -113 67 -169 -144 3 -62 -237 -283 -44 -138 -233 -162 80 -170 -313 -124 29 -164 -144 2
2364 2 163 -93 -12 171 88 -88 61 218 41 -37 138 208 5 -10 128 119 -56 -32 132 -9 -163 60 99 -31
2388 -31 -170 14 4 -148 -195 188 60 -4 42 127 -6 -208 6 169 51 71 202 281 35 -34 141 42 -34 104
2412 104 352 168 48 32 76 -149 -147 6 94 -22 -68 57 -132 -366 -237 -75 -173 -199 -24 -27 -191 -369 -191
2435 -191 -131 -332 -135 69 54 -232 -34 42 -95 -146 2 123 100 8 176 199 -100 87 165 153 30 155 316
2458C16k08r8J11O7j32q9K15O4k85j4K06j14j47Q4J44j84j54K80k3j85%K08p9
2481a7j75J23R3j55o1J76N6j60K4O0oj02P7K28j03j31J54J09j41n5P9J24r6k8
2505G3J55k3j53J4O4Pk26K02J50j95j20J22mk53M5J57j11j31N9M5j32k12J66Q9
2529b12o2l3J75l3j32M0J36L9j43J93J94n9j51J44Q5l7j01K58L3j13N0K26j41
2552C56j96J18Q9q9j82M2J26k73j3P9l0k19l1J67q3j47j9K39k03j07J46J26j26
2575b30p5J53J16k06R4K32n9n9J13J31o3r6K27Lr3J3P6%j84O0R2j21k05J39R5
2600A53k33j79K78j56j75N6O9K8j75k7K13n7j42J57J93j88N2J47J1j50Q2K21k0
2623A58k1N6J06j36o4J81L7j94j3J08m2j96L4L3j6j95P8R9j80j47J85N7k40N2
$$ plain form
2458 316 108 10 121 188 56 -33 182 246 -39 -53 153 39 -108 -24 120 -64 -218 62 39 -146 -146 62 -17
2481 -17 -192 -69 24 -131 -192 -16 40 -120 -96 -36 -42 -144 -67 161 58 -73 81 190 49 -6 73 197 101 73
2505 73 228 205 52 66 130 137 -89 113 263 68 -52 70 66 -187 -142 15 -96 -227 -168 -123 -255 -467 -301 -212
2529 -212 -274 -307 -132 -165 -297 -257 -121 -82 -225 -32 162 103 -48 96 181 144 43 301 334 221 271 497 356
2552 356 160 278 367 278 96 138 264 -9 -22 57 27 -192 -223 -56 -139 -286 -305 -66 -269 -376 -230 -104 -230
2575 -230 -305 -152 -36 -242 -148 84 25 -34 79 210 147 51 278 281 188 201 277 277 93 153 245 124 -81 58 153
2600 153 -80 -259 19 -137 -312 -256 -187 -159 -334 -361 -148 -205 -347 -190 3 -185 -133 14 25 -125 -43 178 158
2623 158 137 193 299 163 99 280 317 123 110 218 176 -20 14 47 31 -164 -86 13 -167 -314 -129 -72 -312 -260
2647b60J53k0p4o2K44Rj49J46J77l3j15K07J7o5k1K09l4j15O7Q4q1j55J07Q1j45
2672A72j86R9J6j67l4P1n2j21OJ12r6j85J64J0j41N6J98l4j20N0K21N2k07J22
2696FJ16Qj20J33N5j37l6J63N0j92l3J16j13j63N4Q5j28j25J26K3j83l2J50J5
2720a62j78N7Q2m3j33J77J23j4m0J53M6j69J36K28l5q0J61P4r6J2R8Q5k20J3J78
2745D53o3j22L4J9r4j79P4P8j22l6q1J16k91l6J37Oj29L7P7l6j30N8J23o0k7J57
2771c7Q4j78l4J47rj57R3R8K9j80J40J07n8j90J38R3j27kR0j7j24K3L7No1J07
2797A7Q5r1j40J73J3r0K5J00m6o1N2J37o7j37J23M0j13k8Q8O7j34J2J12q5j18
2822f6Q0J35j02j49J46O3j05r6J18Mj12L3J51k4j54J38R4j03p3J84o5q6L6J40
$$ plain form
2647 -260 -107 -127 -201 -263 -19 -10 -159 -13 164 131 16 223 240 175 154 363 329 214 281 365 284 129 236 317 172
2672 172 -14 85 101 -66 -100 -29 -81 -202 -196 -84 -180 -365 -201 -191 -332 -276 -78 -112 -232 -182 39 91 -116 6
2696 6 122 130 10 143 198 61 25 188 238 46 13 129 16 -147 -93 -8 -136 -261 -135 -112 -295 -327 -177 -162
2720 -162 -340 -283 -201 -244 -377 -200 -77 -91 -131 22 68 -101 35 263 228 148 309 383 287 299 397 482 262 275 453
2745 453 390 268 302 321 227 48 122 200 78 42 -39 77 -214 -250 -113 -107 -236 -199 -122 -158 -288 -230 -107 -167 -194 -37
2771 -37 47 -131 -165 -18 -27 -184 -91 7 36 -144 -4 103 45 -145 -7 86 -41 -43 47 30 -94 -71 -34 -29 -90 17
2797 17 102 11 -129 44 57 -33 -8 92 46 -15 37 174 107 -30 93 133 20 -8 80 147 13 25 137 52 -66
2822 -66 14 149 47 -102 44 107 2 -94 24 28 -84 -51 100 76 -78 60 154 51 -22 162 97 11 47 187
2846A87l0k08J46P0j59j27J62J07j11j40P4J01k45m6J20N5j52M3J22j43j41P4
2868b41P2r9pJ44J22j56q4J94L1j32J16J27o4l5R6N3j16m0J82N1j11L3J30n1j36
2893G9N8J37j28n8O7R0j51j5R6k1j59J1J69j03j55J01O0j15r0J28O8j69n1J81
2917C0o4j11lJ67j14r3J97J2j00n4J52R8j46j0J48q5l2M0P9m3j24M0J63j98j9
2942g0J14P9j10J4L8M6j31L6J36k22k9O2Q1j21r0Q9K1k05Q8J52j2j40M3J83j55
2967a03j25J30M3o6O2J14k7j26L3J09Nj62K11O0oj68J43J18j93k1J24L5r4KJ00
2992A98K8j68K8M5o3l9R4N0j65k2J34o3j01J8J01j25m8N1J14j47j02J51m9n5m9
3017a84K08r6q0NJ57q8j32K28K6j83j4J77O1j66O5P1l6j03O4J15k9j14J36J7j79
$$ plain form
2846 187 157 -51 95 165 6 -121 41 148 37 -103 -29 72 -173 -219 -99 -44 -196 -153 -31 -174 -315 -241
2868 -241 -169 -268 -275 -131 -9 -165 -249 -55 -24 -156 -40 87 23 -12 84 137 21 -19 163 214 103 136 266 215 79
2893 79 137 274 146 88 155 245 94 79 175 154 -5 6 175 72 -83 18 78 -37 -127 1 69 -100 -151 30
2917 30 -34 -145 -148 19 -95 -188 9 21 -79 -133 19 117 -29 -39 109 24 -8 32 111 68 -56 -16 147 -51 -70
2942 -70 44 123 13 27 65 111 -20 16 152 -70 -99 -37 44 -77 -167 -78 -57 -262 -174 -22 -34 -174 -131 52 -103
2967 -103 -228 -98 -55 -121 -59 55 28 -98 -65 44 49 -113 98 158 152 -16 127 245 52 31 155 190 96 98 198
2992 198 226 58 86 131 68 29 123 173 8 -14 120 57 -44 -26 75 -50 -98 -47 67 -80 -182 -31 -80 -135 -184
3017 -184 24 -72 -152 -147 10 -78 -210 18 44 -139 -153 24 85 -81 -16 55 19 -84 -20 95 66 -48 88 105 -74
3042g4m0J37Kj14j1P9J03k35J06K2o5n7J06R1j88j6R2N6j08R5Q3o7n5J20N4m3
3068G3r6J56K5k8o6K51j20k4jO8k0j13R3J12k36l0L3L8r1j37J70k2k32R8K1j54
3094b32n6J05J30j82m1J75k9j68Q0J60l7j22J20J65o9q8K05N1n8j6L1J03p8NN6
3119B10j4j26N7J12j27q9M5M5q8o8P6q5q7qJ43n8j92R3Q1j28q6J01J24k06O3J69
3145d3P4j97J02J12r2O9M5J19j32q9J18R6j36L7J13m1o6M6J21j24p9O5J00j76
3169D2N0L9j2j75oJ24p1q2R6K9n4p5J74k1q7KP1po8JJ43m7j87Q7P9l7j46J62K8
3198E2k01jJ62j5j32l4R6J3j47Q9P3p8j11J30L8j82R9J08J15k03N9J16Kj00R8
3223D6J37p2n9J24qr8P4J0mr8Q4K8j3q6JJ2q4m6P2L1j06J4O0j47r1R5N9p4l3J28
$$ plain form
3042 -74 -114 23 25 -89 -100 -21 82 -153 -47 -25 -90 -147 -41 50 -138 -154 -62 -6 -114 -19 64 -3 -58 62 116 73
3068 73 -23 133 158 130 64 315 195 171 170 238 218 105 198 310 74 44 77 115 24 -113 57 35 -197 -99 -78 -232
3094 -232 -288 -183 -53 -235 -276 -101 -130 -298 -218 -58 -95 -217 -97 68 -1 -89 116 167 109 93 124 227 149 154 210
3119 210 196 70 127 239 112 23 68 113 25 -43 33 -52 -139 -147 -4 -62 -254 -161 -80 -208 -294 -193 -69 -275 -212 -43
3145 -43 31 -166 -64 48 -44 25 70 189 57 -32 86 182 46 83 196 155 89 135 256 132 53 118 218 42
3169 42 92 131 119 -56 -62 62 -9 -91 5 34 -20 -95 79 58 -29 -27 44 37 -31 -30 113 66 -121 -34 45 8 -138 24 52
3198 52 -149 -150 12 -3 -135 -169 -73 -60 -207 -118 -45 -123 -234 -104 -66 -248 -149 -41 74 -129 -70 46 48 -52 46
3223 46 183 111 52 176 168 70 144 154 150 52 136 164 151 65 66 78 -6 -52 20 51 -55 -41 19 -128 -219 -124 -65 -139 -172 -44
3253d4N3o0p0L4P1r4L2J59l2r3O2Q0r1o7J12J03j39O3J40r8k04Q0J24j33L3M0
3279F1N4q8j38J00K5r2n0J37m6j06O1R7q7q1J45k0p0J7Q6K4j25J7O6ln7K2J17
3306F6m4j08J46O5n8j5N2J5p3l2P8K6j12J8J06j15q2J62o6n2K6J09k7j34J6Q1
3332D8K1j33P3M9j1j88J90Rj27p7K30r6m3N1R6n7q8J44M0q9LP4l1o4o6R1j2qR
3361C8M1kq1L1O3j59k5J49L8j33m3J37j55l2NL0m1nL2L9r8L4j9L3m8M4J14n5n3
3390a21J24L7j44M4Q8R0j33O0J07lj34J12N5m7n2M8J01q5r5K9K2r5m2J65p3j26
3416f8OJ09m3n4N3O8j42j40J79N3j26L6N9J2j68Q9J13r0K4J02o1M6o0L7L6q1n7
3443f8J25J4m4jJ2j28q3J65kj1l6R8n3j21K1P3op7k1J73l3q8L0Kl4L7J30j5k2
$$ plain form
3253 -44 9 -51 -121 -87 -16 -110 -78 81 49 -44 18 98 7 -60 52 155 16 79 219 121 -83 -3 121 -12 21 61
3279 61 115 27 -111 -11 14 -78 -128 9 -37 -143 -82 15 -72 -153 -8 -28 -98 -81 5 29 -96 -79 -13 -16 -73 -51 66
3306 66 22 -86 60 125 67 52 104 119 46 14 92 118 6 24 130 15 -67 95 29 -23 3 112 85 -49 -33 48
3332 48 69 -64 9 58 47 -141 49 58 -69 -146 84 -12 -55 -4 92 35 -53 91 131 42 45 119 88 24 -42 49 37 29 38
3361 38 79 77 -4 27 90 -69 -94 55 93 -40 -83 54 -101 -133 -128 -98 -139 -144 -112 -73 -171 -137 -156 -123 -171 -127 -13 -68 -121
3390 -121 3 40 -104 -60 28 118 -15 45 152 149 15 127 182 135 83 131 232 147 52 81 103 8 -34 131 58 -68
3416 -68 -62 47 4 -50 3 71 -71 -211 -32 21 -105 -69 -10 2 -166 -77 36 -54 -30 72 11 57 -3 34 70 -11 -68
3443 -68 57 71 27 26 38 -90 -173 -8 -10 -21 -57 41 -12 -133 -112 -39 -45 -122 -143 30 -3 -91 -61 -59 -93 -56 74 59 37
3472C7l1R7j29J2J9J01n8j6O8op2p0J67j34o7J08Q5l1j02J3P2q0J3j2L8o4J8J36
3500A12j25k8N5P6j8j35J17J13r8NK2K6n1l8N7K4j18R6L5j13Q7p7Ll9l8Q4n8q5
3528a09P6O4r6r0O3j1J6J8o2O7l9l2J6J62j88M8M6K7j18J10M0Mj09R3K9k5K6K2
3556D8K1q9P1l5J8p9O9Q1m9j62J15J8k5m1J16m0p1L6%q4J1O8K6r6K0J41j7j42
3584g1KP7%o1P1O2l0p3O5l4k2j4R2J7k3m2J38r1p8P5N2n7n2L8N0o9J5J8J1l1o9
3615c4R1J6r9k2J14j28k2P2N4j42MM8K5p2k8J57p1p9O8J4n8l6J43Kn1l6R5m1j01
3644a17J83m1l0j8J35L4r7m5Q9Q0j09L6R8j06J1l6O0J8j03P8ro8r4Q6J3j08M3
3671a7O9j18m7J07Qk4r1Q4L1n8j5J36o8j65J49K4j5l6M2K5k0l3QJ02p9MJ04p6
$$ plain form
3472 37 6 103 -26 -14 5 106 48 32 100 94 22 -48 119 -15 -82 26 111 80 -22 -9 63 -17 -4 -16 22 -42 -24 112
3500 112 -13 -41 14 90 72 -63 54 167 69 74 96 122 71 33 90 114 -4 92 127 14 101 24 27 -12 -50 34 -24 -109
3528 -109 -33 31 -65 -155 -92 -103 -87 -69 -131 -64 -103 -135 -119 43 -145 -97 -51 -24 -142 -32 8 12 -97 -4 25 0 26 48
3556 48 69 -20 51 16 34 -45 24 105 56 -106 9 27 2 -39 77 37 -34 2 2 -82 -71 -3 23 -73 -53 88 71 -71
3584 -71 -69 8 8 -53 18 80 50 -23 42 8 -14 -28 64 81 58 16 154 63 -15 60 112 55 3 41 91 22 37 55 66 35 -34
3615 -34 57 73 -26 -48 66 -62 -84 -12 42 -100 -96 -48 -23 -95 -123 34 -37 -116 -48 -34 -92 -128 15 17 -34 -70 25 -16 -117
3644 -117 66 25 -5 -23 112 146 49 4 93 173 64 100 198 92 103 67 127 145 42 120 111 43 -51 35 48 -60 -17
3671 -17 52 -66 -113 -6 2 -22 -113 -29 2 -56 -71 65 -3 -168 -19 5 -10 -46 -4 21 1 -32 -24 78 -1 3 107 31
3699C1l8N9k2k4l6J1J48j58k3O5j6l0mJ19k7j53P2M9m9n1M2J0m8O2j1k1rm4J08
3728A2p5o5OR7Jp6R8Jj2r8J01J14j76%J47m5m5M5L0l6n9J63qj10P6K3k7q3M8Q6
3758A33o4n3J7P1l5j0Mj3J2n9Q0l0j31O9L6m4m0N2L8n2m2K7l2m7J6R2j3r6Q0J2
3788b2m6j3M4N1n0m5RRo5OJ09l9%l8J26j00j7J2N8m9pM6J7o1J7Q1m0oN8K0r6P0
3820C9N1n1o4o1J64Rj42R6P5o4j14N5pkq7J29k4om4M5L1q6J2Q7pj9M2J4m0j0N8
3851G9kr1L7J60j46k4O4K3l6j8j8N8q5J7J7j4n9QR6m0j22O7O9j22kQ2K9p8L8k4
3881c7O1j68J06K8j4O2r4J41j04M4K4L1o4m5M8O6r4L5M9k6r0L3R7j18nL4M7l2
3909A5o4R5q6kJ4P3Lq5M6R6j58O8O5KQq8J38o4K7MQ9r0o4J08nq9QR1j32M5q1J5
$$ plain form
3699 31 -7 52 30 6 -30 -19 129 -29 -52 13 -3 -33 -37 82 55 -98 -26 23 -26 -77 -35 -25 -73 -11 -22 -43 -52 -96 12
3728 12 -63 -128 -122 -25 -24 -100 -2 -1 -13 -111 -10 104 -72 -72 75 30 -15 30 60 24 -35 128 120 10 86 109 82 -1 47 133
3758 133 69 16 33 104 69 59 63 50 62 3 83 53 -78 -9 27 -17 -57 -5 33 -19 -61 -34 -66 -113 -97 -5 -18 -114 -34 -22
3788 -22 -68 -81 -37 14 -36 -81 -72 -63 -128 -122 -13 -52 -52 -90 36 -64 -81 -69 -11 -60 -67 -21 -4 -65 -48 33 -7 -13 45 65 -31 39
3820 39 90 39 -25 -86 78 87 -55 41 116 52 -62 -7 -14 -16 -103 26 2 -4 -48 -3 28 -58 -46 41 34 15 57 71 31 21 79
3851 79 77 -14 23 183 37 13 77 100 64 46 28 86 1 18 35 21 -38 -30 66 26 -96 -29 40 -82 -84 -2 27 -51 -13 -37
3881 -37 24 -144 -38 -10 -24 38 -56 85 -19 25 49 80 16 -29 19 85 -9 26 75 49 -41 -8 89 -29 -34 0 47 15
3909 15 -49 46 -40 -42 -28 45 48 -37 9 105 -53 15 80 82 90 2 140 76 103 107 196 106 42 150 145 56 64 155 23 68 -13 2
3941BQ2j65J01K3m9o0K2l1mj0N4j4j08R1P9n4m3O6nj9J8R2j25M1L2J00o3l8L4
3970D9JP4j25M0J9Mn2j7J5j2l3Q8q0l0K5J20j22l9R9n8r3M5L0J5J0j10J88n0n6
3999e5q1J87r9KN5K8rk9R8p5PN4L7q6RL2k8L3j08P5k1j0n0J09j9l9k4Nl3m2NJ08
4031C6k0m3O0m1r9Q5P4k9j02N3J7k9k0P7j5l9NRJ7j8j9K6n0k8J21k5o7K6k4K4
4061c8ok4O5p8Ql8J60rj05R5J3o0L4J3K0k0l8J07n2r3N9N1n8k8RM4n8o5J37M3
4091H8j22J1M7j6q0M6J8j2m1K6J7j8r2J05K4oo7O9n9LJ10l7k3o8J46J1j17k0J15
4120E8%n0j0N6K3j31Q3j0K5n4P2k1j4k1PMr5L5P9p4l0L3P4q6m2J80j37Nn2J33
4150D0k6m9nO1n5J7K1P7r4k4Q2j3n5j4P6m7K4K3M0o3O2o4K9k5l4P8k8m4K1P2l6
$$ plain form
3941 2 84 -81 20 43 -6 -66 -44 -75 -79 -89 -35 -49 -157 -66 13 -41 -84 -18 -23 -42 -24 68 -57 -16 16 116 53 15 49
3970 49 50 124 -1 39 58 62 10 -7 8 -4 -37 51 -29 -59 -34 86 -36 -75 24 -34 -127 -82 -52 -37 -27 -137 51 1 -55
3999 -55 -136 51 -48 -46 9 37 28 -1 97 22 29 83 120 34 43 75 47 80 -28 47 26 16 -34 75 56 17 -7 -2 -35 -77 -72 36
4031 36 16 -27 33 -8 -107 -22 52 23 -79 -26 -9 -38 -58 19 4 -35 -30 -21 -4 -22 -41 -15 -65 -93 28 3 -64 -38 -62 -38
4061 -38 -44 -68 -3 -81 -73 -111 49 40 -65 30 43 -17 17 30 50 30 -8 99 47 -46 13 64 6 -22 -13 31 -27 -92 45 88
4091 88 -34 -23 24 8 -72 -26 -8 -20 -61 -35 -18 -36 -128 -23 1 -5 -72 -3 -62 -59 51 14 -9 -77 69 80 -37 -57 58
4120 58 58 8 -2 54 77 -54 29 19 44 -10 62 41 27 6 13 17 -78 -43 36 -38 -68 -35 39 -47 -89 91 -46 -41 -93 40
4150 40 14 -35 -40 21 -34 -17 4 81 -13 -37 45 32 -23 -37 39 -8 16 39 79 16 78 14 43 18 -16 62 34 -10 11 83 47
4181D7j07N8Q8p6p8J15J4n0o1Q7j3m0kO3o8o4Q2J5r6J8P4R6j34n2J30j6j19J07
4209A8Rq0l7j6J19n1l3P8pl9o4Q5L4q6j2K2N0m7K3J12n1j04K4N7o5M2j7lJ4j6
4239d1Q1q3QN6Pp2ML3%mn0N7lj3N0Rj2K2j6O6r6oJ7M1m5jQ8l6p9P0P6r0o6K9L9
4274D0Rl0L5K2q7K4K7rk2J3J0n5J5L8Nl3M1nq4k7O3P6k9o1nM7n6m9P0K1p6K0Q2
4307C0%l4ok7M3p2R3N1j17JJ7M2r6J03jl6m2J2J09q7mN5Plj07J00K8q5qQ4q2n
4339c7M0K7m6L7K1n3J6n9J16m0K2k8O7j01K1JK5m4k4N6P7q6kJK7p5N7MO5p6jJ7
4371B5l7J1Ol2m4Q7k6L4q0N6O0m8n5O7j9l4k4K2lk4QM8K7r3N5k6k4L6j7M7oom5
4404e4O0q3m6J26rn7JP7l3j6Q8o8j3J5P5J5j88K1J07N3j01k1N4j8J9O5o1m2K0
$$ plain form
4181 47 -60 -2 86 10 -68 47 61 11 -50 37 24 -16 -18 45 -23 -87 -5 10 -86 -68 6 102 -32 -84 46 30 -89 18
4209 18 27 -53 -90 -106 13 -38 -71 7 0 -39 -103 -18 16 -70 -82 -60 -10 -57 -34 78 27 -77 -53 4 -61 -19 -36 -39 -25 -41
4239 -41 40 -43 -35 21 28 -44 -40 -7 -7 -11 -61 -4 -7 -20 30 39 27 49 33 99 3 -3 14 55 10 9 97 61 -18 52 128 38 -28 1 40
4274 40 49 19 54 76 -11 13 40 31 9 22 32 -23 -8 30 35 2 43 38 -46 -73 -10 66 37 -24 -29 18 -38 -87 -17 4 -72 -52 30
4307 30 30 -4 -10 -37 6 -66 27 78 -39 -38 -21 21 -75 28 27 -9 -51 -39 70 -17 -21 34 41 38 -69 31 59 -26 -34 50 -32 -37
4339 -37 3 30 -16 21 42 -11 5 -54 62 22 44 16 83 -18 3 4 29 -15 -39 17 94 8 6 7 34 -41 16 20 85 9 8 25
4371 25 -12 -1 5 -27 -71 16 -10 24 -56 0 60 12 -43 24 5 -29 -53 -31 -34 -58 -50 -2 25 -68 -13 -39 -63 -27 -44 3 -3 -9 -54
4404 -54 6 -77 -123 3 -6 -63 -62 15 -18 -34 54 -14 -27 -12 63 78 -110 -89 18 71 -30 -51 3 -15 4 69 8 -34 -14
4433a4O0Ol4L3OOo6m1J01o0j6K5K3L9r1J01j26K2P4J9q6OM3K0k3M9r6Q7l5k5M9
4464E6k3q1P9L2r0J6m5M1qj9L0Ol1J0k0R9o9K3O5n6m2J2J1PRJ4J0p4J8R7oo7L5
4497C9L5n0k2M2nk1m0P9J3o3%Q9j34N4k4K7l1nlQ4m2l7N7j5J5j4k9K7l1%J2nk8
4530b6Q0j5L9o8R8p1l3L3N0q9rL4J8k0JJ4j6n1K8m1J4K4k0J1k1p8J41l9j01P0
4560d3RL0j0m8M7L7j15Q9L7r0J0m3R5r1K6O0qk7j3J9m4mN2O5r8K3O8p2K1K6M3
4591E1k1m1n5J82j22k0O5Mq3Q4K6oj15R9j3j9j5m3J27j54N5P5M3r4p0Q6L2q3K5
4620@llkN9mp5j0K8O6p7M9lj1Ko8M5j6l4j1O2k9n5N9M8n7k1N7P3r3M0K3p9L3Q6
4654G9j0p3l0J13j21K8nM4K8l7k5N4q9K1l9J35n9j1L0ol7j6O4n8m1J42n9L1j03
$$ plain form
4433 -14 46 52 18 51 57 63 -3 -44 57 -3 -19 6 29 68 -23 78 -48 -26 48 67 -19 -13 30 50 27 76 -20 67 32 7 56
4464 56 33 -48 31 63 -27 -11 -56 -15 -23 -42 -12 -6 -37 -27 -47 52 -17 6 71 15 -27 -15 -4 3 12 26 36 -38 -20 77 71 4 39
4497 39 74 24 2 44 39 18 -22 57 70 7 7 96 -38 16 -8 19 -12 -17 -20 64 22 -15 42 27 42 28 -1 26 -5 -5 7 2 -26
4530 -26 54 39 78 10 108 37 4 37 87 -2 -11 23 41 21 22 36 20 -31 -3 -44 -30 -6 -26 -15 -36 -114 27 -12 -113 -43
4560 -43 -34 -4 -14 -62 -15 22 -93 -4 33 -57 -47 -90 5 -86 -60 0 -8 -35 -48 -29 -73 -77 -25 40 -58 -35 33 -39 -18 8 51
4591 51 30 -11 -66 116 -6 -26 39 43 -40 44 70 64 -51 48 35 16 1 -42 85 -69 -14 61 104 10 -60 26 58 -25 0
4620 0 -3 -6 -8 51 47 -28 -38 -10 56 -21 28 25 14 16 -52 -7 -23 -57 -68 -6 -35 -90 -31 17 -40 -61 -4 69 -24 16 39 -40 -7 79
4654 79 69 -4 -34 79 -42 -14 -19 25 53 16 -9 45 -44 -23 -62 73 14 3 33 27 -10 -26 38 -20 -61 81 22 53 -50
4683e0N7JJ2k5M2Op8J14m6LKpN9k5q7J21k7j11O9O2j06O1mlm5k2OM1m4RQ3l1l5
4716Bl6L7j5K3k4R9m9j25N1K1k3k2K9M0n2K5L5j0n4j2Q5l4l8K3P5o4m5J11n8o0
4746f5L4L1L8o1j3P2K4m2kL0o7N6m2K0k5k9R6k6j8l0K8J6m5P4M2j09rP1rl3l6
4777b9M3pk3lJ9m0m5J14Kl1k2J01p6OM8n0J2l1J3L2m1q2J25qk9j7L6nK1k2P4Q
4809I3r4j0K1nl1Q6p7L8o9OoL9j6J6p0P4L0L3j20M4k0N1m2o9J50n4j02J10Kl9
4839c1l6J26o1j1L7l3M5r6J20Qo9r6J01M0n6LJ3RrJ0j9Pk5O4l8N5%l4J1l8K0L
4871B0j1j5j4L4Lk2L0R6n5m8k3O5o0nk0k1O7m3L2o9KM1L1n6L1j4N8mj18J53p5
4902a0l7l8R7j7n5L6pK7p0Q9J7o5j7M9K8L7o6O2k1o9N0j7l3K5m9J06p9j07J15
$$ plain form
4683 -50 7 8 20 -5 37 43 -35 79 33 36 38 31 90 65 -22 99 72 -39 30 92 -14 47 43 40 -5 -27 -21 20 -24 -15 68 37 2
4716 2 -34 3 -12 11 -13 86 37 -88 -37 -16 -39 -61 -32 8 -44 -19 16 6 -48 -60 25 -9 -47 -24 51 -13 -58 53 -5 -65
4746 -65 -31 0 38 -23 -36 36 60 18 16 46 -21 35 -7 13 -12 -41 55 29 11 -19 9 25 -20 54 96 -13 -22 49 40 7 -29
4777 -29 14 7 -16 -19 0 -40 -85 29 31 0 -22 79 3 9 57 7 19 -12 1 33 -8 -90 35 27 -2 -19 17 12 33 11 85 93
4809 93 -1 -11 10 5 -26 60 -17 21 -48 -42 -48 -9 -25 -9 -79 -5 25 58 -62 -18 -38 13 -29 -98 52 -2 -104 6 8 -31
4839 -31 -67 59 -2 -13 24 -9 36 -60 60 68 -1 -97 4 44 -12 -9 4 13 4 14 -5 2 -23 41 3 58 58 24 35 -3 17 20
4871 20 9 -6 -20 14 17 -5 25 121 66 18 -5 60 0 -5 -25 -46 21 -22 10 -59 -57 -16 15 -41 -10 -24 34 30 -88 65 -10
4902 -10 -47 -85 12 -5 -60 -24 -31 -4 -74 15 32 -33 -50 -1 27 64 -2 60 39 -30 20 3 -30 -5 -54 52 -27 -134 -19
4931a9J3qk3O0p4L0O6l2l4K3Q6j02rJ2P4k6o2O8l3M0o8O9Mj21N7O9m3L1n1k5M
4962b4k4k6J22q5K4J5jj8N8j7m6O1p7L4N9j28J5L4oLm6N1M1j9ok5J5l0M3M1Ok9
4994A5N8k9j00J58j21N2k1K1Rl7J3Mkr7J13m5J4l3L3J1o0j4J23o3q3M6J04p7o5
5023g3Q4nn2L9QK9J8m1K6m0jLN3m1j9K1L8j3l0O9L4j02K3PJ6m5k8O8l0m0N3qj7
5056Do4R8l2p7Q1J2o5rL4N9j37Q4k2L0o8K3L2j3l5Oj1R1l8J4K5j00L1J12p7p5
5086h7J53l3n9l7P1k5N4j7MK1pm7O0o2M8L6n5k1p9J11N6j27L2P1k4p1mQ6j9o6
5116c7J4N2Ln9J2P9r4K8K3j2mm8M3k9k7J00J2l8m0M0plj30J78p3L1l5K5mm8M7
5147aJL1j13R7N0o8L5l6qjM3k3rj5PM1l4l8J2K2L6p2N7j3j6J1N3p5n3P7O6o4k9
$$ plain form
4931 -19 -6 -14 -37 23 -51 -21 45 13 -21 2 88 -14 -23 -11 63 37 -25 43 10 50 -18 51 55 -66 -9 60 17 48 -3 -28 -24
4962 -24 -48 -74 48 -37 -13 2 1 -17 41 24 -22 39 -38 -4 55 -73 -58 -24 -30 -27 -73 -22 19 0 -6 -31 -16 -46 -3 38 44 15
4994 15 73 44 -56 102 -19 33 12 33 42 5 18 22 20 -77 36 -9 5 -28 5 16 -44 -58 65 2 -81 -35 69 -8 -73
5023 -73 11 6 -46 -7 1 30 48 7 33 -7 -8 -5 48 7 -12 9 47 34 4 73 107 5 28 35 51 6 -22 46 16 -24 29 21 4
5056 4 -60 38 6 -71 10 22 -43 -52 -18 41 -96 -12 -34 -4 -72 -49 -17 -30 -65 -59 -70 21 -17 -3 22 -78 -47 65 -12 -87
5086 -87 66 33 -26 -63 8 -17 37 20 24 45 38 -9 51 -11 37 73 18 -3 -82 29 85 -42 -10 61 37 -34 -38 48 29 -37
5116 -37 -23 29 32 -27 -15 64 -30 -2 21 9 5 -43 0 -29 -56 44 56 18 -22 18 11 8 -122 56 -17 14 -21 4 0 -48 -1
5147 -1 0 31 -82 15 65 -3 32 -4 -12 -13 30 7 -2 -17 -10 31 -3 -41 -29 -7 29 -43 14 1 -15 -4 49 -26 -79 -2 64 0 -29
5180b9O5m5pn4J30m0l4n1J66j14K6N1p9L4r0J12n0pj4M3Om4L9MrJ2M3Jm3k7P3
5211F8Oj07j7J06o0n2O9N4q6QlL4r2K4L5ln5R7k7n1O3k3j3N7o4L7N5o8L4m1N8
5242D3l9m3R6l7o0PL1K4pN1n5o4O6P7q8Kn0J08J6r4K4n0M0o1K9M6k2m8N3J9q3
5273f9K2L2L7q8J03ln3K5o2R5p9M9k5N5l4J6m3N4l0O7j5q3Q6j9N1j23MO7k4%j9
5304fK4n9J1J19p6qj7O6j6q9MJ19j09j3J1K2K0q9L0J9J6k7P5n1MK5J8m3M5j4l3
5335b2%q2P5L5p4L9K7JON0j0n2L1L3j5q4K1K5km4O0M%Mk4K7L1l8L5m5M1p0R5l7
5369D1p4k4L8O0l8k5N7l6J8k1K5k1k2M4k4m3K0J2lk8P3lp8O7J5n8R0j03K7J6m3
5400d1P3L7k6o3O5k1k3K8km0qj1N2j4l6o4R9LqL3p0J1Rpk1L2l2L8nm9O8l2n8m
$$ plain form
5180 -29 36 -9 -16 -70 60 20 -14 -65 101 -13 13 64 -15 19 -71 41 -9 -16 -30 13 19 -25 14 18 9 21 64 65 22 -5 68
5211 68 74 -33 -50 56 -4 -56 13 67 -19 -11 -14 20 -72 -48 -13 -16 -71 26 -1 -52 11 -12 -25 32 -32 5 60 -8 26 -15 43
5242 43 4 -39 57 20 -40 -33 -2 22 15 66 11 -53 13 90 2 4 -46 62 78 -16 8 -42 -2 -63 -34 12 -10 -58 -5 14 -69
5273 -69 -47 -15 22 -66 37 34 -19 6 -56 39 -40 9 -16 39 5 21 -22 32 2 69 54 -29 57 38 89 -34 -30 37 13 13 -6
5304 -6 18 -41 -30 89 13 5 -12 54 38 -51 -47 72 -37 -50 -39 -17 3 -86 -56 -37 -21 -48 27 -24 -20 5 23 -20 25 11 -22
5335 -22 -22 -104 -29 6 -68 -29 -2 -1 5 55 45 -7 24 57 42 -42 -21 4 2 -42 18 22 22 26 2 29 60 22 57 12 53 -17 78 41
5369 41 -33 -57 -19 41 3 -22 35 -1 17 -4 21 0 -22 22 -2 -45 -25 -13 -16 -44 29 26 -52 15 30 -28 62 -41 -14 2 -41
5400 -41 32 69 43 -20 45 24 1 29 27 -13 -21 -32 20 6 -30 -94 5 8 0 33 -37 -26 -17 -24 -45 -13 -45 -7 -12 -61 7 -25 -83 -87
5434h7K3O3k3J6K3J2r8K5P1k7m7LJ05j00R6r4J14o5l0M8lJ7k2M1j9o7K4P0o0K6
5464C5l9M0p1J1N2j6j00O7L2j4kl4L0K0m5k1N9Ql2pN5r1N5Ol8R2o3L8n6M7mk8
5496a4ll1P3l3mL7q9K4LK5Ok6j6K4J6NpK7L0r4N9P9j09k2J8L3p1P1k1o2J17J2
5528E7l8kn6J4P0o0J4Kj0N4j0j4rK6k2Mjl6L0N1l9k9K5l6MjKj9j6K7k7Q9o1L9
5562B2Ko3R7p1N5q1K5k4oj2P6K4J9r9P6jl9J5l0%j4M7K6o4j9J9R9j30J4K6j8Q
5594b1M8n6L0J3mJ8j10Q0K1J4p2M8m1J8o4N3P5n6ONj8l0L3L6j8MJ7Lk2OK9n6N2
5627D1n7QJ0%J3k2Pj6l8J25p9J6l6N6or3N4M5o9M5K7o0J1m6J46j05JK2K9j6o0
5658d7N0J7k3k4nK6q6J32Rn0p0O9Nm4J6J7Q4j05J1M3j9r6M8L6N9j32M1K1k2K4
$$ plain form
5434 -87 -64 -1 -24 -8 15 27 -71 -46 25 -2 -49 -46 59 -41 55 -39 75 10 -20 28 25 42 20 61 42 -25 -1 69 9 35
5464 35 -4 36 -35 -24 28 12 -88 -21 11 -3 -5 -39 -9 11 -34 -55 4 12 -20 -27 28 -63 -8 -2 -40 52 -11 27 -29 18 14 -14
5496 -14 -17 -48 25 -8 -12 25 -64 -40 -37 -12 -6 -32 -48 -24 -8 -3 -10 17 47 -47 12 91 -18 -40 -22 11 -60 11 -10 -72 45 57
5528 57 19 17 -39 -25 45 -15 -1 1 -9 45 35 21 12 38 16 20 19 -17 13 64 25 -4 21 -15 -11 -12 -10 -29 -45 -18 -45 44 -17 22
5562 22 24 -39 58 -13 42 -39 -14 -38 -44 -56 20 44 63 -36 40 39 0 15 -15 -15 -29 18 44 -20 -39 -20 79 -51 -37 -11 -29 -21
5594 -21 27 -29 1 14 10 28 -82 -2 19 33 -39 9 -32 -14 -78 -25 50 -6 0 5 -13 -43 -10 26 8 12 29 32 10 16 45 -11 41
5627 41 -16 -8 2 2 15 -7 0 -16 -54 71 -8 8 -28 28 22 -71 -17 28 -41 4 31 -29 -18 -64 82 -23 -22 0 29 13 -47
5658 -47 3 20 -3 -27 -32 -6 -92 40 49 -1 -71 -2 3 -41 -25 -8 76 -29 -18 25 6 -90 -42 -6 53 -79 -38 -17 -39 -15
5688a5kL3j5L1j2m4K3l7J9O7l8j1K6n9J08o3L1Op7N5M7J8j12m4J18m7l2m8L9M8
5718A3kl5m0O7n1J9J1L8pj5j6l7j6R8k2k7J0Q6n4J4j5L6j3K9n9j8PK4m6M2m3l0
5750e2M5J2Kln2j7J14pn5k9O2r9O0L4o7K2NN1k5k2M5k4l5R3J8l6j8m3K2L5n8M5
5782B3P2l9m3KM6j21Q6J3n1M1k9l8N6n6Q8p5k0jQ1%r6k2Q9Nj9J6jM9k5nkM5j13
5815d4J8K9n8P7M1p8MK2J8l0K6Qm6K0k6L0j7o4O4rO3o1L0J8j7j1n2R0o4j1L1l0
5847b9n2OO6N0l9l4j7O1J6l9k0l2k6J25j4o7L9j3Ok%j8L1l7Q2%l9J3N9q0j9O3
5879D0m5K3nM0k4JkMk3jj1N3n6qK3K0l7l4L9qj1l4O1j5L1k2lj0PQJ7j4o2L9Q0
5914F1m3n6k6K5N1k9k8L2m3P4J2n5K2Q2p7l6P1K6m8j2m0P9j6j07P0k6J8l4O9P
$$ plain form
5688 -15 -17 16 1 32 20 -24 -1 -38 -19 48 10 -1 25 -34 74 11 42 48 -29 26 73 91 -21 -65 53 6 -26 -74 -35 13
5718 13 11 -24 -64 3 -48 -29 -18 20 13 -2 -18 -55 -71 27 5 -22 -12 74 20 34 19 55 42 71 12 -6 1 25 -21 21 -22 -52
5750 -52 -7 5 7 4 -48 -65 49 42 -13 -42 20 -79 -19 15 -52 -30 -25 26 1 -21 24 0 -35 58 76 40 22 -21 1 36 -22 23
5782 23 95 56 13 15 61 -60 26 39 -12 29 0 -38 18 -38 50 -25 -45 -46 35 35 -61 -83 6 11 -8 8 7 56 31 26 24 69 -44
5815 -44 -26 3 -55 22 63 -15 -11 11 29 -1 25 33 -13 7 -19 11 -6 -70 -6 -15 48 -13 17 35 18 7 -45 45 -19 -30 1 -29
5847 -29 -81 -75 -9 41 2 -32 -49 12 28 -11 -31 -63 -89 36 22 -45 -6 -19 -13 -15 -15 -33 -2 -39 43 43 4 17 76 -4 -23 40
5879 40 -5 18 13 53 29 30 28 32 9 8 -3 50 -6 -14 9 29 -8 -42 -3 -11 -22 -56 5 -10 21 -1 -4 -14 -7 1 18 4 -58 -19 61
5914 61 18 -38 -64 -39 12 -17 -45 -13 -56 18 30 -25 -3 79 2 -34 37 63 15 3 -37 42 26 -81 -11 -37 -19 -53 16 23
5944B3k0m2Q3r3J7J12j13O5K2o6j4P7l6JO3o3m8K7Pn4rN9J3ok0j9J2K0p7J16o6
5975b9M3O3m3p3J33r8k1M2ok2PMK0k1l4N2j6k0N%J2j8l6M8L4o1lN5k3J2n4P2m1
6008a7o9J07l4J8p0N6j3k5K6L1j3K4j3l0N6p0Q9jo4M0j4K0o2O2m2M6n7K4J8Qk2
6039IoRPo7N0n5R5l7K1m3QO4n4m5N2P1o9rj4M1k7M4m0k2M6lPJ6m1K6J9q2M9l4
6073a4jj0M0JM0l3o7%N5j3KJ1K8n8J2o3J34q5oO2n4l0L0Lj7J2o6J19q9nM7K6l8
6106b7j1M2L1jl1N9q9oK1L2N7j4j12M8k1N5j5n9RO1mk9J4N0o5M1o6kl7N1J8K5
6138B5L6o4J05q8j0n7M4N5l5LL1j4r4J9N4N3p1l1O1o2M2Qok9M6k2L9j19J06p1
6168d6Q4n1L3k6pJ9K1j6n5j0P6j5Qj0K6m5J0m8N0k8J7RL3m5Pr3J50J0n4Nr9M3
$$ plain form
5944 23 3 -39 44 -49 -32 80 -33 32 54 -12 -26 51 15 16 79 16 -32 -5 2 -52 -61 -2 11 5 -15 -34 -22 -2 -79 37 -29
5975 -29 14 77 34 -39 94 -4 -25 17 11 -11 -4 0 20 -1 -35 17 1 -19 -14 -14 -2 -20 -56 -8 26 -35 -38 17 -6 6 -48 24 -17
6008 -17 -86 21 -13 5 -65 -9 -22 -47 -21 10 -3 21 8 -22 34 -36 53 52 -12 28 14 34 -28 34 -8 38 -19 5 23 31 9
6039 9 3 12 19 -48 2 -53 42 5 26 -17 -9 55 1 -44 8 79 10 1 -13 28 1 45 5 -17 29 26 33 49 8 34 53 -29 20 -14
6073 -14 -15 -25 15 16 56 23 -44 -44 11 -2 0 11 39 -19 -7 -70 64 -21 -27 35 -19 -49 -19 -16 -33 -21 -87 32 -57 -62 -15 11 -27
6106 -27 -38 4 35 34 3 62 -27 -33 -12 20 77 63 -49 -1 -22 33 18 -41 -32 29 25 -4 10 60 -5 36 -30 -32 -69 -18 0 25
6138 25 61 -3 102 14 4 -53 -9 46 11 14 45 31 -63 -44 10 63 -8 -39 22 -40 2 10 4 -25 21 -1 38 -81 25 -46
6168 -46 38 -13 20 -6 -13 6 27 11 -44 -54 22 7 15 5 31 -14 -4 -52 -2 -30 -13 -4 29 -16 -9 -102 48 58 4 9 -90 -47
6200d7Q6m2n7K1K9NL0m1J1Q6q3m6P3J6rNk0pkM9q6OQ3p3M3j6Q3q1k3OK4l7O5q5
6234c4J06n6n1K4j8M7mjm0%l6R8n3j2mj6M6lk8k5N4L2l0J3NJm6N6PkL1p8Pj4M5
6269B1pm0n2L7jK5O7k2k2l1P0q2l5R1MK7r4O1M2r7J4M0m3NL9m5J9M9l6K4j0M8
6301F6o5KPqM8r6K5PM6q0L9N5o4L0NJ9l0n2R3Nn4l8J7J5j8J1J7j3o0l1O0k1O2
6334ak0N4l7PLM1n0k9L1M0o0K7L9j6r6L2J5j0K1lm6M9k7M2mPk5K4j1rK3l1M1k5
6368dO4o7j8k9J01j3o1M6J5q9kQ5k0n3M3j2K6o5O5J7K7p2l5J19Qo9j5Q6o3m9L
6399c1J8M9l6nj7J2K1L9n7L7j2J4Lm2J0k1L7L8p2N7j13Q8J8o1K4O9K8j27j1M1
6429bQrK6k7m5jJ16r1N8j06O2k5%M2o1P8mjK2j9K4l4L4n8mj9P5j27J18J0k5j01
$$ plain form
6200 -47 39 -3 -60 -39 -10 -5 25 -16 -5 81 -2 -48 25 41 32 37 17 10 8 57 -29 -23 60 -13 30 14 97 16 -7 -1 23 -14 51 -34
6234 -34 72 16 -35 -11 -29 18 14 13 -27 -27 -63 35 -18 -30 -34 -50 -4 -7 -35 -60 -6 26 -4 9 14 15 -31 25 32 30 61 -17 -10 -24 21
6269 21 14 -26 -78 -41 -42 -17 50 28 6 -25 45 -37 -72 19 23 50 -44 17 59 -38 -24 16 -27 -22 17 -28 -9 40 4 28 18 66
6301 66 1 3 10 2 50 -46 -21 -14 32 -48 -9 46 -18 12 17 36 6 -46 47 52 -2 -40 -23 -8 -26 -15 2 -11 -71 -102 -42 -63 -1
6334 -1 -21 33 -4 3 6 47 -3 -32 -1 39 -21 6 45 29 -67 -35 -20 -30 -9 -12 -58 -9 -36 6 2 9 -16 8 -3 -12 11 -20 21 -4
6368 -4 60 -7 -25 -54 47 34 -27 19 34 -55 -57 28 8 -45 -2 -14 12 -53 12 29 56 -16 -51 68 76 7 -8 78 15 -34 -31
6399 -31 -13 36 0 -5 -22 -10 11 50 -7 30 18 32 35 -7 3 -18 19 57 -15 42 -71 17 35 -26 -2 67 95 -32 -43 -2
6429 -2 6 -3 23 -4 -49 -50 66 -25 33 -73 -11 -36 -36 6 -55 23 19 18 40 21 45 11 45 -13 -17 -36 39 -88 30 40 15 -86
6461h6O4N3j6J2m1N4Rn8M5l9j7M6K5ql9n0M9L6o4J01Oj27R6k0l4OJ8opRk4N1r3
6494d9Q7M6m8k4k8N5l5ro1J04k7j4KL5n0J2j8l1l0R8p5N5l0O2n3ojj5L7l7K9%
6526a9K9l1j2K4J3k2k7J07m7l4j8MK3p7J07p8L0N7m6M1K6m9O1k7o6N8ll3k4J02
6556F9m6m1P2J1j11Q9k0o5M0qkQm0KP4m8M2k7j1l2N6k4MJ9o7J06l7j8L6k0m7L0
6588fnkmP2m3K1Pl0j0PPj8N6r4jJ02mq3L6Oj2k6ONJ8Pp3M7L3k3J5J2q6M5pL6k7
6625a6K2K0M2p9M8n1P3j06J4L9J9K3q0P2n6M2L8l8p1R2j03N8j0k1Q2n0ro4m2J03
6655iJ03p2qJ4N0m7qm5M0k4PPlK1n9J6K7Nk9jnN0J2l6mj7O8po7Kj3M1j5%j4qL3
6692Ek8K7k8Q6m4M0m7m3J5O4l5j7M4m4%o2O1k0O6m3pL6n2KP0j4n8O7lo3j1K4O3
$$ plain form
6461 -86 -22 31 15 27 -14 40 49 -9 36 -3 -20 26 51 43 4 -46 3 39 -25 76 82 -45 51 31 -3 3 21 15 8 17 -7 44 -49
6494 -49 38 84 36 12 -16 39 4 -5 -66 38 11 -3 -1 34 -16 -4 -22 -53 -83 15 -60 -5 -35 27 -26 -32 -33 -48 -11 -48 -19 -19
6526 -19 10 -21 -33 -9 4 -18 -45 62 15 -19 -37 -33 -10 -87 20 -58 -28 29 -17 24 50 1 62 35 -31 27 24 -9 -33 69
6556 69 23 -18 54 65 -46 43 23 -42 -2 -10 -12 -4 -44 -42 32 -16 26 -1 -12 -44 12 -12 -8 11 -56 50 13 -5 31 11 -36 -6
6588 -6 -11 -13 -17 55 12 33 40 10 0 7 14 -4 52 -42 -43 59 55 -28 8 14 2 -24 -18 -13 5 12 -61 -14 19 -4 11 23 -63 -18 -25 11 -16
6625 -16 6 26 68 -11 37 -14 59 -47 -33 6 25 48 -32 40 -16 26 64 26 -45 47 -56 2 -8 -29 53 3 -6 -70 -112 -9
6655 -9 94 22 14 28 78 31 23 -22 18 -6 1 8 5 26 -33 -17 10 15 -14 -15 -20 30 42 6 2 -15 53 46 -21 -19 -32 9 -6 -6 -20 -28 5
6692 5 -23 4 -24 62 18 58 11 -32 -17 47 12 -5 39 -5 -5 -67 -6 -26 40 -3 -10 26 -26 -24 46 32 -26 41 38 -25 -36 -12 51
6725E1q0MM7k3LP7p0j8NQ1L4j31J6Oj3j5L2K4K1l5k8N3o0K7J1RM6j34J16n2K1
6756B5K8n7Q5j4n5m3k6O5mN9n7L2k2l7k7RJ01j14L8j1M9l6M0l5n2K3O9k9k6NL0
6787A3k2Mj0l4N2l5K2J3k3jn4P8O0j45K0Q5l8LoM2J5l5OJ1n9J13n1m6J3pmj1J1
6820b0K1J3JL9l3m1J7lK4l0JK5M6l4n0J07l7k9p8M5M5j5J9K0l8L8K9j16K5j4J0
6851a3rL4MM7j01K6j4ol1L9N2k2qM3n4O0p2k9J22p3l8O4qK0j8LO5j37J14q4j2
6882c6rQ8m4K4m0Ro1Q7j9kj5j7M7n9M4k7Q8n3kl7L4j4K2o5J24r6L0k9N2J4L8o4
6914A2J9m3K7L4j8q6N4K7p6KN9j8%k0R6n3M8r8m9J25j00N4jkk2O0Mn2mJO0n1K5
6947A4mM5o5J6K3J4q2O7lMl0k4J7L7m6K2j8RMjQj9Q2l9M4n9n0L9k5J6M9k9o3R3
$$ plain form
6725 51 -29 -25 22 -1 2 79 9 -9 -4 77 111 -20 -4 2 -11 -26 6 30 51 16 -12 41 -19 8 19 28 74 -60 56 4 25
6756 25 53 -4 81 67 12 -31 -57 8 4 63 6 38 16 -21 -48 -39 62 -52 -14 -25 24 -12 28 -7 -59 -36 33 4 -22 -17 13
6787 13 -9 -5 -15 -49 3 -32 -10 3 -20 -21 -75 3 63 -82 -62 23 -15 -12 -18 24 39 4 10 21 -38 75 24 -22 -9 -16 -20 -31 -20
6820 -20 1 14 15 54 21 -20 -3 -6 18 -12 -11 14 60 26 -24 83 46 17 -61 -16 29 14 33 53 15 53 82 -34 -9 -23 -13
6851 -13 -22 12 16 63 -38 -12 -26 -32 -63 -24 28 6 -2 41 -13 47 -25 -54 68 -5 -43 21 13 33 15 18 83 -54 60 -24 -36
6882 -36 -45 43 -1 23 -17 -8 -69 18 -1 -3 -18 -35 12 -47 -3 -30 58 5 3 -34 0 -14 8 -57 67 -29 1 -28 24 38 76 12
6914 12 31 -12 15 49 31 -55 -1 26 -50 -48 11 -7 -7 -27 69 16 64 -34 -83 42 -58 -4 -5 -7 -29 31 35 -17 -21 -20 40 -11 14
6947 14 10 55 -10 6 29 43 -39 28 25 29 -1 -25 -8 29 -17 5 -13 -4 0 -1 7 -12 70 31 75 16 -34 5 -20 -4 45 16 -47 46
6981D6j11J17k0J7n4L9m8L2m3Q7l8Lq3J2MM8kl8K8M2r3K0J27o6O5j00n1J58r7
7010AOJ0k1P9m0m4N4m7k1M0m6L0K3K7q4N5j8LK2j8K4o7JN1L2p2M8m3L2j1oP9p1
7043Hl9K2J9op4J21r6L5j2K8j7L2k1lP9j03M2k3k6J9J8n4O8J0l9l4K3L3J0p0N6
7074Fk6L8l1Qm3L7L3m0l6N8o3M1N8k3k2L4qk3LQK8n8L9L7K0p3K6J6j7K3o4N6m2
7107@j5k4K4Nl9j1J08o4O6o1NO6o3JMq9J48m3Lk6N1o0K5L4j7p2N9k9pL0k2K0j9
7140a2M7j16N7Pj5%K3n3J18p7lJ2L1ml4J2J7o5pK9Q1j06oM4Q0l7%%m4J3Jk7N0
7173A6lk6QM7j7k5N1n1N3j2l6j3k8O8J8m9L1K3o1jJ9rl9%O2r1M2K0NJ8p7Q6MK7
7207F0j03J8l8QK3l9J4L4mP8oq1K8l3J12j04K3k1O3j9m2O4l2N9q3K9nN8m7J2p
$$ plain form
6981 46 -65 52 32 49 -5 34 -14 18 -25 62 24 27 -56 -44 -40 8 6 -32 -4 38 -55 -35 92 26 91 -9 -60 98 1
7010 1 7 17 -4 75 35 -9 45 -2 -23 17 -29 1 24 51 -33 22 4 7 29 11 35 -32 -31 20 52 -20 28 -15 17 6 0 79 8
7043 8 -31 -9 10 4 -70 51 -45 -10 -22 6 -11 21 0 -3 76 -27 15 -8 -34 -15 3 -51 17 27 -12 -46 -23 10 20 -50 6
7074 6 -20 18 -13 -5 -48 -11 22 -18 -54 4 -59 -18 40 17 -5 29 21 -2 1 9 37 -21 18 55 75 2 28 44 27 50 -14 42 0
7107 0 -15 -39 -15 -10 -49 -60 48 -16 50 -11 -6 60 -3 -2 2 -87 61 18 21 -5 46 -14 11 45 28 -44 15 -14 -21 9 -13 7 -12
7140 -12 35 -81 -24 -17 -32 -32 -9 -62 56 -21 -24 -12 19 15 -19 -7 10 -55 -62 -33 48 -58 -64 -20 60 23 23 23 -21 -8 -7 -34 16
7173 16 13 -13 -5 42 25 0 51 0 53 41 5 -8 -36 32 50 1 32 55 -6 -7 12 3 -36 -36 26 -65 -23 -3 2 20 -57 29 33 60
7207 60 -43 -25 -63 -55 -32 -71 -57 -23 -27 51 45 -36 -8 -41 71 -33 -10 -31 32 13 -29 35 3 62 -21 8 3 61 14 26 19
7238A9J8m2M0L4r2O7p7Q3Kj9n0L4k2m4J4J1PL1l9K6j9k8L9Lk5R9j32J07K1j08
7268d2N7k3jrm5L8QLN6l8k6k3N1Pj1oNK7L4L1o4J7q1Q4l4m1M7j4Nl1M7j3m9K7
7302gJ1Kl2O0%r1M4N2l5l2l6Q5o1M5j1j6N1Nm5OoJ2L1m7K3Mm2K2M7k8M5p6j4O5
7336C1mK7k7k1L9J6o9L9l1M5m6mQrJ7m0N8p5Q5l8%k6L1jRl7M1k0%P1%l0l2n2R9
7371E4j20P9K4j9rk7pJ0k2Oo4J16L6p5J04j45O2j8K4k5k7R5l2J3j8M3pj6j5n5
7401c5N3m3O9l9l6Q2m9N1n8QL1L3l4Lo6J02j31P8k3JO5j07N7K7k4j4OM6l5N7n3
7432B2j8m4oO6M7j8n8J7j5K4J9%l6jK9K6n0k2j6Q8m9l4m8R5k6JK7L9o0N5q9L6
7464Aq6K7M9K8K6jp3N9o3l7K6O3n3R3o5j0l2O7j2m1J1J7l3O6L4j49J30o4P5j9
$$ plain form
7238 19 37 -5 35 69 -23 44 -33 50 52 33 -17 17 -5 -49 -35 -24 -17 14 -25 1 -18 -46 -7 -4 -29 70 -62 45 66 -42
7268 -42 15 -8 -9 -18 -63 -25 -17 -14 42 4 -22 -45 6 13 2 -4 1 28 62 93 29 46 -35 49 15 -26 21 7 12 -19 28 15 -34 -7
7302 -7 4 6 -26 34 34 -57 -13 39 4 -28 -64 21 -40 5 -6 -22 29 34 -11 -5 -11 1 32 -15 8 12 -30 -8 39 11 56 -20 -34 31
7336 31 27 54 27 6 45 61 -8 31 0 45 -1 -5 3 -6 11 -29 29 -46 39 1 1 -25 6 5 14 -23 18 -2 -2 69 69 39 7 -45 54
7371 54 -66 13 37 18 9 -18 -25 -15 -37 -31 -95 21 57 -18 86 -59 3 -15 9 -16 -43 52 20 33 15 58 51 35 20 -35
7401 -35 18 -25 44 5 -31 51 2 53 -5 3 34 67 33 36 -30 72 -59 19 -4 -3 62 -45 12 39 15 1 7 53 18 75 22
7432 22 4 -40 -46 20 67 49 -9 8 -7 17 36 36 0 -1 28 54 4 -18 -34 54 5 -29 -77 18 -8 -7 20 59 -1 54 -35 1
7464 1 -85 -58 -9 19 45 44 -29 30 -33 -70 -44 19 -34 59 -6 -16 -48 19 7 -34 -23 -6 -39 27 61 -88 42 -22 53 34
7494C4RKPo9L0M5l6P4p1k2J9k3M1j3K6m6J1p2OP2n0N6nL3n7N3m7j3oMN1k6q2M3
7528b2L4Q1q9k0JM9k8Ol5L1L0k6n1j4J9QN4K1Rj32Q5N0o3J2J5k8m6NL4n0Q0o8
7560d8Q4J5l2n6Qj2k4R0n4Kj4pQ8o8K1M0o1R4r0J9k2k9L2JL2j2o2J27q1M1K8m4
7592FK2j5kLJ1k5L6m0kL6k3o2R7Qk9o8L5L1PK9r5P8m9o4J12l4Nj2O4k3j8j2pJ6
7626A6n2L0P7j64J30p3J4j3m9O8Jl5M6J4J1m5R7p5j9O2q5R7m0L7q0jL8PL9l1l
7657A9m7qN8q3Q0l1N4j1L0Jn7M1Qj17K7M5RML0k6r9P3J6RL6r4L3mml7Q2r5Q2J9
7691D3kl8p4Q0n5L3j3R5j08N8K2k6o3N2l4JN1k3qO1r2J4K2N6p1J7O1n8O0r0K8
7722aol8P4k9L1l7m9P2RlMj4m7M7J7Oo8lP7p5o0J14J0J6j6jn0j8rP6o7KK1K6j0
$$ plain form
7494 34 43 45 52 -17 13 58 22 96 25 3 22 -1 40 27 53 7 18 -54 -48 24 -26 30 25 58 1 54 7 -6 -12 -8 43 17 -65 -22
7528 -22 12 93 4 -16 -15 34 6 12 -23 8 38 12 -39 -53 -34 -26 28 49 58 -74 11 61 -2 10 25 -3 -49 -44 -10 -60 20 -48
7560 -48 36 51 19 -37 -29 -41 -65 25 -29 -27 -41 -48 40 -28 -7 33 -28 66 -24 -5 -27 -56 -24 -23 9 -3 -65 62 -19 22 50 6
7592 6 28 13 11 14 25 0 36 -4 -6 30 7 -55 42 50 21 -47 -12 19 26 55 -40 38 -11 -75 37 3 8 -4 60 37 19 7 0 16
7626 16 -36 -6 71 -93 37 -36 -22 -35 -84 -16 -15 -50 -4 10 21 -24 73 -2 -21 41 -44 53 13 50 -30 -31 7 14 53 22 19
7657 19 -28 -36 22 -61 19 -12 42 31 61 62 5 46 54 -63 -36 9 18 22 52 26 -73 0 16 25 61 -33 0 -4 -8 -45 37 -58 24 43
7691 43 41 3 -71 9 -46 -13 -26 69 -39 19 41 15 -48 4 -30 -29 22 -1 -9 52 -40 -26 -4 52 -19 -2 59 1 61 -29 -1
7722 -1 -7 -45 29 0 31 -6 -55 17 26 23 27 13 -34 13 30 36 -32 -35 42 -33 -93 21 31 47 31 30 -20 -38 -47 29 -38 -36 -15 11 1
7757ARJ0m0lQ5l4k9o8R5j3J6N1r2K2M2q6K8j%N5K1j08L0O2n0l6jP1q0K0O1K6n4
7790A0p8J25m2k9K5K3K1q7N6m4N1q0L4J9O3m5K3j2n1pNJ3K8k1M8k6j7m3MO8q8
7821e4R2L1r0k3R8p9o4O0O7o1O9j5K4n0L3l3L0qm7J01l6k7J7q8O4l2L1Q6o1l0
7851EN2o5J3j8J0PON6j37R1pKjqo0R9M8j19K9j6J4Kn0P6K2q5M4J7n3l0O7l4N6
7884C3n2j8R1n2lk2L3o9J08j7m8oj7j1R1j02J7qj4J01q1M7K5m4j7k3M8M0pl8l2
7915d7O4Qj20R2L0J0mJM3o0k1L0m0N2L1m7N8j33Q2j2%k9J5K3k4M3n5pj4L4K3q3
7947e7M7j0R9j41pJ6K0N1j7J9l7oK5J5l2k0O7J8o3J0O4q6N3J5l8O7j10P5K9o9
7977cl5J04o0j5L2n5P4k7q8M8L0k3L5o0P5m8j8JO9m2L8m3m9J0J02p4K3n8J4J3
$$ plain form
7757 1 10 20 -20 -23 62 28 -1 -69 26 13 29 80 -12 10 52 -34 -6 -7 -7 48 69 -39 -9 53 3 -33 -34 37 -43 -23 38 64 10
7790 10 -68 57 15 -14 11 34 55 -32 24 -20 31 -49 -15 4 67 22 45 33 -18 -25 -20 -7 21 0 48 22 5 -38 -34 34 -54
7821 -54 38 69 -21 -44 54 -25 -89 -29 38 -23 46 31 55 5 38 5 35 27 -20 81 45 18 35 -53 11 -21 10 96 35 5
7851 5 57 -8 5 -13 -3 4 10 66 -71 20 13 15 14 6 -54 45 93 -26 3 -13 1 3 -47 29 51 -34 10 27 -26 -56 11 -23 33
7884 33 -19 -37 54 2 -1 -23 10 -59 49 32 -16 -22 -39 -50 41 -61 -44 -52 -66 35 -46 1 26 -18 -35 -58 -10 30 23 -15 -47
7915 -47 17 25 -95 -3 27 37 33 34 77 17 -4 26 -14 38 69 22 80 -53 29 17 17 -12 3 26 2 45 -10 -17 -31 3 26 -57
7947 -57 -10 -20 79 -62 -69 -53 -33 18 1 20 -17 -23 2 17 -15 -35 32 50 -13 -3 61 -25 28 43 5 72 -38 37 66 -3
7977 -3 -38 66 6 -9 23 -32 42 15 -73 -25 5 -18 17 -43 32 -16 -34 -33 36 -6 32 -11 -60 -50 52 -22 1 -57 -43 -30
8007c0L7Jp5P9p4J10m3L8n3jj2Q6p9kPoL1J5q5P1m2O5l5rRl5j0J5J6M1k1j6K9
8040B2o2L8kN0r9N8M3j5q8J1K9J8l3N5m3o1O0N8m9j9K2M8k8M0p3L6K1j0qk8k4
8071c3OO8J1p5prM9J4L6l0j24J02k0MJ4J7l7O3l7j0j8K4%j0r7R9o0O7O3j46J26
8102E0K8n6j8PKn6L5knK7j9J9o%j8L5N0j15R2m0N3n4%m5L3K0PJ0j32J09p2O4k3
8135b0J7J4jo8Q8K7k9j6n4N7o4R2Qp4L4k4m3O3n2O6L4p9rN3j0j0M0m2Ln8J04k9
8167A8m2m0J15p8j2O0J4M5r2J5oM2k8n3O1qj0j6j0J9QM9kl6
$$ plain form
8007 -30 7 8 -67 12 -62 48 5 43 -10 -11 -23 63 -16 -18 -11 -17 14 29 -56 15 -27 38 3 -6 3 -32 -42 -27 -11 30 9 -7 22
8040 22 -40 -2 -4 46 -53 5 48 33 -55 -44 -15 3 -30 25 -18 -79 -19 39 -10 -29 -7 41 13 53 -20 16 37 27 19 -9 -33
8071 -33 -27 41 52 -23 -30 -39 10 24 60 30 -94 8 -12 -8 6 23 -14 49 12 2 -16 8 8 -2 -99 0 -60 7 70 -76 50
8102 50 78 22 4 11 13 -43 -8 -10 -15 12 -7 12 6 6 -12 23 73 -42 50 10 63 9 9 -36 -3 17 24 34 -98 11 -61 3 -20
8135 -20 -3 11 10 -58 30 57 28 12 -42 15 -49 43 51 -23 11 -13 -56 7 -45 21 55 -24 -33 20 10 0 40 -2 1 -57 47 18
8167 18 -24 -64 51 -27 -39 21 35 80 -12 3 -3 39 11 -42 19 11 1 -15 -25 -6 2 51 49 13
8191A3
$$ Imaginary data points
##PAGE= N=2
##DATA TABLE= (X++(I..I)), XYDATA
0@%%%%%%%%%%%%%%%%%%%%%%%%JpJ2j4J6j6J6j6J6j7K2k7K8l1L4l8M3m5N1n9O4
45C3p2Q0q6R6j10J24j39J61j90K24k70L39m49O58j183M470J2199n601j3319j3755
65a6790j1553j0229k967M019N126K773J935j720p742q631k224L267P091J2075
79b5570J2751L599n033m222J181K667M551R278J0026M178K75K58j834m798j728
94E579M008M370K098J838m92o445p657j709J575j107j974N16k69l554k716k33
110f172j335k561J04J776q85j342J621J800n36P12L364L88m219j823L260K987
126b861J207K964L179j722m764k453l06j91K345N452L177j352k361k947n309l945
142i887L144P300M399J431Q87k536p014m857J606M543M416N661M531j860o544
$$ plain form
0 0 0 0 0 0 0 0 0 0 0 0 0 0 0 0 0 0 0 0 0 0 0 0 0 0 1 -6 6 -8 8 -8 8 -8 8 -9 13 -14 14 -17 17 -21 22 -23 28 -31 33
45 33 -39 41 -45 51 -59 65 -74 87 -103 121 -149 190 -259 399 -784 3686 15885 10284 -3035 -16790
65 -16790 -28343 -38572 -41539 -37520 -32394 -29621 -27686 -29406 -37148 -45779 -48003 -44736 -37645 -25570
79 -25570 -12819 -9220 -14253 -18475 -17294 -14627 -10076 -798 9228 13406 13681 13939 12105 7307 5579
94 5579 9587 13957 16055 17893 17401 10956 3299 1590 3165 2058 84 600 331 -3223 -5939 -6172
110 -6172 -7507 -10068 -9964 -8188 -9073 -10415 -8794 -6994 -7530 -6818 -3454 -3066 -7285 -9108 -5848 -2861
126 -2861 -1654 1310 4489 2767 -1997 -4450 -4756 -4947 -2602 2850 6027 4675 2314 -633 -5942 -9887
142 -9887 -6743 557 4956 6387 7274 4738 -2276 -7133 -5527 -984 3432 9093 13624 11764 5220
157E220n215k534j158L237P880N669j394m821m542n922n640M19N636M747J444
172C026q6l389p578o493o87K532L244M981M702q35n523l801o80l21J942O668O826
189D528J637j522j126j645k328J082M915M211J998J677k5l749l557L94J696l40
205G846N43K230k58l900k715l03j174k071L02J092j544k131RJ95j745o37J184
222c077m79k200j55K078M55l63J994K098j353k499J55J005J58J898L793J462j546
239C424j156p99k413j357L041M230J092k43J61k036m624k238J991K713J697K432
255E915J555k617m703k397m29J34K601M764K156k192k711j858l187k435K157N022
271A775K412j41l85k120m655l019J334K451J846K583J973k026m279k032j23m16
$$ plain form
157 5220 5 -2529 -3687 -450 7430 13099 11705 6884 2342 -3580 -9220 -8801 -3165 1582 3026
172 3026 2940 -449 -8027 -14520 -15207 -12675 -9431 -4450 252 -583 -6106 -9907 -10587 -10908 -8966 -2298 4528
189 4528 6165 4643 3517 1872 -456 626 5541 9752 11750 13427 13402 9653 6096 6490 8186 7846
205 7846 8389 10619 10361 6461 3746 3443 2269 198 500 1592 48 -2083 -2074 -1879 -3624 -4261 -3077
222 -3077 -3556 -5756 -5911 -3833 -3378 -3741 -1747 351 -1002 -3501 -3346 -2341 -2183 -285 3508 4970 3424
239 3424 2268 1469 -944 -2301 740 4970 6062 5819 5980 3944 -680 -2918 -927 1786 3483 5915
255 5915 7470 4853 150 -2247 -2676 -2542 59 4823 6979 4787 2076 218 -2969 -5404 -3247 1775
271 1775 4187 4046 3661 1541 -3114 -6133 -4799 -2348 -502 2081 4054 2028 -2251 -4283 -4406 -4822
287d822J334M224K873j209k284q24j564k013J000L554J901J38K59m77k809j989
303b708J070J439j40R48J926n23k815j078P36m60p78J366J560r86j199O10J65
320h67j320q6J588L1j205O88J438m67q36J512J074j532j175J187R30p73N62J946
338B695J90j686o07J40j287o36K009J830o00p83K60j194k751l43K025J017Q8J069
356A436Q39k129k603r2P25J75J365K573N85j794j122j84j359q41K274K926K83
373C057q36J10r14k563j023J705J505Q4J034O67j836k658m62N17m73M46K349P90
391A499j924j377P2q53j424R60K507M06q52L07j07j607q84J463R97j92Q34J476
409A301p45j824K04J275l29m66J543J256j036q36Q80Q6j178J98J523o3r62M91
$$ plain form
287 -4822 -3488 736 3609 2400 116 -708 -2272 -4285 -3285 269 2170 2308 2567 2090 -719 -2708
303 -2708 -1638 -199 -339 609 2535 2012 -803 -1881 -1145 -1605 -2383 -1017 543 -443 -1642 -1032 -867
320 -867 -2187 -2273 -685 -654 -1859 -1171 267 -200 -1036 476 1550 18 -1157 30 960 187 749 2695
338 2695 2885 1199 592 732 -555 -1191 818 2648 2048 1265 1525 331 -2420 -2763 -738 279 367 1436
356 1436 2275 146 -2457 -2549 -1824 -1649 -284 2289 2874 1080 -42 -226 -1585 -2426 -152 2774 3057
373 3057 2221 2331 1417 -1146 -2169 -464 1041 1125 2159 2826 990 -1668 -2130 -1613 -2086 -1640 709 1499
391 1499 -425 -1802 -1730 -2583 -4007 -3047 -540 -134 -986 -679 -786 -2393 -3277 -1814 -817 -1009 -175 1301
409 1301 556 -1268 -1064 211 -118 -584 959 2215 1179 343 1223 1309 131 329 1852 1789 827 1318
427A318O34q38q44J011N19j206m10J214J05j366L7J190k81j285K93P49q20n30
445e10J148N22j011k52R71l05j287K90J478j90p89P68P94j187j205P98O42p68
463i3N3J125j65j463j47M63j015q28J060Q87j163q27O10k09j605k64J296J69p47
482b863L89P80p98j037O58Q08m37J81J598L03j039P3J102k06p76J084J494m16
500H98p28O87M67j145m88J070J25q27N8O59r55j324L08N44r07p43R95L47j294
519b253m86P58J07r47M90J359m9n71Q10Q50n21p0J395P73l78M68J381mr46M51
539B617J128k72o75O96O63r67p77L84k62j212k61O41o39j249o1L53j220j125N59
558a679M54r15l67R33J09j172L8J171N9l76R32J239k88k09J104N39o46L45J621
$$ plain form
427 1318 1952 1114 270 1281 1800 594 184 1398 1503 137 174 1364 1083 -202 91 840 20 -510
445 -510 638 1160 149 -103 868 563 -724 -434 1044 854 65 833 1627 440 -765 33 675 -93
463 -93 -40 1085 920 -543 -690 -227 -1242 -2070 -1010 -123 -1286 -2113 -1503 -1712 -3317 -3581 -2285 -2116 -2863
482 -2863 -2474 -1694 -2492 -3529 -2871 -2063 -2500 -2319 -721 -418 -1457 -1384 -282 -488 -1264 -180 1314 898
500 898 170 857 1324 179 -309 761 886 59 117 776 -179 -1503 -1195 -651 -1558 -2301 -1306 -959 -2253
519 -2253 -2739 -1981 -1874 -2821 -2331 -972 -1021 -1592 -782 68 -453 -523 872 1645 1267 1735 3116 3112 2166 2617
539 2617 3745 3473 2798 3494 4157 3190 2413 2797 2535 1323 1062 1703 1064 -185 -246 107 -1113 -2238 -1679
558 -1679 -1225 -2140 -2507 -1574 -1465 -2637 -2599 -1428 -1369 -1745 -813 426 138 -71 1033 1572 926 1271 2892
577B892M84q51L54R90m92j073M77P22o29o26O46n9j412o67N69m19j037J50P37
596G56q52j108M20L15j057m68J064N06q97j24R31q6o60L98R50k81m04R14N83q83
616A7k71J033K00r79K8R53l24q79K08O98o58p47N87L98r19l72P69J31q48K63Q85
637A73l91q83O93Q73m97l71J140O24p14l16Q31J05p42M17R14k89p08L17L18j090
657D04o56Q72K76q80l18Q44n21j534r3P36m40n55N98N88q87p03M82J7p64L68J277
678h89R4q14L99P49o77p36R38R77l81j20Q88K3j007j59P87k8m62O90O99o95p53
699d77L42J65p98nJ122K75q89n9P23m92r12N37Q00k78k06O59J05r65j97P91N0
720B91p67L95Q69l89r60L04L79p27l68Q26L45p94k29O60k14q05K83Q52l04m68
$$ plain form
577 2892 3376 2525 2879 3869 3377 2304 2781 3503 2874 2248 2894 2835 1423 756 1325 906 -131 19 756
596 756 -96 -1204 -784 -469 -1526 -1994 -930 -424 -1321 -1445 -514 -600 -1260 -862 88 -193 -597 317 900 17
616 17 -254 779 979 0 28 981 657 -222 -14 684 26 -721 -134 264 -655 -1027 -258 -127 -975 -712 173
637 173 -218 -1101 -408 465 -32 -403 737 1361 647 331 1162 1267 525 942 1856 1567 859 1176 1494 404
657 404 -252 620 896 16 -302 542 21 -1513 -1606 -870 -1310 -1865 -1267 -679 -1566 -2269 -1787 -1770 -2534 -2166 -889
678 -889 -795 -1609 -1210 -461 -1138 -1874 -936 41 -340 -460 428 451 -556 -715 72 44 -418 272 971 276 -477
699 -477 -135 30 -768 -773 349 624 -265 -324 399 -93 -1005 -468 332 54 -152 507 612 -353 -550 241 291
720 291 -476 -81 788 399 -561 -257 122 -605 -973 -147 198 -596 -825 -165 -379 -1184 -901 -49 -353 -821
740h21P79N39p48l58J058L67o87L1J012J3p16J78P96m64n00O00M82q40l72O67
760A016j1r58p9O63m14q90K35N08o86o91N99L49p70l59P26J24o98K87P05j93n42
781a079N17O82n11m91R24N99o51j43Q15R3q03J14O92k74o10M66M67o28n69O11
801B21Q3p53j1P44n5p91K59P10l86o40O35P31l18j48P55K06o88O1Q60m1n04M82
823A412P51n82p00L84L22q46l72N72J46j012l10L37o05j097J15N79n73n04M50
842a533j0r79k79P67J45n23N54J133j56o34M52P05j21L8J197P24k70K1O58j97
862A692o55K73R29m8l94L54J81j025q28J99J32p11j98O92l47j177l53J09n38l91
882b104O49O19n12k32O43j9p73K10J262M61k24O77P99l20n12P00O25j94K29Q79
$$ plain form
740 -821 -42 497 -251 -609 449 816 129 160 1172 1185 469 647 1443 979 479 1079 1561 721 349 1016
760 1016 1005 47 -32 631 217 -673 -438 70 -616 -1307 -708 -359 -1129 -1488 -762 -638 -1336 -1049 -344 -537 -1079
781 -1079 -562 120 -391 -882 42 641 -10 -153 662 755 -48 66 758 484 -126 340 807 179 -390 221
801 221 304 -449 -460 284 229 -562 -303 407 21 -619 16 747 429 281 1036 1242 554 615 1475 1434 930 1412
823 1412 2163 1581 881 1265 1587 741 369 941 1087 75 -235 102 -503 -1600 -1485 -906 -1479 -1983 -1533
842 -1533 -1543 -2522 -2801 -2034 -1889 -2412 -1858 -725 -881 -1515 -1063 -358 -479 -441 756 1480 1210 1231 1889 1692
862 1692 1037 1310 2239 2191 1797 2151 2332 1307 479 678 810 99 -99 593 246 -931 -1284 -1175 -1713 -2104
882 -2104 -1455 -836 -1348 -1580 -937 -956 -1729 -1519 -257 204 -20 657 1456 1136 624 1324 1949 1755 1984 2863
902B863K31p60k39L50m30o04L57M09o71p53J71j19j050n18M12r3p96j54L78m16
922a432p14L34M19n02l51O68L42n91K3R68K37m90J73P57k23m44O40P56k12j52
942B06N86m1q53l39Q07j56l66M27O26p10j030J11J36n61j3Q64M68o37l28K05n72
963a170o40O08R87J31L4M71L0r19n80P53N61n1P20Q93k75j171k15K23k73K9J014
984A160O43n45n42R0o48j003K92J041K50l17L11M2j060q37L89M10r8L99Q52j43
1004F86j002k65K64l43j34P87Q18l29m06K66j39q33j00R19K64l64J31K89n36o28
1024f55L32L62m52p8O72L3o62p9O79j64n81L36M73l87m16N46N83l93j69M46j5
1045D11p21K4O85O1k23N31M10p42p67L48K65m84K19R22K40p37m15J08o22m82O41
$$ plain form
902 2863 3094 2334 2095 2445 2015 1411 1768 2177 1506 753 924 805 -245 -763 -351 -444 -1240 -1394 -1016 -1432
922 -1432 -2146 -1812 -1393 -1895 -2246 -1578 -1236 -1827 -1804 -836 -599 -1089 -916 -159 -382 -826 -186 570 358 206
942 206 792 751 -102 -441 366 210 -156 271 897 187 -843 -732 -596 -1157 -1170 -306 162 -475 -803 -598 -1170
963 -1170 -1810 -1202 -215 -84 -50 421 451 -468 -1048 -295 266 215 935 1828 1553 382 167 390 117 146 1160
984 1160 1803 1258 716 806 158 -845 -553 488 738 421 732 774 -286 -1123 -734 -324 -422 -23 829 686
1004 686 -316 -581 -317 -660 -794 -7 811 482 76 342 203 -630 -730 189 453 89 220 509 -27 -655
1024 -655 -323 39 -413 -491 181 214 -448 -527 152 -12 -593 -257 216 -171 -587 -41 542 149 -20 426 411
1045 411 -310 -286 399 460 237 768 1178 436 -331 17 282 -202 17 939 1179 442 27 135 -487 -969 -328
1066c28R68o5j73K05l02j144l99P65L88O8O43O43p11j238j39K46j82L31J086O04
1086A266o73m99j67n96o55N96J224K30l59K40j46j187p27O08O18RM08O74m10j088
1106f34l72K66j95j5J044N86n38m14J45l54o87K36R72K25l04K98J93n52o94N04
1126b90M55j84R2O52q8o56QM65j45m77L96N16m07l89O22K06o16m9M18k8o60N4
1148a05N84n4l13M33K12o88n57M00J25k77L50O98J6p29k33J47n17k41Q05P07j76
1169E87k35J95m65r05k04Q12M39m5M42L45r75r14O7K00j04K52J118J14q24m58
1189e58j36n00l87P89R74L1l21J81k89j058l12P69O20n1L92N02n40j020r5M66
1209e43j35J96R38M10n52m72J90l09m71M53R09k1k67L11N3p77k78N17M40j40P5
$$ plain form
1066 -328 640 575 402 607 305 -839 -1238 -473 -85 -17 626 1269 558 -680 -819 -573 -755 -424 662 1266
1086 1266 593 94 -73 -669 -1324 -728 496 726 367 607 461 -726 -1453 -845 -227 -218 190 864 454 -634
1106 -634 -1006 -740 -935 -950 94 680 142 -272 -127 -481 -1168 -932 40 265 -39 259 452 -100 -794 -290
1126 -290 165 -19 73 725 637 -19 -11 454 309 -168 228 744 337 -52 570 776 160 111 529 501 -159 -105
1148 -105 479 425 112 545 757 69 -488 -88 37 -240 110 808 824 95 -138 9 -508 -749 56 763 587
1169 587 352 547 82 -823 -1027 -215 224 179 621 966 -9 -923 -856 -656 -760 -508 610 724 -100 -558
1189 -558 -694 -1194 -1581 -792 182 213 -108 73 -216 -1274 -1586 -817 -197 -248 144 646 106 -914 -1009 -543
1209 -543 -678 -482 456 866 314 -158 32 -277 -748 -295 614 593 326 637 690 -87 -365 152 592 452 527
1230E27M84j87o49J71L74k31k82M07L84n01l50N02j2n58k9M53k96n23J63M36k30
1251E3l94L02J54o50m36M07J18m04K43O16j82p37oL05l45p7P75O08k99k04L47
1272A94l78n57J36Q81K24j44M87J22p01o25L15L51j64K57P54q3p55l21L0k98k82
1293e57O08O23j35l77K09l86p06k7Q15K34j61L78L77n54o23K40M10j39J46P44
1313A119K13o12k69L12k64k93L73N31j97m36K87l6o81l50N01J54m84l2L47l84
1333b01n99P7K65l36k41M39K06n52j66M61J18n58J75O28k23m09L58M76k72j96
1353e50M71K28n50K5N01K6l28K70M76l01n41L45J52l56j31O11K72n35p5K64k02
1374G2n04K66N83j49k62L57K42o65k96N16K06l70J62O08k18n89k2L23l20k24N50
$$ plain form
1230 527 1011 824 175 346 720 489 207 614 998 497 147 649 637 79 50 503 207 -316 -153 283 53
1251 53 -341 -39 115 -535 -971 -564 -446 -850 -607 9 -173 -910 -916 -611 -956 -1033 -258 350 51 -153 194
1272 194 -184 -741 -605 276 500 356 843 965 264 -361 -46 305 141 398 1152 1069 314 -7 23 -275 -557
1293 -557 51 674 539 162 371 -15 -721 -748 67 301 140 518 895 341 -282 -42 368 229 375 1119
1313 1119 1332 720 451 763 499 206 579 1110 913 477 764 728 47 -303 198 352 -132 -164 183 -201
1333 -201 -800 -723 -458 -794 -1035 -596 -390 -942 -1108 -647 -529 -1087 -912 -284 -507 -916 -558 -82 -354 -550
1353 -550 -79 149 -401 -376 125 151 -177 93 569 268 -273 72 224 -132 -263 348 620 85 10 274 72
1374 72 -432 -166 417 268 6 363 605 -60 -356 160 366 -4 158 766 548 -41 -63 260 -60 -284 266
1395B66K89m78k43K99k16o61J47N16r3l94K00K36m65m04L61K28l16M3N44j6m38
1416e95M5N24j02l49N30M55l28j63M68K05m78Q9N43O8m58J33M43k27m10K73K71
1437I37m83j99L80n7n54l3L82j21o60J98K73l69m28L09K93m66k16M13K8m23L2
1458g64L78j16l13L13L44k93k60M70K85m53r6O52N4l89P9M64j41l61K62L58k60
1479B13k47L84K50n07o4M37l1m19L6M64k43l83L62L25m50k60K57K00l99p9M57
1500C03rm65J13L35l40l75L03M32l42k16M16J2m62r8M70q0l69L13M24k45l88J65
1522a03J94l64o5N94J70m38K2L86k63m96K21M48j31l26L86J70n30k04M15nl20
1543b39K07M01k28m87J57K97l70k03L52J97k58p8M02j38l54J44M05r9l37K92K65
$$ plain form
1395 266 555 77 -166 133 -83 -744 -597 -81 -174 -568 -368 -132 -597 -1001 -640 -412 -728 -685 -141 -157 -595
1416 -595 -550 -26 -128 -477 53 508 180 17 485 690 212 301 844 912 454 587 1030 803 393 666 937
1437 937 454 255 635 578 24 -9 373 252 -408 -210 63 -306 -734 -425 -132 -598 -814 -401 -373 -796 -764
1458 -764 -386 -502 -815 -502 -158 -451 -711 -241 44 -409 -505 147 201 -188 -109 355 214 -147 115 473 213
1479 213 -34 350 600 93 29 466 435 16 52 516 273 -110 252 577 127 -133 124 324 -75 -154 303
1500 303 294 -171 -58 277 -63 -438 -135 297 -45 -261 155 167 -295 -393 77 -3 -372 -59 365 120 -268 -103
1522 -103 91 -273 -338 256 426 -12 10 396 133 -363 -142 306 175 -151 235 405 -125 -329 86 81 -239
1543 -239 -32 369 141 -346 -189 108 -262 -465 -113 84 -174 -252 150 12 -342 -198 207 108 -229 63 328
1564C28l51p7L51J39m38O8M44r0l61J45N32k25k12K18J85l84j59L37K91l53m3
1585C45L78k66n39J01K85j71k09M01J81n16k69J45o6l89R6N46m1m29P1J2m34l06
1607a074M35L52k37PL38j76o55K9L31J06p8M79L25l46l90K52J9k65J54O24K09
1628D39k75L8K08l51m43M71M79j24j55M48Mn78j71L19N6j70J57L68k90l67J13
1649A76K02m56n5N02J55m32p7L55k46m36J80M18j71k66K54R9l14j25L70ol20O8
1671a25L05j69l83K77L52k61l20L11R6l99q6M86R0k97J4L56k89m12J61L29j33
1692i7r7M93N8o06j62K24n7k58K57N69j80l21O0O2m88j69N25L00k14Q6K13k88
1714i0n64P9L29n1N7M41K90n21l99K39R3k31K16N78J28l31K1Jl04k06M80M01j10
$$ plain form
1564 328 -23 -100 251 390 -48 20 464 374 13 158 690 465 253 471 656 272 113 450 741 388 345
1585 345 723 457 -82 19 304 133 -76 325 506 -10 -279 -134 -200 -589 -493 53 12 -417 -346 -334 -768 -1074
1607 -1074 -639 -287 -524 -517 -179 -355 -1010 -981 -650 -544 -622 -143 182 -164 -554 -302 -283 -548 -394 230 439
1628 439 164 202 410 59 -384 87 566 442 287 735 739 161 -10 309 365 195 352 720 430 63 176
1649 176 378 -78 -133 369 524 92 15 370 124 -312 -132 286 115 -151 103 202 -112 -237 133 127 -193 -125
1671 -125 180 11 -372 -95 257 -4 -324 -13 83 -316 -402 84 174 -123 -109 247 -42 -454 -293 36 -97
1692 -97 -194 299 357 -249 -411 -187 -244 -502 -245 324 144 -177 -117 -55 -543 -712 -187 113 -101 -15 198 -90
1714 -90 -654 -575 -246 -297 -240 201 491 -30 -429 -190 -97 -328 -112 466 594 263 284 285 -19 -225 255 656 546
1737E46j13L36k02n71j06L95Q9j69K58K98l99m09M2J12l44J6N09nl82m5K12k90
1759b22l04K69K91j58j88L36J10m51j51L69O6k98J28L11j46l39L28K15k84j49
1779b67L06O3l48l5L72l9l35J27J98k76k51K11K16k19n2K79O0m58j04K88j20j18
1801e02K79M33j77k99J27J25k73n4N13K58j73M5K79m06k77J46M15mo6M39K3n41
1823C10k80J74Nr3J76M84j47m99O7l1l61k19M65K29j98o6K06k85n42P1M19J7j47
1846b45K67K19l56l90J94J44k21J75N31r7l35j2J61j74k37L35L67k16j10K95o1
1867B34m35k0M02l9j78R4K45k55l18K63J49l31n7M21l0l21k3L77j69k55J57K88
1889A99k28l13M03R4k60o1L49K4l65P8J99p9k45L06K17j96l01K31Q6k67pL71P3
$$ plain form
1737 546 433 769 567 -4 -110 285 374 205 463 761 362 -47 -5 107 -237 -221 288 283 -99 -144 68 -222
1759 -222 -526 -257 34 -124 -312 24 134 -317 -468 -99 -33 -331 -203 108 -38 -377 -49 166 -118 -267
1779 -267 39 102 -246 -281 91 52 -283 -156 42 -234 -485 -274 -58 -277 -329 -50 10 -448 -552 -264 -384 -502
1801 -502 -223 210 33 -266 -139 -14 -287 -341 172 430 257 302 581 175 -102 44 459 455 389 828 851 310
1823 310 30 204 209 116 292 776 629 130 197 166 -195 -414 51 280 82 16 222 -63 -605 -534 -115 -98 -245
1846 -245 22 241 -115 -505 -311 -167 -388 -213 318 221 -114 -126 35 -139 -376 -41 326 110 0 295 234
1867 234 -201 -221 181 142 -36 58 303 48 -270 -7 142 -189 -246 175 145 -176 -199 178 9 -246 -89 199
1889 199 -29 -342 61 155 -105 -166 183 207 -158 -80 119 40 -205 101 318 122 -179 52 138 -129 -136 235 308
1912C08k24M9J93k81k31K35L14j41r0L25j3l94r4K32Mj78K37L45k41k99M3P5l26
1935a52m8L37J62l09NM0j65m50J14L39j32j56L04O6m11k90K45O8k29K61L25j24
1957b00k84J57Q8j63j25L89L17k17K0K30o0l61M8M36K8j98K76K33l31j95J71R1
1979C50k37Q3L76j27l13R2J77k06k73K87K25l21j38K44q9l00k5K88p6k38J01J73
2001E3j81j67J49J66k82j08L37Mk56k5K44n5k15J43K38j76j79K53J11k45l1L56
2023A34p5k64L4K20qj38R4L41k21k50K54N8k76M9K80K6k27RK26k77k19J62J58
2046I0j40r7K42l0k80j29K12l8j27J03K90j60k77J46J01j95ML12J77k63j4K51
2068A78r1k86K09L11r3o1J52J41k86j23K29M0j92J11L01j02k48K3J41k87j25K63
$$ plain form
1912 308 84 133 326 45 -186 49 363 222 132 457 444 50 -44 188 192 14 251 596 355 56 99 174 -152
1935 -152 -200 137 299 -10 -5 35 -130 -580 -466 -127 -259 -415 -111 -45 -456 -746 -501 -433 -662 -401 -76 -200
1957 -200 -484 -327 -239 -402 -527 -138 179 -38 -18 212 152 -209 -161 275 303 105 381 614 283 88 259 350
1979 350 113 196 572 445 132 224 401 195 -78 209 434 113 -25 219 130 -170 -195 93 17 -221 -120 53
2001 53 -128 -295 -146 20 -262 -370 -33 -29 -285 -310 -66 -121 -336 -193 45 -131 -310 -57 54 -191 -222 134
2023 134 59 -205 -171 49 41 -97 -3 338 117 -133 121 179 -97 -48 232 258 31 40 266 -11 -230 -68 90
2046 90 -50 -147 95 65 -215 -344 -132 -170 -297 -194 96 -64 -341 -195 -94 -289 -285 27 204 -59 -73 178
2068 178 87 -199 10 321 228 167 319 460 174 51 280 320 128 239 540 438 190 213 354 67 -58 205
2090B05K31l06n4J55n4l58k6K34M8j97J76R9j73l02P1J98k31P1K52o3k49J7J82
2113g4j16k32J92K80j37j79K17j6k82MK47Kk03J61J91j40k47J99J84q8o3K22R6
2136B18k72M9K14Nj81J26K56j74j49J69J38k30r2K70j8k98L5K19j65j47O7K03
2158B43l35j14Q0R6k05q7K67N1k22m1J65r6j72J25L09j22j34L19J16l21k3K67
2180A66J08j42K15K26j31k72J31P4j99p0L14J04l25q7R0j44l48K6L48j74j59R2
2202a57K8l47k31Q5J34o2K0K76o7l22J09J23j00n2L26L25j30lJ66Kk15R3K83J21
2226D05j00K46O1k47k11J98J73j43l5K07L8l86l9J58j18k40J94P6j72j99L7P5
2248b2l54R3J89l0j37R5J23j47j37J66J17j48k9K50Pj30K4K33K8k91J60J50j24
$$ plain form
2090 205 436 130 76 231 177 -181 -207 27 75 -122 54 153 -20 -322 -251 -53 -284 -213 39 -24 -273 -256 -74
2113 -74 -190 -422 -230 50 -87 -266 -49 -65 -347 -343 -96 -94 -297 -136 55 -85 -332 -133 51 -37 -100 122 218
2136 218 -54 -5 209 214 33 159 415 241 92 261 399 169 77 347 329 31 66 285 120 -27 40 243
2158 243 -92 -206 -126 -30 -235 -322 -55 -4 -226 -267 -102 -198 -370 -245 64 -58 -192 127 243 -78 -101 166
2180 166 274 132 347 573 442 170 301 375 176 106 420 524 199 112 202 58 -290 -264 84 -90 -249 -157
2202 -157 -129 -476 -707 -622 -488 -550 -530 -254 -321 -643 -534 -411 -511 -563 -237 88 -42 -45 121 123 -92 1 284 405
2226 405 305 551 612 365 154 352 525 382 347 554 592 206 167 325 207 -33 161 237 65 -134 -97 -22
2248 -22 -376 -283 -94 -124 -261 -166 -43 -190 -327 -161 -44 -192 -221 29 36 -94 -70 163 191 -100 60 210 86
2271H6j81J78J15j63L6Q6P0l56J2J56Nj61O5K54k70j51LJ20j68MK98M7k60n8J83
2296e0m6k68J30L40j41p4K56J5l18j45K45J21q9P1K63j97k24N1N9j05lK76P8k80
2320c5n5K34j14k76P6L04Mn7Q4O7k62j02K06J8j02J23K67o7k73k9J71j06j37K87
2344B26J99k51j29Q3k9j62n4K18l0j09lJ41k02j83J34J62j97n9K13l9j48K2K17
2367B0j19j63J12J93j14q7J71M8j85MK28k1j42M9J55n6j02%K15k13q8R7N7j72
2391a13%K33Nk74J07J20k24j61K26K30r5j96J41M4k72%K57L5o4Q2K38k08j95J83
2415I9P7n6o9K03J22k75pJ16j04k41P6L01j4j69L5K9j88j72J77O3k52J61J68p0
2439A0k37KJ69k01p1K15J49k00k8J31m0j50j5K81o9r9J95P2j74j06K18L7j56K6
$$ plain form
2271 86 -95 83 198 35 71 157 227 -129 -117 39 44 -117 -52 202 -68 -219 -216 -96 -264 -260 38 85 -175 -233 -50
2296 -50 -96 -364 -234 106 -35 -109 147 162 -156 -301 -56 65 -24 47 310 113 -111 -60 -1 -106 -109 167 245 -35
2320 -35 -90 144 30 -246 -170 134 138 81 165 232 -30 -132 74 92 -10 113 380 313 40 11 182 76 -61 226
2344 226 425 174 45 128 99 -63 -117 101 71 -38 -41 100 -102 -285 -151 11 -186 -245 -32 -71 -219 -197 20
2367 20 -99 -262 -150 43 -71 -158 13 61 -124 -120 108 87 -55 -6 149 93 -9 -9 206 -7 -95 2 59 -113
2391 -113 -113 120 125 -149 -42 78 -146 -307 -81 149 54 -142 -1 43 -229 -229 28 63 -1 81 319 111 -84 99
2415 99 176 120 51 254 376 101 94 210 106 -135 -59 242 228 59 94 123 -65 -237 -60 3 -249 -88 80 10
2439 10 -227 -225 -56 -257 -328 -113 36 -164 -192 -61 -101 -251 -266 15 -54 -153 42 114 -60 -166 52 89 -67 -41
2463d1K26j9k21N2J30L2j52M2J59j66m1J23M2j79k8J85J8k79O8J71j27j20J95
2486G0Q6j72j95K37mj46N3J51j23j44R1R4n5j41J76M1j04m1K21j3j52j5K75j4
2510A76j30J32J46j10j75R8J63j33j01J79J24k26j1N9j01j27R6R3j85j46K06l7
2532a0k42m4J82j06r5l8J49o0j89J32J36j67l0K34M3o1jK06o7n4R8J81q2kJ14
2557B27J20j61l3K34l1j51QJ46q2k03P1J06j70j23Q9l0j22q0L5P8k01qJ38m8k01
2582c92J23J53r7p3K30J00j93J8K19Mn8K0J68Q3k22J15J46j22n1J19M3j86j7J00
2606B30o2j77k3R3q1j55M0P0k27n2J61M3j47o5J76Kj01Q6J64j38n2K10Q0p0j54
2631a49K05J56j07o3J64L9k06R5J88k09J%M4k12k2J20l4k98R3J07p5k04J12J02
$$ plain form
2463 -41 185 166 -55 -3 127 159 7 49 208 42 1 124 166 -13 -41 144 162 -117 -49 122 -5 -125 70
2486 70 156 -16 -211 26 22 -124 -71 80 -43 -187 -96 -2 -57 -198 -22 19 -85 -126 95 82 -70 -85 190 176
2510 176 46 178 324 214 39 137 300 167 66 245 369 143 132 191 90 -37 59 152 -33 -179 27 -10
2532 -10 -252 -296 -114 -220 -315 -353 -204 -264 -453 -321 -185 -352 -382 -148 -105 -166 -167 39 -28 -82 16 197 115 113 227
2557 227 347 186 153 387 356 205 213 359 277 74 145 251 81 -42 47 17 -105 -185 -150 -72 -273 -281 -143 -191 -392
2582 -392 -269 -116 -213 -286 -56 44 -149 -131 88 92 34 54 222 305 83 198 344 222 171 290 333 147 130 230
2606 230 168 -9 -32 61 -20 -175 -135 -65 -292 -344 -183 -140 -287 -352 -176 -174 -275 -189 -25 -163 -215 -5 75 5 -149
2631 -149 56 212 105 42 206 245 39 134 322 113 114 114 158 -54 -76 44 10 -288 -195 -88 -163 -367 -255 -153
2655a53j03r4J45J33j36n4K10P2j49Q9J19O5j31J32J25n6o9J60M6j54l3K27nk73
2679A13P0Q2j51q6N7N7j78k7J11o9j77J6J59o9k03J25J05n4j11J01K17q4l5J35
2703A04J7j67O6J92m2q1L6J56j01j36J24K6j56j6Q6o3k30KJ88j33k40K12L6j73
2727b93j01NJ20j28n1R4J05k05J72J30k5j09K15R5j54J03J50O9j01k9J94L4r5
2750A95R8J23r7n2l9J34j18j93K03J16k23J8O5j14j30P0K7o0j45J97J8j93p5J28
2774d7Kq3jJ10J6j15NR7L1j23J16N8j35m6J98k6j91k4K93j20j23J03N8j72q0J95
2800dlr8q7J44K3j65P1J56j13r3R6J61j81l4J08R9j55O5J50l1j57P1J79j72n2
2825b2J35N5j85J0R6j7k16L5K15o6j23K2J99k04o0R6P7p7mJ60o7p1m2K27j06p7
$$ plain form
2655 -153 -256 -350 -205 -72 -208 -262 -52 20 -129 -40 79 144 13 145 270 214 145 305 351 197 164 391 386 113
2679 113 183 265 114 28 85 142 -36 -63 48 -21 -198 -182 -23 -92 -295 -170 -65 -119 -230 -129 88 4 -31 104
2703 104 121 -46 20 212 170 89 125 281 180 44 168 194 38 22 108 45 -185 -183 5 -128 -368 -156 -120 -293
2727 -293 -394 -389 -269 -397 -448 -354 -249 -454 -282 -152 -177 -286 -71 24 -130 -27 123 192 91 62 256 290 195
2750 195 293 416 319 267 228 362 244 51 254 370 147 165 230 116 -14 56 83 23 -122 75 93 -100 -175 -47
2774 -47 -45 -128 -129 -19 -3 -118 -113 -16 15 -108 8 66 -69 -115 83 57 -134 -158 135 15 -108 -5 53 -119 -199 -4
2800 -4 -7 -105 -192 -48 -25 -190 -119 37 -76 -169 -73 88 -93 -127 -19 80 -75 -10 140 109 -48 23 202 30 -22
2825 -22 113 168 -17 -7 89 72 -144 -109 106 40 -83 -61 138 -66 -126 -30 47 -30 -34 126 59 -12 -54 173 67 -10
2851a0J59R2p9j02R5M2j13k3J65rj33m7N3jk37J66J4p1j52J65ok15k6J58K0j69
2877b64O8O3p4j31J22M7k5j74K58P8j89N1J64p8l7L2K68j25p4Q5K0n9MJ07k4k0
2903I3k7J16k2j14J12L1o2r9P0J27j80n1J31p1o3M0L5oj25J7O9k6j19Q8L5n2o0
2930a13J13N7j20l9J83m1q5J3J45j82o3J71J47j86M1J01l4q3k9J46Rj08P1M6r5
2955F5q0O8Q9j55o0K43j42q4j7J08j48k8O9J16j43p5J38j4j00p1J73p6n7J0J53
2980a8j02m0M4J19j05KL1J18j83P1J16Kj77J49Q4m7RP3P9p2j01J08K3j22M1J26
3006B28q7o9M5O3j13q6J50P1k34j8J54j06m2K3J10q6m3K4J20j98ON1K6n7q7J79
3032B4p2J1J00j9q1j0P2J17j40q0J03Nq8N0Q7l8j06J1J53j28k1M6M5j34l4O6P
$$ plain form
2851 -10 149 241 162 60 155 197 84 61 226 217 84 37 90 89 -148 18 32 -39 -191 -26 -32 -247 -273 -115 -95 -264
2877 -264 -196 -133 -207 -338 -216 -169 -194 -368 -110 -32 -221 -170 -6 -84 -121 -89 179 54 -20 65 85 26 30 137 113 93
2903 93 66 182 160 46 158 189 127 28 98 225 45 -6 125 54 -9 31 66 60 -65 -48 21 -5 -124 -36 -1 -53 -113
2930 -113 0 57 -63 -102 81 40 -45 -32 113 -69 -132 39 186 0 41 142 108 25 -4 142 151 43 114 160 65
2955 65 -15 53 142 -13 -73 170 28 -56 -73 35 -113 -141 -72 44 -99 -174 -36 -50 -150 -221 -48 -124 -181 -171 -18
2980 -18 -120 -160 -116 3 -102 -100 -69 49 -134 -63 53 55 -122 27 111 64 73 146 225 153 52 160 183 61 102 228
3006 228 141 72 117 180 67 -19 131 202 -32 -50 104 -2 -44 -21 89 3 -40 -16 104 -94 -88 -37 -11 -68 -155 24
3032 24 -48 -37 63 44 -37 -47 25 142 2 -78 25 30 -58 -8 79 41 -65 -54 99 -29 -50 -4 41 -93 -127 -61 -54
3059e4j37OJ44n3j07R9K7l0j42J43Ln0j4J80m6k4J10J35r5q0O8J67j53J1J11N9
3085B78j42m1K08j09j0J6P8j24o3P3j1j04j15J79j15p7o1J03n2j54M5Q2p8r1Q5
3110b00R9q4n9J04P6n2l6J32K2o0J18R5n2k8N1J08j01m8J10J2j40M3P5L4k06R8
3136A11L0r7q0L6N5j58J0L1k7j79qJ38j9o4Q2N7k3j15P5R9o8r6K21%j31J24O8
3163G2l1j35K06N5m9j43J23L7j51L6J13m5o0K2P5m5j09R5L8q4m4O2N4j55L2J47
3189A16o5o9M9J07oj28J32l2o2l6J31K0j08m9J10o4m1L7K6p1j08O4N2j35l7J20
3215d7p5r5O9Q8j44j12J36J51p8k4O1M5j13m6J98L3j40Q4J47Lj75P2Q3p1J5J16
3241A81M0j75O5k3l8j18N8J04q3r3P1L1j16j07Q6P7p8j0Q1J4j73J23O7r4k5J19
$$ plain form
3059 -54 -191 -185 -41 -94 -201 -102 -75 -105 -247 -104 -101 -151 -165 15 -31 -55 55 190 95 15 83 250 97 108 219 278
3085 278 136 95 303 194 184 200 278 154 91 164 153 49 -66 113 -2 -79 -140 -37 -89 -243 -198 -116 -194 -285 -200
3110 -200 -101 -185 -244 -140 -64 -116 -152 -20 2 -58 60 155 103 75 126 234 133 85 195 207 67 110 185 219 13 111
3136 111 141 44 -36 0 55 -103 -93 -62 -89 -268 -276 -138 -157 -221 -139 -82 -105 -220 -145 -46 -114 -210 11 11 -120 4 72
3163 72 41 -94 112 167 118 -25 98 135 -16 20 133 88 28 50 125 80 -29 66 104 20 -24 38 92 -63 -31 116
3189 116 51 -18 31 138 132 4 136 104 42 6 137 157 49 0 110 46 5 42 68 -3 -111 -47 5 -130 -167 -47
3215 -47 -122 -217 -148 -60 -204 -316 -180 -29 -107 -131 -70 -25 -138 -184 14 47 -93 -9 138 141 -34 38 121 50 65 181
3241 181 221 46 111 88 50 -68 -10 94 11 -82 -11 20 -96 -203 -117 -40 -118 -128 -47 -33 -206 -83 -16 -110 -135 -16
3267a6P8j81J00J08p0l7JJ95p7j16J4J40q1m1P0m2k9k4J88q0j68R1R8j24p9O9
3293a3N4r6o8J59m2j48j6J14j8r7R5O7o8m4O8R4j59j7J14P0j42n5J53K2j39O2
3319e0J15n7j08J46J3l4oO4J1j43mJ23J0j10L8P9n5n3K2N3j05o1K09jj31k1J11
3346E5n9j38J51Kl1k2JJ28k01jJ15J18r2MJ17q0q3j3R0j4j4J64m4p5oj1P6j27
3374A0N7O8m5n5M5L7r3q2M0Nj37R1M2k1j98M0P1m4j5L7K2n6R0m7OM1n7J63m7n4
3404h6O6Q4l9n4O4J08p7q0J62L5j24oJ26m4r4L7Q0j08p1J08J5j32nJ7j6j12J12
3431c4O8Pj35J49%j30j6N6O6o0M4O1rj11K1Q9%j20Q1R7o8m3J05l8j58K5J59j22
3459a6lQQ7j44o3L8J2o0N9J17o7j1q4P8k7r6O8J39r9j0J26n2o8M8j6J58j21k9
$$ plain form
3267 -16 62 -119 -19 89 19 -18 -17 178 101 -15 -1 139 58 17 87 45 16 -8 180 100 -68 23 121 -3 -82 -13
3293 -13 41 -55 -123 36 -6 -154 -170 -56 -74 -171 -76 -9 -77 -121 -53 41 -118 -135 -21 49 -93 -148 5 27 -112 -50
3319 -50 65 8 -100 46 59 25 19 83 94 -49 -53 70 80 -30 8 87 32 -21 1 54 -51 -112 97 96 -35 -56 55
3346 55 -4 -142 9 11 -20 -42 -41 87 -114 -115 0 118 26 30 147 67 -16 -29 61 47 33 197 153 78 72 61 137 10
3374 10 67 135 90 35 80 117 24 -58 -18 -13 -150 -59 -17 -38 -236 -196 -125 -169 -184 -147 -125 -181 -91 -138 -132 -91 -148 15 -32 -86
3404 -86 -20 64 25 -29 35 143 66 -14 148 183 59 53 179 135 41 78 158 50 -21 87 102 -30 -35 -18 -34 -146 -34
3431 -34 34 41 -94 55 55 -75 -91 -35 31 -29 15 76 67 -44 -23 66 66 -54 27 124 56 13 118 80 -78 -53 106 -16
3459 -16 -19 -11 76 -68 -131 -93 -81 -141 -82 35 -32 -43 -127 -49 -76 -172 -104 35 -64 -74 52 0 -68 -20 -36 122 1 -28
3487b8Q5m0lK9j2p6m1M2P1r9J0O0n9m3j0J00o4RQ5qj07M5L7P0k6m5P9O3j77P0
3517A7J65r8r8J30jk9J6P9kj25P9L4lj96J65j1l4k2k7J8k9o0JJ8p7O4j0j7r4N9
3547h8Oj2m1O2M3o8M1O4l9o5P6K7pp5J07K1j39J5Q1Rn0pJ09k1j18N8Kl6MN1O2
3578G2j12o5J09N7r6j4L2K0m3L2J24j29j26K5J80r7J4O8Op3o4J24p7r7J06P1R
3605E6j26J66m6p4J2O1N8n0q9J45J5o8m8J30o4q3J05L5j53m6J15m2p3O0K6k1p8
3632g7L2O2p6j0K0mp4K2P1o7Ok9K2ll5P7k3l7j3Q9K1m1k5J08l1j4J0N8j8PRP5
3664A12J8j13J01l3m4j7Q1l2k4OQ9r3j13O0J35j42QQ6p3r7P7M5n1n0J18K1r7o6
3692h8J03l6q2N6M3k8oPJ02n4q2O9R8p3o9R7O3j42N5M1m4m0M5M7j21j1O9L4l1
$$ plain form
3487 -28 57 17 14 43 31 -45 -86 -44 27 -72 -62 -2 -61 -104 -114 -14 -78 -69 16 8 -99 -54 -17 53 27 -18 61 124 -53 17
3517 17 182 84 -14 116 115 86 102 181 179 54 133 167 164 -32 133 122 88 66 39 57 28 -32 -31 -13 -90 -26 -36 -53 -147 -88
3547 -88 -82 -94 -135 -73 -30 -98 -57 7 -32 -97 -21 6 -1 -76 31 52 -87 -72 9 18 -32 -39 70 49 -69 -11 -9 -45 -41 10 72
3578 72 -40 -105 4 61 -35 -49 -17 3 -40 -8 116 -13 -139 -114 66 -31 -17 51 57 -16 -80 44 -33 -130 -24 47 56
3605 56 -70 96 50 -24 -12 49 107 57 -32 113 128 60 12 142 78 -5 100 135 -18 -64 51 9 -64 -4 22 1 -77
3632 -77 -45 17 -59 -69 -49 -53 -127 -105 -34 -101 -95 -124 -102 -105 -140 -63 -86 -123 -136 -47 -26 -67 -92 16 -15 -29 -19 39 21 28 37 112
3664 112 130 17 118 85 41 24 105 73 49 55 144 51 -62 -2 133 -9 -1 85 12 -85 -8 37 -14 -64 54 75 -22 -88
3692 -88 15 -21 -103 -47 -4 -32 -38 -31 71 17 -65 4 102 29 -40 57 120 -22 33 74 30 -10 35 82 -39 -50 19 53 22
3721B2o6P7L3r9l2J28k4p3NQ0p7o5M9J4p6JP0j9o0N8K2kj15J02R9j01n8L4J35
3750F2j50j3J66l4j06P6K1l9l2J01J9j2p5J04L4j54jJ17J8j9j3Q0k8j19N8P9m5
3777I5r3P6L2j08M5K6Oq6P0P7j21j6N4k3k1l1J9pp2OP5n8J3Q1oo3j9M5k6q7N1
3808f6j0L5m7K2oL9n1P7Kl2r2Q3P7r9qJ43r5k7M2M2p2n9J11k0L8j20J33K5j13
3837d8k1P1J9j00P8M5j00q3J39mq5j2J23o4o7O5M4N4r4%J1K6j9LN3k0k5O4k8m2
3867a7j3R5l5m3N1M9p1n3J05J8j18n9J32m9n7l5P0J3n7mJ25n0j2nM4l7n7R3J7
3896D0n1q5J38k4o3K8K0m4O7l3Q3j62J6J17J2r6K9J8r9K2MO8l5p4Q0j0o7lJ16
3925A2l3j4%P5n0p3Q9K4k4l1J75l8j17O8P2n1n4K1Q7o5j2qK5n2l8K3O9j04L6M2
$$ plain form
3721 22 -44 33 66 -33 -65 63 39 -34 -29 51 -26 -91 -42 -28 -104 -103 -33 -52 -112 -54 -32 -34 -149 -47 52 -49 -107 -73 62
3750 62 -88 -101 65 31 -75 1 22 -17 -49 52 71 59 -16 88 122 -32 -33 84 102 83 70 150 122 3 61 140 95
3777 95 2 78 110 2 47 73 79 -7 63 140 19 3 57 34 13 -18 1 -6 -78 -72 3 -55 -42 39 33 -30 -49 -4 -30 -117 -66
3808 -66 -76 -41 -88 -66 -72 -33 -84 -7 -5 -37 -129 -46 31 -68 -76 67 -28 -55 -13 29 -43 -102 9 -11 27 -93 40 65 -48
3837 -48 -69 2 21 -79 -1 44 -56 -139 0 -4 -89 -101 22 -42 -109 -44 0 54 -40 -40 -29 -3 -22 -19 34 14 -11 53 25 -17
3867 -17 -30 65 30 -13 38 87 16 -37 68 86 -32 -91 41 -8 -65 -100 -30 -17 -74 -78 47 -3 -15 -20 24 -13 -70 23 40
3896 40 -11 -96 42 18 -45 -17 3 -41 26 -7 76 -86 -70 47 59 -37 -8 10 -89 -67 -63 5 -30 -104 -24 -34 -101 -104 12
3925 12 -21 -35 -35 40 -10 -83 6 30 6 -25 150 112 -5 63 135 84 30 51 138 73 61 53 78 26 -12 11 80 -24 12 54
3955E4r5k2O2N3j13l8O3Pq5K3O6j5NLM8jq8M8M2K8nN2rp5nJ13p5l7L3P7m4n5J
3988A6Q4j06o9N6N0o8j7L0k0j20J37L1l1k6J8L1j19O2R0p6qM5N0m5nK2l8L9O3
4017G6j06P7l8l0J08j2p5K2N5m7o6N9L7o5J1N6o2K1%QP8r8j5M9J3n0m6L2k9j6
4047e3J13m7J2k9J23j11p6J2J04k3l8J9J3o7o0K0L1k2l3J30j24j5J12L1o7n8L5
4074f8R2l1m3P1j4p8K4M6O1j03J14p6l5NN9M5j37O6N5Pj13K5M5jm8K8O3q0nJ8
4104hk2Km7M0JL2m4N3om9QM7rj23P8N8m9j0J4qm4Q9N5l8kj2K1N2j12R0pn3L0k0
4138Gm7mP1j5k7p1P5P2r5n4R9k8n3J6N0j4p5L4R4o4j5J4Q4o9rP5o8Kk3P9p2j9
4170e0N2jmo8L9M9J8o2O5j9qL0Q4o0l2K0L9o3n3L2P7j20O0M0j8r4M3N2r4K0O9
$$ plain form
3955 54 -41 -63 -1 52 -61 -99 -36 -29 -114 -91 -25 -40 -35 -32 16 15 -73 -25 17 45 40 92 83 8 3 116 41 4 37 114 70 15 16
3988 16 100 -6 -75 -19 31 -37 -54 -24 -44 -164 -27 4 -27 -53 -35 -4 -123 -61 29 -47 -55 -10 40 -5 -10 12 -26 13 76
4017 76 -30 47 9 -21 87 75 0 22 77 30 -36 23 60 -5 6 62 0 21 21 29 107 9 -6 43 56 6 -40 -8 -37 -53
4047 -53 60 13 25 -4 119 8 -68 -56 48 25 -13 6 19 -48 -108 -88 -57 -79 -112 18 -106 -121 -9 22 -45 -103 -68
4074 -68 24 -7 -50 21 7 -71 -47 -1 60 -43 71 -5 -40 -35 24 69 -68 -2 53 60 -53 -28 17 16 -32 -4 59 -21 -26 -8
4104 -8 -30 -28 -75 -35 -34 -2 -46 7 1 -48 -40 7 -2 -125 -47 11 -38 -48 -34 -42 -86 3 58 20 18 6 27 79 -33 57 50 -3 27 7
4138 7 -40 -44 27 12 -15 -86 -11 61 -34 -88 11 -17 -70 -54 -4 -18 -93 -59 35 -29 -44 -30 54 -15 -24 51 -17 -15 -38 41 -31 -50
4170 -50 2 1 -3 -71 -32 17 35 -27 38 19 11 41 125 65 33 53 92 29 -24 8 85 -35 25 65 47 -47 -4 48 -46 -26 43
4201D3N4r9l9J14l4q7P6oJ2o4Q1K9q1LJ5L0r5M5J1Nlq8J54j02l0Q3K2p6qJ4N9
4232C8q3k3R4n5M6p6M2M1j07L2O3j26jP9O2j02J8N4o7K7ON6k8j17Q4J6Qj3RL3
4262A0r6P4k1Mpk1P3r4k4J14QJM2o5P8j24N1J33j33%P1Nl6r0R7Lj2J7j9M9m4k9
4294A5N9o6J2kJ0k1l2Q3m4ln0M7K1o4K1O3m4kM2J7q0j3P5rm6j8P3k8j08P5kn0
4326f9J5Q7pl9K3J9p3k5K1O0m9o3O3L5M1j31M5O8q7J0P5l2l1m1O3N1k7J2M9j8
4356D5m4QK6K8r5O1M4q9N0rN8p5J7O6r3qNO3j7n9K7K9l2L6ln5mR5m9J0n7J04q6
4389co2P9K9j5l8j1J09r0J0N1l8j2k5j4J04j39m3J04l8j9K7N8lj11J06n5r6K8
4417a07R6k8n4J4O1J1m1L0J2m8k2O2l4%j6J30q3K4o7M1lk5L7Pn0rJ6P4o1RKPn8
$$ plain form
4201 43 97 -2 -41 73 39 -48 28 22 34 -30 51 80 -1 2 17 47 -48 -3 8 13 10 -78 76 -26 -56 27 49 -27 -35 -21 38
4232 38 -45 -68 26 -29 17 -59 -17 24 -83 -51 12 -114 -115 -36 26 -76 -58 -4 -71 -44 -38 18 -10 -127 -43 -27 -19 -32 -23 10
4262 10 -86 -12 -33 -29 -36 -57 16 -78 -102 12 20 21 63 -2 76 -48 3 136 3 3 74 79 43 -47 50 53 41 58 39 88 44 15
4294 15 74 8 20 18 28 7 -25 58 14 11 -39 8 29 -35 -14 49 5 3 45 62 -18 -31 44 35 -11 -29 44 16 -92 -17 -19 -69
4326 -69 -54 33 26 -13 10 29 -44 -69 -48 12 -37 -100 -37 -2 39 -92 -47 21 -66 -56 19 -13 -44 -85 -22 29 2 14 63 45
4356 45 1 9 35 63 -32 29 73 -16 34 25 83 8 25 91 -2 -10 -5 58 41 -18 9 38 6 42 39 -16 -20 75 26 36 -21 83 -3
4389 -3 -65 14 43 28 -10 -21 88 -2 8 59 21 9 -16 -30 74 -65 -108 -4 -42 -61 -34 24 21 -90 16 -39 -135 -107
4417 -107 -11 -39 -93 -79 -18 -7 -48 -18 -6 -54 -76 -14 -48 -48 -64 66 -17 7 -60 -19 -22 -47 -10 -3 -53 -62 -46 28 -33 -24 -22 -15 -73
4450g3L8J01r7m3O7nN3j22J27l1o5LO2k0l0M1M6n4j3%K8m7M2L5Lj8o4N9K5p4Q5
4481E9m2p1O8m2k7L2l5K4j0j0m1P5j0p1L6Q2k9n5N4K0k9m7N5O1j34K9MN7j05J18
4511A6O1j11J1P8rj24J3J32l9o7Q3jq2k5L5J02q5lJ3M3r3L6J18j16L2J6N5q4O
4540A1J9Rk9m4%N1k6NR0N9j93O2M1l7%K7J5m0k8K0P8r9o3N5R2j11Q9o6K1m7J5
4571b4Jn0P1Q2q4m8J5Q8m3o3P6M4j04l3Q1L1j11L0K0PqJ9L1m7o7J00oj23P4J28
4601H7n1m4l3J12m7Mm3O1q5kO8J4p7L8P8o7o8J10P0p0p5L5P2l3m3NN6p5L0k3K9
4632C3p8NN1J3l8J4M4j26%J10M8j53O3J9M7q5J0O7J8j27K8jmnM0K6q0O8L8k3j14
4663i2P4Qj9mN5K0n8Mj0O3o5%oN1m7K4pl6rL2K4k6m1N1Jk7JN2j8p3R5j0l5M0l6
$$ plain form
4450 -73 -35 66 -31 -74 -7 -12 41 -81 46 15 -50 -47 15 -5 -35 6 52 -2 -15 -15 13 -34 8 43 46 28 -36 23 48 -26 59
4481 59 17 -54 14 -28 -55 -23 -58 -34 -44 -54 -95 -20 -30 -101 -65 17 -12 -67 -13 7 -22 -69 -14 47 -87 -58 -54 3 -102 16
4511 16 77 -34 -23 55 46 -78 -65 67 28 -39 44 43 -39 -64 -29 73 -12 -15 -2 41 -52 -16 102 -14 18 34 89 5 11
4540 11 30 39 10 -34 -34 17 -9 -4 86 145 -48 14 55 18 18 45 60 20 -8 12 90 -9 -72 -17 75 -36 53 -13 8 -39 -24
4571 -24 -23 -73 -2 80 -4 -52 -37 51 8 -55 21 65 -39 -72 9 40 -71 -41 -21 -14 -22 -3 28 -19 -86 14 8 -115 -41 87
4601 87 36 -8 -41 71 24 28 -15 46 -39 -41 27 41 -36 2 80 13 -55 55 125 55 -20 15 87 54 11 16 72 -3 27 4 33
4632 33 -45 -40 11 24 -14 0 44 -82 -82 28 76 -77 -14 5 52 -33 -23 44 62 -65 -37 -38 -42 -47 -7 19 -61 7 45 22 -92
4663 -92 -18 -10 -29 -33 22 42 -16 -12 -22 41 -24 -24 -30 21 -26 -2 -9 -45 -54 -22 2 -24 -65 -14 -13 -40 -39 13 -5 -78 17 7 -28 12 -24
4698b4Q8q6M1M0l0l8O1j4k3l7K1M9l2m8L8J6Om2R2o5m6L7J1J9m0QRl9M9k6j6n
4730b6L0L7o5K4J6k0L5o1N3o9K3l2Q6n8L2o5N6L8r2N9K0n2pQ7m9j8r3J27n5o0
4760i9M6P1o5p2R4M4q1J9K6M2J1p1K6R0j02j0L1J3l2P4j7kr9M7M6Kl1N0k6j6O
4791A5m9O0q4N9j1K3o3J6n0O3k8Q4km6jJ5Mm3Q9k8km2J11qj23O9N1j26KJ1J08
4822G4o9m1O6r5J13j46P1K5j04O5KL8o4rR1j10O2K6j1j6l5P6mj4n6O3m8M6k5L6
4852Gp7J6N5Rn7k7O8L6k4%R1j3q4O6j0n9n9M4J3lpM3m3Mj4O1n2O4J6k0k4p4P8
4885B4L6o2%J19j13l7J10l1j4l9N9n7RJ3K1k8l6QL4l5K2M7Q2j46p6J19J2m3Nq
4915ej5k9M9M5q0QML2q4R0m1L7p1K1O3J1j53J12L2j8n2L4l4N1q5J01j0q0pN7j7
$$ plain form
4698 -24 64 -22 19 59 29 -9 52 38 15 -22 -1 48 16 -32 6 22 28 -14 78 13 -33 4 15 34 -6 2 11 -28 21 -5 -21 -26
4730 -26 4 41 -24 0 16 -4 31 -30 23 -46 -23 -55 31 -27 5 -60 -4 34 -58 1 21 -31 -38 49 0 -18 -111 16 -39 -99
4760 -99 -53 18 -47 -119 -25 19 -62 -43 -17 25 36 -35 -9 81 -21 -31 0 13 -19 55 38 36 -63 -16 30 32 1 51 25 9 15
4791 15 -34 26 -58 1 -10 13 -50 -34 -84 -21 -49 35 33 -13 -14 1 5 -38 51 23 21 -21 90 82 -41 28 79 -47 -45 -34 74
4822 74 5 -36 30 -65 48 -98 -27 -2 -106 -41 -39 -1 -65 -74 17 -93 -31 -5 -16 -32 -67 9 5 -9 -65 -2 -50 -4 -29 7
4852 7 -70 -54 1 10 -47 -74 -6 30 6 6 97 84 0 66 56 -3 -62 -18 -5 -8 -15 28 -15 -11 -25 36 -16 48 64 44 20 -54 24
4885 24 60 -2 -2 117 4 -33 77 46 32 -7 52 -5 4 17 38 10 -26 -18 16 -19 3 50 132 -14 -90 29 41 -2 3 -5
4915 -5 -20 -49 0 45 -35 -27 -23 9 -75 15 -26 11 -60 -39 24 35 -118 -6 26 8 -44 -10 -44 7 -78 23 13 -67 -74 -17 -34
4946c4m7O8J16p1o8R7k7m6QN8J7r8L4j1K9k6oR6p2l1oM9M8q9L9lm6P2pj0q1k8
4978g6J15l2n3k3N9q4R3j4K5j9q4P6PK0k7K5nn8J37l6p2QL6k6j4JJ09r9l4ON9
5009B0l1j6noN2l9L2jM3l1k5J0j1k8L3j4j3O5n4j4RJ7n0N5j5O1o8j7N5N0o2k9
5041b7P3J5j58J39j08N2j0K5M7j23L1O9n5j0N9K4M2m9K8qj7p0R1p2pOR2q2k0L9
5071A6rMo0M7M1n8K6m0N9M0r7M3k4j2o4J23k9l4N6k3j9n0N0j9j0J3P6lq2k0N1
5102ho8L9N0mj4j0N7P2j28m1k9P4J8l9J22m7l8J9j4J9m1j7K2j0j8P7m6M6j6Nm8
5133a6j6Q9l5jq3J01n7J8J8nk9l5P1JLm2Q4o6K7o7N8O9j02J8JK7q4Q4N0k4j28
5164g1J35qm4k5L9Nj12l6O2K0m0J04m7J4l8R5q2N4K4q5N1m4K2j4K2l3Q1o2m0k
$$ plain form
4946 -34 -81 -13 103 32 -36 61 34 -12 -4 54 71 -27 7 -4 25 -1 -7 89 17 -14 -20 29 77 -12 27 24 -22 50 43 33 -48 -76
4978 -76 39 7 -46 -69 -10 -94 -1 -15 10 -9 -93 -17 -10 10 -17 8 3 -55 82 46 -26 -18 18 -8 -22 -21 88 -11 -45 -39 20
5009 20 -11 -27 -32 -38 14 -25 7 6 49 18 -7 3 -8 -36 -3 -17 -30 35 -19 -33 -24 -7 -57 -2 -17 44 -24 -41 14 64 2 -27
5041 -27 46 61 -97 42 -66 -14 -24 1 48 -75 -44 25 -30 -40 19 43 85 36 64 56 39 -31 60 -12 -19 -13 79 -3 -23 16
5071 16 7 11 -49 -2 39 -19 7 -33 26 66 -31 12 -12 -24 -88 35 6 -28 28 5 -14 -64 -14 -33 -43 -30 46 43 -39 -59 -8
5102 -8 -76 -37 13 9 -5 -15 42 114 -14 -55 -84 -10 8 -31 91 44 6 25 11 30 -11 -28 -6 -16 -34 43 -3 43 27 32 -16
5133 -16 -32 57 22 21 -62 39 -18 0 18 13 -16 -51 20 21 24 -18 66 0 27 -40 18 87 -15 3 4 31 -53 31 81 57 -71
5164 -71 64 56 12 -13 26 31 -81 -117 -55 -35 -75 29 -18 -4 -42 53 -29 25 49 -36 15 -29 -7 -21 1 -32 49 -13 -53 -55
5194e5J2K0n6L0Q2j05P1j0M2l5p5R2m1M7j9J6Kl7K4M2Mj2J4j9J9o2M1l1j4n4N7
5225a0P0p3J00m8k2l2N6m1Rr3RJ00l2J4l5K7o3M6q9N9l5N9K7n7k9R0J06j08k4
5254a9N3l0p2J14o2J4k2M4n8K6P0p9KJ9M8n3M3k4M9k6n4j9L7L4q9J5J1M%m8P2
5285@J5n0M2K3j15P4J0J2o2N9M1Pj26R9o5O9m5L7M6j17M8M4L7o0j4K8Op4N9j1
5315A7K7j0m0L1p0J06l1j5K2p0R0p0m5J17m2j5n2PJ3j0o8P5J05k6j06Q8l9Qn1
5344e4Q3j08J3J00m4k2j5N6m3lk2R2o2k5L5K9k0n3J19l8k6l0L8L4OJ2L0n9n6j0
5374d3N4kl5LJ07j11M9j5j9M2m4J8n1l7O6N7n5NnK1K5k5k0N1Rl4%M6j32N9k0j3
5406d9O2J9j4n5J02o4K9PJ4o5J0K1j2R3j09l3O8l3J4k3jN4q9M7Mm0J18r5k2MN5
$$ plain form
5194 -55 -43 -23 -79 -49 33 -72 -1 -11 31 -4 -79 13 -28 19 0 16 18 -19 5 47 51 39 53 34 53 -9 32 1 -13 -67 -10
5225 -10 60 -13 87 39 17 -15 41 0 9 -84 -75 25 -7 7 -28 -1 -64 -18 -107 -48 -83 -24 3 -54 -83 7 113 5 -19
5254 -19 34 4 -68 46 -16 -2 -24 20 -38 -12 58 -21 -19 0 48 -5 38 14 63 37 -17 -36 1 35 -54 -39 -28 -24 -24 -72 0
5285 0 15 -35 7 30 -85 -11 -1 11 -51 8 49 56 -70 29 -36 33 -12 25 71 -46 2 46 83 23 9 37 43 -31 28 17
5315 17 44 34 -6 25 -45 61 30 15 37 -33 57 -13 -58 59 17 2 -50 -43 -30 -40 -108 -33 72 46 -60 28 -11 -3 -54
5344 -54 29 -79 -66 34 -10 -32 -47 9 -34 -37 -59 33 -29 -54 -19 10 -10 -63 56 18 -8 -38 0 34 40 52 82 23 -33 -43
5374 -43 11 9 -26 -23 84 -27 22 7 -12 30 -14 4 -47 -84 -18 39 -16 -11 -16 5 30 5 -15 36 45 11 11 57 -75 -16 -36 -49
5406 -49 13 32 18 -37 65 1 30 37 51 -14 -4 17 5 98 -11 -44 24 -9 5 -18 -19 35 -54 -7 -3 -43 75 -20 -42 -38 17
5437A7m6km6O5m5rk8O0J26j02m8L9M1mM3l6J2l9OJ07r6m7O9r6M8k8L2L5l2K7R
5468C2k1oL2m2K6KL6n7Kl3Qj6O2m5j1O6j01O3Po3N4j6M8n9K6L8l4q7J3L7Q0l9
5500Bp0Q1n2L5NoKj1J6k2No4J07n3J5J2pK0k9qrKk5N9P4j05lJ8k0qn3P5k0K3N0
$$ plain form
5437 17 -29 -31 -77 -12 -57 -66 -94 -34 92 -10 -58 -19 22 18 61 25 37 -2 4 111 15 -32 37 -59 -11 -39 -7 28 -4 23 32
5468 32 11 5 37 -5 21 23 59 2 4 -29 -21 -37 25 -20 -31 35 -66 -3 4 -59 -5 -21 27 -32 -6 32 -2 -89 -76 -39 41 2
5500 2 -68 13 -39 -4 1 -5 -3 -14 2 -20 -15 -79 28 -25 -10 2 -5 15 -14 -22 -31 -29 -54 5 79 -26 -29 -11 -31 -39 -92 -17 -37 -14 36
$$ [...]
8191h
##END NTUPLES=NMR FID
##END=
