##TITLE=1H_BAU-13022P
 CDCl3, 8 sc, 
 13.2.2019
##JCAMPDX= 6.0         $$ Bruker NMR JCAMP-DX V2.0
##DATA TYPE= NMR FID
##DATA CLASS= NTUPLES
##ORIGIN= UXNMR, Bruker Analytische Messtechnik GmbH
##OWNER= root
$$ XWIN-NMR		Version 3.5
$$ Wed Feb 13 14:27:12 2019 Russian Standard Time (UT+4h)  she@DPX200
##.OBSERVE FREQUENCY= 200.1313
##.OBSERVE NUCLEUS= ^1H
##.DELAY= (6, 6)
##.ACQUISITION MODE= SIMULTANEOUS
##.ACQUISITION SCHEME= undefined
##.AVERAGES= 8
##.DIGITISER RES= 18
##SPECTROMETER/DATA SYSTEM= spect
##.PULSE SEQUENCE= zg30
##.SOLVENT NAME= CDCl3
##.SHIFT REFERENCE= (INTERNAL, CDCl3, 0, 15.7039)
##AUDIT TRAIL= $$ (NUMBER, WHEN, WHO, WHERE, WHAT)
$$ ##TITLE= Audit trail, XWIN-NMR		Version 3.5
$$ ##JCAMPDX= 5.01
$$ ##ORIGIN= Bruker BioSpin GmbH
$$ ##OWNER= she
$$ F:/spectra/data/she/nmr/H-F/1/audita.txt
$$ ##AUDIT TRAIL=  $$ (NUMBER, WHEN, WHO, WHERE, WHAT)
(   1,<2019-02-13 14:25:57.92 +0400>,<she>,<DPX200>,
      <created by zg, POWCHK disabled, PULCHK disabled
       configuration hash MD5:
       00 E9 B6 7A A2 85 ED C7 34 08 36 98 17 FE 4E 26
       data hash MD5: 16K
       A2 1D 54 21 81 AC 61 C7 D0 3C DF 06 A7 EA 99 AF>)
$$ ##END=
$$ 
$$ hash MD5
$$ 27 FA 44 97 5D 2D 7C 4C C2 19 8E FF 0B 36 3D 01
##$RELAX= 
##$RELAX= 
##$RELAX= 
##$RELAX= 
##$RELAX= 
##$RELAX= 
$$ Bruker specific parameters
$$ --------------------------
##$DU= <F:/spectra>
##$EXPNO= 1
##$NAME= <H-F>
##$PROCNO= 1
##$TYPE= <nmr>
##$USER= <she>
##$AMP= (0..31)
100 100 100 100 100 100 100 100 100 100 100 100 100 100 100 100 100 100 
100 100 100 100 100 100 100 100 100 100 100 100 100 100 
##$AQSEQ= 0
##$AQ_mod= 1
##$AUNM= <au_zg>
##$AUTOPOS= <>
##$BF1= 200.13
##$BF2= 200.13
##$BF3= 200.13
##$BF4= 200.13
##$BF5= 200.13
##$BF6= 200.13
##$BF7= 200.13
##$BF8= 200.13
##$BYTORDA= 1
##$CFDGTYP= 0
##$CFRGTYP= 5
##$CHEMSTR= <none>
##$CNST= (0..31)
1 1 145 1 1 1 1 1 1 1 1 1 1 1 1 1 1 1 1 1 1 1 1 1 1 1 1 1 1 1 1 1 
##$CPDPRG= <>
##$CPDPRG1= <>
##$CPDPRG2= <>
##$CPDPRG3= <>
##$CPDPRG4= <mlev>
##$CPDPRG5= <mlev>
##$CPDPRG6= <mlev>
##$CPDPRG7= <mlev>
##$CPDPRG8= <mlev>
##$CPDPRGB= <>
##$CPDPRGT= <>
##$D= (0..31)
0 1.2 0 0 0 0 0 0 0 0 0 0.03 0 0 0 0 0 0 0 0 0 0 0 0 0 0 0 0 0 0 0 0 
##$DATE= 1550053557
##$DBL= (0..7)
120 120 120 120 120 120 120 120 
##$DBP= (0..7)
150 150 150 150 150 150 150 150 
##$DBP07= 0
##$DBPNAM0= <>
##$DBPNAM1= <>
##$DBPNAM2= <>
##$DBPNAM3= <>
##$DBPNAM4= <>
##$DBPNAM5= <>
##$DBPNAM6= <>
##$DBPNAM7= <>
##$DBPOAL= (0..7)
0.5 0.5 0.5 0.5 0.5 0.5 0.5 0.5 
##$DBPOFFS= (0..7)
0 0 0 0 0 0 0 0 
##$DE= 6
##$DECBNUC= <off>
##$DECIM= 32
##$DECNUC= <off>
##$DECSTAT= 4
##$DIGMOD= 1
##$DIGTYP= 9
##$DL= (0..7)
0 120 120 120 120 120 120 120 
##$DP= (0..7)
150 150 150 150 150 150 150 150 
##$DP07= 0
##$DPNAME0= <>
##$DPNAME1= <>
##$DPNAME2= <>
##$DPNAME3= <>
##$DPNAME4= <>
##$DPNAME5= <>
##$DPNAME6= <>
##$DPNAME7= <>
##$DPOAL= (0..7)
0.5 0.5 0.5 0.5 0.5 0.5 0.5 0.5 
##$DPOFFS= (0..7)
0 0 0 0 0 0 0 0 
##$DQDMODE= 0
##$DR= 18
##$DS= 0
##$DSLIST= <SSSSSSSSSSSSSSS>
##$DSPFIRM= 0
$$ [...]
##$SUBNAM2= <"">
##$SUBNAM3= <"">
##$SUBNAM4= <"">
##$SUBNAM5= <"">
##$SUBNAM6= <"">
##$SUBNAM7= <"">
##$SUBNAM8= <"">
##$SUBNAM9= <"">
##$SW= 20.0189088683792
##$SWIBOX= (0..15)
0 0 2 0 0 0 0 0 0 0 0 0 0 0 0 0 
##$SW_h= 4006.41025641026
##$TD= 16384
##$TD0= 1
##$TE= 0
##$TE2= 300
##$TE3= 300
##$TEG= 300
##$TL= (0..7)
0 120 120 120 120 120 120 120 
##$TP= (0..7)
150 150 150 150 150 150 150 150 
##$TP07= 0
##$TPNAME0= <>
##$TPNAME1= <>
##$TPNAME2= <>
##$TPNAME3= <>
##$TPNAME4= <>
##$TPNAME5= <>
##$TPNAME6= <>
##$TPNAME7= <>
##$TPOAL= (0..7)
0.5 0.5 0.5 0.5 0.5 0.5 0.5 0.5 
##$TPOFFS= (0..7)
0 0 0 0 0 0 0 0 
##$TUNHIN= 0
##$TUNHOUT= 0
##$TUNXOUT= 0
##$USERA1= <user>
##$USERA2= <user>
##$USERA3= <user>
##$USERA4= <user>
##$USERA5= <user>
##$V9= 5
##$VALIST= <valist>
##$VCLIST= <CCCCCCCCCCCCCCC>
##$VD= 0
##$VDLIST= <DDDDDDDDDDDDDDD>
##$VPLIST= <PPPPPPPPPPPPPPP>
##$VTLIST= <TTTTTTTTTTTTTTT>
##$WBST= 1024
##$WBSW= 4
##$XGAIN= (0..3)
0 0 0 0 
##$XL= 0
##$YL= 0
##$YMAX_a= 70945
##$YMIN_a= -79864
##$ZGOPTNS= <>
##$ZL1= 120
##$ZL2= 120
##$ZL3= 120
##$ZL4= 120
##$ABSF1= 10
##$ABSF2= 0
##$ABSG= 5
##$ABSL= 3
##$ALPHA= 0
##$AQORDER= 0
##$ASSFAC= 0
##$ASSFACI= 0
##$ASSFACX= 0
##$ASSWID= 0
##$AUNMP= <proc_1d>
##$AZFE= 0.1
##$AZFW= 0.1
##$BCFW= 1
##$BC_mod= 2
##$BYTORDP= 1
##$COROFFS= 0
##$CY= 11.3945322036743
##$DATMOD= 1
##$DC= 2
##$DFILT= <>
##$DTYPP= 0
##$F1P= 18.9103706918063
##$F2P= -1.10871071338519
##$FCOR= 0.5
##$FTSIZE= 0
##$FT_mod= 4
##$GAMMA= 1
##$GB= 0.15
##$INTBC= 1
##$INTSCL= 1
##$ISEN= 128
##$LB= 0.24
##$LEV0= 0
##$LPBIN= 0
##$MAXI= 10000
##$MC2= 0
##$MEAN= 0
##$ME_mod= 0
##$MI= 1.114404
##$NCOEF= 0
##$NC_proc= 0
##$NLEV= 6
##$NOISF1= 3.799351
##$NOISF2= 2.8
##$NSP= 1
##$NTH_PI= 0
##$NZP= 0
##$OFFSET= 15.70392
##$PC= 1
##$PHC0= -9123.139
##$PHC1= 6.600142
##$PH_mod= 1
##$PKNL= yes
##$PPARMOD= 0
##$PSCAL= 0
##$PSIGN= 0
##$REVERSE= no
##$SF= 200.130013532006
##$SI= 16384
##$SIGF1= 3
##$SIGF2= 2
##$SINO= 400
##$SIOLD= 16384
##$SREGLST= <1H.CDCl3>
##$SSB= 0
##$STSI= 0
##$STSR= 0
##$SW_p= 3612.71676300578
##$SYMM= 0
##$S_DEV= 0
##$TDeff= 0
##$TDoff= 0
##$TI= <>
##$TILT= no
##$TM1= 0
##$TM2= 0
##$TOPLEV= 0
##$USERP1= <user>
##$USERP2= <user>
##$USERP3= <user>
##$USERP4= <user>
##$USERP5= <user>
##$WDW= 1
##$XDIM= 8192
##$YMAX_p= 0
##$YMIN_p= 0
$$ End of Bruker specific parameters
$$ ---------------------------------
##NTUPLES= NMR FID
##VAR_NAME=  TIME,          FID/REAL,        FID/IMAG
##SYMBOL=    X,             R,               I
##VAR_TYPE=  INDEPENDENT,   DEPENDENT,       DEPENDENT
##VAR_FORM=  AFFN,          ASDF,            ASDF
##VAR_DIM=   8192,          8192,            8192
##UNITS=     SECONDS,       ARBITRARY UNITS, ARBITRARY UNITS
##FACTOR=    0.0002496,     1,               1
##FIRST=     0,             0,               0
##LAST=      2.0444736,     0,               0
##MIN=       0,             -79864,          0
##MAX=       2.0444736,     70945,           0
$$ Real data points
##PAGE= N=1
##DATA TABLE= (X++(R..R)), XYDATA
0@%%%%%%%%%%%%%%%%%%%qJ6j6J6j6J6j6K4l2L2l2M0m8N2o0O8p6Q7r5J04j20J35
41G1j49J64j82K00k20K43k67K96l28L60l93M33m80N29n85O52p29Q18r21J045j200
62f43J397j656K014k544L399n000Q963l5563n0231J06742J9155p5689J9047O3074
76E2465n6957n3856N9556L5758m6344N248L4814m1486l3712N6264K1585m9634
88a6299N282M2503l5053l7403M7381K6151m3980j377L5672k4678k9005L9088J6526
101B4808l9519M795L5581k7392l0152L9703J8226m1517L066L9189k5489l4543
113c3244L9341K1921m4181o52M5350k0488m2632L2647L0637l6489r316L7524j2130
126H288l5247K5586K3954l2044l213L6858j8476l9333L2324L2716l8483j5125
$$ plain form
0 0 0 0 0 0 0 0 0 0 0 0 0 0 0 0 0 0 0 0 0 -8 8 -8 8 -8 8 -8 16 -16 16 -16 24 -24 28 -32 36 -40 47 -48 56 -64 71
41 71 -78 86 -96 104 -116 127 -140 156 -172 188 -205 228 -252 277 -308 344 -385 433 -488 557 -643
62 -643 754 -902 1112 -1432 1967 -3033 5930 -29633 -79864 26878 46033 -29656 -10609 52465
76 52465 -4492 -58348 1208 36966 -9378 -4130 30684 -10802 -44514 11750 33335 -16299
88 -16299 -11017 31486 -3567 -40970 6411 32562 -11418 -12795 22877 -1801 -30806 8282 24808
101 24808 -14711 -9916 25665 -1727 -31879 7824 26050 -15467 -12401 26788 1299 -33244
113 -33244 6097 28018 -16163 -16815 28535 8047 -34585 -1938 28699 -7790 -17106 20418 8288
126 8288 -26959 -1373 22581 -9463 -12676 24182 5706 -33627 -1303 31413 -7070 -22195
138b2195M2288n612m4001J9604L7428k5501j9570K8793k549l1362J8943K8081
150B4347k6839j4734L1024m075l4275J9486L2607k7698k1680L1442L978l3313
162a9730J2825L0800k3943k0665K9810M561l2029J1843K9695k4208k1107L1875
174I727P777l4933O812L2493k0056k4339L0545J2565l6018M33L3963j4137k5309
187b0477K7155J4144l5074k973L3586r565k4329K3612J3657l3875m534L4382n865
200I844k5909J9612J5551l1834p256L4893j831k7740J4815J6858k8089p860L3498
213A4552n90k8193J2057J7636k4841q377L1952P66k9217R058K0289k1008j1310
226a7226K9483L594k9504N782K2639j7231j3956K6104N433k7899M172K3088j4881
$$ plain form
138 -22195 20093 14481 -29520 -9916 27512 2011 -17559 11234 8685 -22677 -3734 24347
150 24347 -2492 -17226 13798 9723 -24552 -5066 27541 -157 -21837 9605 13583 -19730
162 -19730 -6905 23895 -48 -20713 9097 13658 -18371 -6528 23167 -1041 -22148 9727
174 9727 17504 -17429 -10617 21876 1820 -22519 8026 20591 -15427 -14994 18969 4832 -20477
187 -20477 6678 20822 -14252 -17225 16361 6796 -17533 6079 19736 -14139 -18673 15709 9844
200 9844 -16065 3547 19098 -12736 -19992 14901 13070 -14670 145 17003 -11086 -18946 14552
213 14552 13962 -14231 -2174 15462 -9379 -17756 14196 14962 -14255 -5197 15092 -5916 -17226
226 -17226 12257 15851 -13653 -7871 14768 -2463 -16419 9685 15118 -12781 -8609 14479 -402
239d02j5392K3183O820k5959K876K3546j2899j7957K0657J0121k4091r8K3640
252A4045j0343k0072J8116J3009k1747k554K2076q565k0013J6365J4354j9572
264d901m626K0006o396j9096J4354J5433j7592p235J8221l533j8049J2411J5786
277A4783j6612r053J7353j295j6953J0862J5155j5994r925J6732R20j5769Q573
290a223J4272j4615j0607J6215L399j5497N756J4316j2937j1620J6028N664j5891
303f740K759J4333j0431j1512J4562O410j5037P28J3190q028j0183J3149O034
316I234j4920m69J3727o048j0759J1951O995j5110k250J4640l668j1424R713P210
330H822j3792k685J4152k304j1327P535P078j1770k949J3360j039j1632N375P746
$$ plain form
239 -402 -15794 7389 14209 -11750 -8874 14672 1773 -16184 4473 14594 -9497 -9595 14045
252 14045 3702 -16370 1746 14755 -6992 -9546 12530 3965 -16048 317 14671 -4901
264 -4901 -9527 10479 4083 -15013 -659 14774 -2818 -10053 8168 4635 -13414 -1003 14783
277 14783 -1829 -10882 6471 5176 -11777 -915 14240 -1754 -11679 5053 5973 -9796 -1223
290 -1223 13049 -1566 -12173 4042 7441 -8056 -2300 12016 -921 -12541 3487 9151 -6740
303 -6740 -3981 10352 -79 -11591 2971 9381 -5656 -4928 8262 234 -9949 3200 9234
316 9234 -5686 -6155 7572 1524 -9235 2716 9711 -5399 -7649 6991 3323 -8101 1612 8822
330 8822 -4970 -7655 6497 4193 -7134 401 7479 -4291 -7240 6120 5081 -6551 -1176 6570
344F570r730l403J2546m74j2112M386Q595q495l976J1650j39j1998L598R165p046
359h63m789R974O57j1129K750R679n899o284Q823K284j0608J480J0297m725p664
374f017P423L658r168N05R282l893p450O261M033p738j45Q223l191p416N436N018
390D821o791j380P521k310p327M964N613o329k183O899j775o833M649N655n861
405f67k934O098p47o117L769N598n285l823N765O56n968K652N895m776m688N550
421I78K028n610J331N380l859m479M853K501m866K57M625k821m204M242L046m588
437a186r62M416j567m003L568L179m392j498M186q15l503L016K706m126j631L968
453A356k1l164J977K401l493j746L803O40l205J183K345l063j658L978Q33l546
$$ plain form
344 6570 -3160 -6563 5983 5509 -6603 -2217 6378 -2117 -6093 5557 5418 -6580 -2982 6183 -863
359 -863 -5652 4322 4979 -6150 -3400 6279 380 -5904 2919 5203 -5405 -3925 6372 1647 -6017
374 -6017 1406 5064 -4104 -3599 5683 1790 -5660 601 4634 -3104 -3249 4974 1783 -5633 -197 4821
390 4821 -1970 -3350 4171 1861 -5466 -502 5111 -1218 -3401 3498 1723 -5110 -461 5194 -667
405 -667 -3601 2497 1750 -4367 -598 5000 -285 -4108 1657 2313 -3655 -1003 4892 116 -4572 978
421 978 3006 -2604 -1273 4107 248 -4231 622 3123 -1743 -1486 3139 318 -3886 356 3402 -1186
437 -1186 -2148 2268 701 -3302 266 3445 -947 -2445 1741 926 -2577 439 3145 -981 -2612 1356
453 1356 1335 -1829 148 2549 -944 -2690 1113 1753 -1452 -269 2076 -987 -2645 1333 2166 -1380
469a380O58K437k427j484L602Q06l479J47K492j652j537L032R46l566k94L099
485A400r58k212K465J407l394o57L317l81k441J661J455k644o52K965j40k490
501a299J041J675k021q77K697J43k794O07K205j526j220K380K16k750N35K380
517A392j177j313J877J94k416N39K426r20j701J436N97k196K85K628p69k260J235
534a43J128j987M4K584p13k451J093J481j593k83K232m73k414Q00J911j219r09
551i12J898ok386N36K231j043j422J642L64k128M04K130r28j519J328O42j693
568h62K22J873q16j624J204J042j578j54J850o60j894J237J425j572n40J745m64
585D34j796J164J491j421p88J519j28j624R28J613j304j213J486L68j638N84J702
$$ plain form
469 -1380 -722 1715 -712 -2196 1406 2212 -1267 -1120 1372 -280 -1817 1215 2161 -1405 -1699 1400
485 1400 442 -1770 695 2102 -1292 -1949 1368 987 -1454 207 1662 -982 -1634 1331 1191 -1299
501 -1299 -258 1417 -604 -1481 1216 1359 -1435 -828 1377 -149 -1369 1011 1227 -1523 -988 1392
517 1392 215 -1098 779 973 -1443 -904 1522 602 -1099 337 934 -1262 -977 1651 882 -1378 -143
534 -143 985 -1002 -958 1626 913 -1538 -445 1036 -557 -840 1392 919 -1495 -695 1216 -3 -912
551 -912 986 980 -1406 -870 1361 318 -1104 538 902 -1226 -822 1308 380 -1139 189 831 -862
568 -862 -640 1233 417 -1207 -3 1039 -539 -693 1157 497 -1397 -160 1265 -307 -847 898 434
585 434 -1362 -198 1293 -128 -916 603 475 -1149 -221 1392 88 -1125 361 729 -909 -325 1377
602A377j212j430J421O42j503L50J505j081j334J316Q02j335M3J363p82j342J210
619A0J029j326l12J384n07j375J132J084j370m97J372l26j237R72R53j284n10
636h08J281j18j118P64Q99j195n61J358P2j252N91R84j161o23J447J47j359M31
654b21R83j032n51J362J22j338L13R86p86n77J249K15j386J55J185o18p41J132
672D52K95j393Q7J266n13p85R39K49j247J44J190m61q33P91L29j119J18J230m25
691C14j030P77N37j075LJ264m39j118P70O52j016r4J155m34j078P43P33r35k35
710e06J039k80j046O88Q36q87m29J036j38j016O51Q58r30m76J009p4r25N73P76
729G59r29n12J003P5r37M33Q09q39o25J027K78r79K29Q40p05o28R86L24r67J14
$$ plain form
602 1377 165 -1265 156 798 -705 -355 1150 69 -1265 51 853 -482 -439 924 142 -1200 10
619 10 1039 -287 -599 785 278 -1097 35 1119 -251 -748 624 298 -939 33 986 -298 -808
636 -808 473 355 -763 1 900 -295 -856 502 574 -678 -87 897 -264 -887 560 707 -652 -221
654 -221 762 -270 -821 541 663 -675 -362 624 -162 -739 510 725 -661 -506 679 61 -680 452
672 452 747 -646 -559 707 194 -591 348 597 -650 -506 684 223 -610 181 510 -609 -491 739 314
691 314 -716 61 598 -477 -474 790 351 -767 3 655 -361 -455 700 266 -812 -69 664 -271 -506
710 -506 533 253 -793 -105 731 -156 -585 451 313 -703 -52 806 -124 -600 409 335 -590 -17 759
729 759 -170 -682 321 396 -541 -108 701 -138 -763 264 542 -437 -208 632 -73 -701 285 609 -358 -244
749b44P64n86n20Q70K61r19N2P57m75n19Q02K80r37jQ43l72n70P59K75r30J6Q90
771D96l38o12O54K63q34QQ29k63o50N22L34p48l3Q04k15o97M66M15o65m9P56k54
793A89o54M80M04o13l3O45k65o12M48M31n65j51O13j90o19M43M95n74k29O14j32
814A25n70M57M62n99k06N93j16m94M12M08n80k66N96k7m95L12M12n68l05O47N0
835B48n49K71M00n47k22O72J2n63K44L74m80k05O37K7n96J65M33m18k45O16K4
856B98o63J54N39l85k77N86K0o71K08N58l53l05N24L0o06J68N96l09m24M49J37
877B74n87J12O31l06n45M60K38n54R3O03l30n37M56L10n07L5N50l02n36M23M09
898C90m69j24N04k11n53M46M67n25k28N13j33n13M39M54n58k55N24m1m31L44L90
$$ plain form
749 -244 520 -66 -586 284 545 -374 -322 435 -40 -559 243 523 -414 -415 428 56 -514 245 520 -410 -394 496
771 496 158 -454 200 463 -371 -363 466 203 -447 75 409 -339 -372 432 217 -480 -14 401 -264 -313 443 189
793 189 -465 15 419 -194 -227 418 153 -459 -11 420 -145 -296 317 127 -492 -49 446 -128 -357 257 125
814 125 -445 12 474 -125 -331 262 146 -348 64 472 -108 -374 222 195 -300 12 424 -144 -449 198 248
835 248 -301 -30 370 -177 -399 273 285 -278 -34 340 -140 -345 292 319 -277 -112 321 -97 -342 274 298
856 298 -365 -211 328 -57 -334 252 272 -399 -191 367 14 -291 233 263 -343 -175 421 112 -312 137 274
877 274 -313 -201 430 124 -421 39 277 -277 -184 419 89 -448 8 318 -189 -154 396 94 -442 -19 390
898 390 -79 -203 301 90 -463 -17 450 -75 -303 210 77 -436 3 457 -101 -356 168 127 -304 40 430
919D30m92l11N33J14m99K05M02m59l43N90J54n59J24L96m13k58N96J31n67L1M26
940B31k56k65M89J71n90p3N21j34l19L99J62o06o0N82r5l85L16J43n45j7O09o9
962B09m30K08J93m14kN55k9n24J44K95l43o1N60r3n93J79L72l20p9M70j12n66
984c81K07M27k56j71L84n0n04J86M91k31l35L56P6m91J59N24l02l88L51J26m31
1005b53J39M55l00l87L36K06l58M4M08k37m10L60L30m10p9M35k16m29M10L60m88
1026h4j40M32j64l79L88L42m89k12M37l7l76L20L58m90k97N32Q8m64K35M04n14
1047a10l33O19J42n31J67L80m65k96N93J84n47NM47l13l54N59K99o50r9N96k11
1068H2m32N11K92o70j24O18j08m47L84K45n93j15O19m3n01K78L17n46j59P08L
$$ plain form
919 430 -62 -373 160 274 -225 -20 382 -77 -420 170 324 -235 -111 285 -128 -386 210 341 -226 -195 231
940 231 -25 -290 199 370 -220 -293 228 94 -225 174 336 -270 -330 252 157 -228 88 231 -314 -331 278 209
962 209 -221 -13 180 -234 -236 319 290 -234 -90 205 -138 -199 361 268 -325 -146 226 -94 -173 297 185 -381
984 -381 -174 253 -3 -174 210 160 -344 -158 333 102 -233 123 199 -292 -133 391 89 -299 52 178 -253
1005 -253 -114 341 41 -346 -10 196 -162 -118 290 53 -357 3 333 -77 -156 279 63 -366 44 404 -84
1026 -84 -224 208 44 -335 53 395 -94 -306 131 94 -282 38 396 -94 -391 141 229 -235 0 404 -110
1047 -110 -443 176 318 -213 -46 334 -131 -427 166 350 -197 -192 255 -58 -412 147 446 -204 -303 293 82
1068 82 -350 161 453 -217 -341 277 169 -278 106 351 -242 -357 262 219 -282 -4 313 -233 -392 316 319
1089C19o46K29M36n16j64P14j9p06J90M79m11j82O05k5p15J50N98l21l16N45O2
1110C06p60J37P48k96m54N13J04p29J62P68l06n28M32J61o06J11P14k64o22L74
1130c5L21n40KO90k35p05M22M45n44o6O65k71o53M72M64n41j28N82k26n85M42
1151b4N20n94k83O42p3o65M41N74o56l62P44ko85M14N49o78l40P41O5o83L03N45
1173D93n99m05P48J91p65J37O41m97m91P89K29q43R2P03m67m39P53K01q42P8O97
1194D04l64m52O60K23q35j1P74k79n72O17K99q62l4Q97k89o55O20L16q63J3R31
1215E38l14p06N67L88q09o0R26k18q52N01N59p67k02R46j75r40N04O88p88k68
1235d82R51j60r29M89P32p21l60Q68l6q98L53P92o06n14P90J11q84K87Q34o24
$$ plain form
1089 319 -327 -98 338 -178 -342 372 353 -353 -163 316 -95 -277 328 303 -412 -262 336 15 -301 244 306
1110 306 -454 -317 431 135 -319 194 298 -431 -269 499 193 -335 97 258 -348 -237 477 213 -409 -35
1130 -35 286 -254 -252 438 203 -502 -80 365 -179 -245 420 149 -504 -32 432 -109 -237 345 119 -466 -24
1151 -24 496 -98 -381 261 188 -477 -36 538 -118 -480 264 262 -423 -9 540 -138 -478 263 328 -355 -52 493
1173 493 -106 -511 237 428 -337 -200 441 -56 -547 242 471 -372 -280 423 -44 -483 270 471 -371 -293 404
1194 404 40 -412 248 471 -364 -375 399 120 -452 165 464 -398 -432 465 176 -479 141 457 -406 -393 538
1215 538 224 -482 85 473 -336 -396 530 312 -540 -39 520 -247 -449 497 322 -618 -114 574 -214 -482
1235 -482 469 309 -620 -131 601 -120 -480 388 352 -546 -193 599 -7 -521 269 380 -504 -217 617 -7
1255gn68Q16J42q80L06Q02o27n70Q16J89q44K25P93n71o26P97L25q86J05Q49n43
1276D3p04Q35L84r66Q5Q81n39p06Q66M19r76k8R23l93p37P63M84r62j56R67k65
1297B18p95O72N29r69j95J017k10q49O38N38r36j95J032j75q42N06N36q04k05
1316d89R87j23q90M42O29p96k50J030j20j028M45P35p70l00R96j25j018M32P84
1335E71p05l53R18n1j008M03Q72o61n23Q87N3j014L70R38o75o30Q89J17r58L56
1355b04Q87o83o19Q46J91q97K79Q61o36o82Q58L34r46J54Q91n90p27Q92L96r92
1375c87O8Q87n66o80Q85L74r88L4Q90m71o91Q33M36r98j04R87l21p98P49N15j024
1396c70j66J046k56q46O82N12r77j52J044k05q81N85N39q65k20J022j16r36M79
$$ plain form
1255 -7 -575 241 383 -497 -191 611 -16 -586 230 419 -425 -200 593 22 -604 193 518 -368 -263 586 43
1276 43 -661 174 558 -408 -323 558 19 -687 179 598 -378 -406 517 124 -613 150 634 -328 -484 483 218
1297 218 -577 95 624 -345 -540 477 267 -582 56 594 -342 -537 495 320 -522 -16 520 -284 -489
1316 -489 498 375 -515 -73 556 -240 -490 540 420 -608 -163 572 -198 -498 498 373 -645 -213 571
1335 571 -134 -487 431 380 -628 -225 647 -14 -537 350 403 -611 -241 697 22 -608 281 398 -560 -204
1355 -204 683 0 -619 227 418 -479 -200 661 25 -657 201 535 -411 -257 634 44 -683 209 605 -387
1375 -387 -319 568 2 -678 207 581 -407 -373 517 46 -645 188 624 -374 -478 509 188 -610 139 654 -370
1396 -370 -536 510 254 -592 90 602 -375 -527 517 312 -569 16 555 -310 -530 492 376 -560 -81
1415h1O49p82k71R91j09r84M61P07p70k82R54j49r53M52P35p06l55Q78n9r09L75
1436b08Q06o17m95Q16O3r02L44Q26o47n31Q13P9q61L68P86o68n51P98J50q21K77
1457a75P68n97n83P66K75q12J64P68n62o14Q10L02q59J22P57n35n99Q22L03q72
1477c51O4P43m45n69P37L34q49k6P97l62o15P06L87r09m8Q75l11o55O61L42q71
1498c65l0Q50k72o55N55L67p82o7Q50j84p55M82M75p40j26Q71j81q13M68N36p00
1519b16j44Q31k09p97M32N66o02k07P28j39p75L96O18n44l01O78p3p64L96O92
1539E66o10l87O97j4p25L96O45o03m15O45N5o41L05O04n53m66O53J69o56K11O21
1560D97n27n08P31K07o85J43N88m93m48O98K13o87O3N61l78m11O00K54o85k4N96
$$ plain form
1415 -81 568 -214 -485 506 397 -587 -126 581 -189 -471 483 334 -619 -167 568 -138 -493 385 326 -583 -208
1436 -208 598 -19 -514 302 365 -537 -193 633 -14 -545 268 347 -514 -146 640 -28 -579 219 369 -452 -175
1457 -175 593 -4 -587 179 454 -358 -194 574 12 -602 208 510 -349 -227 530 -5 -604 218 521 -351
1477 -351 -287 456 11 -558 179 513 -336 -362 435 73 -542 164 551 -358 -406 469 158 -497 164 506 -365
1498 -365 -395 455 183 -472 83 450 -332 -399 451 267 -488 -6 469 -271 -397 474 293 -520 -52 484 -216
1519 -216 -360 471 262 -535 -103 463 -139 -346 382 243 -532 -136 482 -62 -363 315 242 -522 -126 566
1539 566 -44 -431 266 252 -473 -77 568 -35 -450 195 250 -391 -86 518 -35 -501 152 321 -335 -124 497
1560 497 -30 -538 193 400 -285 -142 446 -47 -495 203 416 -271 -208 353 -25 -436 164 418 -267 -291 305
1581C05k78m45N80K54p28j8O56k25m65N32K20o80oO40k06m49M16K02n87j5O43
1602C46j68n18L50K89n46l2O52j62n76L58L15n09rN78k04n21L40K93m18m4N16
1623C30j91n10L15L55m13j07M85j42m96L21L95m19j59M68j22m49L47L46m38j50
1643b34M43r5l89K79L28l98k08M28J4m21K22L57m05k28M79L5m44K21L24m04j99
1664b95M76L3l96J30L02l27j90M12Q5m04O4L14k63k09M07R4m26N1L32k42j76L98
1686A70M2m08O3L04j84j30L06K1l71M5L01j27j77K59L9l57N0L55j36k18K51L2
1708A30l61J26L49j64k21J99K8k43Q8K72j18k47J37J14j67J0K31j07k46J38J51
1729I9j60L9J71j64j71K04Q7j32L8R2j56p8J91O8j28pM6j09m1K12L6j95j2J14
$$ plain form
1581 305 27 -418 162 416 -312 -330 326 101 -364 168 388 -292 -298 342 136 -313 103 305 -282 -297 346
1602 346 178 -340 10 299 -247 -279 373 211 -365 -7 308 -201 -210 368 164 -357 -17 276 -142 -186 330
1623 330 139 -371 -56 299 -114 -221 264 122 -374 -53 342 -77 -236 232 110 -339 8 354 -84 -234
1643 -234 209 114 -275 4 332 -66 -274 154 168 -253 -31 326 -79 -307 172 207 -237 -16 308 -96 -295
1664 -295 181 214 -182 -52 250 -77 -267 145 230 -174 -110 204 -59 -268 139 233 -193 -142 190 -52 -228 170
1686 170 212 -196 -133 171 -13 -143 163 184 -187 -142 159 32 -145 114 153 -204 -154 201 65 -153 98 130
1708 130 -231 -105 244 80 -141 58 86 -157 -69 203 85 -162 -25 89 -78 -68 163 56 -190 -52 99
1729 99 -61 -22 149 -15 -186 18 105 -27 11 103 -53 -131 60 128 0 -7 39 -70 -111 101 137 -58 -70 44
1753D4q5o0K24K0k39MJ40p3QJ50q0j81O0J22n7J2P6o0j55N9J42l3o7O9n4j27J27
1780a4J40j31m9Q6q0o9K03N2j99PR9q4k6J63J9k00j7J69n0q3J42L8k56QK52l2
1806H8j80J60K4k60O3K80q2j99J31M5k00M9K73r4k32P2J32j50RK38q0k80J31J65
1830A03j65QK36j60k47K05J64j91QJ80j36j99K02J46j78m1J78j26j83K34J78k72
1852e6q9K65j00k19K67J77l40q1K91q0k01K60J30l42o5K97l7k19J90J49l19j08
1874b30L54mk88J82J74l55m7M14n3l29J90J65l28k4M01o5l50J79J71k69m6L86
1896B28n9m01J57K90l08q2M20p6m72K21L55l41j13M07r6m21K25L50l17j76L80
1917A71l1m31K04M13l19k91L84P6m44J74M47l59l29M39R6m32J59M02l51l18M56
$$ plain form
1753 44 -41 -101 123 143 -96 -92 48 -25 -17 133 53 -128 -68 54 -3 9 85 25 -130 -71 71 38 -29 40 -14 -141 -14
1780 -14 126 -5 -54 32 -48 -117 86 138 -61 -54 45 -39 -65 98 117 -83 -100 69 19 -64 78 116 -140 -132 120 88
1806 88 -92 68 92 -168 -105 175 93 -106 25 70 -130 -81 192 98 -134 -62 70 -80 -71 167 87 -193 -62 103
1830 103 -62 -54 182 22 -225 -20 144 -47 -39 141 5 -194 8 154 -24 -65 113 -13 -196 38 216 -56
1852 -56 -145 120 20 -199 68 245 -95 -176 115 35 -166 94 224 -118 -183 114 77 -142 48 197 -122 -230
1874 -230 124 120 -168 14 188 -167 -214 200 147 -182 8 173 -155 -179 222 157 -193 -14 157 -112 -158 228
1896 228 169 -232 -75 215 -93 -175 245 169 -303 -82 273 -68 -181 226 130 -291 -66 284 -33 -209 171
1917 171 140 -291 -87 326 7 -284 100 176 -268 -94 353 -6 -335 104 200 -232 -73 329 -22 -340 116
1938A16J31m20P4L84k86l22M14K15m54j2M19k58l41M72K03n40J8M39k62l06M81
1959A65J66n27m0M75j72l33L79K03n06j01N21r8m23L54K47n20r0N68j21m30L19
1980C6K40n01m1N49j15m35K58K69l96q6M94p1m95K35L45l89j42N24j05n26K83
2001f9L83m16j39N18j36m90K82M04l81j97M38n8m51K52M11l86k60M55K6n10K36
2022h8M62m15k93M99L4n03K36M29m20k82M83P8m58J65M01l53l11M59J53m90R3
2043a21M52l40l38M89J67n38O9M68l23l37M90J56n24N7M45k53l22M25J73n14P
2064b12M93j92m16M12K35n51k6N54k00m22L82K35n19j1N27j66m17L13K58m38o6
2085b27M82q3m54K70K94l93j14M96r3m91K69L39l95j14M64j03m56K57L29l49j28
$$ plain form
1938 116 247 -173 -99 285 -1 -323 91 306 -148 -160 259 1 -340 132 335 -205 -187 252 -10 -316 165
1959 165 331 -196 -236 239 67 -266 113 316 -190 -291 230 132 -291 63 310 -210 -300 268 147 -283 36
1980 36 276 -225 -266 283 168 -267 -9 260 -136 -222 272 201 -294 -59 286 -103 -245 279 174 -352 -69
2001 -69 314 -102 -241 277 141 -349 -67 337 -44 -241 197 139 -312 -60 351 -35 -295 160 186 -324 -88
2022 -88 374 -41 -334 165 199 -304 -68 361 -59 -341 142 220 -238 -73 328 -25 -336 123 276 -214 -121
2043 -121 331 -9 -347 142 309 -229 -160 308 -15 -352 138 294 -230 -173 272 19 -303 122 295 -219 -212
2064 -212 281 89 -327 85 320 -231 -257 297 97 -325 57 292 -227 -238 289 123 -294 19 277 -161 -227
2085 -227 255 172 -282 -12 282 -111 -225 271 178 -313 -44 295 -100 -214 250 147 -309 -52 277 -72 -200
2106b00M16p3m52K34L77l24k28M17lm50J95M07l33k59M10Pm12K06L72l40k31L74
2128A10M3l64J55L33k83k83L67J32l86J00L47k77k92L87J44m09P9L41k78k46L83
2149A03J20l70K1L23k05k38L46J41l78l2L53j46k74L05J82m20l2L83j29k77L00
2170G6J17l61j7L78j05k85K45J35l26k7L53p2l12J87K13l02n7L62p4l42J91K22
2192A99k84m6L20j01l14J96K23k51q3K75n5k95J63K65k26j40K55j5k85J50K80
2213B31k31j85K74j9k52J74K21k50j37K34J5k13J06K06j95j70K37P4k10O2J97
2234A69j78j82K60Q4k41M4J88j77j32K41O7k37M6J53j21j21J93P3k07l4K05p9
2256A4j58J87Q4k23k1K13o6j44J55N8j97oJ92m9j16J07L6j34j9J63l3j20O3Q3
$$ plain form
2106 -200 216 143 -309 -75 302 -22 -250 167 164 -286 -91 316 -17 -276 134 141 -271 -65 307 -33 -264 110
2128 110 153 -211 -56 277 -6 -289 78 210 -176 -76 271 -6 -298 89 233 -176 -97 244 -34 -280 103
2149 103 223 -147 -126 197 -8 -246 100 241 -137 -169 184 38 -236 69 251 -169 -201 182 53 -224 76
2170 76 193 -168 -185 193 88 -197 48 183 -143 -170 183 111 -201 -14 199 -103 -160 202 128 -214 -23 199
2192 199 -85 -131 189 88 -226 -30 193 -58 -141 134 79 -216 -53 212 -14 -154 101 86 -199 -49 231
2213 231 0 -185 89 70 -182 -8 213 -37 -174 60 75 -138 -32 174 -21 -191 46 120 -90 -28 169
2234 169 -9 -191 69 153 -88 -44 144 -33 -165 76 143 -94 -48 105 -16 -137 56 129 -78 -112 93 14
2256 14 -144 43 127 -96 -117 96 30 -114 41 99 -98 -104 88 39 -77 30 66 -68 -87 76 43 -77 -14 69
2280F9j21j4J57l5j48R4R3j39jJ42p2j23R9O4j04QR2m7j22R4P7p6m7J02k7j04
2306h9Q3Q1q6m5J13l8r2P4N5q7j2P8l1n7O0M5p6k6O0J0o7N0M2p0k0Q7pq2N5M4
2336E2r0RQ4k9o0L2J9n0QO7j8o9L0L5m0j1P2j5q9L9M8l9j3P7m0p2M7M5m2J2L3
2367C2l6m4M8K1k3mJ7k7k0L8K8k9j7L5k7j7L8J7l4%K7l1j5M7j9l1J2K4k6MJ9r
2399bk0JL2ol6K5J7l9J7L2l3k3M5j1l0M5%l8kL8k1j6K5Qj9lL2j2k6K0K1m1MN8
2433D2l0l4K3K3m6J6M9m9l4L5K8n4K7L2l4k2K9K1m1oM4ro5O2M5q0KN3l1n2O3L0
2465C7p9kN7k4l3N8J0o2OO8j9m3L8K6o4rQ0k1o4N0K6o4J3N3k0m4L5K4o8PO8l0
2497A0n1L7K9l8k8O8j4o3M5M9p0j5Q6l9n8N2L9o7nN5j9m6M4M5p2k2O2Jl5J3O9
$$ plain form
2280 69 -52 -66 91 56 -92 2 95 -44 -45 97 25 -98 1 65 -39 -31 61 14 -108 -14 63 -13 -60 42 15 -89
2306 -89 -6 75 -11 -56 57 19 -73 1 56 -31 -43 35 4 -53 7 52 -24 -50 10 20 -47 3 45 -25 -45 42 35 -47 8 52
2336 52 -38 -29 55 26 -34 -2 17 -33 -25 42 24 -45 -15 20 -20 -31 41 26 -63 -24 24 -15 -28 49 9 -63 -16 29 -13 -1 32
2367 32 -4 -48 0 21 -2 -6 11 -16 -36 2 30 1 -16 19 -8 -25 13 30 -4 -4 23 -8 -23 24 5 -26 -14 10 -16 -12 7 -2
2399 -2 -22 -21 11 5 -31 -6 11 -28 -11 21 -12 -35 10 -1 -31 14 14 -24 -26 12 -9 -25 0 8 -11 -14 18 6 -20 0 21 -20 -16 42
2433 42 12 -22 1 24 -22 -6 43 -6 -40 -5 23 -31 -4 28 -6 -28 1 22 -19 -25 19 10 -55 7 52 -28 -26 27 -4 -56 7 37
2465 37 -42 -44 13 -11 -44 14 24 -38 -32 36 17 -26 12 38 -26 -35 45 24 -40 10 36 -28 -15 38 18 -26 9 33 -35 -28 40 10
2497 10 -41 -4 25 -13 -41 27 13 -50 -5 44 -26 -41 45 6 -52 0 39 -28 -33 22 3 -43 1 46 -26 -48 14 15 -20 -7 62
2528F2p5k5P5po1M6K5p1j1P3nn4L4K3o4j1P7j5n7K4L6m2k6P8qp9L7N4o9oQ7k4
2560B1q6N8M9o4j7Q1k8p4M5O7o8j7P0k4p1M3P9o0n4Q0mq7N5O2o2m2Q8j6p4M5P2
2591F7q6l5Q2j1p8M1O6p5l4R3Jq2N1P2j04m3J13Or4M0O2p7l6J04Jq9K0P4o5m6
2621f2R7J7r6J7Q3n9m3R7Oj22M1Q3n0n2Q3Kj00K6Q9o5m9P5J2j00L8J02o2q7R6
2650A7J3r7M6R7p9o9Q9K1r3L8R4q3p0Q3M4q3J4P9o6o6Q9N7r8j0J06q4o3J09L4
2679F9r9jQ7n8o2J11L0j13pQ5l7p4J12K0j05j9J07l7q0R1M3j21lJ33m5q1Q7K7
2707F0j21J7J21m2q7N7O3j09mJ23l4j27P7O8j12NJ28n2j21J05O4j02rJ11o1r4
2733g6P6P6j08k5J12l2j11Q4R1j26l4J23l2j06R5Q3j32l8J26k4q8P7P3j15n0J20
$$ plain form
2528 62 -13 -38 37 30 -31 15 40 -31 -42 31 26 -28 6 29 -35 -46 31 16 -41 -17 19 -23 -49 29 21 -58 -21 33 -36 -42 45 21
2560 21 -65 -7 42 -22 -39 42 14 -60 -15 52 -16 -33 37 13 -58 -15 64 4 -50 30 26 -61 -6 56 -6 -48 40 24 -50 -5 67
2591 67 -19 -54 28 17 -61 -20 46 -29 -63 30 31 -51 0 72 -32 -75 38 44 -50 -10 52 -25 -61 43 44 -45 -25 49 -16 -62
2621 -62 35 52 -44 -27 56 -3 -46 51 57 -65 -24 59 9 -43 40 42 -58 -32 57 -8 -57 18 30 -70 -32 70 8 -79 17
2650 17 30 -67 -21 76 -3 -72 17 38 -55 -17 77 -6 -76 7 51 -32 -18 61 -5 -71 18 75 -23 -33 73 -11 -74 35 69
2679 69 -30 -31 56 -2 -64 47 77 -36 -43 42 5 -69 43 63 -42 -61 46 9 -71 20 63 -58 -61 72 27 -54 33 60
2707 60 -61 -44 77 35 -52 5 68 -41 -45 78 44 -83 -6 62 -50 -45 83 31 -90 15 79 -23 -32 79 18 -76
2733 -76 0 76 -32 -57 55 23 -88 -4 87 -39 -73 50 18 -88 7 90 -42 -80 46 22 -66 11 84 -31 -81 39
2759C9Pj05M8Q8j01m8J20K5j26L2R4j01n0J28J3j18L5R6q1o5J19K3j27J7R8n8
2785Bp4J17K0j30NJ24o2p6J03L4j44K6J25o2q1J10K5j22J1J18o0p1P6M4j07MJ26
2812H1m9j07Q7N4j13KJ45o9j13Q5N3r4pJ24m4j11P1P8j02rJ13l3j37Q6Q9j15l1
2839f6J22k9j19Q1O8q8k7J08k3j02P9O0q6m1J06j2r9O4P8r5m7J22nj17O0Q8j00
2866b0n2J16J1j17M8Q2q6m8J14J0j04J8R3p6n5J10L4j44J6J03n1p6J15K4j32K
2892f5J15n8n8P9L3j16J9R8k8o6M8N3j07QJ24m0j02O2O3j00j3J13k6j04O2N3q4
2919c7PQ6l0q5M2O3m9l5Q4j8q2L8Q3p4n3R8j4r9P0O5n7n8Q2j2o7M4N6n8m7P2J3
2950B8o3J1O9m3o1P3L9p4NN7m7o4Q9K7p4%N8l4k9M3K6m2k3N0rm9M8L7p4j9P3j1
$$ plain form
2759 39 46 -59 -11 77 -24 -72 48 73 -53 -21 73 -28 -78 50 63 -55 -20 76 -5 -70 49 72 -55 -38 60 2
2785 2 -72 45 65 -65 -60 64 2 -74 29 63 -81 -55 70 8 -73 37 62 -60 -49 69 9 -62 14 58 -49 -45 81
2812 81 32 -75 12 66 -47 -45 100 31 -82 3 56 -38 -45 79 35 -76 -5 73 -29 -38 75 42 -95 -9 80 -35 -66
2839 -66 56 27 -92 -11 57 -31 -58 50 27 -75 4 64 -22 -63 43 31 -68 -4 74 -21 -68 54 49 -68 -8 80 -20
2866 -20 -72 44 55 -62 -14 68 -18 -66 48 58 -46 -28 65 -11 -66 44 78 -66 -50 53 2 -74 41 65 -67 -65
2892 -65 50 -8 -66 13 46 -70 -51 47 19 -47 1 54 -53 -45 79 39 -63 -1 62 -38 -51 62 36 -68 -6 47 -37
2919 -37 -30 56 26 -59 -17 46 -3 -38 46 28 -54 -16 67 -7 -60 38 24 -75 -5 60 3 -55 27 15 -52 -8 48 -10 -57 15 28
2950 28 -35 -24 45 2 -59 14 53 -21 -16 41 -6 -70 19 46 -28 -28 30 -4 -33 10 36 -6 -29 21 12 -37 11 48 -26 -45 28 17
2982A7n4M8K0o3oO1j4m7K6L3m6j2O2Jn7ON3l2k8M7J4n1jO1k8l9M5Qm8LM8k0k1
3015a4K0J4l5kM2rl2MM4m2k1N2Jm2ML2k2j5L4Kk8j1L3j1j5K1J8m1j1L0Lk8J6M3
3049C4n0j2N3qm7L6J9k7k1M5nl2J0L4l0k3L5K3o1QN2l1l3N1Nn3OL8k3k4M6K1n2
3082a6j8N5j5l3J9L7n3k9O7Lp0L8M8o3j7P0Jo9L8M3n3k1N8Rm5mO3m2m3N7L9r0
3114c6J7O8m6m9P5K8r2J7O0m5l9P8ko9nP1k2n2N2N7r6j9Q3j2q8P1M2r6JQ6j7p7
3146e6O2M7q3rR0j6p8L3P1p6k9Q5%r3M0P1p5k8R9k1r1N5O5q4l9J00nr6M3P6p0
3177a2l8O7J2r0K9Q9m9o6P2J5q6K8R6q1o5R0L5r8K3J17p1r3J04L6j07J6J00o2
3205A1r8J04N2j02oJ13n5j01J05O3j31mJ22p0p8J03N5j14l4J17k7q4P6N5j13l7
$$ plain form
2982 17 -37 11 31 -32 -38 23 9 -38 -12 21 -25 -37 25 26 -31 -25 28 -4 -32 15 29 -22 -23 38 10 -29 16 24 -24 -21 27 7 -14
3015 -14 6 20 -15 -17 25 16 -16 -12 32 -10 -31 21 22 -20 -16 16 -6 -21 13 15 -13 -24 9 -2 -17 4 22 -19 -30 0 3 -25 -9 34
3049 34 -16 -28 25 17 -30 6 25 -2 -23 22 17 -15 -5 29 -1 -24 11 34 -27 -19 33 2 -31 20 25 -28 -22 16 -7 -31 15 36 -16
3082 -16 -34 21 6 -27 -8 29 -24 -53 14 17 -53 -15 33 -30 -47 23 24 -45 -7 36 -17 -38 20 29 -16 -20 43 1 -42 15 54 -36
3114 -36 -19 49 3 -46 29 57 -35 -18 42 -3 -42 36 34 -35 -40 31 9 -43 9 66 -30 -49 34 22 -66 5 47 -49 -48 38 21 -56
3146 -56 6 53 -30 -39 51 35 -43 -10 61 -15 -44 41 41 -52 -12 59 -16 -44 55 34 -57 -2 63 -21 -60 40 35 -61 -18 58 -12
3177 -12 -50 17 29 -61 -32 57 8 -58 14 29 -57 -29 67 -14 -79 11 46 -52 -29 88 17 -76 28 64 -43 -27 73 11
3205 11 -87 17 69 -33 -39 74 19 -82 23 86 -45 -49 73 3 -75 28 83 -31 -65 52 25 -59 17 72 -41 -78
3231g8J45j8j38J00O2j26l5J63l2j23P6N8j01l0J42rj28N3R5r8n1J48j0j53N4
3256c4J36j14n0J38j2j61O0J23r5o9J43j5j42O0J16q1p7J08J7j44N6J41q8j07
3280i1J30L6j63N0J42j10j05J40L2j38L6J32r2r9J20N9j37J1J35q2j13J38P4j60
3304e5qJ55p6j20J36P8j71j4J61o3j18J23P0j52l1J63l5j42J01R5j51k8J58k8
3328D8j38P9R7j53k9J89m6j48R9R1j40k8J61k2j64Q4J07j19n5J66qj65O4J51j49
3353b8o1J76j3j73O8J45j31p6J68j9j59N9J47j06r0J33K7j62M8J61j13j20J54
3376C5N2j82M7J53j09j11J38N0j52L3J44r5j06J23O5j47mJ70p9j30J32P6j71R
3400e9J68q0j32J37O9j55j4J59o9j26J18Q0j52k0J57m3j35R2J10j59l0J60k7j57
$$ plain form
3231 -78 67 49 -89 11 73 -53 -88 75 43 -80 -4 54 -47 -77 65 56 -72 -19 76 -22 -73 75 65 -88 -34
3256 -34 102 -12 -62 76 64 -97 -37 86 -9 -78 65 50 -92 -32 84 3 -74 34 51 -93 -37 104 16 -91
3280 -91 39 75 -88 -38 104 -6 -111 29 61 -77 -41 91 -1 -100 20 79 -58 -47 88 6 -107 31 105 -55
3304 -55 -63 92 16 -104 32 110 -61 -75 86 23 -95 28 98 -54 -85 78 43 -99 2 97 -54 -82 76 48
3328 48 -90 -11 86 -67 -96 93 47 -101 -2 89 -51 -79 82 60 -104 -20 87 -32 -87 79 71 -94 -30 121 -28
3353 -28 -89 87 74 -99 -31 114 -17 -93 75 56 -103 -44 103 -3 -93 40 67 -95 -47 114 1 -119 35
3376 35 87 -95 -48 105 -4 -115 23 73 -79 -46 98 3 -103 20 85 -62 -66 104 25 -105 27 103 -68 -59
3400 -59 109 29 -103 34 103 -52 -66 93 24 -102 16 96 -56 -76 81 38 -97 -5 105 -54 -84 76 49 -108
3424a08J10J03j45m3J60k3j53Q3R5j11m9J47k0j20N4J06j11n7J44pj40O7J15j21
3448b4m6J42mj47O9J09j07o5J35j0j22N0J03r8o3J23J3j49O4J14r3q9J42J5j46
3473h4N0J14q9p9J18L4j44M0J18q2r6J20M5j25K0J22p1q4R1O1j38JJ39q8p0J19
3499D2M3j28OJ21p5q0R6M1j11jJ18m6j02Q1O1j19JJ29m6j12R3O6j26k0J31m1j02
3526h0Q8N2r9rJ03k2j07O1R6j06m3J16rj16O6Q9j00l7J20l2q6O4P3j03m0J17q
3553D8j00M8P8j03l3R0K4j05M0P8q8m4J11J3j10K7Q4p9m1J01lr0K9P8o5m6Q4J9
3581D5q9J7Q1n8m8P4K8j01K1R0n5n5P9J4r5L9Q0n9m4O0J1o2PP6m1n8M6L1o7jP5
3612D1m0m6O2J0p4K3O3m2m9O3K1p3J1N6k1m5M9K3o4J2N7j9o1O6K2p6MQ0m3n2N5
$$ plain form
3424 -108 2 105 -40 -83 77 54 -99 -16 79 -32 -81 66 46 -74 -20 86 -25 -82 62 55 -85 -18 97 -24
3448 -24 -70 72 68 -79 -10 99 -8 -73 62 52 -70 -20 83 -15 -78 45 58 -91 -27 87 -6 -95 47 62 -84
3473 -84 -34 80 -9 -88 30 64 -80 -40 78 -4 -100 20 65 -60 -40 82 11 -73 18 79 -59 -58 81 -7 -77 42
3499 42 85 -43 -37 84 9 -71 25 66 -45 -46 72 26 -76 5 66 -53 -52 77 31 -81 12 78 -48 -68 63 22 -80
3526 -80 8 60 -39 -48 55 33 -74 -13 83 -23 -66 50 41 -75 -9 80 -20 -57 63 31 -55 9 82 -21 -61 56 48
3553 48 -52 -4 74 -29 -62 28 52 -53 -13 65 -23 -67 44 57 -53 -26 58 -21 -62 39 36 -54 -25 53 -12 -58 26 45
3581 45 -44 -27 54 -4 -52 22 50 -51 -30 60 5 -50 29 43 -52 -13 67 8 -36 24 35 -27 -20 56 15 -43 3 34 -33 -34 41
3612 41 1 -45 17 27 -47 -24 39 -3 -52 11 32 -41 -30 26 5 -40 9 32 -32 -20 37 18 -43 23 45 -31 -27 53 10 -42 13
3643A3K8o3J5N0l8l3M7J4o0J0N6l1l8M2K6o2PN0j9m8L6K7o2LO3l7l8N1Ol4%M8
3675B9k4l8L5K1m6%N2j4n1L0L7n1j2O0j2l7M1J8m8qM8l2j2L1Kk6oL7j7k2J8J7
3707B0k7k2M3ql9M0J8n1OM5l3j6L7mj4nK0k3pK3K2m5NL3j5k4K8K8n0LN0l9j9L3
3741A3Jl3NL7k5j4L2j1k0J8K1j9j0J7J0m9J4L7k6k6L6J4n6L1K6l6k7N6Jm6K3K2
3773A6l4j2M8ml1PM5l6k7M0J2n2K9L9m3k8M9Qm7K0M4n4j3M4rk6LL4k9k6L6J8m5
3806b4J1L7k9m6O4Rn9K6N0n6l0N4J0n6K5L4l0k5M9J6n3lO6m2m3N8K2n9jO9m0l3
3838b9M9K0o2kO7m3k5M9J5n6RM4l4m4N2K5o8RO7m5n2N1L5p6KP4l0m7N5K0o7PO7
3871C7l4m6L7L8o0j5P8k1o5O0M3o8k1Q6k9o8N9L1o3j1P5l1m9L1M8o8rO5j1o9M4
$$ plain form
3643 13 41 -22 -7 43 5 -28 19 33 -27 -17 39 8 -30 12 38 -24 -17 33 14 -34 2 29 -33 -30 33 -4 -42 9 15 -19 -19 29
3675 29 5 -33 2 23 -23 -23 29 15 -36 -6 31 -20 -32 28 16 -21 20 38 -10 -18 30 -2 -14 17 19 -7 -13 24 7 -15 3 20
3707 20 -7 -29 14 6 -33 7 25 -26 -20 25 -8 -24 13 9 -5 -10 10 -13 -20 3 25 -20 -15 18 3 -21 7 35 -15 -12 38 -1 -20 13
3741 13 14 -19 -14 23 -2 -16 16 5 -15 3 24 5 -5 12 22 -27 -13 24 -2 -28 8 22 -34 -3 23 -13 -40 16 17 -29 -6 16
3773 16 -18 -30 18 14 -17 -10 35 -1 -28 12 24 -28 1 40 -3 -31 18 26 -21 -1 43 -11 -24 20 11 -15 -12 22 -7 -33 3 21 -24
3806 -24 -13 24 -5 -51 13 22 -37 -11 39 -17 -47 7 17 -39 -14 20 -10 -35 14 30 -23 -26 40 -2 -45 13 35 -24 -25 44 4 -29
3838 -29 20 40 -22 -24 43 0 -25 24 39 -17 -8 36 2 -42 10 35 -33 -24 43 -2 -54 -3 32 -44 -42 32 2 -45 10 30 -37 -30 37
3871 37 3 -43 -6 32 -28 -43 35 14 -51 9 52 -16 -37 49 20 -48 11 42 -21 -32 43 12 -37 -6 42 -26 -35 30 19 -50 -6
3902fM2n8k8Q7k2o7M0N0o3k4P3j8n6N0L4m9l1Q4j0q9L8O1m7k7O8Jq3L6P0o5l7
3933d6Q4J3j04M2N7n6m4Q8Lq0L2N0m8m0P4J4p8J5P3n8m5P4K3r2J7P9m4n0P5jp7
3964e0K6P0l9n7O2K4p3JP4k4o2O4L0p4OP5l9n6O5K4p4NO8m9n0O2K3n9mP1l6n6
3996e2O5K9p5MO2k8o2O1M0q7MQ7m7m9M8M1o6j6P6k0n9M2M7n8j9Q1j7p3M2M9n9
4027ik2P3k2p0N4M8o6k2P1j2o6L8N2n6l1P2j1n8L0O0n8m6P6Ko6J8N9n3j9M7Kn9
4059d4K7M7m7k7O5J6p7K4N4m7l0N9J5o2J5M7l1m5O3K3p4K3N2m9l1O0Mn6RN6m2
4090cl7M5L4o5NP1n2n0N7L0p0J5N5l4m4L7L1n1jM7k1m1M5L2n5j7O4k1n8O0L4n6
4122a4j6N4ro2P1Rm9lN7k9m5M1K6n2pN2rn2L8K6n3rP1k2m7K8K8m8rN7j1n4L5L6
$$ plain form
3902 -6 36 -22 -50 37 15 -52 -12 38 -25 -49 24 6 -50 0 34 -15 -46 38 28 -61 -23 38 -9 -36 32 33 -50 -14 56 -9 -46
3933 -46 38 51 -53 -11 46 -10 -54 34 37 -43 -11 39 -9 -49 25 39 -39 -24 49 -9 -54 20 43 -49 -32 47 3 -47 28 27 -50
3964 -50 -24 46 7 -50 12 36 -37 -36 38 14 -48 16 46 -28 -22 53 14 -42 23 47 -27 -22 46 -3 -53 9 32 -27 -31 40 4 -52
3996 -52 13 42 -33 -29 33 5 -57 4 44 -43 -39 48 1 -48 0 41 -25 -41 35 15 -44 -2 45 -13 -32 49 32 -41 1 50 -9
4027 -9 -31 42 20 -50 4 52 -14 -36 35 23 -43 -5 47 -9 -40 32 21 -37 -7 53 -5 -51 25 27 -39 -21 38 -15 -34 13 15 -44
4059 -44 -17 30 -17 -44 21 37 -40 -16 38 -9 -39 20 35 -27 -12 35 4 -41 22 45 -29 -6 46 -3 -34 26 30 -26 -17 39 -3
4090 -3 -40 5 39 -26 -21 50 -2 -52 5 35 -35 -20 35 1 -43 -6 25 -26 -27 20 -1 -42 3 35 -20 -37 27 6 -52 8 42 -14
4122 -14 -30 24 15 -47 24 33 -16 -19 38 9 -36 5 31 -21 -28 24 15 -37 1 27 -26 -35 36 14 -33 -5 23 -25 -34 23 12 -42 -7 29
4156B9m7k1O4ln6K6L9l4l4N4Qm8J1M4l5k0M8on5L9M2m4l0N4mm8K3M4m4k1M3Pm8
4189b3PN1m3l2N3Mn0J5M2l0j7L9kk7QK3j8k7L1Pl8J1K8j3l1L8L0n8J6L1j5k9L6
4222A7J1m2J1L1j1l0L8om0JL8j6j8J8J1l3J4L0j5l4K8pk8J5M2k9k7K9J2l0ML5
4254A9k2k6J7K0j9MK9j5l0J9K0l6J3K3j1k8K0K7k4NJOj6RNnj8L6k1j3J2J3j9k4
4288b9M3qj7J1J4k6j0K1Mj2QJ0k4jJ9Qk4RjqqL5rj9J5J0j6pL7j9okJ3j0JQqoJ0
4327FJ3j9Rl%j9J5K0j4j7K3j6qLJ4mj9J2%j2K9jj6JKRoj1J0qj2L0j2NKj1NpJ9
4366A2Mj9J5j0o%J7Kj1JmJLQmj5J0Rj2nKJokQKmJ1rj7LJ6jL%j5PjmNpQQnLMj0
4413dNNj2J1Qj3p%J1NnOj0rJ6J0j6MJ0j6kjJ0j0lQj1j4K7KqKkj1%K3j9%PkNj5
$$ plain form
4156 29 -18 -39 25 22 -34 -8 31 -3 -37 17 25 -23 -12 32 -3 -23 25 19 -36 3 45 1 -29 25 21 -27 -4 40 -4 -25 18 25 -23
4189 -23 -16 35 -8 -40 13 17 -33 -18 24 -6 -23 16 14 -13 -5 18 0 -27 4 11 -27 -16 12 -1 -32 6 36 -22 -6 25 10 -19 17
4222 17 28 -14 -3 28 17 -13 25 19 -21 -20 18 2 -16 2 13 -20 -6 24 9 -25 3 -4 -32 -17 25 -4 -31 -2 10 -20 -16 19
4254 19 -3 -29 -12 8 -11 -7 22 7 -23 -4 16 -20 -7 16 5 -23 -3 24 0 5 6 12 -4 5 10 5 -13 23 2 -11 1 14 -5 -29
4288 -29 14 6 -11 0 14 -12 -22 -1 3 -9 -1 9 -15 -16 3 11 -13 -4 -5 -13 -21 14 5 -14 1 11 -5 -12 25 6 0 -2 11 1 2 10 2 -4 6
4327 6 19 0 9 6 6 -13 2 22 8 -9 14 -2 -10 -7 7 3 -16 -4 -4 -16 13 12 -4 -3 -1 8 2 -9 1 -7 -19 11 -1 4 6 -5 0 -7 12
4366 12 16 -3 12 2 -4 -4 13 15 4 5 1 2 5 13 9 -6 4 13 1 -4 -2 -1 -7 -9 -1 1 -3 8 -1 -18 -15 1 0 3 3 -12 -5 -6 -10 -5 -12 -4 4 -1 2 6 -4
4413 -4 1 6 -6 5 13 0 -7 -7 4 9 4 10 0 -9 7 17 1 5 15 -1 -3 -4 6 -4 -7 1 -10 -24 3 5 -3 -1 -3 -14 -14 9 -10 -10 -3 -5 0 -15
4455a5K6rj3NJ6%j1J9mj7MK4j8rJ2Kj8ONMpKJ0l0J2K6j3k2J9Pl1J3K2k4qK3op
4493ePJ8l2j1J7RonJ5kk0J7J5j6j1L9k6k2K5J2j1oJ2j0j5J3K1l6NK8j3j6J4J1
4527A5qk0J4Qk9K0J7k8PK0j5k4L1kk5lL0nk9J5J5k0JJ7J0l1NK7j9jK8Kl4J5J5
4562A9k4rL8j4k9K2J2k1PJ6j3k2J4K9l5%J9jl2J9K6j9l0M0kl3K0L0m5j0L5Kk2
4595a3LL5l1j3K2J3k4nK9j7k5M6Nl8J7K0j8k2K9J6l4jL1k1j5L4kk5j1L2j5k0L6
4628A8J3m6qN0l2j5L2nl6K2K8j2l1K8%l2PL4j5k6K3K3k6j6N2k6k2L3Ql1LK6j7
4661Dk0J7K6k9j2L6j7k9K6J5k3nK4ol4L2J0k7pJ7Ql7K5K3l8jL1j5k7K4L2l7k5
4694c9N5%l8J1L6l7j2M1Pm5K2K3l6j5M5Jk6LJ5j6pK8Qm0J1K2j2k3M0Km7QK7l2
$$ plain form
4455 -15 11 2 -11 -6 10 10 -1 18 14 -3 1 25 7 -2 10 12 -6 0 5 9 2 4 14 -16 -4 22 9 -13 6 13 -18 -5 17 -7 -15 8 2 -5
4493 -5 2 20 -12 -23 -6 3 -3 -8 7 5 -15 2 17 1 -10 29 3 -19 6 18 7 1 13 3 -12 1 22 -14 -9 19 6 -10 4 15
4527 15 7 -13 1 9 -20 0 17 -11 -4 16 1 -23 8 6 -19 -22 8 3 -26 -11 4 -16 -15 2 12 -19 -14 13 -6 -7 21 23 -11 4 19
4562 19 -5 -14 24 10 -19 3 15 -6 1 17 4 -18 -4 25 -10 -10 9 8 -24 -5 21 2 -28 12 10 -23 -3 27 -18 -28 7 9 -13
4595 -13 -10 25 -6 -19 3 16 -8 -13 16 -1 -26 20 25 -13 4 24 6 -16 13 29 -5 -6 25 4 -11 23 21 -4 -15 17 2 -18 18
4628 18 31 -15 -23 27 -5 -20 12 7 -29 -7 21 9 -22 6 6 -26 -19 15 0 -26 -3 20 -6 -22 30 4 -18 15 23 -8 -5 21 4
4661 4 -16 1 27 -2 -14 22 5 -24 2 17 -6 -11 13 7 -27 5 15 -12 -19 -2 6 -31 -6 17 -21 -22 9 -6 -33 -9 23 -14 -39
4694 -39 16 16 -22 -11 25 -12 -24 17 24 -21 1 24 -12 -27 18 19 -7 -4 11 -5 -12 16 24 -16 -5 17 5 -18 22 24 -23 -15 12 -20
4728b0mL0Om9J4L7j4k7L4Km0J1L2qj9J6Ml5RN2k5k7K7J0l3J5L4j7l1K9J0l4OK3
4762A8j1l0K3J9k5%K2j8k6L8K3m5OK9j9l6L4J5l4oK5j7rK9Pl3lL2j7j4K4J1l5
4795b3mM1j3k4L5K0m7jM3j2l7L9Jm1K2K3qm5K7K2k4rL5j7k3J6J5k7KK6ml5J4K9
4829A6j8j8L3j8l3K7K9k5j6K8j1j7K0L4l5j6L7Kk8J6K0l6pK7Kl0K8J0rl1K7Qk2
4862fLK3k1j3J2K2m1JK6j9qK8Kl4QK9k4j1L7Ll6lL5k6j7L9kk3KL0j5k9L4Jl0J4
4898iK1j6j2J6Lj8J5J6rj5J3J5k8JK7j1k3J3Pj8OK6j7k7K5J1l2J2K4k5rQJ4k1
4932a7RPlk1K1J8l0jK0Ll5K8K1k5qK2qk1L1J0l4NJ5pj1L1nk4lK6ok0K2Jl3KK9
4969Ijj8NQk7%K7j0j1PJ0opJ9qj8MJ6k0J1K0j2j9J7K0j9nK5j6j6J7Rk2KK8j8m
$$ plain form
4728 -20 -24 6 12 -37 -23 14 0 -27 7 9 -31 -20 12 4 -15 1 5 -30 -21 31 6 -21 6 16 -17 -2 32 15 -16 13 23 -11 -5 18
4762 18 7 -23 0 19 -6 -6 16 -2 -28 10 33 -12 -6 23 4 -32 2 17 -17 -23 2 -15 -24 5 12 -21 -24 8 -9 -23 1 12 -23
4795 -23 -27 14 1 -23 12 32 -15 -16 27 15 -22 17 18 -23 -1 22 14 -31 -4 18 -6 -15 20 3 -20 -4 11 -16 -14 12 8 -27 -13 16
4829 16 -2 -20 13 -5 -38 -11 18 -7 -23 5 -6 -23 -3 31 -4 -20 17 19 -9 7 27 -9 -16 11 13 -17 11 21 12 -19 8 16 -6
4862 -6 -3 20 -1 -14 -2 20 -21 -20 6 -13 -21 7 9 -25 -17 12 -12 -23 14 17 -19 -22 13 -13 -30 9 7 -16 -14 16 1 -28 6 7 -23 -9
4898 -9 12 -4 -16 0 3 -15 0 16 7 -8 5 20 -8 -7 20 9 -14 -1 6 -12 -6 20 3 -24 1 12 -20 -8 16 -9 -18 -10 4 -17
4932 -17 -8 -1 -4 -25 -4 14 -16 -17 3 6 -29 -1 20 -5 -13 9 1 -20 11 21 -13 -8 7 0 -11 20 15 -9 -12 14 8 -12 10 11 -22 -20 9
4969 9 8 -10 -5 3 -24 -24 3 -7 -18 -11 -1 -7 -14 5 -3 -21 -17 -1 -21 -10 10 -2 -21 -4 16 -3 -8 17 1 -15 2 11 -11 -9 19 1 -3
5006cmK4j9j2J2Ok9K1K7l1nJ9j0k3K5J5k3k0L4j4j1MJ4j3lJ4J1k6J0J9k6KJ7K
5040Dj7QPk1mL0jj6J1Oj7PJ0mj0QMlqJ5j1j6J0K0j9KK0k6qJ9mkj2J6prNJ3j0j1
5080b1J5Mk2J7K2l2mK7krOPk4%K6j1kRQk4PR%j6J3Qj3j2K7qk0J4Ol0J0K3j3j3
5118a8QJ4j6lJ6%k0J1J1j6mJ5Kk8RL3j7pK6j8j9J6J9k4NJ7j9j7L4Jqj3J6pj6K4
5154GPj9kJ6qk1K1J4k8rJ9nj4K5Qk5kK0j5j6J7JroJ9Nl4J0L5l0kL0Ol5J6J2k4
5191a6PJ9kk0J4NrqK3%k3jJ7%j8K6rl2J7K3j9k4K6Pk4J5J0j2j5J4J2l1J8J1Jm0
5227c8K9Ok1K4J2j7j7K4Pk0jJ1qj4K6Ol0J0J6k0j0L2Lk1oL8k7j2K4Qm2J1L3j9
5261cj6J2J5k4LL1j5k6J7kqmK6j0j9RK6l3pL1Jk0J5Rk4J0OKk4K0J9k2lK7j6j7
$$ plain form
5006 -3 -7 17 -2 -14 -2 4 -25 -4 23 -8 -13 6 -4 -27 -2 13 -10 -30 4 -10 -21 -17 -3 -16 -19 -5 6 -20 -10 9 -17 -15 2 4
5040 4 -13 -5 2 -19 -23 7 6 -10 1 7 -10 -3 7 3 -7 1 5 2 -6 9 -2 -18 -8 12 -7 -5 15 -11 -19 0 -4 -6 -18 -2 -9 -18 -13 0 -10 -21
5080 -21 -6 -2 -24 -7 15 -17 -21 6 4 -5 1 8 -16 -16 10 -1 -3 6 14 -10 -3 6 6 -10 3 11 -2 -14 13 5 -15 -1 5 -25 -15 8 -5 -18
5118 -18 -10 4 -12 -15 1 1 -19 -8 3 -13 -17 -2 0 -28 -19 14 -3 -10 16 -2 -21 -5 14 -10 -5 12 -7 -24 10 11 3 -10 6 -1 -17 7
5154 7 14 -5 -7 9 1 -20 1 15 -13 -22 -3 -8 -22 3 11 -14 -16 4 -11 -27 -10 -9 -18 -24 -5 0 -34 -24 11 -19 -21 9 15 -20 -4 8 -16
5191 -16 -9 10 8 -12 2 7 -2 -10 13 13 -10 -11 6 6 -12 14 5 -27 -10 13 -6 -30 -4 3 -21 -6 4 -8 -23 -9 3 -28 -10 1 2 -38
5227 -38 -9 -3 -24 0 12 -5 -22 2 9 -11 -12 -1 -9 -23 3 9 -21 -11 5 -15 -25 7 10 -11 -17 21 -6 -18 6 14 -28 -17 16 -3
5261 -3 -19 -7 8 -16 -13 18 3 -23 -6 -8 -16 -20 6 -4 -23 -14 12 -21 -28 3 4 -16 -1 8 -16 -6 0 2 -22 -2 17 -5 -8 19 3 -14
5297a4J5Oj7pL7j0k6J6J4k6oK0Jk4K9Kk1oK8kl3J0K5k0lRJk7J5K1k2j3M5j8j7
5332a8MJ9k2qM2j5k1K5Mj7j2K9Pk6J2K2k9j4L2%l1LJ8k0mJ9Kk4J4K3j5j7J6Pk3
5367a8PK0j8j1J3J3k6J3J6j3k1L1ok2J0K4j0j8K1Lrj2L3ql3K1J4k5JK7k1l3K9
5400hQj9OJ0j0k1K5J4k5oL6j2l0K4Rk3LJ1Nj7PK7l9LK3Jk9K3J4k9PJ4j4rJ4K3
5436A6j9qJ4kj0J3Lj6rK5Pl0K0J2k4qK5j0k4J8K2k0j0J4nk0J7LqpJ2J5j9mK6k4
5472a5nL1qk4J3K7m3lM1j1j6PJ4lk4K6pqJ6Kj9qJ7Rj9%J4j0j4J4J1j4jJNk1K3
5509bOj8lK0qk7K9Mmj0K2k4OJ6jk0JK3j6qJ5Mj4lK3mj7J2Pmj9K4Kj6J2j7kJ8%
5548Gj6kPKj2NJ5k2%J7oj0LRj0OkRj0JMkj0J8j0NLmkLJ0onNlKLKKj6J1J1j0j0
$$ plain form
5297 -14 1 7 -10 -17 20 10 -16 0 14 -12 -18 2 3 -21 8 10 -11 -17 11 9 -24 -14 11 -9 -12 -3 -2 -29 -14 7 -15 -28 17 -1 -18
5332 -18 -14 5 -17 -25 17 2 -19 6 10 -7 -19 10 17 -9 3 25 -4 -18 14 14 -17 -14 4 -16 -20 -1 1 -23 -9 14 -1 -18 -2 5 -18
5367 -18 -11 9 -9 -20 -7 6 -20 -7 9 -4 -25 6 0 -22 -12 12 2 -16 5 8 -1 -13 20 12 -21 0 14 -11 -10 17 -4 -37 -8
5400 -8 0 -19 -13 -3 -13 -34 -9 5 -20 -26 10 -2 -32 -8 1 -22 -19 -8 -3 -20 -13 14 -25 -22 1 2 -27 -4 10 -19 -12 2 -12 -21 -7 16
5436 16 -3 -11 3 1 -9 4 7 -9 -18 7 14 -16 4 16 -8 -16 9 -1 -25 -7 15 -5 -15 -1 -6 -26 -9 -6 -14 -21 -9 6 -13 -17 9 -15
5472 -15 -20 11 3 -21 -8 19 -24 -27 14 3 -13 -6 8 5 -19 7 0 -8 8 10 -9 -17 0 9 -10 -10 4 -6 -20 -6 5 -9 -10 -9 -4 -25 -2
5509 -2 4 -14 -17 3 -5 -32 -3 1 -3 -13 9 -15 -9 7 6 -14 -13 10 -6 -14 1 5 -9 -12 11 7 -10 2 9 5 -14 10 12 -4 8 -9 -11 7 7
5548 7 -9 -11 -4 -2 -14 -9 6 -16 -16 1 -5 -15 -12 -3 -13 -7 -9 0 -10 -9 -5 -7 -17 1 -9 -4 -1 -5 -7 -4 6 0 -5 0 -3 -1 2 4 6 -10 1 12 2 -8
5592hQJj5nK7j4pJ5jj4OJ2pj2J9rppJ1lmOPj0J3p%JJ0nj7J3PKj3NJ4pJ%Rj8JJ5
5636A3k3KJ1j6JJ3jmj2J5ljQJj3LpJjJ2Mk0KJ7qmjJ0Jj3J4Nj9J2ooRJ4oj4JJ3
5678Dj1PLLlkJ2j8mMPj2J2Jk0J7rKkKNkmLpk0K3J2j1NLkrJ0KqKJ0rnJ4mj3MJ0
5723B%j0ROj5J0Jj1RjRj6KJ9j4rPjNk4K7nnoJ1pLMj4QnQoJJ3j4j1LJ8j1QOj0j1
5767a7J9J0k0OOomJ7kj6jJ7j3kQJ6k3lJ7omj4K0j7kJ0Pj1J3mj4lJ1J0k7J8Rrq
5806a2K2kj6KJ3lj2J3nrKJ7kpJ4j4j1KJ2kj4J2Lpj1K7j3lmkKjL0k0j3K4mk6J4
5845dOkl4K9mOqJ0%j7J3J1j7LJ4qj7K8lk1jJ6Oj4J8lj2NLQj0J2Ll1MQ%oQJ7l4
5886a8QJ4Pj7J0Jj1JLNk5J4J7k3kJ7nj9K0Rj6J5J1j3oNJ0j9%J0oqNJ5j3lJ8kj9
$$ plain form
5592 -8 0 1 -14 -19 8 -6 -13 2 1 -13 -7 5 -2 -14 5 -4 -11 -18 -7 -10 -14 -8 -1 -11 2 -5 -5 -4 6 1 -16 -3 4 6 -7 -2 12 5 6 6 15 -3 -2 13
5636 13 -10 -8 3 -13 -12 1 0 -4 -16 -1 -4 -5 3 4 -9 -6 -13 -12 -13 -1 3 -17 -15 2 -6 -10 -11 -1 0 -13 1 6 -13 -1 -7 -13 -4 10 4 -10 -9 4
5678 4 -7 0 3 6 3 1 13 -5 -9 -5 2 -10 2 3 -17 0 -9 -7 -9 -7 -2 -4 -8 -5 -12 -32 -9 3 -8 -3 0 -2 -11 -1 1 -7 -5 5 -4 -9 5 1 -12 -8 2
5723 2 2 -8 1 7 -8 2 3 -8 1 0 9 -7 -5 14 0 -9 -2 -3 2 -22 5 0 -5 -11 0 -7 -4 0 -14 -6 -11 -3 -9 -8 5 -9 -20 -17 1 -10 -2 4 -6 -17
5767 -17 2 12 -8 -2 4 -2 -6 11 9 -7 -8 9 -4 -6 2 18 -5 -8 9 3 -1 -15 5 -12 -14 -4 3 -8 5 1 -13 -16 -5 5 -22 -4 5 -4 -12
5806 -12 10 8 -8 -6 7 4 -8 5 0 -9 -7 10 8 1 15 1 -10 -8 4 2 -12 0 3 -4 -15 12 -1 -4 -8 -10 -8 -9 21 1 -12 12 8 -18 -4
5845 -4 2 0 -34 -5 -9 -3 -11 -1 -1 -18 -5 6 -11 -8 6 -2 -19 9 6 -15 -16 0 6 -8 10 7 -5 0 3 11 1 13 16 -15 -11 -3 -3 -9 -1 16 -18
5886 -18 -10 4 11 -6 4 5 -6 -5 -2 3 -22 -8 9 -14 -16 1 -4 -23 -3 6 -10 5 16 3 -3 2 12 -7 -7 3 -3 -11 -6 9 -4 -7 11 9 -10
5925a0J5kjrJ8j7KPjqkJ0ppJ4Oj6qK5qj7J8J4l8QJ2KqJ0KrrJ5Ok3J2J5k3jJ6K
5966Ej4MJ7%j8J8j0mMKJ0j5J1kj6JK1j8mJ5rJqJ1rqRLqlPmJJ1j0rJ0K0j4j8K1
6007AKk1J7LlM%Oj1jOj0NOJ2k3LJ8j6jJ6rj2J3J0j4qMJ0nj1J1mnmJ6ooKlqQJ3
6050EqpJ0J3k6J7mj1JJ7rJ3nlojJ7nj1RNoj0J0qlQMrpK4j3j3J6j2rRJJpJ0Nmk2
6094b4J9MrRKqj4K3Nk4J7Jj2MJ3pj2K0krmJ6mmPjrPnNpJ0nj2KJ7lj4KPnj8J3j
6138a0pLJ8j9%J5kmNMj3jJ6kj0NQk1J2%%lLJ2poMKmPlo%J4oNrMj1OMj2%QJoML
6186A%j3LJ4k3PJ1Mo%Lp%J0pqJ3Qkj4OMqJOkoPnlkJ6j3%OQj0JJ2ok2K5ok5PJ5
6232@j5J1rQj6J1K1k3MNOkj4J8j4MlK%pJ4j0jRJ4j7lJ1l%JQj4j2K1%j0J2Pj9k
$$ plain form
5925 -10 5 3 2 -7 11 -6 -4 3 2 -6 -8 2 -5 -12 2 8 -8 -16 9 1 -16 2 16 -22 -14 -2 0 -8 2 4 -5 -14 1 7 -16 -4 11 -12 -13 3 5
5966 5 -9 -5 12 12 -6 12 2 -2 2 4 14 -1 10 8 -8 -7 14 -4 -8 7 -2 -1 -9 2 -7 -15 -6 -3 -11 -14 -7 -11 -10 1 -9 -18 -8 12 -2 -20 1
6007 1 3 -18 -1 2 -1 3 3 9 -2 -3 3 -7 -2 4 16 -7 -4 14 -2 -3 13 4 -8 5 15 1 -7 -3 7 2 -9 2 -2 -7 -11 5 -1 -7 -5 -8 -16 -8 5
6050 5 -3 -10 0 13 -13 4 0 -11 -10 7 -2 11 6 3 -3 -4 13 8 -3 6 11 5 -5 5 -3 -6 2 6 -3 -10 14 1 -12 4 -8 -17 -8 -7 -6 -13 -3 2 -2 -24
6094 -24 -5 -1 -10 -1 1 -7 -21 2 7 -17 0 1 -11 -7 6 -1 -13 7 5 -4 -8 8 4 0 7 6 -3 4 -1 4 -3 7 2 -10 -8 9 6 -8 -6 1 -4 -22 -9 -10
6138 -10 -17 -14 4 -15 -15 0 -2 -6 -1 3 -10 -11 5 3 -7 -2 6 -15 -3 -3 -3 -6 -3 9 2 -4 0 2 -2 5 2 -4 -4 10 4 9 0 4 -7 -1 3 -9 -9 -1 0 -6 -2 1
6186 1 1 -12 -9 5 -18 -11 0 4 -2 -2 1 -6 -6 4 -3 -11 2 10 8 -6 0 4 -4 -3 3 1 -5 2 -3 -6 -8 8 -5 -5 1 9 -1 0 12 6 -16 9 3 -22 -15 0
6232 0 -15 -4 -13 -5 -21 -10 11 -12 -8 -3 3 1 -13 5 -9 -5 -8 -6 -6 -13 1 -9 -10 -1 13 -4 -7 4 1 1 2 10 -4 -16 5 5 -5 7 14 -5 -7
6273gLLqMNj7J4%Oj5LJ9k0LRJqJ1okmJQk0K1okLNMr%J3moJ6pj5J2%j6RPj2qJ9
6319GOmj1J1pj4ORj2qOOJllKllKJKJp%J0oNOkoLQkl%J4j6QJMj4J4j4JKOpNj2J7
6369Gj0nJ6j2mOPnKopRpMpjJ5plnP%PloqJ5%onJ4Rj2lJ3j4QmjjKpJKJOnQnj1J3
6420BoloJ0J3k5pRNj4QJ7j5LQoLmJ3j3rJ3o%%LJ0j2QLkkJ1qj5J5Jj3J8mojMLj6
6465a3J3kJoJ0qJjJ1j3lOjNoKj5QR%Jj0OpPQpJLRj5jNKj%Qj5PK7k2pJ6j0%qJ5
6512A0lj3J2Mnj2NOmqkJoJ1Mj4RMrMOkkj3J6ooJ9j0qPJ6j4OkkoMJ0qJmLj5QJ7
6558Ij2nJ5jj1pJ7ok0ROkpJ8rmJ0Kp%Knj3J0NpKJ1j4LJ0NpmJ9j7lJ6opKJ6lj2
6602bKOrlJ8j6OlJ1j9NOj1j2J1J2rqJ3Lk4%K1j6NJMj5J3Lj0NJ8j1j2J0J0nj1O
$$ plain form
6273 -7 -4 -1 -9 -5 0 -17 -3 -3 3 -12 -9 10 -10 -7 2 3 -5 6 0 -2 -6 -5 3 -17 4 -2 -4 -1 4 8 -1 -1 12 8 2 18 11 -4 8 8 -8 1 8 -4 -12 7
6319 7 13 9 -2 9 2 -12 -6 3 -9 -17 -11 -5 -4 -7 -10 -8 -11 -14 -12 -11 -9 -8 -15 -15 -5 -11 -6 0 -2 -8 -5 3 1 -2 -2 12 -4 4 5 9 -5 9 -5 -4 -2 4 -3 2 -10 7
6369 7 -3 -8 8 -4 -8 -2 5 0 2 -4 -11 -2 -9 -5 -12 -13 2 -5 -8 -13 -6 -6 1 -2 -8 -16 -1 -1 -7 -12 2 11 -1 -4 9 -5 3 -1 -2 -3 -1 -8 -7 -5 -4 2 -3 5 0 -11 2
6420 2 -4 -7 -13 -3 10 -15 -22 -13 -8 -22 -14 3 -12 -9 -1 -7 -4 -8 5 -8 -17 -4 -10 -10 -10 -7 3 -9 -1 2 0 -2 9 1 -14 1 2 -11 7 3 -3 -4 0 3 -13
6465 -13 0 -2 -1 -7 3 -5 -4 -5 6 -7 -10 -4 -5 0 -6 -4 -19 -11 -2 -2 -1 -11 -5 -12 -5 3 -4 -3 0 9 -6 -7 -2 0 -1 -1 7 -8 -1 26 4 -3 13 3 3 -5 10
6512 10 7 -6 6 10 5 -7 -2 4 0 -8 -10 -9 -15 -4 0 -14 -5 -1 -10 -6 0 -2 -4 -17 -1 -7 -13 6 -4 -12 -5 11 -3 3 1 -1 -7 -3 7 -1 0 -4 -1 -16 -8 9
6558 9 -3 -8 7 6 -5 -12 5 -1 -21 -12 -6 -8 -15 3 -6 -10 0 2 -5 -5 -3 -8 -21 -11 -6 -13 -11 0 -14 -11 -1 4 -3 -7 12 -5 -8 8 2 -5 -3 13 10 -2
6602 -2 0 6 -3 -6 12 -4 2 -1 10 -9 -4 2 -9 -21 -10 2 -7 -15 -2 1 -23 -23 -2 -18 -13 -12 -8 -23 -10 -7 -17 -12 6 -5 -17 -7 3 -2 -13 -7
6642gLmNJKNkLj2J4Mj4j1OJ3oNjj2qJ8Nk3J2Oj7J4j0MpOjjmMJj0KJ9j2lRLj4o
6687b1J4QpRmj5jJ7oj2J9Nkj9K2nk0K2llK%Kj1LPj2%PlmKJ8k4j1J5PpnJ6kj3J4
6730aj4OJ3nolJ0oMkRj3%OKrQJQj6J5Qk2LOm%%J3j2rJ3j1kJ4qmj0J5oNPj1mJJ
6776a0QoNjj2RLj1J1NjlNKqJ0mOj1LkKKpL%lPJj1NOoj4J1JqQJ1j2jJ3j0j5%K7
6822Hj3j3J8%%oQoLMj0jRqpJ3JKj2LRj5NLPj3K2j0lnJ7j4mJ3lj1JOOj8MKnLQ%
6868bj1JjoPNJj0jJ0MnJ4mj5K4pplJ5k3J1J2Oj5LlQo%jNLnLLklj2KKJl%lKqJJ1
6917booJ0lj1KMmK1nj0J5qOJmpL%J4lllQj1QnLoj4J9j8J1j1QMj4J2MkKOj1kPn
6963f%Nj3No%LJ%Q%JJ1j5Rj1KLpNkJ3j0nNmP%RjLj3KJ4j7KRk3RkJ0lmJ2nnj5J2
$$ plain form
6642 -7 -4 -8 -3 -2 0 5 3 6 -6 8 12 -2 -13 -7 6 0 5 4 -8 -16 2 7 -16 -4 2 -15 -1 -11 -7 -14 -8 -9 -10 -14 -10 -9 -19 -17 2 -10 -13 -4 -1 -15 -21
6687 -21 -7 1 -6 3 -1 -16 -17 0 -6 -18 1 6 4 -15 7 2 -18 4 1 -2 0 0 2 -9 -6 1 -11 -11 -4 -7 -11 -9 9 -15 -26 -11 -4 -11 -16 0 -2 -15 -1
6730 -1 -15 -9 4 -1 -7 -10 0 -6 -2 -4 5 -8 -8 -2 0 -9 -1 0 8 -8 7 15 -7 -4 2 -2 -2 -2 11 -1 -10 3 -8 -10 4 -4 -8 -18 -3 -9 -4 3 -8 -12 -11 -10
6776 -10 -2 -8 -3 -4 -16 -7 -4 -15 -4 1 0 -3 2 4 -4 6 2 8 -3 0 -2 0 2 -5 -2 -2 -5 2 3 -8 -3 3 -3 -17 -6 -5 -13 -5 6 -6 -7 6 -4 -19 -19 8
6822 8 -5 -18 0 0 0 -6 2 -4 -1 3 -7 -8 1 -7 -14 -1 0 2 -10 -7 2 -13 -8 -5 2 -11 11 1 -2 -7 10 -4 -8 5 2 -9 -8 -2 4 -14 -10 -8 -13 -10 -2 -2
6868 -2 -13 -12 -13 -19 -12 -7 -6 -16 -17 -7 -3 -8 6 2 -13 11 4 -3 -6 9 -14 -3 9 15 0 3 0 8 2 2 1 6 9 4 7 10 8 5 -7 -5 -3 -2 -5 -5 -8 -6 -14 -13 -2
6917 -2 -8 -14 -4 -7 -18 -16 -12 -16 5 0 -10 5 -3 3 4 0 -7 -4 -4 10 7 4 1 9 -2 6 1 4 -2 -16 3 -15 -4 -15 -7 -3 -17 -5 -1 -3 -1 5 -6 -8 -1 -6
6963 -6 -6 -1 -14 -9 -15 -15 -12 -11 -11 -3 -3 -2 9 -6 3 -8 -6 -3 -10 -5 -7 6 -4 -9 -4 -8 -1 -1 8 7 10 -3 -1 13 -4 -2 7 -16 -7 -9 1 -2 -6 6 1 -4 -19 -7
7011gpNjLpMkmlJ6kqJ0lkNMRoj8J4Jj3J4ojNmMjNpLj0NKOojMpl%LrPqJ1qPMnJ
7064gpONjnRp%JkpRMPqjRLj0J2qLJLl%poJ1jjj0JKMQj0MMj1kOoMrMnOm%LNmlR
7119blJ5j9J0krQkmRLqkNlLnPnJkRj0KNJnoJ1nJLpLLjlKKoKoQmmJqjRNKmKKpQ
7175apQlo%QjPrnQNMmj1MKLomlLKkmRj0PjNpl%MpJ1j3J0j4J3Mj1RnPoOj1OJJ%
7227gJ1j8J7lpKJo%MJ1pkJkkoJ0pNj1J2kJqJ2j1NPj4J2rOqRj1MJNOpNrPpK%lo
7276a7J0j0J3%nmLRkoJ2pnJJ3krMKpQMk0MKjOmkMmPj0J7rKj0KPJ0qLJrMjLKj5
7325a4NRk%KkJ1rJpLKKqRNj6NkJ6j7JPj0Nj1J4j8J3njLJ4k0J4JoRmLj1lKJ4j5
7370a1PJp%QNj2J0Nkj9J5Kj4PKJ1j5ONj1oJ0plJ1Nm%pr%NOnNqPkjJ3njljLkRj3
$$ plain form
7011 -7 -14 -9 -10 -7 -14 -10 -12 -16 -19 -3 -5 -13 -3 -6 -8 -3 1 10 4 -14 0 1 -12 2 -4 -5 0 -4 0 -1 4 -3 0 -10 -5 -3 3 -3 -4 0 -7 -10 -10 -7 -16 -9 -17 -6 -14 -7 -3 -8 -7
7064 -7 -14 -8 -3 -4 -9 0 -7 -7 -6 -8 -15 -6 -2 5 -3 -4 5 8 -2 10 2 5 6 9 6 6 -1 -7 4 3 2 -8 -7 -5 -1 7 -3 1 5 -6 -8 -2 -8 -4 -13 -9 -14 -8 -12 -12 -9 -4 -8 -11 -2
7119 -2 -5 10 -9 1 -1 -10 -2 -4 -8 1 4 -4 -6 -1 -4 -1 -6 1 -4 -3 -5 4 -6 -4 1 2 -3 -9 2 -3 -2 1 -6 -3 0 -1 -4 -2 0 -6 -4 -10 -2 -6 -10 -9 -17 -18 -9 -4 -2 -6 -4 -2 -9 -1
7175 -1 -8 0 -3 -9 -9 -1 -2 5 -4 -9 -1 4 8 4 -7 -3 -1 2 -4 -8 -11 -8 -6 -8 -12 -3 -13 -6 -7 -2 -9 -12 -12 -8 -15 -4 -17 -7 -21 -8 -4 -15 -6 -11 -4 -10 -4 -15 -9 -8 -7 -7
7227 -7 4 -14 3 0 -7 -5 -4 -10 -10 -6 5 -2 -4 -3 -5 -7 -13 -3 -10 -5 -16 -4 -6 -5 -13 -1 -12 -7 0 -14 -2 -11 -5 -13 -4 -15 -11 -10 -5 1 -6 -1 -10 -3 -10 -8 -8 -11 -17
7276 -17 -7 -17 -4 -4 -9 -13 -10 -1 -3 -9 3 -4 -9 -8 5 3 -6 -2 0 -7 1 5 -15 -11 -9 -10 -4 -8 -10 -6 -10 -3 -13 4 -5 -3 -13 -11 -4 6 -2 1 2 -7 -3 -4 -1 1 -14
7325 -14 -9 0 -2 -2 0 -2 9 0 1 -6 -3 -1 1 -7 2 7 -9 -4 -6 10 -7 -6 1 -9 -4 -15 -1 -19 -6 -11 -12 -9 5 -15 -1 0 -6 3 -1 2 -9 -12 -10 4 -11
7370 -11 -4 -3 -10 -10 -2 3 -9 1 6 4 -15 0 2 -12 -5 -3 8 -7 -1 4 -7 -13 -3 -10 -13 -2 3 -1 -1 -8 -17 -17 -12 -6 -11 -6 -14 -7 -9 -10 3 -2 -3 -6 -7 -4 -6 3 -10
7419a0PmQoLQn%Pj2KOmnMnlkRkoPJmmlMqPRj4PoQmnJ3p%J%m%lJ3nLj0ONkJoNJ
7474dmQnOml%NJpl%QqPJKKnrJ3j5NqJ2qQkJrRkj%%%NlNj0J0%%j1KKJ3mr%LJ2J2
7527A8k6L%Pj3LJjj1J0LLmjloJ2rQJ5k7LJRjkmLLoP%JpQpjOkMmPKMj1OkJPj0k
7578eJj1kMP%OqJ1j0%pJ2j5MKQpLnM%RjknJ5qKj1OPj0mm%J3j2ONjqJ3kjQkj3L
7627eJkMLMj2MnkkJ2jj5LJoRJKnNnPOpmJ0nQj6QoLlNMj1K0j5J6pLrPJnJ0pmPn
7678@ljJjNoNJoJnj0QjNJmOlNnKPj6LPkjpJ3k%jNOrQqPjMqJ2j0JqrJ6mpNlLMj0
7733a0LjmpR%Oklk%KNJJknMJJmJpLJRoLJQj0mJ2j6J0Oj1LNoOj5MlKJLKkMkjpQ
7787ekmPlrJ2%ooJJ4nlPj7J0j2N%NJOj%J0nMJrmLMj2OoL%LoQKNrrRj3J2LnkJr
$$ plain form
7419 -10 -3 -7 1 -5 -2 6 1 1 8 -4 -2 4 0 -5 -1 -6 -9 -11 -2 -4 -10 -3 -2 -6 -10 -13 -9 -17 -10 -1 -15 -8 -14 -6 -10 -15 -2 -9 -9 -8 -8 -12 -12 -15 -2 -7 -4 -14 -8 -3 -5 -4 -10 -5 -4
7474 -4 -8 0 -5 1 -3 -6 -6 -1 0 -7 -10 -10 -2 -10 -3 -2 0 2 -3 -12 1 -14 -9 -17 -5 -13 -5 -7 -6 -15 -6 -8 -9 -9 -9 -9 -4 -7 -2 -12 -2 -2 -2 -13 -11 -9 4 0 -9 -9 -6 6 18
7527 18 -8 -5 -5 2 -11 -8 -7 -8 -19 -9 -6 -3 -7 -8 -11 -17 -5 -14 -6 9 -18 -15 -14 -5 -6 -8 -12 -9 -6 -12 -5 -5 -4 -11 -3 -10 -11 -5 -7 -3 -7 0 2 6 -5 1 -1 0 7 -3 -5
7578 -5 -4 -15 -17 -13 -6 -6 0 -8 3 -7 -7 -14 -2 -17 -13 -11 -3 -10 -7 -12 -8 -8 1 0 -2 -7 8 0 2 -9 -3 4 -6 -10 -14 -14 -1 -13 -7 -2 -3 -11 2 0 -1 7 5 -8 -5
7627 -5 -4 -6 -2 1 5 -7 -3 -8 -10 -12 0 -1 -16 -13 -12 -18 -9 -8 -6 -11 -6 -11 -4 2 -5 -9 1 -4 4 -12 -4 -10 -7 -10 -5 -1 -12 8 -7 9 2 5 -4 3 4 -1 9 2 -2 5 0
7678 0 -3 -4 -3 -4 1 -5 0 1 -5 -4 -9 -19 -11 -12 -7 -6 -10 -4 -7 -2 -7 -5 2 -14 -11 -4 -6 -7 -14 -1 -3 -3 -4 1 7 -2 6 -2 5 4 8 0 12 2 3 -5 -14 2 -2 -9 -4 -7 -4 0 -10
7733 -10 -7 -8 -12 -19 -10 -10 -4 -6 -9 -11 -11 -9 -4 -3 -2 -4 -9 -5 -4 -3 -7 -6 -13 -10 -9 0 -6 -3 -2 6 -4 -8 4 -12 -2 4 -7 -4 1 -5 1 -14 -10 -13 -11 -10 -7 -5 -7 -3 -5 -6 -13 -5
7787 -5 -7 -11 -4 -7 -16 -4 -4 -10 -16 -15 -1 -6 -9 -2 -19 -9 -21 -16 -16 -11 -10 -4 -5 -5 5 0 4 5 -4 -8 -5 -1 -13 -7 -13 -10 -10 -7 -13 -5 -3 2 -7 -16 -7 -20 -8 -5 -10 -12 -11 -20
7839b0MjJ1OqJ%KlNPrrRj0RKJJLnjOnMLj0RqPj1J1LpM%j7J5nPnj2NjJmJ3k1J4
7888ikJKoNLqN%mKL%KJRmjpNnQqRlrMO%jj%Nj7QJ%mJ0jpj0mJ2plRRqNqMnMj2P
7944a5rJ8rKQLoJ2j2rLJ4j1LjOnOJKj2MNj4K0pnkLjoJP%j3%%J3oRj1%Rm%lRj4
7992a7KjPlkJ1lj1NKNPJjj1%MKj3JJ0KMj0LNLJj3JNMj2JOj5J2lmJ0j3Nj2J3rJ1
8038a0lNnqONLkj2J5lrJ9j0P%Oj1nOOMjLj3LMqLPpJ%jljkLKoNklKLk%jJ6j4pQ
8090grMkNJLkK1k2J0mJMKqJ3j4J%%R%KpjJj1KrJ4mLjj0NkJ1mklJlNl%PqJkM%R
8142Aj0Nj3J2jMmpPNoOl%nJLj0J4kLnjPoNj0Ll%okJ4j2Mjl%MnPJlknOnPJ
$$ plain form
7839 -20 -16 -17 -6 0 -8 -7 -7 -5 -8 -3 4 -5 -14 -5 -15 -6 -4 -3 -2 1 -4 -5 1 -4 0 3 -7 2 -6 1 -10 1 4 -3 1 1 -16 -1 -6 1 -4 -16 -11 -12 -11 -15 -2 -23 -9
7888 -9 -11 -10 -8 -14 -9 -6 -14 -9 -9 -13 -11 -8 -8 -6 -5 4 0 -1 -8 -3 -8 0 -8 1 -2 -11 -7 -1 -1 -2 -3 -3 2 -15 -7 -6 -6 -10 0 -1 -8 -18 -22 -10 -17 -20 -11 -2 -10 -5 -13 -9 -14 -10 -22 -15
7944 -15 -24 -6 -15 -13 -5 -2 -8 4 -8 -17 -14 0 -11 -8 -9 -3 -8 -2 -1 1 -11 -7 -2 -16 4 -3 -8 -10 -7 -8 -14 -13 -6 -6 -19 -19 -19 -6 -12 -3 -14 -14 -5 -9 -9 -12 -3 -17
7992 -17 -15 -16 -9 -12 -14 -3 -6 -17 -12 -10 -5 2 3 2 -9 -9 -5 -3 -16 -15 -5 -3 1 -9 -6 -1 2 3 -10 -9 -4 0 -12 -11 -5 -20 -8 -11 -15 -5 -18 -13 -25 -12 -21 -10
8038 -10 -13 -8 -13 -21 -15 -10 -7 -9 -21 -6 -9 -18 1 -9 -2 -2 4 -7 -12 -6 0 4 3 6 -7 -4 0 -8 -5 2 -5 -4 -4 -5 -8 -9 -11 -8 -6 -12 -7 -9 -12 -10 -7 -9 -9 -10 6 -8 -15 -7
8090 -7 -16 -12 -14 -9 -8 -5 -7 14 -8 2 -2 -1 3 5 -3 10 -4 -3 -3 -3 6 6 8 1 0 1 -10 -8 -17 -3 -7 -4 -5 -15 -10 -12 -1 -5 -7 -10 -9 -12 -7 -10 -10 -3 -11 -10 -12 -8 -8 1
8142 1 -9 -4 -17 -5 -6 -2 -6 -13 -6 -1 -7 -1 -4 -4 -9 -8 -5 -15 -1 -3 0 -5 -6 1 -5 0 -10 -7 -10 -10 -16 -18 -4 -16 -12 -13 -16 -16 -12 -17 -10 -9 -12 -14 -19 -13 -18 -11 -10
8191a0
$$ Imaginary data points
##PAGE= N=2
##DATA TABLE= (X++(I..I)), XYDATA
0@%%%%%%%%%%%%%%%%Qj6J6j6J6j6K4l2L2l8M6m8N6o8P6q8J04j18J32j50J68j84
38i6K05k29K56k88L20l52L88m30M75n24N77o34O99p71Q48r36J036j145J267j409
58g43J573j763J987k260K599l029L601m401N601p634J1948l6381N0186M9661r9560
73b8615M386O2836l7374o1666O4788M5362n1700j8554M0668k6832l2895N1081
85A1485L0815n5214q830M4725k0694m0685M4336L2846m6578j5446M0056j2808
97D008l2153L3615K4209m0712o531L7486j6616l3365L5279K5336m1459q531M0600
110B1166j4963l7401L3720K9547m2612j1984M4995j0641m4857K7908L8017l5207
122b312k0728L7192k045l7143K0016L1036k9304j4382L4487q189l8757K6598L7524
$$ plain form
0 0 0 0 0 0 0 0 0 0 0 0 0 0 0 0 0 0 8 -8 8 -8 8 -8 16 -16 16 -22 24 -24 32 -36 40 -48 56 -62 70 -80 88 -96
38 -96 109 -120 136 -152 168 -184 204 -226 249 -275 302 -332 367 -404 444 -492 544 -601 666 -743
58 -743 830 -933 1054 -1206 1393 -1636 1965 -2436 3165 -4469 7479 -28902 21284 70945 -28615
73 -28615 -24229 38607 1233 -60433 4355 49717 -1983 -20537 20131 -6701 -39596 11485
85 11485 42300 -12914 -21744 22981 2287 -38398 5938 38784 -7794 -23240 16816 4008
97 4008 -28145 5470 29679 -11033 -17564 19922 3306 -30059 5220 30556 -10903 -19434 21166
110 21166 6203 -31198 2522 32069 -10543 -22527 22468 11827 -33030 -5122 32895 -2312
122 -2312 -23040 14152 12107 -25036 -5020 26016 -3288 -17670 16817 8628 -30129 -3531 33993
135C3993l6045k4994M0444M402m3741J3768M2138k3296k9696K7158Q343l0385
147a7911J1903L0884k3705k2577K9067N462l2839J2626L4439k4390k8337K9873
159D495J3218l2667M949L2866j9181k6749K7359J3032l1407L955L1594j8650k6178
172b3364K8593J4831l3983m05L4464j3671k9030K5748J8745l4105o123L5984p226
185A0458l0238K0922J9772l2107q615L5556l015k9567J6601J8827k9689q991L5519
198A5433k34l0862J2483K0557k6447j1172L4833L116l2286P895K2257k1946j2040
211a8413L2148L832l2007N855K3047j8681j2664K9523M596l1764L702K5113j5021
224g34j5556K6136P468l0618P50K6618j1437j8280K2363R734k7997q47K6077r565
$$ plain form
135 33993 -2052 -27046 13398 17800 -25941 -12173 29965 6669 -23027 4131 12474 -17911
147 -17911 -6008 24876 1171 -21406 7661 13123 -19716 -7090 27349 2959 -25378 4495
159 4495 17713 -14954 -10005 22861 3680 -23069 4290 17322 -14085 -10130 21464 2814 -23364
172 -23364 5229 20060 -13923 -14328 20136 6465 -22565 3183 21928 -12177 -18300 17684 10458
185 10458 -19780 1142 20914 -11193 -19808 15748 12733 -16834 -233 18594 -11095 -20086 15433
198 15433 15199 -15663 -3180 17377 -9070 -20242 14591 17707 -14579 -6684 15573 -6373 -18413
211 -18413 13735 17567 -14440 -8585 14462 -4219 -16883 12640 17236 -14528 -10826 14287 -734
224 -734 -16290 9846 17314 -13304 -12554 14064 2627 -15653 6710 16444 -11553 -12400 13677 4112
238D112j9419J9574J1201k5342k127K5272p994k1047J7249J4364k2944n316K4293
251A1876n251k2241J4755J7042k0434q108K2226l174k1406J3053J7702j8492r916
264a2368J9958j018j9761J0954J7761j6487j1889J8054J925j8221Q464J7389j5094
277c33j3014J7266M104j7221O473J6361j4085j3073J6756N741j6325M028J5127
290A1805j2183j2861J5874P411j5974J182J4975r800j3281J5004R107j6217j599
303f557J5262o886j3153J3007R266j5185l000J4293m535j1823J0969Q248j4487
316d581l424J4628k762j2391R209Q967j3970m740J5315n78j3244O812R370j2136
330c525m974J4448K74j3051M937R254r913m979J2977R55j2875L140R847p638n531
$$ plain form
238 4112 -15307 4267 15468 -9874 -12001 13271 5277 -15770 1479 15843 -7101 -12417 11876
251 11876 6625 -15616 -861 16181 -4253 -12361 9865 6691 -14715 -1662 16040 -2452 -12368
264 -12368 7590 6572 -13189 -2235 15526 -961 -12850 5204 7129 -11092 -2628 14761 -333
277 -333 -13347 3919 8023 -9198 -2725 13636 -449 -13522 3234 8975 -7350 -3322 11805
290 11805 -378 -13239 2635 10046 -5928 -4746 10229 429 -12852 2152 11259 -4958 -6557
303 -6557 8705 1819 -11334 1673 10939 -4246 -7246 7047 2512 -9311 1658 9906 -4581
316 -4581 -8005 6623 3861 -8530 679 9646 -4324 -9064 6251 5673 -7571 -759 8611 -3525
330 -3525 -8499 5949 6223 -6828 -1891 7363 -2550 -7529 5448 6403 -6472 -3332 6515 -1123 -6654
345f654J1464J427j2755K383J0643o450o272J0338J820j2249J906J0907n311p043
359e846Q639K609j0860J091J0712m346q147P413M289r931l55J0753l152r227O170
374a88N757q440j518R480k312q594N188N893p122k082Q132j654q012M439O402
389E369o210l320P229n29p568L812O687n775m047O686J73o965L450O431n426m486
405d489O035J126o144K430N973m731m924N575K363n891J072O007l934n471N309
420C06L525n626l12N552k764n048M537L658m913j182M760j644m451L678L742m527
436g09k118M528l17m259K700L673m147k449M385M00l871K007L124l730k222M190
452A185Q87l579J009K742k852k087L790J273l586J89K759k210k006L695J302l908
$$ plain form
345 -6654 4810 6237 -6518 -4135 6508 58 -6214 4124 5944 -6305 -4399 6508 1197 -5846
359 -5846 2793 5402 -5458 -4367 6345 1999 -6148 1265 5554 -4377 -4732 6021 2869 -6358 -188
374 -188 5569 -2871 -4389 5091 2779 -5815 -627 5266 -1856 -3938 4194 2540 -5472 -1033 5369
389 5369 -841 -4161 3068 2539 -5029 -1217 5470 -305 -4352 2334 2507 -4458 -1008 5423 -3 -4489
405 -4489 1546 2672 -3472 -1042 4931 200 -4724 851 3214 -2677 -1605 4402 468 -5003 306
420 306 3831 -1795 -2107 3445 681 -4367 170 3828 -1085 -2267 2493 849 -3602 76 3818 -709
436 -709 -2827 1701 1384 -2875 -175 3498 -649 -3098 1287 1687 -2184 -177 2947 -783 -3005 1185
452 1185 2072 -1507 -498 2244 -608 -2695 1095 2368 -1218 -1029 1730 -480 -2486 1209 2511 -1397
468a397j77L018j556j920L179J152l686l86L046q56j954K414J203l426o68L426
484A412k66k668J707J771l053j033L453J89k930J015J934k221j034K921K69k786
500a320N83K102j532j270K432N09k842K14K563j055j768J989O92k666J84K651
516A466q61j902J525P25k172K21K524p21k144J148J157j786r6K495n48k563R60
533e72J753j582n13K338m66k637Q99K044j314q66J917j51k386O59K237r66j415
550a021J552M26k204L01K417p82j877J315Q89j940N5K205p09j898J113J087j516
567e87j85J807n30j810J020J400j384o14J755k63j923R85J737j416j015J659J6
584F52j798Q55J687j347j189J482L22j571N69J638j157j462J398Q39j541J32J700
$$ plain form
468 -1397 -1574 1444 -112 -2032 1147 2299 -1387 -1773 1273 417 -1537 877 2080 -1346 -2014 1412
484 1412 1146 -1522 185 1956 -1097 -2130 1323 1512 -1418 -403 1531 -690 -1724 1197 1466 -1320
500 -1320 -737 1365 -167 -1437 995 1504 -1338 -1124 1439 384 -1384 605 1297 -1369 -1185 1466
516 1466 605 -1297 228 953 -1219 -998 1526 805 -1339 -191 966 -820 -916 1579 1031 -1532 -572
533 -572 1181 -401 -914 1424 958 -1679 -780 1264 -50 -916 1001 850 -1536 -877 1360 394 -1021
550 -1021 531 957 -1247 -946 1471 689 -1188 127 1016 -924 -869 1336 627 -1271 -158 929 -587
567 -587 -772 1035 505 -1305 -285 1115 -269 -883 872 609 -1314 -329 1408 -8 -1023 636 652
584 652 -1146 -291 1396 49 -1140 342 664 -907 -338 1300 143 -1319 79 918 -623 -491 1209
601A209r44j644J354J110j456j61J508p71j475J237J105j322l98J326m53j364
617a139J029J235j277p13J358r8j384Q77J280j275q35J389Q7j303O81J124j188
634a52p58J313J73j194M53J002j015p50J300L53j330K46J151r03q16J381L89j433
652e90J46J169p41p50J215L34j393O9J171n53p71J033L85j380m4J332l57r78Q91
671A88N17j315q5J396k83j065P51N12j122k9J257l05j037O14N53r73r0J209k77
690D16j181O12P94r35k52J204k33j245O34R25r06l61J093j87j134N92R39q38n24
709e87R85k0j083M93R82q19o68R87J38j023M13R47q00o81R89K43r89L63Q56p88
729f2o53R77L16r77J74Q65o68p31R67M60j039k6R30m99p39Q99M83j000j11Q78
$$ plain form
601 1209 265 -1379 -25 1085 -371 -532 976 205 -1270 -33 1072 -250 -648 678 225 -1139
617 -1139 -110 1125 -152 -865 493 395 -989 -112 1168 -107 -942 447 534 -769 -88 1036 -152
634 -152 -910 403 576 -618 -165 837 -178 -928 372 725 -605 -359 792 -111 -927 454 843 -590
652 -590 -444 725 -16 -766 449 783 -610 -541 630 77 -694 339 724 -656 -700 632 275 -703 188
671 188 705 -610 -695 701 418 -647 104 616 -506 -535 722 417 -620 -6 547 -426 -516 693 416
690 416 -765 -153 641 -294 -546 658 425 -820 -186 739 -167 -528 565 378 -756 -164 775 -63 -587
709 -587 398 378 -705 -212 770 -49 -717 270 408 -615 -202 745 -55 -736 253 496 -493 -130 726 -62
729 -62 -715 262 578 -399 -225 640 -28 -759 208 668 -371 -397 533 34 -705 194 677 -323 -434 444
749D44l53o36P67M03r43j24Q40k48o31O35L97r15j52R24j90p33N81M31q87j24
769e14R46j66p49M98M44p49j22Q80j52p46L89N01o31k10P92r0p85L30N69n81k24
790c70P18j19p24L79N56n55k16O40j14o50L82N50n19l07N95l1o23L14N71n17l93
811d33N94M0o00L01N39n42l63O06P4n41K87M55n08l47O17J34n45J79M60m78l52
832d23O16J79o17R3M88m31l22O32J31o40J04M79l66k67N72J20o48P6N34k83l33
853c06N16J41o68N0O14k82m04M89J36o55P9O41k67m48M29J84n75Q9O29k41n18
874c67L90K96n18j5O39k25o11L80M01n12o5N84k46n92L95M48m81j51N13j55n52
895d44L81N00m70k63M81m0n18L46N16m91l81N19N0n24L16M66n16l85N53J13m64
$$ plain form
749 444 91 -545 222 625 -318 -442 398 150 -481 154 551 -364 -516 408 218 -515 66 497 -390 -514
769 -514 432 266 -483 15 459 -290 -412 468 316 -430 -41 460 -171 -381 411 321 -464 -134 435 -146 -370
790 -370 348 229 -495 -116 440 -115 -331 309 195 -455 -73 477 -42 -349 246 215 -408 -94 477 -40 -433
811 -433 161 201 -399 -98 441 -101 -464 142 216 -325 -38 417 -91 -438 179 313 -232 -53 407 -71 -423
832 -423 193 372 -245 -152 336 -95 -417 215 346 -294 -190 289 -77 -344 228 348 -300 -224 310 27 -306
853 -306 210 351 -317 -267 347 65 -339 150 286 -369 -290 351 84 -364 65 249 -326 -237 392 151 -367
874 -367 23 319 -199 -214 425 200 -411 -31 370 -142 -207 377 131 -461 -66 382 -99 -250 263 108 -444
895 -444 -63 437 -33 -296 185 145 -373 -27 489 -2 -383 136 186 -338 -22 444 -72 -457 96 209 -255
916b55J84M15m32l56N44K28n07M6M52l54l49N52K56n84l5M62k66l34N15K06o08
937b20o8M90j33l40L90J97n58j19N71mm28K71K46n17j11O21rn08K02K41m35p0
959b91O00l5n40J14L06k93r3N12j5n63P6M23k22j61M60j6n99J38M98k31k31L97
981B34m5n28J65N04k21l20L06N3m59J20N19j86m40K93J98m22N9N30k20m85L22
1002b3K61l79J9M24k27m35L05L21l48r1L80j47m29L14L92l72k32M34n9m40L29
1023cM27m72k56M61Jm11K83L83m65k92M62R8m11J59L82m17l76N42K25n20P3M42
1045C15m03l55N85K57n85J1M48l17l33N49K43o04j06M97j49m03M42L38o26k24
1065d20O27k0n12L73L73o17k10O67J9n22K58L24n09j75O25N8n76J32M08m27k37
$$ plain form
916 -255 -71 344 -88 -444 100 328 -179 -133 319 -35 -384 168 424 -160 -195 267 1 -333 182 388 -220
937 -220 -288 202 69 -271 119 316 -242 -361 210 206 -222 49 295 -222 -333 288 279 -229 -27 214 -221 -291
959 -291 309 274 -266 -152 154 -139 -232 280 265 -298 -222 201 -21 -182 278 262 -337 -199 299 68 -163 234
981 234 189 -339 -174 330 109 -211 95 148 -311 -191 328 142 -298 -5 193 -229 -170 360 140 -345 -23
1002 -23 238 -141 -122 302 75 -360 -55 266 -82 -173 207 60 -369 -55 337 -35 -267 167 108 -332 -3
1023 -3 424 -48 -304 157 158 -253 30 413 -52 -344 118 216 -195 -36 346 -71 -447 95 320 -200 -127 315
1045 315 -88 -443 142 399 -186 -175 273 -44 -377 172 415 -189 -295 202 53 -350 92 430 -196 -420
1065 -420 207 187 -325 48 421 -196 -406 261 280 -242 16 340 -169 -344 281 339 -237 -105 303 -124 -361
1086c61O56O9p11R7N68l74k87O24P0p29J04O13k92l31N25N2o73Q1O82k29m73M26
1108A07J71o60N5P69k13o28M12K80o29N2P75k32o81L73L55n13rO74j91o97L10
1129a20M87m47j60O23j51p32L41N94m90k55O08j25o77L96N81n09k97N66n9n88
1149d14L49N74n37m13O10J07o51K60O29n62m98P18J79p17K05O42n73m49P58K11
1169D28p39J21O34m59m77O97L04p77j9P01l32n70O56L74q55j03Q00k71n85O19
1189A47L28q30p3Q05k13n73N29L34p77j15Q44j30o89M32M42p53j67R07j39p99
1209d90M44M94p51j53R44j79q36M42N66o96k12Q93r6r00L74P31o61l89Q92Rr81
1230e55L40Q29o57m91Q78M3r68L30Q59o18n60P92J93r06J93Q88m94o73P09L32
$$ plain form
1086 -361 295 364 -347 -250 318 -56 -343 281 351 -378 -274 339 47 -284 241 293 -380 -299 383 154 -319 107
1108 107 278 -382 -327 442 229 -399 13 293 -336 -284 491 259 -422 -49 306 -207 -216 458 267 -430 -120
1129 -120 367 -80 -240 383 232 -500 -159 435 -55 -310 298 173 -504 -108 473 -36 -333 233 174 -414
1149 -414 -65 509 -28 -441 169 276 -375 -115 514 -48 -546 172 351 -366 -161 481 -92 -541 217 428
1169 428 -311 -190 444 -15 -492 205 509 -268 -287 414 82 -488 168 542 -313 -416 384 113 -472 147
1189 147 475 -355 -428 377 164 -409 120 454 -323 -438 406 276 -413 19 461 -292 -459 448 309 -490
1209 -490 -46 448 -303 -456 488 309 -527 -85 481 -215 -427 466 370 -530 -156 575 -86 -475 417 426 -555
1230 -555 -215 614 -43 -534 344 387 -581 -251 608 -10 -570 222 415 -491 -298 590 96 -577 132 464
1250D64q71J06Q90m75p20P26L68q77R8Q63m88p15P41L87q31J0Q42m11p28P11M89
1271E79q38j03Q66l43p76P19N36r20j55R36l10q29P26N67r54k23R64k01q31N90
1291@O23q73l36R82m2r03M90O84q53l89J042Kr54M20O98q07l70J006K2r62L40
1312a80P03o72l79R22N9r80K82P81o09m36R37O3j072K76R19o12n24R03P7j044
1332e86K75R26n69n93Q19J36r83K45R72n37p19P80K99r66J61J020n38q13P99L90
1352E18r52J29R55n34p85P80M26r03N9Q87m77p80P69N17r08j02R56l90q30P61
1372I6N94r61j76R45l26p89P40N35r67j82R48k47q01O56N66r47k83J028j00r04
1392e75N43O71r11l51J067l4r66M81O86q59l23J047l5r85L92P27p48l76R58N5
$$ plain form
1250 464 -407 -301 589 114 -606 120 488 -389 -291 572 84 -631 110 497 -334 -324 518 107 -621 90 579
1271 579 -259 -362 504 161 -615 104 640 -280 -435 501 191 -638 88 655 -299 -522 442 241 -590 0
1291 0 623 -250 -586 396 354 -549 -59 625 -228 -617 425 427 -527 -107 591 -216 -586 420 442 -520 -180
1312 -180 523 -149 -528 394 453 -527 -245 536 -73 -509 428 491 -581 -305 614 2 -522 381 458 -586
1332 -586 -311 615 46 -547 272 408 -575 -330 642 105 -614 166 465 -501 -340 680 142 -671 128 518
1352 518 -434 -305 650 116 -669 111 537 -366 -307 580 103 -677 92 609 -299 -401 555 165 -665 96
1372 96 690 -271 -447 498 172 -617 123 658 -309 -491 457 210 -591 65 631 -316 -599 429 329 -575
1392 -575 -32 639 -272 -623 444 410 -556 -75 611 -248 -571 476 441 -544 -152 575 -173 -549 409 464
1412D64j000K89Q22o39m72R21Q4j015K93Q71o26n15Q76O5r83L12Q73n94n67P95
1432B54J53r25K09R09n11o84P37K79q69J52Q94n17o90P38L14q44J58Q54n51o90
1452f30P58L60q19P3P91m57p00P01M57q02n2Q02l87p06P22M78q66q1Q27l53o96
1473e80P21M63q73j39Q11k51o62N97M58q25j84Q39j62p17N37N01q30k20R22j20
1493B86p85N10N17p96j93Q85j14p60L97N29o89k15Q33o1q32L34O33o20l02Q34
1513C91k7q78L38O85n73l53P84l6q45L43O97n21l83O51J7p63K75P09m72m92O18
1534A65J23p49K55P54n09n75O64J93p20K35P00m99n70O45K60o65J32O47m51n59
1554e24O21L37o70PO47l79n74O38L88p27m9O62l31n21O32L32p00r3O31k38m82
$$ plain form
1412 464 -536 -247 575 -64 -536 385 469 -546 -253 618 -8 -523 353 418 -565 -253 620 26 -541 254
1432 254 407 -518 -309 600 89 -595 142 421 -448 -296 598 81 -609 129 443 -401 -243 611 60 -630
1452 -630 128 488 -331 -258 533 76 -624 77 534 -268 -320 482 95 -611 111 589 -277 -358 469 116 -580
1473 -580 141 604 -269 -408 403 152 -510 87 545 -280 -464 375 213 -504 33 534 -296 -516 406 286
1493 286 -499 11 528 -268 -461 424 310 -450 -53 476 -213 -428 405 344 -488 -154 479 -141 -443 391
1513 391 364 -514 -176 509 -64 -417 367 331 -514 -171 526 5 -378 273 290 -473 -198 511 39 -453 165
1534 165 288 -461 -206 548 39 -536 128 321 -399 -164 536 37 -533 112 372 -293 -161 486 35 -524
1554 -524 97 434 -236 -229 418 39 -535 103 491 -236 -285 377 46 -475 157 489 -211 -304 327 89 -393
1575c93N12L35o69j54O53j23n31M19L62o81j54P29j05n67L83L37o24r7P03j04
1595B31n54L15L27n21q7O28q1n94K49M07m54j57O23o7o53K72M54m28j68N76j06
1616B12n86K83M24l81j80M73p1n13K45M46l60k55M44mn17K30M73l88k83M50Qm58
1638c08K34M22l92k63M43L7m23J96L86l47k94M20J18m35J19L93l29k98M46J49
1658B74m70P7M03l20k75M60J14m38N3L34k30k37L81J34m08k8L54j44k56L24J58
1679B60m44m1L95j35k64L37R3m21J4L69j11k20K60O4l36OL44o0k43J91R8l14J1
1702a47L68r9k85J82J35l08K9L68j34l07J85J38k27L0K70r9k85J33J60j27n3K03
1724A30q0k48J38K03j55o0J67j13j86K04J44j62m9J08j09n7K00P0j73l8Q1m2n0
$$ plain form
1575 -393 119 454 -215 -369 284 161 -370 49 411 -270 -424 305 200 -367 16 353 -271 -368 335 231
1595 231 -323 -8 319 -202 -289 339 258 -336 -87 320 -134 -291 332 265 -388 -116 338 -90 -258 318 212
1616 212 -374 -91 333 -48 -228 245 174 -339 -94 352 -8 -263 181 177 -340 -110 363 -25 -308 142 150 -308
1638 -308 -74 348 -44 -307 136 173 -250 -54 332 -15 -309 111 229 -206 -87 306 -23 -321 125 274
1658 274 -196 -119 284 -36 -311 149 263 -175 -122 212 -18 -255 126 260 -148 -176 178 34 -222 102 260
1679 260 -184 -225 170 35 -229 108 201 -220 -206 163 52 -168 92 156 -180 -174 170 110 -133 58 156 -158 -147
1702 -147 221 122 -163 19 154 -154 -125 243 109 -198 -13 125 -102 -72 198 99 -186 -53 107 -20 -73 130
1724 130 50 -198 -60 143 -12 -72 95 -18 -204 0 144 -18 -67 41 -68 -125 75 145 -28 -66 15 -27 -77
1747g7J75M8k01o7J67j9p3J54L2k62pJ98l3o0J09k9j92P1J43k9n6M5m3j06P0J57
1773A15n0j29M4Kr0J03J36j37j06J19j8q5J60O1j98m7J65l5n9J38J0j89j6J81
1797G5J1j28Q1O3k14k5K73Kk39R0J03k07J2L05q2k74J17J15j67L4K39q9k62R3
1821g4J75r8p6K01o0k69J05K33j40r4K12r8k43J81K23j95q8J95p6j97J91J75j88
1844er7J71k9j89J81J98k56j54K61J8k47J75K17l22j26L13j7k29J89J58l08j16
1866b14L47J4k56J10J73k60j38L48O1l24P2K30k79j15M06J6m11J31K51k55q9L81
1888A99l2l71J09K70k06j07L26nm07J20L46k28k00L71Nm64J46M19k76k39L68J2
1910A56m37J71M18k83k72L46Q4m14J14M43k61l88L71J78m12M4M48k78l86L94K21
$$ plain form
1747 -77 98 146 -55 -122 45 26 -47 107 139 -123 -130 68 35 -25 84 55 -137 -66 77 48 -8 37 -6 -112 -42 115
1773 115 65 -64 -20 -18 -108 -5 131 -6 -112 7 -11 -96 64 125 -73 -120 45 10 -49 89 99 -90 -106 75
1797 75 86 -42 39 102 -112 -137 136 138 -101 -11 92 -115 -103 202 120 -154 -37 78 -89 -55 184 95 -167 -74
1821 -74 101 3 -73 128 68 -201 -96 137 -3 -97 115 17 -226 -45 178 -17 -105 90 14 -183 8 183 -5
1844 -5 -102 69 40 -149 32 230 -26 -180 81 99 -148 27 244 -78 -204 109 92 -137 52 210 -98 -214
1866 -214 133 147 -109 1 174 -86 -224 124 185 -139 -67 163 -116 -231 175 191 -220 -89 162 -93 -182 199
1888 199 167 -204 -95 175 -31 -138 188 183 -224 -104 242 14 -186 185 190 -274 -128 291 15 -224 144 156
1910 156 -281 -110 308 25 -247 99 183 -231 -117 326 65 -323 48 226 -186 -142 306 28 -358 36 257
1931B57m44M6M19k79l50M11K24m25l7M03j70l60L80K81m67j03M44j33l87L88K71
1952C69n22j11M94j20l92L68K35n06j04N08n8m10K76K82m67j55N31j0m68K31L16
1973B87m28j82N70j0n30K23L45m21j40N28l0n20J96L77l31j69M56Jn05J54M45
1994C16l22k46M57J6n28J93M86l73k78M67J1n13K17M56l58k92M19P2m55J38M63
2015C46l19l59M32J36m85J10N00l51l88M72J79n13R7M65l26l62M56J79m75N4M32
2036B80k60l58M11K49m89l2M86k26m03M33K66n33m0N11k16l99M08K42n11m0M77
2057B56j66l82L53K42m80q7N19j09m61L17L18m87j35N68r4m92K90L31m61j21N27
2078B46q1m69K47L43l78j44M56j2m93J76M08l25k11M44J2m99J77M23l40k16M40
$$ plain form
1931 257 -187 -141 278 -1 -351 60 284 -141 -178 225 55 -305 75 356 -111 -214 230 97 -290 98 369
1952 369 -153 -264 230 110 -282 86 321 -185 -289 219 161 -249 27 309 -158 -313 218 208 -260 -29 287
1973 287 -141 -323 247 237 -293 -70 275 -146 -286 242 212 -308 -112 265 -66 -235 221 222 -283 -129 316
1994 316 -6 -252 205 221 -307 -114 372 -1 -279 188 199 -314 -97 359 1 -291 128 200 -255 -117 346
2015 346 27 -332 100 236 -249 -139 361 10 -378 94 273 -240 -143 322 -4 -366 90 269 -206 -152 280
2036 280 20 -338 73 322 -167 -199 287 61 -342 91 357 -176 -216 295 79 -320 88 330 -181 -221 256
2057 256 90 -292 61 303 -177 -264 255 146 -315 2 320 -167 -302 266 172 -320 -30 301 -160 -281 246
2078 246 165 -304 -57 286 -92 -236 220 208 -285 -109 299 -26 -237 207 219 -280 -103 320 -20 -236 204
2099B04nm82J82M06k99k44L88K7m42J61M19k76l22L79J08m41J01M55k70l64L86
2120G1J33m11J09L83k74l19L68J30l74P0L75k41l17L45K07l79k6L94j95l34L47
2141F2K28m10l6L78j76l07L45K00m08m6L49j22k78K75J97l68j00L76o3l00K27
2162B3K11l55j10M15n5l42K17K05l44o4L80n6l31J79K19k93p5L46k1l48J38K64
2184B03k41j27L38k0l57J34L02k57j22L24m7l37J67K69k29j49K58nk90J20K79
2205B13j87k17K43P0k79Q4L00k13k27K47Q9k71J09K56k21k01K34J04k28L6K14
2226A55j75j79K18J36k09l2K18j19k02K24J53k42k4K14j12j68K08J10k38j9J84
2247A01o8j49J62J19k24o1K00j9j76J28J15j93o9K27l0j79J16J14j87m3K08k7
$$ plain form
2099 204 199 -283 -101 305 6 -238 150 177 -265 -104 315 39 -283 96 204 -237 -136 319 49 -315 71
2120 71 204 -207 -98 285 11 -308 60 190 -184 -114 261 20 -297 48 255 -124 -150 244 49 -285 62
2141 62 290 -120 -156 222 46 -261 84 284 -124 -170 179 57 -221 54 251 -117 -217 159 96 -204 23
2162 23 234 -121 -231 184 129 -213 4 209 -135 -199 181 125 -206 -27 192 -101 -176 170 149 -199 -61 203
2184 203 -38 -165 173 153 -204 -70 232 -25 -147 177 130 -207 -40 229 0 -149 109 104 -186 -66 213
2205 213 26 -191 52 122 -157 -73 227 14 -213 34 123 -148 -39 217 -4 -205 29 133 -95 -59 155
2226 155 -20 -199 19 155 -54 -86 132 13 -189 35 188 -54 -78 136 24 -144 64 174 -64 -83 101
2247 101 33 -116 46 165 -59 -120 80 61 -115 13 128 -65 -134 93 63 -116 0 114 -73 -116 92 65
2269F5j50Q0Q1j26l7J55qj45N8J09j15l8J41qj57O2J28j04m1J40l1j40Q0R6r5
2294@l5J00l3r5O5Q0p7n8Q8jj23O5J08q9q1J04J3j06O4Q2j01l2R3j1o2M6M2p7
2322c1k5Q0J7o9J5M8n3m1R9Rq5K8M8m8k7J02k2q5N5K0l9rO5j6p2K2M7l4k1N3o
2353B5p5J2P5l5l1O3k7p0N3M9l9j6L7k6m0M9L1k8l1K4nk1L2K1j5m0M2jk0L3K2
2384D8n0j1N1j9k9M2Mo0K4L0k9j4L3kk8nL3nl9L0Rl5J1L9k0m5K7J9l4J9L5m9p
2417b7L6qk0K9Kk6J1L0ll7J4K8k7k1N3Jm7J8L6m6NN6l7m3M0K7m9NL3k9k6K2K9
2450B9l8k0N5k3m1K7N3o6j2N6qn4N5K6p3lO2j7n4N9J4n3j1N8Po1L3K6m4nO3Op3
2483b7K6N6p3LP1k4p7O1K5m9j3N6j2o9M0L4n0k1N6mo1M1N2o4k8O8ln7M0M3n5k9
$$ plain form
2269 65 -85 -5 76 -50 -87 68 60 -85 -27 82 -33 -71 70 62 -95 -33 95 -9 -50 90 59 -81 -1 95 0
2294 0 -35 65 32 -63 2 82 5 -53 35 34 -89 -24 84 -5 -86 18 31 -75 -11 71 -30 -62 31 20 -42 4 46 -31
2322 -31 -56 24 41 -28 -13 35 -18 -59 40 49 -36 -8 40 -8 -35 67 45 -40 15 35 -4 -13 52 36 -36 -14 33 -1 -22 31 25
2353 25 -50 -38 37 2 -29 34 7 -63 -10 39 0 -16 21 -5 -45 4 35 7 -24 0 -5 -26 6 27 12 -28 14 13 -7 26 48
2384 48 -2 -13 38 19 -10 32 36 -24 0 30 1 -13 20 18 -10 -15 18 13 -26 4 13 -22 -11 28 8 -37 -10 9 -25 -6 29 -20 -27
2417 -27 9 1 -19 10 12 -14 -3 27 24 -13 1 29 2 -19 34 35 -12 6 42 -4 1 57 20 -23 17 44 -5 0 33 4 -22 0 29
2450 29 -9 -29 26 3 -38 -11 42 -24 -36 20 12 -42 13 39 -34 -37 25 8 -46 13 27 -26 -37 21 28 -33 0 26 -18 -23 40 46 -27
2483 -27 -1 55 -18 -15 56 32 -45 16 41 -8 -21 35 23 -46 -6 28 -22 -43 13 9 -52 -11 41 -23 -51 17 14 -43 -3 40 -15 -44
2515d4O3No6L8M8o0l1O1J7n7K5L7m1m6R6J3q1K0N0n4k0Q1j0p0L0L8n7rP8j9p5
2546d0OO5m4l1Q1mr0K8N3m6k0Q7j9q4L4P3n7k1O5j2o9L2O6n6l2O3J0q4L7P2n3
2577A0m6P5Lr6M7Q9p6m8P8J0o9K4O8p0m8P5K1q2K2O3o1n5P4M5j05K5P9p5n1Q9
2607A5K4r1QQ6n6m9R4K6r4J2P6l7n7Q2K0q8j3J12n2o9R1K0j16K8J03n0o2P4J9
2636E6j01L6P8m8p5N6M6r1J4R3m1r7O6N3q2qJ01n6q7P1N8q0JR4n4q8R8N8j01P
2666b3Q8m7q1Q2P0j06k9R4l7o9J01N5j17l4J15l9p2Q3M6j03l1J05pr1O9N8j23
2693d3k4J25j7j01O1N4j07j6J31k5j04O4M1q7j6J23j3j22N7P9r6k0J32l5j11O2
2719hR4r3m7J29j8j36Q2J01j16l3J17l0j13O3R8r2o5J09Mj22N9J06j04p3J15K7
$$ plain form
2515 -44 19 24 -42 -4 44 -16 -47 14 31 -26 -1 36 -5 -51 45 58 -23 -3 47 -7 -27 54 44 -26 4 42 -15 -24 54 35 -40
2546 -40 -34 31 -13 -44 37 33 -57 -29 24 -22 -42 45 26 -58 -24 49 -8 -29 36 24 -45 -13 53 -3 -35 28 38 -46 -9 63 10
2577 10 -36 39 42 -54 -7 82 6 -42 36 46 -23 1 69 -1 -49 26 47 -35 -13 50 -11 -66 8 53 -52 -27 52 -23 -74 15
2607 15 39 -52 -44 42 -14 -63 31 57 -37 -25 51 14 -43 39 59 -29 -42 70 18 -51 40 60 -56 -28 75 25 -37 37 56
2636 56 -45 -9 69 21 -54 2 48 -43 -29 64 23 -74 -8 45 -37 -45 56 0 -87 -16 42 -38 -37 57 3 -85 13 71 -30 -23
2666 -23 65 18 -63 19 89 -17 -46 48 11 -58 43 98 -19 -53 62 23 -49 34 80 -23 -54 51 44 -47 22 80 -43
2693 -43 -67 58 41 -60 1 55 -52 -68 63 38 -66 -2 39 -48 -64 59 46 -76 -19 60 -36 -56 76 41 -70 -8
2719 -8 86 -7 -54 75 57 -79 3 104 -12 -45 72 42 -71 -8 90 -2 -67 42 46 -76 -17 89 -15 -88 27 54
2745E4j27O9Q8j18n5J23J4j04M2R2j04p4J25L9j15J2J12q0p0J19L8j38K4J02o3
2770Eo3J05M9j45J5J16q5m8J00L4j25mJ20m3r8R1N5j28j6J48m4j24J08M7j39Q
2796f1J27m2j00P7N1j11oJ38m3j00O1O6j01j1J32l2j17N5R1j03k4J30l5j27Q0
2821eQ8r4l5J31l7j12O0Q6q3m0R8j0j22O0J02r2p1J29rj23N3J12r9o9J15Mj25
2848h8P0Q9q7o5J01L2r9L3R5q3p1J04M5j16J9J11q2q3J24K9j21K7P4n0o7J04K6
2875G1j16J3R5m2p5Q7M0j23%J07k2r9R6L6j22j3J28m3r7P9L3r8NJ14j8j03M7O1
2903D1p8rJ15j1j10M1Q0p7l3J12k3j16O1Q0p3l5J02j6j04N3P5o9m0P0Mr0L2R5
2931G7n6o9O9J9q9M0Q1o6n8O2L5p9J2P2n9n8O9L8p3oP5k2q2O8N3o8j1P5l8m5O2
$$ plain form
2745 54 -73 -4 84 -34 -89 34 48 -56 -14 78 -26 -100 25 64 -51 -39 73 -7 -77 42 80 -58 -34 68 5
2770 5 -58 47 96 -49 -34 82 -3 -51 49 83 -42 -46 74 31 -67 24 79 -49 -65 83 39 -85 23 70 -69 -61
2796 -61 66 24 -76 1 52 -59 -65 73 30 -70 -9 57 -44 -55 77 45 -72 -17 74 -29 -53 77 42 -85 -5
2821 -5 83 -11 -46 85 48 -64 -4 82 -1 -41 57 47 -75 -15 87 -5 -76 53 44 -79 -26 86 -13 -82 33 37 -88
2848 -88 -18 71 -16 -81 20 52 -47 -14 81 -2 -73 31 76 -40 -21 90 8 -75 49 78 -43 -16 58 8 -59 45 71
2875 71 -45 -32 63 21 -54 33 73 -50 -50 57 35 -64 32 68 -54 -67 61 18 -79 0 33 -65 -60 54 36 -67 -20 41
2903 41 -37 -46 69 58 -52 -11 69 -8 -41 71 48 -68 -7 73 0 -35 67 51 -53 0 75 6 -34 36 40 -50 -18 77
2931 77 21 -48 21 40 -49 -9 72 6 -52 10 45 -34 -22 50 -9 -67 2 40 -33 -39 36 14 -68 0 53 -15 -26 49 11 -34 28
2962B8L6p5lN7k4l8L9L4n8k0N5%m5K9L6n9m1Q3j0o3M3L8o3kM3J2o8K8K5l1j2M4
2994A8Rn8QL9pl8L6K6n3qN3j5l3L9J2l5mO0k1l3J1K8k1k0M5J2n5JM6k6l3M5J1
3027C9o9J5M1j4l4L6kk4lK1qk6J5M1l7l0L5J8l8PL7l0k4N1Om6L0J3k4j3M0Rm1
3060ikM1j2n3M9L7m5j6M7mm8L0K9o0jM2mm1J3M4m2j9M2On4J7L8m1k3O4Po5J1N6
3094C4n5l6Q4No5K8M5l5l4N7J2n3jM7qn9N4L7o5j6O4j2p0O8K9o8j2P7l1n8O1L7
3126F1q3k1Q7j5p3M1N3p6k4P4J7j03M2P5r1k8J03qq4N4M6p2l1R5Mp8K6O5n5l7
3156c6P5K3r9K4Q4n7n5R7Jj02K6R7o8n9R2Jq7J7Q8m7p2Q2K1q9MJ06m7q6Q5L4j14
3187f1J4J08n5r2Q0P2j17J1J00n7o9P4O0r4j2J10m8q9Q5Q3j08m6J29l5j09R9O7
$$ plain form
2962 28 64 -11 -14 43 19 -19 20 54 -4 -24 31 31 -14 15 51 -8 -49 34 24 -39 4 42 -21 -23 20 32 -36 -8 17 -14 -26 18
2994 18 27 -31 -23 16 9 -29 7 33 -20 -28 25 10 -23 16 28 -7 -11 49 28 -5 6 34 13 -7 38 50 -5 -4 42 16 -17 28 39
3027 39 -30 -15 26 12 -22 14 12 -12 -15 6 -2 -28 -13 28 -9 -39 -4 14 -24 -17 20 -10 -34 17 23 -23 7 20 -4 -17 23 32 -9
3060 -9 -11 30 18 -35 14 51 6 -10 37 33 -15 15 44 -16 -17 25 21 -20 -7 37 -5 -24 18 24 -30 -13 25 -16 -39 25 32 -33 -22 34
3094 34 -21 -57 27 32 -33 -5 40 5 -29 28 40 -13 -14 33 25 -34 20 57 -8 -24 40 28 -42 26 55 -13 -25 52 21 -37 24 61
3126 61 -22 -43 44 29 -44 -3 50 -26 -50 24 41 -62 -20 55 -36 -64 39 31 -53 1 47 -25 -56 39 43 -35 -9 56 1 -36
3156 -36 39 62 -37 -13 71 14 -41 56 57 -45 -19 78 10 -49 43 44 -43 -26 62 15 -57 25 46 -43 -39 67 20 -66 19 53 -61
3187 -61 -47 61 6 -86 -6 66 -51 -40 60 3 -66 8 68 -26 -38 72 24 -65 20 103 -5 -51 78 43 -66 33 100
3214A00j25l5J30l8r9Q9N0j13l1J23mr5M6Q6j09n9J39Qj36O3R4j12n2J45j1j36
3240h2N8J00r1o4J36J8j50K4J31p7o7J26K2j58L2J45p5r1J43Lj49K5J51q4r8J10
3266C8L1j38K4J51o8j25R4N8j24KJ62q3j32J06Q8j50J3J49q0j26J14Q7j48JJ30
3291G4o5j09J05Q6j34l4J47m3j32J00J09j48m2J61k5j32J13R0j53m8J71l0j33
3314g2Q2Q3j23n9J54%j42O1J13j47n2J72jj64O2J24j26o1J47J9j71O8J16j10o1
3339h8J46J9j62M1J46j08q9J45L3j74L9J67j11r0J35M2j76N3J61j17r8J42L9j66
3363g1M0J46r4j15J32N9j67J1J58p0j49J32Q2j68jJ72q6j37J34Q1j49pJ51n5j32
3388a03J14R2j47k3J50l7j57J19J05j52l5J61l4j58J16J05j54m0J75l8j49J00
$$ plain form
3214 100 -25 -60 70 32 -67 22 72 -41 -72 51 47 -48 -2 84 -25 -84 55 63 -73 -10 84 -28 -80 65 54 -82
3240 -82 -24 76 -15 -79 57 75 -75 -51 80 3 -64 62 84 -74 -42 103 28 -63 80 83 -66 -41 110 26 -72 38
3266 38 69 -69 -45 106 38 -87 7 65 -59 -57 105 22 -110 -4 84 -66 -53 96 16 -110 4 91 -57 -56 74
3291 74 9 -100 5 91 -43 -77 70 27 -105 -5 104 -44 -86 75 50 -82 31 121 -32 -80 91 61 -72
3314 -72 10 93 -30 -89 65 65 -77 -16 97 -50 -102 70 69 -95 -33 91 -35 -96 51 70 -101 -33 83 -27 -88
3339 -88 58 77 -85 -44 102 -6 -95 50 83 -91 -52 115 4 -86 49 91 -85 -32 129 12 -86 56 95 -71
3363 -71 -31 115 21 -94 38 97 -70 -59 99 29 -120 12 94 -74 -75 97 11 -126 8 89 -60 -67 84 29 -103
3388 -103 11 103 -44 -67 83 46 -111 8 113 -39 -74 87 53 -105 11 116 -38 -78 97 59 -90 10
3410A0J06j37n5J62j1j63P5J30j29q8J72Nj64N7J29j34o6J59kj54O6J20j12p4
3434i8J41K5j48L8J32q9q7J36K6j49L0J47r6q5J38K4j49L4J36j00p9J11L7j34
3458e9K8J34q3j01J22M5j43PJ55q3j11J21N1j47JJ53p6j13J14N8j37J4J19n5j05
3483i1Q8P1j15j8J30l1j20R0P9j17k5J32l2j14Q8P0j09l0J34l9j10P6P6j10k4
3508e1J19j6j18O9Q1j05m6J34k5j26O5R6j13m0J33l2j12P3Q2r6m1J14kj19N2R7
3534G3q9o5J12J5j19M3J06p9o1J04Or7M8Q8r1n6J21Mr5K4Q2p9m8Q1L3j01J4P8
3562E2n4o2R2K2j09J5R9o9n3R1K6j04J4Q1m4n2P3L0r4J6Q8l3q2N9M4q9jJ04m2
3591A8p4P5K9q8K2P9l9o6P1L5p2jN9rp1M8L2o4rP2k3p4O2L8q1lP7l7n7O7J1o4
$$ plain form
3410 10 116 -21 -76 86 75 -88 -13 117 -12 -100 72 77 -87 -30 99 -35 -101 58 56 -98 -32 88 -24 -98
3434 -98 43 68 -80 -42 90 1 -86 50 76 -73 -43 104 8 -77 61 85 -64 -30 106 6 -73 38 75 -59
3458 -59 -31 103 20 -81 41 86 -57 -50 105 22 -89 32 83 -64 -63 90 14 -99 15 73 -64 -50 69 14 -91
3483 -91 -3 68 -47 -65 65 34 -86 4 83 -34 -59 73 41 -73 15 85 -24 -54 80 41 -69 7 83 -27 -51
3508 -51 68 52 -66 3 84 -21 -67 67 42 -84 -19 77 -36 -76 57 25 -87 -14 68 -28 -69 45 43 -76 -24 73
3534 73 -16 -81 31 46 -73 -30 76 -3 -64 40 46 -51 -3 85 -6 -62 59 63 -32 -8 74 -5 -53 28 61 -40 -26 52
3562 52 -2 -64 28 50 -59 -44 55 -14 -67 24 50 -54 -40 41 -3 -55 18 48 -46 -30 58 25 -57 2 46 -43 -44 60 18
3591 18 -56 19 48 -40 -18 61 22 -44 27 62 -10 -11 48 39 -32 16 48 -16 -25 47 24 -50 12 50 -31 -34 43 6 -51 16 27 -37
3623c7%O4k7l8L9K4n3k1Q5j1p8O0M7p7lO1j2o0N4L0o6NN6k2m7M1K9n4lN8j2o3
3655c1L8M2n0k8P1j1p8M8M0n2k9O6k2m7L7L5n9qN3ml7K4K9m0j8N4jm8L0L2n0j1
3687b5N4qm3K3L2m7lM9rl6K1J9k5j3L0Rn0K3L4l4j8M1ol3J6L2m8j3L9pk2K1J5
3720A8l3pK4qmLJ6j7k4M7Kl5L6J2l2oK7kl7M6Mm7K0L3k8j8K6mk6PL1j1k9K0K2
3755B6m6J5K3j2l2K9K2m7ML7l0k3M1Om3J8L3k0l5L7J3m0LM3k2k9K9K1l7mO2l9
3787Cj9M7jn4K4M9l9l3N4Rm8pM8k2m2M7J0l7j0M8j6n1M7K5o7J1N2k7m6M6K4n9
3819c4RN6l4k8L3K4n1LM1nn3N0L2o2mO4l0m9N8K7o3lO6j3n9M2M1o7nN5j0n8L5
3852HM6o9j5O2j2o7M0N0o8k0P7j8p2P0K8o2j7N9ro1M9L2m6k2O5J0p9M1M9o3k5
$$ plain form
3623 -37 -37 27 0 -38 1 25 -28 -49 36 25 -53 7 54 -23 -26 35 23 -37 17 47 -19 -14 42 20 -27 14 43 -11 -14 44 32 -31
3655 -31 7 49 -1 -29 42 31 -47 1 41 -11 -40 26 4 -43 -6 29 -30 -38 15 11 -26 -2 27 -13 -31 23 22 -26 4 36 -14 -25
3687 -25 29 21 -22 1 33 -14 -17 32 23 -13 8 27 2 -11 19 28 -22 1 35 1 -17 24 18 -15 1 33 -15 -28 11 4 -18 3 18
3720 18 -15 -22 2 -6 -10 -7 9 -8 -32 15 17 -18 18 30 -2 -8 19 17 -20 26 30 -17 3 36 8 -10 16 12 -14 -7 24 13 -16 4 26
3755 26 -20 -5 18 6 -26 3 25 -22 -18 19 -11 -34 7 13 -30 -12 21 1 -34 3 16 -24 -21 22 0 -29 0 21 -16 -20 42 3
3787 3 -16 31 30 -24 0 49 10 -23 31 40 -8 -15 33 11 -31 16 26 -11 -21 27 11 -40 7 32 -35 -24 28 1 -45 1 25 -34
3819 -34 -25 31 -3 -31 2 26 -25 -22 19 14 -39 11 43 -19 -23 41 11 -38 20 47 -16 -19 47 34 -25 17 58 -9 -14 41 31 -27 8
3852 8 54 -15 -30 32 20 -47 -7 43 -25 -45 32 14 -58 12 40 -22 -39 20 11 -50 -1 31 -15 -37 28 38 -41 0 49 -14 -39
3883c9P9jp7M4M4n0k9P2qo1K9N5n6k6N4J0p1J8P0n8m0P4Oq2L4O7p5l5P3Lp1L1
3915a6N0l8m6O3J5q0K2Q0l8o4P2K6q1PR0m5n7P4K3r9L1O1l1o2P1L0q6J2P3l0o0
3946c3N4L6q1nP7k7o6O1L3p8qQ5m1o6O8J5o3nQ3l5o6N9M0p0kO8j6o4M6N6q0pQ3
3979E1k0p4O2L0n6j8O4k4n4M3M4n5l1Q2j7o5L8M6o2k6P7j1p2L8O0p0j5P7k6n7
4009d1K5O3o9l8Q3lo7L1N6m9l2N9Mo9L9O0m4l7P1mp3L4O6n6k9O7po9L2O0n4l4
4041b5N5Rq2L5O1n2m3O6Qp1K4O6m7n1O4Nn1QO2m2n1O2J1n4J3N0k6n4N5L9q1J1
4073b6O5k0o2N7K5o4J5N9l3m8N2L1p1J1N8k0n5M1L5o4j0O6k2o3N0M4p5jN3k3m1
4104c6K8M3o3mN1j2m9K9M5l6l0M9pm7L2M3n7j1O4k5l7L2M3o1nN4qm4L2K9l9j9
$$ plain form
3883 -39 40 39 -38 6 50 0 -29 43 35 -26 3 58 2 -24 30 40 -31 -13 57 -1 -41 33 39 -43 -9 58 -17 -52 21 24 -47 -16
3915 -16 34 -4 -50 13 28 -52 -30 50 12 -52 20 46 -35 -28 62 17 -40 34 57 -42 -11 50 19 -43 28 58 -28 -16 57 27 -33
3946 -33 21 57 -24 -29 48 21 -45 16 49 -29 -37 48 7 -59 9 24 -39 -44 39 4 -62 -3 37 -33 -35 33 17 -47 -1 55 -25 -32 51
3979 51 31 -43 19 49 -7 -25 39 15 -39 4 48 -7 -38 44 27 -38 0 46 -16 -42 35 24 -48 -10 50 -20 -35 42 16 -41
4009 -41 -16 47 -22 -60 23 20 -47 -16 40 -9 -41 18 22 -47 -8 52 8 -29 42 38 -35 -1 65 9 -20 47 40 -29 3 63 9 -25
4041 -25 30 39 -43 -8 53 1 -42 24 32 -39 -15 51 4 -47 17 22 -29 -21 41 -1 -52 10 21 -33 -20 30 4 -50 5 44 -37 -26
4073 -26 39 19 -43 14 39 -25 -10 49 16 -32 20 51 -20 -9 49 29 -26 15 50 -14 -24 42 20 -43 7 51 -24 -25 28 5 -36
4104 -36 -8 35 -28 -32 19 7 -42 -13 32 -4 -34 15 8 -39 -7 36 -21 -32 32 7 -30 2 45 -16 -21 33 25 -19 13 42 3 -16
4136a6M9Mm9PM8m5j3L8Nn9K8L1n0k0O4j4n2L4L2m2j7M9Lm9J8M4k4m0O3jn7J8M2
4169B9l2k9N7Km2J4L5l3k3M2J2m5J0L7k0m3M3J5k4kK8j6l0K1L4n3NL3l2l1M2K4
4201B8n5J0K4k4k0L0K6l9j2L7nk4L1K2m7kM1j7j9L5Mm1J8K9j3j9K4kk7mL2%j9
4234BqK6l2pO0j3m3K3J4k7nL3rl1QK5k1kJ6k4j8K7J9l0pK5om1L5K3k9%K9rpJ0
4270FK1k8lK4kj8J4Rrj6L3kk7J2J0k5k1M1Pl4OK5k1j2L1j6lLLj0oK4jj7kPoqP
4309dJ4k9RK0j3nJ8rj6J6K0j4JJ0Mk4QJ3Rk3LNj4MJ2jk0R%j3LJ3j8jPKoJ3%lj6
4350a6J1OqmJ3j7lJ4rP%J4k5J2R%j4OPNqJ3mNj3RjJJPj5RNpjrKnKkj3J4J5l7J6
4395hJ0qnRj4J1lJ%MLnQpNkoQQj0kJ3j1kJ3qnJ2oJ2j3J3Qj5JOJj5QJ0k6LJ0j3
$$ plain form
4136 -16 33 37 -12 -5 43 -2 -15 23 28 -31 -3 28 -22 -42 22 8 -44 -10 22 -20 -37 12 15 -34 -16 28 4 -36 27 26 -31 -13 29
4169 29 -3 -32 25 27 -15 -1 34 1 -22 20 32 -13 -3 34 14 -29 14 29 5 3 31 15 -15 6 40 -13 -8 25 -7 -38 4 28
4201 28 -27 -17 7 -17 -37 -7 19 -20 -32 5 0 -24 7 29 -18 -20 21 4 -15 20 24 -17 1 30 17 -2 22 20 -7 -11 21 21 2
4234 2 -6 20 -12 -19 41 28 -15 8 22 -5 -10 23 14 -17 -9 16 -5 -7 9 -15 -33 -6 13 -17 -24 1 -5 -46 -11 12 -17 -17 12 3 -4 6
4270 6 27 -1 -4 20 18 0 14 23 14 -2 31 29 2 14 24 -1 -22 19 26 -8 -2 23 2 -10 21 5 2 5 8 -2 -8 16 15 -2 -4 3 -3 -11 -4
4309 -4 10 -19 -10 10 -3 -8 10 1 -15 1 21 7 8 18 22 -2 6 19 28 5 8 13 -1 3 15 14 -6 3 3 -10 -7 6 -12 -13 -6 -4 -10 3 3 0 -16
4350 -16 -5 1 -7 -11 2 -15 -18 -4 -13 -6 -6 8 -17 -5 4 4 -10 -4 3 8 0 13 9 14 1 10 9 10 11 18 3 12 17 10 9 0 2 -3 -1 -3 -16 -2 13 -24 -8
4395 -8 2 -6 -11 -2 -16 -5 -8 -7 -7 -3 0 -5 3 -4 1 -1 -7 1 9 -1 -3 10 -1 -3 10 2 -3 9 3 15 2 15 23 8 9 15 16 1 9 19 -7 -4 6 -7
4439gj0K0oomJ1nj0K1pmj4RJ0J%Oj4NPKrJ1Lj4PMll%J2j3%J8j2j2PJ2j1pL2j3
4481A4j7PQj4rK6j2k5K5Lj6LJ4rk4J4QKj5K1j4j0RK1k4qL0kj3J3Qj4oJ6Lj1K3
4518B5nj0k1L2nk1J4J8k8j4L4%k2%K1j8k0L1J2l3LK6k7nL8k3k7K3Pk7PJ4Ok5K0
4553@Ok1lK6Ml8K1M0m5lL7j2k2J5L4k6k3L4Nm1J4K8k1j9K2J3l2J6K2l4j1K6Mk6
4587a0J4J5j9l6L1K3k6j1L1j2k4K9K3m2MJ9j1j3L1J7l6oL6k2k6M9Km2J1K4rk0
4619fL5J5m0lL2j0l1K1J6m3LL5pm0K3K7n2NL7km4J6K7k1j0M0j4l0J4K4k3oM0o
4653B2m8K2K9l2mM4j5m5L7J9k2oL6j6k8K3L1l5j4K4Mm1K5L0m1k6M0Mm8K1K7k9
4685a2j7L4Ql5J9Rl5%K9J8l7J5L0l5j8N1Mm2J5K2k6j2M2%m2RL3k9k0M6Ml2kL1
$$ plain form
4439 -7 -17 3 -3 -9 -13 -2 -7 -17 4 -3 -7 -21 -12 -2 -1 -1 5 -9 -4 3 5 -4 7 10 -4 3 7 4 1 1 13 0 0 18 6 -6 1 13 2 -5 27 14
4481 14 -3 4 12 -2 -11 15 3 -22 3 6 -10 -7 7 -2 -26 -12 -4 -2 -17 4 -10 -20 -11 10 -14 -22 8 6 -7 6 14 0 -6 10 13 2 25
4518 25 20 10 -11 21 16 -5 9 27 -1 -15 19 19 -3 -3 18 0 -20 11 23 -10 -7 19 -8 -13 25 2 -25 -2 5 -22 -15 -1 5 -20 0
4553 0 6 -15 -18 8 12 -26 -5 35 -10 -13 24 12 -10 5 39 13 -10 24 29 -12 2 30 9 -10 12 25 -7 9 31 -3 -14 12 16 -10
4587 -10 4 19 0 -36 -5 18 -8 -19 12 0 -24 5 28 -14 -10 9 -2 -15 16 33 -3 -9 27 5 -21 28 30 -12 -1 23 14 -6
4619 -6 29 44 4 1 33 23 -8 13 29 -14 -11 24 17 -23 0 27 -25 -20 17 15 -29 -13 14 -7 -17 23 9 -21 -7 17 -6 -12 28 22
4653 22 -26 -4 25 -7 -11 33 18 -27 10 29 7 1 37 21 -7 16 47 12 -2 22 26 -15 10 40 -1 -27 13 17 -31 -10 17 -12
4685 -12 -29 5 13 -22 -3 6 -29 -29 0 18 -19 -4 26 -9 -27 24 28 -14 1 23 -3 -15 27 27 -15 -6 27 -2 -22 24 28 -4 -6 25
4719B5pk1K2J1m8%M4j8j5L5j6l8J0M0k4k6L1ml3J5M7k2l7K0J1j6j4O2j4l2J9K4
4751C1l7NL7k1l0K0K8l3J1L0l2k3L7Rk2rL2j3l8L4K0l6j9M2mk4J2L6n0rM0j6k3
4784a5L0J1m6jK4Jk8J7K9k7j8M2ml1J9J8k3%L3ll6K2J7k9PK0Jl1QK4j7j0J6Lm1
4819a8J4L1j7k1L4mm4J4M0j5l0K5nl2K3L5l8k6L3Nk6K2K0l0j6L6Om0J9L1k4k0
4851a8K6J0k3RK0j7j2K8Nk3LJ6j0k7L2J5m8MM2k5k1L8ml0qK5k2lK3jk1OK0j4k4
4886b9L5J2m2MM0lk4J2J3l2PL3j5k6K4Ok8J5K3j1k8K1K0k5%K3Mk7KL0k6qK2qk8
4921a4K1J4k9PJ3j2k9K0K0rj6K6j4j8J3K1k7%K4qj1K0J4k5pK7k0oJ6J9k8kJ3K
4955A5j4J2J4k0nJ9JrNJ2k8j1L2lk8J4K3l4rK7Kl8J2J2k4J1J2oj5J0K2j9%K2m
$$ plain form
4719 25 18 -3 19 30 -18 -18 26 8 -7 28 12 -26 -16 24 0 -26 5 1 -32 -17 30 8 -29 -9 2 -14 -28 34 20 -12 7 31
4751 31 -6 -1 36 15 -15 5 33 0 11 41 9 -14 23 32 10 1 33 20 -18 16 36 0 -19 23 19 -5 7 43 -7 -16 24 8 -15
4784 -15 15 26 -20 -21 3 4 -24 -7 22 -5 -23 19 15 -16 3 21 -2 -2 31 28 -8 14 31 2 9 29 30 -1 7 31 14 4 20 23 -18
4819 -18 -4 27 10 -11 23 19 -25 -11 29 14 -16 9 4 -28 -5 30 -8 -34 -1 4 -22 0 20 -10 -26 10 16 -24 -5 26 2 -18
4851 -18 8 18 -5 4 24 7 -5 23 28 5 8 24 14 -13 19 34 -14 -10 32 7 -14 24 20 -10 -18 7 -15 -18 5 4 -17 -11 9 -5 -29
4886 -29 6 18 -24 -20 20 17 -7 5 18 -14 -7 26 11 -15 9 15 -13 2 25 14 -14 7 27 2 2 25 29 2 4 34 8 0 22 14 -14
4921 -14 7 21 -8 -1 12 0 -29 -9 11 2 -14 12 -2 -20 -7 14 -13 -13 11 3 -8 12 26 1 -6 21 1 -5 11 30 2 0 13 15
4955 15 1 13 27 7 2 21 22 13 18 30 2 -9 23 20 -8 6 29 -5 -14 13 15 -23 -11 1 -23 -12 0 -6 -21 -11 11 -8 -8 14 10
4990A0k6K1Kjj9L1j8j9K4J0j1jQrmJ5J3k1qJ7nj1K5Ok5j0K4Kj6J0Mj9qJ2Mj7%
5027a0K5k6lJ5Mj6J0jj3%K1Jl2K0J7mj0J9lj5J4Rj2kK1kj6%J3qqK0ql1RJ7mj9
5065hK3j0j1J5Pj5jPlj3J1J2k0rPJ4k6QJ6k0pK7oj3J0J8k2KK2Nj8OKj2J1PMoj
5104A3Rj5kJ7ok0J0J6j6k1M2j2l0J6Rpj6L3j3k1J8Mj7mJ9nk4K3Rqj8J2J2k2PJ6
5140Hj2qJ2JnJ3J9qj5J3Jj1QJ3j6rK0j2oNJ1j6j6J9Rk8MK2k9LJ7Kj7LJ8j3j4K2
5178Hjk6J6J0j3rK4Pl0K0Nqj0J7lj0MJ4j3KJ1LrkK9j4k3L0rk7J4J7k2j6K7kk5
5215a4QK3j9k4K1J4j5j0J4pk2L2K3k9pL2j5l2M0j0nKK0j9rK2Mj4QQrj8K5Pk8N
5251BK6j6k2J5K9l9oL1rk6L1J0l2qL4j4k5J9J1l2MK6j0j7J2J6k5MJ6jk3J8K1k7
$$ plain form
4990 10 -16 5 7 6 -13 18 0 -19 5 15 4 3 11 2 -2 13 26 5 -3 14 9 -2 23 29 4 -6 18 20 4 14 18 -1 -9 3 7 -10 -10
5027 -10 15 -11 -14 1 5 -11 -1 -2 -15 -15 6 7 -25 -5 12 8 -2 17 14 -1 13 22 10 8 29 27 11 11 24 16 8 28 20 -11 -2 15 11 -8
5065 -8 15 5 -6 9 16 1 0 7 4 -9 2 14 -6 -15 -8 6 -20 -12 4 -16 -23 4 -2 -15 -5 13 -9 -7 15 20 2 8 10 -2 9 16 20 14 13
5104 13 22 7 5 22 16 -4 6 22 6 -15 27 15 -15 1 10 3 -13 20 7 -14 4 8 -9 -13 6 1 -23 0 9 1 -17 -5 7 -15 -8 8
5140 8 -4 -12 0 1 -4 9 28 20 5 18 19 8 16 29 13 4 24 12 6 11 22 6 -10 9 18 -10 -6 16 -13 -10 7 9 -8 -5 13 0 -14 8
5178 8 7 -19 -3 7 -6 -15 9 16 -14 6 11 3 -7 10 7 -3 1 15 2 4 15 18 9 7 36 22 -1 29 20 -7 7 24 2 -14 13 11 -14
5215 -14 -6 17 -2 -26 -5 9 -6 -16 -2 -9 -31 1 24 -5 -12 20 5 -27 13 3 -2 0 20 1 -8 14 18 4 12 20 11 -7 18 25 -3 2
5251 2 28 12 -10 5 34 -5 -11 20 11 -15 16 26 -6 -14 20 6 -19 0 11 -21 -17 9 -1 -18 -6 10 -15 -11 5 4 -19 -1 20 -7
5285gkL1ok3J2J8j8j2K8%l2K3J5j6k4L5ll4K8J9k7j1L1jl8L1Ql3KJ2Ok0QJ1k1
5320a0kK1qk4K3J0j2j7K5Oj8NK1j8rL0rk3J6J8k3nK9rj5OL0k7k0J9K0k5nL4k6
5355Hj7K1Mm2K4K1j9qJ8J4k7lJ6qj5K8qj4mK2j3k9L1K1m7PL5j7k3K8J0k1J9J2
5389B4mk9K2Pj4J2K4k1k5J9J2k4jJ8j1j5MJ6j9j2K5pk2K2J2k1JK1j3j7J5J3j8
5422fj5K8jj7J2K0k6j2K8kk0J2J7j6OKNj1RPj0j5K7j0j6J2K2k1j4L2pl1J8J9k2
5457Dj4J1Kj0KJ0j7j4L1mj2rL9k0jJJ9k0nK6k0j4L8ok1JJ1Nl3L5krQOj0k0K6k
5495A2j2nL0j7k0K9%j5LJ1j0qLJ6k6KJ3%j5LJ4k3NJ0Mk5J6J6mj4QoqK1%j2RJ8
5533B3rk1RJ7rj0J1kqJ0Pk0OJ3j2nJK1j8OJ0k1kLMlj1Rlj7J7J1kj9J5p%KJ7k4
$$ plain form
5285 -7 -9 22 16 -7 5 23 5 -7 21 21 -11 12 27 11 -13 22 19 -15 13 32 5 -6 25 24 -14 17 25 -8 -6 6 12 -8 0 11 -10
5320 -10 -12 9 1 -23 0 10 -2 -19 6 12 -6 -1 20 2 -7 23 14 -9 7 25 2 -3 26 17 2 8 38 11 -9 10 30 5 0 34 8
5355 8 -9 12 16 -26 -2 19 0 -8 10 24 -3 -6 10 2 -13 15 7 -7 -11 11 -2 -31 0 21 -26 -19 16 -1 -24 4 14 -7 12 24
5389 24 20 -9 13 20 6 18 42 21 -4 15 27 3 2 20 9 -6 -2 14 -5 -17 8 1 -21 1 13 -8 -7 14 1 -16 -1 12 -6
5422 -6 -21 7 6 -11 1 21 -5 -17 11 9 -11 1 18 2 8 10 15 4 13 20 10 -5 22 12 -4 8 30 9 -5 27 20 -11 7 26 4
5457 4 -10 1 3 -7 -5 5 -12 -26 5 1 -11 -20 19 -1 -2 -1 18 -2 -7 19 -1 -15 23 17 -4 -3 8 13 -20 15 13 4 12 18 8 -12 14 12
5495 12 0 -5 25 8 -12 17 17 2 5 16 6 -2 1 17 -9 -7 6 6 -9 -6 8 -15 -10 0 4 -21 -5 11 7 -7 1 -5 -13 8 8 -4 5 23
5533 23 14 -7 2 19 10 0 11 9 1 11 18 -2 4 17 5 0 1 22 4 10 20 -1 -3 0 4 1 -10 -1 -4 -21 -4 7 5 -14 1 -6 -6 -4 13 -11
5573a1OJ0QoMOj3KNKpjRj3oRJ3j2J5Jk8J1J1%j9J3Pk1J5rNj4POnKjkmjJ0k2PP
5617d%pPRj5jJ4nNOK%pM%JKJ5Lk1J3prJ1Pk0LJ0rj0RLj7JJ2pjMRj6lJ4nj8J8N
5663EpJJ0rjNkq%J5Qj7J0%j1J1%KnRMj8PJ9j2j6K5jj8lJ8kj9LJ1j1%Lp%nJ2j1
5706eNNjrQMj5KJOj0J1Qk4KK6qk1J5J4q%%%Kj1J6qjPKk3K1JqlRLpK%lqJ6qj1R
5753CrMj3LJ1j5J9llj3J5mMmJ4j2jOLpJ3Rk0j1K4j0mJ5%k3pJ7J7j6NPoj4K3kj9
5794dLJ2j5qK2j6oJJ4j5jlRj6PQKj5J7Mj5OJ3rkORj0kK3rpJ1Mk1J1LOj5RRj6q
5837dJ9qj5J5Lj2JJ0j4k%J3j6jJ0Kj3ROj0j4J2j3J0OQrmJ3%j5K0jOj6K7j4jKM
5877A4j9RJ3Rk3J3Nl2J7J9k2lKJ0rpJ5rj5nK0mkJ0qrJ0Kmo%J1j6J2jpJ2Pj2j6
$$ plain form
5573 -11 -5 5 13 7 11 17 4 6 11 13 6 5 14 1 -5 4 17 5 20 21 -7 4 15 15 -4 9 16 -5 10 1 6 -8 -1 5 0 2 1 -1 -5 -6 4 -18 -11 -4
5617 -4 -4 -11 -4 5 -10 -11 3 -2 3 9 11 11 4 8 8 9 11 26 29 8 21 14 5 16 23 3 6 16 7 -3 6 9 -8 -7 5 -2 -3 1 10 -6 -9 5 0 -18 0 5
5663 5 -2 -1 9 0 -1 4 2 -6 -6 9 17 0 10 10 -1 10 10 12 7 16 20 2 9 28 16 0 25 24 6 3 21 19 0 3 14 3 3 6 -1 -1 -6 6 -5
5706 -5 0 5 4 -5 3 7 -8 -6 -5 1 -9 2 10 -14 -12 14 6 -15 0 14 6 6 6 6 8 -3 13 5 4 11 13 -10 11 12 4 1 10 13 6 8 8 5 -3 13 5 -6 3
5753 3 -6 -2 -15 -12 -1 -16 3 0 -3 -16 -1 -5 -1 -5 9 -3 -4 2 5 -2 11 20 0 -11 13 3 -1 14 14 -9 -16 1 18 2 7 14 8 -6 17 15 -4
5794 -4 -1 11 -4 -12 10 -6 -12 -11 3 -12 -13 -16 -7 -23 -16 -8 -6 -21 -4 0 -15 -9 4 -5 -7 -1 8 -2 -4 19 10 3 14 18 -3 8 11 17 2 11 20 4 -4
5837 -4 15 7 -8 7 10 -2 -1 9 -5 -7 -7 6 -10 -11 -1 1 -12 -3 3 -7 -21 -9 -22 -12 -6 2 -7 -11 2 2 -13 7 6 12 -4 23 9 8 10 14
5877 14 -5 4 17 26 3 16 21 -11 6 25 3 0 2 12 3 -4 11 2 -13 -18 2 -2 -4 6 -2 -11 -1 1 -3 -9 -9 2 -14 -2 -3 -10 2 9 -3 -19
5917a9J6J4lj2J0J3k1K0jj2mkK0j2J1%j4kJ6j2rOKj2mNJ2k3K2Pj9lJ0Qj4kJ5j2
5955epQJ3j5jOPj0J1Jj2oJ2%MJ0%j9NJ0jmKPj3KJ6j0nO%pj0K1j2o%OmqJ3roMj
6000gjrK0Jj2MPj3J0PqoRJ6j7KRj5RRj0MlJ1j5JJ1Pj2LRPk3J3qj3RJpj1J9nj0
6043gR%nojJ4j6KJ3j0jLQj2kJ8pnJ2JkKPrrJ3jKj7J2kmRNljNqpJ9kpj1J5nj8K1
6090A2lmppJ5j5RQk7OJ2Kj1PQj7kJ6K%RoJjJ4lj3J1Rj5j0J0J0j4kQKj1J3oqOm
6133DnpJ4J0j7MMoj1J8Rk6J1jkqOKj3RJ5j6j2J5Qj7QJ7pj1J2Pj3J0Pj4pK0jj2
6173DjK0j4j2J5qnj1K2j5pJ7mj4J3MmoJ0Mj2oJ5j3nJ1jj2J5Mkj4JJ6j7OJ8ooJ
6213AL%%J0Mk0J4Nj5QONj0LjkqJ3lk9J5jLj1ONj7MK2j1j7J8j3kOPpJ0kpkJ2Pj9
$$ plain form
5917 -19 -3 11 8 -4 6 19 -2 18 17 5 1 -1 19 7 18 18 4 2 18 6 -3 3 5 -7 -11 -6 6 -17 5 12 -7 -10 0 8 -6 -8 7 -5
5955 -5 -12 -4 9 -6 -7 -1 6 -4 7 8 -4 -10 2 2 6 16 16 -3 2 12 11 7 9 16 3 5 21 11 6 12 12 5 -5 16 4 -2 -2 4 0 -8 5 -4 -10 -6 -7
6000 -7 -8 -17 3 4 -8 -4 3 -10 0 7 -1 -7 2 18 1 3 12 -3 6 15 5 9 6 17 2 3 14 21 9 12 21 28 5 18 10 -3 6 7 0 -11 8 3 -7
6043 -7 2 2 -3 -9 -10 4 -12 -10 3 -7 -8 -5 3 -9 -11 7 0 -5 7 8 6 8 15 6 -3 10 9 11 -6 6 4 0 9 14 11 10 15 7 0 19 17 10 -1 14 9 -9 12
6090 12 9 5 -2 -9 6 -9 0 8 -19 -13 -1 1 -10 -3 5 -12 -14 2 4 4 13 7 8 7 21 18 5 16 25 10 0 10 20 6 4 12 14 3 16 10 2 8 4
6133 4 -1 -8 6 16 -1 3 7 1 -10 8 17 -9 2 1 -1 -9 -3 -1 -14 -5 10 -6 -18 -3 5 -12 -4 13 6 -5 7 14 1 11 18 4 -3 17 16 4
6173 4 3 23 9 -3 12 4 -1 -12 10 -5 -12 5 1 -13 0 4 0 -6 4 8 -4 -10 5 -8 -13 -2 -3 -15 0 4 2 -12 -11 5 -12 -6 12 6 0 1
6213 1 4 4 4 14 18 -2 12 17 2 10 16 21 11 14 13 11 3 16 13 -16 -1 -2 1 -10 -4 1 -16 -12 10 -1 -18 0 -13 -15 -9 -2 -9 1 -1 -8 -10 2 9 -10
6257a0RJ1kmlQnmJ3loJLKj4J9LomPnpLPk0mPjj2J0KpNjPj5J7pj3J5joOo%KJ0j
6305@LkkQonJ4jj2RPk8K4Mj9J2Qoj5QJ7j4nQk%j7QJj2J0J2j5qPopJ7j6J1KL%q
6349a3J0J4j2pJ5j0jOlOnNjqJ4Kk0J2KolJ3Lk1J2jjMo%mMj3J5j5J1%lrRmJOj0
6393a2mOLKkJ2j1lJ2j6J7qKJ5j3KJ4k5%J6plQJqMQj2kRJj3JkLj0MJ4oj2OJlMJ
6438fKrNJpQqkRKjJmKkKQKlJ1lqJ3j%j0J6J%j4Nrj1J3lJj2OKnKj%j2K0lj1PRn
6488bj6J2KpJJ0j2Rj0J1oP%lJ3%kj8J0J2%j2K3nj8J5JrpJ3j2MrJnJ1lnopR%mJ1
6532conqJ1mpJ1J5j4J0QqnjONnOnqLK1j4oJ6loNPj7J4Klj4J0%rqJ3Mj9J4kj4P
6577fJjkj4J6mjJ5ooJJ6j1nJ6j1LLMj5mRJJJknJ1LPj8PJ1rJKj2KNQj2LNJk0J7
$$ plain form
6257 -10 -1 10 8 4 1 9 4 0 13 10 4 5 8 10 -4 15 18 12 8 15 10 3 6 13 -7 -11 -4 -5 -17 -7 -5 -12 -7 -8 -1 -16 1 -6 -19 -4 -5 -11 -5 -11 -11 -9 1 0
6305 0 3 1 -1 7 1 -4 10 9 -3 6 13 -15 9 13 -6 6 14 8 -7 1 18 4 -1 7 5 5 -12 -4 -3 -15 -5 7 -8 -16 -9 -15 -22 -5 -21 -10 -8 -5 -5 -13
6349 -13 -3 11 -1 -8 7 -3 -4 2 -1 5 0 5 4 -4 10 12 -8 4 6 0 -3 10 13 -8 4 3 2 6 0 0 -4 0 -13 2 -13 -2 -2 -5 -14 -5 -9 -8 -2 -12
6393 -12 -16 -10 -7 -5 -7 5 -6 -9 3 -13 4 -4 -2 13 0 2 16 -9 -9 7 0 -3 5 6 -2 2 10 -2 -4 5 6 -7 -6 -8 -5 -15 -11 3 -3 -15 -9 -8 -11 -7 -6
6438 -6 -4 -13 -8 -7 -14 -6 -14 -16 -7 -5 -6 -5 -9 -7 -9 -7 1 3 0 11 8 0 13 12 12 2 18 19 19 5 10 1 -10 3 0 1 -11 -5 -3 -8 -6 -7 -7 -19 1 -2 -13 -6 3 -2
6488 -2 -18 -6 -4 -11 -10 0 -12 -3 -13 -2 -8 -1 -1 -4 9 9 7 -11 -1 11 11 -1 22 17 -1 14 15 6 -1 12 0 4 -5 -4 -9 2 -1 -6 -12 -19 -10 -10 -14 -3
6532 -3 -9 -14 -22 -11 -15 -22 -11 4 -10 0 8 0 -5 -6 0 5 0 6 1 -7 -4 17 3 -3 13 10 4 9 16 -1 13 15 12 -2 8 8 -1 -9 4 8 -11 3 1 -13 -6
6577 -6 -5 -6 -8 -22 -6 -10 -11 4 -2 -8 -7 9 -2 -7 9 -2 1 4 8 -7 -11 -2 -1 0 1 -1 -6 5 8 15 -3 4 15 6 7 9 -3 -1 4 12 0 3 8 9 -11 6
6623FmokkQj6J0Lj0j3K2Mj9RkRmOOj6jJ9j1LLlqJ5Mkj5J0Ql0J6J3opJJ0rj0J2
6666AMrKjjnJ3Jj9OQj7KRlj4Rnj0K2J0j2qJ2Km%%J2j4J1Qj2lJ8qoLJ4pqJ0oj0
6710eJ5onrJ8j9O%Joj0K2j3mQJ3j5qJ3%j3J0J0k3J1JPrmJ3nmJ4oJKJ0j1JRMj4
6752@J4j0RlkJ1j9LJ3j2qNmLj4J5oj0jK0j7kJ2rM%%nJ3Mqj0MQnQPkj3J1JqPNK
6797A1pLJLj0PkKLnRj0KmQKrnj%jqkJJ2kKnlR%j0k%MkJ3KnPpPj3RPqKjMj1OJ5
$$ plain form
6623 6 2 -4 -6 -8 0 -16 -6 -3 -13 -26 -4 0 -19 -10 -12 -3 -7 -1 5 -11 -12 7 -4 -1 2 -1 -9 6 10 8 -7 3 11 -19 -3 10 4 -3 -2 8 -1 -11 1
6666 1 5 -4 -2 -3 -4 -9 4 5 -14 -8 0 -17 -15 -6 -9 -23 -14 -19 -29 -7 3 -9 -17 -5 -3 -7 -7 -7 5 -9 2 10 -2 -5 13 5 -1 2 16 9 1 11 5 -5
6710 -5 10 4 -1 -10 8 -11 -5 -5 -4 -10 -20 2 -11 -15 -7 6 -9 -17 -4 -4 -17 -7 3 -20 -9 -8 -1 -10 -14 -1 -6 -10 4 -2 -1 1 11 0 1 10 14 0
6752 0 14 4 13 10 8 19 0 3 16 4 -4 1 -3 0 -14 1 -5 -15 -16 4 -13 -15 -3 -12 -8 -8 -8 -13 0 4 -4 -14 -10 -2 -7 1 8 6 -7 4 5 -3 4 9 11
6797 11 4 7 8 11 1 8 6 8 11 6 15 5 7 3 11 13 4 -1 -2 -2 -3 -11 -13 -12 0 -2 0 -5 -8 1 1 -9 -11 -11 -7 -9 4 6 1 8 1 8 -5 4 11 3 5 4 8 -3 3 18
$$ [...]
8191@
##END NTUPLES=NMR FID
##END=
