##TITLE=1H_BAU-13021K
 CDCl3, 8 sc, 
 13.2.2019
##JCAMPDX= 6.0         $$ Bruker NMR JCAMP-DX V2.0
##DATA TYPE= NMR FID
##DATA CLASS= NTUPLES
##ORIGIN= UXNMR, Bruker Analytische Messtechnik GmbH
##OWNER= root
$$ XWIN-NMR		Version 3.5
$$ Wed Feb 13 14:35:27 2019 Russian Standard Time (UT+4h)  she@DPX200
##.OBSERVE FREQUENCY= 200.1313
##.OBSERVE NUCLEUS= ^1H
##.DELAY= (6, 6)
##.ACQUISITION MODE= SIMULTANEOUS
##.ACQUISITION SCHEME= undefined
##.AVERAGES= 8
##.DIGITISER RES= 18
##SPECTROMETER/DATA SYSTEM= spect
##.PULSE SEQUENCE= zg30
##.SOLVENT NAME= CDCl3
##.SHIFT REFERENCE= (INTERNAL, CDCl3, 0, 15.7039)
##AUDIT TRAIL= $$ (NUMBER, WHEN, WHO, WHERE, WHAT)
$$ ##TITLE= Audit trail, XWIN-NMR		Version 3.5
$$ ##JCAMPDX= 5.01
$$ ##ORIGIN= Bruker BioSpin GmbH
$$ ##OWNER= she
$$ F:/spectra/data/she/nmr/H-F/1/audita.txt
$$ ##AUDIT TRAIL=  $$ (NUMBER, WHEN, WHO, WHERE, WHAT)
(   1,<2019-02-13 14:34:17.90 +0400>,<she>,<DPX200>,
      <created by zg, POWCHK disabled, PULCHK disabled
       configuration hash MD5:
       00 E9 B6 7A A2 85 ED C7 34 08 36 98 17 FE 4E 26
       data hash MD5: 16K
       B1 1A B5 A0 C3 88 11 26 23 11 11 2A 67 3F 18 02>)
$$ ##END=
$$ 
$$ hash MD5
$$ 52 01 53 C2 2E 1F B3 5E 33 91 A6 3F 97 5E 73 32
##$RELAX= 
##$RELAX= 
##$RELAX= 
##$RELAX= 
##$RELAX= 
##$RELAX= 
$$ Bruker specific parameters
$$ --------------------------
##$DU= <F:/spectra>
##$EXPNO= 1
##$NAME= <H-F>
##$PROCNO= 1
##$TYPE= <nmr>
##$USER= <she>
##$AMP= (0..31)
100 100 100 100 100 100 100 100 100 100 100 100 100 100 100 100 100 100 
100 100 100 100 100 100 100 100 100 100 100 100 100 100 
##$AQSEQ= 0
##$AQ_mod= 1
##$AUNM= <au_zg>
##$AUTOPOS= <>
##$BF1= 200.13
##$BF2= 200.13
##$BF3= 200.13
##$BF4= 200.13
##$BF5= 200.13
##$BF6= 200.13
##$BF7= 200.13
##$BF8= 200.13
##$BYTORDA= 1
##$CFDGTYP= 0
##$CFRGTYP= 5
##$CHEMSTR= <none>
##$CNST= (0..31)
1 1 145 1 1 1 1 1 1 1 1 1 1 1 1 1 1 1 1 1 1 1 1 1 1 1 1 1 1 1 1 1 
##$CPDPRG= <>
##$CPDPRG1= <>
##$CPDPRG2= <>
##$CPDPRG3= <>
##$CPDPRG4= <mlev>
##$CPDPRG5= <mlev>
##$CPDPRG6= <mlev>
##$CPDPRG7= <mlev>
##$CPDPRG8= <mlev>
##$CPDPRGB= <>
##$CPDPRGT= <>
##$D= (0..31)
0 1.2 0 0 0 0 0 0 0 0 0 0.03 0 0 0 0 0 0 0 0 0 0 0 0 0 0 0 0 0 0 0 0 
##$DATE= 1550054057
##$DBL= (0..7)
120 120 120 120 120 120 120 120 
##$DBP= (0..7)
150 150 150 150 150 150 150 150 
##$DBP07= 0
##$DBPNAM0= <>
##$DBPNAM1= <>
##$DBPNAM2= <>
##$DBPNAM3= <>
##$DBPNAM4= <>
##$DBPNAM5= <>
##$DBPNAM6= <>
##$DBPNAM7= <>
##$DBPOAL= (0..7)
0.5 0.5 0.5 0.5 0.5 0.5 0.5 0.5 
##$DBPOFFS= (0..7)
0 0 0 0 0 0 0 0 
##$DE= 6
##$DECBNUC= <off>
##$DECIM= 32
##$DECNUC= <off>
##$DECSTAT= 4
##$DIGMOD= 1
##$DIGTYP= 9
##$DL= (0..7)
0 120 120 120 120 120 120 120 
##$DP= (0..7)
150 150 150 150 150 150 150 150 
##$DP07= 0
##$DPNAME0= <>
##$DPNAME1= <>
##$DPNAME2= <>
##$DPNAME3= <>
##$DPNAME4= <>
##$DPNAME5= <>
##$DPNAME6= <>
##$DPNAME7= <>
##$DPOAL= (0..7)
0.5 0.5 0.5 0.5 0.5 0.5 0.5 0.5 
##$DPOFFS= (0..7)
0 0 0 0 0 0 0 0 
##$DQDMODE= 0
##$DR= 18
##$DS= 0
##$DSLIST= <SSSSSSSSSSSSSSS>
##$DSPFIRM= 0
$$ [...]
##$SUBNAM2= <"">
##$SUBNAM3= <"">
##$SUBNAM4= <"">
##$SUBNAM5= <"">
##$SUBNAM6= <"">
##$SUBNAM7= <"">
##$SUBNAM8= <"">
##$SUBNAM9= <"">
##$SW= 20.0189088683792
##$SWIBOX= (0..15)
0 0 2 0 0 0 0 0 0 0 0 0 0 0 0 0 
##$SW_h= 4006.41025641026
##$TD= 16384
##$TD0= 1
##$TE= 0
##$TE2= 300
##$TE3= 300
##$TEG= 300
##$TL= (0..7)
0 120 120 120 120 120 120 120 
##$TP= (0..7)
150 150 150 150 150 150 150 150 
##$TP07= 0
##$TPNAME0= <>
##$TPNAME1= <>
##$TPNAME2= <>
##$TPNAME3= <>
##$TPNAME4= <>
##$TPNAME5= <>
##$TPNAME6= <>
##$TPNAME7= <>
##$TPOAL= (0..7)
0.5 0.5 0.5 0.5 0.5 0.5 0.5 0.5 
##$TPOFFS= (0..7)
0 0 0 0 0 0 0 0 
##$TUNHIN= 0
##$TUNHOUT= 0
##$TUNXOUT= 0
##$USERA1= <user>
##$USERA2= <user>
##$USERA3= <user>
##$USERA4= <user>
##$USERA5= <user>
##$V9= 5
##$VALIST= <valist>
##$VCLIST= <CCCCCCCCCCCCCCC>
##$VD= 0
##$VDLIST= <DDDDDDDDDDDDDDD>
##$VPLIST= <PPPPPPPPPPPPPPP>
##$VTLIST= <TTTTTTTTTTTTTTT>
##$WBST= 1024
##$WBSW= 4
##$XGAIN= (0..3)
0 0 0 0 
##$XL= 0
##$YL= 0
##$YMAX_a= 87343
##$YMIN_a= -100015
##$ZGOPTNS= <>
##$ZL1= 120
##$ZL2= 120
##$ZL3= 120
##$ZL4= 120
##$ABSF1= 10
##$ABSF2= 0
##$ABSG= 5
##$ABSL= 3
##$ALPHA= 0
##$AQORDER= 0
##$ASSFAC= 0
##$ASSFACI= 0
##$ASSFACX= 0
##$ASSWID= 0
##$AUNMP= <proc_1d>
##$AZFE= 0.1
##$AZFW= 0.1
##$BCFW= 1
##$BC_mod= 2
##$BYTORDP= 1
##$COROFFS= 0
##$CY= 11.3945322036743
##$DATMOD= 1
##$DC= 2
##$DFILT= <>
##$DTYPP= 0
##$F1P= 18.9103706918063
##$F2P= -1.10871071338519
##$FCOR= 0.5
##$FTSIZE= 0
##$FT_mod= 4
##$GAMMA= 1
##$GB= 0.15
##$INTBC= 1
##$INTSCL= 1
##$ISEN= 128
##$LB= 0.24
##$LEV0= 0
##$LPBIN= 0
##$MAXI= 10000
##$MC2= 0
##$MEAN= 0
##$ME_mod= 0
##$MI= 1.114404
##$NCOEF= 0
##$NC_proc= 0
##$NLEV= 6
##$NOISF1= 3.799351
##$NOISF2= 2.8
##$NSP= 1
##$NTH_PI= 0
##$NZP= 0
##$OFFSET= 15.70392
##$PC= 1
##$PHC0= -9119.508
##$PHC1= 11.60014
##$PH_mod= 1
##$PKNL= yes
##$PPARMOD= 0
##$PSCAL= 0
##$PSIGN= 0
##$REVERSE= no
##$SF= 200.130013532006
##$SI= 16384
##$SIGF1= 3
##$SIGF2= 2
##$SINO= 400
##$SIOLD= 16384
##$SREGLST= <1H.CDCl3>
##$SSB= 0
##$STSI= 0
##$STSR= 0
##$SW_p= 3612.71676300578
##$SYMM= 0
##$S_DEV= 0
##$TDeff= 0
##$TDoff= 0
##$TI= <>
##$TILT= no
##$TM1= 0
##$TM2= 0
##$TOPLEV= 0
##$USERP1= <user>
##$USERP2= <user>
##$USERP3= <user>
##$USERP4= <user>
##$USERP5= <user>
##$WDW= 1
##$XDIM= 8192
##$YMAX_p= 0
##$YMIN_p= 0
$$ End of Bruker specific parameters
$$ ---------------------------------
##NTUPLES= NMR FID
##VAR_NAME=  TIME,          FID/REAL,        FID/IMAG
##SYMBOL=    X,             R,               I
##VAR_TYPE=  INDEPENDENT,   DEPENDENT,       DEPENDENT
##VAR_FORM=  AFFN,          ASDF,            ASDF
##VAR_DIM=   8192,          8192,            8192
##UNITS=     SECONDS,       ARBITRARY UNITS, ARBITRARY UNITS
##FACTOR=    0.0002496,     1,               1
##FIRST=     0,             0,               0
##LAST=      2.0444736,     0,               0
##MIN=       0,             -100015,         0
##MAX=       2.0444736,     87343,           0
$$ Real data points
##PAGE= N=1
##DATA TABLE= (X++(R..R)), XYDATA
0 0 0 0 0 0 0 0 0 0 0 0 0 0 0 0 0 0 0 0 0 0 8 -8 8 -8 8 -8 8 -16 16 -16 20 -24 24 -28 32 -36 40 -45 48 -56 62 -68
42 -68 76 -84 92 -101 114 -124 140 -149 165 -182 201 -224 248 -274 305 -341 385 -437 499 -579 682
63 682 -821 1019 -1326 1846 -2910 5879 -30797 -100015 13747 53767 -25481 -8272 63873 -1238
77 -1238 -74036 -9595 41441 -3997 546 39773 -11227 -58462 3960 38168 -11895 -7400 38496
90 38496 -3348 -51091 -1017 32543 -7402 -3418 30614 -8289 -42535 7240 27452 -15571
102 -15571 -2982 37009 -6510 -47386 4634 32463 -12523 -7580 33334 -4472 -45402 5472
114 5472 33509 -14792 -11703 35115 585 -47259 -123 36648 -7019 -15066 24777 2400 -35944
127 -35944 980 27386 -9812 -8117 28997 -3379 -42977 5271 37517 -11616 -19813 27934
139 27934 7419 -40710 -4633 34940 -1629 -16151 18092 1958 -32996 1928 31324 -6842
151 -6842 -15721 21678 3255 -35990 59 35334 -4103 -20736 17297 7004 -31269 -1337
163 -1337 31874 -4641 -19679 17686 7109 -30994 -1062 32315 -5284 -22063 17770 11271
175 11271 -29669 -4769 31045 -3229 -22415 17369 13957 -29712 -8591 30751 -392 -22786
187 -22786 15820 15751 -28709 -12050 28804 3203 -20165 13521 14142 -27790 -12567 28691 5771
200 5771 -19831 10898 14128 -26441 -13659 28717 8521 -19948 7256 12980 -24004 -12225 28129
213 28129 8233 -20516 5446 12816 -21794 -11352 27591 8535 -21627 3072 14197 -18374
225 -18374 -11645 25981 8917 -22351 1467 15829 -15780 -12424 24053 8858 -22386 639
237 639 16738 -13825 -13167 21804 9044 -21430 102 17544 -12174 -14749 19896 10762 -20270
250 -20270 -1266 18089 -10589 -16358 18099 12451 -18752 -2663 17211 -9451 -16557 16492 13269
263 13269 -16982 -4173 15408 -7751 -15472 14906 13443 -15561 -5419 14159 -6096 -14181 14324
276 14324 13110 -15801 -6352 14227 -4568 -13377 13528 12334 -16121 -7132 14279 -2643 -12623
289 -12623 11783 11479 -15735 -7736 14721 -472 -12771 9718 11539 -14966 -8306 15455 1439
302 1439 -13543 7280 11550 -13266 -8140 14887 2169 -13504 5085 10732 -11099 -7026 13902
315 13902 1796 -13837 4016 11222 -9578 -6989 13499 1926 -14640 3307 12570 -8102 -7649
328 -7649 12222 1989 -14165 3072 12895 -7055 -8411 10294 2358 -12745 2693 12728 -6214
341 -6214 -9416 8765 3469 -11216 2377 12429 -6138 -10195 8439 4766 -10252 1617 11523
354 11523 -5894 -10122 8016 5518 -9262 431 10086 -5281 -9477 7865 6176 -9266 -1224
367 -1224 9836 -3801 -9307 7329 6846 -9035 -2506 9360 -2343 -8182 6573 5913 -8863 -2475
381 -2475 9138 -1601 -7699 5650 5413 -8595 -2870 9237 -404 -7734 4375 5188 -8105 -2716
395 -2716 9685 62 -8269 3680 5467 -7484 -2765 9628 659 -8469 2278 5476 -5902 -2719
409 -2719 8488 651 -8464 1613 6050 -4993 -3397 7881 1197 -8746 904 7052 -3568 -4146
423 -4146 6301 1540 -7451 754 6635 -2863 -4251 5007 1634 -6400 593 6412 -2441 -4964 3907
438 3907 2388 -5104 349 5507 -2520 -4664 3848 2396 -4507 777 5007 -3207 -4721 4339 3185
453 3185 -4322 -235 4392 -2588 -4533 3920 3619 -3946 -1151 3725 -2131 -3975 4076 3571 -4301 -1629
469 -1629 3771 -1439 -3502 3811 3251 -4253 -1805 3745 -672 -3177 3141 2909 -4236 -2048 4112 68
485 68 -3687 2200 3117 -3819 -2250 4211 604 -3889 1373 3143 -2951 -2000 3821 720 -3819 733
501 733 3252 -1935 -2044 3034 765 -3681 268 3376 -1247 -2159 2293 463 -3425 529 3477 -1117
517 -1117 -2177 1871 261 -2983 938 3568 -1058 -2523 1455 650 -2493 780 3537 -1075 -3112
532 -3112 1210 1254 -2193 503 3345 -1228 -3430 1292 1900 -1885 -22 2955 -891 -3355 1029 2521
548 2521 -1223 -877 2167 -187 -2829 656 2574 -970 -1393 1635 104 -2326 622 2227 -1120 -1504
564 -1504 1424 393 -1734 482 1717 -1054 -1323 1428 744 -1483 199 1485 -1056 -1299 1730 1000
580 1000 -1765 -210 1453 -971 -1223 1848 988 -2001 -521 1474 -557 -1078 1644 1073 -2003 -934
596 -934 1680 200 -1139 1110 1140 -1866 -1132 1784 565 -1226 637 905 -1720 -998 1774 653 -1301
613 -1301 163 828 -1184 -827 1575 791 -1326 -182 983 -671 -715 1430 622 -1491 -148 1214 -540
630 -540 -752 1200 351 -1539 -54 1330 -389 -914 818 361 -1316 9 1493 -250 -1210 642 641
647 641 -1106 53 1617 -369 -1489 610 828 -974 5 1405 -532 -1598 550 1046 -750 -262
663 -262 1132 -413 -1554 544 1377 -618 -584 1034 -231 -1446 691 1537 -718 -815 917 -71 -1219
680 -1219 656 1356 -801 -985 765 141 -1020 520 1188 -901 -1063 1007 449 -1111 383 1267 -936
697 -936 -1107 1277 667 -1281 116 1243 -798 -1084 1207 759 -1345 -295 1205 -411 -1079 958 811
714 811 -1309 -482 1247 -126 -967 845 674 -1288 -313 1363 -96 -925 770 546 -1263 -240 1417
731 1417 -59 -1130 548 627 -1206 -320 1512 -19 -1426 442 904 -1060 -392 1536 59 -1502
747 -1502 330 1097 -742 -462 1237 47 -1403 247 1111 -599 -605 977 12 -1346 285 1212 -634
764 -634 -764 935 98 -1206 419 1220 -685 -789 929 234 -1010 399 1097 -742 -870 910 410
781 410 -1015 196 1022 -764 -941 977 532 -1057 56 963 -687 -836 1069 569 -1056 -69 927
798 927 -494 -720 971 566 -1067 -229 917 -332 -729 826 486 -1137 -265 1002 -250 -731 760
815 760 396 -1115 -121 1085 -178 -693 650 366 -981 -26 1121 -167 -853 538 449 -955 -89 1130
833 1130 -233 -1024 482 547 -856 -78 1052 -297 -983 537 622 -724 -96 944 -260 -932 529
850 529 694 -699 -273 844 -216 -914 527 695 -819 -356 837 -196 -841 571 633 -842 -332 879
868 879 -61 -743 518 604 -777 -333 933 61 -795 380 594 -802 -359 987 40 -919 316 569
886 569 -777 -301 979 -2 -927 284 612 -645 -263 948 34 -942 244 708 -553 -338 880 -4
904 -4 -1010 247 777 -573 -398 808 -82 -972 321 807 -531 -428 723 8 -840 351 856 -501
922 -501 -536 696 123 -792 317 817 -598 -634 712 186 -801 260 723 -643 -590 748 249 -754 169
941 169 664 -542 -540 795 335 -785 48 704 -456 -529 797 317 -881 -16 707 -436 -513 734 231
960 231 -905 -22 713 -330 -466 677 226 -840 23 813 -255 -511 632 257 -855 34 878 -277
978 -277 -604 569 248 -826 25 792 -306 -654 511 305 -732 -8 786 -258 -665 496 421 -656
996 -656 -77 755 -250 -670 525 436 -669 -100 672 -282 -617 520 375 -684 -162 627 -211 -544 497
1015 497 413 -672 -168 701 -124 -540 533 417 -742 -150 772 -133 -578 490 353 -755 -171 763 -108
1034 -108 -632 367 355 -692 -184 794 -40 -680 325 447 -593 -156 819 -45 -715 313 464 -574 -142
1053 -142 738 -127 -743 282 467 -525 -195 667 -96 -727 281 571 -468 -266 673 -1 -680 326 602
1072 602 -487 -289 641 -11 -626 317 519 -538 -321 612 27 -631 243 508 -541 -391 671 106 -662
1091 -662 191 554 -511 -353 721 155 -681 183 549 -479 -350 685 149 -705 83 528 -391 -393 592
1110 592 196 -702 4 609 -292 -401 583 211 -678 43 631 -241 -356 515 158 -608 58 584 -228 -387
1130 -387 404 147 -589 30 583 -242 -467 404 197 -573 72 607 -283 -453 464 200 -550 90 585 -295
1150 -295 -463 447 241 -568 -31 558 -224 -512 403 314 -564 -100 594 -160 -504 419 334 -552 -85 594 -121
1171 -121 -430 362 303 -473 -107 504 -71 -421 276 259 -462 -131 484 -78 -429 273 253 -483 -85 523 -98
1192 -98 -386 322 228 -456 -32 505 -140 -419 292 259 -455 -95 515 -117 -518 261 356 -448 -150 556 -81
1213 -81 -527 297 407 -430 -143 546 -49 -483 280 411 -372 -212 466 10 -474 173 394 -358 -269 419 42
1234 42 -481 160 387 -357 -244 447 44 -423 186 350 -313 -201 416 43 -398 137 310 -321 -218 423
1254 423 55 -459 128 347 -373 -242 485 68 -483 133 408 -307 -232 460 109 -456 93 410 -231 -278 390
1275 390 148 -463 -3 409 -219 -342 347 150 -456 -7 399 -204 -290 321 135 -359 39 346 -166 -236 289
1296 289 125 -333 31 336 -187 -276 297 119 -394 27 363 -233 -298 323 125 -395 36 348 -183 -245 318
1317 318 164 -331 26 357 -147 -288 282 197 -362 -51 355 -143 -341 251 182 -369 -51 309 -140 -255 251
1338 251 149 -316 -21 312 -106 -238 236 178 -292 -58 315 -93 -282 243 175 -327 -64 317 -144 -262 256
1359 256 135 -347 -17 331 -106 -236 246 182 -303 -37 354 -32 -270 204 200 -301 -76 335 -79 -312 198
1380 198 153 -330 -54 330 -105 -294 192 184 -277 -70 318 -40 -288 162 227 -237 -96 292 -24 -289 163
1401 163 222 -259 -93 285 -73 -290 167 194 -244 -76 259 -49 -237 168 215 -192 -90 268 -17 -242 158
1422 158 217 -237 -112 275 -52 -290 161 185 -269 -115 248 -51 -255 121 174 -208 -102 229 -9 -239 119
1443 119 197 -200 -88 281 -16 -276 143 207 -234 -103 263 -45 -270 136 180 -206 -82 242 -24 -234 120
1464 120 219 -177 -106 246 4 -251 127 253 -199 -137 243 -23 -266 134 193 -230 -125 222 -41 -238 117
1485 117 189 -207 -126 237 17 -225 118 232 -196 -143 286 43 -248 116 214 -226 -137 256 17 -253 101 196
1507 196 -200 -123 237 45 -248 80 215 -149 -135 256 68 -244 73 247 -163 -148 252 35 -267 72 195
1528 195 -187 -131 200 14 -252 70 213 -181 -178 223 69 -242 59 251 -152 -175 238 80 -248 84 231
1549 231 -187 -161 225 52 -238 47 196 -161 -166 223 88 -226 26 228 -133 -166 226 99 -247 35 234
1570 234 -141 -160 226 68 -266 27 209 -149 -168 188 71 -253 1 217 -104 -183 176 89 -235 15 257
1591 257 -106 -182 200 71 -241 47 253 -118 -182 177 57 -230 19 230 -117 -196 157 106 -199 19 249
1612 249 -101 -204 189 111 -193 38 233 -119 -178 192 103 -204 22 190 -131 -186 160 97 -201 -19 187 -104
1634 -104 -198 194 111 -229 2 242 -101 -182 216 130 -234 -4 241 -104 -178 169 113 -223 -37 222 -64 -197
1656 -197 151 141 -219 -37 245 -57 -205 173 151 -200 -3 251 -70 -187 165 117 -188 -19 205 -68 -201
1677 -201 132 117 -194 -57 203 -89 -220 160 165 -205 -20 242 -75 -200 197 162 -198 -19 216 -81 -191
1698 -191 160 155 -203 -68 206 -45 -212 149 177 -222 -94 214 -31 -202 158 168 -198 -64 229 -23 -168
1719 -168 132 133 -190 -61 196 -26 -199 83 130 -183 -92 200 -36 -220 108 157 -186 -50 228 -56 -205 153
1741 153 159 -169 -36 200 -56 -191 134 155 -189 -89 198 -43 -220 130 196 -191 -110 221 -21 -235 141 206
1763 206 -183 -109 206 -15 -202 122 187 -153 -111 171 14 -213 71 160 -164 -143 181 13 -211 78 167 -176
1785 -176 -89 195 -2 -188 90 166 -153 -71 197 4 -196 82 163 -160 -110 200 -2 -228 87 200 -171 -134
1807 -134 199 -9 -241 106 205 -163 -116 204 21 -196 99 205 -146 -156 184 40 -214 41 214 -151 -199
1828 -199 167 50 -213 48 205 -149 -158 168 40 -177 63 179 -126 -127 163 72 -158 56 174 -122 -158 173
1850 173 63 -199 59 194 -152 -165 184 56 -206 64 190 -140 -140 185 71 -192 29 195 -115 -155 171
1871 171 86 -223 2 210 -114 -203 156 79 -214 11 197 -95 -168 151 84 -169 13 184 -72 -151 139 88
1893 88 -157 15 192 -75 -162 142 90 -179 26 179 -118 -163 157 74 -176 32 168 -115 -154 156 94 -160
1915 -160 -7 164 -81 -163 158 111 -202 -35 193 -95 -190 161 89 -206 -16 191 -79 -156 129 93 -166 -14
1937 -14 178 -46 -157 116 107 -159 -30 202 -44 -173 125 106 -175 -13 193 -67 -171 105 76 -155 -10 176
1959 176 -66 -154 115 109 -135 -10 182 -56 -178 102 111 -163 -46 195 -80 -207 125 117 -165 -29 170 -77
1981 -77 -166 117 120 -131 -25 165 -37 -173 103 149 -146 -55 187 -24 -168 112 123 -167 -47 166 -48 -164
2003 -164 110 101 -148 -24 167 -26 -143 79 117 -126 -42 165 -5 -179 74 120 -143 -41 179 -38 -195 89
2025 89 111 -144 -45 149 -45 -165 65 118 -101 -43 146 -4 -156 83 158 -90 -68 156 -13 -162 84 146 -127
2048 -127 -78 140 -42 -149 75 115 -116 -55 121 0 -130 84 122 -95 -93 135 11 -143 76 114 -126 -83 147
2071 147 -31 -163 63 97 -133 -57 130 -15 -143 50 95 -96 -67 128 18 -129 41 137 -89 -60 154 4
2093 4 -146 57 120 -102 -48 122 -33 -136 44 72 -97 -44 107 -8 -128 48 106 -80 -62 118 -1 -152 62
2116 62 110 -109 -60 132 -20 -141 58 87 -127 -52 112 -19 -117 41 82 -99 -67 119 17 -125 49 121 -84
2139 -84 -48 163 1 -134 61 109 -109 -29 136 -20 -135 44 86 -75 -56 109 9 -134 38 107 -75 -77 122
2162 122 -2 -161 50 121 -95 -67 126 -24 -142 55 88 -99 -42 96 -21 -119 35 103 -73 -57 108 10 -136
2185 -136 55 144 -85 -56 145 3 -133 72 112 -107 -39 120 -15 -142 44 97 -77 -59 117 6 -135 21
2207 21 127 -80 -83 121 -5 -146 46 118 -80 -53 115 -26 -142 54 93 -80 -46 96 -20 -118 43 116 -72
2230 -72 -49 106 3 -148 63 153 -83 -67 141 -12 -156 74 151 -103 -58 123 -22 -132 52 134 -76 -97 108
2253 108 19 -144 38 147 -77 -117 111 26 -134 40 147 -86 -88 110 6 -128 38 107 -79 -83 68 20 -116
2276 -116 23 111 -60 -77 107 28 -134 46 153 -79 -80 135 28 -145 50 144 -84 -74 111 14 -131 29 133
2299 133 -60 -97 103 46 -148 5 179 -57 -126 111 49 -156 27 157 -63 -101 112 22 -124 14 120 -50
2321 -50 -96 57 42 -105 14 133 -53 -104 87 46 -121 33 150 -69 -90 117 29 -134 45 131 -77 -86 105
2344 105 22 -114 20 137 -60 -114 89 54 -142 -6 158 -70 -129 123 65 -151 16 157 -74 -106 102 52
2366 52 -131 -1 119 -44 -109 69 58 -119 -19 121 -18 -113 83 66 -111 2 156 -36 -97 98 43 -121
2388 -121 32 144 -45 -86 91 51 -112 18 134 -53 -114 79 76 -139 -11 145 -52 -134 101 89 -138 21
2410 21 156 -54 -133 105 88 -116 -13 124 -21 -135 64 92 -112 -43 130 -15 -138 75 87 -124 -34 143
2432 143 -40 -107 93 78 -108 -4 134 -18 -98 68 66 -100 -27 133 -19 -138 52 78 -119 -39 150 -30 -137
2455 -137 72 81 -116 -10 151 -20 -126 71 90 -90 -23 132 -15 -139 58 106 -86 -49 138 -7 -142 71
2477 71 112 -101 -38 134 -17 -130 72 101 -75 -28 109 -2 -97 55 108 -80 -60 100 8 -127 40 101 -108
2500 -108 -61 127 -13 -125 69 91 -116 -44 112 -5 -111 45 79 -86 -64 101 20 -130 39 105 -76 -68 121
2523 121 24 -140 41 114 -79 -53 126 4 -114 41 99 -55 -41 104 22 -100 28 114 -64 -75 95 12 -132
2546 -132 14 111 -71 -85 101 -5 -121 44 92 -79 -74 95 11 -105 35 97 -62 -89 79 34 -103 10 99
2569 99 -72 -86 110 28 -116 35 108 -82 -75 102 26 -102 21 94 -52 -61 92 42 -100 0 97 -38 -62 84
2593 84 41 -128 -10 104 -52 -67 87 17 -117 6 102 -45 -68 69 14 -97 12 89 -33 -69 70 36 -104
2616 -104 10 133 -42 -86 80 47 -114 24 111 -50 -87 77 36 -79 12 102 -38 -65 73 64 -73 -13 94 -47
2640 -47 -93 78 46 -108 -4 99 -45 -72 82 40 -104 -1 79 -37 -59 76 39 -81 -19 85 -14 -67 67 52
2664 52 -104 -16 112 -21 -90 60 41 -104 5 106 -33 -72 50 36 -78 0 91 -4 -73 48 70 -73 -17 92
2688 92 -7 -94 43 58 -87 -16 95 -42 -100 55 49 -77 -14 68 -24 -76 47 64 -56 -35 75 -2 -71 56 77 -72
2714 -72 -37 91 -11 -61 66 53 -84 -24 79 -6 -59 61 40 -74 -32 85 22 -69 36 56 -66 -32 97 12 -74
2739 -74 32 51 -80 -26 102 -11 -85 22 35 -50 -21 79 -12 -86 12 53 -38 -13 75 -3 -92 34 93 -44 -16 74
2765 74 -14 -84 41 70 -43 -25 54 -19 -65 52 66 -39 -29 68 9 -46 38 68 -45 -36 72 -3 -68 44 55 -67 -33
2792 -33 74 4 -65 28 34 -57 -41 61 17 -69 3 42 -48 -34 71 17 -74 13 72 -49 -17 75 2 -76 19 45 -38 -18 50
2821 50 -8 -62 20 53 -8 -23 43 9 -55 17 72 -35 -29 53 13 -71 43 59 -42 -47 51 -6 -63 32 39 -54 -62 35 26 -52 1
2852 1 55 -46 -47 55 32 -55 24 57 -41 -36 70 18 -55 3 42 -36 -17 44 29 -57 10 56 -17 -21 49 23 -68 -12 59 -18 -45
2883 -45 51 6 -76 5 60 -30 -32 42 -8 -55 21 58 -26 -52 29 5 -53 7 60 -43 -55 36 20 -48 21 74 -35 -56 45
2912 45 12 -41 2 44 -33 -46 47 34 -35 -14 34 -13 -36 46 51 -41 -6 42 -31 -38 54 22 -53 -4 45 -28 -20 51 9 -58 -10 51
2944 51 -17 -22 24 8 -62 -19 52 -11 -46 41 21 -58 2 70 -15 -39 26 18 -56 0 59 -23 -33 18 24 -30 7 53 -10 -54 17 38
2976 38 -33 1 45 -13 -57 29 35 -30 -3 35 -21 -48 33 26 -33 -20 28 -25 -42 35 22 -50 -30 36 -9 -47 30 28 -53 -13 51 3
3008 3 -28 23 21 -40 -26 35 8 -40 20 21 -40 -14 55 -4 -48 4 30 -33 -9 64 -7 -56 7 17 -21 -4 43 -9 -44 11 20 -21
3040 -21 -21 18 -19 -51 9 33 -35 -33 32 -16 -44 25 41 -11 -7 33 -7 -22 7 36 -19 -25 22 -3 -30 14 35 -24 -23 29 21 -29 14
3073 14 35 -28 -25 31 17 -24 29 14 -28 -11 41 12 -31 -4 5 -19 -15 20 2 -45 -11 19 -20 -29 41 5 -46 14 42 -16 -6 38
3105 38 -6 -45 -1 31 -10 -13 30 5 -28 3 42 -19 -34 36 2 -40 9 26 -30 -30 23 6 -27 26 31 -15 -10 19 12 -21 -3 14 -32
3138 -32 -31 16 14 -30 -13 11 -25 -23 25 16 -25 -3 13 -10 -12 33 7 -26 -12 13 6 -3 24 7 -32 -4 41 2 -12 32 5 -41 -9 40
3172 40 -4 -20 10 -5 -31 2 38 -1 -22 7 13 -15 15 22 -3 -39 10 11 -30 -3 31 -13 -27 17 13 -14 -7 8 -18 -20 20 9 -15
3205 -15 -7 6 -2 -15 30 21 -11 -13 22 -8 -18 18 10 -30 -18 16 2 -11 9 11 -34 -15 15 0 -8 9 3 -30 -11 24 -16 -31 2 8 -25
3240 -25 -1 18 -5 -20 0 8 -24 -1 26 -5 -32 0 9 -17 1 29 7 -18 12 25 8 -2 24 2 -19 20 16 -14 -4 18 -15 -23
3272 -23 9 18 -18 -10 8 3 -15 13 13 -16 -18 18 9 -25 14 8 -29 -8 6 7 -10 0 8 -19 -2 13 -2 -17 7 12 -7 -13 28 6 -20 11
3308 11 9 -8 6 23 -1 -34 9 15 -18 -2 19 2 -16 5 -5 2 -14 19 2 -11 9 6 -13 -17 2 -12 -41 2 12 -18 -7 1 -21
3341 -21 -19 0 11 -10 -23 -5 -4 -12 7 6 -7 -17 19 8 1 4 12 -13 -14 21 9 -22 -6 1 -11 -4 22 8 -16 -17 0 -5 -9 -2 5 -20 -11 12
3379 12 -17 -18 5 3 -40 -7 2 -9 -15 11 -20 -16 -3 11 -14 -19 -5 -3 -5 10 19 -1 -6 0 4 -9 2 26 -11 -16 4 6 -11 9 5 -15 -7 -9 2
3418 2 4 -4 -3 -15 -17 -3 5 -18 -18 8 -6 -7 -3 4 -20 -15 6 -11 -11 -2 -6 -29 -19 3 -14 -3 -8 19 -30 -17 25 3 -8 20 17 -17 5 21
3456 21 0 -10 -6 -11 -8 -7 10 -1 -15 -14 8 -9 -6 11 1 -11 -8 1 -5 -6 12 -11 -8 -5 1 1 -6 -2 -6 -16 -4 -3 -18 -15 -3 -6 -18 11 0 -7 -10
3497 -10 3 5 0 8 14 -16 7 12 2 2 5 2 -3 -15 14 0 -13 -6 1 -10 -2 7 -1 -12 -11 -5 -16 -8 13 -1 -15 -10 -2 -2 2 2 -6 -10 -9 -13 -3 -13 -11 -9
3541 -9 -22 -2 11 1 -17 -2 -6 -1 9 11 12 -2 0 6 -1 7 0 -1 -6 -6 2 7 3 8 -5 -16 -6 2 -8 -10 -2 -17 -8 -3 -5 -14 -4 -9 -9 -2 -1 -4 -4 -6 3 1 -7
3588 -7 12 6 -15 -13 -1 3 -3 6 6 -5 0 4 2 -6 11 2 -1 -1 -3 -4 -8 3 4 -8 7 8 0 0 1 -1 -7 -5 1 -13 -14 -9 -2 -6 5 -2 -10 -13 -4 -8 -6 -10 -13 -13 -10 -7 -4
3639 -4 6 -9 -3 -7 5 11 1 -1 -10 2 -5 -2 3 1 -11 -11 1 -3 3 9 -8 -11 -7 -2 -3 -4 -3 -3 -9 1 6 -4 0 -2 3 3 -2 -3 6 1 6 -5 -7 -17 3 -4 -23
3686 -23 -6 -5 2 -9 -1 -17 -17 5 3 -2 4 -7 -5 8 0 2 -2 -9 2 5 -10 6 3 -8 -4 -14 4 -10 -6 -16 -14 -6 -15 -5 0 1 -18 -7 -6 11 4 -12
3728 -12 1 -6 -8 -16 -14 -8 -13 -14 -1 -1 -6 9 -3 8 -10 0 12 12 -1 8 -4 3 7 -8 -6 -2 -5 0 -2 -2 -9 -18 -10 -19 -12 -6 -9 -1 -15 -4 -4 7 -2 -4 -6 -6
3774 -6 -1 9 6 2 -6 -4 -10 -5 -2 -6 -2 -2 -10 -7 -4 -5 -9 -5 -14 4 -2 11 12 -1 -6 -3 5 12 -2 -1 -4 -6 2 -3 2 -8 -4 -15 -1 -9 -2 8 -5 -12 -7 -4 -6 -4 -11 1
3824 1 0 2 6 -1 -4 -8 -10 -5 -5 8 1 6 -9 -5 -1 -1 1 -1 -12 1 -1 16 3 0 3 -2 2 20 4 3 6 5 -5 8 2 3 -9 -21 -12 -14 2 -7 -5 -16 -5 -3
3870 -3 -2 -3 -15 -2 -5 -10 -3 -3 0 4 1 -9 7 3 2 11 -4 -9 -2 -1 11 0 -3 -6 -7 -5 12 13 0 3 13 14 -2 5 -5 0 7 1 -9 -7 -3 -14 -22 -4 -10 -7
3916 -7 -3 -8 -18 -17 -9 -8 -13 -11 -5 -1 -15 8 8 -4 -2 2 6 -1 19 5 5 -3 -4 -2 3 1 9 1 6 4 8 0 -4 9 -3 0 4 0 -1 2 -11 -9 0 -5 -6 -3 5 -20 -6 3
3966 3 -6 -4 -9 -4 3 5 3 0 -2 5 -4 -1 4 0 11 -5 -1 4 5 -4 2 -4 5 -5 4 7 5 -4 2 16 4 5 9 0 -5 -6 7 -6 2 11 -13 1 -2 -2 18 9 0 1 -11 -10
4016 -10 -5 -2 -4 -3 -2 -9 9 10 -6 11 -4 -6 0 4 -3 -13 12 1 -7 1 7 3 -15 -5 -1 5 12 9 3 -9 6 12 -9 -7 -6 -5 -6 -10 8 -5 -5 -10 -10 -1 4 -10
4062 -10 -3 -10 -10 -4 3 3 1 1 0 -5 2 -9 -9 9 -2 7 13 -1 -2 1 -6 -6 -1 -2 5 -1 1 6 -3 -2 12 0 1 -2 5 -9 -2 8 -4 -12 -8 -3 -2 -5 -5 -10 -11 -14 -11 -3 -6
4113 -6 -8 -14 -6 -6 -5 -18 -10 -1 5 -6 -5 11 -7 0 -7 6 -2 3 8 -7 -12 0 2 -1 -1 3 -9 0 8 22 3 5 22 -3 -8 -1 0 -7 2 -6 -9 -7 0 -5 -13 -2 -9 -8
4161 -8 -9 -8 -10 -16 -19 3 -6 -21 2 6 -7 3 11 7 3 -4 -8 -10 7 6 -1 -14 2 7 -5 9 11 1 -10 0 4 -6 -5 4 -7 -11 7 -11 -14 0 3 -8
4203 -8 -9 1 -5 6 -3 -5 -16 -13 -20 2 -3 2 3 0 -5 -1 5 -6 -5 3 7 -11 5 6 2 10 0 -1 -1 -4 1 -4 1 -6 -9 -8 0 10 -13 -10 7 -11 -12 11 0 -16
4249 -16 -8 -2 -9 6 3 5 1 -5 -11 -2 -12 -7 2 -9 2 4 -13 -14 -4 -10 -12 3 0 3 -6 4 -2 -10 -3 -4 5 6 4 3 1 -2 3 3 0 6 1 -5 -6 4 -9 -4 2 5 -11
4298 -11 -2 2 5 -6 2 -10 -9 -10 7 -10 -19 -3 -16 -34 -8 8 -12 -22 -10 -4 1 -2 7 -5 -11 7 -4 -13 -14 2 4 -2 -4 20 -3 3 7 -6 -5 9
4338 9 7 -16 -8 1 -8 -21 -1 -2 -12 3 3 -1 -6 11 2 -8 -13 7 -5 -12 -5 17 -15 -10 9 -3 -10 9 -4 1 -1 10 10 -4 10 8 -3 -7 11 -2
4378 -2 -2 14 5 5 -8 25 -5 -9 4 12 -7 -9 10 -8 -19 -5 7 -6 0 12 1 -7 0 4 -6 -12 20 6 -7 9 16 -10 7 13 10 4 8 2 4 0
4418 0 1 11 -6 -1 8 0 -2 6 4 -8 -1 11 -2 -9 15 5 -12 6 8 -11 -4 4 3 -3 7 9 -2 -4 9 14 -10 3 7 -5 -12 7 -5 -28 1 9 -15
4459 -15 -8 14 -9 -16 -3 7 -4 2 -10 13 -11 0 5 1 -1 20 10 -2 3 14 -7 -10 17 7 -13 1 9 -14 -7 -5 7 7 -2 4 3 -9 1 15
4497 15 -3 -5 5 2 -16 6 11 -6 -4 5 -7 -21 5 -5 -22 0 13 -12 -9 -8 -4 -4 -3 19 12 -5 5 13 -11 -5 21 9 -19 8 7 -14 -11 16
4535 16 -6 -10 -1 -4 -15 0 12 8 -14 9 19 -11 -11 7 2 -14 -3 17 -13 -13 19 -1 -4 2 0 -9 -4 2 -1 -21 -4 11 1 -9 17 8 -8 8
4573 8 27 -8 -2 19 11 -20 12 13 -9 -4 6 -1 -28 8 7 3 -6 3 7 -11 -7 9 -6 -12 10 -4 -24 -11 9 -8 -14 19 5 -19 10 18 -5 -13
4611 -13 15 7 -19 -3 17 0 -6 5 16 -8 5 14 -4 -8 19 3 -3 12 3 -3 -3 23 19 -11 11 7 -4 2 21 16 -5 -14 16 -11 -14 12 10 -27
4649 -27 -1 8 -1 -12 17 9 -17 -3 12 -9 -17 2 1 -17 -5 13 2 -14 7 10 -11 -3 24 -1 -14 20 6 -15 -9 7 -4 -3 4 14 -12
4684 -12 10 13 5 4 19 12 -17 -8 12 -5 -32 0 -2 -20 -6 8 -2 -11 6 -5 -15 -12 5 2 -7 0 11 -21 -10 24 -5 -11 6 24 -10 2
4720 2 16 -7 -6 1 -3 0 -9 17 5 -7 3 19 4 -2 18 16 -4 1 15 -11 0 17 -3 -15 2 5 -2 -13 13 1 2 10 6 -5 0 7 1 -7 3
4759 3 6 -13 -9 12 8 -2 23 21 1 0 8 27 1 16 3 4 0 5 6 -8 10 18 10 -24 10 11 0 -3 15 -6 -1 13 1 -15 -10 10 -2 -11 10
4798 10 4 -12 -12 13 -6 -15 13 12 -8 -5 14 0 -10 8 14 -2 4 8 6 -1 1 1 -5 7 20 -2 -7 1 13 3 1 2 -9 -21 10 10 -12 -4 16 -3
4838 -3 -5 5 3 -17 -2 12 -6 -7 -4 9 -8 -5 9 4 -15 -6 1 -18 -7 4 -4 -13 14 15 -3 6 21 7 0 12 15 -9 -6 3 8 -4 -4 23 2 -2
4878 -2 16 4 -9 6 17 -13 -7 1 0 -9 14 5 -11 6 10 -1 0 2 13 -5 -16 4 2 -14 -7 8 -5 -5 1 10 -7 10 20 -15 3 0 7 -11
4916 -11 -6 17 -5 -5 9 13 -6 -6 18 5 -6 17 12 -12 -2 2 -25 -2 9 -9 -21 7 2 -8 -18 1 -2 -20 -19 5 -6 -5 10 8 -23 -15
4952 -15 9 -6 -9 4 4 5 4 -8 7 -6 2 -1 -12 -3 6 9 -6 -4 7 7 0 23 14 -2 17 10 -6 1 9 -6 -7 14 2 -4 0 6 -10 -7 0 3 7 -5
4994 -5 -2 -7 -13 4 10 -3 -7 8 1 3 4 4 -5 2 8 2 -1 -4 3 2 9 -5 5 -2 8 2 5 -1 19 5 -5 7 4 -10 7 14 -13 -14 -11 -15 -12 -4 0 -3 -8 0 -13
5041 -13 -18 -17 7 -9 -12 2 -5 -6 -4 2 -10 -7 -11 -5 -11 1 11 3 -15 -7 10 -1 -14 1 13 -4 -8 7 4 -12 6 0 -8 -3 -6 -7 -2 2 -3 -11 1 -16
5083 -16 -8 -5 8 2 -5 -9 4 2 -7 -9 8 -19 -4 -1 -5 9 7 2 1 7 3 4 6 6 2 -4 -8 10 9 -1 10 9 2 5 14 7 -5 -3 -2 1 -6 9 -9 -20 5 -1
5129 -1 -7 -6 5 15 -3 -2 1 -5 -6 -7 3 2 4 3 -6 -3 7 -11 -13 16 1 -10 7 0 -3 3 6 -3 -8 -8 3 13 0 14 4 4 -5 18 2 15 13 -3
5171 -3 1 -6 2 -3 2 -11 -7 4 -3 -4 2 5 -5 0 -15 -4 10 -4 -13 -5 -6 -6 1 0 6 7 1 1 -2 4 -1 7 -4 -9 5 3 -14 -2 6 -4 0 13 5 -2 7 10 -6
5218 -6 1 3 -1 -6 3 12 -3 -9 -4 -10 -8 -7 0 -5 -8 -2 -20 -10 -3 7 -7 1 4 -12 -3 9 6 5 7 -8 -9 0 1 -11 -11 -14 4 -11 -3 16 5 3 -4 0 5 -7 5
5265 5 5 -7 2 3 -1 2 -4 0 -7 -7 -7 1 -4 -1 5 -5 -8 -3 -7 -13 -6 -6 -3 -4 7 7 -6 2 12 -8 -3 3 12 -4 -9 0 7 -5 1 -2 -2 4 14 -1 3 2 2 -3 -3 3 -9
5316 -9 -3 -8 -5 6 0 -2 -1 -5 -8 -2 1 -5 -7 -6 0 3 -12 -4 1 -7 -8 -1 1 1 -1 3 1 14 -16 -2 10 -4 4 2 10 2 -7 2 4 8 5 -3 10 -1 -3 5 -8 -8 5 0
5366 0 -1 -8 10 -6 2 -2 -2 -3 -1 0 -6 -6 3 -1 -9 -6 -8 2 -8 -8 -5 -14 3 9 -3 -7 6 -2 12 12 -12 -16 0 -4 -2 1 7 1 -5 0 -4 -9 7 0 12 2 0 3
5414 3 2 -11 -13 1 -7 2 -4 -3 1 -2 -17 -1 4 -8 -3 -10 -5 6 -1 -3 0 6 -1 -6 3 -6 -2 2 -9 -7 1 3 -12 -7 2 0 -3 -3 3 4 12 3 16 4 -6 -3 4 -5 2 0
5464 0 0 -7 -3 -13 -4 5 -7 3 10 6 -14 -3 -1 -5 -8 7 3 -6 4 11 5 -4 -7 6 2 -17 14 4 -7 -5 -1 4 -1 -2 7 5 0 -6 1 -5 3 4 3 8 0 -7 -5 1 -2
5513 -2 -3 0 5 -8 0 9 -1 -7 -8 -6 -3 -7 -7 -1 0 -2 0 -3 -15 5 9 -3 -4 11 7 2 -2 -9 -7 15 3 -1 -11 7 -4 -2 -2 2 11 8 7 0 5 -11 13 12 5 1
5561 1 -1 -9 0 -4 -1 3 -7 0 -10 -9 -10 1 -6 -7 0 -1 -3 -3 -3 -6 7 1 0 -1 4 4 0 -4 5 -2 -4 -5 4 1 7 -1 12 -7 -4 8 -8 -4 -1 2 -6 0 -3 -3 1 7 -3 7
5613 7 -4 3 -4 -3 1 -1 3 -2 -2 -9 -13 4 4 -8 0 6 -5 -3 1 -9 -7 -5 -3 10 -7 1 -3 -8 1 10 2 -3 0 2 -4 -1 -10 -11 5 15 -4 -6 -8 1 3 -3 -9 0 1 -4 8
5664 8 -4 2 5 -3 -1 -13 0 -14 1 -11 -8 -5 -8 4 3 -2 -6 -3 -5 0 -3 -6 -6 4 -2 -11 4 -6 1 7 10 5 -2 -3 -2 -3 -2 2 -6 0 -3 -9 0 -3 -5 5 -9 -2 0
5713 0 12 -16 -4 7 -4 -1 -3 7 -2 1 0 -6 -2 1 -1 4 -3 0 -2 3 0 -3 2 -5 3 -3 -13 13 4 4 8 6 8 8 13 0 2 3 -7 7 5 6 6 -4 -2 -3 -10 -2 -7
5762 -7 -4 -3 -13 -2 1 -11 -6 -2 8 -5 3 0 2 1 -1 -2 0 4 -8 -10 0 -4 2 0 10 -12 -10 6 -4 12 6 8 -2 -5 10 11 8 4 8 5 0 -12 -5 6 9
5807 9 -7 9 -4 -1 -4 -21 -10 5 -6 -15 4 4 0 -2 -9 -11 -8 -2 -9 -5 5 5 1 4 12 -8 3 -6 1 2 1 0 -4 6 1 13 1 -11 9 7 5 5 -6 14
5851 14 -3 -1 -1 -1 -4 -1 -5 7 2 11 -3 -2 -3 -13 -16 1 -4 -10 -5 -1 -6 1 0 0 -6 -9 -1 -8 1 2 8 -1 -10 7 7 -3 4 -2 6 8 -3 7 -7 -3 3 -5 -7 3 -7
5900 -7 0 5 -3 -1 3 2 -7 -8 -7 6 -5 -3 4 -5 -9 3 -1 -4 8 1 -8 -15 -9 4 -6 -2 -2 -2 -12 1 -2 14 2 0 8 2 10 -4 8 4 -13 4 -2 -8 6 2
5946 2 -5 -9 -10 5 0 5 -11 -13 7 -5 -8 -13 -15 -7 -11 -9 -11 -1 2 5 -8 -3 -2 -17 -4 -7 0 10 -11 -8 -13 -8 1 -2 4 5 11 -2 -1 2 -8 5 -7 4 -1 0
5992 0 -7 -2 -1 -9 -10 -8 -4 -2 -3 -4 -10 -6 -7 -6 -9 -3 -5 0 -3 0 3 -10 -6 -16 -3 5 7 -5 -10 -11 -18 -16 -12 -5 -6 -12 -8 0 -4 2 0 4 -6 -2 -2 -11 -4 -8 2 -5 -4 6 2 1
6046 1 -3 3 3 -3 -4 -9 -3 -5 -3 -13 -22 -10 -14 -4 -11 -15 -1 -8 -2 -3 -9 2 -16 -5 0 5 -11 -12 2 -11 -14 3 -9 3 -4 7 -1 9 -1 11 0 7 -3
6089 -3 -3 -4 -8 4 8 -1 1 14 1 -3 0 0 -7 -4 -7 -11 -6 -3 -13 4 -11 -1 -6 -11 0 -7 -6 0 -1 -8 -10 2 -5 -2 1 -5 4 -2 3 -5 -3 -7 5 -3 -9 -6 7 -4 -8
6138 -8 -1 -7 5 -3 1 -5 -9 0 -6 5 1 -10 -13 -11 -7 -6 -4 -18 -12 -8 -11 -13 -8 -7 -12 -10 -11 -6 -9 -4 -5 -9 -13 -6 -9 -7 3 -5 0 -4 2 -1 -7 -2 -12 6 4 -4 3 10 -6 13
6190 13 0 10 2 5 7 0 2 -12 -9 -13 -13 -6 -4 -6 5 4 -13 -14 -1 -11 -12 3 -14 -11 -11 -8 -5 -5 5 -12 1 -5 3 12 2 4 3 4 -3 -4 -9 -9 -4 -3 -1 7 0
6237 0 -11 11 0 -1 -3 -4 -8 -11 -5 -1 -9 -10 -5 -13 -1 -20 -4 6 -4 -1 -11 2 -9 -13 -4 -13 -9 -9 4 -5 -1 -4 7 5 -1 9 8 0 4 1 -5 9 5 -3 -4 -8
6283 -8 4 3 4 10 -1 9 -4 2 1 -3 2 -6 -1 -19 0 1 -2 2 -3 8 9 1 7 3 4 -12 -5 -1 -12 4 -4 -5 5 -8 4 8 12 13 -3 4 -2 -8 1 0 3 1 -3
6330 -3 3 1 -7 3 0 -6 4 0 12 5 5 -12 -6 5 -6 -5 -8 -2 1 -1 -2 -4 -3 -2 5 7 1 -11 0 -6 -5 4 -3 -1 4 17 -3 -9 0 1 4 -9 -3 1 -1 -2 -5 0 -1 3
6380 3 -14 -8 -2 8 13 4 4 -8 -6 -6 5 4 -3 2 -4 -10 -2 -10 -1 -3 -5 -8 -10 7 -2 -8 -8 -3 -14 -2 -4 3 6 6 7 -3 0 -12 8 5 -1 6 5 -7 9 1 -2 -4 5
6429 5 -1 2 6 5 1 7 2 3 6 -11 -16 5 2 -6 -5 5 -7 -7 4 -4 0 -3 5 -6 -11 -7 -2 -10 -9 -4 -10 -5 -5 -4 -7 4 -6 -5 2 5 -7 -11 -6 4 7 -2 -6 -4 -3 -1 0
6480 0 -2 6 9 -11 -7 -9 1 -13 -5 -8 -8 -2 -8 -6 -12 6 5 6 3 7 -6 -7 6 -13 -2 -13 -13 3 0 -1 2 -14 -4 6 -1 0 -1 -6 -1 -1 2 0 2 1 1 13 5
6527 5 3 -5 0 -2 -4 -8 -3 -7 -8 -8 0 -9 -8 0 4 -8 -7 -4 -10 -1 0 -7 -1 -1 12 -6 -12 -1 -2 -3 1 3 -2 -6 -11 5 -5 -3 -8 -8 4 5 5 -4 -3 -1 -7 -1 5 11 7 -3 -1
6580 -1 3 -1 -3 -4 -2 -7 -5 0 5 -17 -9 3 -14 -5 0 -11 -2 -7 -9 1 -4 -9 -10 8 -1 -7 1 2 -4 -2 4 -9 3 -1 -3 1 -1 3 -6 -2 11 -6 0 13 4 2 -5 -4 -4 5
6630 5 2 -2 -5 -3 -1 1 0 -5 -3 3 -14 -11 6 3 4 8 1 3 7 -2 -8 -1 -6 -4 7 -3 -6 -5 14 -1 -5 5 3 9 3 -1 -1 -9 1 6 1 -6 -3 1 -6 7 2 -5 3 -11 -13
6681 -13 -2 6 -2 5 11 -4 7 6 7 5 -4 0 3 1 1 -7 -6 -11 2 -3 -5 4 -3 4 -2 11 2 -7 5 8 -3 0 5 4 2 3 9 1 3 8 11 2 -9 -5 2 8 -3 -6 2 -2 1
6732 1 16 3 2 -2 -5 1 0 -1 0 -5 -12 2 -4 1 2 -3 -13 -2 -5 -2 -1 -5 -7 -6 8 -4 -5 5 -2 -9 0 1 -1 6 18 1 5 0 9 7 8 1 4 -2 -4 -1 -8 4 -5 1
6782 1 6 8 -3 -5 1 -6 4 -8 3 6 -2 6 -4 4 -2 -3 -11 6 5 1 2 -4 3 -2 4 -3 5 -1 -5 -1 -4 -8 2 -6 2 8 1 7 1 2 2 3 -3 -5 12 -1 -1 3 -11 7
6832 7 -5 -2 4 12 0 -10 -10 -13 0 2 10 -7 -5 -1 -10 -2 -3 4 -1 1 -3 1 -4 -4 7 0 0 -1 -11 4 2 -3 8 -3 4 -5 3 7 0 -1 -4 -3 2 -6 4 -11 7 10
6880 10 -6 6 8 -5 -4 -5 -2 -1 -12 -10 1 -8 -7 9 -1 2 -12 3 -1 -5 5 7 8 1 4 4 -2 -6 -2 -2 2 11 -5 -10 4 4 4 4 -2 5 1 15 7 -6 -2 0
6926 0 0 -5 4 0 2 -11 -2 1 -14 -9 -4 -2 -6 -4 -8 3 3 -1 3 8 8 -4 24 9 2 0 14 6 -10 2 1 2 -4 3 13 15 3 6 3 -6 7 -10 -3 4 5 -7 -5
6973 -5 2 -1 2 7 0 8 3 -10 -3 -1 -7 -7 6 -7 -7 -9 -15 -7 -10 -3 -7 -14 0 4 -7 -1 -2 5 -1 2 1 4 6 1 8 2 4 10 1 -5 2 -2 9 0 12 4 -9 4 -12 -2
7023 -2 9 -6 2 -2 -9 5 0 -13 -6 2 1 -3 -8 1 -2 1 -11 4 -4 -3 -4 -8 -15 -1 0 5 2 0 4 4 -4 -1 11 6 4 0 3 2 1 -4 -3 -6 -3 -2 10 -1 0 -7 -6 4
7073 4 11 2 -8 -8 2 -3 4 -12 -2 -3 -3 -3 -1 -4 8 1 -10 12 -4 -2 2 -3 -6 0 0 1 0 -2 6 4 0 7 16 10 1 9 6 0 -2 -4 20 2 0 -1 4 6 0 -2 -4 -6 -5
7124 -5 9 -6 -8 -7 -8 -4 -7 -2 -5 -4 1 -7 2 3 4 4 -1 1 12 -2 -4 -3 -1 2 -1 1 7 5 8 -3 1 2 11 0 9 1 -3 4 -4 10 11 -3 4 -10 -11 0 1 -5 -4 14
7174 14 -4 -10 -8 -9 -5 -9 -11 -8 -3 0 -5 -1 -3 -6 -9 -4 2 -5 2 3 -2 8 2 11 0 2 10 0 4 3 -11 -5 4 17 8 3 -4 -2 1 1 -11 2 -12 9 12 -3 -1 0 1
7223 1 -11 -8 -8 -8 -14 -11 -6 2 2 -1 -4 -7 -10 -7 -7 -3 -3 -1 3 2 1 2 6 12 5 0 -2 11 5 -1 -5 2 -6 0 4 2 3 3 3 -5 8 3 4 13 1 -10 6 9 -1 -3 -9 -4 -9 -12
7277 -12 -11 -7 -7 -2 -11 -4 -3 -3 -4 3 0 4 1 -3 -6 2 3 -12 5 4 4 3 7 -4 -7 7 -6 -10 -6 3 2 -3 -3 -13 3 -1 -3 4 -1 -10 0 -1 -8 -5 -3 -10 -4 10 -4 4
7327 4 1 3 -7 0 -5 0 -9 -7 -3 -4 -8 -10 2 5 -7 -8 8 -2 2 -2 -5 -19 0 0 4 9 5 -1 -3 -2 8 3 2 15 -1 1 -2 -10 -5 -11 -6 1 -14 -11 -8 -12 -3 -10 -2 -8
7377 -8 2 3 -5 3 -7 6 -5 -3 -7 -1 1 -3 -6 -10 -2 0 3 3 1 6 5 -3 -1 7 8 2 7 -1 -10 12 -1 2 -5 -2 4 -14 0 10 -8 -8 -4 1 -9 0 -1 -13 -4 -9 0
7426 0 -4 3 -11 -4 -11 2 3 4 -2 3 0 -7 3 -3 -12 0 -7 8 5 -2 4 2 12 14 7 -3 13 -1 1 5 6 7 6 4 5 2 2 5 2 11 3 5 2 3 11 -2 -7 3 2 -2
7476 -2 5 2 1 -5 -16 -5 -7 -1 1 10 -8 -6 3 8 -6 -12 4 -8 5 -7 -3 -5 -5 8 -3 1 -5 -3 9 6 -9 2 1 -2 1 -10 -5 2 -11 -3 -6 -10 10 2 -6
7521 -6 -9 0 -15 -13 -6 -12 -12 -13 -4 2 -3 1 7 1 -1 9 5 2 1 6 9 5 3 -5 -7 1 0 -7 2 2 -5 -2 0 -6 -2 -5 -3 -9 -1 -6 -10 3 -2 -9 -2 -8 -10 -2 -18 -1 3 -16 -6 -7
7575 -7 -3 -18 -4 -5 -14 1 -9 -7 1 -7 9 1 5 1 1 0 -6 -4 -2 3 5 6 0 4 5 0 -2 -6 -5 -13 4 -11 -4 -4 -11 -16 -6 -7 -16 -2 -7 -5 -8 -1 -8 15 1 1 1 -4
7625 -4 2 -2 -1 -3 2 -8 -8 6 11 -9 -2 -6 0 -10 -8 -3 -9 7 0 0 3 3 -4 -3 5 -10 8 2 -12 0 -6 -1 -4 9 -3 -3 1 -7 -1 7 -13 -9 -4 0 4 -6 -2 -12
7673 -12 -6 -6 -13 -8 -18 -9 2 0 4 -4 -4 4 1 4 10 7 3 -1 3 0 1 5 -10 6 8 9 11 -5 -7 2 -3 -1 -13 -14 1 -9 -1 5 -2 -4 -7 -8 1 -3 -4 -2 -9 -8 -7 2 -4 -8
7725 -8 -2 -9 -7 1 -4 2 -4 -16 -9 -2 -2 -8 -5 -6 2 -1 2 -2 10 4 -1 6 -7 -3 2 -1 0 -3 -11 3 -6 -6 -6 1 4 -14 3 -9 -2 -5 -8 -1 -2 -6 -9 -15 -11 -10 0 -5 -14 3
7777 3 -1 -4 -2 9 11 3 -6 -7 1 2 -7 1 2 -4 -4 8 -7 5 6 2 -10 5 -6 -4 -13 9 -9 1 -3 -6 12 -15 4 2 5 -1 -1 1 -2 -8 -15 -19 -1 -6 -3 -11 -4
7824 -4 -1 2 -10 -1 -6 2 8 7 1 1 5 -4 -6 5 2 -2 -8 -1 -6 -3 0 1 -9 -2 0 4 -12 -2 4 -3 -5 -2 0 -6 6 -5 -3 -7 -12 1 -9 -9 -7 -11 -8 -9 -16 -5 -1 -3 1
7875 1 14 8 7 7 -6 9 -7 -3 -3 4 2 10 3 5 5 5 3 3 4 -7 7 6 2 3 -5 -9 -3 1 -4 10 5 -7 -7 7 -7 -6 -9 -11 -7 -4 -1 -16 -14 2 -3 1 -5 1 -6
7924 -6 -6 -12 -14 -13 -8 -2 -8 -5 -15 -2 5 -4 -7 4 1 10 -1 0 -2 -3 4 -7 -1 -11 -11 2 -5 -4 0 1 -7 -7 -5 -19 -8 -7 0 -9 -10 -14 -10 -7 -2 -4 -8 -3 -2 3 -1 -9 -6 -6
7976 -6 -2 -5 -1 3 2 5 -1 7 0 8 7 9 0 -3 1 -3 1 -8 2 -1 -16 7 -2 0 -12 -5 -3 -9 9 -3 -1 6 -7 -10 -8 -8 -11 -15 -1 -9 -10 -6 -2 3 -8 12 -3 -8 -7 5
8026 5 -3 -17 -4 14 -3 -5 7 5 15 0 -2 -4 2 -2 8 -14 -9 -16 0 -7 3 -2 0 3 -1 -1 -3 -15 1 -3 -8 -9 -7 -12 -10 -4 -13 -10 5 -4 -4 -3 -4 0 -10 -7
8072 -7 -8 6 5 5 4 0 -9 2 -4 -9 -11 -2 7 10 4 -1 -8 3 0 -6 0 2 -3 2 -3 3 -2 10 4 -2 -18 -9 -17 -8 -10 -11 -6 -7 -1 -8 -4 -7 5 -2 3 -6 3 -3 -1 -1 0 -3 -1 3 1
8127 1 3 7 4 3 -3 8 0 -7 -11 5 -15 -5 -1 6 -7 -6 -1 -6 -2 4 -5 -3 -1 -9 -10 -4 -13 -14 -16 -9 -9 -7 -5 -11 -9 -13 -5 -5 -12 -16 -2 -6 -5 -11 -7 -6 -9 6 0 3 4 -7 6
8180 6 1 8 -3 -3 -4 -2 -3 -4 2 4 -3
8191c
$$ Imaginary data points
##PAGE= N=2
##DATA TABLE= (X++(I..I)), XYDATA
0 0 0 0 0 0 0 0 0 0 0 0 0 0 0 0 0 -8 8 -8 8 -8 8 -16 16 -16 24 -24 32 -32 40 -48 56 -62 70 -80 88 -97 112
37 112 -124 138 -155 173 -192 213 -236 261 -288 318 -350 387 -427 468 -516 569 -628 694 -769
56 -769 852 -948 1061 -1193 1352 -1543 1787 -2103 2528 -3141 4108 -5845 9951 -39841 8865
71 8865 87343 -18918 -24451 41991 642 -76670 -3291 60607 8352 -19240 22194 -11014
83 -11014 -53023 6903 52931 -5133 -21010 24173 -719 -48898 1551 44827 -298 -17445
95 -17445 18618 -5507 -39616 7714 38051 -9325 -14332 25807 -4020 -45125 5843 42788
107 42788 -6264 -19468 22492 -615 -41913 5172 42242 -8248 -22248 24454 4122 -43739
119 -43739 -147 44524 -1864 -25863 15267 6931 -32481 -393 34122 -3838 -17736 18817
131 18817 789 -37831 4845 42836 -6997 -28992 19043 12177 -36026 -5470 40323 2733
143 2733 -26128 8854 7514 -27013 738 34555 -3364 -24266 13269 8297 -29921 -738 38063
156 38063 -1047 -28850 9779 12980 -25161 -3390 33692 -883 -26691 10340 12629 -25238
168 -25238 -3544 33446 -1559 -28097 10820 16055 -24606 -7711 31974 1515 -27341 9827
180 9827 17753 -24431 -11111 31929 5090 -27190 7686 18702 -23409 -13904 30468 8739 -24876
193 -24876 4517 16284 -21941 -13348 30037 10423 -24668 1718 16064 -19758 -13663 29593
205 29593 12480 -24858 -1599 15668 -16457 -12168 28057 11346 -25135 -2516 15912 -14265
217 -14265 -11613 26402 10723 -25639 -3907 17362 -11064 -12443 23660 10918 -25185 -4715
229 -4715 18907 -8697 -13655 21253 11194 -24187 -4908 19568 -7288 -14656 18880 11520 -22531
242 -22531 -5215 19450 -6281 -16059 16906 13220 -20841 -6719 19178 -4767 -17175 15275
254 15275 15072 -19003 -8187 17994 -3521 -16806 13958 15603 -17332 -9439 16064 -1962 -15381
267 -15381 12166 15004 -15926 -10275 14707 -359 -14061 10975 14117 -15793 -10512 15103 1117
280 1117 -13594 9755 13211 -15573 -10366 15481 2599 -13258 7672 12135 -14560 -10210 15555
293 15555 4023 -13708 5259 12138 -13041 -10387 15712 5319 -14562 3025 12648 -10746 -10061
306 -10061 14645 5518 -14372 1515 12292 -8381 -9020 12924 4551 -14234 1051 12738 -6963
319 -6963 -9321 11759 4476 -14503 691 14006 -5758 -10332 10362 4855 -13487 739 14051
332 14051 -5110 -10917 8794 5451 -11677 384 13129 -4654 -11525 7486 6579 -10086 -418
345 -418 12077 -4564 -11831 7379 7783 -9331 -1438 11117 -4044 -11190 7221 8208 -8617 -2487
359 -2487 9802 -3094 -10053 6813 8149 -8682 -3846 9602 -1464 -9832 5744 8288 -8434
372 -8434 -4878 9352 60 -8927 4661 7232 -7945 -4272 9309 544 -8525 3724 6646 -7328
386 -7328 -4183 9219 1333 -8721 2299 6453 -6435 -3976 9223 1428 -9334 1659 6909
399 6909 -5670 -4009 8955 1748 -9372 715 7126 -4032 -3936 7504 1681 -8811 371 7437
413 7437 -3223 -4692 6562 2180 -8698 -275 8085 -2223 -5682 4991 2751 -7121 -349 7311
427 7311 -1770 -5511 4009 2965 -5777 -403 6636 -1532 -5837 3200 3763 -4570 -1024 5387 -1578
442 -1578 -5323 3247 3654 -4251 -839 4766 -2159 -4990 3980 4170 -4336 -1756 4371 -1249 -4458 3526
458 3526 4314 -3999 -2555 3801 -527 -3840 3328 3900 -4396 -2872 3987 87 -3615 2800 3421 -4278
474 -4278 -2715 4067 678 -3376 2070 3113 -3829 -2560 4315 1203 -3879 1101 3419 -3145 -2772
489 -2772 4125 1478 -4153 359 3512 -2267 -2641 3469 1365 -3916 20 3622 -1336 -2661 2550
504 2550 1434 -3385 -157 3719 -717 -2847 1752 1275 -2920 128 3603 -895 -3024 1390 1152 -2457
520 -2457 456 3408 -1069 -3240 1172 1627 -1866 257 3180 -997 -3509 1114 2330 -1563 -241
535 -241 2855 -1011 -3605 1254 2781 -1521 -933 2378 -624 -3321 963 3063 -1048 -1706 1658 257
551 257 -2572 519 2877 -744 -1989 1320 739 -2012 345 2378 -900 -1937 1252 909 -1633 45
567 45 1710 -857 -1592 1253 1043 -1488 -297 1496 -635 -1381 1488 1225 -1772 -635 1659 -341 -1294
584 -1294 1514 1131 -2030 -829 1755 14 -1245 1116 1004 -1970 -1099 1885 651 -1370 444 1101
600 1101 -1578 -1147 1960 987 -1477 38 1048 -1242 -913 1877 894 -1584 -320 1002 -731 -832
616 -832 1444 817 -1548 -586 1113 -247 -837 1124 711 -1515 -401 1414 -134 -943 948 577 -1397
633 -1397 -182 1500 -144 -1158 582 603 -1098 -180 1417 -164 -1447 411 927 -871 -266 1417
649 1417 -235 -1606 515 1260 -739 -356 1235 -284 -1550 576 1410 -621 -678 899 -153 -1416
665 -1416 489 1534 -605 -1059 766 126 -1268 525 1581 -710 -1235 819 413 -1031 470 1370
681 1370 -732 -1210 790 599 -856 221 1106 -764 -1215 915 764 -1073 -61 1175 -724 -1225 1150
698 1150 929 -1273 -262 1288 -427 -1138 1071 969 -1284 -542 1300 -40 -1150 691 929 -1201
714 -1201 -698 1290 172 -1164 466 798 -1133 -499 1393 150 -1150 463 753 -1018 -347 1450
730 1450 147 -1284 301 892 -867 -452 1403 143 -1554 181 1150 -783 -674 1300 191 -1601
746 -1601 118 1342 -520 -747 1038 246 -1338 141 1346 -379 -858 807 312 -1182 155 1317
762 1317 -489 -1053 755 407 -1125 161 1231 -605 -1072 805 524 -966 127 1109 -554 -980 889
779 889 701 -928 -70 1046 -479 -1004 905 771 -1055 -282 1006 -425 -939 893 710 -1121 -356
796 -356 1005 -214 -805 787 674 -1037 -382 1052 -1 -791 621 623 -1037 -378 1120 21 -895 483
814 483 523 -995 -281 1110 -39 -923 395 507 -827 -163 1115 -35 -982 379 692 -698 -215 1102
832 1102 -41 -1111 372 810 -692 -319 963 -150 -1094 392 795 -650 -356 840 -104 -956 413
849 413 860 -581 -467 814 46 -879 413 855 -675 -534 840 75 -867 383 734 -745 -511 858
867 858 120 -863 278 683 -679 -478 902 238 -861 188 741 -572 -445 966 241 -973 141
884 141 766 -568 -426 903 128 -1020 107 752 -492 -447 805 127 -983 104 875 -363 -515 755
902 755 189 -958 168 962 -376 -581 691 147 -916 201 919 -451 -659 597 194 -811 175
919 175 861 -432 -719 602 356 -718 127 855 -434 -729 707 458 -743 49 785 -476 -684 700
937 700 423 -784 -61 691 -401 -626 679 444 -808 -165 755 -244 -606 671 456 -840 -163 822
955 822 -179 -597 626 372 -853 -132 812 -170 -614 484 313 -798 -138 861 -124 -671 448 406 -753
974 -753 -91 930 -111 -733 455 453 -701 -87 864 -171 -760 395 461 -640 -160 754 -153 -765 378
993 378 563 -598 -251 730 -96 -724 422 588 -595 -256 711 -72 -637 426 505 -608 -278 658 -43
1012 -43 -621 354 446 -637 -306 693 18 -633 349 485 -653 -273 813 54 -674 338 493 -626 -234
1031 -234 807 31 -730 240 498 -551 -281 749 53 -806 146 568 -470 -303 740 55 -790 195
1049 195 628 -424 -258 695 34 -745 226 622 -392 -318 598 40 -725 163 659 -405 -453 573 122
1068 122 -708 163 684 -401 -443 602 172 -630 194 614 -408 -395 623 198 -628 118 570 -410 -473 606
1088 606 239 -711 5 602 -384 -488 639 261 -720 19 640 -311 -420 638 279 -693 -22 638 -222
1107 -222 -465 502 289 -685 -115 641 -163 -523 424 294 -668 -77 679 -130 -494 403 275 -561 -11 633
1127 633 -117 -476 338 274 -493 -37 602 -152 -550 298 302 -526 -72 590 -198 -569 378 333 -534 -47 601
1148 601 -181 -512 392 374 -489 -117 588 -89 -546 304 419 -502 -213 576 -49 -578 275 412 -520 -224
1168 -224 581 -4 -519 257 397 -411 -174 525 51 -431 188 348 -368 -191 493 37 -476 164 321 -427
1188 -427 -202 485 -23 -500 196 314 -406 -128 508 -34 -469 224 357 -352 -146 511 8 -528 190 448
1208 448 -365 -261 506 10 -574 185 470 -393 -288 491 48 -536 169 474 -318 -300 441 143 -451 98
1228 98 478 -256 -347 416 172 -476 47 425 -296 -338 414 136 -465 59 379 -271 -266 390 145 -399 54 365
1250 365 -218 -251 397 156 -441 49 444 -251 -313 438 149 -520 28 448 -231 -317 400 168 -466 -12 453
1271 453 -149 -335 340 238 -418 -52 478 -92 -379 296 243 -421 -79 426 -112 -366 254 189 -373 -73 343
1292 343 -109 -307 231 188 -326 -36 357 -79 -293 261 209 -346 -44 396 -114 -340 272 205 -370 -54 366
1313 366 -133 -327 237 210 -337 -63 359 -66 -315 233 279 -312 -126 394 -34 -352 210 265 -311 -122 333
1334 333 -51 -320 188 187 -307 -111 296 -47 -272 177 210 -271 -119 324 -4 -280 188 240 -292 -99 343
1355 343 -36 -298 204 191 -325 -89 333 -58 -310 170 206 -290 -113 333 14 -287 140 253 -250 -121 341
1376 341 26 -312 157 240 -288 -122 329 -39 -334 137 227 -256 -146 280 -6 -310 98 259 -193 -169 288
1397 288 64 -294 109 281 -212 -146 302 17 -290 132 244 -227 -155 251 4 -267 95 231 -196 -159 243
1418 243 45 -258 96 260 -177 -154 292 56 -268 106 240 -216 -146 259 9 -265 82 199 -192 -147 213
1439 213 34 -254 62 232 -161 -151 251 51 -266 97 267 -167 -155 265 39 -265 98 240 -168 -154 212
1460 212 20 -252 76 225 -157 -168 213 54 -256 74 280 -151 -172 249 70 -233 96 251 -196 -160 224
1481 224 37 -241 71 206 -187 -180 209 65 -248 26 228 -160 -190 252 108 -248 55 259 -168 -164 274 94
1503 94 -248 47 228 -149 -176 214 76 -250 4 226 -130 -198 214 116 -249 14 264 -108 -194 223 105 -246
1525 -246 36 254 -128 -178 208 66 -227 12 227 -134 -213 178 107 -246 -17 241 -127 -219 202 141 -226 9
1547 9 267 -117 -178 230 124 -223 9 224 -118 -191 185 120 -232 -40 223 -99 -218 174 137 -248 -32 264
1569 264 -83 -198 208 129 -232 -7 251 -79 -181 161 109 -222 -41 223 -58 -223 129 113 -223 -56 239
1590 239 -76 -225 151 123 -210 -10 270 -67 -202 165 130 -193 -12 235 -77 -229 122 147 -191 -59 224
1611 224 -59 -244 128 175 -205 -49 222 -77 -206 179 160 -196 -18 196 -67 -184 154 142 -192 -59 195
1632 195 -57 -209 153 150 -231 -79 227 -50 -225 165 153 -232 -67 256 -46 -199 169 160 -203 -63 240 -18
1654 -18 -208 113 175 -196 -99 239 -8 -248 121 182 -201 -75 222 -45 -210 128 160 -168 -55 210 -27 -207
1676 -207 116 174 -163 -94 195 -25 -236 100 179 -204 -108 206 -45 -231 138 178 -204 -99 212 -16 -186 148
1698 148 183 -183 -121 214 7 -221 91 192 -184 -156 220 35 -230 96 190 -200 -119 217 24 -204 84 167
1720 167 -158 -89 199 32 -193 64 169 -137 -111 195 13 -232 54 180 -163 -127 200 -13 -228 107 198
1741 198 -162 -97 198 4 -193 109 204 -149 -128 197 36 -217 88 225 -169 -160 205 48 -221 80 222 -171
1763 -171 -159 211 39 -200 63 203 -138 -147 188 80 -184 38 194 -121 -159 176 68 -217 26 181 -146
1784 -146 -166 182 30 -205 64 181 -129 -121 183 38 -182 54 200 -105 -137 179 74 -208 53 220 -143
1805 -143 -185 183 57 -235 44 214 -154 -175 187 65 -216 44 215 -113 -182 166 116 -181 8 224 -90
1826 -90 -202 157 115 -213 5 202 -120 -197 143 94 -175 3 177 -94 -152 153 108 -150 3 185 -81 -167
1848 -167 159 128 -168 -2 203 -100 -177 176 108 -210 -1 190 -122 -178 163 101 -197 -15 204 -76 -180 155
1870 155 142 -186 -35 223 -56 -195 133 142 -194 -29 210 -65 -208 121 118 -177 -23 190 -53 -179 107 142
1892 142 -141 -33 195 -26 -168 131 151 -143 -38 188 -53 -176 142 127 -167 -33 171 -83 -163 133 120
1913 120 -175 -45 172 -31 -169 129 152 -178 -60 208 -19 -191 139 150 -187 -62 205 -38 -180 109 132
1934 132 -167 -61 166 -29 -174 86 141 -145 -57 191 6 -176 103 163 -135 -42 197 -28 -177 104 128 -145
1956 -145 -49 164 -43 -173 95 135 -124 -58 169 -21 -186 77 165 -123 -71 184 -22 -197 110 171 -149 -79
1978 -79 166 -26 -180 102 149 -135 -90 145 -10 -173 70 167 -119 -104 171 27 -181 87 169 -126 -73 193
2000 193 16 -170 85 139 -136 -63 151 -6 -162 48 135 -101 -81 163 22 -181 43 165 -106 -89 174 12
2022 12 -185 80 161 -97 -86 149 -19 -163 58 155 -70 -77 123 27 -158 51 169 -74 -92 136 39 -158 70
2045 70 180 -94 -100 149 22 -138 61 137 -102 -92 122 28 -130 31 125 -92 -108 121 48 -133 37 145 -110
2068 -110 -91 163 47 -144 38 128 -100 -72 133 16 -141 28 116 -78 -84 115 34 -137 20 139 -48 -99 127
2091 127 37 -154 30 158 -62 -78 123 14 -131 55 110 -76 -67 86 0 -127 29 128 -67 -93 92 33 -137
2114 -137 37 146 -75 -88 128 19 -127 52 118 -88 -60 115 14 -115 17 100 -76 -76 94 37 -124 11
2136 11 131 -71 -84 144 41 -140 45 137 -80 -51 135 15 -127 25 111 -62 -69 88 13 -130 14 125 -38
2159 -38 -87 100 39 -131 23 136 -61 -85 120 26 -129 55 131 -63 -50 100 3 -120 29 110 -62 -90 84
2182 84 34 -129 19 139 -89 -93 125 39 -134 49 153 -72 -59 132 21 -119 41 110 -61 -69 88 31 -128
2205 -128 2 129 -55 -96 100 35 -145 27 151 -65 -94 106 20 -131 56 129 -63 -58 90 7 -110 46 129
2228 129 -41 -97 80 29 -133 33 151 -76 -108 110 22 -135 58 173 -87 -92 116 31 -115 44 151 -64
2250 -64 -107 85 58 -128 11 144 -61 -145 93 62 -134 2 150 -78 -135 95 55 -114 24 130 -62 -85 81
2273 81 50 -96 -5 115 -45 -100 76 64 -123 2 152 -65 -124 105 53 -144 33 144 -67 -108 104 55 -122
2296 -122 28 136 -41 -111 77 76 -122 -16 172 -31 -168 79 89 -137 -12 157 -42 -134 67 59 -118 17
2318 17 134 -21 -111 58 60 -93 -6 124 -19 -128 65 75 -96 -9 147 -51 -125 91 64 -122 8 131 -69
2341 -69 -113 87 71 -105 -8 125 -41 -123 89 89 -128 -26 141 -35 -160 87 98 -148 -34 146 -45 -141 83
2364 83 76 -115 -27 133 -18 -115 62 76 -92 -31 126 2 -120 50 87 -105 -37 149 -30 -119 78 75 -111 -2
2388 -2 122 -30 -107 76 91 -94 -9 123 -23 -129 70 101 -101 -34 140 -36 -154 74 106 -127 -45 137 -32
2411 -32 -144 82 111 -96 -42 132 0 -126 44 117 -88 -61 129 5 -134 46 129 -101 -56 136 -20 -124
2433 -124 69 99 -102 -44 120 -2 -111 44 97 -90 -50 114 8 -121 38 106 -94 -53 140 5 -159 51
2455 51 103 -106 -49 145 -30 -141 55 108 -76 -53 121 15 -134 37 125 -70 -76 116 21 -153 26 132 -88
2478 -88 -81 124 17 -121 48 112 -71 -50 106 33 -98 45 111 -49 -72 100 39 -101 28 117 -75 -93 123 23
2502 23 -129 35 101 -99 -63 120 16 -107 43 98 -58 -70 103 46 -108 14 115 -37 -82 120 40 -124 23
2525 23 116 -62 -71 105 29 -132 24 125 -45 -67 85 31 -103 21 117 -32 -85 73 58 -99 10 126 -45
2548 -45 -100 90 39 -120 18 112 -79 -94 69 28 -95 11 96 -41 -83 74 79 -95 -13 100 -41 -88 104 67
2572 67 -100 -4 102 -62 -88 94 50 -109 -16 104 -33 -76 79 55 -99 -42 111 -1 -83 84 72 -101 -13 124
2596 124 -24 -88 75 44 -126 -11 107 -32 -82 44 28 -92 -5 102 -30 -88 43 61 -85 -18 117 -18 -105
2619 -105 66 66 -86 -14 111 -42 -92 68 53 -84 -6 81 -28 -84 46 74 -67 -28 92 -13 -97 72 83 -87
2643 -87 -35 100 -26 -83 63 65 -101 -23 83 -19 -79 44 40 -90 -44 94 4 -82 40 62 -87 -40 107 0 -102
2668 -102 43 66 -85 -27 113 -14 -93 45 41 -70 -14 86 -14 -96 26 78 -46 -23 83 -3 -93 49 84 -57
2692 -57 -36 79 -26 -101 53 76 -64 -42 70 -24 -80 48 74 -61 -67 63 8 -78 34 71 -74 -55 85 15 -84
2717 -84 33 61 -72 -54 76 14 -73 15 48 -60 -43 70 16 -82 6 55 -44 -40 88 19 -89 1 61 -48 -41 78 -2
2744 -2 -100 11 57 -47 -28 53 -11 -94 2 72 -36 -40 41 -6 -86 11 75 -29 -63 46 2 -80 28 78 -56 -59 46 -2
2772 -2 -68 28 56 -40 -62 49 20 -52 15 65 -50 -60 70 17 -69 17 64 -51 -53 75 31 -66 -2 49 -41 -38 54 18 -80
2801 -80 -13 59 -30 -47 49 28 -85 -10 69 -34 -47 58 12 -69 0 61 -32 -32 36 6 -58 12 68 -12 -39 28 19 -58 19 75
2831 75 -32 -58 36 19 -56 31 77 -51 -61 54 20 -57 9 43 -45 -60 42 25 -51 -5 37 -46 -59 42 45 -55 -16 56
2859 56 -37 -55 58 32 -61 -4 53 -20 -32 52 19 -63 -13 42 -7 -33 28 17 -58 -10 63 -12 -50 39 17 -67 8 78 -16 -40
2889 -40 38 11 -56 4 62 -17 -60 11 16 -50 -5 55 -24 -77 21 32 -50 -10 60 -27 -58 59 49 -45 -2 52 -10 -34 45 52 -29
2920 -29 -19 33 -10 -41 34 38 -56 -28 42 -11 -47 47 43 -56 -18 52 -2 -33 40 27 -56 -19 51 -8 -43 17 21 -62 -24 45 -16 -59
2952 -59 18 17 -52 -12 67 -9 -56 16 20 -39 -11 55 -5 -52 15 39 -20 -8 46 1 -58 14 49 -25 -26 34 -12 -52 31 44 -40 -24
2984 -24 28 -17 -41 30 44 -39 -33 38 -5 -40 16 38 -49 -46 26 5 -53 12 34 -49 -43 37 9 -33 8 31 -27 -13 54 13 -38 1
3016 1 33 -20 -16 39 16 -57 2 29 -21 -17 46 -7 -56 3 32 -19 -17 34 -12 -50 -1 32 -18 -27 21 1 -42 1 40 -17 -44 18 -10
3049 -10 -47 6 38 -28 -38 18 6 -31 9 24 -36 -32 35 11 -17 9 23 -26 -35 38 33 -24 5 35 -31 -19 37 15 -37 -10 14 -22
3081 -22 -21 30 10 -45 -6 25 -14 -14 24 6 -43 -12 27 -9 -19 32 -3 -44 -10 24 -8 -21 17 -9 -35 3 33 -4 -24 11 12 -23
3113 -23 7 37 -18 -38 16 12 -26 -1 32 -35 -21 32 20 -29 3 24 -23 -27 20 15 -34 -11 15 -16 -30 20 11 -27 -20 15 -30 -23 26
3146 26 14 -49 -19 22 -13 -10 26 16 -34 -7 28 -6 -6 14 14 -21 -13 37 1 -29 8 7 -39 -1 27 -3 -32 11 10 -19 8 32 -7
3179 -7 -29 12 7 -3 -4 29 -6 -37 13 20 -15 -9 25 -23 -42 7 18 -18 -5 13 -15 -27 12 14 -17 -18 14 1 -25 17 19 -23 -16 24 1
3214 1 -21 21 14 -24 -4 23 -5 -26 8 0 -26 -14 28 -1 -25 6 4 -19 -6 33 -6 -33 -2 12 -28 -11 33 -5 -30 -6 2 -24 -1
3247 -1 20 -11 -29 -3 18 -8 -11 17 6 -19 8 29 -7 -14 21 9 -8 27 20 -18 -14 13 -1 -28 25 5 -9 -13 4 2 -8 5 24 -20
3281 -20 -11 18 4 -12 0 11 -18 -10 13 7 -17 -3 5 -21 -4 13 -5 -18 -4 6 -18 -17 5 8 -19 2 21 -6 11 24 -2 -22 12
3314 12 19 3 0 9 -7 -23 4 12 -12 -23 -3 -3 -22 4 18 -8 -13 -2 6 -24 4 22 -15 -23 8 7 -10 5 19 -6 -16 10 15 -10 -4 1
3350 1 -9 -16 6 7 -8 -10 14 -9 -4 26 16 -10 -1 5 7 -2 22 11 -9 -6 24 1 -10 12 13 -20 -21 18 1 -22 11 -4 -20 -2 22 -5
3386 -5 -5 12 3 -18 3 23 2 -13 8 3 -6 0 -1 -1 -25 -6 20 -2 2 21 -6 -18 10 13 -6 2 8 -19 -17 9 17 -8 -5 9 -5 -3 6 19 -12
3425 -12 -15 3 -9 -18 2 5 -11 -6 12 7 -5 -1 6 -9 -8 18 0 -1 -8 5 -11 -7 18 6 -12 2 10 -7 0 27 6 -2 9 10 -6 -3 7 -5
3463 -5 -14 4 2 14 -6 10 0 -7 0 2 5 -6 -5 -5 -1 8 18 -10 -11 9 -14 -13 -6 4 6 -16 -12 3 -5 -2 6 -4 -17 9 10 1 10 18 -1 2 12 15 -1
3506 -1 12 13 -4 -2 12 14 -1 3 4 -7 -7 -2 -2 -16 -17 -1 3 -7 1 15 -18 -17 -3 -6 -10 -1 2 -2 -7 7 -5 1 -2 0 -5 -12 7 1 -5 -7 4 -6 11 11
3550 11 -2 -19 15 5 8 18 13 4 0 12 7 4 10 -1 -5 -9 -6 7 -10 -6 7 -6 -9 0 4 -5 -8 -7 -8 -5 6 -1 -8 -7 -7 4 0 0 1 -5 -6 13 5 -5 1
3595 1 5 -13 -1 11 11 -5 10 2 -3 1 -1 -2 1 -6 6 17 -6 18 -5 -7 7 -3 -6 0 3 -8 -14 -5 -8 -3 0 5 -12 -5 3 -3 -5 -1 3 -4 2 12 21 -1 -3
3640 -3 0 -2 1 -6 3 6 -2 15 11 9 8 -2 -4 4 -1 6 6 -1 8 1 4 22 13 4 -4 -3 -8 6 13 -4 -11 -13 -12 -3 -10 -14 -11 -14 -4 5 12 -2 1 -1 -5 -1 8 0 -9 2 -7 -1 1
3693 1 13 -2 6 -4 -6 -2 2 3 4 -5 -8 3 4 12 7 2 -10 4 4 -2 1 7 0 4 -2 -5 0 0 -7 -11 7 -7 -2 2 -7 -6 -7 10 -1 4 -4 0 -3 7 -2 8 0 -3 6
3742 6 7 14 10 -1 7 -3 17 -2 11 -6 3 6 4 4 7 -2 -2 7 3 3 8 17 7 -4 1 -4 1 15 7 -2 -6 10 2 2 1 3 -6 -9 -3 4 -4 -2 -2 -12 -2 1 -4 1 3
3791 3 2 7 9 6 4 6 -3 8 12 7 4 2 -1 6 6 2 -3 9 0 1 -4 -3 2 -7 -6 4 2 4 -2 0 -2 -8 -4 0 14 2 -1 -5 -2 -2 4 -1 3 2 -5 -4 -4 3 10 -8 3 7 4 11
3845 11 1 8 3 8 -2 10 4 2 7 12 11 10 7 9 0 -8 10 -4 11 5 -13 -5 -1 -3 0 6 1 -12 -6 -10 14 5 15 4 -6 -2 8 -3 1 7 0 -7 5 9 8
3890 8 13 0 10 -4 1 1 3 11 -2 -4 -2 -3 6 9 -4 10 9 -1 3 -2 6 -14 3 -5 -3 -6 -7 3 0 -3 2 9 -25 -3 -2 -2 2 10 -4 -5 10 6 2 8 11 -1
3936 -1 6 -3 10 5 4 -2 -6 1 7 2 1 -6 4 0 -4 12 15 -1 -11 6 -1 -1 9 13 -7 5 0 4 1 2 -3 1 -9 0 7 -4 -8 8 -8 -1 10 -5 12 0
3980 0 15 2 14 4 -5 12 10 7 9 7 16 7 -1 0 1 1 6 13 -1 -2 9 13 6 4 14 0 8 3 5 -6 5 -13 1 4 -2 6 -1 -2 -16 -13 -9 0 7 -1 0 -8 -8
4027 -8 13 16 14 2 1 3 3 4 14 4 -2 8 13 10 14 6 0 -1 10 14 5 0 5 16 2 8 9 10 -10 13 5 -3 16 1 -8 1 6 -7 -5 -2 -4 2 -4 3 0 -6 10
4074 10 9 0 1 15 1 -1 13 4 -5 8 8 8 14 -2 -4 7 10 10 14 1 -3 6 9 4 3 3 -4 7 8 3 6 6 -4 -11 5 6 4 4 4 -2 1 1 6 3 -3 3 -6 -7 5
4123 5 3 0 -12 4 3 -3 13 11 1 -1 8 3 6 13 4 7 4 19 8 7 6 7 9 -1 15 -1 6 0 -9 -7 -11 4 1 4 -6 -2 -2 3 1 -2 -6 0 13 10 -9 8 -5
4170 -5 -3 4 12 1 -4 6 9 15 4 5 2 -7 7 -3 6 6 5 8 -11 10 14 1 16 20 9 -5 6 -3 -6 13 -3 -4 -3 16 -1 -4 2 -11 2 2 11 12 4
4213 4 -23 12 6 -3 13 18 -4 19 21 5 9 11 9 10 13 6 -4 4 -4 3 -4 -5 9 11 -5 3 3 6 10 12 10 8 2 9 -2 7 -4 3 0 4 13 3 -5 3 -4 -9 -6 -3 -7
4262 -7 -5 2 3 -14 9 14 -9 1 0 -2 -6 5 7 2 -3 0 6 12 3 8 -5 -1 13 4 1 10 11 -16 -5 16 8 -4 6 -9 -8 -3 3 -8 -7 7 3 -10 -1 4 2
4307 2 -5 11 2 -11 -10 2 -12 -9 1 6 -19 -6 11 -1 -1 19 8 5 7 13 5 -1 10 12 -1 -7 12 0 -11 4 29 6 -3 14 -2 -6 11 3 -12
4346 -12 7 19 9 3 -1 12 -4 -5 10 4 -2 6 10 -13 -9 8 -5 -7 -7 12 -12 2 4 -2 0 10 3 -7 -1 4 0 0 0 18 6 -4 19 10 -6 4
4386 4 9 0 -9 4 -5 -16 5 13 -12 -16 7 -4 -11 4 6 -1 0 4 7 -15 -5 9 -9 -8 11 5 -15 1 4 -6 0 12 1 -4 3 0 -5 7 8 8 -6 14
4428 14 10 6 1 17 20 -4 14 21 2 2 14 0 -3 -12 9 -6 -5 8 10 -14 -11 10 -1 -2 7 8 -14 -8 10 -4 -20 11 13 -8 7 4 -5 -12 2 10
4468 10 -6 -1 10 -6 -9 19 25 -4 -3 15 6 0 15 12 -11 -2 28 -3 -7 13 15 -2 -1 13 1 -18 -2 10 -13 -14 14 -1 -22 12 3 -5 -3 7
4506 7 2 -6 4 3 -12 -2 4 10 -9 11 9 3 3 8 5 -15 5 20 -17 -8 15 4 3 10 20 -7 5 14 -1 -3 4 5 -11 -10 7 5 -10 1 12 -7
4546 -7 -17 16 4 -14 2 4 -26 -9 9 2 -14 -9 10 -10 -1 6 18 -6 1 10 -4 -13 16 4 -15 -5 11 1 -7 20 14 -4 3 22 3 -9
4582 -9 2 7 -15 5 14 -10 -10 -3 5 -8 -3 11 -7 -2 13 12 -19 -7 9 -7 -10 3 2 -16 -7 13 -3 -17 6 11 -5 -4 11 8 -1 8 17 -14 -3
4621 -3 16 4 -9 17 7 1 -1 10 -10 0 9 2 -9 -16 6 -3 -16 1 4 -15 -10 8 -8 -18 8 8 -19 -9 13 -3 -22 -1 3 -12 -7 9
4657 9 1 -14 -4 4 -8 -16 4 3 -9 9 18 -11 -3 16 5 -6 5 10 1 -6 13 9 -5 13 4 -2 -3 11 5 -9 1 12 -7 -9 7 -3 -13 -7 8
4696 8 -23 -7 10 -6 -5 6 7 -4 -8 4 2 -2 -8 0 -3 -9 14 7 -31 -3 17 -7 -11 20 3 8 8 20 3 1 16 7 -3 5 7 6 -9 -1 0 -9 -3 15
4738 15 -10 -15 -9 -15 -15 1 19 -7 -6 0 -3 -5 -3 9 -6 -13 5 1 -7 -8 15 -8 -14 3 9 -17 -9 7 -4 -8 3 13 -10 0 15 0 3 9 18 -6
4778 -6 -11 4 1 -1 17 8 -15 -9 2 -4 -9 12 -6 -10 -8 6 -15 -19 10 -6 -8 -2 9 -2 8 9 2 -8 1 18 -1 -13 21 9 -11 -8 27 7 -7
4817 -7 18 16 2 -3 5 -1 -16 2 7 -7 -12 8 2 -8 10 14 -7 -7 17 -7 -22 2 7 -13 -9 12 -5 -10 12 0 -8 -22 3 6 -10 -9 13 -10
4855 -10 -5 6 -1 -8 4 12 -3 1 32 9 -3 8 12 4 7 8 6 -3 0 20 -3 -10 0 6 10 -1 13 -5 5 14 -3 -15 -3 7 -11 -4 1 -10 -5 3
4895 3 4 2 -6 11 6 -20 0 11 -3 -7 9 10 -3 2 10 5 0 24 14 1 9 6 9 -1 10 18 -4 0 3 -2 -10 4 10 -1 -1 8 4 -1 17 -2 -6 -7 2 0
4939 0 -6 4 1 2 1 10 2 -5 11 4 -1 -6 21 12 -7 11 2 -7 3 -1 8 1 12 6 4 14 12 -1 4 0 21 14 5 11 7 -3 9 21 6 -6 8 -10 1
4982 1 16 3 -5 -5 1 -3 -7 -2 6 9 6 8 10 -5 -8 15 -11 3 14 5 1 3 5 -3 7 3 3 -4 3 0 7 7 5 13 7 10 12 2 7 11 22 0 18 13 1 -1 13
5029 13 -2 -7 -6 7 -5 -7 -1 2 -12 -3 -3 -3 -3 3 6 -7 -2 8 2 12 5 3 -1 10 9 8 5 16 13 4 3 6 -16 9 19 23 4 6 6 3 -2 8 9 1 -2 11
5075 11 -2 10 21 6 4 -10 -4 -9 -3 9 2 -2 -11 3 5 -7 9 -1 -3 -4 8 -2 -11 14 -8 6 0 12 -3 8 10 -3 6 5 13 8 7 5 -4 2 13
5116 13 3 17 0 4 14 -11 6 8 3 3 6 2 3 -1 4 -7 -17 -11 6 1 -9 2 -10 -10 3 -1 3 -2 0 -1 2 1 -4 -5 3 13 -1 13 4 3 -5 3 3 0
5160 0 -8 10 -1 -11 0 10 7 1 7 -6 -4 -13 4 12 -6 -5 -3 -6 -1 -9 3 0 -10 8 0 -1 -1 2 -4 10 6 -6 2 0 0 -5 3 -2 5 4 10 11 -11 7 6 -3
5206 -3 3 11 15 5 0 3 -2 -3 3 4 5 10 16 1 0 3 7 -5 8 1 -2 -2 -3 11 1 2 2 10 4 12 4 -4 5 1 -1 3 4 4 -1 -4 -3 1 5 9 10 3 2 15 15 -4 10 12
5258 12 3 6 5 -1 5 7 1 1 -1 13 -2 2 1 -5 -2 -2 12 -3 -1 -11 4 -2 -3 -10 0 -1 -3 1 -1 -3 5 1 5 9 -5 3 -7 3 3 6 4 10 10 1 -3 4 4 13 16 3
5308 3 7 -3 0 2 0 12 4 11 -3 8 4 -4 4 13 -2 -2 -4 -4 3 1 -8 -15 -1 -9 -5 -17 -1 -4 -5 3 1 -4 -1 0 9 9 5 4 -4 15 -2 10 -5 -1 11 -2 -4
5355 -4 16 7 0 -1 -1 6 -5 -7 1 6 -4 1 2 3 1 1 -7 -6 5 -10 -12 -8 -14 -12 -7 -7 0 -2 -6 -5 -7 -1 -7 -8 -13 -2 3 2 1 4 1 -8 9 13 9 -5 -2 1 2 0 9 7 2
5408 2 -5 -6 -4 -9 -3 6 -5 -6 7 -9 -8 -5 -13 7 1 -9 -14 6 -1 -7 3 -2 -10 6 -1 -5 -8 -12 7 6 -3 4 11 4 -1 9 9 2 -5 10 0 0 12 8 6 9 8 5
5456 5 5 1 1 -3 -3 13 3 -5 3 -2 5 -11 -6 1 -5 6 3 -11 -5 -1 3 -1 -2 -6 8 -5 -10 -4 -5 -3 2 -8 -8 5 2 1 2 5 -3 -7 19 12 5 3 6 0 5 -3 -1 -4 0
5507 0 12 -8 -7 8 -2 0 -6 2 -5 -7 -6 -3 -15 -12 -7 -16 -17 -1 -3 -3 -12 -3 2 -2 13 2 -3 -12 20 -4 -10 3 6 11 4 10 0 0 -1 7 -5 -4 5 15 2 7
5553 7 9 0 8 12 2 -4 8 -2 0 4 3 -18 1 2 3 -5 -8 7 -7 -16 3 -4 1 -4 3 5 -4 -1 0 -13 0 11 -8 -3 -6 2 -5 2 -1 -5 4 -9 10 2 -3 -1 2
5600 2 2 7 9 0 1 -7 2 0 -3 -4 6 -1 -3 4 -6 -8 -3 3 1 -3 -2 -4 -11 -8 -4 -6 -1 -2 -6 -2 -6 3 5 20 3 -1 12 15 -3 -5 5 -2 -2 3 3 10 9 11 2 1 -9 15
5652 15 -6 0 10 5 -4 -11 -3 1 6 2 3 8 4 -3 -8 0 -3 -2 -14 -7 -2 -10 -8 3 -1 -4 2 0 -4 5 5 8 -3 13 2 7 15 4 15 6 0 -6 0 7 -3 5 -5 -3 -2
5701 -2 -8 -8 -11 7 -7 -13 -4 -3 -2 -4 -6 -2 0 -5 -7 -10 -3 -1 -6 -3 8 -6 -12 -8 -10 -15 1 -1 -14 -11 -7 6 -9 -3 -2 -6 7 -1 -1 1 -3 -11 -6 11 7 2 3 6 7 -12
5751 -12 2 0 -4 -2 2 -6 3 -7 -4 -4 -3 -8 0 -1 -7 -11 5 4 -8 3 -2 -3 -10 1 -2 -8 -8 -7 10 -10 -11 -1 3 -6 -8 -10 0 -2 -9 -11 -9 10 0 1 3 -3 -3 2
5799 2 2 -10 -4 -2 4 -2 -8 -5 -15 -9 0 -10 -7 -16 -1 -9 -11 -4 -10 -4 -12 -8 0 -7 3 -2 0 -6 11 10 10 -11 1 3 3 -3 6 -1 -9 -5 6 2 4 8 -4 9 -1 6 -1
5848 -1 0 9 7 -3 1 3 -15 1 7 5 -7 -9 -14 -18 7 -3 -4 -9 -5 -5 -3 2 -8 7 3 7 2 -14 -1 3 9 2 0 1 2 7 0 -4 6 5 5 -1 -3 6 1 2 10 8 1 6
5898 6 -4 3 -1 2 -1 -1 -1 -9 -4 -3 -7 -5 1 12 5 -6 -5 -3 -3 -16 8 2 -6 3 -4 4 -2 7 -1 8 12 -3 7 -4 9 -1 -3 3 8 9 4 6 5 1 -10 9 -11 -10
5946 -10 -6 6 1 -1 7 -5 0 1 -4 2 1 1 0 0 -7 -1 -7 -8 -8 0 -1 3 -11 -9 -3 -5 6 -8 1 -4 1 -1 2 14 4 13 5 4 12 15 16 7 7 1 -1 -1 -2 4 8 -8 -5 -3
5998 -3 -1 2 -2 -10 1 5 5 -10 3 -18 -4 9 -13 5 0 -14 -6 -6 10 0 -4 4 0 -1 -8 -5 -2 -1 -4 -5 -10 -12 -3 -1 1 0 -6 5 5 1 9 6 3 -3 0 -13 -6 6
6046 6 -8 1 1 -11 -13 -4 -5 0 -2 2 -3 -7 -5 -9 -10 -2 -8 0 0 -10 -7 1 -5 5 11 6 0 -1 -1 -2 -8 -4 -5 7 -2 13 9 -1 4 5 0 8 8 6 0 12 13 -1 8 2 -4 6
6098 6 -2 -1 2 -4 -3 -14 -13 -10 -8 -4 -12 0 -4 -2 2 -8 -9 5 -5 11 5 0 1 4 -3 7 8 -4 9 0 5 10 -1 8 -6 0 2 5 -9 -3 -1 -6 -1 -2 5 -5 3 0
6146 0 2 -11 -10 -1 -3 -4 0 -4 -11 -6 -8 3 -7 -6 1 -5 -7 9 -1 -4 -3 -8 -4 -3 11 2 -10 4 -10 -13 14 5 11 6 -4 3 2 4 -9 -3 9 0 -9 0 -7 -6 0 3
6194 3 -5 14 -2 -2 -8 -7 5 1 -7 -9 -13 2 -2 -3 -17 -17 -3 -10 1 7 -7 -5 -17 -13 -10 -1 0 0 -1 -6 7 5 4 3 9 4 4 3 3 -1 0 10 -6 8 -3 -8 -4
6241 -4 9 8 -1 -11 -6 -9 -7 -3 1 -4 3 -5 -14 -2 -18 -2 -13 -5 -2 -3 -11 4 -8 1 7 7 -15 -3 -4 8 -6 -15 -3 4 11 10 1 9 6 -4 9 -4 7 8
6285 8 7 -7 -1 2 -1 -18 -12 -1 -2 -16 0 -10 -8 -2 -17 -13 -7 -3 -7 0 -6 -15 1 3 5 -2 -9 5 0 -1 9 -6 3 -7 -5 -2 0 -2 9 12 -4 -3 2 2 17 -3
6331 -3 5 6 -9 -15 -5 -3 -7 5 1 11 9 -4 10 -4 1 -5 -1 -11 11 -6 0 6 7 -7 1 -6 -5 -5 -6 -7 6 -13 -3 -4 -9 -4 -13 2 -5 1 -1 -1 2 7 -1 7
6377 7 -5 -1 1 -3 8 6 4 9 3 0 -4 5 4 -2 -6 7 -11 -21 3 -9 -5 -15 -6 1 -10 -3 4 -17 8 -2 4 1 0 4 -12 -1 -8 12 0 3 3 7 -1 4 4
6422 4 -1 1 2 23 -5 -4 -2 -1 -6 3 4 6 11 -10 11 -11 -9 0 1 2 -7 -7 -13 -9 -9 11 -2 7 4 -12 0 -3 -5 -7 -1 -5 -4 -11 2 -2 3 12 1 8 -3 -1 -1 -1 10
6471 10 2 -9 -8 7 -3 -4 15 2 -6 -8 4 -2 13 -4 -4 -11 -6 -5 -9 0 -5 -16 -5 -1 -17 -8 0 -8 0 -5 -10 -5 0 -6 -5 -3 -2 -17 -5 -9 -11 3 -3 6 -14
6516 -14 7 2 6 10 6 -2 -5 -8 -4 -1 1 5 4 -7 -8 14 4 -3 -1 3 -1 -16 -14 -8 6 -5 2 2 -12 1 3 -5 -8 11 -3 9 -1 8 7 0 3 0 -4 -10 5 -2
6562 -2 9 -2 -4 10 7 5 7 10 -6 8 -4 0 8 -7 0 -5 0 -3 -2 -4 -10 -9 -2 -9 -17 -14 -12 -8 -8 -7 -3 -16 -2 -7 -17 -2 0 4 0 -13 -7 -7 -3 -1 -7 -6 -1 -10 9
6611 9 -6 -8 0 -6 -5 1 0 0 -4 -10 -1 5 14 0 2 -10 3 -1 -1 0 -6 -9 -11 -9 -9 -15 -6 -20 -8 -2 -13 -5 -10 -1 -7 7 5 -1 -4 -3 -19 -10 -8 2 -1 -8 0 0 2 -6 -4
6662 -4 -11 -1 -5 1 6 -6 5 -6 -4 7 2 -1 6 -6 2 -5 3 13 5 0 -11 2 0 -4 -4 -7 -11 -8 -11 -7 -3 -2 -5 -10 -6 -3 -12 -2 -7 -8 10 9 -2 -8 3 -4 -4 7
6710 7 16 -2 4 10 -8 -3 -6 8 -3 -5 0 -6 -7 -3 6 7 0 -6 3 4 4 -4 -2 -7 -10 -6 -14 10 -4 -4 -6 -9 -2 -3 -12 -9 -10 -6 -19 -19 -7 -5 -5 -6 0 2 2 7 -4 -1 5 5
6762 5 -1 1 -5 -1 0 1 4 2 8 -3 9 3 -5 6 8 -2 -2 6 -3 -5 -1 6 -3 3 -3 4 4 -4 -2 -1 -16 -8 7 -15 -10 -8 -9 -5 -12 -6 -5 6 15 -6 -11 19 -1 2 6 20
6812 20 12 6 -1 -1 -7 -8 3 6 -1 2 13 3 -3 -4 4 4 1 -10 -14 -2 0 -12 11 -6 -2 -12 -5 -3 0 -5 -13 10 -4 -15 -3 -9 -10 -7 2 1 -1 -3 -6 5 7 3
6858 3 1 -3 10 10 8 13 -4 4 -2 3 4 12 14 7 5 7 1 0 -2 -6 -12 -1 -11 -4 -1 -6 3 -1 2 0 -14 8 -2 -6 5 -7 -3 -1 2 -3 -4 2 -7 -1 -1 -2 -9 4 2 -1 -4
6909 -4 0 7 5 0 4 8 1 3 -2 -3 12 6 5 11 -1 -13 -5 -15 -4 -7 -3 -11 -1 -7 -1 -8 8 2 -5 -6 -6 -6 -2 4 -4 -1 -6 -4 -5 8 8 7 -1 -12 -1 -9 4 5 -1 5
6959 5 -1 -7 6 -7 1 1 11 10 4 11 6 0 1 0 4 -1 -10 -3 3 4 -9 -5 -2 -15 3 -10 -19 -11 -16 -11 -3 -10 -9 1 -13 -5 1 -3 -1 -7 -5 2 -2 -7 2 17 0 -5 -4 11
7009 11 5 7 -4 -7 -2 1 2 0 -5 8 -1 1 -1 -5 6 -3 -15 -5 -13 -4 -3 2 1 10 -10 -1 -9 2 -6 -3 -6 -10 -8 -8 -9 12 -3 -1 -4 3 10 5 -1 -3 12 7 2 3 0 1
7059 1 10 8 0 -5 1 -1 -2 -3 1 -4 -10 2 5 -2 -4 -15 6 -11 -10 -11 -8 -5 -6 -5 -5 -6 -2 -15 3 2 -5 0 -2 -6 0 7 2 8 5 -6 10 -2 -8 3 9 -9 -3 9 0
7108 0 13 8 16 -10 10 -7 -3 -4 -10 -8 4 -4 -13 -3 1 -1 -4 -9 4 -6 -14 -6 -3 -1 -6 -4 -8 -7 -16 -10 -1 -11 -8 -2 0 -2 -3 -6 3 7 0 3 -7 12 7 5 9 7 -9
7157 -9 2 4 2 2 9 -14 -3 -2 -8 3 3 -4 2 3 -4 -9 -9 -10 -3 -6 -3 3 -9 -10 -4 8 5 -8 -14 4 -5 -8 -6 4 -1 9 -3 3 -8 -3 11 -7 8 6 5 5
7203 5 0 -4 4 4 3 4 0 2 -4 -6 -1 10 -6 -5 5 4 -2 -7 0 -9 -3 -6 -1 -8 -8 -15 -9 4 5 -17 -5 2 -5 11 4 4 8 6 1 6 11 -5 1 12 8 2 -1 -1 -1 7 5 14
7255 14 8 12 16 8 12 0 -3 2 6 3 -2 2 16 -6 2 10 -1 -12 -2 -6 -6 -3 -6 -8 -13 -9 -13 -2 -5 1 -1 -3 2 7 3 -5 1 9 -6 4 3 10 3 11 1 0 6 14 14 -2
7305 -2 1 -1 6 -3 1 1 5 -9 6 -3 -11 -9 -1 12 5 0 -9 -7 -9 -7 -5 -18 -16 -7 1 -8 -7 0 4 -10 -6 -4 -9 -4 -5 -5 5 8 -3 1 16 -1 4 4 8 -6 -4 4 -2 8
7355 8 -6 7 -12 -13 -3 -1 -13 -9 -11 2 0 -9 1 4 1 -15 -5 -1 -3 -5 2 2 -18 -3 -10 -13 -8 -1 -9 -2 2 1 -9 4 -4 -6 -6 -5 1 8 10 -1 -2 6 11 -6
7401 -6 10 2 -8 3 -7 4 0 4 8 -4 -11 -7 5 3 -4 -7 -13 -7 -14 -3 -4 -4 -6 3 -11 -8 5 2 -5 -9 -8 0 6 -4 -13 -1 4 2 2 2 -7 0 10 5 5 -6 8
7448 8 4 -8 9 5 6 1 -1 0 1 5 7 -8 -8 0 9 -3 -5 -16 -2 0 -9 -5 -8 -1 1 5 5 8 -2 -1 -3 0 3 8 6 -9 4 1 -5 8 -2 6 3 -5 6 -3 8 1
7496 1 9 4 2 2 5 7 7 6 5 -2 8 1 6 1 -1 -5 4 -10 -10 -7 3 -3 -3 -2 -12 0 -4 5 2 -10 -3 -1 13 2 2 15 0 -1 3 7 3 7 -1 4 8 5 0 2 2 6 15
7547 15 7 5 11 -12 -1 18 2 0 -8 0 -6 2 -8 -4 -16 -3 -8 -2 -5 -7 -13 -14 -7 -12 -3 -8 -12 -11 -10 4 3 -6 1 -4 -8 -4 3 0 2 12 -2 -6 11 8 2 2 5 -3 -4
7596 -4 -11 5 3 0 0 10 5 7 3 9 -6 0 1 -3 8 -7 -3 4 2 -10 -9 -6 -1 0 3 5 -4 -7 -1 3 2 3 -4 6 3 -2 -2 -2 -2 10 2 4 11 12 7 8 5 1 4 3 -1 7 9
7649 9 -6 -16 -5 -8 -5 -1 1 7 3 2 1 -4 -8 -13 8 -11 5 2 -4 -7 2 -4 3 4 1 1 -1 -3 -5 1 -4 7 0 3 7 5 7 5 4 5 2 0 12 10 9 1 0 -3 0 4 -10 0
7701 0 -5 0 5 2 -3 1 -9 -5 2 -1 -7 2 -5 -2 1 -2 -6 3 7 1 3 -1 -5 8 -1 7 -1 -4 -2 4 6 2 1 2 8 10 -1 2 3 -4 7 10 7 7 8 -3 0 -1 -12 1 5 -7 6
7754 6 0 -16 -2 -8 0 8 -11 -9 -8 -9 4 -3 -8 -3 -11 -1 4 -4 0 -12 1 -3 -1 7 3 7 -9 -7 -1 4 2 -4 2 -3 -3 1 0 5 -3 2 4 -2 -2 6 -7 2 -6 -8 8 -7
7804 -7 -13 -8 -6 -4 -19 -5 -2 -19 -8 -6 -7 -12 -3 -14 8 -4 -10 3 -2 -4 6 -2 3 5 -2 -1 -1 8 2 -8 7 -12 5 0 -2 -2 -3 -3 -9 3 2 1 1 5 -3 -3 0
7851 0 -10 10 -12 -13 -8 -7 -14 -3 2 -15 0 -2 -2 -3 -6 -13 -8 3 -1 -8 2 1 -7 1 5 3 0 8 9 -2 5 6 9 0 0 -2 3 15 -11 -2 2 -5 -8 0 5 -8 -5 -5 -8
7900 -8 -15 -10 -5 -2 -10 -4 -7 -7 -10 2 -10 -1 0 -16 -6 -2 6 -1 -12 3 -2 -9 10 -2 4 15 6 -5 7 -1 -5 7 9 -6 -1 7 -2 5 -7 0 8 1 -9 -2 -2 -9
7946 -9 2 -7 -9 -3 -5 -10 -8 -8 4 -5 9 0 0 -5 1 -6 -13 -7 -1 0 -8 -6 -5 -12 -15 -11 3 -2 1 -4 -7 -4 -2 -3 5 3 -7 -1 5 2 10 3 -1 -12 3 3 10 1 -4 -17 -9 3
7998 3 -8 -7 -21 -19 -9 -5 -1 9 6 -6 -13 2 1 4 -4 -7 3 -2 4 1 10 0 -4 8 -3 9 1 5 -3 -3 3 -11 -1 1 4 6 0 1 12 0 1 -1 2 -5 -2 -2
8044 -2 1 2 2 0 -8 -11 -4 -3 -6 -4 -3 -1 12 -9 -10 -4 -5 2 3 6 0 6 0 6 1 -2 5 8 10 -8 5 9 5 -3 3 12 -1 5 1 1 0 18 8 2 7 -2 -9 1 3 -5 -4 3 -8
8097 -8 1 -7 -9 -9 -6 9 -9 2 1 -2 -9 -16 -6 6 -10 -3 -3 5 13 8 4 8 3 9 0 4 3 6 -3 -9 14 6 1 -1 1 6 -1 0 -8 -9 -13 -2 -4 -6 1 -10 -12 -3 -5 -15 -5
8148 -5 -8 -5 -4 -7 9 -7 -14 -10 -16 -6 -10 -5 -15 -2 -4 -7 -10 -10 -1 -3 4 1 0 -2 -2 4 6 4 -1 -5 1 0 -3 -2 0 2 -6 -3 -12 4 -5 -8 7
8191G
##END NTUPLES=NMR FID
##END=
