##TITLE=1H_BAU-130119
 CDCl3, 8 sc, 
 14.1.2019
##JCAMPDX= 6.0         $$ Bruker NMR JCAMP-DX V2.0
##DATA TYPE= NMR FID
##DATA CLASS= NTUPLES
##ORIGIN= UXNMR, Bruker Analytische Messtechnik GmbH
##OWNER= root
$$ XWIN-NMR		Version 3.5
$$ Mon Jan 14 14:46:54 2019 Russian Standard Time (UT+4h)  she@DPX200
##.OBSERVE FREQUENCY= 200.1313
##.OBSERVE NUCLEUS= ^1H
##.DELAY= (6, 6)
##.ACQUISITION MODE= SIMULTANEOUS
##.ACQUISITION SCHEME= undefined
##.AVERAGES= 8
##.DIGITISER RES= 18
##SPECTROMETER/DATA SYSTEM= spect
##.PULSE SEQUENCE= zg30
##.SOLVENT NAME= CDCl3
##.SHIFT REFERENCE= (INTERNAL, CDCl3, 0, 15.7039)
##AUDIT TRAIL= $$ (NUMBER, WHEN, WHO, WHERE, WHAT)
$$ ##TITLE= Audit trail, XWIN-NMR		Version 3.5
$$ ##JCAMPDX= 5.01
$$ ##ORIGIN= Bruker BioSpin GmbH
$$ ##OWNER= she
$$ F:/spectra/data/she/nmr/H-F/1/audita.txt
$$ ##AUDIT TRAIL=  $$ (NUMBER, WHEN, WHO, WHERE, WHAT)
(   1,<2019-01-14 14:45:28.62 +0400>,<she>,<DPX200>,
      <created by zg, POWCHK disabled, PULCHK disabled
       configuration hash MD5:
       00 E9 B6 7A A2 85 ED C7 34 08 36 98 17 FE 4E 26
       data hash MD5: 16K
       F7 5C 6A 22 5A 7A DB 12 1B AC 83 AE E3 46 F6 BE>)
$$ ##END=
$$ 
$$ hash MD5
$$ C3 0C 5E 94 4A CF 02 40 B4 88 F5 B1 70 F0 58 88
##$RELAX= 
##$RELAX= 
##$RELAX= 
##$RELAX= 
##$RELAX= 
##$RELAX= 
$$ Bruker specific parameters
$$ --------------------------
##$DU= <F:/spectra>
##$EXPNO= 1
##$NAME= <H-F>
##$PROCNO= 1
##$TYPE= <nmr>
##$USER= <she>
##$AMP= (0..31)
100 100 100 100 100 100 100 100 100 100 100 100 100 100 100 100 100 100 
100 100 100 100 100 100 100 100 100 100 100 100 100 100 
##$AQSEQ= 0
##$AQ_mod= 1
##$AUNM= <au_zg>
##$AUTOPOS= <>
##$BF1= 200.13
##$BF2= 200.13
##$BF3= 200.13
##$BF4= 200.13
##$BF5= 200.13
##$BF6= 200.13
##$BF7= 200.13
##$BF8= 200.13
##$BYTORDA= 1
##$CFDGTYP= 0
##$CFRGTYP= 5
##$CHEMSTR= <none>
##$CNST= (0..31)
1 1 145 1 1 1 1 1 1 1 1 1 1 1 1 1 1 1 1 1 1 1 1 1 1 1 1 1 1 1 1 1 
##$CPDPRG= <>
##$CPDPRG1= <>
##$CPDPRG2= <>
##$CPDPRG3= <>
##$CPDPRG4= <mlev>
##$CPDPRG5= <mlev>
##$CPDPRG6= <mlev>
##$CPDPRG7= <mlev>
##$CPDPRG8= <mlev>
##$CPDPRGB= <>
##$CPDPRGT= <>
##$D= (0..31)
0 1.2 0 0 0 0 0 0 0 0 0 0.03 0 0 0 0 0 0 0 0 0 0 0 0 0 0 0 0 0 0 0 0 
##$DATE= 1547462728
##$DBL= (0..7)
120 120 120 120 120 120 120 120 
##$DBP= (0..7)
150 150 150 150 150 150 150 150 
##$DBP07= 0
##$DBPNAM0= <>
##$DBPNAM1= <>
##$DBPNAM2= <>
##$DBPNAM3= <>
##$DBPNAM4= <>
##$DBPNAM5= <>
##$DBPNAM6= <>
##$DBPNAM7= <>
##$DBPOAL= (0..7)
0.5 0.5 0.5 0.5 0.5 0.5 0.5 0.5 
##$DBPOFFS= (0..7)
0 0 0 0 0 0 0 0 
##$DE= 6
##$DECBNUC= <off>
##$DECIM= 24
##$DECNUC= <off>
##$DECSTAT= 4
##$DIGMOD= 1
##$DIGTYP= 9
##$DL= (0..7)
0 120 120 120 120 120 120 120 
##$DP= (0..7)
150 150 150 150 150 150 150 150 
##$DP07= 0
##$DPNAME0= <>
##$DPNAME1= <>
##$DPNAME2= <>
##$DPNAME3= <>
##$DPNAME4= <>
##$DPNAME5= <>
##$DPNAME6= <>
##$DPNAME7= <>
##$DPOAL= (0..7)
0.5 0.5 0.5 0.5 0.5 0.5 0.5 0.5 
##$DPOFFS= (0..7)
0 0 0 0 0 0 0 0 
##$DQDMODE= 0
##$DR= 18
##$DS= 0
##$DSLIST= <SSSSSSSSSSSSSSS>
##$DSPFIRM= 0
$$ [...]
##$SUBNAM2= <"">
##$SUBNAM3= <"">
##$SUBNAM4= <"">
##$SUBNAM5= <"">
##$SUBNAM6= <"">
##$SUBNAM7= <"">
##$SUBNAM8= <"">
##$SUBNAM9= <"">
##$SW= 24.933730806125
##$SWIBOX= (0..15)
0 0 2 0 0 0 0 0 0 0 0 0 0 0 0 0 
##$SW_h= 4990.01996007984
##$TD= 16384
##$TD0= 1
##$TE= 0
##$TE2= 300
##$TE3= 300
##$TEG= 300
##$TL= (0..7)
0 120 120 120 120 120 120 120 
##$TP= (0..7)
150 150 150 150 150 150 150 150 
##$TP07= 0
##$TPNAME0= <>
##$TPNAME1= <>
##$TPNAME2= <>
##$TPNAME3= <>
##$TPNAME4= <>
##$TPNAME5= <>
##$TPNAME6= <>
##$TPNAME7= <>
##$TPOAL= (0..7)
0.5 0.5 0.5 0.5 0.5 0.5 0.5 0.5 
##$TPOFFS= (0..7)
0 0 0 0 0 0 0 0 
##$TUNHIN= 0
##$TUNHOUT= 0
##$TUNXOUT= 0
##$USERA1= <user>
##$USERA2= <user>
##$USERA3= <user>
##$USERA4= <user>
##$USERA5= <user>
##$V9= 5
##$VALIST= <valist>
##$VCLIST= <CCCCCCCCCCCCCCC>
##$VD= 0
##$VDLIST= <DDDDDDDDDDDDDDD>
##$VPLIST= <PPPPPPPPPPPPPPP>
##$VTLIST= <TTTTTTTTTTTTTTT>
##$WBST= 1024
##$WBSW= 4
##$XGAIN= (0..3)
0 0 0 0 
##$XL= 0
##$YL= 0
##$YMAX_a= 205140
##$YMIN_a= -218891
##$ZGOPTNS= <>
##$ZL1= 120
##$ZL2= 120
##$ZL3= 120
##$ZL4= 120
##$ABSF1= 10
##$ABSF2= 0
##$ABSG= 5
##$ABSL= 3
##$ALPHA= 0
##$AQORDER= 0
##$ASSFAC= 0
##$ASSFACI= 0
##$ASSFACX= 0
##$ASSWID= 0
##$AUNMP= <proc_1d>
##$AZFE= 0.1
##$AZFW= 0.1
##$BCFW= 1
##$BC_mod= 2
##$BYTORDP= 1
##$COROFFS= 0
##$CY= 11.3945322036743
##$DATMOD= 1
##$DC= 2
##$DFILT= <>
##$DTYPP= 0
##$F1P= 18.9103706918063
##$F2P= -1.10871071338519
##$FCOR= 0.5
##$FTSIZE= 0
##$FT_mod= 4
##$GAMMA= 1
##$GB= 0.15
##$INTBC= 1
##$INTSCL= 1
##$ISEN= 128
##$LB= 0.24
##$LEV0= 0
##$LPBIN= 0
##$MAXI= 10000
##$MC2= 0
##$MEAN= 0
##$ME_mod= 0
##$MI= 1.114404
##$NCOEF= 0
##$NC_proc= 0
##$NLEV= 6
##$NOISF1= 3.799351
##$NOISF2= 2.8
##$NSP= 1
##$NTH_PI= 0
##$NZP= 0
##$OFFSET= 15.70392
##$PC= 1
##$PHC0= -8871.338
##$PHC1= 14.20006
##$PH_mod= 1
##$PKNL= yes
##$PPARMOD= 0
##$PSCAL= 0
##$PSIGN= 0
##$REVERSE= no
##$SF= 200.130013532006
##$SI= 16384
##$SIGF1= 3
##$SIGF2= 2
##$SINO= 400
##$SIOLD= 16384
##$SREGLST= <1H.CDCl3>
##$SSB= 0
##$STSI= 0
##$STSR= 0
##$SW_p= 3612.71676300578
##$SYMM= 0
##$S_DEV= 0
##$TDeff= 0
##$TDoff= 0
##$TI= <>
##$TILT= no
##$TM1= 0
##$TM2= 0
##$TOPLEV= 0
##$USERP1= <user>
##$USERP2= <user>
##$USERP3= <user>
##$USERP4= <user>
##$USERP5= <user>
##$WDW= 1
##$XDIM= 8192
##$YMAX_p= 0
##$YMIN_p= 0
$$ End of Bruker specific parameters
$$ ---------------------------------
##NTUPLES= NMR FID
##VAR_NAME=  TIME,          FID/REAL,        FID/IMAG
##SYMBOL=    X,             R,               I
##VAR_TYPE=  INDEPENDENT,   DEPENDENT,       DEPENDENT
##VAR_FORM=  AFFN,          ASDF,            ASDF
##VAR_DIM=   8192,          8192,            8192
##UNITS=     SECONDS,       ARBITRARY UNITS, ARBITRARY UNITS
##FACTOR=    0.0002004,     1,               1
##FIRST=     0,             0,               0
##LAST=      1.6414764,     0,               0
##MIN=       0,             -218891,         0
##MAX=       1.6414764,     205140,          0
$$ Real data points
##PAGE= N=1
##DATA TABLE= (X++(R..R)), XYDATA
$$ [...]
1982A659o77q85J089L68p23q05O00J11j084l57N52j17j126l8J040n62q46Q66J235
2001C00m67l82N03J788r43p95O58J105r62p76N01O22j087n31M18Q0n31n51Q01
2020b49J20p63M40Q53n2r99O84J093r36j014P94R17j171q41M32J027p91p50J005
2039b01P63r57l0Q51M62j14k37R68P7q40k93N72l03j532L3O95p52j219Q18P98
2059d41p12p03J031J270p27k06J004J090q10l76O56K57q91j06N57k78j228J5N96
2078bl71q04N52P75q0o40O07J134o19r27P72P09r40m99J76L20n21q78N57M92l27
2099e14l43P78P54q34M43J131k21o70M33Q00q40r08K12K26n67j378N53P03q35
2118a077p81O14J174o96k62J286M88m85JP42j47n12j15P54o39m08j20N22j73j060
$$ y = [1659, 982, 97, 1186, 1554, 831, 26, 626, 737, -347, -704, -152, -269, -1395, -1433, -393, -955, -1801, -935, 300, -167, -549, -46, 1742, 799, 4, 662, 1767, 805, 29, 530, 1152, 65, -466, -48, 32, -499, -1050, -249, -129, -892, -452, 401, 349, -650, 34, 1127, 191, -823, -29, 888, -283, -1124, -692, 335, -456, -1206, -201, 562, -395, -425, 426, 888, 774, 537, 1505, 1582, 742, 449, 1021, 718, -814, -781, -86, -838, -2057, -1239, -441, -1153, -1856, -825, 445, -282, -488, 516, 1606, 796, 420, 1076, 1333, 442, 336, 893, 615, -613, -598, -2, -373, -1177, -625, 150, 70, -570, 37, 1171, 552, -375, 397, 1106, 166, -333, -157, 163, -358, -1236, -679, -187, -514, -857, -79, 675, -159, 284, 1415, 1194, 524, 957, 1757, 917, 9, 221, 447, -120, -1498, -945, -242, -1077, -1858, -1244, -70, -766, -1028, 258, 746, 261, 262, 1004, 857, 345, 230, 984, 345, -63, -183, 339, 166, -894]
2138h94L59J039p05k85L13R58m81m70M15N92n96r26P37J83r15m05R95k92o09J85
2158h02O73L5n66O38J093l51o88P92Q29n84j191N64O87o74q10R8J33k90n57N12
2178d59J20p18L9Q06P3l43K3Q88p8q27K14R28k22j032O91N48o12m72K42O78k50
2199B37q56Q03K22m6m83M74L48m80m52P49j47q92N1M09j3r47K14P11o31j3K17
2220e25P55r3m39L24O75j71r4K70M75l57o15M9K41m30n57N43J33r08J70M05n83
2241g32l5K15Q56j07p35K45Q10k72m14K40O09l16l99j7M24k08n99K41N45m56r6
2262b01N21r5l78J35O40k9n52J31K25j1p43j15N16l18o77N7O97l73j11L49O35
2283C03m09k9M79L05J02q6K18L99q67k2J53K7j112K8O19k55o80n8R59l75o27N35
$$ y = [-894, -535, 504, -201, -486, -173, 785, 304, -166, 249, 841, 245, -681, 56, 239, -676, -1081, -86, -378, -987, -802, -129, -94, -660, -22, 1071, 720, 32, 824, 1653, 1069, -122, 442, 1129, 455, -355, -257, -124, -414, -971, -459, -339, -1057, -1018, -212, -139, -482, -459, 429, 351, -476, -262, 666, 444, -588, 103, 651, 39, -433, -191, 487, 237, -619, 184, 406, 360, -123, 351, 699, 219, -233, 516, 369, -523, -472, -63, -76, -1023, -809, -98, -729, -742, -525, 230, 137, -302, 22, 697, 526, 432, 702, 1177, 820, 205, 254, 495, 65, -492, 51, 184, -724, -554, -149, -732, -767, -552, 304, 197, -538, -293, 517, 245, -169, 71, 680, 364, -35, -52, 372, 164, -435, -194, 351, -105, -201, 320, 225, -153, -18, 622, 593, 41, 172, 397, 386, -357, -472, 44, -274, -951, -894, -197, -570, -681, -332, 303, -106, -135, 344, 649, 751, 665, 883, 1282, 415, 393, 546, 573, -539, -511, 108, -147, -827, -885, 74, -301, -928, -393]
2305c93O78l38j95K90P23n86MM8L66o34l01M50o1m22j33O80j42l62N25N70l12
2326D55m83L92M84j18o21M5O2m69l23P9J30l90j73J48M40o13M54L71N67m47K20
2347B10O58J30p01L03J00n1p27j04O18m84k54k82N26k40n14M19N33L9n12M21K30
2368C18k51r7J71J94p97K14J15L68o05J04L19m7l91M65M62k61j81J27N92k43k94
2389B82l7J93o8m34M9M69q40k46j1M25l39j12O50j06m01L38O76O0m10k7P11j19
2411G03q00M20L03j60n48j09M07k34k29J64M42n03lR8L80n04l5M94k67l32m4M05
2433D8L64j148L59M39l4n51N32J45R8l33L65K10K2n26M50L46n55m10K70L14n09
2454a04k2Q6j04k02o91P69K31n12K54N81k4n05nR02l78k03J38J45Nn06L61k67
$$ y = [-393, 285, -53, -248, 42, 765, 179, 183, 231, 597, -37, -338, 112, 51, -371, -504, 176, 34, -328, 197, 767, 455, -28, 364, 848, 730, 109, 154, 216, -253, -576, -497, -367, -757, -930, -782, -342, -955, -501, -130, 437, -10, 210, 868, 998, 297, 600, 700, 649, -78, -182, 436, -48, -302, -584, -58, -298, -812, -393, 140, 179, -333, 88, 318, 67, -30, 141, 335, -462, -248, -133, 235, -370, -266, 53, 6, -385, 80, 542, 281, 100, 227, 819, 576, 282, 245, 438, 370, -64, -15, 454, -386, -632, -643, -218, -557, -669, -19, -125, -526, -188, 488, 548, 138, 111, 822, 703, -97, 323, 626, 466, -82, -191, 216, -18, -247, -83, 359, -144, -147, -49, 331, -173, -208, 286, 19, -313, -357, 48, 412, -736, -377, 62, 28, -523, 9, 154, 252, -81, 284, 494, 516, -10, 440, 786, 231, -179, 91, 405, -104, -126, -40, -144, -346, -1037, -268, -37, -549, -295, 286, 262, -243, -248, 654, 276, 73, 211, 356, 361, -145, 216, -51]
2476e1K0j42R3N51p95J73M25O9k68j30J62O0l82J02O09l65n11k28M15j29k66J14
2498d74O72j86k63K17M46j5m26M79K93m49rO1M30j019p9K07N6j08m29P61k74m24
2520e33M9M99j32j48m1M92K02l62M0L06k60j56K00J15k56j98M81k07k00M8K88
2541B27j2l34J54K09J2M9l24J50J20o05K00O7k43k43RM66k78j00L82M43k79k14
2563a44N54L0k52j3K94K30n22k9L30o6l59l49K09N2k93J02K31k10j57J50K06M7
2585D1q4J94K2l18j87N61l07J15k19M63n6m30l8K46M35l84k47M15K1k82J34J33
2607B28J94n61R0J87N3o77L41M0l80J73j95P59o83r0O32m7j64P5J71K39m40Q2
2629B7L84j43m68N2L55J6m79K23J6l62k8K35K75l02j53R1L35n3j29j10K29j80
$$ y = [-51, -31, -173, -80, 471, -324, -151, 274, 343, 75, -55, 107, 167, -215, -113, 496, 131, -380, -608, -193, -322, -588, -474, 198, 12, -251, -34, 412, 397, -29, 450, 743, 294, 285, 346, 776, -243, -322, -115, -59, -167, -596, 165, -109, -533, -484, 15, -117, -265, -306, 186, 388, 26, 66, 372, 112, -44, 156, 271, 15, -183, 298, 91, -109, -61, 227, 215, -119, 35, 244, 256, 305, -19, 131, 251, -354, -154, -87, -330, -573, -564, -98, -376, -476, -94, 349, 70, -144, 410, 440, 188, 175, 469, 699, 177, 148, 478, 412, 53, -296, -87, -35, -328, -226, 5, -205, -362, -212, -6, 41, -43, 151, 173, -145, -332, 229, -78, 37, -182, 281, 225, -205, -243, 3, 438, 54, -193, 222, 243, -39, 95, 228, 422, -139, -49, 138, 191, -486, -145, -105, -485, -312, -507, 252, -431, -521, 111, 64, -100, -25, 146, 385, -55, 27, 411, 268, -200, -148, 207, 223, -256, -33, -17, -379, -407, -172, 103, -199, -352, -261, 74, 21, -108, -218, 11, -169]
2651a69j10M18J8m01J06M27j48M0k86J39J68L9lN4K1Rl80L02j87r6p0J82l11k41
2675d79J37K76l52J54o9N02l18k99O45R5j19j63N68k38J63m20N4J11k99J18L71
2696D38n20j84J48L24j71k12j2K37l0l64Q8L34j90l24K78L41J00m91K98k77K11
2717B2p3J13L0j41K12L09k49k46J03N12l04l56M24l49k56P9j14O85n05j82n4L18
2739b2q9p3K09J25p0j24K35J73n22L33j25J19Ll01L44l19J40L4L64k46m21N55
2761C22l16j4j53M4K92j85p7L8J07k36k52J66O2K20l54M29J07m95L93J88m09j9
2783a42K58J62j53j36M66m23M1J31q6p6K4n47N80m4k94m3M01j61m6j54M20r7n12
2806d31L08J96j9k79K65K18j86l40K24M30k82k15J23J80k98p6K68J37j23l29J16
$$ y = [-169, -279, 139, 157, -244, -138, 289, 141, 181, -105, 34, 202, 241, 238, 292, 313, 322, -58, 244, 57, -39, -109, 73, -238, -479, -342, -66, -418, -264, -333, 169, -149, -448, 197, 292, 173, 10, 578, 340, 503, 83, 137, 248, -51, 67, 438, -82, -266, -118, 206, 35, -177, -189, 48, 18, -346, -258, 76, -114, -438, -160, 181, 281, -210, 88, -189, 22, -51, 62, 92, -49, 163, 472, 223, -23, 80, 592, 288, -68, 356, 7, -249, -170, -284, 401, -104, -286, -340, -22, -111, -184, 25, 150, 80, -44, 191, 364, -158, 175, 50, 169, 172, -129, 215, -104, 36, 70, 434, 188, -233, 322, 6, -8, -161, -117, 175, -10, -87, -49, 58, -178, -430, -264, -202, 18, -336, 93, 200, -295, 98, 286, -123, -142, 116, 278, 125, -11, 455, 32, 73, 204, 118, 42, 66, -481, 99, 55, -239, -282, 119, -42, -88, -242, 178, 81, -431, -123, 73, 54, -225, 40, 258, 72, -268, -44, 386, 104, -111, 12, 192, -106, -182, 86, 223, 100, -229, -113]
2827a13P1n9j22N48k09o32M15M48l97L6j7J05r2k80L84L70l59j73kM34j56l60
2849a60K90l62N42j09J56k58Q8l47M79m49K0MK85k52l55Q2N18l67r9J62K29j11
2871a4j10J88L40l94k02K86J09N4j47J11k87j37J66J25k3p4p7K23j6m19K66K27
2893A95l85j27J08K34k7l6J35j7j11r6K44R1k99n1K83o8j03N8J66l8k6j59L04
2916B75k92o48O73K34l09k11J70K91l15k66L58L80l44j84Q6J5Q8j71N41o6k24
2937H1j60J29J11k68J65J61K8l00J70q4J85j60RJ50m44j99K53j88L56l62K2L20
2959b5k79M43j80K46l17J89N0J65k60J5j44l5J75j09J48j29k20J4J33K33o28J96
2981c19P00k51n4j13J16M1l41L50J1m09K50k76L09j80N6p0K43K7m03L68Q0k74
$$ y = [-113, -42, -101, -223, 325, 116, -516, -101, 347, -50, -14, -31, 74, -18, -298, 86, 456, 97, -76, -78, 356, 200, -160, 130, -232, 310, 201, 357, 99, 187, -160, 319, -130, -110, -106, 179, -73, -428, -346, 172, -195, -294, -132, 97, -14, -124, 64, 404, 10, -192, 94, 203, 257, 110, 221, -66, -203, -37, 88, 65, -9, -86, 137, 121, -298, -32, 195, -190, -317, -209, 25, -2, -38, 97, 80, -31, -127, 117, 208, -91, -142, 141, 73, -30, 28, 194, 156, 130, -29, 275, -17, -665, 8, 242, -67, -278, -108, 183, -132, -398, -40, 340, -4, -188, -102, -87, 1, -170, 371, 305, 81, -79, 50, 161, -107, 58, 219, 247, -53, 117, 33, 218, 58, 67, 217, -227, -426, -173, -361, -5, -367, -345, -25, -304, 139, -41, 205, -112, 77, 127, 292, 32, 47, -97, -132, 43, -66, 82, -47, -267, -253, -120, 113, -515, -319, 381, 130, 76, -37, 79, 120, -221, 129, 140, -269, -19, -295, 14, -166, -110, -180, 63, 90, -313, 55, 135, -139]
3003a39J85K42m6k21j05L89r1k83k07K32k9k43QL13j40j66N15j48l31J51N2K01
3025A39m5J84j68M02n24j00K97J1n7n23L23J68o62K72L36M2p3k59L39j85O2J54
3047A33O5p8n40P44k63k02j67K96lj67K55k2j7j04q8J71K51l03j08M22k24Q2L4
3070A67j13l8k60L19N8m42j87M74L8l01OJ58L6p0k8L30k11J24j35N11l13l5j36
3093d8M20o4n67n8M56j17j79J80J54l68Q0J66k5j0j84O8J50k57K6K92j12j86M9
3116a34K84k03r8M1Q7J62k59J7J82j02j7N2L96m54R8j27M31m53M2K76o6k97k14
3139c56M73k16K3j66K11J7m79M67K91j29l3K6N1R1l69p4M03l46J41J41q5k5r0
3162c3J02J3k95J74M91l86m8M5j24L48k47Ok1j73K3K7L92m94L2K47P2p09J60L46
$$ y = [-139, 46, 288, 242, 21, -84, 305, 214, -69, -276, -44, -73, -316, -308, 5, -135, -301, 214, 66, -265, -114, -62, 139, 94, 278, 110, 512, -12, -112, 185, 196, 139, -384, -61, 107, -555, -283, 53, 95, 22, -237, 102, -83, -21, 133, 198, 120, -420, 324, 61, -141, -308, -12, -15, -182, 73, 51, 34, -70, -158, 13, 264, -39, -147, 275, 51, 133, 167, 54, 16, -244, 75, 133, -309, -496, -22, 16, -285, -279, -121, -85, -155, -183, 147, -64, 60, -75, 436, 123, 88, -48, 372, 308, -259, -317, 139, 22, -157, 23, 177, -191, -111, 55, 30, 20, -164, -96, 54, -203, -177, 115, 3, -183, -134, 150, -53, -151, -110, -23, 139, -120, -103, 79, -23, -40, 12, 408, -46, 52, -75, 356, -97, -55, 221, 155, -142, -356, 117, -99, -76, -242, -31, -14, -493, -26, 265, 136, 103, 129, 180, 271, -98, -172, 231, -115, 26, 167, 82, 57, -33, 69, 82, -213, -39, 452, 66, 18, 63, -61, 287, 40, 46, 25, -148, -125, -98, 294, -200, -168, 79, 151, -558, -398, -52]
3186e2K71J02m51J70K28j07J5K82k22m68M6M66k82j68N8k0K43l79L70J30k8k76
3208g2O5j62J38J10rJ4K3j91K12nl22j04M67j22m4k8J60l7j34R1K53j79l71J63
3232h4K53k10p9rL53k51O2j71K34m85J41J97M15m08k99N66j33p0j43L32P9m06
3254a16K55j02k3l13K6N61m58N9N0J25j89Kr8O21n88j03M39o4j10r3L79j63k89
3277a92j40N08k27m6p4K95k79J17k3K06J3j78K10J62j06n41M48n9k94l6K85K35
3299B84n98J04J45J99l66J29J45P5j34ML13k57l73L86mj04j71M35q9l43m6L70
3321A04J16l24j89O27o6j53k27K78k96o5Q7N1J84k19J20J11j30l11K36K15j39
3342A0j15L8M11n28O8O9K18j08k53K02L79n60O9p6M00j47j80K98j88o7J90M3L7
$$ y = [-52, 219, 321, -130, 40, 268, 161, 176, 458, 236, -232, -186, 280, -2, -170, -112, -132, 111, -268, 102, 232, 204, -72, -7, -169, -31, 79, 70, 84, 107, -84, 128, 123, -199, -303, 164, 42, -2, -30, 130, 93, -41, 50, 303, 124, -247, -84, 169, -41, -120, -129, 224, -27, 35, -136, 98, -387, -246, -49, 366, -42, -341, 225, 92, 22, -121, 211, 290, -116, 139, 37, 14, -299, -273, 288, -170, -111, -61, 64, -125, -123, -221, 400, -188, -291, 148, 84, -26, -119, 260, 97, -192, -332, 176, -51, -97, -171, 124, -155, -38, -61, 145, 158, -20, 190, 352, 246, -295, 153, 94, -200, -236, 49, 284, -314, -210, -65, 134, -232, -103, 42, 117, -17, -13, 300, 43, -330, 56, 52, -52, -223, 212, 123, -220, -266, 104, 220, -104, -293, 334, 268, 115, -112, 166, -130, -195, -108, -57, 127, -92, 28, 139, 9, -302, -66, 149, 10, -105, -67, 344, -184, -116, -47, 171, 63, -190, 12, 391, -169, -100, -176, 224, 77, -103, 195, 7, -60, 130, 173, 210]
3365B10n19K44J61l35K02J33L49o44L4K58K27m81K07q1K30k10N7j17L07l87R7
3386e8kK57k83j45K86ok93J01J48r0j5o9K37m8J36o3R1j40j86N9J57j94j04K17
3410gJ58k43N2J19j64J59j98J94m1j0o3O6j74j29M14k27j04M5J51M12m50k84O67
3433C43n0l45K4K08K24m62l31N69M0m96K48J99l26j67J78K36L27m32k27M67j29
3454I8k47K84L10n19k41M23j2M3l48L89j17J0k74M23m7j89J70J08N8n58K74R0
3476A28l23j87L04J9J8k94L30K49m34o2L95l35L11k46M22o9l81Q5L43Q8k19k74
3498a32L98k97j29L6m1j88L36J60m7k51n3J57J20K7n02N96m6k91k4K22R5q5l37
3521b76J75K92l42o8N67k19j27k8M61m31N6J97p5j56l64N76j25m32M01k40J38
$$ y = [210, -309, -65, 96, -239, -37, 96, 445, -199, -165, 93, 320, -161, 46, -35, 195, -15, 42, -75, 232, -155, -58, -60, 197, -86, -231, 55, 49, -244, -143, 5, -85, -100, -169, 68, 20, 156, 93, 184, 44, -142, -83, 74, -120, -224, -7, 151, -92, -40, 79, -85, 74, -124, 70, 29, 19, -44, 22, -152, -281, 133, -94, -198, -153, -2, 410, -40, -324, 343, 293, -52, -28, 180, 404, -58, -389, 180, 220, -276, -28, 171, -155, -322, -144, 92, 419, -13, -240, 227, 98, -149, 135, 445, -74, -315, 108, 96, 139, -209, 180, 63, 73, -201, 222, 175, -14, 156, 264, 322, -236, 38, 128, -195, -382, -78, -59, -41, -335, -5, 244, -190, -252, 143, -192, 119, -127, 295, 226, -155, -70, 273, 361, 142, -132, 266, -31, -160, -124, -165, -353, -17, 143, 96, -155, -208, -51, 69, 96, -406, 190, 144, -147, -171, 51, 146, 61, -276, -101, 191, -151, -219, 348, 129, 2, -26, 435, 4, 60, 257, 182, 26, -338, 238, 113, -319, 82, -158, -20]
3542b0r3l4J14J17k98o9O28k57j4m70M78n3O9k56M06j41k17Q0J20k27k04M79M2
3565A80k38p2K65J73l89j12L15k55P4J51J02j43j21j62L03Q5j42j63K09j34j8
3586i2Q6K40k57k26J94k1L0k20K78K30n5q1q1K63n80J58K09K26n83J00K36M9j16
3609a3j12o9p8l8K28L83l81j67J53M37n51j6M61j32J61l75K94k96L3m43J44J87
3631a90Q3M1J41J12m01Q8K17j59J14J23p7k01j10J31J70k05k59M10Q6r4j37p7
3653a94K77k40J3M08K99m72j66K57J5m12M15j34l5k43Q3j54o7J30K58M3l46L55
3675I0q5M35l08j46J37L7K99l41j11J25L7m76L81k1j95n4J5J71o1K26M5j01j77
3698g8L33p1J8n29J02L56K1l90J11j13J5p9K28J65j32j63K17K49k74kL34l76k29
$$ y = [-20, -113, -147, -33, 84, -214, -283, 345, 88, 74, -396, 82, 29, 98, -158, 248, 107, -110, -30, 90, -137, -341, 138, 180, -58, -130, 135, 308, -81, -193, 122, -133, -59, 92, 194, 51, -70, -232, 71, 156, 14, -149, 60, -74, -92, -6, 234, -23, -249, -55, -76, -46, -266, 12, 242, 187, 106, 25, 288, -292, -134, 75, 301, -282, -182, 54, 103, -13, -125, -194, -272, -310, -82, 301, -80, -247, -94, 343, -208, -224, 237, 105, 266, -109, 185, -111, -78, -521, -377, -190, -107, -66, 75, 187, -214, -126, 91, -68, 46, 169, 92, -109, -219, -88, 82, -123, -382, 28, 114, 20, -117, -194, 83, -157, -144, 264, 563, 91, -75, 182, 197, -215, 200, 66, 31, -212, -129, -283, -350, -220, 38, 81, -265, 90, 5, 440, 132, -14, 123, 160, 459, 118, 7, 132, 169, -307, 74, 53, -142, -196, -181, -10, -71, 155, 200, 99, -78, 255, 184, 202, -327, -225, 131, 152, -238, -127, -240, -225, -304, -76, 89, -43, -206, 11, 260, -14, -16, 318, -58, -287]
3721b87N26P5m05P1j02Mk24n6J58L86K6n79M95K0O5l48L54P6l25J44q6L69k79
3744G8p3L85m20l8k60L85O9m63J78J06J26k86O64j32m69Q4J06J60l73J07j9L55
3766B70j34k11L24J99n59K20j11L8j84J45M25j57k04k08L74j98p1j11M90k59J8
3787I6P0O4l59n7K20J24j0q1L0Kj56j41L25j9j62k0K94l15k13K44J78l22R9l03
3811d12N69j25m21M91k8j43j08N41l68L2k11j10O13n67J55K19n6j25J60m3l4j24
3833i5JK50pm05M93r2j10j88K12K13k28K07j24n5l82K09K38j10r1N4K48j7j53
3856F8L3J65j00k46J22J5M3l65L63r5J55j42k94M86m1l80K15K89l94J85Qj99o5
3879a74K43J06l0j0rk35J19k15K29J85k57m22L44K91r8l04J37L06k5l38K83q6
$$ y = [-287, 239, 314, -91, -20, -122, -118, -342, -398, -240, 146, 172, -407, 88, 108, 173, -175, 179, 255, -70, 74, -12, 357, 78, 5, 390, -30, -68, -328, 57, 126, -337, -159, -53, 73, -213, 451, 319, -150, -66, 40, 200, -173, -66, -85, 270, 136, -75, 249, 448, -111, 109, -2, 36, -148, -3, 422, 265, 61, -147, 227, 29, -42, -153, 337, 78, 96, 166, 230, -129, -186, 34, 158, 148, 67, 97, 99, -57, -198, 127, 108, -54, -74, 220, -95, -308, -64, 114, -208, -109, -412, 157, 32, -389, 102, 74, -69, -177, 364, -4, 28, -183, -293, 320, -247, -92, 127, 71, -54, 106, 63, 29, -95, -94, 156, 149, -256, 237, 145, 35, -153, 59, 272, 44, 251, 127, 72, -310, -101, 137, 27, -64, -10, 238, 221, 68, 101, 266, 166, -80, 42, 57, 100, -265, 98, 3, 158, 16, -278, 208, 167, -213, 2, 291, -103, 82, 90, -109, -174, 69, 175, 145, 135, 126, -109, 10, -205, 24, 209, -48, -470, -126, 165, 67, -237, -100, 206, 181, -157, 126, 40]
3901D0o8j27J56J8k68L13j43J25k03L90k46j96J56K79L5k31N9j28M77l72Ko6j06
3924a04J41k97J67K65n27M96k67M25n22p1K45Q3j75J71M1J3m66O13k87J10l45
3945b91J83J44J6l17J68M09m18p6K11N1K5k44N52j92k35K21j94J52k23kj1j17
3967a88k56M37L03l40j61n9O55k87L9m1r0j4l43M27J23m07r0O76m69j87J4J82
3989g6r2k44M29j80R4m3K44J66m03R6n8J24J46l63R1L41k72p1j63K23j32J71M4
4012G2M1J18l45K92k47o6K02L08k25j73PR0O4m53K71K8n1m18M17K95o20L22j13
4035a84L86j97j79J69J5q2J97k09O3l69K32M89n14m4J9M41j90j89K90l9R2k05
4057hK2N4J31k18K97O2k65l43L57j73Ol4J10L96l19k61J97J29k94J82M26m23L8
$$ y = [40, -28, -155, 1, 19, -249, 64, -79, 46, -157, 233, -13, -209, -53, 226, 261, 30, 89, -39, 438, 66, 68, 2, -104, 37, -260, -93, 172, -355, 141, -126, 299, -223, -294, -49, 34, -141, 30, 71, 84, -382, 231, -56, 54, -291, -108, 36, 52, -265, -97, 312, -106, -182, 29, 80, 105, -139, 413, 221, -14, 207, 13, 165, -58, -60, -71, -188, -444, -7, 296, -44, -205, -264, 391, 104, 143, 102, 12, -2, -345, 82, 205, -202, -292, 384, -85, -272, -258, -76, -168, -412, 17, -163, -69, -112, 132, 298, -105, -9, -67, 57, 203, -160, -69, 272, 0, -71, -234, -11, -143, 28, 72, 113, 231, -114, 178, -69, -135, 67, 375, 150, -23, -16, 74, 138, -315, -44, -16, -67, -485, -68, 227, -393, -71, -184, 202, 5, -174, -5, 10, -72, 125, -84, -21, -390, -158, 331, -183, -227, -208, 233, 43, -146, 144, 105, 197, -8, 14, 68, 199, -19, 278, 340, 75, -268, 89, -84, -78, -112, -2, 394, 75, -186, 11, 140, -154, 28, 454, 31, 69]
4080F9l23M38p6K23m67L22j78j78L0K87n27L25J94kk67L5M54l44J17j52O6nj02
4103f1k06N73m87J6J46J88k03j66L43k0n8k70K62Q0j83J36J45J76m16n3j7K26
4125A51k64J39K5n6j85K32K17j60m68K50K05k43l6P3M59l02K7l2K16l67OK87J91
4148C65n58Q2L34J0m99lJ79P7n8L09p6j1r7m12P22k97m27N48j7j10o38M29M35
4171B87p1m10K07L00l51l5J12J65o14K67K14J66l45R9J88K5l51j4l7J96m83M56
4193b9K42l60J13K20n0j29p0m0M66n38J89j7L55l33o4J35Q9o05K96K16r4l74L03
4216g9K34k97K3L10r9j65j82N27j78j34k50M62J0j58M4j18J53j51j97P19l04m4
4238A26L6R2R6o13L32O4k57k79J58K02j8r8R2J45K7l22K98o1J24l76L48k3l1l70
$$ y = [69, -254, 184, 108, 331, -136, 186, 8, -170, -140, 147, -380, -55, 139, 137, -130, -95, 359, 15, 132, -20, 46, 41, -61, -267, 306, -181, -165, -19, 169, -34, -200, 143, 123, 65, -205, 57, 137, -46, 90, 235, 411, -5, -58, -75, 151, -113, 26, 51, -5, -190, 42, 259, 99, -369, -119, 86, -157, -193, -120, 339, 37, 64, 32, 248, -119, -113, 174, 365, -193, -111, 223, 233, -266, -269, -90, -13, -71, 238, 162, 151, 54, -358, 364, 67, -360, 188, 171, 61, -577, -148, 287, 216, -194, 13, 313, -38, -73, 39, 204, -410, -143, 71, 237, -108, -9, 179, 204, -147, -161, -198, -2, -485, -29, 213, -147, -34, 186, 136, 7, -63, -103, 363, -175, 14, -3, 352, 19, -45, 90, 179, -426, -130, 86, -8, -382, -79, 155, -142, -119, 191, 92, -73, -255, 272, 94, -40, -290, 172, 182, 24, 68, -50, 103, -48, -245, 474, 170, 126, 162, 254, 350, -263, 69, 133, -124, -403, -245, -43, -61, -159, -67, 78, 105, -217, 81, 20, 144, -232, 116, 93, 62, -308]
4262c08M47J80l68P2q4J03k59j8O7L6q9L18J72m6n92K96K68k33j01J48L65n04
4284a30j05L61J95m76j56M33O9l80K20K68q0m31K42n4J68j84J50J61n47J62J67
4305E3K23l00k14P2M24m37K31j60K22j82J04L54j78l52J03K50k09j11j35N13k22
4326D9k26k4M11l37j53K06K2k22l37O22m0j14J16K19j95q6L3O9J65k29j39J70
4348b0r3o2J22K00k07j09L17K15o06k82M62M35l80j08K0J71j49k92L96J22j97
4369d5j49L13j46l37l2M93P0l25nN09m6o86L94N10l68k73J82nL1p9J52j93j64
4392a99lN19m53N2l39O17k09Q5j33K90J61n42p0K61m0L2j33M17k69p1N9J7j41
4415i2k20L73K55l35jL99j81k02J7K60l33j9k01L31j9m66J80K57J0l09K06J50
$$ y = [-308, 139, 319, -49, 23, -61, 42, -217, -235, -168, -132, -221, 97, 269, 223, -369, -73, 195, -38, -139, 9, 374, -130, -235, 126, 321, -155, -311, 122, 191, -189, 31, 299, 219, -212, 30, -24, 144, -40, 110, 271, -276, -114, 53, 276, -24, -238, -166, 258, -179, 52, -108, 114, -68, 36, 390, 212, -140, -37, 213, 4, -107, -242, 271, 49, -177, -201, 210, -127, -280, -74, -52, -274, -611, 11, -29, -143, -27, 192, -3, -89, -56, 13, 178, -51, -190, -20, -113, -175, -53, 147, -60, -169, 148, 363, -243, -525, -63, 372, -8, -116, -96, 75, -74, -366, 30, 152, -45, -194, 119, -27, -364, -396, 97, 167, -158, -163, 346, 300, -386, 8, 518, 150, -123, 59, 54, 85, 6, 158, -35, -199, -202, 317, -136, -84, -423, 194, -15, 70, -63, 227, 388, -154, -224, 37, -3, 29, -104, 313, 44, -27, 32, 49, -92, -312, 61, 316, -19, -20, 379, 198, -4, 13, 273, -60, -79, -280, 51, 32, -434, -254, 3, 13, -296, -90, 60]
4437F0o1j44J43N7K7J55k11J94m3k01Q9N9k18k18N35Qk93j34L22J6k53O8Q9K30
4461B76l33j85L21kJ4l11K89R3m60J51M00l49k32K16K69r6j6N5L20l44o7N53k20
4484C42o20N11j33nj67j23K97j81k42J98K21L9r5K24j74j99M1l8L21j52jL46j17
4507B93n98K97J70j9k52j33M00n2n24nN40k3o9k2q2J8k85N86j07j50J2J67n2j21
4531a1k4J39j34p2J42J51j29k24K37J83j92k46L98J6N8n22K26K34k25J09j79Q8
4553B3n02K26K67J94p5m99N21K3m50J87M22j37k90L16Q7j92k69J32J78k11j84
4574b33K24R0J47n28K34k3K55j08K28j11r2k37M76k21j56j52K77J27m13k2M6N40
4596C48m32PL94N5n28O4K86M9j50J37J48m72k53M71r3l4j54L57l28j30J37J89
$$ y = [60, -1, -145, -2, 55, 82, 237, 26, 220, 177, -24, 65, 124, -94, -312, 223, 231, -62, -196, 126, 142, -111, -43, 46, 276, -57, -242, 79, 77, 91, -220, 69, 162, -298, -147, 253, -96, -328, -112, 157, 61, 45, 100, 420, 76, 9, 562, 342, -278, 233, 100, 95, -72, -195, 102, -79, -321, -123, 98, 137, 42, 266, 92, -107, -66, -104, 217, 65, 64, 410, 293, -305, -8, 162, 143, -109, -242, 158, 106, -418, -423, 117, 94, 25, 3, -79, -61, -346, 240, 133, -17, -5, 162, 110, -11, -35, 104, -30, -102, 40, 191, 62, -162, 75, 258, 66, -180, 218, 234, 292, -230, -4, 230, 5, 114, -65, 23, -479, -253, 14, 208, 133, -366, 155, 178, -272, -85, 337, 200, -90, 226, 313, 121, -148, -16, 162, -49, -233, -9, 81, 228, -300, -66, -89, 166, 58, 286, 175, 83, -154, 322, 101, -55, -207, 70, 197, -216, -238, -192, 348, -84, -77, 317, 372, -156, -92, 194, 243, 93, 230, 378, -94, -347, 124, 31, -3, -157, 200, -128, -258, -121, 68]
4618F8J19m49j29M49M4k61K43K82k40j20P9Q5k63j14J01K84j74k83L45q7n5K11
4640A35N5L6l95R4Q6K41l14o4l5M12m14J43n4J75k65k6K58j43n6n0J87M2j15K66
4664A99J0m31N4M74j15k93P4J27L3m56K71L9k40R4J13J90J3l83RL22k87kK83K52
4688C50l03j31K03K39m90Q8L21l88JN5M74k48k15L2M00l04P4m42O54k68l32J75
4710e5J05n6j57q8K94j14k08L03j3l4l8K2k1K6K0M34j97j70q8K76j01n12K88J42
4734E8K10l16j29K68j85k31K78J42k72o7M64M7n99l38N76J55j99m3J87K3l24M34
4756A39j74J18j67K95J54j29l42K09O7k99k91M05P4k09J25K77k86j48O9L1J34
4777E2l10J09M35j85j71L0L92j00l02K00K14j71j29o1K64m61j15L01J51l32R0
$$ y = [68, 187, -262, -391, 58, 102, -159, 84, 366, 126, 6, 85, 170, -93, -207, -106, 178, 4, -279, 66, -21, -76, 135, 190, 226, -169, -75, 11, 252, -62, -126, -161, 251, -163, -20, -74, 101, -164, -190, 68, -75, -131, -181, 6, 48, -67, 199, 209, -222, -168, 306, 191, -102, -28, 99, 132, -324, -53, -14, -254, -160, -47, 143, 156, -227, -218, 104, -183, -185, 98, 350, 47, -84, 119, 358, -132, -44, 277, -111, -110, -55, 419, 171, -44, -12, 388, 84, 158, -284, 370, 102, -230, -55, 50, -6, -163, -251, 43, -71, -279, 24, 11, -23, -61, -39, -60, -34, -14, 420, 223, 53, -35, 241, 140, -372, -84, 58, 268, -48, -177, 91, -94, -325, -47, 95, -177, -244, 220, 267, -332, -670, -94, 61, -138, -181, 6, 29, -295, 139, -35, 83, -84, 211, 365, 236, -106, 103, 170, -129, -420, -15, 59, -150, -25, 252, -34, -182, -113, -82, 52, -258, -149, 286, 101, -70, -40, 352, 252, -50, 150, 364, 193, 64, 3, 267, -194, -309, -8, 143, -189, -99]
4798i9J57J09j83n8J95M0l82Q0K25j41j09p5L76M7l28J81J23j2j98R7J68k95m4
4821a26j1M26l54J16J41K58n75K18r9K34m87K23K12j15l15n4L56m5j61j5M03l01
4843g1K3Q7J25J58l43J11K89l12J19j71J66k29J8j18K46m22R9N85l38L9j64MK48
4866A49j95j09L27j22n98N35N9L2m14J50K40j74j96N36l1k53K12M5j01O4j86J38
4888A08J98m31l0J54l30P7j5M35k24PO1L17j81j90l9J11J89m90K22L03m71K00
4910a9K52j1k84J23J5K67m82j8L66j99m25N42nj93k48K70M42l57m26M86R5m50
4932b59k76M17J98l53M53j06J50n73N48NN1j53j49K45j18K63l25p3q4O4j9K41
4954A47k62o2p6L15J77k19K9L31k76l70K21J79Ok9om5q6k58N18k40Jo9J07J10
$$ y = [-99, 58, 167, -16, -74, 121, 161, -221, -141, 84, -57, -166, -241, 135, 182, -146, 35, 158, 146, -52, 45, 213, -82, -126, -137, 289, -65, 51, 192, 450, -125, 93, -6, 228, -259, -36, 176, 61, -254, -308, 48, 3, -158, -173, 230, -71, -48, 39, 164, 322, -21, 90, 379, 67, 186, 15, 181, -48, -30, -148, 98, -324, -225, 360, 22, 61, -103, -99, 149, -46, -155, 172, 50, -548, -13, 46, 78, -336, -186, 54, -120, -316, 220, 189, -64, 148, 193, 92, 156, -30, 108, 306, -125, -155, -1, -331, -254, -269, 166, -58, -51, 10, 327, 146, -44, -83, 28, 217, -273, -51, 252, -219, -19, 233, 222, -62, 61, 76, 343, -139, -157, 209, 10, -415, 127, 122, -71, -319, -49, 393, 36, -390, 96, 191, -259, -535, -118, 80, -273, 180, 74, 224, -349, 199, 204, 255, 102, -47, 198, 80, 343, 18, -55, -139, -75, -94, 147, -115, -177, -253, 62, 239, 20, 49, 380, 104, -266, -45, 134, 140, 111, 105, 60, -26, -284, 234, -6, -5, -74, 33, 143]
4978A43k53K38j00K9m07J38L86k04j81L43l1j76J49j20N1q5j2J8L7N2N6j50L31
5001B52l78J62M97l33m18K73L76k89l7k33L04q2l38J35K75k57p6J55N0o52L41
5022b73M24j34k97K68M1q2n2K61k4J03k65n5M57j82r2j54J73l50R5K05j01J12
5044G8k74M41j58m90J42P7p1j72J88K80l2j44r1L99Q6m22K25J12j18qqp6k2M9
5068iJ94K9l48L05l03K61j93j26J81J43j88k76L88p9l66P6L20j21k59L36J03m
5090F4k48L34O2j67n0m8J26K6j47K92O6l79O5jJ86j56k43K59k3r7k7r1K57J2j31
5115e9J36K2l65P5K42n9r6r9K98k14J43K67o3q6k29K32n5j0ql0j15P4k90L42l87
5140c34j5K54j14m0J40nJ39l1r0R9k08J58q1M02k10k85J74K50J40n00k95M81Q2
$$ y = [143, -110, 128, 28, 57, -350, -212, 174, -30, -211, 132, 101, -75, 74, -46, 5, -80, -92, -74, -37, 15, 71, -79, 252, -126, 36, 533, 200, -218, 55, 431, 142, 105, -128, 176, 94, -244, -109, 166, -91, -167, -12, 38, -614, -273, 151, 17, -280, -12, 29, -53, -105, 156, 132, 235, -30, -85, 372, 190, 98, -56, 117, -233, -138, 67, -34, 78, -196, 245, 87, -403, -261, -184, -255, -427, -239, 41, 9, -135, -226, 173, 259, -163, 62, 174, 56, 48, 40, -36, -58, -9, 185, 214, -134, 171, -132, 129, -64, -190, -9, 134, -54, -330, 58, -21, -387, -311, 9, -112, -371, -35, 68, 64, -184, 150, 212, 45, -5, -53, 73, 99, -48, 244, 310, -69, -4, -5, 181, 25, -218, 41, 18, -79, -106, -197, 60, 72, -59, 77, 99, -266, -191, 51, -8, -104, -203, 95, -119, 24, 291, 228, 142, -87, 145, 90, 80, 72, 42, -73, 1, -289, 53, -334, -349, -95, -209, -249, -109, -114, 25, -6, -96, 3, -205, -47, -128, 274, 64, -221, -47, 203, 343, -157, -452, 29, 111]
5163A11l26J13O2J46q3k06L34k65k52L68K4K37p13K30K92q2L9m6j6l23L79K09
5185B32k91J39j71L07J07l49L4N5L44k60j91J30j40j00K41Q9j68j47J25J03k91
5206b02M34k51kl16K38Q1n7j88J97M24k25j53O1j7j00O9J14R0k10k40K84R8j2
5229A17k97p7M53k69j38J74j39j22R2J61OM9q7J13J17k92q9K72M0j19KL04l50
5252g9k89P8O80j74n71N82k48k02K30pp2J11k08K75Qk20J87l1pl97L34K63l81
5275a38J16N7J05k69m9L35N3k5l10K18Q5l56O4L07m7k24K57j87J59k49K5K73j80
5298B0k46K2L99k7n99M18j02O2l19L11K85k51J67k15O2om9L51P8k50k25J18J08
5321A12K1j76k51L07J48l09J89j55J40k63L97k31j36J46K50m9M5j92J63l88Q0
$$ y = [111, -215, -102, -40, 106, 23, -183, 151, -114, -366, 2, 26, 263, -450, -220, 72, -10, 29, -17, -33, -356, 23, 232, -59, 80, -91, 216, 323, -26, 8, 63, 407, 147, -44, 86, -54, -154, 87, 176, 8, -139, -14, 89, -202, 232, -19, -21, -337, -99, -18, -75, -263, -66, 358, 133, -20, 41, 24, -76, -7, 107, 197, -13, -253, 31, 129, 117, -180, -257, 196, -73, -211, -37, -176, -298, -206, -45, -39, 10, -77, 36, 153, -139, -228, 44, 84, -35, -33, 271, -79, -368, -290, 390, 216, -355, 227, -21, -223, 7, 0, -72, 39, -169, 106, 114, -106, 81, 50, 43, -354, -20, 243, -138, -22, 35, 140, -129, -178, 157, 210, 185, -125, 93, 178, -178, -114, 193, 146, -78, 179, -8, 151, -98, -73, 200, 20, -226, -204, 195, 168, -431, -13, -115, -53, -372, -61, 224, -27, 140, -75, -13, -19, -68, 283, 361, 111, -114, 4, 112, 133, -43, -294, 13, 161, -148, 41, -114, 26, -237, 160, -71, -207, -61, 189, 140, 185, -7, 156, -232, -152]
5342a52J89N2k1j22k21K60j11J14K6q1M11k69K43l37J07k65L55k70Q9o1K83n2
5364A67k78pL43l93K97k31L91k86J7J03k46R3m1L13j88M6j38Pj9j8q2K46p5l84
5388c63L33NJ97l70R3K33m0k66L02j03j19m7L19j31m9n8K25jj0k37K83p3p8j53
5412a08M10k22n1O9k95M43j84K45m7l26l92K54L08m09J09J83o6L10k81n6j9K17
5434I2j34R8j37o3K74r2k2j77J65N6o3k46M49k70L0j7Q3n4q5JK55K8l01K74k9
5459A15J90l07N1K27j29j25n4j4l9J10m0J35j03k2Q5J81m10L46j85n0J96j79k82
5482c03K63j02R5j54M03m31Q6Q1r8j35J17K11j78l5M5M76k32j67O9K80m33K63
5504A21j93M54l99m0JK50l68j07M55J14k44j95l9K80N8o0O5k36J00m1K05o9k42
$$ y = [-152, 37, 89, 68, -54, -275, -15, -126, -12, 14, -67, 344, 75, 318, -19, 88, -177, 178, -92, -3, -64, 219, 167, -111, -118, 225, -168, 129, -102, 289, 3, 20, 123, -123, -30, -71, 242, 54, 100, -38, -31, -50, -68, -150, 96, 21, -363, -30, -25, 172, -198, -105, 128, 88, -178, 124, 21, -98, -145, 174, 43, -6, -64, 161, 160, 150, -87, 196, 123, 45, -108, 302, 80, 29, 98, -197, 246, 62, 307, 260, -66, -458, -204, 104, -305, -196, -13, -79, 231, -50, -106, -125, 92, -42, 56, -81, -144, 130, 38, 16, -161, 4, 60, -3, -249, 200, -70, -40, -57, 26, -28, -113, -112, 143, 171, -130, 144, 115, 305, -2, 49, 276, 147, 22, -32, -46, -85, 25, -15, 120, 17, -5, 80, 261, -149, 197, 12, -38, 158, -21, -303, -40, -142, -47, -201, 202, -229, -143, -62, -160, -295, -178, 33, -145, -180, -135, 341, 109, -58, 11, 291, -142, 121, -72, 382, -17, -57, -56, 194, -174, -281, 174, 288, 44, -151, -190, 90, 148, 88, 153, -83, 17, -24, 181, 112, -130]
5527a30L50J3j14k03J77K5r5J2j40J60J01k16J03o9J6Q8ql3n9N4j03j2O7jo4J61
5553H0O6k43Q0M68k86r6L2l0M1j32J36j11p0M0nJ8j16K8J68k21n7P6R9q3L53P1
5579C06j88l59M96j77j02j61j0K61N7q0P2k33j4K85k71L4Q5j03M70l06q2K15j19
5602G6j29O8k0k3J14l51J84J19k19k7J51l3o4k16O16L3p23N21n0J66j15j25J76
5625A29mj11OJ4m6j50O2J89k87K53R4Pl57L61L9k54m8oJ63J11j66J75k4p3K61
5650C38j71J67m09J1K46K28j66l40O8K89q1k49J66l47O1%L44o0n2j7k11j18J72
5673a31K13o7Q8p0n8J33R8k28L76j84L8m54L13L37l65p6J08l8j57L1J39K8N7k67
5697a36QK01J11m65K54q5jJ06J50k1k12k15M13n6n6m3J31r7K09k24K58j54j93
$$ y = [-130, 220, 233, 119, -84, 93, 118, 23, 35, -105, 55, 156, -60, 43, -26, -10, 78, 70, 37, -22, 32, -71, -83, -16, -17, -81, 80, 146, -97, -17, 451, 165, 69, 101, 71, 112, -20, 116, 5, -65, -25, -30, -12, -128, -100, 68, -153, -210, -134, -35, -118, 235, 306, 118, -241, 255, 78, -24, -185, -195, 66, 123, 43, 115, -118, -132, 153, -118, -84, 1, -102, 368, 62, -20, 195, 76, -53, 15, -5, -28, 86, -265, -81, 38, -181, -208, -57, -90, -154, -370, 246, 279, -444, 77, 27, 193, 78, -47, 129, 125, 14, 20, 34, -12, -162, -100, 89, -198, 55, 149, 156, -201, 160, 199, -55, -103, -109, 54, 165, -1, 174, 150, 77, 338, 167, 334, -75, -64, 182, 410, 244, -96, -28, 261, 180, -69, 97, -250, -189, -189, 155, 95, 43, 26, -185, -303, -131, 82, 15, 103, 33, -25, 108, 206, -22, 354, 170, 208, -246, 67, 404, 39, -37, 71, 33, -124, -93, 46, 74, 131, -136, -128, 73, 184, -281, -27, -112, -113, -7, 143, 122, -90, -305, 108, 52, -4, -47, 84, -13, 196, -28, 230, 76, -117]
5720a17M9k5L01j3j89r8k12L0M63k34j20j37O02n44J62J61O8J9r4K12j78Nk50
5743a39O8J70n1l03L26j46J11k1r0R8o2n7L34k07J2l58M52%l51R0L05l78k2J76
5767d3J00oL8J30ln0k8j50J60l9j29j30J88q9J5J6L04k47nJ0n7m9J07J7O5k56
5793a31p4J28J80l97J24Q8J61j28j7Q0J18J5J55l70jK07j59L15r3k95K70j06k90
5816b20J95k17K58k2J3J50m82L44Q9j25k41L23J19k8r9j87J84m0j9j04L93k87
5838cM6m3j7J65j56j00N3J37j13J09j14j87k20L89M4j92J48o4j75J10P6J61L9
5861I3J5j76J60l8k75P7K80n7j05J35Kj33J23o0J58j20j%q2k59J78J49k7J73k45
5886c5o6K85k99P6j39M16j00k5n5J38k07L0O0k15J5j5N37j94k93K87Jk6m45L91
$$ y = [-117, -68, -93, 208, 195, 6, -92, -304, -274, 189, -45, -165, -302, 300, -244, -82, 79, 147, 166, 72, 284, 106, 111, -139, -71, 99, 48, -255, 71, -75, 36, 15, -75, 23, -39, -96, 238, 31, 43, -315, 137, 137, -214, -124, 181, -197, -219, -43, 57, 51, 89, 219, 216, 166, 138, -12, 148, 109, -20, -150, 38, -51, -36, -20, 284, 37, 32, 42, -15, -64, 43, 60, 125, -131, -205, -77, 103, -294, -170, -82, 79, -49, -66, 14, 132, 147, 302, -68, -69, 138, -21, 294, 201, -94, 176, 70, -220, -25, -242, 16, -6, 7, 157, -325, 19, 108, -17, -258, 65, 184, 156, 57, -130, 54, 14, -5, -109, 284, -3, 43, 0, -17, 148, -8, -108, -55, 82, -31, 78, -36, -223, -443, -54, -10, -202, -54, -118, -293, -183, -107, 54, 93, 108, -68, 92, 54, -221, -144, 136, 79, -26, 109, 111, -22, 101, 41, 199, 79, 78, 78, -4, -263, -85, 64, 37, 210, -35, -101, 184, -115, -39, -178, 238, 138, 113, 58, 196, -11, 19, 79, -136, -121, -136, 401, 207, -86, 201, 202, 176, -269, 122]
5910A22P7l34M30l12n5J69k55K3J75l46K49kL0m3jJ29L7J4l8J23n1j28k64K79
5934B8R3j97K85q7l3j84J45N3q2j95L54k95K2J00M4p0K63k08j29K22l26K76m8
5957C1k1O8K57r3k15k40L25J64K9k70k60o6K64k06K74q0r1n7K81O6k13L7l79J75
5981b20N9J94J48k80R3L0M4k18J95J1p5J56j95K4j07L16j92n5J25l9N8r5n6l1
6005a10K34j41mO9q4k18L48k02J4K69j86O8Q6q5K00q4j45J42j33J41j46n5q0M9
6029e3L7K3J20l16L10j82J9K8M7l4Kj70M5p1J33J09j02M1k03J66J70k53k14J74
6053a74K81J71l19J94j84J33rJ07j26k2J03qk04K09j98k29K67q3k87L39Jl3l8
6076a09j81N56j48j67J45j3l83J55K52O4k30P8r1pK82N3j21j02l12K55lJ41j76
$$ y = [122, 199, -135, 295, -17, -72, 97, -158, -135, 40, -306, -57, -59, -29, -72, -73, 56, 93, 107, 69, 192, 141, 13, -251, 28, 121, -76, 209, 122, 89, -95, 50, 103, 21, -174, 180, -115, -93, 7, 51, -19, 244, 36, -93, 129, -197, 79, 31, 10, 78, 335, 242, 27, -213, 112, 276, 305, 35, -225, -291, -27, -233, 41, -39, -130, -187, 94, 160, -53, -16, -395, -220, -161, 33, 181, -99, -6, 24, 68, -150, 45, 56, -19, 137, -58, -34, -141, 175, -17, -72, 53, 14, 72, -23, -79, -110, 124, -17, -21, 48, -36, -254, 94, -108, -94, 175, -11, 57, 143, 58, 258, 174, 29, 171, 38, 179, 33, -22, -102, -53, -16, 7, 127, -189, 121, -61, -42, -14, 33, -1, 1, -169, -124, -195, -62, 47, -55, -14, -217, -51, 119, -134, -348, -174, 107, 278, -41, 153, -31, 102, 93, 200, 74, 52, 155, 147, -57, 152, -46, -275, -8, -91, -378, -39, -38, -71, -109, -290, 266, 118, -49, 96, 83, -300, -145, 107, 171, -59, 19, -72, -79, 203, 256, 135, 33, -279, -24, -27, 114, -62]
6099f2J84l00J1j62K91k2j39J07J92l1n1j98L59l85J21J38k9K7j28M9N7j78J43
6122fK31m07K04j10J68l13J51oJ47J17j48r8J92q4r8J08O9k07J52O5J23l53J94
6145I1J16J21l13R6J14k57J03N1l48M70k01k22K11j8j12P0L9q3k29L19q0L2p3
6168a03P5QJ05k20p3J80L8K53j04l16K02k40K62J66k32J64R7n1j3l47R4J14n4
6191EM6J16l53J52j14K60j33p7Q9oJ20j44j24L49k67J82j74L20kj2j2r4o0j0J32
6216A89Nk66L73k94O2o0k31K78k58J84l32J97k72%K15J65p0mo3K46m7J79K7j99
6240B4j09L8J11j39K73j09Q3r5J55l42K47j54L9n7j47K29k10j06K22n3j29K13
6262a6r0J62m1j55L40l03JK41J20l56Q3K44o3M3l52J86l76L12L49k73j08J88k63
$$ y = [-62, 122, -178, -167, -329, -38, -60, -199, -92, 100, 69, 18, -180, 179, -206, -85, 53, 24, 51, -77, -28, 29, -149, -6, 225, -182, 22, -88, 80, -233, -82, -88, 59, 176, 28, -70, 122, 38, -60, 48, 117, -90, 62, 127, 250, -103, 91, 207, 328, 15, 111, 225, -32, 71, 122, -226, 244, 43, -179, 32, 14, -98, -28, 11, -72, -301, 18, -62, -30, -103, -28, -20, 85, -135, -208, -28, 10, 263, 159, -157, 45, -195, 67, 233, 1, 165, 262, 211, 198, -149, -55, 59, 5, 51, 167, -186, -34, -148, 112, -21, -98, -9, -15, 105, -39, -163, 186, -81, 101, -73, 247, 245, 233, 221, 127, 67, 57, 189, 194, -72, 301, 7, 69, 9, -222, 56, -202, -18, -350, -153, -425, -425, -210, -45, -115, -119, -182, 64, 17, 196, 223, 24, -85, -47, 64, -75, 198, 89, 172, 77, 232, -110, 137, -17, 22, -35, -182, 47, -163, -269, -47, -100, -229, -16, -106, 56, 15, -140, 200, -103, -102, 139, 259, -97, -14, 230, 167, 210, -142, 44, -332, -20, 329, 56, -52, 136, -127]
6285a27J63P0l71QL91k82j11M14N9k21k7K41o4l97P1L91l34j2L32o5j34r4mL53
6309B50j70J67j51J9j99moJ36L9k31K7K21l2k28Q2P8Pl1K1R8k71J21j84M9L24
6334A32n1J44l73J15Nj00J35K2Nm0k4n9K03q2j63N8J0O9k10J23N4J53k42L38n39
6359c17L72k12M48j11J03m30J29J13k43l5K39R3m4p4Q5J13l08j14J15K90m48J03
6381a33M5L3L30l95R1P3j73K46qo0k69K28p3L69l53Q7R4k08K06k03K24k32J68
6404H7M0n4n7m8P0k0kj75K77o4l0o8N2j34QK21j96n5K48m2K5M7n1l0J56k40K03
6431A68k29n8J79j26j45L66j89j79L25k09j5R7L74o48J71J68m1l75K49Q6R4J3
6453G6l4j3K68l15m6N7J43k89K11J57k59J0J45j65K29m09J2K86J12l81J39Q2j57
$$ y = [-127, 36, 106, -265, -257, 134, -148, -259, 155, 214, -7, -34, 207, 143, -254, -183, 208, -126, -138, 194, 129, -5, -99, -103, 250, 80, 247, 96, 115, -84, -88, -94, 42, 81, -150, -123, 98, 66, -162, -80, -2, 5, -26, -5, 93, -178, -57, -241, -192, 132, 81, 225, -148, -33, -28, -128, 7, 29, 34, -6, -30, -89, 114, 32, -131, -73, -63, 6, -204, -81, -27, 126, -116, 222, -317, 55, -157, 291, 180, 283, -147, -18, 95, -148, -183, 56, 149, 105, 31, 116, 229, -79, -193, -78, 212, -236, -133, -88, -55, 275, -120, -29, 44, -129, 117, 109, 49, -220, 8, -65, 304, -49, 38, 132, -76, 130, -73, 151, -81, 87, 127, 73, 16, -32, 38, 18, 16, -159, 118, 54, 24, -44, 8, -126, -118, 103, -93, -148, 100, 58, 83, 130, 79, 49, 205, -35, 168, -61, -119, 60, -66, -211, 155, -34, -213, 112, -97, -112, -15, 359, -289, -118, 50, 9, -366, -117, -31, 63, 76, 42, 29, 297, -18, -64, -7, 136, -153, 58, 215, -44, -34, 111, -54, 175, -234, -222, 64, 176, -205, -66, 16, -141]
6476a41O4k19L62j35K53l40M3j56K89l0r3j44K2N59j26k74K3J4J21R5k84O8J05
6499G6p8Qj42L9r0J16Qq4R7j24j6K16l8M20k31l10J53M7Q9l92M22n80L69K13l30
6524a42M76m08k44K40rK10K0j95J36j97J52o8p2J14J29j66J98l85J79L36l11o7
6546g4Q8PN4j58p0K14l37M22k20J16J12k07J21O8j31J08r4Q1j51j21qM02l93j28
6570b99L62J14p7k5p9J66l33J20N13m43Qn5K62k27k0J00p5J17l5o0J38j21l71
6593c20J37Q6o2K40M9o3J07k23n4K34k86m0L31k32M9L30j90k04J88j50K45k43
6615g1k5J62L4M9k8m9J43j46j78J56j57q9L45j0l6j86o9K45j99jj30K57L08o37
6639c12K72L51n09J46J91N1p3j66L0OJ9j81P4R9j62R2K70j28l35M08k70K19r7
$$ y = [-141, -77, -296, 66, -69, 184, -156, -113, -269, 20, -10, -103, -247, -225, 334, 208, -66, -43, -29, 92, 187, -97, -29, 76, -2, 6, -136, -97, -187, -71, -63, -147, -50, -174, -190, 26, -12, 408, 177, -133, 20, 67, 156, -236, 186, -394, -25, 188, -142, 334, -74, -318, -78, -87, 123, 143, -52, 84, -113, 39, -29, -101, 13, 142, -24, 174, -211, -32, 304, -7, -74, 14, 21, 75, -83, -153, 61, -276, 146, -74, 42, 154, -53, 68, 136, 5, 113, 19, 100, -51, -172, -180, 222, -171, -299, 63, 177, 100, 75, -4, 162, -171, -51, 462, 19, 27, -28, 234, 7, -13, 87, 12, 129, 94, 34, 172, 51, -320, -183, -97, -159, 81, 130, 67, 174, -49, -103, 131, -155, -195, 136, -96, -47, 283, 93, -111, 77, -73, 172, -71, -96, 66, 100, 149, 121, 72, 215, 69, -109, 47, -110, -199, 146, 136, 100, -86, -155, 90, -109, -110, -240, 17, 325, -312, -40, 311, -198, -52, 139, 190, 117, -49, -19, -13, 6, -175, -101, -2, -164, -72, 198, 70, -265, 143, -127, 92, -5]
6662ej29L18N1l97K00K5k97k7J95J01k38L01j3l22K05j13K80O1k17k70N97k04
6684A02k0k55M6o2J07K40k89J59j03l8K71k1J31m16M8k60M33l0m7J32j52L09K4
6707C09o03K06j8K90j57l85M20J79m63K80J0m2k96L93j50j09J74j15q6K63k14
6728a14J60j58J4j46J97L7r8J43K28l19l6K1J64L7n04N44r5j10p7J62k41J6j47
6751c22K41L13n20K08J38j06J76k75K66j20L3k5K21J49o57J99J60o5o3K65j59
6772E7J20j23j4J57j23j4l52J97K03j03k64N40n03N2P6K8J21k36O1J69r6on6K6
6796h3K65q2K47j47l18m0K18p0n9m6K05Q4p6j13J24l38N2J11J1l4J31K87k88k14
6820a73J26J0j01J91J02K90l03j61N2k17L32RQ7j59k08k9R4r0J07r1k3L81m22
$$ y = [-5, -134, 184, 235, -162, 38, 63, -234, -261, -66, 35, -203, 98, 85, -237, -32, -145, 135, 196, -21, -291, 306, 102, 82, -173, -127, -189, -82, 158, -131, 28, -75, -113, 158, 137, 268, -148, -100, -360, 73, 43, -4, 128, -24, 285, 309, -294, -88, -106, 184, 27, -358, 62, 241, -222, 58, 68, 26, -270, 123, -27, -136, 38, -77, -163, 100, -114, 46, -112, -98, -244, -47, -10, -108, 35, 263, -56, -92, -71, 93, 130, -374, 170, 75, -35, -112, 50, -191, -175, -322, -81, 232, -288, -80, 58, -48, 128, -147, 119, -1, 32, 7, 228, 377, -280, -81, 79, 14, -49, 216, 57, 177, 54, 40, 197, 74, 60, -292, -95, 108, 5, -259, 281, -222, -170, -94, -66, 55, -181, -120, 49, -47, -53, -109, -83, 182, 100, 347, 200, -118, -158, 60, -10, -69, -115, 90, 174, 98, -15, 109, -229, -177, -66, -55, -89, 42, 329, 41, -173, -47, -37, -138, 53, 155, 445, 142, -19, 33, -184, 148, 157, 244, 85, -123, -152, -58, -148, -41, -132, -155, 226, -196]
6843a96K62Q1K9N7l26n6O1J58k9J79n4Kj59J17l19K45O1o6M6j98K18O2j71j62
6867a58K28k92j25K36N7n7n1m1K00M6l14K16O7k99J99k7K46j02k8K07o4k18J25
6890E1m0J17J22p02O25l32j65K56J65j69J20j29J99k50J09n5P8J24k82K74jk22
6912a07r5J94j21J78m4l0Q3Kk59K39KK6jJ73j01j41N4%N1k78pJ99Q3j00n0R4l7
6939Gj72j33M92o4p4j94Q1j03RL20l98M6NK44p0j96J76J59J69m72J74Qk80J95
6963g1J2L34l80L4j85K31l39J79M0L94k08p9J87j60RQ4q5J14N5j11J11j05j0r2
6987d1J89K9l56J47O3%l43K28L21n37K32K59j06n7k84K87j9j11KM2J30l97J29
7010a93O60k65k23k93L64O6k78l1J13k87K02rM73k50k60L17J09K8l93L02o7o0
$$ y = [-196, 66, 147, 176, 233, -93, -149, -88, 70, 41, 220, 166, 168, 9, 126, -193, 52, 113, 47, 93, -105, 113, 175, 4, -158, 70, -222, -347, -111, -54, -111, -162, -203, -3, 43, -271, -55, 12, -287, -88, -115, 131, 29, 1, 208, 144, -74, 51, 11, 128, 250, -452, 173, -159, -324, -68, 97, -72, 48, -81, 118, -132, -23, -78, 0, 124, -158, 116, 115, -107, -202, -8, -129, 49, 5, -25, 58, 60, -199, 40, 42, 68, 67, 240, 139, -2, 52, 52, 103, -175, -182, 17, 100, 0, -50, 44, 7, -165, -298, 194, 130, 56, -138, -57, -160, -151, 169, -229, -183, -178, 66, -4, -200, -24, 135, 304, -168, 6, 14, -266, -71, -59, 275, -105, -71, -256, -25, -364, -185, -145, 249, 41, -38, 149, -11, -2, 82, -3, 111, 166, 55, 166, 61, 51, -41, 148, 177, -179, -32, 31, 31, -312, -84, 237, -300, -68, 191, 85, 28, -256, 31, 12, -99, -97, -55, 75, -322, -193, 467, 202, -21, -314, 50, 116, -162, -193, -80, -367, -165, -174, 299, 49, -211, 106, 215, 243, -150, 152, 85, 25]
7032B5j23K21O8m45J50j29J83j43J65K01j57o3j08K26j2l9j11L59j48k54O0q7
7054a61j6J24K30J13n23L09K4m6l10K75q3K75l47K85j04j4M9R1j94j36M7J20J94
7077B02k82j0J18J71k41m0j5J70J2N7k16L51n36M8K98J48m08L4K18j88n5J96r0
7100e8M37m66j20L99j85K19j35j62J71L8k77K30j43J03m69N76j76J44k73J32p5
7121i0L9L48l66Q5K6j14j9K3O9J12K2l63L09k35R9K54k76K59m78J75Q1L4n6j00
7145a62M95k07n6j77M66n57L70k52K84k31Lk43K67o9j36J56K31j47JO1J24j65
7167E6k31L00n4pn0L69l4n42L26K17l32J3J49m44K05j75L42L8N7m02O0J03r5K26
7191I5J83j54l72J05K46K25m70J04K72l05J76j41P6p6l6j16L82k6n71L25K11k62
$$ y = [25, -98, 123, 191, -254, -104, -233, -50, -193, -28, 173, 16, -47, -155, 71, 59, 20, -91, 268, 120, -134, -74, -161, -177, -53, 177, 290, -233, 76, 100, 54, -256, 19, -64, 211, -136, 149, 45, 31, 80, 171, -23, -159, -112, 8, 202, -80, -90, 28, 199, -42, -82, -97, 73, 85, 142, -74, 277, -259, -211, 87, 235, -173, -139, 79, -109, -164, 32, -58, 379, -87, -207, 192, 7, 226, 91, -71, 100, 138, -139, 91, -52, 51, -418, 158, -18, 126, -147, -15, -90, -51, 297, -69, 16, 42, -72, -91, -68, 1, 113, 135, -228, 81, -154, -55, 199, -77, 182, -296, -121, -40, -6, -62, -162, 333, 126, 70, -107, 359, -198, 172, -80, 204, -27, -24, -267, 0, -69, -205, -49, 182, 35, 36, 97, 221, 56, -175, 125, 71, 64, 14, 383, 349, -193, 133, 350, 18, 31, 180, -264, -59, -234, 108, 146, 203, -199, -139, -36, -131, 95, 278, 124, -248, -143, 103, 328, -142, -38, 234, -71, 105, -36, 40, -36, -72, -188, 194, 168, -403, -78, 133, -129]
7213a29R8L67j93j64j55K26Q0k54J21q9o1R6J37q3J34k12n2R1k01P8J79K01l54
7236a39nK25O1l14K59K81l02L1L5j99J55M7M1L9j32o3o8L5k48J2K74j1l19K13
7260i2J46K58k00l58J47J80Jj45j68N57m04M6j45J62Lq5K28j24O1oo4J18j95j05
7284a84N87l01j38N9K48l36j87K07J47q5j26K33Q7j28l64J33L06m8p2K7j64M4
7306e5J13k7l7j90L8M00l99N6k26M51j61j49K94n7n7j76J89R8k30L0J17Q2k63
7329a59j43L03O5j17j4K59j69j57K17k25M36k76R6K00l00r9o2J75J48k85K22j12
7351Cl7k74L69j66J87k93L81Ok73k3L74j74J0k93L84j2j93k14K44J47l40J48J98
7374A59J12m57K7J07L2l45N44j27Lk15K67n4k04O6M48k33j97O5K8j43j01J36j53
$$ y = [-129, -31, 336, 143, -21, -176, 50, 130, -124, -3, -92, -153, -57, 80, -3, 131, -81, -133, -42, -243, -165, 14, 215, -139, -144, 81, 142, -172, 87, 368, 66, 97, 132, -67, 88, 135, 176, 215, 83, 20, -48, -13, -261, -249, 25, 14, -305, -92, 54, 312, 112, -246, -99, 81, 82, -63, -231, 326, -78, -32, -177, -15, -12, -97, 131, 7, 68, 62, -2, 116, -79, -184, 403, 102, -36, 23, 271, -65, -252, -45, 102, 17, -109, 124, 211, 83, -281, -148, 158, 110, 38, 65, -99, -55, 58, 31, -6, -196, -158, 242, -157, -101, -327, 124, -37, -186, 108, 51, -6, -182, 7, 105, -125, -95, 22, 104, -159, -302, 1, 66, -51, -65, 194, 25, -132, 85, -140, 296, 20, 116, 316, 16, -83, -145, 30, 178, -107, 115, 3, -34, -308, 61, -105, 82, -211, 170, 176, -97, -120, 254, 80, 90, -203, 181, 169, -24, -238, 6, 153, -187, -39, 159, 271, -186, -159, -52, -20, -365, 179, 52, 55, -160, 107, 53, -151, -85, 363, 130, -67, -2, 26, -117, -218, -82, -235]
7397b35K47l11K03K5K10q7OJ57k69O9J46J07l85q2M75k96K32j39J45j36K08m16
7419a26N9J42k22J46K11l1k37q1O90l58l45L07l3j77L4%J89j91J26l04L01l45
7441b45J83R6OO7k90L93q9K89l11J74m04Q4R6J4j20j25N8L49j66r3J4J1l22kL76
7466D3J12l14r1M43l05K80k09M17k76k10J24Q7N5m02K87N8j61O0j89K62k52j88
7488c69L14J10k62P9R3K29j51L9j05j58o6j0L28j44J3j26K18n2k98M03K51j72
7510A64j80K37j73j28J85MJ25j52k60J72N9J07rj97q6M5l13O31k07j42K53K5J9
7533A79k46K08L8j99Q4K18j76j81NJ85l5l02K91j18P6j02J63m8j57k01L37M0K19
7556B78o87K69L21k04k51K07J92l23J53O0Q2j24k07L54K0q3k1J13l5k35j80L93
$$ y = [-235, 12, -299, -96, -71, 139, 52, 58, 215, -54, 15, 161, 268, -117, -199, 276, -20, 212, 73, 218, 82, 290, -126, -67, 75, -147, -1, 210, 179, -58, -139, 551, 193, -152, 155, 122, -55, -21, -21, 168, -23, 103, -201, 100, -245, -62, 34, 40, 107, -183, 210, 121, 410, 99, 273, -131, -47, 49, 63, -57, -182, -124, 225, 59, -34, -20, -9, -331, -333, 43, 155, -159, -250, 193, -112, 168, -41, 376, 100, -110, 14, 101, 156, -246, 41, 99, -62, -2, -191, 71, -181, -369, -55, 55, -207, -128, -35, 194, 43, 82, -23, -181, -247, -257, 71, -73, -60, -186, 32, -20, -318, 85, 336, 164, -16, 221, 48, -80, 105, 109, 234, 82, -178, -6, 53, 160, 151, -46, -132, -87, -400, 231, 24, -118, 135, 160, 179, -67, 141, 179, -20, 64, 282, 106, -75, -70, 115, 80, -222, 69, -49, 27, -75, 88, 40, -117, -318, 19, 59, 278, -409, -140, 181, -23, -274, -67, 125, -198, -45, 15, 97, -27, -234, 120, 140, 57, 36, 149, 114, -121, -301, 92]
7578I2Qj34M0J48p9k27L06k91L47l06J0M15k86k56J16L71j70j78J69k96O1n5L45
7601A50O9l61L35J52m32J90o6J10k26k25L64r2M8q4L0J48j89k69M74k07J4k11
7623b78J63j07M5J08J74L4k13j60L42l92J78M1L6J1J89j32Q2r8j91J26M4j01l46
7646d45M18K44k55j14J35L00m47k7L2L91k00k36L94q8l24K77J02m54J23K16k5
7667A7J55P4j80O0r6k87L66p2J12M9m9R1m52K80J22r3k88L45k41J94m47L32J03
7690I5J87l78K45J34p2o3j89K01l7l2k48K95K6k61JL20m84j94M25K64m26O9R0
7713c2J72l72l0M55k49j64J52K68j99M0o3K01l08k30M24J15k72M5M2K9O2lj08
7736b5J65j90j77M40j85k77K97J7j01j63K02J04k16j0j47L50J5j27j28N21k14
$$ y = [92, 100, -34, 6, 154, 75, -152, 154, -137, 210, -96, -86, 329, 43, -213, -97, 274, 104, -74, 95, -201, -140, -195, 150, 219, -142, 193, 345, -87, 103, 37, 147, -79, -304, 60, -32, 16, -68, -38, 110, -79, -348, 126, -81, -67, -278, -115, -222, -177, -69, 105, 139, -74, -234, 108, -284, -106, -65, -29, -18, 171, 39, 121, 23, -168, -42, 2, -99, -445, -27, 217, -38, -152, -17, 283, -164, -191, -159, 232, 32, -204, 190, 102, -222, 55, 157, -297, -174, 42, 17, 172, 246, 66, 126, 30, -257, 109, 37, 149, 198, 149, 240, -212, 68, 190, 97, -191, 154, -87, 107, -340, -8, 95, 282, -96, 149, 283, 211, 148, -41, 160, 123, 91, -157, 138, 164, -97, -96, 224, -260, -454, -29, 235, -191, -122, -32, 140, -232, -262, 193, -56, -220, -68, 200, 1, 41, -22, 179, -129, -359, 65, 180, -92, -47, -5, 24, 86, 83, -25, 140, -50, -227, 213, 28, -249, 48, 65, -36, -199, 3, 107, -109, -119, -266, 84, 99, -28, -156, 365, 151]
7757A51j2l26L39k56K23or0M0k45J84j24N2J18J71j75j54N1m0K10l08m2K04P4
7780C9j25J64Kok74J87J65j42p1J00N7q3o9K7R2k0j53R2l6O0N6j5J28m93L05Q7
7806G4j81j67L44R2q6K0k45L50l36O4L26k45j64J1K34J07l28L55k67K02k93J77
7828D4o8L8l06L79O8j84k94M22J80n58n0N19k17m5L1J00Q2l31Q1K70J25n11J83
7851d2K82k47q0P9J60j07k0M1J14k87l9l8L38j46L4R1k88jN2K37j83m5N5K84j75
7876F9r6oo9K29q5j67L88j99l94M03N0j47p7l6K48j0j15j9M6p7J05M5J41k46q1
7901a00J27K95m69J6J8L3J5J44N55o54j99O19j36j15qj37L48l44m2j8L69o59M31
7924H9J23j07k24n1O6Q5k8j6N5K59l85J84j3k6r0J52j60p9O1K34m0rj73J37L80
$$ y = [151, 139, -187, 152, -104, 119, 113, 23, 63, -182, 2, -122, -70, 48, 219, 44, -110, -59, -99, 111, -197, -239, -35, 39, -86, 78, 80, 74, -200, -13, 152, 10, -61, 39, 96, 13, -56, -29, 63, 43, -110, -18, -54, 6, 62, 47, 175, -318, -13, 74, -107, -274, 70, 162, 76, 96, -149, 201, -135, -71, 255, 10, -154, -143, 91, 198, -130, 225, -42, 160, -133, 44, -24, 14, -292, 87, 155, -29, -323, 99, 279, -279, -329, 190, -27, -72, -41, 59, 141, -190, -109, 161, 286, -225, -42, 240, -7, -87, -8, 152, 45, 25, 66, 180, -107, -146, -184, 154, 8, 42, 133, -155, -156, -104, 133, -50, -95, -40, 244, 69, -27, -33, -102, 127, 42, -125, 263, 64, -330, 73, 123, -24, -101, -137, 111, 101, -14, -33, 13, -64, 41, 86, 227, -19, -100, 27, 322, -147, -131, -113, -80, -65, 79, 634, -20, -219, 400, 264, 149, 141, 4, 352, 8, -34, -52, 317, -342, 89, 212, 105, -119, -170, -104, -19, -47, -63, -8, 251, -134, 50, 37, 11, -79, 73, -87, -166, -105, 129, 89, 80, -93, 44, 424]
7949D24p07Q8j9M25m59K42J8K00m01rJ19o5K87k4J26q6j94k63L45m8k3R1j59L53
7973B61k35j82Q4j00J14K24k09J76q9o2p3J12m4n9j0K26j93J94j8l49lK56J34
7996A55j75r5L10P2o35M86k0j91J0J55J18k27O7k78L63n28L70L02j99l13J38r4
8018b09m3L26j33n6J00P8j95M38n05J83j03p8J88OQ1J08l32J38M4J82l77J08Q2
8041C1L24n04L00O4j13l38K29R6j86j03J02R0J56j22j50K78J89j72l38J08K87
8062B28l21J78l16K50k38J83J93k43Q3K76l73J3Q3P3R3m02J62K34j67J43jk8k53
8085a50L2K8P8O3j16K51l98J97j71Q1M30n36K86M6k22o8J53J99j06j16J03K6J78
8108B68k08j61l1M45o73L20J63k57L8nK81k15L0O0l26J36J84K68m40K33k25J60
$$ y = [424, -283, -195, -214, 211, -248, -6, 12, 212, -189, -198, -79, -144, 143, 119, 245, 159, -35, -298, 47, -1, -24, 67, -92, 261, 26, -156, -72, -172, -58, 166, -43, 133, 44, -18, -91, 21, -23, -82, -92, 134, -59, 135, 117, -232, -235, 21, 155, -20, -115, 195, 267, -368, 118, 98, -93, -83, 72, 190, -37, 30, -248, 115, -413, -43, 259, 60, -253, -115, -209, -252, 74, -59, -115, -15, 63, -132, 306, -199, -16, -119, -197, -9, -3, 78, 186, -146, -8, 36, 218, -159, -51, 31, 355, -149, 151, 215, 102, -236, -7, 89, -97, -200, -98, -8, 148, 26, -124, 154, 343, 171, -167, -59, 228, -93, 85, -231, 19, -219, -36, 157, -86, -3, 273, -100, -87, -4, 69, 162, -240, -78, 156, -11, 132, 131, 103, -150, -118, -90, -12, 51, -65, 186, -212, -15, -186, -105, 325, -211, 75, 121, -101, -169, -16, 183, 77, -39, 64, 90, 268, 60, -101, -132, 313, -360, -40, 123, -134, -96, -101, 180, -35, -5, 55, -271, -135, 49, 317, -123, 110, -115, 45]
8130D5K72m24J08J87j50o2K7K89o77K91K01o4k45N9O1j4q9j6M02j77J05m1j41
8153e3O0j21K3m7J00j35K14J26l42K0j91M66k9j29o1l1L43j78m6K71k25k00L31
8176A66m19%J34N63l77j39P4K78m65j9J80M5N0K6k82
$$ y = [45, 317, -107, 1, 188, 38, -24, 3, 292, -385, -94, 107, 43, -202, -143, -82, -96, -185, -201, 201, 24, 129, 88, -53, 7, -114, -91, -138, -38, -173, 41, 167, -175, -155, -346, 120, 91, -38, -99, -130, 213, 35, -11, 260, 35, -165, 166, -253, -253, -119, 444, 67, -72, 2, 280, -185, -204, -24, 21, 71, 97, -185]
8191a85
$$ Imaginary data points
##PAGE= N=2
##DATA TABLE= (X++(I..I)), XYDATA
0@%%%%%%%Qj6J6j6K0k8L2m0M8n6P2q2R2j10J29j49J72k00K30k62K97l37L84m32
31b28M84n43O09o80P59q44R36j041J154j279J416j566J736j923K130k368K637
48A389k941L295l712M211m817N573o553P877r775J2747j8108L0835j17923j07153
62b05055J93903J28758J7096n3000L7832O6328J6052o9242o5402k8096P437k4651
74B1960p5136r7867m0249K3482M1164J8133K3281L0976K5649L1704O9156O2655
86A34908j429l0476K6878M5526m9785j33679o7680M8048M0665o7653j04802k3312
98a82791N9892N5273K492j0742M2715R4766O4950k4415n4041J6651P1054J6202
110A52006o6354o4726j9245k2811m8277k5588J0806k203k1096J2671M7396J7454
$$ y = [0, 0, 0, 0, 0, 0, 0, 0, 8, -8, 8, -8, 12, -16, 16, -24, 24, -32, 40, -42, 50, -60, 69, -80, 92, -108, 122, -140, 157, -180, 204, -228, 256, -287, 322, -358, 401, -443, 493, -548, 606, -673, 743, -823, 913, -1010, 1120, -1248, 1389, -1552, 1743, -1969, 2242, -2575, 2998, -3555, 4322, -5453, 7294, -10814, 20021, -97902, -205055, -11152, 117606, 134702, 81702, 119534, 185862, 201914, 132672, 67270, 39174, 46611, 21960, -53176, -151043, -191292, -167810, -126646, -108513, -85232, -54256, -28607, 3097, 72253, 134908, 133479, 103003, 129881, 175407, 125622, -8057, -75737, -27689, 12976, -54677, -159479, -182791, -122899, -67626, -65134, -75876, -33161, 61605, 126555, 102140, 48099, 64750, 135804, 152006, 85652, 20926, 1681, -21130, -69407, -94995, -84189, -86392, -107488, -94817, -47421, -29967]
122b9967j8711J9755Q1565O5435j2503n3346j8286L2599L1215k7544p2486m0284
134d2558K8990K3965n7758q0318J7110R5483L6725n7194l7691N0563O4128N231
146D6676j8189J0780K2419j632j8833j9594j9220j3151L151M487j3814k3712j6695
159e7327l784J4805L3493K0449j7451j5078L7673N0845j3517n1714P938O5328
171G1660J5008o7203n5339J9296L7219j3482m3893j9871J3052J8459J819j5313
183c8588n503K7686M0009P627k1793k082K5834J0941j3599j157J0527j9118l6969
196a6185l605K3974j0010m2399m815M2668J9544l1148k3507K7562M4215J3009
208C9303j8100j6478P849K5050O882l2964l7065R236L2557j1668m9118j3453L8201
$$ y = [-29967, -48678, -28923, 52642, 118077, 105574, 52228, 33942, 66541, 97756, 70212, -2274, -42558, -13568, 10397, -47361, -127679, -110569, -15086, 21639, -35555, -73246, -22683, 41445, 46676, 28487, 39267, 61686, 60054, 41221, 21627, 2407, -10744, -7593, -3106, -16920, -40632, -57327, -61111, -46306, -12813, 7636, -9815, -24893, 12780, 63625, 50108, -1606, 6332, 71660, 86668, 19465, -35874, -16578, 20641, 7159, -36734, -56605, -43553, -25094, -23275, -38588, -44091, -16405, 23604, 31231, 9438, 7356, 33190, 44131, 30532, 29375, 39902, 20784, -16185, -19790, 4184, -5826, -48225, -53040, -10372, 9172, -21976, -45483, -17921, 26294, 39303, 21203, 4725, 12574, 37624, 44506, 11542, -25523, -16287, 16270, 4602, -44516, -57969, -19768]
221a9768K1796k0703j0677K6478K1800m459J735J8850M921j5937n727Q701o090
234B0920k4510j6189l43J594k516n819j1337l099K3551K8022n302k0284J7667
247B355M3170M823l7760j4289K7743J1361l0274k6961N116P977j0497j0264J836
260b5664K948M385J4054J2133N95K800J3014N599q841k243N897j0295k2136k942
274a0696J2243j3733l2466q82L0740Q140k2850l364L2354K4661n484p166J0712
287B2209J2115J686m556j1147j4205l009M853j1360k7003p971J7021N179j5581
300c1769j68K4268J3051q588L533K1842P058j3402n45J4767k784k3091j1155N311
314a672l025j3651o092K690K26L617J0645K830m700R783K3025N334j6152o56J9114
$$ y = [-19768, 2028, -18675, -29352, -2874, 18926, 14467, 16202, 35052, 39973, 24036, 18309, 27010, 20920, -3590, -19779, -20122, -18528, -21044, -26863, -38200, -41299, -17748, 10274, 4972, -15312, 2355, 45525, 50348, 12588, -1701, 26042, 37403, 7129, -19832, -14716, -6739, -17236, -27500, -25664, -22716, -18331, -4277, 7856, 8451, 11251, 24265, 29864, 21023, 18780, 24677, 14382, -7754, -10696, 1547, -12186, -44652, -45534, -14794, -6654, -29504, -32868, -514, 24147, 18663, 11497, 22209, 34324, 36010, 31454, 20307, 6102, 3093, 7946, -3414, -30417, -38388, -21367, -16188, -31769, -31937, -7669, 5382, -3206, 327, 22169, 29227, 15825, 15280, 30047, 27263, 4172, -6983, -1672, -4697, -18348, -24440, -21750, -21524, -17907, -7262, -4432, -9132, 651, 23676, 29010, 12858, 12202, 31316]
329C1316J485k4507j3378Q566k067k0222q349Q084O5j0421K674J4087M319j285
343i633J0758J5017K527m41P684K456j0036l982N796o721k1313n772J1109l650
357f201k1883m462J8685P382j1631N02J8406J0779l798K164Q332j365n920K745
371A3735J853j1399r856M358p14j5426p188J0763O575q087J257J6388O643p902
385A000K768J7005L890j2241p21R385n030j7317n032M745o479j2665j69N445m999
400b0415k723J1739R827l860J709J5288P998p529n20J3414J544j5110o913N885
414A0334n322j6561l499R299k254j2791Q17J1113N72l848Q668J2565J83k767P605
429A4114L717q865m936P130k61j5521p143P546k53j4074k503J2790M542p504K987
$$ y = [31316, 32801, 8294, -5084, 3482, 1415, -18807, -27156, -19072, -19007, -29428, -26754, -12667, -8348, -9633, 1125, 16142, 18669, 18228, 25912, 28368, 18332, 14350, 20146, 13425, -7888, -13660, -2551, -6201, -28084, -32546, -13861, -6479, -18110, -17608, 798, 11577, 7779, 9943, 18275, 16910, 10990, 13735, 15588, 4189, -5667, -1309, -2023, -17449, -24637, -13874, -7299, -15386, -14129, 2259, 8902, 1000, 3768, 20773, 24663, 12422, 11701, 21086, 16056, -1261, -6293, -1548, -8027, -20692, -20861, -15416, -20415, -23138, -11399, -1572, -5432, -3723, 11565, 19563, 12034, 11514, 24928, 26472, 11362, 4449, 10334, 5012, -11549, -15048, -5749, -8003, -20794, -19977, -8864, -8292, -12140, -3472, 9093, 9276, 6509, 14114, 17831, 8966, 4030, 11160, 10899, -4622, -11765, -4219, -4472, -18546, -21049, -8259, -3717, -11221, -8234]
444h234J4535M719m404N112J0578l444r371J909L777r381j1149J537Q20j2955
458a5951r126O932M795o639R93J4886P222n669K598J5321M707p309J219R958l580
473B0357j4124l567M100p794j3022K03N075n726o406P548Q618l207K79J2352P247
488A1933n116N8J1629J280j2274m722O702m225j5442l668P864j771j0810R00R502
503h160J134k857P939J1299N88j605Q090N198p526n531N595o57j3995p411N003
518b896k435j3671m428R669K115q150K891J3885N640l283N404J1459N03n620L277
533A4360N343n815q315J729q12j1862p792M220J110q938j164J0982L530p123K358
548h189J4017M007o871K092J1682k96j1328j766N605m097j0182k277K771m772
$$ y = [-8234, 6301, 11020, 6616, 11728, 22306, 18862, 9491, 11400, 15177, 5796, -5353, -3816, -2996, -15951, -25077, -18145, -13350, -19989, -18996, -4110, 3112, -2557, 41, 15362, 20069, 12760, 13979, 23937, 20357, 6233, 2666, 6766, -1028, -14050, -13847, -8772, -14498, -20904, -13356, -4738, -7945, -7666, 4686, 11933, 6817, 6875, 18504, 19784, 7510, 2788, 9490, 5265, -10177, -13845, -5981, -7752, -18562, -17662, -8160, -7026, -9883, -1944, 9355, 9943, 8338, 16428, 21626, 14100, 8569, 14164, 13507, -488, -7899, -2896, -5331, -19002, -23430, -13761, -11646, -19796, -16905, -3020, 2620, -663, 4741, 16200, 16703, 11083, 14360, 19703, 13888, 5573, 7302, 6490, -5372, -13164, -8944, -7834, -16772, -17936, -6954, -3424, -10547, -8189, 5828, 9835, 2964, 5056, 16738, 16442, 5114, 3348, 8953, 4856, -5326, -7603, -4832, -9604]
562i604n134M922L582m335J288J0720M747n601K522J3847L553j1224k849Q688
576A5122j526j4216n534O562k130j2159l783N353j090m266M287Q410J617J274
590b079Q217N613l543O59R302P48j0826l266P043k467j5425n342Q269n07j2181
605a5785k477J0943L857n082J837R815K807l232L067N114k296l281L064j001r159
620a809m487M915j221r776k59J0887J912r708J357J3838L753q808O99J2130K635
635A6058j0412m269N499o94q189l102P61k879k332L296P42n477J658J0115J975
650B750q003K121J3138K553j1792k348J1224J355j2003m026R158J903q704l076
664e750N964J291m294L78L413q74q56L370q1o730j28O908j291j0423J88J1500
$$ y = [-9604, -14738, -9816, -6234, -10569, -9281, 1439, 6186, 585, 3107, 16954, 20507, 9283, 6434, 15122, 13596, -620, -6154, 408, -1722, -13881, -17664, -12311, -13401, -17667, -13380, -4970, -3353, -2079, 6138, 11751, 8208, 8867, 18169, 18917, 8091, 4825, 11868, 9401, -6024, -11366, -3097, -3604, -15785, -18262, -7319, -3462, -8544, -6707, 3108, 5915, 2683, 5750, 10864, 8568, 5287, 8351, 7350, -1809, -6296, -1381, -2602, -12378, -12637, -1750, 162, -9546, -8189, 5649, 9402, 594, 1293, 13423, 16058, 5646, 1377, 6876, 6182, -2007, -5109, -4348, -7227, -9559, -6263, -5521, -10998, -9340, 775, 2750, -5253, -3132, 10006, 12559, 767, -1581, 9643, 10998, -1005, -5031, 4127, 6030, -2674, -5750, 214, 1505, -2789, -2411, 1002, 128, -728, 2642, 2561, -4169, -4297, 2611, 1320, -9103, -8915, 2585]
680B585J401j1614p83J2617M047j0335j825J0744M606p591l432M689O31n796j819
695a875J414j847j370K630n35n577M20Q428O91p718J334J1854O87j1958j563J1353
711F368J704j2176m166R680L056q755l946O158L861l074j83K555L62J696M554
726G694o2n950K13O846k022j1215j513J0628k62j2830m253J0355K755j0327k459
741a2402J0739N490o070k202O678L153k259M71K641j12o14K438j769o383m46O002
757E355k095j0749j049R483M13j1966j799J1539L968r463k664J0654N780n221
771B186k326O053K376m489j933P12j562j265J407k140o777j54O264k76p757K374
787g307J2393K962r189m93J2280L539r818m046Q126J877r684o976J816K10n218
$$ y = [2585, 3986, -7628, -8411, 4206, 8253, -2082, -3907, 6837, 11443, 3852, 420, 5109, 5740, -56, -1875, -461, -2308, -3678, -1048, -1583, -7160, -6740, 1688, 2379, -5339, -4005, 7849, 8536, -3422, -4985, 6368, 8072, -4104, -8270, 1410, 4466, -4289, -8235, -2077, 1784, -1290, -1473, 1082, 1444, 3140, 7694, 7632, 1682, 1895, 8741, 6719, -4496, -6009, 4619, 4357, -8473, -12726, -2371, 384, -9943, -12402, -1663, 3827, -2243, -4445, 2233, 5386, 3127, 3598, 6239, 6127, 5513, 7951, 6182, -201, -647, 5355, 3260, -7489, -8538, 945, 1358, -10608, -12407, -868, 3100, -6363, -9027, 1627, 7407, 2186, -140, 5913, 8289, 3800, 1867, 2579, 1017, -248, 1159, -981, -7758, -7912, -1648, -1924, -9681, -7307, 5086, 8048, -1141, -1634, 10646, 14185, 4367, 321, 8447, 10324, 640, -6336, -4520, -4310, -9528]
802i528k359O69k34J298N425L046j915M248J0573K211o949J123J0607K1j2088
817F148n499O143j111j3748o867O095K057o443k568O167M499j82K805N955K186
832E637K429N032M07n819j871M180k853j1464l406O028j213j0977k633J0745L943
847a835o115k09J1542O697l499o24O012K263m639l086j151l692m056n97l219p199
863a3407j885N951P44n940K214J2491N308n256Q90J1457M491p604l065O379J182
878A3950q785n806J201j825o276k925Q12j232j81M742K690k453J938Q701L309
893G860n552Q1R324J774r680m444N839K59r546m454M810J645n455j455N089K491
909a414j856K632M771K20j45L992J597m514k175L636j226q978l347N332J00r048
$$ y = [-9528, -11887, -11218, -11452, -10154, -4729, -1683, -3598, 650, 11223, 13434, 6485, 7608, 18215, 18236, 6148, 649, 6792, 5681, -8067, -14934, -8839, -6782, -13225, -15793, -9626, -5127, -5309, -2504, 3451, 5637, 8066, 13098, 13505, 7686, 5815, 9995, 7142, -4322, -7728, -1700, -2913, -13890, -16523, -5778, -1835, -7950, -8159, 3383, 10080, 6581, 5957, 11969, 14232, 9593, 6507, 5356, 1664, -2392, -2989, -6208, -13407, -15292, -9341, -8597, -14537, -12323, 168, 5476, 220, 1110, 12567, 17058, 9454, 6389, 12768, 13950, 5165, -641, 560, -1265, -7541, -10466, -9654, -10886, -11067, -6325, -3635, -6088, -4150, 4551, 7860, 2308, 2389, 11713, 13487, 3807, -637, 5202, 5461, -4085, -8539, -3729, -2084, -7539, -8994, -3905, -1414, -3270, -638, 4133, 4353, 4208, 8200, 9797, 5283, 3108, 6744, 5518, -3460, -6807, -1475, -1375, -10423]
925a0423k713P648K697n863o92Q719N114k588K23N894K015k900j76J576k748k956
941B827R00r88o619l452L548K43o237r77P319L040n154k66Q664L480m887j451
957a0O604K249n539k377K314n59m884q48R95k694j848L991K348l109p51O735K898
974E515m594o19O873K947o777l110M365m7p616l357L868J14n243j059M150N83
990d007k619K438N033J60r0M404L557l333j794M523Q73p033l714M567L18p844
1006d561l180M720J486o110j257O102K561k635Q61N033J031k919J493L170k733
1021C062k784K316J029m791l422K875J888n359j401O012L165m477j072O922K641
1036F604m499j357M759R72m840j359K310j574n306L07J506l013k938L742L245
$$ y = [-10423, -13136, -5488, -2791, -8654, -9346, -627, 4487, 1899, 2122, 8016, 10031, 7131, 6955, 8531, 5783, 2827, 3727, 2739, -3880, -7332, -3784, -3541, -9778, -10755, -3436, -396, -5550, -5816, 2848, 6328, 1441, -10, 6594, 8843, 3304, 927, 3241, 2682, -2202, -3050, -2055, -4749, -6597, -2606, -258, -3367, -4118, 2617, 5515, 921, 302, 7175, 10122, 3345, 235, 4600, 4553, -3063, -6420, -2552, -2438, -7681, -8740, -4590, -4007, -6626, -4188, 845, 1005, 915, 5319, 8876, 5543, 3749, 8272, 9145, 2112, -1602, 2965, 3283, -4561, -7741, -3021, -1535, -7645, -8902, -2800, -239, -2874, -2013, 3020, 4051, 1132, 2625, 5795, 3062, 278, 2594, 3623, -1168, -4590, -1715, 173, -5186, -6587, -575, 2590, -1887, -2959, 3963, 6604, 2105, 748, 5507, 6479, 1639, 280, 2590, 1016, -4290, -3983, -2477, -5490, -8428, -4686, -1441]
1051a441k558j381N224M191l636p18O075K987m496k284M252J58o307k311L465
1066A220m05n021r48L270n57l512J943L964j085j804L794L512l134j959L614K128
1082E020m938k663L831J440m927k220M119J551m383j046N124J744l236N18M607
1097D541q0l420K20L021k188l272J586J754m596k968K796J848m520k239N189L383
1113A055l240j125M836K929l761p00M408O48l447r6K846j341m415O65K701k161
1129a98l527J896L287k955k434L247K579l922j631M533K165m006k286M410J577
1144B735m797j123M134R96l446K93L503l69l018J272L527k060k786K330L325l518
1160I98k962K513J716l413k658M066J114m147j223M230J475m746n73M037J232
$$ y = [-1441, -3999, -5380, -156, 4035, 399, -319, 5756, 8743, 4247, 1963, 6215, 6373, 66, -2245, 1220, 815, -4206, -5154, -1884, -2441, -5953, -4010, -46, -1131, -2935, 859, 4371, 1237, -722, 2892, 5020, 82, -2581, 1250, 2690, -2237, -4457, -338, 1213, -3170, -4216, 908, 2652, -584, -66, 4541, 4461, 1041, 1261, 4282, 2094, -1178, 408, 2162, -2434, -5402, -2606, -758, -5278, -7517, -2328, 1055, -2185, -3310, 1526, 4455, 694, -6, 4402, 5050, 1603, 1507, 4353, 3012, -1403, -738, 1963, -198, -3725, -1829, 1458, -1497, -3931, -684, 1895, -2027, -3658, 875, 3040, -966, -3252, 1158, 2735, -2062, -3185, 949, 1945, -1501, -1208, 2295, 1926, -1092, 180, 3707, 1647, -1139, 1191, 4516, 998, -1964, 549, 2265, -1148, -3806, 260, 1374, -2773, -3996, 234, 1709, -3037, -3610, 427, 1659]
1175A659l219o74L769L1k780M77K643j169k187L080K742l397k481L379K863l917
1191H19l054L604J904l839k299K961N97m176r83L644l1l453O62M133N43l040R46
1208a062L419k9k253K402K141k616k028K678J042m589k701M263J925m474j970
1223c852L637J897l284j495L706J426l254K83L366p81l737P14L148j752l452J270
1239b160K717j671j792K881J767k680o89M676J615l783j311M922J610n160k502
1254a560K958J219l882j763J824l77k620M17K302j739j456L092L786j869j766
1269a434L270K761k496j987K747J587l876k003L144O04m643j370L917R18l477
1284b338o98L686J411k087l75K162n96j944J649J395k863k600K963J118m211k263
$$ y = [1659, -1560, -2234, 1535, 1566, -1214, -737, 1906, 737, -1450, 1630, 4372, 975, -1506, 1873, 4736, 819, -2235, 1369, 3273, -566, -2865, 96, 693, -3483, -4466, -822, -853, -4306, -3644, 489, 1032, -2008, -1062, 2357, 2328, 75, 2477, 4618, 2002, -26, 2652, 3694, -895, -3596, 667, 2592, -1882, -3852, -215, 1682, -1602, -3097, 609, 2035, -1219, -936, 2430, 1649, -2088, -1374, 1774, 22, -3430, -2160, 557, -1114, -2906, -25, 1742, -938, -1627, 3049, 4664, 881, -430, 4492, 6102, 942, -1560, 1398, 2617, -1265, -3028, -1204, -1581, -4201, -3784, -1482, -3221, -4677, -1585, 2201, 332, -1434, 1836, 4597, 2101, 114, 2861, 4448, 572, -1431, 1713, 2317, -2326, -3696, 221, 1139, -2338, -3036, 650, 2061, -26, -401, 1761, 1165, -779, 870, 2265, -598, -3198, -235, 883, -3328, -5591]
1300e591L557L023k968j212M107K228k329l90L681J179l472j22L119q34m429r54
1316a407J582j292k748L54J107j271o66L172J852k966o27N101K432l537k048M184
1332C222J999m094k947K326Q49k778j260K375K10j874P04K854o34j687K342K606
1348D213j901j943K021O40l553k312K324O68m638j647L994J692l503j149M701
1363c93K703j962k39L698J277j732j88J234j856k118R15N15l448k341K110J404
1379d21l288j794L681K324j743j137M191J969l013j537L642P96l526j694K300
1394G50L9k974q38J471j41q40J882J709j113o3L250J712k866j731L475J577m401
1411H98l209K814J017m459k470K234J328k678k07L392O57q18R41L217lj377J671
$$ y = [-5591, -2034, 989, -1979, -3191, 916, 3144, 815, 425, 4106, 5285, 1813, 1691, 4810, 3976, -453, -1407, 175, -1117, -3865, -3511, -2404, -3675, -4341, -1169, 683, -2283, -2910, 2191, 4623, 1086, -962, 3222, 5221, 1127, -1820, 506, 1355, -1423, -2683, -308, -98, -1972, -1268, 1586, 952, -735, 1607, 4213, 2312, 369, 2390, 3030, -523, -2835, -511, 157, -4481, -6128, -2134, -442, -3945, -5094, -393, 2310, 348, 109, 3807, 5084, 3352, 3164, 4398, 2542, 424, 1339, 1854, -1594, -3935, -1825, -421, -3709, -5503, -1822, 502, -1241, -2378, 1813, 3782, 769, -768, 2874, 3670, 144, -1550, 750, 789, -2185, -3023, -1552, -1693, -2533, -651, 1058, -55, -118, 3132, 4844, 1978, 247, 3722, 5299, 898, -2311, 503, 1520, -2939, -5409, -3175, -1847, -4525, -4732, -1340, -683, -1501, -560, 2657, 2654, 1277, 2948]
1428B948J729j533j869J502L20l608j894K104J028l724j982L946J981k775j494
1443c321L527K124j777p84K183N07j786n17J273j391k304N25J722k088j516K669
1459i54J523j876q87L410K223k420p39L675J434l386k190K655O43l421k362J470
1475a202M81k552n29J205j89p99J796J776p29p43L702J792k259j449K806J834
1491D941l173k436K318J360l608k552K301Q28k585n70K422J185j472J71K139Q4
1507A353j158J037J079j665j252J494N82l317j806K381J684l120j428L119K493
1522A476j862r15K741K328j724m36K263J56k300l12O33j612k317j44P85k044j383
1539d667J878J217j781o90L572K376j527j215L863J928k672j577J889P70k492
$$ y = [2948, 4677, 3144, 1275, 2777, 3097, -511, -2405, -301, 727, -2997, -4979, -1033, 948, -1827, -3321, 206, 2330, 553, -231, 1952, 2459, 673, 156, 1429, 38, -2266, -1741, -19, -2107, -3623, -954, 569, -1307, -2194, 1216, 3439, 1019, 280, 3955, 5389, 2003, -187, 2468, 3111, -310, -2672, -1202, -721, -3273, -3802, -2597, -2786, -3585, -1789, -13, -742, -1485, 2217, 4009, 1750, 301, 3107, 4941, 1768, -668, 1650, 3010, -598, -3150, -849, -21, -2606, -3176, -754, 431, -1041, -870, 1269, 1353, 195, 1232, 2311, 646, -606, 888, 1470, -1847, -3653, -1272, 412, -2708, -4136, -1017, 1476, -386, -1301, 1440, 3768, 2044, 1608, 3871, 4027, 1727, 1415, 2048, 436, -1881, -2025, -1240, -3284, -4667, -2789, -1572, -3353, -4043, -471, 1905, 378, -837, 3026, 4954, 2282, 705, 2594, 3364, 872]
1554H72j714Q89J44j864p26J487m57j377J562K612j147r76K493J675j973k070
1570e70K103J187l082j837J305J272l247j712K565J150j369k77L041J557j450
1585F36P97K183j63j565P33J395k098j984P67O23l300k189J719J486k383j350
1601d693L083J890j697m99K947J458j643k24K145R2k027l49R26j064j659j02J328
1618h8j210j116K037J577j683j133K801J931k235j240K364Q82k310j920J257N19
1634D33k281j103J223J93j202M16J848J70r29J567J884k21j182J771J404k050
1650A941j720J695P44k611k108J624P56k071j591J896J075j339n42K146R45j356
1666e16M24J849m32j523P96J162j201j561R95J031j572j616J923J524j894p99
$$ y = [872, -842, 47, 191, -1673, -2399, -912, -1369, -2746, -1184, 1428, 281, -695, 1798, 3473, 1500, -570, 1533, 2720, -362, -2199, -894, 378, -2869, -4581, -2016, -866, -2235, -2512, 529, 2086, 636, 1433, 3616, 3453, 1888, 2621, 4016, 1918, -66, 701, 1324, -1976, -4165, -2446, -960, -3343, -4693, -1610, 280, -1417, -1916, 1031, 2489, 846, 622, 2767, 2859, 832, 483, 1409, 345, -1314, -1416, -88, -1298, -2414, -377, 1200, -483, -1616, 1185, 3116, 881, -359, 2005, 2887, 577, -1343, -86, 433, -1848, -2951, -1728, -1535, -2737, -2321, -473, -303, -1232, 335, 2219, 1998, 816, 2587, 3991, 1941, 221, 1916, 2660, 49, -2059, -435, 321, -1750, -3341, -1445, -370, -1709, -2251, -105, 840, -516, -92, 1757, 1325, -198, 598, 1760, 559, -1002, -7, 1024, -548, -2164, -241, 1283, -611, -1410]
1682a410K124J709j841p55J796P70j979r15J557K1k026n54J179q05j211M32J294
1699f14q80j257K269J519r83j188K378J939j766j025J552J002j791j196J077M35
1715A471k150p03Q84J88j499j48J740k85j463R11J926p68j147J717J354j483j429
1732h84J379J114j737j254J350J061j681p57J561Q39j444k6K125k1j208M05J227
1749B049l58j432j43Q87j337j613P23Q98j514j101J127J437j091p91K129J835
1765A705j244k84J460Q52j023o13J159J67j900j93Q07r03j214k95J284j044q29
1782b108J030J664p41j609J582J738j458o44J335P11j233j273J226L91j420p18
1798a527J120L93q73QJ469K26r81R01J410o19j206P78J030j057j880Q81P58j820
$$ y = [-1410, 714, 2423, 582, -173, 1623, 2393, 414, -501, 1056, 1077, -949, -1503, -324, -1129, -2340, -1908, -614, -1494, -2751, -482, 1037, 54, -1134, 1244, 3183, 1417, 392, 1944, 2946, 1155, -41, 1036, 1471, -679, -1382, -498, -310, -1809, -1957, -217, -502, -1965, -1054, 872, 104, -1043, 674, 2028, 545, -884, 495, 1609, -128, -1382, -32, 1029, -652, -1409, 152, 991, -453, -479, 1646, 1625, 417, 822, 2049, 1691, 259, 116, 1003, -334, -1947, -1224, -326, -1840, -2941, -1814, -377, -1468, -2259, -130, 1705, 461, 177, 1637, 2489, 1466, 853, 2012, 2179, 279, 86, 893, -10, -1224, -1519, -235, -1279, -2108, -1078, 586, -155, -1764, -182, 1556, 98, -546, 789, 1500, 267, -1006, 220, 611, -809, -1527, -407, -14, -887, -879, 590, 816, -165, 736, 2146, 1527, 321, 1099, 2129, 1072, -808, 73, 831, -989]
1816i89j467J199R27j674o28J529J225j123o0J391J182j186L57J442l03j084J96
1833I34J043j083j493M85J152j396j420J027J138j084p82J290Q59q55p92J581
1849F04O90j404o75J300N78j500m77J090o16j022M52J440o53p55R32J505p46j045
1867c02J216J220q76j261J098Q12j675j220R67K3j398p01J115O8j002R4J565J
1885b56q82P16J751k67j000J145R43j009j150R96J37j046r23P05R01j178j101
1902a518J244N36q52m01J483M68j047k92J386k89j472M38O50m74j562O20J192
1919A10r02p53R80J032m85n03J185J477r03r50J065Q43j398n40N35L2j264n92
1937a031L40K0j169L71P91m93l16Q24J322p61n21R48J342o24j168R18Q59r69j079
$$ y = [-989, -2456, -1257, -330, -2004, -2632, -1103, 122, -1001, -1061, 330, 1512, 326, 683, 2125, 1822, 738, 934, 1977, 894, -599, -114, 1038, -358, -1778, -751, 387, -697, -1479, -189, 670, -185, -977, 604, 1294, -110, -785, 515, 1093, -407, -884, 206, -410, -1432, -980, 460, -193, -948, -16, 1489, 743, -302, 914, 2134, 1258, -3, 1095, 1907, 232, -988, -21, 2, -1396, -2097, -982, -914, -1916, -1822, -257, -256, -1138, -422, 1329, 1062, 62, 1207, 2150, 1141, -9, 987, 1124, 78, -845, -140, 761, -417, -1518, -274, 262, -590, -991, 492, 960, -87, -379, 1007, 718, -754, -316, 334, -140, -1702, -1082, 110, -792, -1545, -565, 467, -18, -521, 664, 2141, 1238, 288, 1353, 2196, 798, 258, 793, 825, -439, -1031, -691, -671, -1840, -1469, -678, -1171, -1487, -663, 659, -102, -623, 325, 1667, 1043, -125, 793, 1652, 683, -396]
1956c96N24P26j187n93Q26K93r09J8J055L92j017K38Q32k79q80K49J286j157j152
1975a131N88O81o91j321J030J256j024m34J192L63m37l16J039P89p92M9O55l22
1993A174r97j82R35q90p92o2Q36p97j336J258P02n04r03J000R01n41l08J030O87
2012A211n98o88O65N40r80o88J023Nj005j4R58m33r60L81R67j26r87N43J227n19
2032E22r64L36J218j016q02L62M02q00p20N06L94k67k92J427J59n12O23N39K56
2051A371q23M51N67k84r05l9O09q51j578M94P05q56p34O53N09J4o41J078O04k71
2071G3O6P74M01o59mL01l90p85K17Q72j034q63L32Q71n28o48R03J141l19q23N02
2092D00P94q03l48K34P8r80k13L12no14p0R56l55l62P58Q89K02q42P88J224r72
$$ y = [-396, 128, 854, -333, -926, -100, 193, -716, -698, 357, 749, -268, -30, 802, 523, -357, -108, 1178, 21, -1131, -543, 138, -553, -1874, -844, 412, -612, -1046, 146, 509, 72, -244, 795, 1584, 792, 841, 1496, 1174, 177, -5, 930, 40, -752, -814, 22, -775, -2111, -853, -151, -655, -1558, -558, 343, -198, -506, 524, 1211, 613, -75, 590, 1130, 150, -538, 485, 490, -515, -529, 429, -4, -964, -583, 384, 258, -729, -186, 1041, 522, -442, -106, 1112, 96, -706, -344, 58, -742, -1462, -956, -562, -829, -1121, 306, 465, -47, 576, 1115, 1371, 548, 999, 1566, 1282, 377, 338, 947, 96, -1482, -988, -283, -1139, -1873, -1220, -711, -697, -1338, -260, 344, 73, 139, 913, 1314, 655, 651, 952, 562, -223, -6, 866, -168, -1031, -699, 172, -356, -1004, -101, 1040, 721, -102, 400, 1194, 391, 43, 277, 355, -625, -838, -526, -531, -1145, -1215, -259, -614, -976, -218, 671, 873, 31, 819, 2043, 1071]
2113A071m69M63M00r26n63j60L49p54o30N06N48q74j18P33M38o28K65R39k51m45
2133a06L98M35k54q47M93O95n77j263Q64N55n33k98N41P73k48o03M72M87o86q3
2153B15L02l6r18p5L74l98p26J7Q93l3j047O82Q43R5q45Q53Q79l89l60M13N08
2174A247l57p63J32M4l22l86L09j07m15K51K55k03o38L57P86r8m90L12Q81n31
2194B64p61M22O84l55p53L19M23l53l02O34l7j58m30O07N44p73K40N93j41o42
2214B5N2N22p67o58L89M94p27p09M68O67l49k1L48Q35m34o1M06K32j88o2L14j22
2236F54j52k73J15n7o56j69Q31l13p00K25O72k49o97M92N38Ro48L56M91p6n45
2257a52K43K60q62o4O88J08p84O2O56K47n78j14J227m4o68J17Q56n49p47L8P04
$$ y = [1071, 602, 1065, 1465, 539, -24, -184, 165, -589, -1219, -713, -165, -1039, -1157, -424, 14, -614, -349, 590, 339, -106, 292, 727, 473, -374, 119, 814, 237, -1026, -162, 393, -140, -438, 103, 876, 628, 25, 497, 984, 298, 215, 517, 481, -437, -512, -138, -536, -1262, -1245, -352, -385, -1432, -750, 93, 188, -657, 196, 1075, 686, 326, 739, 1247, 890, 127, 259, 303, -19, -405, -96, -203, -618, -367, -112, -315, -953, -596, 190, 92, -398, -86, 795, 264, -497, -75, 609, 254, -499, -180, 243, -110, -412, 222, 185, 27, -403, 204, 748, -25, 215, 808, 667, 25, 77, 599, -168, -826, -437, 57, -670, -1379, -911, -244, -593, -614, -266, 569, 135, 74, 480, 712, 524, 462, 776, 654, 502, 229, 344, 287, -369, -538, 293, -20, -720, -495, 177, -72, -769, -277, 261, 270, -378, -22, 469, 393, -152, 91, 351, -511, -575, 113, 221, -563, -501, 155, 402, -176, -290, 937, 893, 225, 342, 1198, 649, -98, -60, 644]
2278F44n44p66J77K44o3o90L91m2k04L78M82R7l64M43N84N4l71J44L35l70m57
2299A02J07L05j79r44K99K89k14m51K25P11m04J1J51M79o37K28J39K96o22N5L28
2320B74j78j228N84K59K03k13J07O17J70m56J82O29l29l29J24O41p97k22o0p7
2340i9m33p0J95j84m55O4O14o8j27k9R01J93n69J56J027k27o99N1N56m05o26L58
2362A24K26n51j76K79J47k32j87N66Q6k38p2N02j69n93K9L55R0m84j52K74L28
2383A52p48J03N86l0m9J61K26j60R8K28K17l20q1J01l5n28l28L33L10r70j27P99
2405f2M0n79j54P89J63n04L49M19J8n40K19M25l22m58K22K92m10n2J2L17m22j65
2427d03P00N2o60K28M16j62q9k86M56nr18L65K92j73l15O4O69n5n45M7P32l07
$$ y = [644, 100, -666, -489, -245, -308, -998, -607, -649, -853, -475, 7, 104, -260, 183, 767, 821, 450, 594, 929, 559, 102, 209, 514, 335, -609, -310, -21, -235, -686, -461, 250, -154, -143, 8, 487, -150, 78, 217, 513, -109, -54, 274, 96, -1132, -548, -289, -86, -299, -192, 425, 595, 139, 321, 950, 621, 292, 416, 1057, 260, 38, -22, -99, -532, -602, -407, -591, -1046, -982, -368, -436, -563, -592, 309, 502, -67, 89, 1116, 889, 190, 241, 797, 392, -234, 124, 350, -201, -377, -98, 49, -183, -370, 196, 282, 44, -28, 474, 305, -288, -259, 96, 186, -298, -450, -176, 152, -596, -493, 93, 63, 14, 175, 401, 241, 339, 567, 784, 464, 383, 484, 449, -79, -407, -74, 236, -734, -861, -62, -22, -601, -755, 34, 197, -307, 42, 461, 479, -61, 158, 583, 261, -197, 25, 317, -93, -145, -133, 184, -238, -403, 297, 349, -311, -83, 333, 171, 82, -204, 252, 247, -671, -306, -14, -187, -502, -438, 231, 176, -369, -322, 410, 103]
2449A03L0J70K81j39k01J23K75n29j53kJ36n50nK95j63n40P9N87K4k17N0N43j17
2472H0j28J11K25k52k09L09k55q9j61N39J38n97M84j06L89l30l06N31Mk40k58
2493a21M13j46k35l46L25J11l32j44K15m42r9N24K83k4j34L04K98j21k37N06r9
2514D99k06J04k00K26n31l13N46k63j88k11M70O1l32n1L54q0j40M91n0j63j85
2535a62L86N7m93l9M67j82l98NM29L77m57k62N65m8j80J59L11r5l18k12K26L7
2557A73n15j74N06n59P5L50j20j32l08Q07j22K49k57N87q5j59j84N72j87l48J1
2578A80K55l66k88j51M79J37n90L34K79J38m88PL16l29j50O6L97k80l01L59L0
2599C4j40j12K39R4k35J99j21p9K51J09%J4l36J98J06J0k52o4J11m14j29M34J0
$$ y = [103, 133, 303, 584, 445, 244, 367, 642, 113, -40, -42, 94, -456, -461, -166, -329, -869, -790, -203, -179, -396, -346, 197, 80, -48, 63, 288, 36, -173, 136, -119, -208, -369, 170, 308, -289, 195, 89, 478, 148, -158, 373, 377, 137, -121, 292, 146, -89, -435, -110, 1, -331, -475, -260, -702, -801, -277, 6, -18, -152, 152, 450, 329, 92, 598, 499, 293, 397, 197, 423, -108, -421, 125, -138, -326, -537, -67, -6, -338, -389, -35, -115, -255, 236, 186, 23, -162, 224, 281, -212, -251, 216, 34, -364, -359, 70, 447, -10, -272, 293, 245, 65, 224, 535, 440, 122, -90, 136, 173, -342, -516, -10, -569, -494, -144, -264, -396, -704, 103, -19, 230, -27, 560, 475, 316, 132, 704, 517, 169, 180, 435, 69, -219, -370, 109, 246, -344, -10, 269, 407, -81, -74, 242, -87, -237, -171, 226, -54, -355, 4, 34, -106, -218, 21, 115, -120, 79, -42, -121, 130, 239, 239, 253, -83, 115, 221, 231, -21, -85, 26, -388, -517, -83, -73]
2622g3n21%L63J55j17J3L80k39K9j55N19r1j92K22K86o79q8N85k52p0j94j1K41
2645A11j00n29K92M88p97L96J65m0p5o4J16R7j81k92M73k21j47K45k6M5l6L05
2667B25Lr0J58J39q3m39n8L74j33o3m70N21j25j09j19L39p4l37k0J4L96l26J76
2690a01K39J3j53K02j30J14q4L56K5n47o1L28M8p2m54K69M53k13l73KK54q5k93
2713b63J93L4m39PM72J4m18q8N95j44J13k85M11j40k01M42K21k07l02j0O29n64
2735G0k09L26p9J23j42K6j79J44m30K41n8qj47J29K26k14K49J85j74k20Q1N0j44
2758a54K59j44L73j26k71P4J07j78j50N41Ok86p8q6K45j6J4m41R8L1K49k38n2
2781b23L5q3L03q0M3J45K7O4j78J87K22l73l1L31k42L2l55N72l46j74R4j67J33
$$ y = [-73, -594, -594, -231, -76, -193, -180, 200, -39, -10, -165, 354, 263, 71, 293, 579, -100, -188, 397, 145, 75, -119, -130, 111, 11, -518, -226, 262, -535, -139, 26, -14, -89, -153, -37, 60, -121, -413, 60, -161, -308, -63, -89, -44, -80, 225, 228, 138, 296, 435, 352, -87, -145, 229, 96, 33, -437, 84, -41, -150, -269, 70, -4, -341, -361, -347, 49, -277, -101, 138, 151, -2, 200, 70, 184, 100, 456, 481, -66, -127, 201, 249, 177, -277, -8, 445, 232, -141, -139, 115, 30, -263, -70, -36, -475, -468, 4, 18, -400, -488, 107, -37, 76, -209, 202, 62, -139, 303, 524, 317, 15, 5, 634, 70, -139, 187, 108, 231, 89, 115, -64, 80, -350, -109, -167, -175, -322, -193, 33, -181, 68, 253, 79, -141, -60, -10, -154, 105, -39, 334, 208, -63, 11, 118, -60, -210, 331, 337, 51, -27, -113, 132, 116, 130, -311, -213, -182, 67, -171, -223, -188, -271, 32, -48, -5, 140, 167, 231, 53, 240, 462, 89, 58, 389, 147, 179, -176, 396, 50, -124, -30, -197, -64]
2804f4k39K82K00j54l81J18K80J1k5j57K51j16j18J25M54l76k19L07k30O4L1M1
2826H5O9j29k15K81j3n02L43K26m4m39K68J55N8k75M3J48J6j53j7J83m11K45J73
2849I5Q6M4l59L33l9j15N1J44J61o24L00K82k50j98j87L32J8l11oL85j87l63M14
2872FL5J3j67L7L42j73l22K11J58n07R1L43K1o1Oo9N2J06l6o5Q9l32J53L37n84
2897c16J0N81k38k87J27p0J11O4j07J86j4O6j85J16J83k11J40J66n1l12O7J67
2919A93K35l29k22L99k76J3O4O0j14K3RJ01l12J86q2q3m0J03K44m2m12J46P6M94
2943D34k33k36P8P6j73K27J63J13n98J31J99j20J56j29n6j13k37L36J83n42N1
2964b90J68L75o18M69R1q2j84L63q4L8j30k45N4Q2o6L0J59j43JJ35k24L7j58L39
$$ y = [-64, -303, -21, 179, 25, -356, -238, 42, 53, 28, -129, 122, 6, -112, 13, 467, 91, -128, 179, -51, 13, 44, 85, 154, 25, -190, 91, 78, -424, -81, 145, 101, -338, -70, 85, 143, -132, -89, 59, 75, -78, -95, 88, -323, -78, 95, 181, 225, -134, 199, 160, 45, 96, 240, 401, -223, 77, 359, 109, -89, -276, 56, 74, -237, -243, 142, -45, -408, 6, 41, 54, -113, -76, 266, 93, -229, -18, 140, -367, -276, 67, 88, 27, 33, -36, 16, 122, 86, 21, 110, -222, -69, 268, -316, -306, 275, 37, -250, -123, -193, -82, -18, -125, 61, 47, 113, -72, 44, 227, 16, 156, 322, 271, -41, 26, 193, 428, 99, -123, 276, 0, 13, 77, 137, 23, 46, 55, 156, -156, 30, -52, -135, -175, -72, 172, 130, -282, -136, -60, 434, 201, -35, 43, 119, -54, 173, 336, 449, -149, -18, 181, 61, 217, 88, 32, -81, -318, 18, 201, -341, -290, -122, 253, -365, 104, 195, 113, -71, 292, 208, 246, 116, -129, -75, 7, -59, -29, 130, -13, -12, 123, -101, -64, -222, 117]
2988A17J25n05K73K59j43j74K65O5k26j45m29L19K17m6J7J65J27m47J21O9M7N9
3010A30q3K56k26j95L37l5j98r9J86J80l37l63M15n1k33J3N07l35P5r6K13K41
3032C02k68k03M20k54k06N3M36k69k32J32R1o0j37K89k24R1J2o1K88k03r3K62
3054A66K4j69R6o2J31m34M2O1M7k70J47m6K32J31rn5O1j06L86J44m46l4L1J28
3078A96j79p7J86k09j24j6K5j1j15K93j4J50j60J33L07k59Ok42L09O6k08j4M0
3101H3k97J52Q7K4j28m19K60O51m96k7L81j36j31Q2J35K2m94K51J02L0l86J12
3123a42J51j58l77O87j26o5k26K94jp6K5K11L37m98Q0J30p9m20q0N54J12n45J87
3146b5J59k22j18K54j19j34J24j11N59m35n2L23O8k79p8K52K94q48L13L25m03
$$ y = [117, 242, -263, 10, 269, 126, -48, 217, 282, 56, -89, -518, -199, 18, -28, -11, 154, 281, -166, -45, 24, 71, 130, 47, 303, 77, -118, 219, 184, -14, -113, 73, 253, -84, -447, -32, -83, -316, -303, 204, -131, -56, -152, 61, 302, 34, -169, 251, -3, -209, -156, 280, 11, -221, -89, 2, -58, -195, 94, -130, -39, -27, -88, 200, -3, -96, 166, 190, 21, 117, 55, 186, -248, -206, -145, -98, -368, -221, -267, -35, 96, 87, 32, 93, -13, 373, 517, 71, 37, 68, 196, 17, -60, 126, -83, -207, -223, -198, -209, -324, -31, -45, 105, -55, 78, 385, 126, 132, -110, 199, 265, 57, 43, 83, -214, -62, 25, 49, -79, -498, -238, 413, -83, -110, 271, 135, 4, 86, 221, 243, -251, 0, 102, 132, -254, -142, 9, -149, -526, 161, 35, -30, -256, 38, 37, -39, -14, 197, 534, 36, 116, 246, 167, -253, -333, 221, 333, -212, -25, 134, -88, -206, 48, -71, -205, -81, -192, 367, -68, -120, 203, 271, -8, -86, 166, 460, -388, -75, 250, -153]
3167a53j23L8J32P4q7LJ89j4k39K15L7K11k94r0L68m37j43N05Q3m58j09K96N4
3190E8l35j07O86J36n13K9L62K0l7k37j25p8k0R0J55j10L9k79L61l9k30J41k4
3213e7n1o5L11Qk46j29L25J71o8j93j76J09m9LK20r7k98q4L97J0n4M3J60k31j07
3238a48L02n4j00n13L75K03j9j83kJ80j02j05K32K82j50l67L56J9k09l81N46l96
3260b34P2J21R1ql11K55L87n42J90j43j07J76k93M17O2k20l8J86K10k39O0K27
3282C19k71J49k57L73k61p3J89m9pj99J09R4k42P6K45j90k44L45J78l17l10R5
3304b48N70k31k52J98l5o7J29J09m3k60k7J28L62l50l22J91M13l53k01J14L57
3325A82l63l25N95k11lk42M52m3n9J85o0K5m16J8N73j85m2M0j96J59m74L78K08
$$ y = [-153, -276, -238, -106, -32, -119, -116, 73, 59, -180, 35, 72, 283, -11, -101, 267, -170, -313, 192, 275, -183, -292, 4, 58, -277, -384, 302, 438, -75, -46, 316, 336, 299, 62, -63, -141, -161, -71, 84, -26, 13, -266, 95, 56, -174, -33, -57, -108, -173, 138, 146, -100, -229, 96, 267, 199, 6, -170, -61, -110, -107, 113, 16, -282, -366, 31, 41, -13, 30, 190, -41, -148, 154, 100, 0, -513, -138, 65, 46, -137, -139, 41, -61, -166, 66, 348, 198, -169, 187, 206, -3, -384, 162, -234, -162, -41, 50, 42, -269, -14, 373, -169, 21, -122, -229, -53, -346, 71, 133, -87, -125, 61, 271, 32, 92, 319, 48, 197, -60, 313, 52, -21, 168, 119, 112, -87, 22, 116, -126, -50, 195, 5, -239, 106, 284, -33, -343, -248, 322, 91, -161, 37, 2, -65, 64, 173, 130, -130, -157, -29, 333, -17, -339, -148, 265, -88, -289, -175, 182, -181, -506, 89, -122, -125, -367, 85, 42, -17, 168, 108, 133, -283, -265, 308, 123, 81, 121, -75, 84, -390, -12, 196]
3348A96m02J03K68N9j69P1r2K84m17k71M26L0j7k40L27j11k12M2L71k48k97N14
3370B15l04P5j95J88K72l61O5J87j1j90j82M26r2j90l0K80J0j22j62L17j43L9
3392I2n25M84k36j2p3L99o18K53Q2L80m26j9M5L53k39J08Pj64L05l16K84l8L3
3415A59l23M93J8l48k90M88k9m00K87P9N2m47L54j20k0m5q1L27l67J91j28K98
3437A48qo3J38n2r4J02k02N3q0p8J31J22k00R5J98q8l81K97Q6k45J63K40k02N9
3461A39m84J19J66l07l6L10J10j73M3J84M08l52l96M91J82l95n1M12n01j63rM90
3483A87n24J92J21K1k99rK66Jo3rL7K58J09j70l2K8J01k15K6K05l39j5R4k62K42
3508d9j2M60l10l89K72M74n84L21o0l5q7k93K85O9j22j45QK09J11l83K52J56j63
$$ y = [196, -206, -103, 165, 224, 55, 126, 34, 318, -99, -370, 56, 86, 69, -171, 156, 45, -167, -125, 246, -2, -299, 215, -89, -14, -209, -21, 251, -110, -45, 142, 131, -59, -241, 185, 93, -97, -127, 153, 163, 41, -121, 196, 53, 92, -433, 51, -185, -197, -270, 129, -489, -236, -154, 226, -200, -219, -174, 179, -60, 48, 55, -109, 196, -120, 164, 126, 159, -164, 329, 347, -1, -291, 197, 168, -232, 55, 134, 186, -261, 93, -27, -47, -92, -173, 154, -213, -22, -150, 148, 140, 77, 215, 163, 69, 171, -31, 22, -58, -136, -5, 117, -83, 12, 210, 122, -259, 38, 124, -121, 42, 282, 80, 139, -345, -226, -60, -367, -403, -93, 17, -156, -113, 71, 479, 127, -269, 222, 404, 9, -42, 370, -131, -294, -303, 187, -337, -145, -24, -3, -302, -311, -45, -44, -107, -116, -79, 179, 288, 118, 86, 114, 215, 0, 26, 231, -108, -123, -29, -291, -49, -61, 399, 89, -300, -28, 446, -138, 183, 123, 88, 1, -292, -7, 62, -60, -205, -197, 12, 123, -260, -8, 148, -15]
3531a5R2J1J8N4o6J01j80r9M2L63k67k30M07j40l41k11K27L43k65K3QJ4o9J53
3555b7K86k92o3L55M5r9j72J03J0k30j27M13n0m25J07K0pJ2J5L16P1k50k2K70
3579B59j43k38m2M10J51o99L28K23j11j89j33L64q9k97K19kL0k24L67K29m34k66
3601b87M71J47k62k57L46P8n28J54L4L20k03N2k55k4n1n3L03N4o3N1K42r5k74
3624a00K40L14l79j4j1J47j15j03r3p6j31K82L0O5m14L86Q1K0k04P7L12k39k85
3647b10K70K51o86K40r9L32k63j39K71K38o9k69K04L13m02J09J21kr2o0Q9r5o10
3670e58N09J39k54L8n3K89j18j87P1K73r6k00J43L88k05Q6P1j27k23j92L75l18
3692a49J4J51M0j77J67j27L16m4l28L19M9L3k41o9L68m95k13L75K40j06m64L91
$$ y = [-15, 77, 88, 106, 160, 94, 195, 15, -84, -42, 321, 54, -176, 231, 91, -250, -461, -234, 109, -156, -133, -125, -111, -180, -27, 259, -33, -96, 259, 304, 205, 33, 136, 146, -84, -211, 202, 152, -273, -166, -146, -153, -141, -126, 190, 261, 11, -11, 259, 116, -122, -164, 246, 397, -302, 26, 249, 138, -51, -184, 180, 91, -206, 13, 11, 41, -183, 184, 413, -21, -287, 184, 331, 69, -188, 158, 236, -292, -138, -104, 216, 13, 65, -190, -214, -265, -318, -15, 39, -24, 27, 269, 174, -100, 140, 454, 75, 61, 50, 197, 82, -21, -114, -190, -321, -39, -9, 56, -358, 28, 109, 129, -75, 2, 314, 75, -210, 60, 311, -375, -135, -234, 98, -165, -304, -33, 205, 136, -133, 71, 384, -18, 91, 212, 210, 118, 58, 147, 52, -558, -49, 90, -164, -126, -179, 110, -8, -195, -124, 149, 53, -147, -4, 384, 179, 265, 336, 209, -14, -206, 169, -149, -135, 16, 56, -121, 46, -81, 235, 191, -137, 182, 231, 264, 23, -46, 322, -173, -386, -11, 229, 123, -341, 50]
3714E0j27l0j12J06Q8jj37K28L42m47O0K11o3k40R3K69k21N9j48J30k80j96O47
3737B81l2k49R8m2lk4m02O29j25j57j78J33L83p06K06L72O4m68K39K6p3j41K29
3760F0%k67J38K9J95l95k7O20j1n34O2J42O7k21K54O8qk79K69K3j90l19L21K15
3784B12l90K02l30M10p1k86L88r1%J8K5n1k24J05J86N9l14r4M92j88m6q6K48m3
3808A31m26J67M75k00k33n2K92m41k31O41J18j39j56L8J76j60j8J92j7J00r6j86
3830b5k91J55M10k39J94n46J29L87m93L88m3O8j39O7j29K32r9q9j21K17l74J37
3852b04R4k1N2j51M11q4j79K15K34k98m28K80K74m7l24%J99k20J79J55r1Ml1j7
3876BJ08l2k39L11l9N9l48L12j34k4j61K06P5n31M47M53o69R6J71j19J11j42L78
$$ y = [50, -77, -107, -219, -113, -25, -26, -163, 65, 407, -40, 20, 231, 168, -72, 21, 290, 69, 128, -20, 110, -170, -366, 281, 249, 0, 98, 56, 53, 29, -373, 256, 131, -26, -204, -71, 312, -394, -188, 184, 248, -220, 19, 45, -28, -169, 60, 60, -207, -69, -40, 155, -240, -267, 353, 342, -192, -130, 12, 79, -142, 112, 180, 172, -107, 162, 185, -5, -324, -3, 212, -178, 24, -306, 104, 33, -253, 135, 44, 44, 62, 87, 36, -188, -83, 103, 162, -152, -246, 246, 58, 12, -74, 174, 131, -295, -128, 347, 147, -86, -138, 154, -287, -518, 123, 241, 102, -54, -16, 160, 0, -18, 174, 157, 257, 161, -25, -316, -161, 249, 10, 204, -342, -213, 174, -319, 69, 26, 94, -45, 22, -107, 125, 26, -63, -184, 33, -341, -204, -110, -131, -79, -230, 181, 97, -82, 133, 367, 69, -359, -79, 195, 148, -176, -176, 23, -197, -18, 137, 46, 50, 19, 2, 110, 78, -161, 150, 111, 170, -178, 134, 0, -24, -185, 21, 96, -435, 12, 465, -204, -108, 63, -56, 55, -87, 291]
3899B91M6j11l52K49q5k92K87K42j32M0Q5j5m02j62K72J51k13J06J80J19k82n5
3921c3l12O40m49J5m8L90k7m89N10j94k9k12K71K0k99J26M43j77m01K04K01k79
3943a29Q9l7N15l88j87J80m1L9m06K04K94l25N6K71J26j00j94J17K2j17R6K57
3965C42l90K02j83K39j26n31L56K90j95k50J34M8r7N5N1o6J99j87L23k29n8J49
3987G6%R3l17R4O7nl7m0L52m38K17k73N93l55j31K05K09l20r7J03J5N8l65J31
4011a65L78q5m12L06q7k47J57J60J19n3Q1j90j14qQ9M36N2m44J31k78M3k8P0L12
4035B23l2m10J32K02k84K23K03Kl64k08M07N7j38j43R6K31k58j02K72l68O4K72
4057G7k47MJ05j42N37k43q7Q0J53l32J76n9J1k88j43L71l7l89L22M05L0p73M88
$$ y = [291, 337, 226, -126, 123, 38, -254, 33, 275, 143, 183, 268, 253, -149, -311, -39, 112, -101, 5, 185, 304, 22, -33, -345, 295, -154, -139, -187, 203, 176, -313, 197, 3, -26, -238, 33, 53, -246, -120, 323, 146, -255, -51, 150, -129, -40, -77, 438, 50, -137, 43, 2, 41, -365, -161, 133, -192, -136, 135, 261, 161, -33, 84, 106, -11, 85, 342, -48, 154, -29, 210, 84, -447, -91, 199, 4, -246, -112, -64, -161, -106, -55, -121, 78, -109, 214, -15, -73, 76, 76, 169, -148, -54, 13, 8, -29, -69, 283, -155, 62, -211, 382, 27, -104, 101, 310, -10, -107, -4, 11, 69, -296, -165, 213, 128, -284, 22, -65, -312, -155, 5, 124, 71, 152, -38, -152, -160, -71, 365, 417, -27, 104, -174, -131, -159, -89, 223, 191, -219, -87, 115, -169, 54, 257, 259, -105, -313, 94, 151, 13, -130, -34, 197, -61, -163, 109, -259, -195, 77, -170, -166, -61, -203, 334, 91, 4, 84, 237, -95, 81, 22, 33, -255, -398, -27, -64, -453, -131, 274, 304, -469, 19]
4080A9J82j6r1j79M26k25j45K12J05l27k80M25j31r7j68L54k5j83K47j4j68k61
4102c40K65K87K96m63p3j0Q7m14L92%k48n4K28K22l11J25j36O53n45j37K42J4
4124H0q2n6kM55n81j40Q4J81l65K64K31n7m04K83J65j94K6O4N00m09n7j6J20j59
4148f9ON6L7j27K34lj01k12L39k40J09k87M72pk65P8j07N56m42n6J80j9k43l5
4172a46M06K4l00l64M04J50k62L9K65l2j86k59L29R5j67j4Q5j14n2J66l9j37Q9
4195b0K21p4r5l16J3L99j24J04n2n6J86k33J73k23k30K34O73n81l20M80J18j74
4217A03k72K44L0R3o05M45N2o4k11L08l8l59J6L91Lk60l71O13j03j67J20K12j21
4240E9k72J46M50j68k24j3K34j70n0O5OK59n51J58p4j5J40N6J40r0l53L36K71
$$ y = [19, 201, 185, 94, -85, 341, 116, -29, 183, 288, -39, -319, 106, -25, -122, -290, 64, 39, -144, 103, 89, -79, -340, -75, 212, 508, 45, -28, -38, 49, -365, 27, 27, -221, -275, -47, 175, -136, -11, -147, 506, -39, -176, 66, 80, -2, -58, -60, 395, -186, -326, -242, -61, -426, -162, 69, 12, -392, -109, 56, -138, -112, -48, 452, 43, -14, -30, 90, -69, -63, -7, 30, -97, 137, 134, 33, -179, 160, -80, 29, -258, 214, 207, -58, 20, -87, 469, 27, -29, 151, 132, -111, -146, 260, 284, -16, -380, 24, 174, -88, -49, 216, 184, -2, -261, 68, 163, -4, -18, 67, -47, -99, 67, 28, -109, -20, 201, 127, 32, -284, -271, 128, 4, 108, 56, 0, 186, -47, 126, -97, -327, -93, 580, -1, -321, 159, 277, 103, -169, 75, 105, 198, -407, 38, 90, 26, -185, 123, 85, -274, -258, 133, 136, -124, -495, 118, 15, -152, -32, 180, 59, -213, -67, 383, 215, -9, -22, 212, 42, -8, 57, 63, 322, -229, -71, -145, -160, -20, 36, 176, 86, -267, 69, 340]
4263C40o38K56K59j26k24J27K00k0o12O66O3k41l30N6M45l78j7J91R1l3J08j03
4285H0K86m36l7J99J92n57L34J84p4n24O2Q35m28n9j5Q9j47J42k8k8J11J75l05
4308E1J7k55M1K59k49j90RM55l85J41k59O57k98k34L63j06Ok05M11O1l46l8O2
4331c2K64l4m65M08J3j17k8J37K2l67J0K04l7p7P0J79j63k28R8J70j74k16L52
4354a1J45k54o7L74rj68k7j00M70l24m7J55j29j07k11M85p1l93o3N81l89K9K3
4377a08o0K76n79M45J35j17j35q7K95J45n87P30J3l35r8j15M08n79J50O24m56
4398c5L9K8kK59m29L06Q6k65j25K71n0j26k06K18L01k86l9j96K40P3q9K65j56
4421H2n8j02J80j60RJ60j14J58j47R8M8O7l52K17k92k1r5J20K70l45O0k7M93l03
$$ y = [340, -298, -42, 217, 91, -133, -6, 194, 174, -438, 228, 291, 50, -280, -224, 221, -157, -174, 17, 108, 75, 183, 80, 366, -70, -107, 92, 284, -273, 61, 245, 171, -353, -291, 544, 116, 57, 42, 131, -16, 126, 98, 70, 181, 356, 51, 68, -187, -146, 113, -136, -326, -317, 138, -247, -106, -365, 292, -6, -240, 123, 17, 23, -182, 229, 290, -56, -94, -32, 232, 198, -267, 141, 154, 37, 9, 146, 168, -199, -189, 15, -22, -99, -29, 150, -13, -241, -143, 27, -147, -363, -11, 134, -120, -187, 187, 178, 10, -17, -117, 353, 29, -18, 137, 8, -99, -310, 175, 104, -289, -352, 229, -160, -131, -108, -168, 108, -471, -26, 109, -8, -143, -230, 65, 210, -377, 353, 366, 31, -67, -182, 226, -353, -203, 421, -35, 4, 32, 30, 289, -140, 166, 252, -13, -138, 133, 83, -43, -249, -31, 270, -16, -55, -251, -11, 62, -27, 238, 82, 24, -78, 102, -58, -49, 111, -3, 155, 8, 106, 154, 221, -131, 86, -206, -227, -322, -202, 68, -277, -217, -244, 249, -54]
4445e4j82K90N0k38J08O9Q1N7l63L90j11k00r0M37p1m88K22O06l13l14K58l5L7
4468A46j02k7OL0k8J05K00l78k10L81J00m84J06L23p3k16J03O0L78l60L0O6q9
4491F7j57K99P7m00k91O21k28k52L9pJ22j46K6K84q1M1K2N7q1l11K70J36Jk31
4515a23M4L14l92k9pj12M99j82J91J2k25j20J51K34o62L57K85l19k09J16N81n51
4537a47k70K88J26k40o2K01J17N3j84K73j0j42j2j4M95k09k90K40j44o4k52K53
4559Fq2l39j17R95n61k40j27N79j07k94M47j66J84l39K30J84j59l57J67J64j94
4580a26k05L52J12j46M5L26j85j03k83M44J32q72N60K49l32j26l1K61p1r1n0L63
4602B23n38p9K36M00k83l4M3K91m51K59J3P9j11l19L80ll59N1n3K00k46K16K9
$$ y = [-54, -236, 54, 104, -134, -26, 43, 124, 181, -182, 208, 97, -103, -193, 244, 173, -315, -93, 513, 200, -114, 144, 109, 146, 44, 17, 23, 53, 25, 130, 330, -48, -258, 123, 223, -261, -155, 168, 95, -121, -18, 42, 420, 60, 90, 156, 67, -90, 209, 286, -114, -405, 216, -12, -264, -225, -232, -110, -256, -230, 54, -27, 14, 36, 93, 12, -299, -29, 107, 108, -123, -79, 235, -157, -186, -193, -305, 194, 12, 203, 215, -10, -130, 21, 255, -407, -50, 235, -84, -293, -177, 404, -147, -417, -129, -3, -243, -305, -104, 13, 66, -118, 155, 145, 3, -9, -23, 472, 263, -27, 213, 69, 5, -247, 6, -76, -415, -532, 463, -98, -338, -465, 114, 7, -287, 160, -6, 178, -161, 69, 253, 94, -263, -96, 68, -126, -331, 21, 133, -13, 32, 358, 173, 70, -213, 231, 363, -509, 51, 300, -32, -158, -189, 72, 1, -90, -140, 223, -315, -394, -158, 242, -41, -75, -32, 259, -192, 67, 80, 159, 48, -271, 109, 106, -253, -202, -255, -55, -301, -85, -56]
4625e6J61m67N17j27J08l68K12J83k45o6J53J41k95j20M17l8M8l60L85j60j08
4646h5O3o7K15l79K41L23k50k37L6J72O9m95L60M00n76k7J26L39k47j51M71J70
4668D71m88k23M18j0m41M07Q7k43r8K98K4k32l36K43K98k16r4K48k02K5p3J17
4690b0L89p22J43M63r0m29K16K8K09m81j7O10k82k12K73O5k01J5J83J28L1n80
4712b81N59j40k75J67RO3k36j99P19l56j13j27K26J1m21L54J47K0j86N8J28J50
4734B77k49q2K95j71l52L65l25M80l88K49L8k32K03j87p0p7K29K82k32k17N8K52
4756A46k51l02K39M32j63l47J32L69k09m36L02R4M9k33M29j5k95PJ22O5k67K3
4778a09J85M5m76o6N81L1m15K74O8m1M4j26K0M13m99N9L19m41o9K72l33K24N9
$$ y = [-56, 105, -362, 155, 28, 136, -232, -20, 163, -82, -148, 5, 146, -149, -269, 148, 110, 158, -202, 183, 23, -85, -22, -89, 126, -253, -12, 311, 61, -176, -140, 32, 101, -394, -34, 366, -210, -237, -111, 228, -19, -170, 301, 471, -17, -240, 178, 168, -273, 134, 221, -22, -120, 178, 202, -30, -366, -123, 175, -41, -135, 113, -89, -64, -137, -20, 369, -353, -210, 253, 163, -266, -50, -22, 187, -294, -311, 299, 17, -195, 78, 143, -58, -43, 140, 268, 299, -281, 278, 138, -137, 30, 39, 102, -134, -333, 386, 30, -83, -210, 16, 27, -394, -40, 107, 127, -59, -1, 127, 277, 28, -54, 241, 70, -282, 83, -242, 238, -150, 99, 137, -95, 108, -79, -149, -226, 3, 285, 53, -164, -106, 146, -105, -407, -168, 264, 101, -246, -114, 255, 46, -390, -88, 6, 55, -178, 251, 236, -59, -52, 70, 135, -132, -109, 76, 121, -355, -421, 160, 191, -224, 50, 118, 77, 121, -5, 15, 428, -71, -12, 307, -134, -203, 69, -264, -40, 19]
4801A9j5J98l35J65j13J01J45k89K8N0j79M3L53q2l26K25O8j30l54M03K10l24
4823a39J04Q7L94n83j3K17J29l04J30n9J68k57K3N14n83nl8J33K31n53J09M15
4845A20m6k42j13J09J98L7J5J52pm25K48J2j65j06L13N5l10M4J57N3k86NK76M8
4869A42j29N7mj89k5O4K59m13J00r7L89m04R8K70L34l33J56j14k28ok41N46k70
4892c8j28L82j42j0k29J87P6L1k76m5J37P7m63K88L01l90L6L68j85j70J59j08
4914a42K70m62N98m3j13q7Q4Q4j38j98L4L23r3j39L2M01n76M1J80l8l31j0K16
4937a07K33n35L28j91K84l98P5M52Q7n02L08K47k80J39j76L99k32k89n5M24o2
4958A49l27K66%j22rJ07p5r1J77j55j98K0J26P4J04k87J78J94K37n69K71j19j24
$$ y = [19, 4, 202, -133, 32, -81, 20, 165, -124, -96, -46, -225, -182, 171, 89, -237, -12, 56, -74, -428, -25, 185, -139, -35, 52, 446, -137, -150, 67, 196, -108, 22, -37, 131, -126, -103, 411, -172, -177, -215, -82, 149, -404, -295, 120, 74, -168, -281, -172, 26, 63, 78, 230, 223, -202, 46, 58, -107, -213, 100, 155, -155, -111, 46, 99, -187, -182, 94, 142, 13, 70, 66, -123, -148, -84, 175, -238, -138, -235, 154, -250, -152, 118, 452, 119, 275, 161, -67, -73, -314, 232, -38, -166, 216, 74, 64, -165, 22, 98, 129, -147, -192, -55, 22, -441, -153, 148, -242, -206, 162, -23, -193, -34, -142, 128, -334, 264, 221, 108, 21, 105, 189, 51, -147, -113, 210, 117, -22, 10, 411, -165, -124, 56, 18, -313, -323, -107, 126, -409, -81, -272, 12, -386, -311, 141, 228, -274, 34, 281, 1, 140, -36, 363, 131, -158, -213, 211, 149, -178, 88, 88, -34, -43, 64, -11, -102, 75, -80, -278, -258, -132, -58, 46, -241, -63, 131, 368, -201, 70, -49, -173]
4981a73L6j9N07l81j13J58O0o6k00L91J18l45l17L40P9n73J11P25l68J01j13k3
5003f5j57M42o4J41j28l97L15j6j60p0N19l28J98j49J21j20k53K77K41k88J0r6
5025b7L76p35m6P0M10k02Q1P8J66j96j35J82J21jk74L64j28Q2p5k49K90L8k89
5048i9K88q7j88j51L45mk29L5p5k9K97j41K43k68K54l41L09j30j26L01j12M8k63
5071a23J47nJ14n05O56kn55J88K33o8k17m2M21j58j23J13J62k27j44j5J37l2j80
5094b25L86M1m6j39j51N29j99j93P8q4j09K7p3K34J34l67M73j94m72N67p8l9l55
5117b55M41J21k51k47J57N8k44o0L03Q1o5k39M52j35k81jL20j20o2M2L0K66n71
5140b60K26K13n6l13K94K5l79K46o6K3J15l07M16j59N4j63L45k07l02J54K42j48
$$ y = [-173, -137, -156, 351, -30, -143, 15, 75, 9, -191, 200, 318, -27, -344, -4, 75, -498, -387, 338, -30, 71, -42, -65, -222, 220, 156, 297, 169, -228, 87, 71, -89, -159, 360, 32, 230, 81, 202, 82, -171, 106, 347, 59, 69, -27, 349, -386, -432, -362, 48, -154, -73, 5, 171, -25, -160, 22, 143, 142, -132, 232, 104, 186, 111, -138, 152, 190, -99, 189, 102, -86, -237, 108, 104, -125, -90, -165, -194, 103, -38, 205, -63, 191, -150, 159, 29, -97, 204, 92, 140, -123, 24, 19, 133, -372, 284, 282, -273, -85, 148, 80, -137, -179, 242, 84, -39, 74, 236, 9, -135, -150, -13, -45, -225, 161, 202, 156, 17, -134, 395, 196, 3, 81, -3, -112, -85, -158, 76, 210, -157, 316, 122, -350, 217, 139, 100, -255, 186, 307, 56, -191, -34, 24, -220, -280, 23, 104, 39, -200, 252, 117, -164, -165, 155, 35, -27, 15, 45, 311, -260, -34, 179, 123, -190, 104, 129, -250, -4, -70, -47, 68, -239, 177, 18, 72, -91, 254, 47, -255, -101, 141, -7]
5162gj21j99L66K60l73P5NJ77m26N79m7j72k47J85j09L8j41K16p0m6j35M69l59
5185h2J26J18k04L28k51j38K97J28m06J57L2M9k56J10K69m79K39K05Rq6n37L78
5207FJ55l74K01k59J02q1K81J5J0j25r3K87j44p2P4O6J06j28q6J66j1j1M2J2l5
5232A04j89M08k34o2j51L75j48k84L19rj19p3o1m7k9j90K29J56j08J00k9K07n3
5255A12N9m2J93l92K27j67L27j31k26K50l35K84k06M6p9K00k16K60l11Q4q2O07
5277D62p30J29N34k92J42n89N14l6j41j47M01j77pj9K98k16k15K97P1j34n0k72
5299a77J52K12m23J26k2Jj02O0R7j08J79q9Q9l6p7L47l47K26J05k5j27J4j7K22
5323B80j93j98J19j34O0l77M39K06l33p6K47J4j95QK4J20K26m11L77j8j10m5m3
$$ y = [-7, -128, -327, 39, 299, -74, 1, 6, 183, -243, 336, 289, 117, -130, 55, -54, -16, -157, 59, -11, -57, -192, 277, -82, 44, 162, -42, 286, 35, -103, 194, 322, -84, 73, 105, 154, -102, 8, 277, -202, 37, 242, 251, 165, -372, 6, 161, -213, -12, -271, -169, -250, 31, 46, 56, -69, -162, 125, -19, -91, -17, 49, 155, 27, -59, 107, 96, 85, 127, 139, 104, -85, 323, 89, 27, -124, 251, 103, -181, 138, 129, 10, -63, -124, -171, -200, -390, -161, -5, -113, -13, -42, 165, 112, 171, 129, 322, -70, 157, -10, 317, 186, -40, 210, -125, 159, -47, -1, -80, 120, -96, 164, -147, -63, -145, 462, -268, -139, 395, 103, 245, -344, 170, 134, -7, -154, 247, 70, 63, 44, 342, 126, -89, 208, 279, 145, 95, -177, -25, 187, -236, -110, -132, -131, -233, -173, -76, -184, -5, -94, -5, -41, -118, 229, -118, 108, 213, 188, 61, 75, 58, 280, 87, -111, 8, -126, -66, -443, -4, 202, -131, -207, 40, 54, -141, -133, -109, 11, 237, -174, 203, 185, 75, 30, -13]
5346a3K52l39k5J16L4J10j69J63K7l47K01M55k36j72j47L94o4l17J67K8j9n08
5368d09N9K67j41J14K6J13n1k24J43N17m16M1J33j02k87J78J78j1j48J78k0j50
5390a2Q4k32K84j31j09K78n4M4n44L25J00m69L83p6J79M5l28j12K74P2N8m0Q8
5413A07k09j26M18j74OP7n9J92l12M71j76k55k91N33Rl52rR4K56l76k8L81r2m4
5437D1j22K39l28L22J04n7l1l64Q2K81rj71N2N2Pl27J04J33K53m35R0M16n40J
5461b07M44m36J05n8J04L1K34o6k17j24q6J35M60n00r1N79ql75L17M9m17kp7J94
5485a2Rj17j21L63l59K0n7Q3m2K75l2j35k43L79K69m99M14l84L08R7k34J66l6
$$ y = [-13, 239, -100, -125, -9, 25, 135, -34, 129, 156, -191, 10, 465, 229, 57, -90, 304, 240, -77, 90, 118, 99, -409, -350, -83, -224, -110, -84, 29, -22, -246, -103, 414, -2, 39, 172, 70, -217, -39, 139, 128, -20, 158, 138, -12, 72, -160, 124, -7, -116, 162, 108, 152, -392, -67, 33, -436, -53, -129, 50, 95, -233, -345, -71, 1, 59, 19, 107, -102, -228, 190, 16, 22, 99, 40, 232, -80, 391, 215, -40, -331, 202, 211, -141, -150, -56, 200, -176, -204, 177, 85, 41, -81, 158, -170, 152, 256, 199, 168, -196, -114, 167, 158, -13, 39, 91, 98, -229, -125, 8, 261, -174, -84, 332, -208, -207, 237, -199, -94, -152, -48, -17, 217, 151, -66, -190, -276, -141, 319, -181, -272, 307, 299, -76, 241, 290, -127, -129, -206, -12, -3, -120, -241, 122, -237, -217, -274, -191, -233, 42, 10, -125, -368, 11, 280, -219, 195, -189, 119, 216, -18, 148, 112]
$$ [...]
8191E7
##END NTUPLES=NMR FID
##END=
