##TITLE=1H_BAU-0GA-2
 CDCl3, 8 sc, 
 2.8.2019
##JCAMPDX= 6.0         $$ Bruker NMR JCAMP-DX V2.0
##DATA TYPE= NMR FID
##DATA CLASS= NTUPLES
##ORIGIN= UXNMR, Bruker Analytische Messtechnik GmbH
##OWNER= root
$$ XWIN-NMR		Version 3.5
$$ Fri Aug  2 15:07:48 2019 Russian Standard Time (UT+4h)  she@DPX200
##.OBSERVE FREQUENCY= 200.13155
##.OBSERVE NUCLEUS= ^1H
##.DELAY= (6, 6)
##.ACQUISITION MODE= SIMULTANEOUS
##.ACQUISITION SCHEME= undefined
##.AVERAGES= 8
##.DIGITISER RES= 18
##SPECTROMETER/DATA SYSTEM= spect
##.PULSE SEQUENCE= zg30
##.SOLVENT NAME= DMSO
##.SHIFT REFERENCE= (INTERNAL, DMSO, 0, 15.7039)
##AUDIT TRAIL= $$ (NUMBER, WHEN, WHO, WHERE, WHAT)
$$ ##TITLE= Audit trail, XWIN-NMR		Version 3.5
$$ ##JCAMPDX= 5.01
$$ ##ORIGIN= Bruker BioSpin GmbH
$$ ##OWNER= she
$$ F:/spectra/data/she/nmr/H-F/1/audita.txt
$$ ##AUDIT TRAIL=  $$ (NUMBER, WHEN, WHO, WHERE, WHAT)
(   1,<2019-08-02 15:06:50.93 +0400>,<she>,<DPX200>,
      <created by zg, POWCHK disabled, PULCHK disabled
       configuration hash MD5:
       00 E9 B6 7A A2 85 ED C7 34 08 36 98 17 FE 4E 26
       data hash MD5: 16K
       9B 51 A3 4F 79 72 C8 1C 49 46 33 CE 25 70 80 EC>)
$$ ##END=
$$ 
$$ hash MD5
$$ 48 EC 4B D3 16 B5 03 3D D6 AF B7 59 E0 04 B8 19
##$RELAX= 
##$RELAX= 
##$RELAX= 
##$RELAX= 
##$RELAX= 
##$RELAX= 
$$ Bruker specific parameters
$$ --------------------------
##$DU= <F:/spectra>
##$EXPNO= 1
##$NAME= <H-F>
##$PROCNO= 1
##$TYPE= <nmr>
##$USER= <she>
##$AMP= (0..31)
100 100 100 100 100 100 100 100 100 100 100 100 100 100 100 100 100 100 
100 100 100 100 100 100 100 100 100 100 100 100 100 100 
##$AQSEQ= 0
##$AQ_mod= 1
##$AUNM= <au_zg>
##$AUTOPOS= <>
##$BF1= 200.13
##$BF2= 200.13
##$BF3= 200.13
##$BF4= 200.13
##$BF5= 200.13
##$BF6= 200.13
##$BF7= 200.13
##$BF8= 200.13
##$BYTORDA= 1
##$CFDGTYP= 0
##$CFRGTYP= 5
##$CHEMSTR= <none>
##$CNST= (0..31)
1 1 145 1 1 1 1 1 1 1 1 1 1 1 1 1 1 1 1 1 1 1 1 1 1 1 1 1 1 1 1 1 
##$CPDPRG= <>
##$CPDPRG1= <>
##$CPDPRG2= <>
##$CPDPRG3= <>
##$CPDPRG4= <mlev>
##$CPDPRG5= <mlev>
##$CPDPRG6= <mlev>
##$CPDPRG7= <mlev>
##$CPDPRG8= <mlev>
##$CPDPRGB= <>
##$CPDPRGT= <>
##$D= (0..31)
0 1.2 0 0 0 0 0 0 0 0 0 0.03 0 0 0 0 0 0 0 0 0 0 0 0 0 0 0 0 0 0 0 0 
##$DATE= 1564744010
##$DBL= (0..7)
120 120 120 120 120 120 120 120 
##$DBP= (0..7)
150 150 150 150 150 150 150 150 
##$DBP07= 0
##$DBPNAM0= <>
##$DBPNAM1= <>
##$DBPNAM2= <>
##$DBPNAM3= <>
##$DBPNAM4= <>
##$DBPNAM5= <>
##$DBPNAM6= <>
##$DBPNAM7= <>
##$DBPOAL= (0..7)
0.5 0.5 0.5 0.5 0.5 0.5 0.5 0.5 
##$DBPOFFS= (0..7)
0 0 0 0 0 0 0 0 
##$DE= 6
##$DECBNUC= <off>
##$DECIM= 24
##$DECNUC= <off>
##$DECSTAT= 4
##$DIGMOD= 1
##$DIGTYP= 9
##$DL= (0..7)
0 120 120 120 120 120 120 120 
##$DP= (0..7)
150 150 150 150 150 150 150 150 
##$DP07= 0
##$DPNAME0= <>
##$DPNAME1= <>
##$DPNAME2= <>
##$DPNAME3= <>
##$DPNAME4= <>
##$DPNAME5= <>
##$DPNAME6= <>
##$DPNAME7= <>
##$DPOAL= (0..7)
0.5 0.5 0.5 0.5 0.5 0.5 0.5 0.5 
##$DPOFFS= (0..7)
0 0 0 0 0 0 0 0 
##$DQDMODE= 0
##$DR= 18
##$DS= 0
##$DSLIST= <SSSSSSSSSSSSSSS>
##$DSPFIRM= 0
$$ [...]
##$SUBNAM2= <"">
##$SUBNAM3= <"">
##$SUBNAM4= <"">
##$SUBNAM5= <"">
##$SUBNAM6= <"">
##$SUBNAM7= <"">
##$SUBNAM8= <"">
##$SUBNAM9= <"">
##$SW= 24.9336996594482
##$SWIBOX= (0..15)
0 0 2 0 0 0 0 0 0 0 0 0 0 0 0 0 
##$SW_h= 4990.01996007984
##$TD= 16384
##$TD0= 1
##$TE= 0
##$TE2= 300
##$TE3= 300
##$TEG= 300
##$TL= (0..7)
0 120 120 120 120 120 120 120 
##$TP= (0..7)
150 150 150 150 150 150 150 150 
##$TP07= 0
##$TPNAME0= <>
##$TPNAME1= <>
##$TPNAME2= <>
##$TPNAME3= <>
##$TPNAME4= <>
##$TPNAME5= <>
##$TPNAME6= <>
##$TPNAME7= <>
##$TPOAL= (0..7)
0.5 0.5 0.5 0.5 0.5 0.5 0.5 0.5 
##$TPOFFS= (0..7)
0 0 0 0 0 0 0 0 
##$TUNHIN= 0
##$TUNHOUT= 0
##$TUNXOUT= 0
##$USERA1= <user>
##$USERA2= <user>
##$USERA3= <user>
##$USERA4= <user>
##$USERA5= <user>
##$V9= 5
##$VALIST= <valist>
##$VCLIST= <CCCCCCCCCCCCCCC>
##$VD= 0
##$VDLIST= <DDDDDDDDDDDDDDD>
##$VPLIST= <PPPPPPPPPPPPPPP>
##$VTLIST= <TTTTTTTTTTTTTTT>
##$WBST= 1024
##$WBSW= 4
##$XGAIN= (0..3)
0 0 0 0 
##$XL= 0
##$YL= 0
##$YMAX_a= 482810
##$YMIN_a= -626929
##$ZGOPTNS= <>
##$ZL1= 120
##$ZL2= 120
##$ZL3= 120
##$ZL4= 120
##$ABSF1= 10
##$ABSF2= 0
##$ABSG= 5
##$ABSL= 3
##$ALPHA= 0
##$AQORDER= 0
##$ASSFAC= 0
##$ASSFACI= 0
##$ASSFACX= 0
##$ASSWID= 0
##$AUNMP= <proc_1d>
##$AZFE= 0.1
##$AZFW= 0.1
##$BCFW= 1
##$BC_mod= 2
##$BYTORDP= 1
##$COROFFS= 0
##$CY= 11.3945322036743
##$DATMOD= 1
##$DC= 2
##$DFILT= <>
##$DTYPP= 0
##$F1P= 20.1537800932815
##$F2P= 0.134698688090026
##$FCOR= 0.5
##$FTSIZE= 0
##$FT_mod= 4
##$GAMMA= 1
##$GB= 0.15
##$INTBC= 1
##$INTSCL= 1
##$ISEN= 128
##$LB= 0.24
##$LEV0= 0
##$LPBIN= 0
##$MAXI= 10000
##$MC2= 0
##$MEAN= 0
##$ME_mod= 0
##$MI= 1.114404
##$NCOEF= 0
##$NC_proc= 0
##$NLEV= 6
##$NOISF1= 3.799351
##$NOISF2= 2.8
##$NSP= 1
##$NTH_PI= 0
##$NZP= 0
##$OFFSET= 15.70392
##$PC= 1
##$PHC0= -9220.633
##$PHC1= 14.00097
##$PH_mod= 1
##$PKNL= yes
##$PPARMOD= 0
##$PSCAL= 0
##$PSIGN= 0
##$REVERSE= no
##$SF= 200.130013532006
##$SI= 16384
##$SIGF1= 3
##$SIGF2= 2
##$SINO= 400
##$SIOLD= 16384
##$SREGLST= <1H.CDCl3>
##$SSB= 0
##$STSI= 0
##$STSR= 0
##$SW_p= 3612.71676300578
##$SYMM= 0
##$S_DEV= 0
##$TDeff= 0
##$TDoff= 0
##$TI= <>
##$TILT= no
##$TM1= 0
##$TM2= 0
##$TOPLEV= 0
##$USERP1= <user>
##$USERP2= <user>
##$USERP3= <user>
##$USERP4= <user>
##$USERP5= <user>
##$WDW= 1
##$XDIM= 8192
##$YMAX_p= 0
##$YMIN_p= 0
$$ End of Bruker specific parameters
$$ ---------------------------------
##NTUPLES= NMR FID
##VAR_NAME=  TIME,          FID/REAL,        FID/IMAG
##SYMBOL=    X,             R,               I
##VAR_TYPE=  INDEPENDENT,   DEPENDENT,       DEPENDENT
##VAR_FORM=  AFFN,          ASDF,            ASDF
##VAR_DIM=   8192,          8192,            8192
##UNITS=     SECONDS,       ARBITRARY UNITS, ARBITRARY UNITS
##FACTOR=    0.0002004,     1,               1
##FIRST=     0,             0,               0
##LAST=      1.6414764,     0,               0
##MIN=       0,             -626929,         0
##MAX=       1.6414764,     482810,          0
$$ Real data points
##PAGE= N=1
##DATA TABLE= (X++(R..R)), XYDATA
0 0 0 0 0 0 8 -8 8 -16 24 -24 32 -40 48 -64 72 -88 108 -129 152 -176 210 -248 285 -328 379 -435 495 -562
28 -562 637 -724 814 -914 1026 -1150 1283 -1429 1590 -1767 1962 -2174 2407 -2668 2954 -3268
44 -3268 3620 -4017 4461 -4965 5542 -6212 7001 -7940 9084 -10521 12377 -14877 18458
57 18458 -24037 33968 -56910 215599 -183067 -601147 254008 399631 -270804 -308800 409926
68 409926 246117 -445221 -238667 461644 176809 -449195 -152342 438354 128449 -362361
78 -362361 -95808 270406 -26846 -254355 112006 314228 -114447 -358514 19506 297590
88 297590 15028 -208510 12779 166341 -70001 -184473 81224 193171 -97688 -196797
98 -196797 131301 227231 -148883 -263489 122303 244604 -100132 -151678 168427 91498 -273992
109 -273992 -93762 341301 128295 -317551 -84807 299689 5251 -305347 74350 324659
119 324659 -118086 -295873 190847 272076 -267549 -270839 305347 263026 -287975 -188490 285990
130 285990 76357 -341879 -13134 391488 1433 -384404 9096 324794 -74709 -300158
140 -300158 123842 288927 -144260 -268796 138671 209669 -173437 -186038 199176 193114 -188572
151 -188572 -197238 145536 153997 -141678 -113941 177792 124166 -195163 -153333 177131 152682
162 152682 -158819 -112441 195602 103700 -232535 -113389 247074 117553 -230423 -67056
172 -67056 254341 27198 -285558 -5320 299301 -6849 -269136 63945 257374 -127416
182 -127416 -269844 155404 265900 -153995 -213790 174032 145021 -231022 -118360 261819
192 261819 104503 -255486 -76626 226450 11268 -232033 23408 226146 -44219 -201884
202 -201884 61707 157054 -111076 -152225 131755 157917 -115044 -138977 87277 83864 -100077
213 -100077 -46858 134933 56676 -138554 -69477 119457 62665 -104811 -38549 123832 45632
224 45632 -124002 -47658 116568 33494 -112592 7119 154284 -8797 -183493 -7576
234 -7576 178895 10753 -145055 35457 143435 -83214 -165090 100872 170407 -106414 -148226
245 -148226 128801 123710 -164084 -123961 165646 102748 -159571 -58480 165456 4294 -206675
256 -206675 -379 212333 4025 -184975 11653 142338 -64329 -141133 91422 145108
266 145108 -90733 -128036 88327 94236 -108664 -81589 123295 89149 -102760 -71033 84384
277 84384 34143 -92795 -6881 126223 28082 -120174 -40504 96063 28720 -77784 6554
288 6554 101777 -6688 -112389 -1670 103109 -4213 -88373 36263 104368 -48778 -123269
299 -123269 36653 109406 -38424 -81031 69447 71011 -106474 -91699 102227 85948 -94167
310 -94167 -57929 100786 23813 -133149 -27029 132451 22710 -115916 1720 103978
320 103978 -40893 -122847 46231 126187 -37101 -99949 47019 70793 -79309 -70238 96283
331 96283 82730 -77813 -62674 70501 32952 -83774 -16275 106039 33261 -89242 -27500
342 -27500 70624 4208 -69032 20084 93080 -6756 -88505 -2224 67040 -12313 -55861 39907
354 39907 73250 -40004 -84681 22587 64569 -29101 -45927 53569 48909 -70988 -68658 54672
366 54672 55235 -51106 -32149 65879 17883 -91634 -33900 82040 28216 -68403 -4377 69880
378 69880 -21037 -92062 15138 90651 -8921 -68176 27377 56272 -52956 -65629 59433
389 59433 73285 -43550 -49638 49347 29071 -67664 -24765 81844 38649 -62969 -23350 54840
401 54840 1038 -62306 12207 78221 1170 -65755 441 48637 -19020 -47277 35433 61468
413 61468 -27738 -59889 16129 37696 -29608 -29497 46760 37741 -49885 -48211 32152 29509 -36646
426 -36646 -16397 50014 15244 -61656 -28716 46588 16423 -42569 1107 52938 -9004 -66771
438 -66771 -1691 57279 -67 -41946 20208 44330 -34169 -54967 31111 54753 -22373 -33404
450 -33404 37875 27714 -51301 -30805 54085 36298 -38311 -14869 43154 1262 -55131 304
462 304 61419 9121 -45271 1649 36440 -19474 -43329 23880 50549 -14858 -40570 13195
474 13195 22899 -31186 -26267 38062 34010 -31806 -33994 18713 13351 -30541 -9620 40132 14922
487 14922 -41767 -22339 27189 7214 -31419 2411 42195 122 -46445 -8401 33346 -378
499 -378 -26168 18875 37377 -21813 -45706 14740 40066 -10902 -22728 28197 24675 -35745 -27923
512 -27923 35069 27211 -26704 -8767 38379 4793 -46517 -9554 43426 12561 -27568 4682
524 4682 26630 -19907 -38452 17651 41524 -9124 -29981 10492 16708 -25344 -22476 25693 23610
537 23610 -19922 -18318 15507 3379 -30396 -9784 32600 17510 -24709 -18543 11405 -111
549 -111 -20129 6206 32851 1082 -34202 -8412 23804 895 -20817 10871 31669 -8071
561 -8071 -32395 4859 24466 -9731 -15132 28082 26389 -28124 -31349 21767 25571 -15086 -6111
574 -6111 30272 4202 -38785 -9055 35842 9330 -24647 4757 27653 -13535 -35070 8278
586 8278 30532 -5894 -18431 14232 11924 -27869 -22158 21859 21570 -13611 -12790 10882 -1194
599 -1194 -24461 -5485 23949 11414 -15885 -9469 7267 -3953 -16430 3694 23823 5599
611 5599 -19704 -8361 10979 -532 -13271 8452 25052 -969 -22979 -1440 16181 -5601
623 -5601 -12199 21181 25702 -17190 -27868 11127 19996 -10304 -4155 26416 6917 -32412 -11319
636 -11319 28860 8195 -22929 3498 28073 -7711 -31823 2848 22183 -7948 -13432 20354
648 20354 14339 -29948 -26035 18525 20826 -10448 -8211 10568 -4656 -23455 -1194 21873 3295
661 3295 -16411 -1428 12291 -3874 -17881 -2725 14744 8320 -3575 -1457 704 -9878 -11313
674 -11313 11138 25088 4492 -19860 -9253 11494 4252 -6925 8187 16605 -6306 -16347
686 -16347 8442 14557 -13424 -13248 22708 22609 -16431 -20215 8878 6064 -12354 7814 26717 -6273
700 -6273 -34368 -2921 25227 -43 -16804 8309 13767 -16526 -16743 13145 8053 -18648 -4341
713 -4341 23466 5275 -25754 -13322 11775 4717 -4338 8427 8269 -15607 -18776 7036 17690
726 17690 1067 -7620 1580 4114 -4750 -5605 3248 7246 2172 136 4842 3299 -9104 -11649 7870
741 7870 21126 5400 -12593 -4209 4791 -4917 -4222 16251 14653 -14127 -15766 11578 9567 -15030
755 -15030 -6176 20595 7851 -19004 -6385 12650 -6709 -17695 12553 24575 -11073 -26651
767 -26651 2188 12167 -9209 -5224 18078 5045 -22788 -9950 14953 3050 -13265 3506
779 3506 15555 -4056 -16007 53 7946 -3068 -1222 12116 6303 -11562 -10670 4198 8375
792 8375 3641 2844 3028 -1518 -6291 -2941 5023 8946 3642 -2510 -14 2392 -5220 -6715 6952
807 6952 12946 -696 -8454 1909 1801 -10876 -3918 16072 9154 -13325 -8926 7600 -2429 -13711
821 -13711 5308 18293 -4405 -18920 1016 8828 -10106 -8831 15531 10777 -15630 -11852 9373
834 9373 2402 -12495 3164 17689 -1301 -17106 -1123 9518 -2994 -4856 11602 10311 -9749
847 -9749 -10753 5199 6638 -1664 2423 8730 293 -8633 -2990 4982 4486 1136 2506 3092 -1081
862 -1081 -5733 -4374 3737 7575 1601 -2865 -5 -1095 -7541 -3793 9461 7779 -6531 -7104 2956
877 2956 -1359 -10368 1002 12821 139 -12800 -1362 6520 -7407 -9104 10272 11639 -8922
890 -8922 -10942 5870 2856 -10669 247 15741 2234 -14267 -2734 8998 -2130 -7128 8868
903 8868 11923 -6388 -10341 4480 6157 -4064 116 10573 3390 -8954 -4132 5819 2671 -1783
917 -1783 3351 6346 -1607 -6940 -2249 3254 2820 489 1626 1486 -3259 -6858 -1943 5629 4220 -2425
933 -2425 -3391 491 -2278 -6855 -214 7610 1093 -7162 -1179 3633 -5470 -8095 5287 9741 -3401
948 -3401 -7589 2511 1394 -8287 -966 12395 4882 -9976 -3972 6884 -445 -6320 5225 10859
962 10859 -2764 -8126 3467 5337 -5304 -2601 10224 7077 -6333 -4777 3841 1196 -3270 4127
976 4127 8637 -698 -8576 -2029 4179 768 -1376 2680 3417 -3362 -5889 -839 2032 104 -876 2049
992 2049 1725 -4285 -7120 -1156 4356 1872 -2115 10 120 -5812 -6111 3604 7035 -1488 -4393 2045
1008 2045 1344 -6064 -2718 7597 5248 -4146 -1796 4272 -1558 -7283 2805 10597 1956 -5738 826
1023 826 3514 -4379 -3358 8536 7724 -4066 -5257 2806 1333 -4352 1122 8237 1978 -6200 -2607
1038 -2607 2314 -1306 -3007 3536 5355 -2052 -6621 -1758 681 -1285 -216 3926 2349 -4602 -6380
1053 -6380 -1248 2204 576 349 1988 -292 -4830 -4295 1589 3642 -88 -971 2276 239 -5242 -2845
1069 -2845 4224 4218 -347 427 3189 -2148 -5759 1278 8251 3190 -3337 73 2104 -3179 -3130 5146
1085 5146 6287 -1687 -3305 2507 779 -4870 -1212 6358 3411 -3723 -2183 959 -2547 -3861 3131
1100 3131 6470 -902 -6157 -2328 673 -2015 -975 3582 2175 -3957 -4156 323 757 -1731 -208
1115 -208 3603 1314 -3334 -3718 54 1351 431 2038 3448 -563 -5047 -2334 3248 3642 93 140
1131 140 1941 -996 -3185 577 4302 1902 -1126 2008 2366 -2694 -3979 2320 5211 666 -1650
1146 -1650 1001 -171 -4168 -1119 5188 3291 -3053 -2613 1022 -758 -3869 963 3848 -278 -3447
1161 -3447 -631 620 -2863 -2763 2566 3224 -2108 -3622 -491 -299 -1827 132 3378 1209 -3202 -2624
1177 -2624 734 552 -847 1318 2951 108 -2495 -1146 1489 1063 24 2110 2605 -539 -2861 48
1193 48 2593 1529 -158 1568 1752 -1835 -2564 1208 3458 113 -756 1305 155 -2971 -1909 2387
1209 2387 2403 -1257 -876 1091 -1166 -3294 -364 3309 626 -2448 -686 755 -2238 -2641 1760 2928
1225 2928 -1139 -2540 -168 -370 -2424 -855 2969 1820 -1959 -1907 715 158 -1205 1243 3012 697
1241 697 -2079 -856 997 363 66 1829 2534 -443 -2189 -411 1358 936 732 1899 1472 -1349 -2419
1258 -2419 147 1317 474 187 1393 333 -2849 -2099 1213 1932 -725 -505 685 -928 -3129 -935
1274 -935 2060 861 -1365 -60 468 -2214 -2779 673 2413 148 -1248 -73 -520 -2443 -1076 2509
1290 2509 2185 -948 -1286 294 -545 -1042 1158 2857 905 -1029 -532 430 -440 -211 1884 2994 655
1307 655 -1777 -788 0 282 820 2378 1821 -1482 -1946 -241 1024 482 415 1308 502 -1692 -1960 -51
1325 -51 362 -378 180 1373 -473 -3246 -2247 1228 1468 89 262 -311 -2351 -2871 523 2041 247
1342 247 -1208 85 85 -1656 -1143 1183 1495 298 153 934 -771 -1563 -20 2986 2062 -376 -701 -59
1360 -59 -942 -218 1932 2410 158 -1118 -440 184 -152 53 1194 1433 143 -813 -730 -534 -423 616 1652
1379 1652 835 -1704 -2445 -294 812 349 584 658 -1074 -2010 -1038 709 299 -566 82 765 -1026 -1888
1397 -1888 -712 795 513 357 720 46 -1897 -1440 984 1976 619 -263 497 -408 -1270 224 1698
1414 1698 1233 -84 237 467 -407 -1000 760 1645 685 -133 20 4 -789 -319 1429 1605 153 -1141
1432 -1141 -561 -31 -605 62 880 493 -585 -887 -227 -329 -619 264 678 327 -1199 -1184 -478 197 -137
1451 -137 886 674 -231 -1439 -772 479 455 -74 900 380 -406 -824 227 591 444 441 461 519 -863 -554
1471 -554 676 1073 321 718 513 -156 -829 -11 933 623 379 213 276 -702 -869 662 767 101 -420 -100
1491 -100 -217 -951 -412 559 680 -353 -691 -173 -559 -911 -205 673 227 -499 -707 -446 -453 -569 390 695
1511 695 -59 -696 -492 -107 -262 -153 895 576 -376 -528 77 -41 181 546 845 297 -668 -411 117 734
1531 734 524 539 637 22 -610 -191 897 706 105 410 250 -744 -668 -107 224 393 -38 -103 -185 -768 -405
1552 -405 121 141 -176 -74 -365 -271 -925 -212 603 545 -420 -561 -450 -666 -285 618 899 -13 -420 -618 67
1573 67 -485 215 742 550 -303 -516 -162 -67 47 705 1179 399 -444 -485 87 712 620 447 489 -220 -531 -234
1595 -234 280 444 421 440 -61 -98 -581 -132 288 426 129 -100 -400 -919 -696 31 703 287 -186 -198 -630
1616 -630 -783 -219 772 542 -154 -696 39 -641 -594 475 714 343 100 -267 -261 -348 -143 1185 932 175 -418
1637 -418 -205 194 118 669 1047 287 -106 135 7 51 63 673 901 -155 -467 -521 -8 190 403 352 346 -367
1659 -367 -851 -344 56 350 262 50 -519 -801 -533 -88 214 149 -267 -209 -623 -546 -709 238 236 -57 -519 125
1681 125 -537 -719 73 878 647 -13 -217 -174 -339 -223 698 714 248 49 37 -193 -350 432 1075 310 -73
1702 -73 42 211 -221 -21 608 706 145 -443 -311 -271 -206 281 618 186 -299 -274 -418 -129 84 300 296 -342
1724 -342 -462 -457 -453 191 224 94 42 -263 -946 -526 41 186 13 101 -98 -498 -555 -195 793 245 30 345 137
1747 137 -110 -458 184 454 72 396 430 32 -169 -162 769 490 195 -11 55 -463 -107 288 512 -74 -242
1768 -242 -375 19 -380 -153 438 111 -242 -119 -243 -613 -557 -127 242 -11 -498 -434 -696 -104 -5 287 -75
1789 -75 -210 -335 -590 -332 94 254 354 -61 24 -243 -119 90 598 429 463 251 -248 -306 84 559 454
1810 454 140 261 138 -560 -152 262 705 165 224 160 -440 -597 308 467 100 165 -102 -295 -379 -484 290
1831 290 268 -182 -108 -160 -487 -652 -67 225 216 -267 -238 -374 -524 210 492 182 -193 -168 -399 -352 -19 113 337
1854 337 104 155 46 -483 131 366 347 432 54 16 -275 -220 293 511 238 567 -15 -228 -369 288 650 228
1876 228 16 304 -83 -301 257 420 543 -196 -280 -103 -401 -502 -82 442 -130 -174 196 -335 -738 64 454
1897 454 -24 -377 -40 -154 -621 -240 216 266 -34 -243 -34 -287 -285 232 394 333 -181 -225 -550 -72 529 774
1919 774 435 317 45 -336 102 456 451 124 15 100 8 -319 182 571 204 -111 61 109 -408 -383 71 320
1941 320 -178 -116 106 -372 -417 39 256 148 -250 -383 -165 -550 -141 253 62 -260 60 -54 -428 -194 -18
1962 -18 -57 -42 36 292 -247 -438 169 517 310 170 -32 -407 -349 133 695 533 299 235 186 121 -48 225 475
1985 475 303 238 236 -512 -346 61 498 196 126 -64 -761 -521 -38 339 171 -394 149 -353 -278 -186 37 8
2007 8 52 -36 -28 -413 -561 -138 333 143 -101 256 -292 -571 20 451 272 -50 44 36 -198 104 453 498 77
2030 77 327 262 -50 -325 504 523 519 13 396 -215 -312 178 629 277 189 94 -59 -259 -214 -9 -86 178 65
2053 65 -95 -157 -41 132 192 -182 102 76 -560 -571 -244 80 -247 -214 -79 -459 -625 -93 244 4 -110 327
2075 327 -183 -484 -71 411 239 108 302 288 -390 -280 406 656 351 419 384 -289 -479 91 325 306 390 307
2097 307 -87 -363 42 318 284 116 306 16 -505 -477 180 257 53 436 57 -708 -461 98 246 -381 -88
2118 -88 153 -394 -442 -175 319 -267 -155 267 -141 -632 -377 -155 157 215 243 248 -219 -414 152 222 -68 16 318
2141 318 -254 -389 365 733 406 98 410 -158 -377 78 406 64 108 620 103 -493 -271 306 368 -8 -143
2162 -143 72 -431 -501 115 -20 248 -118 282 -141 -322 -138 -78 45 201 122 -188 -489 -297 -169 -103 61
2183 61 127 -131 -294 -230 296 350 -147 332 371 -298 -83 354 252 -55 153 290 152 -485 -29 725 -38 23
2205 23 456 88 -552 64 301 253 52 -8 522 -239 -431 -91 383 -119 -154 285 -369 -503 -348 -177 -230 -58
2227 -58 -78 93 -669 -255 75 89 -271 81 -35 -676 -352 227 91 -47 193 382 -351 -206 -414 132 -122
2248 -122 83 249 -132 -501 -43 354 52 -2 461 211 -346 25 296 276 -146 310 210 -182 -280 152 42
2269 42 -226 -147 262 21 -508 -86 252 334 -238 575 -29 -331 -377 -30 -73 -408 88 291 -248 -446 16 -93
2291 -93 -251 -192 49 -528 -622 10 158 -30 -201 326 -120 -305 -5 282 -138 208 415 63 -380 -195 307
2312 307 128 -71 249 789 61 -153 -13 180 -63 440 356 -280 -293 -65 47 -247 -67 567 108 -436 -40
2333 -40 31 -215 -260 382 301 -284 -670 -129 146 -159 123 456 -98 -589 -179 -162 -145 -172 597 201 -220 -337
2355 -337 158 -50 144 308 242 -101 -201 90 365 206 157 516 29 56 10 15 118 1 570 6 -38 -188
2377 -188 95 125 156 358 158 -129 -128 19 -474 -56 209 473 -103 -626 151 -45 -493 -16 549 -537 -823
2398 -823 -229 101 -247 -111 283 -148 -463 -137 225 11 -345 163 349 -52 -551 155 117 -41 199 389
2418 389 -262 -538 -88 69 -123 88 703 129 -245 -5 292 92 143 208 138 -195 -89 244 14 10 148 312
2440 312 -124 -261 93 -115 -33 163 192 19 -428 -226 -38 -319 -66 163 251 -383 -301 296 -390 -190 34
2461 34 491 -553 -804 260 -43 -416 219 396 -469 -244 -17 217 -86 -50 239 8 -286 -378 342 24
2481 24 -276 392 305 -44 -525 376 0 -129 87 253 -24 -596 98 388 -222 460 312 17 -176 -374 85
2502 85 -264 -116 156 283 -226 -239 -112 15 84 84 133 -269 -127 -76 -196 -350 182 90 64 -158 -149 -208 70 -166
2526 -166 180 88 -126 -406 128 24 -39 369 121 -66 67 218 58 177 135 511 243 -109 268 176 6
2547 6 87 444 505 -411 130 283 -208 -229 531 165 -214 -281 130 65 247 -81 -38 -313 -510 -19 -47 -375 -69
2570 -69 294 16 -310 47 -80 -158 -322 354 182 -45 -4 146 160 -143 55 202 -324 -172 287 104 -157
2591 -157 -116 228 -97 -96 134 190 -151 151 238 423 -32 17 269 -233 334 270 -58 -91 157 111 -61 -199 67
2614 67 356 -271 -493 74 184 -482 -114 324 44 -311 -152 -342 -194 -342 440 -174 -459 -280 -73 -111 -220
2635 -220 130 27 -206 -427 -151 -131 -298 258 385 72 -69 193 157 169 48 307 61 -221 -194 114 -75
2656 -75 -52 217 175 -40 9 240 113 -106 77 531 -32 -111 -93 -54 138 135 465 28 -200 -339 -33 -38 -12 158
2680 158 132 -236 -345 -113 204 -57 214 266 -165 -348 287 54 -153 -225 439 465 -337 -44 140 29 27 56
2702 56 62 -60 271 502 235 43 367 334 -245 65 143 -49 -193 80 371 251 84 279 -187 -188 28 422
2724 422 232 -237 115 84 -163 -52 48 297 -95 3 -175 -6 -33 77 -31 -230 -138 -110 -97 -247 -139 37
2746 37 -176 -295 -8 131 -282 -433 73 69 153 -72 70 -235 -235 279 150 17 140 142 234 -81 -15 302 -74
2769 -74 82 70 216 -116 228 608 176 79 -6 216 24 -147 195 48 -204 -284 -37 271 -516 -173 118 -590
2791 -590 -34 9 -60 -129 -304 136 202 -181 48 212 -297 -364 -163 93 -345 -115 4 -340 -31 236 75 -217
2813 -217 -231 290 139 -156 366 179 124 68 243 -126 -185 127 369 116 -71 -51 46 -110 -30 128 121 183 50
2836 50 52 -133 -166 -6 -298 -121 -43 -42 68 -271 -128 143 -118 -355 71 -89 -252 -172 228 103 -401 -115 130
2859 130 -327 -554 -49 341 148 -198 -32 56 -389 87 271 -115 -227 128 11 -281 -58 406 213 -1
2879 -1 80 346 -296 -186 23 387 153 84 138 139 -256 302 -22 -42 -56 95 -210 -109 -54 268 -79 -194 -199 -82
2903 -82 -380 -298 -44 147 -156 -238 158 -52 -407 -230 377 -191 -289 -183 221 -156 17 295 -36 -33 119 201
2925 201 -178 -41 175 60 276 -102 89 19 -49 0 361 -279 179 25 -56 -36 -38 311 260 45 264 112 -154
2948 -154 126 143 109 -259 -181 -9 8 -215 275 121 -58 -428 161 -68 -307 -106 -7 -140 -343 -38 -222 -337
2970 -337 -237 255 33 -283 -5 -55 -289 -92 94 74 63 81 142 11 -125 -163 330 -171 202 222 343 -262
2992 -262 -151 401 250 76 217 133 -198 4 427 487 -331 183 165 -170 -82 -190 132 -9 -108 22 -389 -156
3014 -156 4 146 -81 -154 60 -113 -25 -291 26 201 -327 20 -61 -359 -170 145 62 -384 228 -246 -109
3035 -109 -11 81 240 -129 -6 92 -3 -597 50 186 235 -30 212 217 -22 46 342 180 237 156 267 142 -204
3058 -204 9 459 114 3 80 34 -168 -21 308 -83 -114 34 156 -243 -278 21 -13 -68 54 65 -411 12
3080 12 -12 99 29 -16 166 -98 -211 56 17 -185 -193 195 -32 -118 144 84 271 -32 -19 69 38 -102 407 287
3104 287 3 241 155 -67 -29 11 270 -219 -133 409 -207 -297 -39 174 171 -49 -23 -100 -203 -7 -130 -399 -195
3127 -195 365 118 27 -63 111 234 -290 -193 146 -210 -497 -43 15 122 -83 -468 -199 -288 -33 -9 -123 -30
3149 -30 -61 119 -105 12 151 -200 41 -144 74 -9 -588 -51 -39 160 212 203 332 -175 403 156 147 158 173 53
3173 53 309 -40 -39 -120 -152 47 -117 -56 -348 43 -98 47 -197 16 -349 -119 -310 126 -176 -188 -20 270
3195 270 -118 -190 12 -164 -32 201 29 -197 173 60 249 25 12 230 199 -182 -23 55 -78 -14 173 161
3217 161 -4 130 -163 191 124 -131 183 -116 -235 35 256 -74 -7 221 302 -65 130 125 -231 -49 -13 -133
3239 -133 -229 -6 60 -299 -7 186 118 -444 -126 122 -13 81 160 160 58 -43 43 10 -161 -47 -77 177 -364
3262 -364 155 211 -90 -175 348 -59 79 -80 34 14 41 138 -143 -192 -25 252 75 -318 112 93 52 55 43 160
3286 160 162 47 52 139 -32 -226 -3 -181 -125 157 -86 -29 -124 179 -169 -59 -127 40 88 -168 169 -49 -164
3309 -164 -211 286 -176 -320 405 75 -97 -173 296 -127 90 102 90 -30 -398 74 61 -99 101 165 229 -62
3331 -62 8 26 -2 210 -116 -54 46 -124 543 120 -104 -34 231 206 35 56 8 -164 -32 65 149 -215 -24 -112
3355 -112 -37 14 343 -9 -424 -4 -32 -53 -272 -39 -399 -41 20 284 55 155 -65 -168 185 158 6 3 125
3378 125 43 -8 -22 -79 87 293 64 98 190 174 131 103 406 299 -361 103 -23 -309 -93 -12 65 173 -279 183
3402 183 25 -37 -165 -94 -150 -182 -241 196 -328 44 116 287 -50 -20 85 -147 175 33 60 -196 -40 -354 116
3425 116 170 99 371 8 -112 -18 -147 -69 -129 259 -29 -48 125 213 87 -44 206 189 113 204 310 113 -131
3448 -131 293 196 27 -56 49 73 -207 19 137 -128 57 -63 120 -109 73 92 32 -124 184 27 -167 -111
3470 -111 20 -111 74 17 -196 -116 -341 -1 -134 -87 -530 -161 -154 104 25 285 266 -94 97 70 122 16 148
3493 148 30 8 11 6 -3 72 104 -31 117 -56 -173 217 6 191 -164 -62 231 46 25 -92 149 -123 -133 -269
3517 -269 38 -50 9 -64 283 55 -73 192 315 78 -162 -72 96 15 -6 -147 249 35 -160 362 -77 -209
3539 -209 -34 -4 -197 -275 59 31 -46 57 211 -127 98 -45 -57 142 114 158 238 83 81 -7 -233 -200 -17 193
3563 193 -186 -9 109 -7 -293 -100 -194 18 14 -10 98 -32 100 99 200 44 23 245 49 -219 -214 -53 26
3586 26 94 61 155 -12 -123 -63 -298 19 166 159 138 -48 -118 -140 464 207 -5 -127 -134 175 198 82 -84 36
3610 36 -34 23 -44 -50 60 98 93 124 -6 -28 102 60 50 195 226 11 178 -184 -165 -127 76 -65 180 47 -157
3635 -157 -164 -169 18 100 -8 203 -167 -146 -263 230 80 276 221 -348 64 -209 268 -105 -51 -55 -233 -95 -120 442
3659 442 59 -40 99 144 -272 -29 -165 -11 -255 -28 409 224 -5 135 180 37 33 211 226 -205 229 205
3681 205 220 241 160 -33 -63 35 -128 -32 151 -71 -326 84 -52 -88 -47 211 -39 -14 -269 -145 -152 157 -43 -127
3705 -127 149 -388 -188 -83 -138 253 139 80 -222 140 201 78 54 123 97 -73 138 111 167 -96 -20 426 -266
3728 -266 25 -63 142 185 152 -42 -88 137 -28 -101 101 164 -306 -82 -94 -151 109 6 -75 -274 90 -125 -147
3751 -147 139 -72 -349 166 -40 456 -258 58 -170 -288 -143 156 -262 -580 172 158 -1 227 322 -144 120
3772 120 41 -157 -16 32 -48 0 131 98 101 276 269 -21 -207 -115 129 -80 232 25 388 -23 -138 18 -181
3795 -181 141 -43 -115 -157 -33 -206 31 -93 311 -185 -382 -200 -351 57 -226 60 233 -46 -140 -109 -47 -65
3817 -65 183 -325 -126 108 177 -66 174 -149 -143 -41 326 -39 273 -4 114 63 126 -149 165 481 204 -320
3839 -320 -180 123 152 110 78 34 88 198 50 -38 39 -20 121 -150 22 29 -144 -288 -18 -7 -104 44 69 -117
3863 -117 -56 -177 93 -85 -134 110 -408 60 41 89 -37 194 -247 -157 -314 -58 249 114 -5 3 193 -115
3885 -115 -154 180 293 -48 47 171 -125 -224 22 -39 98 149 63 -75 -206 269 -10 180 78 -49 3 -12 178
3908 178 184 128 -21 196 -41 -82 -51 -5 68 171 -17 -437 -110 -286 -135 -66 -11 180 -103 76 29 69 -46 53
3932 53 56 100 193 -139 -139 -101 -217 224 -235 -362 66 393 78 201 -20 288 -193 134 -205 -183 172 -161 0
3955 0 86 176 -69 56 -176 206 -16 -114 114 80 -358 209 108 20 303 -183 -110 -51 77 -248 167 277 98
3978 98 49 33 -179 -1 7 -215 -22 -141 49 53 -120 278 211 209 133 -98 -129 254 192 -77 -109 -109 10 192 -103
4003 -103 30 204 200 266 -32 -6 212 -112 88 247 40 -19 -45 53 11 57 37 202 224 208 -18 -24 118 64 -129
4028 -129 -170 -55 -247 -145 -297 131 140 -79 -8 -335 -99 -22 -441 -103 -100 -110 -134 -79 26 127 -49 149 -183
4051 -183 -203 246 -170 -197 155 131 -6 123 44 -21 45 -14 -112 198 -104 -11 -160 -257 116 147 -211 -89 217 180
4075 180 161 -1 197 106 57 282 305 -15 -44 111 -128 148 179 -36 -205 131 273 -78 -104 79 6 -278 -281
4098 -281 -77 -37 -85 0 152 -107 -79 39 -88 121 81 3 85 -193 4 267 182 -95 12 18 212 -31 -247
4121 -247 -210 126 63 107 165 329 171 51 52 93 143 31 -50 236 58 -118 156 -390 27 -329 -145 30 -37
4144 -37 -115 -283 35 -18 396 -66 -133 -209 -211 -5 -62 9 -220 -168 229 -121 -256 72 -223 166 267 224 -112 327
4168 327 105 -43 -76 -48 1 184 71 217 15 333 -158 -107 -31 66 -58 -224 194 256 -21 100 221 -46
4190 -46 -228 -137 30 52 -38 1 -49 55 42 -185 120 -262 -113 -245 -2 -190 -144 53 -212 -69 -198 21 -204
4213 -204 148 42 -50 209 -7 -9 -205 -50 200 -178 -97 -66 35 122 -194 73 -57 -56 33 157 -182 -33 145
4236 145 172 40 -108 -165 0 1 -12 301 -27 -185 -64 -4 -58 69 262 -137 -327 72 59 -17 -108 -34 54 -43
4260 -43 185 -184 5 -44 -80 -146 -70 -174 -13 74 -159 182 39 -275 36 -42 -104 -63 57 -86 -90 -107 -119 -96 -129
4285 -129 -38 -38 247 115 -14 -13 68 76 258 123 384 115 87 19 146 115 -77 -285 68 -140 217 126 38 -204
4309 -204 -113 218 -489 -68 -82 -82 -70 -231 -138 -187 -79 -269 -115 -129 140 33 37 226 141 -121 -47 95 -14 -68
4333 -68 176 -49 -37 65 -180 142 -108 -62 8 279 86 51 -221 341 281 -151 159 17 -71 -51 -76 25 73
4356 73 20 223 -96 125 205 -23 141 70 109 67 70 76 69 -179 209 28 239 -102 425 -214 -48 -97 69 63 -18
4381 -18 -277 50 104 -54 -48 57 -50 -69 -365 -159 -35 271 -139 16 127 -168 2 -60 103 142 11 173
4403 173 106 88 15 -132 2 -54 131 -4 151 -87 296 -43 101 -86 119 81 112 128 -89 -136 2 -127 -33
4426 -33 293 -296 260 -35 -65 -244 3 56 -334 -37 -362 113 -108 -238 143 -121 -181 20 90 139 26 -169
4448 -169 -75 58 140 -239 35 41 -26 216 -46 -14 -160 -240 42 35 -99 49 349 -103 233 -131 -150 -241 2 -242
4472 -242 220 109 -65 -189 8 132 -224 72 -179 -98 48 -36 10 123 104 -94 -44 -11 129 -39 -212 -148
4494 -148 195 -207 -212 -386 -238 150 139 18 -15 -193 -108 -6 -233 -68 -97 27 131 -190 184 143 -45 -48 118
4517 118 55 -77 -2 107 -163 -94 -168 -18 -211 -63 270 179 -39 -54 25 -119 191 -250 -118 177 172 -8 -31
4540 -31 -73 -178 124 -58 -101 -202 -89 -133 60 -363 -77 26 -266 -47 -142 56 -31 -63 -74 -131 212 -109 44
4563 44 63 -29 -43 55 170 115 261 107 48 -123 -11 -101 -291 121 -178 158 -234 -145 231 -189 -125 39 -80
4586 -80 190 -124 196 115 57 342 204 -2 -4 -64 -74 -197 180 -220 -141 -150 149 93 -192 37 -31 -30 62 -226 -228 122
4612 122 -313 165 222 138 -305 -11 12 -89 53 -96 -124 268 79 302 90 123 -132 -44 -84 -103 179 -60 -146
4635 -146 -13 -98 502 -46 11 -248 106 101 56 11 -16 80 -168 105 -73 105 -23 -199 -198 -12 23 -1 -183 15
4659 15 37 17 -80 7 -161 -72 -142 32 -257 -191 -112 -278 -156 87 87 -38 -12 -138 -331 -526 164 98 -49 -61 135
4684 135 39 117 193 163 -23 -19 43 -127 -72 25 110 215 172 393 166 12 -59 -53 -26 12 -108 258 47 223 262 163
4710 163 -56 3 211 -42 105 41 261 -29 -112 65 -249 -178 -6 -41 115 -45 67 -219 -118 -217 4 35
4732 35 335 37 -31 -127 44 255 -70 -176 -104 65 -130 -214 19 120 -104 -35 173 388 31 33 218 -171 -85
4755 -85 224 -283 -323 27 55 -174 -83 27 -205 66 128 -43 -34 -229 -95 -52 -97 -72 -220 -170 121 -169 -3 51
4779 51 6 -82 -56 -323 -224 -167 -66 -219 49 67 -15 -5 -194 74 195 86 -288 -85 43 -155 142 -98 -101 5
4803 5 85 136 -121 17 117 64 -239 22 -201 226 -252 154 -237 -84 -47 -265 -12 -245 -194 180 227 -156 -58
4826 -58 -208 -222 -28 -9 12 19 -213 22 -166 93 272 22 -109 116 45 -185 -90 288 -28 -139 15 8 280
4849 280 101 -52 -7 5 -60 -63 -225 -157 145 104 41 101 84 -7 58 -108 7 210 20 -32 169 58 -94 147
4873 147 30 40 21 -450 124 -33 -320 -168 -440 206 83 -44 -117 109 171 -150 -55 125 64 60 -140 -108 -22
4896 -22 -157 178 -123 153 48 61 -82 205 -19 -205 120 -79 -28 85 4 -519 -160 385 191 -134 -35 181
4918 181 55 -134 -3 -47 -154 -128 22 -26 -30 -32 -75 -119 86 -152 -8 103 38 3 -188 -145 -42 212 181 -62
4942 -62 -63 116 189 -208 181 143 -127 -101 -79 -121 -143 167 -5 -401 -230 17 -332 31 -235 17 107 115 -222 -247
4966 -247 215 33 -63 -55 95 208 -296 8 -207 215 -105 148 -8 244 -62 191 70 238 -224 150 130
4987 130 45 34 155 -27 -74 76 107 -15 -117 -50 -241 -110 -116 -44 184 159 -82 -29 -126 71 -157 -162 -124 -130 -125 141
5013 141 326 -162 -36 39 95 157 -82 199 -133 -88 -47 99 -188 86 29 -66 268 -124 -147 40 96 -72 91
5036 91 34 143 260 -7 31 2 118 -105 -41 10 -129 -42 -183 -315 -205 112 -121 73 64 231 256 88 -286
5059 -286 -113 23 -75 64 -16 160 40 -107 -30 -31 7 -224 16 -249 -43 93 109 -345 89 215 90 -18
5081 -18 -36 -184 -101 -171 -174 58 83 133 -122 116 34 38 248 -196 181 334 224 -85 173 38 -194 -21 -60 -142
5105 -142 -66 -39 165 -14 -143 -228 1 -156 40 44 45 90 -90 147 -123 -90 9 62 106 79 168 -30 -7 -37 -240
5130 -240 0 -38 50 32 60 16 97 186 -75 -276 -128 -58 55 -205 222 -11 -202 491 294 -118 152 146 76 127
5154 127 120 -143 -112 -133 -81 66 -125 87 41 117 102 -164 87 -45 -153 98 38 66 -54 157 272 7 -118
5177 -118 -41 44 188 -317 -215 -7 25 136 107 -3 -37 30 -55 197 76 57 211 19 -79 101 205 291 -53
5200 -53 -14 205 4 -89 -39 87 59 187 -151 177 184 226 101 17 121 -185 -30 110 112 -47 -13 105 -101 223
5224 223 116 -41 -122 -77 6 -150 65 9 -202 49 88 -194 -26 -101 -307 -70 210 -40 109 -66 62 -64
5246 -64 -292 266 -213 221 7 -158 -75 81 18 82 269 -232 -85 232 159 -83 -56 -92 200 173 -359 -118 274
5269 274 251 277 -59 -95 23 67 -13 -46 245 -47 -208 -178 165 -195 -118 -123 -196 48 29 -3 -73 -11 99 -206 242
5294 242 -11 -301 40 -44 -66 197 -32 -182 87 0 -168 -364 80 46 26 102 82 -59 -99 42 5 142 7
5317 7 -94 -10 -220 -38 216 -123 -97 156 -68 33 225 -19 69 36 -141 149 -28 76 133 -312 -170 -153 56
5340 56 115 -115 -214 139 -20 48 190 -68 85 58 -187 78 63 -145 -83 -31 -279 26 -66 -136 -143 -87 -44 -46 -174
5365 -174 35 48 -21 -129 -115 -140 11 -22 -124 85 -44 -21 103 59 -68 -145 -111 95 -232 43 -63 -5 110
5388 110 -162 -16 -52 70 305 -61 -289 236 -360 142 -199 32 -274 -218 383 20 -222 29 118 -186 -84
5409 -84 28 188 43 -3 71 91 99 10 95 -88 -24 -16 174 7 58 291 164 -80 -152 -53 254 -59 -60 57 52 99
5435 99 -186 -60 50 100 25 170 38 75 -9 -128 -12 58 41 -108 -55 25 -175 43 121 154 67 -63 142 277
5459 277 -179 -218 -237 -145 54 -130 -15 302 -185 -330 -18 7 85 -158 62 149 -30 -154 115 8 64 -35 -171
5482 -171 19 13 3 -14 237 -106 -205 40 77 -157 -143 4 207 -283 148 -200 -141 226 -84 9 -161 -65 81
5505 81 257 180 147 81 -148 -3 112 17 -111 31 75 33 -36 110 -97 17 91 -38 -7 -159 -167 -209 203 37
5529 37 166 -37 -56 -43 -24 134 -171 52 -103 -167 -82 123 261 142 -3 -118 -13 -157 1 -48 33 -132 105
5552 105 222 165 -316 50 248 -42 -214 -159 -55 116 36 -171 -201 -126 -47 30 179 -223 -47 -78 -16 -103 -305
5575 -305 341 -39 -96 151 -17 122 48 -87 105 215 -25 -208 14 -88 67 194 16 89 -75 111 268
5596 268 92 -79 121 -222 -54 23 241 93 -318 118 26 51 51 32 193 -137 42 348 -35 124 -127 -8
5618 -8 -94 -203 294 73 19 -28 -200 -56 96 58 102 -243 100 -124 -217 282 83 -74 -182 -218 -248 -266 -125 -25
5642 -25 -5 277 -8 -28 -19 -40 160 -145 -39 -93 -168 123 -75 -235 -72 -75 -185 12 -142 120 -51 139 -6
5665 -6 288 129 52 -141 -30 25 -226 74 369 146 59 24 233 224 16 -122 -349 -118 -269 -33 149 27 -22
5688 -22 -69 -100 -150 -2 -224 21 -5 -5 -175 53 49 -81 212 78 83 -111 247 -228 160 -105 -76 -47 -103 -244 129
5713 129 253 -186 175 -136 113 153 -156 -269 -134 -98 295 193 104 -152 -64 -95 48 237 80 -84 -13 63
5735 63 -92 -91 -271 95 -73 225 58 -82 69 -91 19 42 189 -256 -70 95 -80 -275 190 133 -123 346
5757 346 -70 -175 -199 86 -197 -20 60 205 -57 -248 -51 194 -20 37 189 -92 105 -25 199 250 77
5778 77 65 -165 -22 156 -52 155 266 31 -133 56 77 -66 48 -18 69 -269 -168 61 -14 -16 -100 207 271
5801 271 -114 -32 150 30 166 -265 150 -40 -27 71 180 -337 -285 -142 10 116 -147 -170 129 -420 -1 -30
5823 -30 97 -126 -147 -68 -132 84 -196 6 -111 127 75 -123 -127 -1 14 189 112 148 55 167 -41 2 -159 -175
5847 -175 80 223 -373 -281 -34 -185 228 -184 -220 -184 -199 3 -357 9 178 -284 -172 -126 -117 11 -27 32 -195
5870 -195 -152 17 -114 92 25 166 -182 -31 117 -267 112 60 55 -21 131 9 -17 26 140 23 -13 -180 184
5893 184 -24 141 163 -5 60 284 -264 112 130 -131 181 -97 -101 -114 -45 141 31 -214 61 -138 -42 -169 42
5916 42 28 202 -207 86 129 -186 113 -120 -305 177 -207 36 -8 -141 -198 68 -246 -73 64 -209 73 48
5938 48 120 7 52 50 20 122 109 -216 10 87 -31 -167 -87 -231 507 25 -76 -115 2 278 -147 -36 -190
5961 -190 -110 390 -243 -213 23 96 -269 -149 -106 245 118 -95 118 87 -27 12 -70 -9 52 -82 213 -105 -115
5984 -115 -128 50 -203 42 -96 259 248 192 -126 -33 201 -22 -81 -36 -189 225 54 24 -254 -93 71 65 207
6007 207 -302 77 -394 -30 50 38 -66 81 -131 -92 -215 -13 -29 -185 300 -67 213 192 150 19 182 -211
6029 -211 -121 3 11 -39 403 238 -59 -10 -28 88 -232 119 178 -27 88 262 75 131 236 -196 -89 65 34
6052 34 -165 138 302 -129 22 -6 169 -165 -253 144 -136 32 172 -81 35 -53 -24 25 58 231 209 -165 -53
6075 -53 -93 -254 -49 23 175 -156 10 -2 21 -169 -41 137 -107 64 -188 -129 -131 -102 229 1 124 -141 20
6098 20 -72 240 -39 -13 68 221 97 226 80 40 -126 -176 80 -101 56 -206 57 -40 -44 78 103 34 159 140
6122 140 70 122 -122 154 192 241 -18 63 -69 -59 83 20 63 81 57 297 -160 -3 -32 178 -160 44 173 -180
6146 -180 -154 103 -65 76 145 272 -185 -169 -90 23 -87 -98 -204 114 -75 -18 -104 243 194 172 -77 18 -56 262
6170 262 82 88 -50 -10 325 -58 101 -23 -57 7 -156 -220 189 17 -38 -51 6 -60 42 435 129 -11 -137
6193 -137 242 -127 77 -37 336 73 -110 237 -27 13 111 -118 -133 -157 -20 -118 -29 -90 -242 -304 72 -4 227
6216 227 273 38 266 130 -116 -222 -124 -128 -31 -10 51 208 -282 11 -189 -98 139 114 -52 124 147 335 198
6239 198 -51 -55 -16 61 -37 402 -16 69 181 55 19 30 -96 108 -342 51 18 -40 87 -267 7 6 94 -9
6263 -9 -2 -152 -280 12 224 377 -16 -219 -54 227 161 136 26 86 -92 211 130 -52 232 -6 215 -118 -153
6286 -153 42 -170 134 -30 118 242 -60 -44 -57 86 -50 30 -184 34 274 -35 -21 -47 -137 240 170 -151
6308 -151 0 139 277 8 -53 357 -91 21 -155 101 -61 -64 236 -185 73 -189 30 -78 -162 -70 5 -13
6330 -13 -151 113 -3 311 440 -111 38 8 -272 44 -111 90 220 -15 140 150 110 188 21 -10 -36 -18 143
6353 143 87 -61 46 46 -21 136 -41 -80 -26 -183 107 60 271 183 47 -130 -217 34 -62 203 -181 -112 -68 -388
6377 -388 0 123 132 24 49 -50 15 -150 -109 1 22 17 -106 0 5 -243 -96 124 -146 146 -8 -126 41 27
6401 27 -63 -171 -101 -189 -46 -111 -40 19 -153 64 282 -40 14 82 -34 -129 -129 99 61 44 -171 215 183 25 176
6426 176 -193 147 35 -17 -71 -86 -114 -3 -287 -252 -105 -94 17 -128 -158 -8 147 67 -83 71 170 -98 7
6449 7 41 -120 88 27 109 129 19 -222 71 13 -26 -10 209 244 -220 -285 -69 71 -17 182 -38 6 128 -63
6473 -63 46 247 111 223 190 -38 -113 -111 76 140 21 -47 -79 319 -126 267 231 -40 249 -39 -25 -81 150 -109
6497 -109 -57 44 -70 326 75 -56 22 78 55 -50 -16 68 -92 -6 83 -22 -89 -141 64 -3 113 22 51 -157
6521 -157 -304 154 256 99 -126 -132 -46 -127 -25 -37 61 183 -80 91 59 288 -86 194 9 105 17 -174 -158
6544 -158 -65 189 -207 31 -39 13 153 105 152 107 -134 207 -46 218 -143 51 -16 200 161 -143 -136 -43 -89 -12
6568 -12 -118 103 -16 -102 -197 -95 123 202 95 1 -25 -33 153 207 -74 7 97 166 26 -66 115 13 -86 288 343
6593 343 157 -11 263 88 246 -1 67 -106 28 -215 -174 -21 20 42 -34 -111 -68 127 292 -98 83 -6 -179
6616 -179 96 -50 -62 -82 142 -194 67 32 152 -99 255 -230 -96 189 -51 -103 5 22 152 78 123 -167
6638 -167 170 -85 22 195 148 -113 -42 -188 16 -21 176 -37 -68 194 -80 93 51 2 -41 -411 100 -112
6660 -112 -187 -18 34 -255 -25 -225 124 -14 -135 -80 58 29 46 218 136 -201 25 144 57 215 -129 199
6682 199 13 111 32 202 102 105 -183 121 -156 -44 54 95 -204 -124 -191 220 229 16 84 309 245 -32 67 -7 -252
6707 -252 165 -20 9 -420 -332 86 176 56 56 -97 -28 333 -184 49 103 82 23 -131 -65 175 -63 329 114
6730 114 -261 269 -28 33 -70 119 -46 51 5 285 -63 -25 99 -36 133 -10 113 -71 88 -318 -110
6751 -110 -131 220 -4 -125 -77 -268 40 183 -49 -215 -91 -84 13 -111 53 -137 73 -185 43 104 -154 -110
6773 -110 -30 -141 -137 -96 6 36 -96 126 -65 191 -59 -46 -180 -298 -194 -46 40 -208 236 282 112 63 263
6796 263 253 -240 130 -10 180 -293 -40 131 5 -83 1 -138 -318 243 -163 139 -83 -48 7 181 -26 35
6818 35 7 8 -74 -36 105 -50 -179 8 191 36 -177 -100 62 162 -38 -94 -122 142 -75 -17 -43 -127 285 -58
6842 -58 -34 -119 -112 -78 -7 28 -126 47 -240 177 283 -135 -129 -136 155 -146 88 -307 51 -160 -139 59 -200 -40
6866 -40 316 -11 -18 2 -176 -10 -222 339 -23 -130 -61 -4 -50 -26 12 6 142 100 100 -47 6 -89 83 40 4 43
6892 43 -37 190 24 -32 -41 -283 288 41 -9 -9 53 -119 -17 249 -67 297 -109 -282 43 -209 10 48 -198
6915 -198 13 93 79 185 81 -172 -214 67 124 -263 -32 250 67 176 27 -181 22 85 -57 -1 31 301
6937 301 -31 -39 4 106 -96 -120 -103 -125 322 -21 103 -165 64 -7 55 -190 64 -187 -113 -87 -203 28 -110
6960 -110 63 -68 174 17 -141 226 -163 -186 -97 -3 -139 252 -74 -300 88 119 -70 -200 -90 -264 -75
6981 -75 95 36 -218 -114 30 183 113 104 -127 231 -7 98 -2 -58 -174 81 33 -188 16 -58 -134 199 -38
7004 -38 -61 320 -70 192 -230 164 -418 121 87 89 79 -42 183 120 -169 97 41 -106 228 21 -148 2 -19
7027 -19 1 -264 15 -311 -234 38 -66 325 -22 125 63 215 17 -126 94 120 -2 99 82 240 207 29
7049 29 186 103 18 -23 20 -208 257 71 -140 -152 -56 36 -145 113 -70 -276 43 48 136 -90 42 22 -25 -132
7073 -132 -63 -60 187 -24 125 196 85 59 -98 90 -12 -328 150 -185 58 -145 -320 -23 -85 227 59 124
7095 124 121 15 -125 -307 228 -267 75 -77 -131 5 -187 -142 -26 -73 -291 123 41 27 -10 144 -6 -82 33
7118 33 113 -93 -24 -182 -38 -156 -65 -210 -37 105 28 -148 225 6 130 220 117 -30 -129 157 -150 181
7140 181 237 198 166 -79 -21 141 176 147 157 57 -68 8 -15 -27 52 137 55 137 117 95 480 -68 -115 -241 -65 -123
7166 -123 -331 -74 -18 -188 196 -16 49 113 -8 15 94 76 131 198 -54 -152 -9 295 -133 64 -159 -167 -173 52
7190 52 -181 -16 -53 46 252 70 -166 65 133 -1 -3 48 -34 -235 -126 322 161 -70 237 -86 67 -157 103
7213 103 -120 -9 39 43 164 -112 51 178 159 23 131 18 -135 66 23 153 -61 -5 -93 116 -301 126
7235 126 50 -217 72 42 85 -162 86 48 145 -57 -134 242 51 -273 -323 -266 363 92 207 -210 -221 -232 -86
7258 -86 -371 27 -331 -2 -75 107 306 52 148 -136 117 275 -125 202 -84 -123 -64 -49 16 -15 -230 -76 4
7281 4 -56 43 376 35 72 -24 183 -210 -7 -95 199 -210 -201 1 -281 -29 78 -8 -120 -123 172 249 -155 272
7305 272 -196 9 92 288 197 41 94 98 -238 -67 -96 -116 180 -44 382 279 294 -21 105 -107 -82 304 -159
7328 -159 145 -152 -78 304 94 96 -167 34 -161 79 20 49 129 8 5 64 -117 93 48 -311 67 -232 45
7351 45 276 39 -181 -6 -57 -168 -146 16 -151 33 100 116 256 -35 250 126 -34 143 167 -4 17 -213
7373 -213 127 -139 -28 54 -177 -75 83 117 243 -335 -321 185 41 -49 7 -230 157 -184 123 68 131 -144
7395 -144 180 173 4 84 -192 79 -81 -54 190 -92 185 194 126 41 -41 90 -42 63 51 -200 -91 166 111 170
7419 170 -51 164 36 -168 -60 3 148 -212 -13 -140 -5 255 -205 206 170 73 -28 238 -59 130 -70
7440 -70 -11 304 322 -314 -185 -76 -136 -211 -53 -105 -188 -31 -4 51 -31 59 8 66 115 -128 78 224 -5 113 179
7465 179 107 -151 77 213 232 78 222 -51 249 53 11 -45 53 -134 -157 -35 -27 -155 166 360 -171 -75 180
7488 180 -49 67 -48 -61 -143 -229 24 35 -172 -168 -96 -212 -75 -24 40 -156 -3 -95 172 -16 21 -44 -97 -121 261
7513 261 215 211 -240 -61 111 -237 -108 77 -36 29 -265 -129 22 90 187 -133 201 -3 -60 -47 -181 110 -32
7536 -32 93 112 -106 169 -37 80 219 -26 3 -64 -149 114 52 99 6 194 198 -39 -59 136 7 -296 -146 -72
7560 -72 256 -72 -12 153 114 130 3 -201 7 105 -250 -62 -85 225 -140 139 -183 -139 -171 -134 -294 134 -98
7583 -98 170 277 -63 -145 126 -186 139 62 -277 -319 -34 61 10 125 -10 37 -101 -60 -48 231 -276 26 -93
7606 -93 126 -181 101 91 158 106 -99 -302 -59 -232 -73 -38 -131 -58 70 -311 -39 160 -382 -33 -209 205
7628 205 -36 -71 7 88 -367 305 119 259 -67 204 37 79 -6 307 125 -246 145 -120 49 79 166 -215
7650 -215 -131 -127 69 -141 -262 165 15 -52 -59 -204 110 94 200 228 64 -37 105 47 85 36 33 17 -120 -90 -97 -69
7676 -69 -145 177 -182 277 21 -235 119 -10 -85 -197 -27 -59 -95 -138 297 310 -143 -25 29 -240 172 -152 -105
7699 -105 73 75 139 65 -151 -118 -257 92 422 -37 73 -201 137 -131 -3 -198 138 143 18 127 163 9 12
7722 12 -40 99 -147 -130 -65 -214 316 30 36 22 -61 43 -20 45 75 178 -37 -4 -146 -181 207 123 233 -261 -70
7747 -70 308 -138 91 74 143 -102 -70 -130 -67 -68 -239 67 -8 -96 -342 -142 -141 92 185 138 -145 112 -81 158 -116
7772 -116 -205 -170 128 42 -69 61 -49 -83 -101 13 130 135 -257 -128 84 134 -112 239 -16 -100 -31 -20 311 -281
7796 -281 59 -87 196 209 46 288 -38 -191 151 329 -39 -91 107 46 -173 -80 226 280 -95 103 -166 -112
7818 -112 27 5 140 -87 -1 -96 -102 -236 -102 -307 -230 53 133 124 299 -133 37 -84 -50 22 -117 -87 510 -7
7842 -7 -16 -7 59 300 -57 80 211 -31 247 -188 -133 -125 -343 93 375 -120 -172 187 35 184 181 63 209 -25
7866 -25 198 176 187 -279 15 31 -63 17 -167 20 -126 -169 -101 228 69 -17 -15 -41 187 93 -100 -257 126 -459
7890 -459 182 358 -153 57 50 -198 -53 -204 264 108 53 -171 -202 -125 26 -79 -48 -183 -184 110 -110 -61 31
7913 31 315 177 -49 -5 -241 -96 5 -36 22 -34 -133 46 -10 183 -42 90 -16 30 -52 -95 134 2 -331
7936 -331 -2 202 -47 -98 -80 77 -73 313 138 -98 -111 50 -4 39 92 -30 98 41 182 -156 93 -96
7958 -96 -116 141 -147 127 -215 182 122 55 72 -40 -99 71 30 155 63 49 -232 -97 -101 78 31 -164 -50 -223
7982 -223 -182 -83 -45 222 -64 -20 53 47 214 66 84 7 -258 44 -64 26 188 -135 218 286 261 -162 24 54
8006 54 123 192 -89 262 14 167 92 -28 30 -27 8 110 -19 254 61 -46 73 104 291 299 57 -325 -14
8029 -14 285 -222 -53 -136 54 -110 -250 -9 324 -118 -159 -86 102 71 134 288 -83 95 294 -98 193 40
8051 40 -36 239 240 -17 -168 -17 11 17 165 -93 30 99 -100 64 106 -46 -229 38 263 -32 15 148 127 82
8075 82 -152 -185 201 -23 -65 142 -230 2 -117 -61 -115 139 -59 74 -69 -26 9 144 -78 233 -18 -68 -118
8098 -118 -209 257 82 14 398 -64 -39 -132 57 -135 123 -75 -84 20 -167 189 -23 -60 104 9 153 37 197
8121 197 109 181 192 -148 -53 206 329 -340 -259 -153 -10 85 106 -172 18 -62 309 45 56 190 -144 165 -66
8144 -66 -65 -62 -39 93 -24 -33 -80 -103 197 80 -29 116 363 -55 -286 11 3 1 301 -18 125 -429 193 -4 153
8169 153 -376 -35 26 91 -106 -19 -47 -81 23 -135 169 -214 314 -83 81 -414 -6 47 -52 119 106 -6
8191f
$$ Imaginary data points
##PAGE= N=2
##DATA TABLE= (X++(I..I)), XYDATA
0 0 0 0 0 8 -8 0 -8 8 -16 16 -16 24 -32 33 -40 56 -64 73 -85 104 -121 139 -161 185 -214 244 -275 310 -357
29 -357 397 -446 503 -563 628 -699 777 -865 961 -1061 1176 -1304 1443 -1596 1767 -1964
45 -1964 2179 -2423 2704 -3032 3413 -3867 4419 -5109 5999 -7180 8843 -11366 15594 -23974
59 -23974 46723 -228264 -626929 240933 482810 -240659 -357248 346880 260489 -434849 -253328
70 -253328 457171 202324 -455447 -166603 448196 134209 -407932 -124591 312277 36992
80 36992 -249105 76373 279336 -129495 -346005 68322 340198 8931 -248373 -7139
90 -7139 180440 -42764 -169537 82390 194901 -83923 -189853 115717 210722 -142957 -245450
101 -245450 142759 267929 -101294 -199517 125788 115360 -219369 -82645 319778 116239
111 116239 -335855 -116316 304553 46414 -299665 37467 317149 -98563 -316099 148244
121 148244 278621 -233657 -271339 291708 269943 -303246 -237610 277247 128166 -311755
131 -311755 -38263 369565 1274 -398943 -3143 353878 -39271 -308504 103146 294072
141 294072 -139284 -283300 139932 240732 -150811 -190328 191461 189004 -197764 -197453 169105
152 169105 182822 -133958 -126757 160551 115535 -189006 -137656 192037 162137 -161041 -131092
163 -131092 174144 104422 -215192 -106585 245247 121306 -237686 -96473 236758 43077
173 43077 -271680 -14790 296494 658 -288039 28352 256517 -100628 -265063 144315
183 144315 270673 -157811 -247972 156319 174428 -203562 -128319 250287 110205 -264767
193 -264767 -96712 238332 44078 -226956 9911 231788 -34887 -217173 50495 178937
203 178937 -83676 -147976 128951 158199 -125635 -151858 100593 115651 -85499 -57121 121061
214 121061 50252 -139216 -62719 132673 71813 -106510 -47165 114822 40286 -126001 -47953
225 -47953 121361 44613 -110166 -12796 129637 -14384 -174179 -507 184671 13241
235 13241 -163396 5784 136917 -64858 -156123 93397 169433 -105183 -164255 111774 131299
246 131299 -149936 -124839 167369 115730 -163131 -84707 157354 27740 -185925 2781
256 2781 215778 4155 -202069 -415 162092 -35249 -135821 84295 147137 -91461
266 -91461 -138400 89096 112890 -94204 -81324 121729 87666 -113989 -82531 92552 55442
277 55442 -82859 -14415 111879 14762 -128404 -37139 109278 38388 -82960 -10402 86428
288 86428 -12079 -111660 487 108449 663 -95359 17646 90846 -48923 -118608 41579
299 41579 118540 -35864 -96881 48960 69634 -92689 -82413 107201 92523 -97934 -74920
310 -74920 92779 37331 -117267 -22346 138085 28621 -124173 -12452 107906 -21607
320 -21607 -110166 49932 130532 -39239 -114118 39898 85130 -60815 -64502 94504 80149
331 80149 -87564 -75400 72370 48754 -73081 -19012 98469 24411 -101119 -34080 78408
342 78408 17534 -66491 10636 80628 -17738 -96629 -1903 76815 -3177 -59459 25295 60748
354 60748 -45707 -84460 29045 75116 -23541 -54420 38494 42412 -67336 -61374 63907 64934
366 64934 -50347 -44038 55325 21201 -80928 -24448 91054 35670 -73017 -17204 67151
377 67151 -9545 -79803 22520 97322 -7879 -78753 16741 60909 -39492 -57273 61747
388 61747 73829 -49936 -63009 44381 38821 -56904 -22839 78842 32887 -74395 -34326
399 -34326 56205 11443 -56805 8092 71030 -7913 -76460 -4834 54449 -9783 -46611 28040
411 28040 52725 -35875 -65615 18325 47675 -21763 -32158 38082 31035 -52497 -46519 40382
423 40382 40440 -31428 -21550 42888 13691 -58190 -22700 56086 26286 -41135 -5878 46979 -6327
436 -6327 -59866 5835 66355 5292 -47043 10661 42087 -27771 -48553 35857 59398 -23848
448 -23848 -43624 28684 28807 -45317 -27881 55404 36101 -46301 -27686 37585 5545 -49990
460 -49990 839 59508 4471 -55789 -7924 36947 -12650 -39672 22590 47118 -21555 -49377
472 -49377 10393 29062 -22719 -23071 35819 29421 -37548 -37052 23118 23947 -22467 -9126 36605
485 36605 11522 -42677 -19539 35131 17317 -25910 285 38048 -1646 -44801 -4023 42417
497 42417 8455 -25846 11575 31846 -21508 -41768 19925 46269 -9435 -30299 19166 22212
509 22212 -33357 -26388 36952 29824 -29804 -18849 30205 4175 -44345 -7537 46205 11772
521 11772 -36530 -6742 23313 -15364 -33663 19654 40786 -14384 -38452 6357 20340 -19500
533 -19500 -18982 26810 23141 -23563 -23165 15503 9729 -22148 -4257 33892 14597 -29530 -19606
546 -19606 17509 10768 -11931 6593 28376 -2515 -34020 -5048 30542 7880 -18962 7563
558 7563 26737 -10006 -32550 6862 30408 -4438 -17495 19315 19618 -30640 -30311 25913 30420
571 30420 -16666 -15645 20804 2111 -37293 -7416 38228 10056 -31142 -4225 23316 -12285
583 -12285 -33449 10464 33712 -6913 -25819 7771 11650 -22941 -16942 26442 23087 -17950 -18957
596 -18957 10034 4253 -17791 -30 26480 9899 -20149 -11701 11068 3885 -9336 7009 22997
609 22997 1672 -22307 -7507 15836 6003 -8944 7389 20410 -5209 -25234 -691 20496
621 20496 -36 -11592 14752 18362 -21096 -28643 13486 24971 -9190 -11777 17100 2946 -32099
634 -32099 -10799 30735 10416 -25983 -3458 23206 -8146 -32470 4125 27203 -4864 -17666
646 -17666 12984 11240 -28182 -21308 25366 25261 -13625 -15549 8649 -57 -16687 3311 24623
659 24623 3515 -18355 -2695 14199 -813 -14138 2946 19142 7727 -8412 -5380 1358
671 1358 -3642 -3076 13543 20371 -2764 -23530 -7769 16008 8874 -7213 3029 11489 -8384
684 -8384 -17937 6360 15316 -10673 -13559 17874 16904 -21871 -24785 10849 13297 -9725 637 17923
698 17923 -10275 -33748 338 30231 2467 -21255 2980 13566 -14051 -16419 14883 13155
710 13155 -15022 -5575 21441 4291 -25860 -9867 20082 11634 -5522 2683 5579 -13078 -12885
723 -12885 13963 21095 -906 -11886 192 5687 -2462 -3706 5419 8280 589 -2878 621 794
737 794 -7447 -6189 9902 17600 -1347 -18465 -7026 7474 -318 -3449 11259 8809 -17424 -17576
751 -17576 11362 12060 -13531 -8147 17306 5518 -21791 -9162 14437 -635 -14782 10160 21026
764 21026 -13489 -27580 5573 19938 -4341 -7346 14009 4346 -21488 -7699 19874 8322
776 8322 -12075 1563 15036 -3837 -15757 2840 13460 590 -2532 8663 3694 -12690 -8422
789 -8422 9121 11423 1489 -2242 -933 -3465 -5585 -484 6942 6967 -505 -6442 -3414 759 -3403
804 -3403 -4447 6398 9914 -4882 -12761 -1135 3582 -6920 -2564 13909 6026 -16471 -11064 8876
818 8876 2983 -10119 4717 16373 -6021 -20001 1642 13992 -4564 -7495 14334 9951 -16109
831 -16109 -11958 13259 8802 -9253 2194 16124 -1658 -17701 363 14464 824 -5410 8704
844 8704 7774 -11159 -10679 8038 9786 -2101 -1233 5098 -2138 -9723 -2168 7201 4597 -1531 -1265
859 -1265 -524 -3236 -5672 -2067 4909 5995 -1404 -6800 -2844 -637 -4840 -1579 8595 5388 -9112
874 -9112 -8783 3439 2174 -6486 1799 11893 -617 -13704 -1621 9304 -2299 -6796 10024
887 10024 11475 -9640 -11584 7494 7894 -6190 206 14297 1676 -14815 -2505 12341 1602
900 1602 -6305 7285 9847 -7750 -11583 5425 9379 -3150 -2374 7759 972 -10802 -4531 7209
914 7209 3644 -3817 205 2949 -4107 -7871 -1052 5025 2477 -1563 -1310 -1247 -4176 -5115 214 6187
930 6187 3480 -4463 -5238 180 142 -3740 1717 8089 875 -7319 -1864 5283 -2016 -5250 6736 10084
946 10084 -3680 -8857 2875 4914 -4036 385 12032 3625 -11245 -4366 8725 2561 -5548 4177
960 4177 8843 -3948 -9977 2879 6873 -3796 -3455 8283 4509 -9261 -7247 4252 3137 -3158
974 -3158 1445 5300 -3915 -10360 -1678 5692 1509 -2864 516 1179 -4359 -5349 613 4000 508 -1499
990 -1499 794 412 -3967 -4860 1885 6798 2680 -2840 -1402 840 -2731 -2278 5976 7883 -1967 -5391
1006 -5391 1602 3346 -3274 -907 8648 5097 -5360 -3491 4299 607 -5221 3028 10019 -3
1020 -3 -8710 -1233 4099 -2301 -2730 6838 5703 -7007 -7733 2374 2797 -3265 232 6042 -461 -8500
1036 -8500 -3442 3673 316 -2732 2448 3936 -4048 -7242 -765 3290 633 -17 2760 674 -5213
1051 -5213 -4861 1705 4966 1734 -332 581 -549 -3910 -1681 4498 5410 149 -1706 1362 418 -3455
1067 -3455 -639 5917 4477 -1538 -1713 1311 -1222 -3817 2774 8140 1329 -5921 -2232 1792 -2113
1082 -2113 -2195 5019 4736 -4241 -5784 959 1333 -4092 -1197 5320 1657 -6062 -4006 1160 -886 -2533
1098 -2533 3015 5344 -2633 -7494 -1797 2964 511 -423 2990 1420 -4087 -3875 1861 3084 3
1113 3 287 2872 1132 -3418 -2594 2292 3482 1527 1132 1748 -1375 -4065 -388 5054 4080 -955 -1033
1130 -1033 883 -724 -2544 1029 4437 880 -2590 -593 1021 -2514 -3566 2242 4905 -896 -4291
1145 -4291 -860 -408 -3158 -440 4930 1750 -4838 -3979 1216 213 -2221 651 3881 -617 -4222
1160 -4222 -913 1997 -924 -1140 3196 3448 -2447 -3603 734 2070 61 1135 3398 711 -3070
1175 -3070 -1460 2268 2353 93 1034 2008 -241 -2531 -594 2648 1761 281 716 905 -1398 -2958 465
1192 465 3320 1166 -1343 -241 192 -1899 -2383 1313 3197 -362 -2055 -284 -95 -2885 -1587 2646
1208 2646 1991 -2231 -2179 515 -492 -2577 574 3840 642 -2971 -1147 1247 -775 -1426 2115 2990
1224 2990 -1261 -2559 531 1369 -609 412 3341 1815 -2204 -1610 1324 1408 -197 1480 2787 -25
1240 -25 -2560 -764 1291 1086 348 1084 1122 -1189 -2426 -404 1888 859 -580 87 215 -2062 -2254
1257 -2254 448 2155 216 -1300 -23 -591 -2882 -1635 1872 1722 -948 -1577 85 -673 -2066 -301
1273 -301 2723 928 -1876 -1089 661 -1097 -1553 1734 3249 230 -1963 -168 466 -1039 314 3309
1289 3309 2191 -1423 -1735 716 342 -317 1314 2492 416 -2113 -536 763 109 -157 1338 1789
1305 1789 -914 -2651 -966 541 319 465 678 10 -2463 -2484 66 1368 543 -622 125 -515 -2066
1322 -2066 -1656 546 1165 -163 -179 478 -890 -2869 -750 2216 2064 -661 -848 -20 -1486 -1391 1973
1339 1973 2942 622 -1401 -82 963 -839 -339 1992 1885 -221 -707 474 -210 -1034 858 2933
1355 2933 1458 -1598 -1473 -519 19 245 1651 1334 -1120 -1878 -651 430 -57 149 831 640 -1088
1372 -1088 -1570 -1061 -138 -21 365 1255 -345 -2122 -1904 128 1163 814 205 -187 -1157 -1622 -179 1349
1390 1349 997 -357 -151 413 -387 -1419 93 1971 1151 -108 437 -391 -1278 -390 1889 2247 199
1407 199 -636 -62 -145 -374 431 1762 1090 -642 -577 383 -686 -826 534 1413 339 -1113 -933 -139 -489
1426 -489 -93 1299 920 -1033 -1708 -841 -129 30 252 601 -125 -967 -1036 198 276 -6 575 439 -441 -1338
1446 -1338 -1023 318 808 420 581 462 -757 -1240 41 1221 859 70 420 363 -830 -633 1046 1305
1464 1305 387 159 48 104 -869 -410 1260 1254 -133 -196 -13 -761 -1072 280 1127 236 -563 -394 -422 -762
1484 -762 -414 470 759 -75 -978 -499 -346 -534 -548 486 59 -828 -964 -116 -228 -235 479 1002 51 -848 -560
1505 -560 173 350 198 1004 440 -228 -547 87 706 430 404 725 551 -504 -877 485 732 579 420 407
1525 407 -35 -830 -465 652 432 133 279 72 -730 -915 100 943 600 -154 -98 -211 -853 -391 47 790
1545 790 66 -577 -527 -256 -761 -525 549 451 -252 -812 -421 6 -149 97 647 434 -607 -587 37 181
1565 181 145 1122 1016 -128 -763 -220 442 383 341 850 447 -623 -732 421 394 486 451 465 -37 -866 -738
1586 -738 142 289 325 525 -144 -843 -948 -501 421 140 -400 -252 -622 -750 -789 -114 343 315 -194 -189 -553 -693
1608 -693 -384 323 947 209 -622 -309 -229 -236 484 992 515 -526 -699 104 69 89 514 1071 372 -577 2
1629 2 -92 -202 261 1198 656 -508 -741 -49 256 327 607 892 -427 -861 -190 127 222 128 279 277 -821 -876
1651 -876 -442 -7 9 182 -21 -575 -608 -591 -20 622 418 -137 -596 -336 -259 -312 360 528 611 -319 -224 -300 -255
1674 -255 50 615 887 -245 -296 146 70 -152 415 1079 289 -263 -75 266 -233 241 994 637 -390 -232
1694 -232 -227 37 -189 76 751 125 -623 -595 -2 -191 -133 371 194 -199 -608 -247 -197 -96 239 198 -165 -714
1716 -714 -636 -426 62 271 163 264 -41 -316 -339 12 -57 148 214 -252 -430 -356 -39 422 615 309 24 -154
1738 -154 -256 -240 176 529 555 -104 -382 -48 149 -150 146 710 82 -145 -279 -41 -387 -85 355 357 -506
1759 -506 -194 -298 210 -150 430 559 -112 -322 -328 -311 -443 -147 311 103 -261 -245 -321 -477 -40 401 349 -210
1781 -210 -487 -325 -10 332 391 651 -105 -33 -478 -29 271 698 358 157 282 -79 5 -55 447 552 222
1802 222 278 -47 -99 -389 343 377 9 -443 -11 -139 -339 -189 334 557 -140 -655 -89 -209 -821 55 459
1823 459 -74 -702 -403 17 -533 -184 565 413 -197 -397 -160 -164 -236 552 640 -113 -139 -204 -135 -225 286 712 289
1846 289 -82 -128 20 -104 257 539 413 119 -19 -9 102 137 410 302 7 -16 -238 -286 19 477 280 -419
1868 -419 -356 -147 -703 -16 272 294 -237 -264 -281 -380 -450 -62 499 -292 -606 -565 -95 -204 -458 301 487 227
1890 227 -748 -337 -223 -268 219 718 118 -336 -159 -43 -164 301 571 512 42 4 -23 11 192 512 540 303
1912 303 -144 -126 -185 212 453 425 57 -547 -135 -137 -376 283 430 86 -99 -193 -617 -234 7 273 193 -397
1934 -397 -242 -220 -533 -350 228 232 -321 -185 -74 -396 -368 79 412 -106 -565 82 -148 -83 263 387 428 -268
1956 -268 -238 139 -88 -131 679 506 181 144 427 -224 -126 184 500 255 -281 -74 223 -155 108 334 320 -251
1978 -251 -369 -191 -272 59 131 164 13 -190 -360 -470 -221 129 5 -184 -173 -284 -454 -385 284 255 5 -297
2000 -297 -7 115 -497 -102 474 -30 -146 -21 158 -400 -176 644 433 217 34 -15 -182 172 448 507 327
2021 327 -241 77 -151 -240 450 606 327 -19 -73 138 -79 21 679 346 -178 -82 -126 -376 -351 271 451 26
2043 26 -449 -82 -95 -597 -40 313 144 -307 47 -357 -547 -24 345 219 -4 -96 -72 -426 -200 311 367 -13
2065 -13 -54 -3 -268 -480 122 600 213 196 139 248 -322 147 342 372 4 408 66 -388 -67 647 553 -194
2087 -194 155 -51 -417 -224 157 670 182 -152 -109 -361 -514 -275 516 356 -437 -222 -49 -638 -128 92
2107 92 196 -270 -235 -79 -371 -368 -55 211 39 -125 211 -454 -511 248 147 -129 -20 58 -11 -33 -132 619 304
2130 304 121 425 67 -196 -118 1020 418 148 160 39 -237 -331 579 676 63 -124 99 -96 -793 55 22
2151 22 -41 -155 64 189 -665 -333 357 232 -137 38 35 -571 -656 124 319 -281 -263 -206 -117 -363 -44 390 -149
2174 -149 -287 210 -7 -93 89 311 130 31 150 145 -168 -46 466 241 40 12 626 -20 -250 414 476 206
2196 206 189 335 -68 -343 -25 517 104 -432 366 -234 -293 -554 548 266 -88 -82 156 15 -373 393 339
2217 339 32 -467 81 -367 -677 28 598 151 -373 102 36 -569 -111 506 -38 2 -11 152 -235 -119 342
2238 342 392 -57 56 274 11 -88 240 419 63 197 268 -69 -103 60 546 138 14 -77 151 -458 -351 230
2260 230 124 0 -32 -86 -691 -310 106 104 -404 -21 130 -209 -903 -21 381 -267 -326 -86 -40 -707 -258 298
2282 298 -154 -10 132 -5 -412 -190 329 169 27 146 272 -157 -261 273 438 -65 144 296 1 -105
2302 -105 48 426 200 -7 286 240 -292 -172 339 106 -275 290 226 -564 -609 354 207 -240 160 324 -159
2323 -159 -505 -82 315 -297 -290 309 -126 -622 -173 309 180 -328 233 17 -387 -250 -151 19 -222 93 368
2344 368 -119 -533 31 360 -51 185 365 93 -428 166 248 602 -11 470 300 -145 -173 293 398 72 76
2365 76 139 -227 -701 143 233 58 -156 450 -159 -177 -165 598 -23 -235 381 -167 -400 -249 139 220 -587 184
2387 184 -38 -317 -654 -20 14 -252 32 274 -47 -358 -94 267 -50 -78 315 40 -197 -273 185 376 -64
2408 -64 391 393 -299 -169 251 200 -30 103 598 54 -339 -33 408 173 49 389 212 -584 -18 584 129
2429 129 74 270 -79 -345 -183 349 267 -95 88 21 -529 -310 -72 327 -54 28 255 -48 -632 -306 371
2450 371 -189 -333 16 -21 -440 -571 84 1 0 195 563 -191 -347 308 299 127 305 520 43 -390 82 432
2472 432 5 -36 803 143 -354 -46 187 331 89 278 29 -159 57 254 183 -417 201 65 -346 -110 246
2493 246 143 -356 -241 87 -252 -289 -279 257 -229 -209 -78 221 -540 108 117 -83 -127 -64 343 -267 -119 -209 267
2516 267 0 57 113 -187 -209 -24 252 -98 127 500 128 77 14 491 258 55 493 1 43 -297 189 26
2538 26 -150 71 224 -90 114 366 -70 -84 33 43 72 -327 -167 -74 21 -173 -82 -251 -354 -60 329 312 -210
2561 -210 -163 321 -247 -550 229 127 115 -30 387 -157 -368 56 -87 84 -129 462 356 -162 0 108 275
2582 275 53 419 198 -162 -293 547 248 -57 189 246 139 -70 175 81 -286 -128 378 -190 -84 -306 82
2603 82 -117 75 283 -70 -500 -203 121 -47 -219 70 150 -360 -183 -65 57 -114 -116 354 -52 -680 -200
2624 -200 238 -141 -117 46 234 -282 -57 245 323 130 196 364 -384 27 40 -54 74 183 243 167 126 129 268
2647 268 77 430 497 -142 -300 -119 65 35 48 66 166 -174 -159 1 177 -159 196 404 -155 -220 -72 -5
2669 -5 -147 25 -80 71 -655 -329 30 -59 -171 89 -31 -287 -473 73 -27 126 42 188 4 -233 131
2690 131 -94 -194 229 302 31 -112 -113 165 182 -112 339 188 -184 -146 -30 156 25 80 -82 -240 -161 -2
2712 -2 -16 -262 55 280 -170 -93 299 -183 -173 -47 417 52 -368 -266 87 -294 43 24 63 -351 -141 -93 -184
2735 -184 -472 -37 443 -183 -216 96 -14 -172 114 68 276 -290 152 389 74 366 297 191 -158 -68 255
2756 255 72 -132 388 437 -51 -284 122 157 -532 26 252 -7 -379 -31 -130 -240 -393 124 81 -284 -38
2777 -38 -80 -165 -538 -88 124 -159 -76 377 -9 -101 -97 -185 -136 -111 98 197 -149 62 134 183 -370 -104 118 1
2801 1 -218 195 195 -39 -85 39 98 -304 137 284 24 88 -15 170 -418 95 197 -100 -46 49 13 -14 -161 365
2825 365 280 -13 -77 -126 101 -124 91 212 -127 -302 196 -7 -156 166 341 17 -263 -44 -51 -164 166 40
2847 40 40 -312 -44 -221 -319 89 165 118 -578 -30 96 45 -124 -57 181 188 89 311 27 -203 275 189 92 -209
2871 -209 -86 57 -176 -3 382 167 -71 -412 -69 -252 -173 43 -211 -159 -267 -104 -197 -389 -47 265 -66
2892 -66 -369 90 16 -21 -409 22 -110 -428 -175 -175 -194 -22 75 113 -67 -233 213 28 57 13 211 -105 321
2915 321 -29 -32 -103 -54 357 -10 -113 191 342 276 28 238 296 71 -31 286 56 -114 124 258 -244 -388
2937 -388 253 126 -193 -215 83 -201 -315 -60 -175 -185 63 17 -30 -395 -139 -150 -277 -83 -69 394 -230 -492
2959 -492 -73 62 -46 -20 450 114 -336 -67 -38 -61 44 456 67 -237 -5 258 -108 109 -19 165 63
2980 63 133 164 -9 -148 133 261 -10 -245 -3 156 -117 -96 340 136 -178 -7 9 -134 -3 9 257 -358
3002 -358 -119 10 79 -112 145 106 -222 -222 273 104 -500 -186 262 124 -157 -26 -52 -135 -82 229 304 -155 8
3025 8 104 -387 21 211 121 -46 196 66 1 -164 335 335 -30 166 137 188 7 -72 245 185 -10 -93 271 -9
3049 -9 -211 158 114 -307 26 -295 143 -168 -42 -167 7 -168 0 -328 -445 -335 11 36 71 121 30 -119
3071 -119 -73 -302 -85 -37 -251 8 -274 -33 211 139 261 206 299 240 -347 88 167 269 157 149 -316 75 158
3094 158 300 286 95 -134 32 51 -68 160 -88 -56 -68 -66 -132 -416 -35 -61 37 -242 211 -30 -219 -106 -86
3117 -86 -357 -230 113 -37 -183 -124 167 104 42 -245 41 5 -280 -131 102 80 4 -18 95 -117 -59 234 -6
3140 -6 125 263 50 -138 -141 301 172 -77 -137 79 -180 -21 70 62 52 -43 268 47 31 114 35 -10 -97 102 87
3165 87 -140 129 -16 -175 -171 117 -86 34 -289 -52 -133 -88 6 77 -171 -99 -194 250 203 -206 -38 -27 -133 -181
3189 -181 2 -163 60 415 -37 214 175 276 -160 17 -128 42 -40 70 47 157 73 -65 234 156 -346 -45
3211 -45 204 138 -178 347 -79 -346 -66 51 -34 -414 -5 291 -108 -390 457 -143 13 145 221 -270 -5
3232 -5 -35 -59 -81 258 -141 -104 -156 -130 -152 262 111 60 -16 3 -354 130 100 63 233 47 142 -147 227 243 116
3257 116 -142 -18 -23 -230 -6 279 98 -96 -44 -125 92 -93 195 -239 -322 79 -135 276 -143 168 132 74
3279 74 -207 265 115 14 -200 -136 98 -189 163 -96 -319 134 -76 45 -358 77 88 -241 48 -38 192
3300 192 -228 39 56 158 203 -17 -51 -189 129 218 42 31 44 66 203 51 311 267 -215 89 181 0 -130
3323 -130 113 -45 84 38 150 467 98 -30 187 176 -138 14 184 257 -58 -255 173 -234 -219 -41 -9 85
3345 85 61 102 -303 -139 96 -115 -169 73 97 -237 -207 -37 -78 115 -18 -154 -138 120 -313 66 10 -120 -35
3368 -35 269 -134 93 458 40 -5 140 113 44 -157 106 267 224 298 110 210 73 -319 177 69 -51 76
3390 76 332 -297 55 105 60 94 -244 136 -192 15 157 133 -293 -25 150 -144 -153 -156 45 -9 -202 -238 242 -191
3414 -191 -67 -150 314 66 92 218 -40 106 203 69 165 -149 176 35 27 -193 42 -188 150 2 280 -26
3436 -26 -250 113 -60 239 73 35 13 -50 111 62 18 183 -121 45 -142 -10 -114 -49 -94 359 -245 -255 144
3459 144 74 74 -19 111 29 -263 -173 26 -85 -140 63 -82 47 -80 -59 -30 -161 -36 -219 93 -139 6 250
3482 250 49 -291 -278 -108 -6 300 -85 -27 -76 -85 42 -208 -56 -102 -23 61 294 87 138 -102 503 -221 124
3505 124 -82 151 -30 -264 -127 -7 18 242 -73 -17 -182 -164 33 73 -5 -16 -128 -5 -180 -259 210 -113
3527 -113 60 80 37 77 164 208 22 -218 16 36 281 -210 -55 137 149 3 129 -61 -193 -151 77 198 168
3550 168 158 -51 -187 198 -69 -28 150 -108 87 -370 79 -349 -44 -119 159 -72 -91 -63 164 233 -46 -149
3572 -149 177 -279 -262 -304 94 -126 -10 -258 50 -14 -266 4 289 210 -38 360 -134 339 170 -91 -185 193
3594 193 245 -33 -2 32 10 -117 235 95 254 19 -164 -149 194 -154 129 -121 26 331 40 -104 -252 -24
3616 -24 55 -91 106 -196 -233 151 -155 57 -63 -140 43 145 11 54 -61 -249 -197 150 214 176 371 12 -175
3639 -175 57 -57 93 117 -98 123 195 27 19 168 59 -67 33 45 34 168 96 114 111 201 70 5 -321 84
3663 84 -78 -138 -13 237 44 -182 -21 15 120 -294 -92 51 -40 22 -95 273 186 -90 136 -12 -234 -115
3685 -115 -176 219 -119 216 21 3 -148 140 -137 -22 73 60 106 -67 146 -296 -62 -78 -196 210 98 0
3707 0 331 -171 64 -61 161 137 183 131 146 111 25 102 -36 105 -13 -108 -99 349 168 -359 -64 62 104 116 -73
3732 -73 89 101 -252 302 29 45 203 -232 -106 -159 -133 -114 -87 109 93 125 57 120 19 125 246 -210 -125 -76
3756 -76 -87 172 -201 159 100 -39 60 150 9 -29 192 -159 -29 99 312 108 112 -295 54 -101 -38 -243 84
3779 84 -31 191 188 -131 68 265 -23 89 336 -222 63 -120 -54 302 158 243 30 -109 56 45 -56 14
3801 14 155 -117 -13 -329 195 55 84 -37 -6 -143 -120 376 -27 -39 -49 166 56 -213 177 -149 -55 3 -28
3824 -28 -34 55 217 30 321 216 -68 52 -183 96 173 -71 -63 -10 90 58 216 195 -139 -228 160 -8 -140 -203
3848 -203 -210 -91 34 -161 -164 -106 -198 32 299 261 -53 -325 -41 311 -15 -402 53 -151 -119 165 346 -73 82
3871 82 250 -139 110 99 -223 97 6 -20 -58 -60 -181 109 89 168 182 125 -111 -65 196 40 169 136 53 -36 -38 -161
3897 -161 301 134 -284 195 204 -182 270 -242 54 -182 143 42 -343 192 62 -11 -233 67 53 87 64 95
3919 95 -184 134 -37 19 -30 -246 -76 241 -1 -10 -90 180 -210 -2 194 32 -79 39 115 145 30 162 239
3942 239 -25 489 26 -272 -154 -47 -97 -80 -17 129 -110 245 -146 -49 93 172 175 114 40 92 -2 -359 -389 20
3966 20 -112 -21 -87 14 -34 72 -185 -138 28 -406 27 155 295 33 166 -208 175 -15 -36 -5 -119 302
3988 302 -61 -89 -189 -25 196 -20 310 151 -20 194 -4 80 162 -149 124 79 45 151 23 -163 -82 139
4010 139 -36 111 -290 -130 -244 47 142 85 304 -172 264 -141 53 135 103 30 99 -284 72 50 181 -107
4032 -107 100 40 -15 75 -47 347 19 -285 -183 150 -187 -256 -199 201 -362 -113 -197 -14 -70 103 134 -79 40
4055 40 17 184 -1 -173 -155 227 8 -385 -28 -35 -275 186 92 -14 -89 -125 46 77 268 118 240 -8 199
4078 199 109 204 -210 71 43 -126 -38 53 -146 -213 189 -179 110 17 -45 95 222 192 169 -32 -114 20 214 93
4102 93 -113 27 -46 -22 102 77 8 -43 -241 -108 77 -1 -21 -88 -48 -41 136 -133 -78 -18 -57 1 20 171 216 116
4128 116 89 319 136 -305 -70 -41 -169 319 -126 -75 211 -175 172 -67 129 -252 55 -131 125 -171 -81
4149 -81 -83 175 265 -161 -32 -92 68 -222 -50 -81 -6 47 408 129 111 179 41 274 149 -44 9 68 -115 399
4173 399 111 19 155 10 300 206 13 127 -248 -205 -276 -80 -200 94 -44 174 -102 -412 -194 -181 -87 -66
4195 -66 -94 -177 81 41 146 114 93 -163 -191 -286 49 122 65 48 299 331 -160 115 150 115 10 7 -207 -263 51 10
4221 10 97 -176 46 -172 17 178 123 6 188 -12 0 57 -116 1 122 -178 22 34 -258 56 -224 83
4243 83 218 0 86 0 -82 -33 -53 -27 91 53 37 9 -125 273 190 -13 140 -29 -41 95 -116 -49 -170 -111 -179
4268 -179 -129 -51 -205 -121 -176 401 303 -27 40 -19 -164 434 2 105 12 40 70 -35 19 -152 32 11 13 4 14 -83
4294 -83 115 -117 -156 90 -53 154 -143 -95 -150 -70 -114 -77 189 -38 -1 -105 -29 -73 12 -232 -212 -89 -126 -256
4318 -256 9 79 -186 45 -17 -31 211 155 135 219 162 -260 79 -189 -141 119 -34 48 188 181 -51 -60 -43 227 166
4343 166 206 184 42 -117 -5 -53 -44 -87 61 291 226 41 -252 -196 142 -200 -152 117 -163 18 93 32 52 -34
4367 -34 -83 -266 -251 -73 -181 47 -219 -98 -60 -61 95 -102 -90 302 -203 20 -36 -41 -124 66 115 32 232 216 63
4392 63 48 111 -22 39 -77 -10 -68 272 -106 -105 100 -366 59 41 210 210 101 -268 1 102 -92 -112 69 37
4416 37 8 -31 -184 176 45 103 -114 51 183 -156 142 -32 -226 -56 -83 -234 195 -136 64 246 -6 87
4438 87 2 -100 115 282 -194 -31 3 9 20 -80 325 208 -67 49 -129 160 79 80 301 103 -10 32 -120
4461 -120 155 -143 -229 82 135 85 134 -5 -39 87 193 73 -113 -95 -30 -187 -65 150 -12 -18 30 118 -17 -29
4485 -29 168 -48 -71 -6 -169 -42 -222 326 116 -154 -21 -86 -9 223 144 173 75 -41 82 -116 93 34 110
4508 110 192 -135 220 121 -166 220 25 190 201 280 8 51 59 286 -227 -363 -105 -7 159 75 61 -167 89
4531 89 -303 -124 18 -77 -284 -147 -129 -268 -189 115 56 -66 367 -272 77 101 131 -196 -355 -51 -59 146 230
4554 230 175 64 -114 -8 -157 296 -394 -13 215 80 270 -130 76 120 -17 57 205 -176 181 42 -63
4575 -63 -47 509 -15 65 -266 -6 7 27 -124 -66 -159 -39 48 -272 7 -238 80 134 18 -89 224 244 -133
4598 -133 -294 -15 181 -98 44 62 -44 80 33 -45 -2 -141 45 -133 51 15 300 203 208 269 -223 100 121
4621 121 111 -14 28 -115 -65 253 130 78 24 85 430 17 -171 -1 -91 -59 24 161 331 -137 238 -28 66
4644 66 -283 -195 -68 -251 -80 -180 -94 -226 53 29 -11 -275 69 -222 -234 -81 259 -43 -243 187 -16 -288
4666 -288 -14 165 273 218 -39 -117 59 213 200 166 144 -195 -18 100 47 166 -105 132 -130 15 -78 275
4688 275 133 67 12 -15 -71 -40 56 78 140 -40 -355 -78 -174 142 -171 -23 41 -27 49 -157 -131 -136 -236 -165 58
4713 58 -267 84 186 -219 -43 30 55 -112 -167 -79 -112 151 -52 237 179 -149 -14 8 265 187 125 34 48 253
4737 253 27 8 60 51 -78 162 -41 54 -211 -115 64 -302 -60 -42 -249 -178 -300 -90 95 5 251 -69 286
4760 286 22 56 161 51 -93 -131 -36 119 205 -102 -17 -80 90 128 108 -298 235 142 -39 -43 -255 17 29 15
4784 15 196 -36 -58 -114 96 68 -132 -40 197 124 -53 62 -110 1 76 42 31 -62 -52 104 -454 93 40 -177
4808 -177 -77 94 -82 -55 -98 91 63 -15 -74 23 241 -351 61 -1 -31 -60 -160 86 -112 74 14 139 54 -115
4832 -115 -224 -167 345 -22 6 -91 6 88 197 -197 167 188 -180 255 -236 177 117 174 94 65 250 -306 34
4855 34 182 -300 -51 -160 -119 -43 124 -40 -250 -194 -64 114 -189 -154 -116 -50 -7 53 151 112 -112 125 109 -21
4879 -21 -334 87 15 80 134 -2 -269 180 -66 -17 92 152 38 -234 -24 49 -77 -158 291 50 200 -38 284
4902 284 -105 -16 -54 -7 121 -127 284 192 -9 0 47 243 117 76 219 160 -190 -135 -109 -8 104 -70 -112 49
4926 49 42 -202 -154 -13 -152 252 -67 -62 224 -171 -197 -53 -36 -43 -43 -63 -250 -173 62 16 -175 -374 -9 42 -71
4951 -71 44 81 -11 -47 45 166 32 200 -40 269 261 -122 28 78 181 207 224 133 145 212 -76 32 97 -64 -28
4976 -28 48 -26 -33 -2 154 -83 60 197 144 -145 180 -114 157 32 30 216 87 -283 -113 179 179 31 19 17 300
5001 300 -28 -137 133 180 -132 82 123 -179 165 143 164 32 -95 43 14 3 98 79 79 56 -33 6 6 63 22 10
5027 10 27 -17 83 -54 1 139 121 -201 100 -20 -224 44 171 -37 -181 -27 29 -34 -43 -183 -55 -191 190
5050 190 -73 -155 109 -176 216 -94 1 59 24 159 -22 -8 -94 64 274 -228 -15 -65 -73 96 10 -307 227
5073 227 132 -75 244 13 82 -110 -243 103 321 -87 -29 258 74 -132 -123 44 182 42 -2 -19 -11 133 55
5096 55 -105 41 105 33 -35 8 -99 -36 -112 -109 -46 214 249 -21 67 136 -148 -90 1 -222 236 102 174 -275 -130
5121 -130 -83 62 225 -41 -7 66 -7 45 445 166 95 -195 -40 196 11 34 -100 159 85 156 -58 271 41
5144 41 123 -133 77 -3 -60 108 -45 -34 -206 -67 -233 -95 -15 -4 -81 -21 34 -14 -37 -262 -107 -176 -155 -140 -99
5169 -99 53 220 31 -110 153 -115 -188 -91 -176 108 -126 4 -321 -77 72 50 95 71 -209 137 76 96 33
5192 33 301 76 403 165 134 -111 91 -211 -469 161 99 110 36 -22 148 -109 -216 324 323 -259 115 110 -237
5215 -237 15 -230 74 -334 235 -164 56 7 84 376 -73 38 76 183 -33 79 164 129 -365 -111 58 48
5237 48 -104 71 -87 -12 173 101 44 81 204 -336 113 -48 -80 -18 126 -169 234 26 28 -72 -119 6 -20 82
5261 82 204 77 -256 -136 184 209 -271 -243 253 -200 -58 -402 112 -26 -50 -145 122 -141 121 -26 13 -115
5283 -115 -2 76 81 -62 -50 -172 179 262 94 -6 -54 169 -41 237 -282 -157 96 130 131 69 -52 83 -43
5306 -43 23 110 83 222 186 -74 133 -204 -142 -95 221 -11 -60 170 -40 -380 61 -86 -9 85 -225 -179 160 -26
5330 -26 49 -3 -398 100 -64 -124 -98 -143 159 -84 -52 -156 269 21 -122 426 -109 20 -94 -88 -13 57 111 -48
5354 -48 -34 -202 98 -233 -104 264 -114 30 -163 -87 79 -238 -144 35 -7 96 31 36 -206 -393 -18 381 112
5377 112 19 -325 73 135 208 124 -2 107 -111 67 -40 74 54 -40 -64 -118 -144 -214 -333 -91 0 237 -28 49
5401 49 92 -95 196 -100 -156 31 -249 67 60 17 111 32 -2 36 147 -145 -25 -86 -47 21 222 25 30 -29 -215
5426 -215 -76 26 -209 166 64 -4 -1 122 -285 -237 172 -70 45 -171 63 -94 -82 99 -41 -70 355 -46
5448 -46 124 137 92 -8 30 -50 173 -28 -23 40 -43 -39 221 -112 -133 -79 94 153 14 -59 76 118 -26 -282 150
5473 150 2 -40 -93 -165 223 -115 -37 -61 -177 -220 384 56 -115 -190 -137 2 87 183 -257 -1 -392 -60 -138 408
5497 408 124 267 86 -150 -82 160 144 117 -186 97 124 87 -57 191 -226 137 -223 -19 43 98 64 76 -10
5520 -10 359 135 -212 -97 3 54 -134 5 -113 -167 42 37 94 198 156 -16 307 -189 148 216 98 -52 -77
5543 -77 79 147 50 -41 -253 186 -90 -91 10 139 13 138 230 127 291 -40 -177 113 -2 27 295 -180 110
5566 110 115 0 -175 258 -163 32 119 -51 34 -103 -65 251 -180 231 -178 85 -6 -132 -37 84 -34 73
5588 73 97 387 97 -65 163 85 66 -63 180 -72 91 8 -233 -169 -85 152 26 -224 -132 53 -163 2 102
5611 102 -53 -63 81 -62 -129 172 -183 63 149 -265 99 313 145 182 196 156 235 -42 73 -79 38 -11 -86
5634 -86 248 137 74 -262 72 124 125 48 68 -59 -110 -125 -158 81 220 73 4 -10 21 114 201 84 146 171 178 -363
5660 -363 -153 -70 139 -9 15 -128 202 196 -395 219 -27 90 -201 -147 51 -8 -100 -132 118 207 -26 64 -91
5683 -91 60 38 -167 1 72 65 -17 -89 4 62 211 -66 329 143 50 -93 174 14 109 130 129 -59 146 -274 -101
5708 -101 36 -60 -173 205 -128 -366 -36 -221 98 102 93 -99 -335 -17 89 -13 38 -174 6 -101 87 96 109
5731 109 6 24 96 -101 62 131 -27 300 -50 -70 36 50 31 2 151 215 -232 32 -80 217 198 -60 89
5754 89 -93 -32 15 -213 -118 29 -133 154 -94 153 -135 -164 53 163 81 -78 11 -171 23 16 142 -140 -47
5777 -47 -17 103 58 128 -153 -215 -48 -4 -56 -95 186 -24 104 45 -297 -75 -254 52 -158 -115 -97 85 -230 104
5801 104 -16 -63 68 210 -49 -19 -201 17 89 201 344 127 -167 -58 107 10 220 -16 -265 126 23
5822 23 195 193 -90 -120 -71 -195 -279 -116 132 -30 -95 238 125 -49 52 -152 69 254 -199 84 -246 -366
5844 -366 101 60 -125 -68 -13 -65 -70 -100 -75 -180 84 40 116 -8 134 -97 123 132 -42 93 -52 -103 119 120 318
5869 318 -26 7 115 79 107 310 213 105 9 66 56 -8 -152 115 -97 -168 -148 -145 -158 30 -50 -235 -16 130 87
5894 87 -206 -77 159 -18 -193 -176 -77 195 311 95 -60 324 66 0 -89 22 -60 -172 143 -42 65 -302
5916 -302 124 25 40 253 175 59 -163 -10 75 178 79 56 -31 -280 -81 -368 64 218 -118 -39 -83 103 91
5939 91 -44 -47 -144 161 -135 -67 106 -82 -47 -30 -128 109 20 -39 -105 219 -98 207 -188 -58 38 -104 200 -7
5963 -7 82 -83 69 110 -79 164 93 207 280 -81 -43 409 93 -15 -78 -57 152 -143 135 -216 -16 -26 49 -91
5987 -91 -124 27 -441 170 111 -11 -36 -70 17 -365 127 212 -16 164 -128 -73 -23 218 -180 -87 -176 71 -93 151
6011 151 -152 65 65 61 265 73 287 49 -239 -41 -138 166 120 -23 129 11 -29 22 -349 -347 335 143 -127
6034 -127 144 88 161 289 -417 -300 321 71 204 153 -88 114 15 75 -258 132 -185 -30 163 198 136 109 -183
6057 -183 -183 -189 71 294 -119 37 -309 -115 110 -82 -67 -69 -58 1 135 149 -190 71 37 -281 -30 -81 -324 -128
6081 -128 206 264 -16 159 50 47 -13 -85 -26 151 -55 104 112 -65 -290 348 173 366 96 -41 327 30 -223
6104 -223 131 13 -226 -36 -104 213 -116 153 -202 -42 -64 -53 9 -272 131 -62 -100 272 -249 108 -26 -212
6126 -212 -311 -57 -122 145 12 -157 -55 13 -26 -63 -91 -21 46 -14 127 75 165 -185 -128 -201 148 8 5 14 -221 -269
6152 -269 -278 80 82 332 188 51 -142 113 191 -93 -200 214 20 -171 165 7 50 124 154 233 30 -250 147
6175 147 -19 -276 144 22 60 -163 195 120 -96 192 64 57 17 -99 -32 102 127 -98 -156 13 -50 -210 -276
6198 -276 77 35 -31 -14 54 -139 -58 -111 212 229 180 -454 -33 319 -180 -80 -101 -214 54 -80 191 -66 -130
6221 -130 -120 90 -119 -191 377 -131 70 128 140 36 -41 3 86 -93 143 53 -154 -92 -349 -342 108 56 23 -131
6245 -131 -13 -184 114 -2 135 -34 -83 -400 -131 179 47 141 93 2 -248 129 274 -123 118 -113 -14 -292
6267 -292 -315 -521 243 145 -38 134 46 130 -212 -245 -12 -13 184 231 -80 -88 -48 -40 311 63 133 72 42 40 24 174
6293 174 -142 76 -184 167 -160 -31 38 -268 203 -20 -401 -48 -177 116 -54 -237 -276 81 45 -196 -83
6314 -83 60 245 -24 -97 -123 -14 22 -30 -169 -198 184 94 78 -151 194 -41 -170 -21 -183 -78 39 22 99
6337 99 70 177 36 -101 6 -107 -207 197 -49 -216 -182 -51 205 66 162 -303 47 -28 -18 -65 149 -20
6359 -20 -173 -31 -220 -2 312 -46 -23 141 116 -25 -198 9 21 -171 -146 -1 -168 -165 -162 32 -22 -191 -59
6382 -59 3 0 153 -99 35 259 -17 244 -276 -4 -47 78 -221 121 -376 -21 22 70 -3 -290 -116 -190 188
6405 188 430 80 187 208 -71 2 191 -98 165 40 -36 72 18 -36 -436 -70 -55 58 -102 -104 -219 132 73
6428 73 -99 -68 128 15 167 56 -16 163 -176 -214 170 -106 -6 -27 59 84 29 111 -8 -41 -11 -147 206 -5
6452 -5 173 29 59 127 75 109 66 -10 -79 -203 135 -43 68 -9 -119 6 27 -200 16 57 -184 -90 -35 198 212
6477 212 302 24 333 -176 -108 -150 -1 139 244 95 156 -15 -228 -27 28 201 220 -53 -121 -171 -173 -24 -232
6500 -232 362 -208 1 -1 27 74 187 44 68 127 -131 -84 -205 32 -15 189 -95 -93 -129 205 98 -63 21 256
6524 256 278 -172 -25 40 153 -10 180 -18 -113 -44 125 -75 70 -185 -48 -19 14 144 -1 72 66 -191 246
6547 246 -1 255 207 -176 -100 303 379 -142 218 -51 -84 43 -68 -22 147 -161 -182 55 -48 -203 -13 -19 247
6570 247 -241 -106 -28 52 260 -32 372 48 55 -42 -118 -246 -27 239 59 -81 -293 -196 -92 -152 -251 -55 -4
6593 -4 -120 -94 122 -35 -109 -99 -165 185 101 -203 -55 -217 -173 63 -249 179 -100 177 45 129 108 17 2 29
6617 29 26 171 203 -129 116 76 163 -90 194 -176 79 231 113 183 -36 -221 386 -162 -24 238 -275 21
6639 21 196 101 85 125 -258 -128 79 63 -180 233 167 86 13 119 -218 -184 72 -52 263 121 -45 -228 35
6662 35 255 -91 -92 -67 76 -142 118 23 261 -92 2 148 -23 87 -128 37 -1 -46 -60 -51 -52 212 154 78 -71
6687 -71 -301 235 11 -206 -128 107 -229 -27 46 39 71 238 -47 -271 53 -80 -45 -3 9 36 -284 7 135
6710 135 12 81 -238 -163 442 79 -144 -93 307 235 -172 -27 72 -130 -156 20 170 8 -150 16 -238 34
6732 34 -143 -176 246 133 132 126 -38 -137 237 209 -127 185 334 -17 -56 -215 102 -107 -140 12 -96 241 -150
6755 -150 374 101 132 151 148 -34 136 59 58 -7 -231 -87 -40 -44 -88 -39 12 -1 61 -101 -162 334 -158 26 3 -204
6781 -204 96 -167 277 -156 -120 44 -119 -143 -155 51 -192 57 -309 29 47 122 -111 -19 152 73 -21 -17 67 -174
6805 -174 -102 96 -49 76 -14 -2 68 -4 43 328 -173 150 160 -117 69 -116 242 73 -50 -111 -15 -201 209
6828 209 239 194 -104 -10 131 -33 -45 278 -133 -115 -30 105 10 142 -217 -335 -130 -114 -131 -262 -28 -180 20
6851 20 -11 171 241 62 -173 -164 -21 94 -39 -43 -125 -105 -291 -198 -257 -224 -96 95 -133 -54 -67 -191 78 -283 174
6876 174 -304 92 -235 -73 -59 73 -158 75 -141 -4 -76 -3 -166 91 125 226 -67 290 82 -82 101
6897 101 222 21 210 -139 50 151 -83 232 -225 37 -85 478 -291 -101 11 34 -194 215 113 287
6917 287 -45 -256 -246 304 -8 -314 -86 170 -1 12 86 6 -17 -84 70 -71 154 131 -55 -220 -52 -181
6939 -181 -1 170 86 -170 182 -54 207 -95 -25 -78 19 -16 -181 -40 31 -140 -207 81 152 -241 -168 -76 163
6962 163 -48 -5 165 84 55 -63 -318 -50 55 134 -20 89 -171 432 -254 -63 118 -98 -66 158 -86 209
6984 209 191 97 31 139 -93 170 -71 90 154 96 327 -88 -207 -183 -103 -205 201 -151 106 124 -17 -310 96
7007 96 326 181 -70 -121 43 54 156 -6 -218 -125 66 15 -169 239 -27 68 222 -8 58 212 -38 -69 224
7030 224 -218 70 -134 107 29 148 122 104 -34 42 -10 58 186 -38 77 112 188 198 40 61 -22 -158 -1 -206
7054 -206 -51 32 155 -13 -128 -258 236 72 136 -6 -42 -76 -271 -166 120 297 397 -166 73 -181 57
7075 57 49 40 -281 220 102 74 -66 -1 29 -17 153 16 267 -157 -68 -91 -76 -4 183 -12 65 -193 251 95 18
7100 18 214 97 13 -39 20 400 -139 28 126 29 144 53 -131 -26 368 -181 72 -40 147 -33 54 51 14 8
7124 8 -80 -126 151 30 -308 -115 227 -93 -27 174 94 284 43 38 378 -134 -41 86 407 301 144 -59 198
7147 198 231 159 259 15 147 -116 236 -6 261 37 124 -121 -283 179 129 99 145 -124 -87 149 -104 -258
7169 -258 -139 -37 -42 234 154 7 218 -86 48 234 143 -207 -318 140 331 62 27 30 -234 0 -10 -74 92
7192 92 222 -57 -186 -120 180 46 -69 3 66 203 -38 283 -190 69 123 166 118 83 62 -144 -81 104 -205
7215 -205 -207 72 -240 -282 44 99 28 -70 -2 -101 154 -46 -67 219 211 116 -255 -73 193 80 -108 12 110 -74
7239 -74 -101 260 91 -4 87 105 -104 -101 203 258 -51 68 -77 -23 139 166 156 -248 47 83 -77 -151 96 -41
7263 -41 -123 -185 203 -274 40 -14 50 -30 -97 -138 -69 62 76 93 11 136 120 28 -86 -264 5 38 -175 53 287
7288 287 96 230 -248 -227 76 -191 -120 -144 -282 -21 -100 -96 193 -12 -313 48 113 186 -56 -28 -47 -25 163 -286
7312 -286 -109 -36 58 -34 -3 55 -137 -260 -307 66 -159 203 441 -189 -55 51 -95 -12 62 -23 94 103 -157 -302
7336 -302 38 -203 73 -171 -103 372 -60 -161 39 -192 -246 169 164 -455 -20 60 54 -22 31 -220 -214 219 -314 293
7360 293 297 -344 -67 339 65 46 134 89 -118 109 -34 190 22 100 66 158 119 -229 -40 80 -16 -12 162 -3
7384 -3 372 -134 298 -81 89 132 -26 11 -103 14 15 292 -97 -76 117 -44 -64 89 -64 27 12 140 193 221
7408 221 176 -180 340 219 279 130 75 148 28 340 28 50 -77 -55 19 38 -251 162 118 44 -273 -107 85
7431 85 -17 60 -190 -55 -181 19 32 135 -30 13 -104 22 63 49 163 69 15 175 74 -32 -16 57 -222
7454 -222 -146 137 -37 -64 62 204 4 139 -6 -176 -124 184 -42 -210 -36 -94 40 -255 130 -89 61
7475 61 290 -135 7 -183 -203 269 -164 100 -29 -56 64 -114 -65 -59 -62 -36 -57 14 144 -13 33 5 -44 262 150
7500 150 87 -211 -42 63 -13 139 32 -130 -17 174 4 230 249 217 -93 165 -124 30 6 92 -60 61
7522 61 292 79 -62 67 328 -78 93 -18 47 91 133 105 216 -3 -142 -124 -23 16 20 -119 -56 -112 164 186
7546 186 111 -97 -161 -136 -58 -172 -365 -140 124 203 -187 107 -88 103 -147 -167 211 -226 11 132 -106 -273
7568 -273 -40 -58 218 -43 -195 -39 -239 27 -88 156 -168 -86 -147 66 261 94 -195 106 -40 260 177
7589 177 -92 205 75 -67 81 -117 -72 275 -192 -71 68 101 -206 -257 88 132 -320 21 -111 59 65 -50
7611 -50 -213 302 -84 -211 21 11 -34 1 -186 6 -65 86 -66 -89 92 155 -150 -198 -23 11 155 -36 -67
7634 -67 -28 -316 98 72 -115 366 40 104 22 -99 258 51 -21 -91 39 184 314 46 -239 184 44 -104
7656 -104 109 94 -125 -21 106 54 0 -26 -10 -91 45 132 -71 13 189 -78 -193 224 -193 -124 -49 20 -74 58
7680 58 -159 -250 69 -11 12 -132 -109 136 -5 -49 66 216 -358 228 211 50 -319 -81 -4 -164 272 124 -174
7703 -174 99 73 100 148 -20 -119 70 152 -148 249 -14 -180 -39 -117 -205 155 -98 -275 157 -43 -247 -155 184
7726 184 -62 -219 -275 -246 -34 -46 5 170 -117 53 138 -34 -18 -157 5 117 346 -84 -204 -10 72 -115
7748 -115 -118 23 -37 -49 87 66 -42 355 53 -52 327 83 -179 -33 -368 197 334 -67 111 181 -35 270
7770 270 -60 -146 -55 24 102 -117 112 1 16 -176 -230 -206 16 91 -161 -61 -276 -20 64 101 65 6 108 -278
7794 -278 256 -136 107 220 -98 -127 -51 104 101 82 143 -21 -106 34 -99 175 210 -30 113 -64 -112 302 -30
7817 -30 -203 -78 251 111 -26 93 35 310 213 202 -234 110 67 337 -208 138 -122 199 -292 72 113 -21
7839 -21 38 70 -18 -22 130 91 15 -530 135 -168 63 -130 112 -7 -150 14 216 -167 37 -81 92 36 -68
7862 -68 -105 47 -176 -7 115 333 367 -183 -173 162 128 -64 176 20 172 -31 178 19 9 78 234 -138
7884 -138 116 -169 66 91 95 192 42 -37 -108 25 41 46 242 -37 136 -227 239 -116 7 -22 149 3 -364
7907 -364 -217 -9 -170 -47 -85 -280 -100 88 137 -84 69 -143 61 -4 112 -7 28 -2 177 -35 -22 3
7929 3 23 388 -91 -150 77 -49 10 306 -193 -122 295 -7 -142 176 232 245 45 191 -29 -79 -233 52 94
7952 94 158 -358 337 32 -202 -74 83 115 -98 -109 118 67 -228 234 140 -43 -281 44 -112 -148 -93 12 141
7975 141 -29 -106 119 4 86 -216 -138 -25 111 -229 -178 15 -147 154 120 -130 -3 233 -200 -135 -43 73
7997 73 -14 136 -145 81 21 -96 96 -191 -162 166 -77 198 113 11 -202 -12 -75 114 -48 47 -200 -316
8019 -316 77 -80 23 -155 33 175 23 -59 441 111 -208 125 97 -21 83 44 -127 77 156 11 135
8040 135 -23 -111 -112 209 161 88 100 -100 99 116 -204 39 -124 36 -165 -112 -48 74 1 -23 95 95 -108 18
8064 18 -297 -134 219 -18 -135 -112 104 -385 -99 8 -11 -210 447 101 -66 12 -31 -99 -100 173 34 156 -184
8087 -184 -67 -45 69 -404 -432 87 -28 -216 67 33 -41 147 111 -50 169 -64 -105 48 -35 135 132 -208 44
8110 44 58 83 150 101 -138 237 16 80 121 -67 -78 -57 -86 -139 70 -362 104 -121 53 -50 -93 -39 -84 379 -87
8135 -87 -23 -101 -85 -65 -11 260 -90 -23 -150 -284 30 -62 -49 145 -27 260 1 179 -75 -266 194 50 184
8158 184 172 63 106 8 100 -124 131 -154 80 62 44 106 209 114 261 65 -44 160 265 197 144 -178 125
8181 125 67 -97 240 -370 -84 -66 -210 7 48 -385
8191c85
##END NTUPLES=NMR FID
##END=
