##TITLE=1H_BAU-090119
 CDCl3, 8 sc, 
 14.1.2019
##JCAMPDX= 6.0         $$ Bruker NMR JCAMP-DX V2.0
##DATA TYPE= NMR FID
##DATA CLASS= NTUPLES
##ORIGIN= UXNMR, Bruker Analytische Messtechnik GmbH
##OWNER= root
$$ XWIN-NMR		Version 3.5
$$ Mon Jan 14 15:00:59 2019 Russian Standard Time (UT+4h)  she@DPX200
##.OBSERVE FREQUENCY= 200.1313
##.OBSERVE NUCLEUS= ^1H
##.DELAY= (6, 6)
##.ACQUISITION MODE= SIMULTANEOUS
##.ACQUISITION SCHEME= undefined
##.AVERAGES= 8
##.DIGITISER RES= 18
##SPECTROMETER/DATA SYSTEM= spect
##.PULSE SEQUENCE= zg30
##.SOLVENT NAME= CDCl3
##.SHIFT REFERENCE= (INTERNAL, CDCl3, 0, 15.7039)
##AUDIT TRAIL= $$ (NUMBER, WHEN, WHO, WHERE, WHAT)
$$ ##TITLE= Audit trail, XWIN-NMR		Version 3.5
$$ ##JCAMPDX= 5.01
$$ ##ORIGIN= Bruker BioSpin GmbH
$$ ##OWNER= she
$$ F:/spectra/data/she/nmr/H-F/1/audita.txt
$$ ##AUDIT TRAIL=  $$ (NUMBER, WHEN, WHO, WHERE, WHAT)
(   1,<2019-01-14 14:58:42.25 +0400>,<she>,<DPX200>,
      <created by zg, POWCHK disabled, PULCHK disabled
       configuration hash MD5:
       00 E9 B6 7A A2 85 ED C7 34 08 36 98 17 FE 4E 26
       data hash MD5: 16K
       B1 77 6E 0E A3 C3 F9 92 8C 4E 0F ED 4B C3 6D F5>)
$$ ##END=
$$ 
$$ hash MD5
$$ 7C 72 F4 06 1D 81 6F 4E 2C 16 B4 51 03 3C 15 82
##$RELAX= 
##$RELAX= 
##$RELAX= 
##$RELAX= 
##$RELAX= 
##$RELAX= 
$$ Bruker specific parameters
$$ --------------------------
##$DU= <F:/spectra>
##$EXPNO= 1
##$NAME= <H-F>
##$PROCNO= 1
##$TYPE= <nmr>
##$USER= <she>
##$AMP= (0..31)
100 100 100 100 100 100 100 100 100 100 100 100 100 100 100 100 100 100 
100 100 100 100 100 100 100 100 100 100 100 100 100 100 
##$AQSEQ= 0
##$AQ_mod= 1
##$AUNM= <au_zg>
##$AUTOPOS= <>
##$BF1= 200.13
##$BF2= 200.13
##$BF3= 200.13
##$BF4= 200.13
##$BF5= 200.13
##$BF6= 200.13
##$BF7= 200.13
##$BF8= 200.13
##$BYTORDA= 1
##$CFDGTYP= 0
##$CFRGTYP= 5
##$CHEMSTR= <none>
##$CNST= (0..31)
1 1 145 1 1 1 1 1 1 1 1 1 1 1 1 1 1 1 1 1 1 1 1 1 1 1 1 1 1 1 1 1 
##$CPDPRG= <>
##$CPDPRG1= <>
##$CPDPRG2= <>
##$CPDPRG3= <>
##$CPDPRG4= <mlev>
##$CPDPRG5= <mlev>
##$CPDPRG6= <mlev>
##$CPDPRG7= <mlev>
##$CPDPRG8= <mlev>
##$CPDPRGB= <>
##$CPDPRGT= <>
##$D= (0..31)
0 1.2 0 0 0 0 0 0 0 0 0 0.03 0 0 0 0 0 0 0 0 0 0 0 0 0 0 0 0 0 0 0 0 
##$DATE= 1547463521
##$DBL= (0..7)
120 120 120 120 120 120 120 120 
##$DBP= (0..7)
150 150 150 150 150 150 150 150 
##$DBP07= 0
##$DBPNAM0= <>
##$DBPNAM1= <>
##$DBPNAM2= <>
##$DBPNAM3= <>
##$DBPNAM4= <>
##$DBPNAM5= <>
##$DBPNAM6= <>
##$DBPNAM7= <>
##$DBPOAL= (0..7)
0.5 0.5 0.5 0.5 0.5 0.5 0.5 0.5 
##$DBPOFFS= (0..7)
0 0 0 0 0 0 0 0 
##$DE= 6
##$DECBNUC= <off>
##$DECIM= 24
##$DECNUC= <off>
##$DECSTAT= 4
##$DIGMOD= 1
##$DIGTYP= 9
##$DL= (0..7)
0 120 120 120 120 120 120 120 
##$DP= (0..7)
150 150 150 150 150 150 150 150 
##$DP07= 0
##$DPNAME0= <>
##$DPNAME1= <>
##$DPNAME2= <>
##$DPNAME3= <>
##$DPNAME4= <>
##$DPNAME5= <>
##$DPNAME6= <>
##$DPNAME7= <>
##$DPOAL= (0..7)
0.5 0.5 0.5 0.5 0.5 0.5 0.5 0.5 
##$DPOFFS= (0..7)
0 0 0 0 0 0 0 0 
##$DQDMODE= 0
##$DR= 18
##$DS= 0
##$DSLIST= <SSSSSSSSSSSSSSS>
##$DSPFIRM= 0
$$ [...]
##$SUBNAM2= <"">
##$SUBNAM3= <"">
##$SUBNAM4= <"">
##$SUBNAM5= <"">
##$SUBNAM6= <"">
##$SUBNAM7= <"">
##$SUBNAM8= <"">
##$SUBNAM9= <"">
##$SW= 24.933730806125
##$SWIBOX= (0..15)
0 0 2 0 0 0 0 0 0 0 0 0 0 0 0 0 
##$SW_h= 4990.01996007984
##$TD= 16384
##$TD0= 1
##$TE= 0
##$TE2= 300
##$TE3= 300
##$TEG= 300
##$TL= (0..7)
0 120 120 120 120 120 120 120 
##$TP= (0..7)
150 150 150 150 150 150 150 150 
##$TP07= 0
##$TPNAME0= <>
##$TPNAME1= <>
##$TPNAME2= <>
##$TPNAME3= <>
##$TPNAME4= <>
##$TPNAME5= <>
##$TPNAME6= <>
##$TPNAME7= <>
##$TPOAL= (0..7)
0.5 0.5 0.5 0.5 0.5 0.5 0.5 0.5 
##$TPOFFS= (0..7)
0 0 0 0 0 0 0 0 
##$TUNHIN= 0
##$TUNHOUT= 0
##$TUNXOUT= 0
##$USERA1= <user>
##$USERA2= <user>
##$USERA3= <user>
##$USERA4= <user>
##$USERA5= <user>
##$V9= 5
##$VALIST= <valist>
##$VCLIST= <CCCCCCCCCCCCCCC>
##$VD= 0
##$VDLIST= <DDDDDDDDDDDDDDD>
##$VPLIST= <PPPPPPPPPPPPPPP>
##$VTLIST= <TTTTTTTTTTTTTTT>
##$WBST= 1024
##$WBSW= 4
##$XGAIN= (0..3)
0 0 0 0 
##$XL= 0
##$YL= 0
##$YMAX_a= 474915
##$YMIN_a= -311522
##$ZGOPTNS= <>
##$ZL1= 120
##$ZL2= 120
##$ZL3= 120
##$ZL4= 120
##$ABSF1= 10
##$ABSF2= 0
##$ABSG= 5
##$ABSL= 3
##$ALPHA= 0
##$AQORDER= 0
##$ASSFAC= 0
##$ASSFACI= 0
##$ASSFACX= 0
##$ASSWID= 0
##$AUNMP= <proc_1d>
##$AZFE= 0.1
##$AZFW= 0.1
##$BCFW= 1
##$BC_mod= 2
##$BYTORDP= 1
##$COROFFS= 0
##$CY= 11.3945322036743
##$DATMOD= 1
##$DC= 2
##$DFILT= <>
##$DTYPP= 0
##$F1P= 18.9103706918063
##$F2P= -1.10871071338519
##$FCOR= 0.5
##$FTSIZE= 0
##$FT_mod= 4
##$GAMMA= 1
##$GB= 0.15
##$INTBC= 1
##$INTSCL= 1
##$ISEN= 128
##$LB= 0.24
##$LEV0= 0
##$LPBIN= 0
##$MAXI= 10000
##$MC2= 0
##$MEAN= 0
##$ME_mod= 0
##$MI= 1.114404
##$NCOEF= 0
##$NC_proc= 0
##$NLEV= 6
##$NOISF1= 3.799351
##$NOISF2= 2.8
##$NSP= 1
##$NTH_PI= 0
##$NZP= 0
##$OFFSET= 15.70392
##$PC= 1
##$PHC0= -8872.644
##$PHC1= 15.20006
##$PH_mod= 1
##$PKNL= yes
##$PPARMOD= 0
##$PSCAL= 0
##$PSIGN= 0
##$REVERSE= no
##$SF= 200.130013532006
##$SI= 16384
##$SIGF1= 3
##$SIGF2= 2
##$SINO= 400
##$SIOLD= 16384
##$SREGLST= <1H.CDCl3>
##$SSB= 0
##$STSI= 0
##$STSR= 0
##$SW_p= 3612.71676300578
##$SYMM= 0
##$S_DEV= 0
##$TDeff= 0
##$TDoff= 0
##$TI= <>
##$TILT= no
##$TM1= 0
##$TM2= 0
##$TOPLEV= 0
##$USERP1= <user>
##$USERP2= <user>
##$USERP3= <user>
##$USERP4= <user>
##$USERP5= <user>
##$WDW= 1
##$XDIM= 8192
##$YMAX_p= 0
##$YMIN_p= 0
$$ End of Bruker specific parameters
$$ ---------------------------------
##NTUPLES= NMR FID
##VAR_NAME=  TIME,          FID/REAL,        FID/IMAG
##SYMBOL=    X,             R,               I
##VAR_TYPE=  INDEPENDENT,   DEPENDENT,       DEPENDENT
##VAR_FORM=  AFFN,          ASDF,            ASDF
##VAR_DIM=   8192,          8192,            8192
##UNITS=     SECONDS,       ARBITRARY UNITS, ARBITRARY UNITS
##FACTOR=    0.0002004,     1,               1
##FIRST=     0,             0,               0
##LAST=      1.6414764,     0,               0
##MIN=       0,             -311522,         0
##MAX=       1.6414764,     474915,          0
$$ Real data points
##PAGE= N=1
##DATA TABLE= (X++(R..R)), XYDATA
$$ [...]
2043G77k1m2K59k25o24o17J07k28n12K4N20J72K25P95P86r4k13j7Q8r59o47j97
2065f43jp74l25L52O99k19N51R58J14LrN36m14l75k19K58l83q55M39M33j63l68
2087d05L86M87m42k86J63m4p05o7L69K43n1K85N28N31k95k15O10n95o19j56R6
2108a82l74k69Q04J25J02J52L87N43o75l2J37k47j135n28R1o00j65L28J202L42
2128FK11R58M62J23l72J26k46q43p80k33J04n60l95P00O34m8K65M57L71m58k95
2149A87K92n66o74p6M47o33O8P21N13L98k74L82M50o91o87L38K41n28m92J12L83
2170h9K03o02Q20j16k03l05L4l01l87JN86l06j84O36J020j32k6P00j7p1p06k27
2192C28j33j034m16K55J14k10J39J217K2M6N95M58k82p47k30j74l99n43Q6L90
$$ y = [777, 756, 714, 973, 748, 124, -493, -386, -614, -1126, -1102, -582, -410, -185, 610, 1396, 1302, 1089, 1072, 1160, 201, -446, -643, -644, -1418, -1743, -1391, -692, -911, -360, 598, 712, 715, 706, 1242, 828, 453, 234, 492, 109, -746, -307, 126, -37, -405, -19, 468, 26, -260, -97, -141, -846, -913, -544, -301, -352, -67, 461, 992, 697, 482, 1092, 497, -122, -278, -182, -556, -825, -21, 104, 206, 358, 745, 1288, 613, 581, 718, 471, -664, -1192, -1101, -1701, -1866, -1538, -336, 6, 217, 1175, 1637, 1760, 1388, 1514, 1268, 425, -355, -588, -484, -1044, -1439, -739, -105, -153, 112, 569, 940, 482, 187, 479, -87, -761, -837, -390, -1023, -955, -234, 279, 677, 403, 785, 1235, 544, -143, 195, 436, -92, -584, -472, -89, 114, -488, 332, 216, 13, -292, -258, -559, -946, -945, -359, -665, -849, -213, 807, 675, 649, 1349, 1332, 1261, 555, 328, 195, -839, -1255, -1000, -886, -1096, -957, 260, 282, 328, 923, 1381, 1099, 352, 122, -52, -451, -994, -908, -518]
2212e18k02K48O05N44j02j11O72J8n87n47K02m31l44n61K22R7L1K07O38L73k82
2233A72J69L61J36p44L17L06k49q29O12J43k31j88J95q3n03k77L59o1n70M13J24
2254d28J41l75L52P04J9l39J32N28j53n08J55K92n78n2N9L93j80j36O48o6l26
2275B82k1j64k75k95m39K40J76l18J66O53rr1J93P15k84k32M16P1r9o22L26k6
2297C63l93o44O00j01n43Q3L81k76J1k18M94r6k16J71O85J97l69J18L31k41j03
2318B34j58J62j43j94L61n0l69J22N48n3l03k52M43o34m73j44K77K33n39K19K03
2339e10L73J0M74O65q5k62N29k12k51o67L26l25n06r7M90J86l13r9K09n2q2l7
2361b36OO1j96j06L95k67j22J33L09J30m03N54J92J08q1P5n6l13n6j30O1j3l15
$$ y = [-518, -720, -472, 133, 677, 575, 464, 1136, 1154, 567, 20, 222, -209, -553, -1114, -892, -795, -764, -557, 81, 454, 172, 341, 702, 838, 94, 411, 717, 468, -361, 251, 394, 163, -25, 170, 87, -416, -693, -334, -395, -965, -552, -428, -287, -662, -310, 394, 413, 74, 206, 734, 581, 73, 228, 520, -58, -110, -51, 342, 162, 26, 674, 608, 282, 261, 97, -178, -473, -912, -672, -496, -814, -648, 5, -4, -95, 98, 813, 529, 297, 713, 784, 685, 63, 389, 363, -30, -674, -74, -175, -718, -635, -254, -530, -519, -737, -243, -339, -555, -384, 301, 498, 129, 247, 578, 337, 234, 76, 238, 95, -99, 262, 212, -157, -35, 513, 460, 157, -95, 348, -286, -759, -903, -626, -393, -932, -713, -510, -137, -127, 347, 1012, 927, 665, 1194, 982, 731, 64, 390, 65, -441, -538, -48, 138, -175, -274, -65, -117, -199, -236, -230, -169, -365, -471, -76, -343, -465, -332, -23, 107, -296, 258, 450, 558, 477, 552, 496, 183, 127, -3, 58, 45, -270]
2384b70j31L73m57K83r1J20m52M18L48k8l38K56K39j72j44L65j48j25K6q4M68
2405D56j07o45N07O1n87n7L29k05l49L04K9O0P7o0L76k68j05K63J46R0j88N41
2427F68j73l88q5lJ87k3k72K07K03k31l85N25j84o03J0K27j37l08K45J87L31m06
2449d08M94J3J8L70R4L20k35p9J0k73l70j75MJ30k08j08P3l9Q5j19K16k32j22
2472e41j26L06J12l51K40N70k14j26L73K50k66o4L41L02k93k47p2K05q78q2N96
2493C5n39N3nK28j73K05k67N71n35R8K42L27p9L8L34j79J92l31K51J04n26P7J83
2516C04J16l03L4j92j24l45j90K8J70k05K83J63o8M4q4L02M39L30J56K46k56l95
2538D53j69K1n94j14K25J35k85p7M01K42k6%J50m73l63m7j43k6n01O53K92J09
$$ y = [-270, -401, -28, -485, -202, -293, -173, -625, -207, 141, 113, -225, 31, 270, 98, -46, 319, 171, 46, 72, -12, 456, 349, -296, 211, 272, -315, -372, -43, -248, -597, -293, -264, -204, -127, -187, 189, -79, -184, 79, 225, 315, 127, 668, 495, 107, 22, 19, 206, 183, -89, 118, 321, 90, -295, 230, 46, -557, -547, -320, -457, -765, -520, -333, -2, -408, 86, 99, 117, 487, 581, 901, 666, 587, 597, 324, -46, -221, -217, -87, -295, -403, -330, -369, -284, -403, -187, -419, -541, -667, -361, -249, -600, -360, 210, -4, -130, 243, 493, 227, 163, 504, 806, 513, 266, 194, 399, -479, -561, 35, -504, -451, -456, -228, -401, -196, -463, 108, -427, -329, -87, 240, 161, 199, 533, 354, 546, 215, 466, 570, 44, 121, 304, 420, 117, 151, -41, -165, -510, -700, -672, -502, -707, -424, -261, -329, -285, -369, -67, 372, 702, 858, 1104, 848, 453, 284, 305, -289, -403, -178, -43, -328, -405, -4, 238, 212, 212, 362, -111, -474, -521, -664, -690, -1191, -538, -246, -137]
2560a37L7M82L90K46k81L09j7l73m86L8k63p11j06N15k68K7L65M63k6l86L02O3
2582A83k69k68q4K02k76L2L25O42m65L26J06M52l03J16%l69l53n27J68l10j1k47
2604i30O20J29L13L95j24N5j96j93j39o8o13L29K41k5KM81J28J33j56J76j66m18
2626b6K60l98l02m48L84l7K14k03N43K73%K62K82j68m2l49k84j77p2k72L05R9
2648a56r2N3M61J06J13k35J33k68j42j22q5K4j59r8J19K54k05M70L17k06l1O0
2670C11K60n73p9Qo3M1J40L52Ml82J31J01k2m38N2l6l60M56L3R1l3K9q6k5K77
2695A89j1J66l3j36m11J98k65J2K13P7J2K79P6L38j42k29J9m76l39o29O42l05
2717g55n3O33M5J71K3l1L22k2j42K03N1k84R5k37j45k01j46J32M02N3j15L94q7
$$ y = [-137, -100, 382, 772, 1018, 737, 1046, 1029, 656, 170, 208, -55, -766, -872, -357, -625, -598, -233, 230, 204, -182, 120, 183, -86, -354, -438, -236, -512, -480, -155, 487, 22, 348, 454, 906, 603, 719, 719, 350, -3, -530, -362, -672, -683, -930, -310, -181, 132, 527, 403, 458, 262, 69, -70, -138, -751, -422, -181, -206, -204, 277, 405, 538, 382, 558, 392, -26, 234, -164, -466, -914, -530, -567, -353, -556, -13, 260, 260, 522, 804, 636, 594, 245, -39, -216, -288, -560, -255, -156, -248, -195, 266, 372, 485, 250, 383, 115, -27, -149, -234, -210, -369, -467, -348, -94, -299, 171, 488, 282, 251, 311, 571, -2, -81, -73, -136, -95, 45, 397, 401, 19, 150, 251, 229, -209, -157, -193, -553, -97, -64, 27, -6, 23, -63, -88, 189, 178, 344, 311, 175, -236, -38, -303, -291, -78, -1, 11, 290, 366, 704, 562, 333, 352, -124, -463, -1092, -450, -755, -808, -175, -130, 41, 64, 33, 355, 333, 191, 394, 445, 161, 256, 19, -126, -327, -473, -341, 61, 114, -1, 393, 306]
2740C06l44j48J97j61l91k43K99J38r0J56L68K9J0J29O4J64m19p9L16k32l0J1
2762E0L70l20l29M9K17j42J19l00L54k59j25J79l69J44K79O3K06QO5L99k66k74
2784A18P7J54m18k55J15L57k28k53N62Pm53mR7P5k2o7J03j3l83J04L88k21j30
2807b90K07K33K3Q7l5M3j21m59N81l78K13P4m10M42l19k2rp6j89K40K26J67k15
2830A3K90j65j59M82k61J68k60j53k39J64k93L11l16J51rM9L62J34j91J17KK16
2852D13m54j70J43K9N9j84J29K2j37K80J15k79J58o4J85m48J60k8J34l23j05J36
2874b29Q1J42j60P3P7K04qJ92J57l21K2O1k89p7nj2l11N5j42O8J02j13J82K81
2898C0J95J52R2n6j31j83L68l92j11l85L87K47k82K43j79L78n05J57J84l14O8
$$ y = [306, -38, -186, 11, -150, -541, -784, -485, -347, -437, -281, 87, 116, 126, 255, 319, 483, 64, -15, 301, 69, 39, 50, 420, 100, -229, -180, 37, -105, 14, -286, 68, -191, -316, -137, -506, -362, -83, -20, 186, 194, 259, 658, 392, 118, 195, 349, -69, -324, -209, 148, -80, -333, 229, 236, -217, -221, -124, -49, -71, -138, -35, -48, -431, -327, 61, -160, -290, -83, 150, 173, 260, 225, 268, 147, -312, 269, -109, 104, 178, -232, 210, -109, -131, -140, -216, -405, -165, 61, 228, 13, 303, 138, -21, 461, 200, 368, 108, -45, -284, -120, -413, -102, -418, -267, -276, -227, 135, 269, 78, 195, 197, 413, -41, -211, -68, -39, 20, -164, -35, -13, -150, 130, 245, -34, 124, 60, 245, -203, -43, -71, 63, -260, -365, -229, -148, -6, -166, -93, -16, 188, 180, 372, 529, 208, 230, 291, 2, -75, -80, -92, -403, -348, -490, -422, -320, -433, -251, 30, 225, 377, 469, 413, 282, 99, 467, 75, -36, -421, -34, 213, -69, 174, -5, 373, -132, 25, 209, -105, -37]
2919c7j1k9l38o7L7M29k83M02n1O4M26j09k61K52l36r7J45j84k55P2L02N2k52
2942a29J73J49j3m7p2k71j20k01j2L25j85n7M22K32j82K19J09J67k44j23j6k08
2964h4r1j11j24j3j61J79K64J90K93R2j23J00k43R0rk99k92j92K82k16J00M40
2986G2q6K96l2K81l35j0j8pj4n84N46k60m30R8J74K97J99P6l6J03l2O8k63k15
3010a12j9n0j22j00N4J61J17K07n6j24K05j03K74j74j2K14n44Q6o3j0k08O9P5
3033b35j7MR3R1mM3K32n5J9K58j58l36P7q0K81j2j91jn0K2J40L0j65l3l41J56
3059b32Q9k24k08O6L92l38J76M68n1K01Q0J19K96l42j46L0k06j72l04M73o62M89
3081fk27J06K59l96L51Q2k87L4j36m42J57n8L8K01M18k25P66jM1L23k56k48K1
$$ y = [-37, -48, -77, -415, -482, -445, -16, -299, 103, 52, 116, 542, 433, 172, 424, 88, -9, 136, -48, -303, -231, 71, 123, -129, 44, 193, 180, 133, 61, -210, -330, -531, -543, -218, -403, -460, -38, 194, 12, 231, 340, 507, 263, 140, 124, -84, -175, -286, -410, -423, -584, -405, -141, 49, 342, 434, 311, 411, 168, 258, 249, -50, -342, -534, -252, -468, -368, 72, -14, 282, 250, 531, 196, 186, 168, 161, 147, -437, 109, -151, -581, -483, -309, -12, 187, 263, 227, 330, 298, 366, 103, -112, -131, -181, -303, -403, -349, -188, -71, 136, 80, -44, 161, 58, 332, 158, 146, 360, -184, -98, -161, -171, -379, -310, -235, -252, -248, -155, -64, -68, -25, 207, 152, 171, 429, 271, -65, 12, -68, 213, 201, 10, 9, -41, -19, 121, 151, -14, -47, -388, -232, -143, -367, -575, -509, -117, -455, -279, 189, 138, 339, 419, 538, 834, 492, 346, 376, 170, -2, -306, 167, -495, -6, -233, -127, 132, -264, 87, 169, -118, -84, -220, -662, -505, -563, -525, -324, 94, -131, 635, 634, 675, 998, 742, 494, 515]
3104E15m00k11k83l78L2J19n5J07N27o4%j35L43k43n0Q7j73rM3o0J06K00l7L95
3128C76L83j94M01j40k27k34k54k70k6n80k34J91J7R1L63J94l4M78j94M01l49
3149A59mp1L75m68k03J92m0J29P5R8J26J99k71l1k04j79m73J67N0l74O6L10R4
3172b78l01J94M73K8L57l54M26k46j33J23k04J45j75k82J82K63K8%N7j30k60N00
3194D13o97J64k50n8K34M0l20L39j55r1M51L75k4k76O7Q3O9n1k02nJ85l32j25
3217a66K07k83L1M02q8k16M6l6o6M7k4M8J4k18M01j78L48l32K5J06j35L96n7m2
3241B30R3m2l8j58r7j95k72O0P1K2m4M29j42n4J24r2K10p2J81q0j36K18q3L20
3265D53k67n4L39k88O6J36l12K85o66L06l37j74l5K66k34J81J7L54j55J91l74
$$ y = [515, 115, -96, -379, -757, -725, -606, -661, -554, -27, -91, -91, -226, 117, -126, -176, -89, -262, -271, -228, -288, -182, 18, -19, 376, 759, 565, 966, 826, 599, 365, 111, -159, -185, -765, -999, -808, -791, -700, -337, -143, -177, 301, 107, 508, 159, 155, 84, 459, -9, -212, -20, -60, 69, 144, 242, 368, 567, 296, 265, 61, -118, -591, -424, -374, -748, -682, -372, -278, -579, -385, 88, 116, 473, 119, 545, 299, 166, 289, 85, 230, 55, -227, -45, 218, 246, 246, 303, 173, -87, 413, -284, -120, -370, -428, -194, -154, -474, -135, -290, -381, 70, 445, 421, 145, 212, 295, 364, 313, 111, 106, 291, -41, -166, 41, -242, -211, 191, 103, -113, -67, -103, -169, -122, -146, -98, -84, -302, 99, -79, 269, -63, -38, 68, -67, 329, 272, 230, 323, 281, 243, 85, -12, -207, -479, -419, -348, -326, -370, 59, -83, -137, -13, -105, 105, 33, 214, 134, -2, 216, 133, 453, 186, 132, 471, 183, 249, 385, 73, 358, -308, -2, -339, -513, -548, -282, -516, -335, -318, 36, -119, 72, -302]
3286c02N44j53L7K12Q6j90k00K84m6o2l83L23l56J95Q9L9j61j92j11J36k39J36
3308c14j40L18Q7j0rJ75J47m0J01R9j67k11M63j49j47j11K9l25o3K5k1m9MJ08
3332b00j24j77L68K30J07j51o9p5K10m1L4J29k40j29J10K17N1l59J70j48j47j5
3354b49o3J50q8K50j01J41l70K57Q6K24k31pJ69Q8o8M2J61j22J42l44kJ47k35
3377b3j26O1j24l8j85K22J18j16O7K45j93P1nK85j53m2q8K26M3k14J76R7j92j51
3401c9J22Rk29J86j35J7l22J45qJ0K55l50J28K52k44R6K54l24L28Pm7P2Q6K26
3425D95k94m5j06K18k02O0l06K09J82l21m1R5l98l5L05Q5K54m12J36L99m42K58
3447I4J10J28j27k26J13J37J37n56Pj8pM8k1J0M5L0K86j28p1L0J5L30n27prp5
$$ y = [-302, 242, 89, 126, 338, 424, 234, 34, 318, 272, 210, -173, 150, -206, -11, 78, 117, -44, -236, -347, -211, -450, -314, -454, -136, -49, -59, -68, 107, 254, 214, 315, 414, 247, 36, 499, 350, 203, 92, 121, -204, -267, -242, -263, -312, -308, -200, -324, -501, -133, 97, 204, 53, -16, -91, 119, 78, 112, 241, 1, -128, -18, 199, 250, -109, 61, -87, -234, -249, -312, -162, -250, 0, -101, 40, -330, -73, 13, 237, 6, -1, 168, 256, 188, 230, 391, 269, 411, 67, 65, 212, -23, -149, -88, -212, -250, -435, -213, -95, -211, -144, 101, -92, -21, -26, 259, 106, 64, -24, 202, 245, 31, 207, 304, 112, -39, 83, 92, -137, 49, -86, -69, -391, -246, -254, -244, 11, -339, -211, 41, -203, -107, 147, -177, 151, 158, 111, 183, 269, 495, 201, 156, 50, 268, 66, 126, -180, 29, 211, -110, -151, -56, -454, -489, -184, -99, 155, -257, -121, 278, -164, 94, 204, 332, 205, -21, 92, 229, 366, -190, -183, -201, -208, -160, -181, -171, -126, -96, 190, 62, -9, 21, 36, 366, -161, -168, -177, -252]
3473b52K15j44N08m9j48M79j4k78K3k72j83J02j94j83l47L77L2J8jKL66L95j68
3496B84l13L03L5r9k73L50k52n7q6Q6L86j12p1J15l11P2k84M49M5l28k2q0j12
3519b75J27k74L85J75j97K20J98N0l03J80j91R0k29K53k52L54j40k76J76l23K13
3540c9J7j33l8Q3pK67k77J31j68KO3lK15j2j66N11m59L41q4k17J8r7k14R7K89
3565A20n3j20k45J4l9P5J29K55J57o6l9j75J03RK1Jl50K74j39J24L00n3p2k84
3589e3P9O0j58N2j95K85l71L0j41K66j63K62j1J65L15k43J76Q8J44m77r0J22l06
3612a64J93k69K11k11k31L35K1m5N0J87J6J96m32j70Q2j20J0J79M2j30L91M29
3634E70l83M93k80K95m02l89Q1n6m75L43m06K26j13J77J38j27J45L74p3j80K04
$$ y = [-252, -37, -181, 327, 278, 130, 609, 595, 317, 340, 68, -115, -13, -207, -390, -737, -360, -328, -310, -311, -309, 57, 452, 284, -29, 274, 309, 210, -63, 287, 35, -22, -108, -22, 364, 252, 181, 296, -15, 57, -227, 222, 267, -61, -83, -163, -275, -148, -422, -37, 138, -59, 161, 359, 409, 106, 286, 95, 185, -44, 209, -43, 311, 171, -105, 71, -252, -39, -22, -155, -193, -110, -117, 150, -127, 4, -164, -162, -99, -102, 113, 101, -65, 446, -13, 328, 244, 27, 45, -52, -266, -169, 120, 67, -53, -298, -284, -323, -248, -119, 136, 293, 227, 188, 13, 116, 125, 146, 147, -203, 71, -68, 56, 356, 303, 231, -53, 26, 86, -72, -20, -215, 70, -301, -271, -412, -146, -309, -47, -58, 107, 422, 179, 355, 443, 587, 110, 20, 142, -164, 29, -240, -29, -240, -471, -136, -115, -160, -110, 77, 93, 289, -143, -313, -231, -351, -341, -162, -120, -250, 141, 570, 187, 680, 400, 695, 293, -96, -15, -71, -546, -203, -609, -383, -496, -319, -181, -308, -163, 211, 138, -42, 162]
3655A62J30J09j76k69L40r9k72K61p8M70o58K2L18j85l89P1j81J88k47n0K79j07
3677c61K66J97o5M30m05P5Q4j59M32N4j42k59j57K91l28J99N0p2j05J29l11J60
3699Ck81j70k53K93Q5k79J22L82J4KK82J92K13P2n2j59M1k93J05k08J0l60l3R8
3723a74j07R9j48J7J81N0j45J82k05J36k03J79j35j04L65K28l4J48J23j47L07
3744F13J57n19J72J3l54j36l20r5K07k75J0Q2J04K88l1K46K00m05J22K0J09K5
3766B33M1k98R8L41k43q5K99n6j60n9J84l07k83J06k46R9O7J34J15m46L04L16
3788A54l6j46oL36Pj79K45m11l8MK93J58k73jL2j78K16k03R7k77l9j61K6N5j90
3813e15J42J16J89M0o6K04L20K1j82o9K14j81J06M2l56J35j13O5l29o3K7j94n4
$$ y = [162, 292, 401, 225, -44, 296, 197, -75, 186, 108, 578, -80, -58, 260, 75, -314, -243, -424, -236, -483, -533, -254, -361, -95, 102, 37, 467, 62, 137, 221, 62, 494, 548, 406, 147, -10, 281, -47, 152, 202, 130, 25, 154, -157, 3, -278, -448, -701, -408, -323, -602, -480, -98, -84, -82, 200, 392, 605, 677, 625, 466, 507, 214, 319, 111, 121, -239, -272, -174, -281, -182, -330, -313, -132, -82, -227, -45, -250, -114, -317, -138, -273, -377, -12, 216, 182, 330, 453, 306, 613, 770, 251, 423, 436, 82, -54, -374, -469, -262, -537, -527, -445, -341, -53, -84, 162, 362, -43, 79, 99, 208, 233, 274, -24, 74, 415, 172, 87, 386, 330, 170, 111, 295, -12, -295, -189, -435, -336, -269, -135, -20, -466, -162, 154, 118, -28, -34, 302, 309, 130, 375, -36, -74, -70, 223, 381, 108, 107, 139, -39, 177, -26, 71, -206, -245, -406, -380, -325, -515, -373, -257, -68, -28, -94, 110, 430, 451, 269, 200, 414, 233, 339, 381, 25, 160, 47, 112, -217, -280, -253, -447, -501]
3836e01L01K14l69k51K27k9N06l55M39J3J52K13j98Q1j84Q7K44j58l41K30K20
3857E41m85J51k77N7k65j88J36j40k3qN16j63k9j31K22J58J90l50L12L1j27L96
3879E24j32j43r7L8r2j53o1j5K17p2k50N4n4J42m55K57M4N3K74m19O36j82k52
3902a38N99p2j31Q7L56o26M7L8L04n00J60l97J93j75J70N6k95N02o53m8N39j62
3924a46o5K69j61J10K0m6K71k02m5K63P2o7J83j90k92j85j34L10j52J78m26K38
3946a97K11p01O32Q3j63K46j88P6p1J54J89J11Q3m59L31k53J26n7J67j25l51n4
3968b10L34j61k0m37K95k24J30J61j93L06j76J21K31Kl85N49Pk30J3K01j57J36
3990B93j40O9k4j64j69L97m25q1n2J74q2p5J32Q0j78K13J77j56J81m44M72J61
$$ y = [-501, -200, 14, -355, -606, -379, -408, 98, -257, 182, 195, 347, 560, 362, 443, 259, 346, 590, 432, 91, 321, 541, 56, 207, -70, -13, -278, -466, -330, -470, -493, -501, 15, -148, -177, -308, -86, 72, 262, -88, 224, 255, 128, 524, 392, 249, 152, 190, 98, -55, -116, -131, 86, 14, -236, -182, -236, -94, -549, -292, -248, -195, 79, -340, 296, 114, -138, 461, 389, 258, 345, 701, 75, 122, 160, 464, -36, 124, -273, -80, -255, -85, -29, -324, 178, -475, -523, 16, -146, -211, 58, -103, 7, 27, -19, 252, 50, 5, 268, 340, 273, 456, 266, -26, -211, -345, -35, -187, -9, -435, -197, 14, -687, -55, 28, -135, 111, -77, -1, -72, 82, 271, 382, 465, 6, 337, 84, 210, 153, 320, 195, -156, -210, 124, -37, -57, -494, -199, -423, -293, -132, -325, -19, -195, -74, 157, 159, -226, 323, 330, 100, 113, 314, 157, 293, 153, 222, 198, 34, -135, 262, -163, -244, -296, -122, -204, -279, -147, -67, -245, -32, 145, -11, 170, -274, 198, 359]
4012C59m21L57j0j20n8n7M0N3j74J95r1n5l04J23L40o19Q5Q2L75k45J9L84k78
4035b0r9p9J98L32k28K74j72J88k91P6N9k90N9j39R3LK83k64j62l97K27J53J37
4058e9j35J1K09j7Q8L13l06j30K07QK0j48O8k73M26J5j64k4k74k3K75J19k19j5
4082b8k89pL6Q7j70J55J36k11N84k8j6K0k10J81K5n6k09K89j90K4o2L5j20j43
4106a67M5j41O5k6M1p8K53J3m32K03o6M25j09N1k00L40j00L33p8j47k14K48j12
4129A47p5j70j55J47Nj23Q2J3j32R3J5o4O8J60q0J00J60K01j50k44L77j33m7j72
4153B3K42J4j17m37j7J40N2p2K42k65j37L7R6o5R0J50O5l3K63k91J4L29j30r2
4177A01pj04J05R9L1l59M02L7l75R7l17J77k8j61J99r1n0j11N15j89j88K45J06
$$ y = [359, -62, 295, 285, 165, 107, 50, 90, 143, -31, 164, 73, 18, -286, -163, 177, -442, -357, -275, 100, -145, -126, 258, -20, -119, -198, 0, 332, 104, 378, 206, 394, 103, 179, 238, -52, 7, -132, -39, -36, 247, -17, -179, -576, -349, -196, -59, -194, -183, 26, 9, 97, 410, 104, -26, 181, 189, 209, 61, 129, -144, 282, 297, 133, 109, -165, -188, 87, 206, -13, -28, -317, -324, -288, -201, -371, -216, -80, -291, 293, 265, 249, 269, 59, 240, 265, 209, 0, 289, 99, 123, 61, 96, -24, -167, -122, -263, -198, -224, -183, -261, -8, 5, -427, -224, -290, 135, 26, 77, -123, 217, 117, 450, 372, 225, 11, 259, 147, 72, -98, -253, -106, -101, -224, -142, -129, -261, -168, -153, -217, -149, 11, -69, 31, 191, 392, 242, -2, 375, 242, 195, 23, 265, 279, 162, -275, -292, -152, -100, -172, 70, -195, -332, -295, -199, -264, -174, -24, 41, 8, 271, -20, -6, 323, 193, 101, 94, -10, 95, 194, 225, -134, 268, 305, -70, 27, -290, -113, -141, -302, -103, -194, -244, -355, 160, -29, -217, 28, 134]
4200A34J50j69K37q9M7l47K84k30L36m26L9J84l57L6k26J11N0R2r1j58j17L79
4222a31J74J83o5j32P9kJ90k46J37j19J51nr9k4j5j4N8k82J77j23J45l77O5K86
4246A1j41K35q4O22o32k25M28J63m3k79Q5J35k0k94k5K43q4o1k07K1j56J37MJ37
4270c0k07J17NJ44%O8K7J69o0j74O8N7n3l5j34K06J86k51o0n6R3N3k24J52k16
4295a55K11o2k22o5m6N33n58k0L28K71k51L93l12J65l44Q0l9R9K7j18l1o2J11
4318f7J14Mk52k39M36K37j95J20j57n9j97K26J03K68o03J23J15k1L48k86J02M3
4340A63j42j14P7J04j30J89Q1L4m22J69q5k51J33K34J90k35J4q9k4J68O5j33j6
4363b0n7J90k24j42J39J70N0K1Q7j14k7k54J83pK70m44J45O6J1K06k88O9n6j20
$$ y = [134, 284, 115, 352, 263, 310, -37, 247, 17, 353, -73, -34, 150, -207, -171, -397, -286, -236, -144, -235, -393, -510, -131, 43, 226, 161, 29, 108, 106, 296, 50, 187, 68, 219, 214, 115, 91, 76, 62, 120, -162, 15, -108, 37, -340, -275, 11, -130, 105, 21, 643, 11, -214, 214, 377, 334, 55, 140, 275, 255, -39, -64, 179, 95, 34, -173, -152, -308, -171, -167, -30, -237, -120, -115, 29, 29, 97, 124, 293, 233, 59, 127, 184, 131, 96, -38, 168, 354, 103, 43, -13, 80, 133, -91, 61, -155, 56, -6, -228, -293, -339, 194, -364, -384, -56, 215, -36, 357, 45, 210, -134, -54, -93, 6, 33, -85, -116, -178, -67, 47, 51, -201, -440, -4, 233, 38, 158, 1, -58, -255, -29, 74, 342, -261, -138, -23, -44, 304, 18, 120, 163, 21, -93, -16, 88, -42, 147, 228, 262, -160, 9, -76, -327, -194, 40, 230, -5, 9, -80, -104, 64, 129, -4, -20, -77, 113, -111, -253, -114, 56, 106, 127, 214, 100, 73, -181, 2, -5, 265, -179, -34, 32, 43, 249, -39, 30, -26, -146]
4387a46kM48k53p4J5P2J97j69k17J33j16J24o0K77l51q2K23O4j58n7K94l84J89
4410c3r6J52M7K00j71K26l01L6J63J11l37J08l6m05K12O9L2M4J95k72J9j66rP2
4434a40J65M7jk12R5J72j30j01L69j93m84N55q7j50JJ44J90l64J71J4k82%o2k1
4458c04M46k28O4P9j73K81m2J81l8l2q4l2O2j84J58KJ68k83j54o6L11k20k37J68
4482a57j41M6L58k65K57j85L12k18L46pj46j10k49M19j83P5n1k62K69J47l38K99
4504B16l30K20l98j3L71o4m0j85J20L95k06N4k5J3L28K4j52j33o6o0K59l01l28
4527c01M24q0j24k60L59j06J68k26J86Q3k16N9R4M6k17P3L66o6k78J47J48l95
4549a16K98l92K75k09J24k32J23J26k82L37rj16R4j31j09J58J20Q2q6Rq0N2J14
$$ y = [-146, -148, 300, 47, -27, -12, 60, 257, 88, -129, 4, -112, 12, -48, 229, -122, -204, 19, 83, -75, -132, 162, -222, -33, -129, 23, 70, 270, 99, 325, 24, 60, 223, 334, -3, 105, 69, -336, -124, -55, -23, 21, 216, -56, -37, -203, -212, -140, 25, 72, 71, -141, -46, 126, -4, -105, 264, 71, -413, 142, 55, -95, -94, 50, 240, -124, 47, 61, -221, -221, -283, -304, 142, -86, -22, 57, -116, 165, 123, 304, 266, 234, 150, 118, 180, -4, 154, 156, 324, 41, -113, -179, 132, -88, -325, -157, -298, -252, 106, -159, 98, -87, 225, 7, 353, 346, 200, 90, -159, 260, 77, 152, 101, -161, 108, 255, -83, 216, -114, 106, -292, -305, 66, 2, -38, -223, -103, 292, 86, 140, 115, 128, 456, 480, 328, 195, 129, 69, 328, 27, -301, 123, 43, -81, -341, 18, -88, 80, -146, 40, 123, -93, -34, 60, 106, -111, -38, 328, 262, -16, 131, 279, -116, 182, -210, 65, -144, -20, -252, -129, -3, -285, 52, 43, -73, 21, -110, -219, -61, 59, 141, 55, 64, -16, 36, 150]
4572A50J86j32p6QK8l66K59LK57k80K1R5k52j10J53j50M0k2L87m86M92l32J13
4595a4m1J65L2l0R1k80Ml00J67M72j99q1K54j59L3m38L87J32l21q3J57M7k67L30
4619E8qJ77m93K49k5L00n24K64J6J52L3Mk93J67k48K83p5J90k59K19J25k44m9
4642A9j73P8J75l04M69l00l1P3N5p3l3J89j63K21k99M38k13ro1p3J67j96n3M1
4666e6Q5p4j10k30K20R0p7r5K42k22J76r6K49r2j54K55j39P2o1L44k78j04qq8
4690a51M09m28m1K83Q8k12L14k77J04l30m8M79l03Q5o5J69k73J63K06j4l1j90
4712f3M47j61k14j20J17lj84K38J59m13Q3J46J05j19Q6k36K80q2N1k99J15N5l3
4735d5m4J12r7j7L43j20j80J06KJ8J56j16l33J3J14K43l8k36K36j56J38j00K71
$$ y = [150, 336, 204, 128, 136, 164, -202, 57, 60, 317, 37, 58, 153, -99, -209, -56, -206, -166, -188, 199, -287, 205, -127, -14, -55, 110, 142, 112, 203, -77, -73, -373, -206, 266, 67, -14, 240, 81, 114, -324, 63, 195, -126, -209, -52, -5, -272, 58, 50, 227, -266, -17, -42, 258, -266, -2, 14, 166, 199, 203, -90, 77, -171, 112, 37, 227, -32, 187, 312, 68, 19, -154, -76, 99, -205, 264, -36, -67, 6, 61, -12, -45, 144, -19, 202, -97, 341, 128, 119, 58, -15, 152, -44, -97, -56, 29, -45, -155, -385, -165, -75, -152, -247, -5, -227, -51, -147, 102, 10, -144, 111, -28, 44, -17, 327, 49, -55, -63, -151, 258, -170, -211, 72, 160, -52, 262, -15, 89, -241, -289, 190, -113, -28, -93, 76, -197, -34, 172, 158, 127, -63, 384, 223, 9, -111, 6, 3, -181, 57, 216, -197, -114, 32, 137, 18, 104, -132, 148, 66, 117, -182, -67, -12, -45, -89, 23, -74, -91, 252, 132, -48, 58, 60, 78, 234, 118, -215, -202, -88, 155, 117, -119, 117, -39, 99, -1, 270]
4758B70k87J20J0N0q5K45l43J0K16l30K9n4L33j06o7j9N9k69k56N80m96L45J26
4781H1L8NnQ6o8J25l43J00l8J42j92J45m0J73q9j04J48l77R8Q1q8j43J67Q6J12
4806A00%K6k68J96k06M11P5k49K09m2l00o8J81J48n7j4q1l47L26j26p5Q6k2L05
4830B08k58j63L96k70l9N6Q8j86l6J81n1j07J35K62J22k91p1K17r3j07m0J26Q9
4853A68n32K78J12j10K27k32J37k78l4L17O3k7k60O8M13n84L27K20l01J19Or4
4875Cr0M08m75k8L11j35k1j44L4NL06j65j92l7M7M4K14k76O2J16j0RJ99O9j77
4900G7m2J08q6L1k66K39j24j69J51K49j84o1J50J82k63j07P3N1j69K96l9J22k90
4923g1R3j3j15J12K34q6k9r2M2n2J20k43P2k8j2k2l3p7M1N1n7M15j95j47J48k
$$ y = [270, -17, 103, 113, 163, 78, 323, -20, -10, 206, -124, -95, -149, 184, 78, 11, -8, 51, -218, -474, 106, -390, -45, 81, 119, 124, 119, 205, 137, 262, -81, 19, -19, 123, -69, 76, 36, 209, 120, 16, 164, -213, -115, -34, -122, -265, -98, -12, 100, 100, 126, -142, 54, -152, 259, 334, 85, 294, 252, -48, -116, 65, 213, 156, 142, 61, -286, 40, -86, -161, -75, -97, 208, -50, -213, 183, -87, -126, -70, 18, -168, -204, -23, -74, -181, -46, 216, 338, 47, -24, 193, 100, -7, -47, 79, 168, -364, -86, 26, -84, 143, -89, 48, -230, -264, 53, 116, 89, -171, -103, 310, -274, 53, 273, -28, 91, 97, 3, -87, 321, -154, -182, 129, -6, -27, -171, -137, -132, 174, 9, -183, -220, -173, -129, 85, -191, -129, -13, -23, -14, 185, 254, 77, 35, 143, 57, 88, -178, 61, -63, -232, -81, 168, -16, -77, 73, 255, -8, -115, -42, 9, -160, 136, 97, 219, -71, 22, 9, -106, 6, 240, 154, 125, 33, 75, 23, 143, -100, -28, -56, -68, -90, -123, -200, -159, -108, -165, 250, 55, -92, 56, 54]
4949E4k40J75J08m1j29N0M6k95K33q8L42l21o7J17j77K68k27J96j43L16m13L21
4971H5j77k65M71n6j23j9J49l9p7J15o1L49m54M3Q8j0m7k57K78n1R1L3n2Q4P5
4996A73k2k13K24q7j62K82j66K2m1l00K69j4K03Pj26j94p7L87o9k59N6Q1j17J51
5020HJ9k86J61J46O9j26k15J36K09L1m9q4K07l16N3N9P7j78l2L19r7k2p5J11q2
5045D3K7j29L70m97J93M2Jj54J90q4p8J15j79K59jj04J48j26p9j59J34lj5J28
5069D2P4j13M43m25p0J44Nn9O6P0k45J88r9j4P0k49L05J78k76J83k63J13p5j94
5093b01L07k38k33L48j59K67k39R2pM3m4j72L76k51j26K56m1J58k36l0L51k35
5115a4j01N9K69k63j43k6L19J73k91j14J20j02J95L30l90j47K66j5J05k03J04
$$ y = [54, -186, -11, 97, 56, -73, -23, 23, -272, -39, -127, 215, -106, -173, -56, -233, 35, -192, 4, -139, 177, -236, 85, -92, -357, 114, 58, -65, -84, 65, 26, -51, 64, 3, 352, -102, -59, 29, 19, -28, -285, -7, -58, 33, 66, 14, 98, 173, 151, -62, 162, 75, -87, 195, 29, 51, 10, -290, -21, -35, 168, 175, 49, -145, -222, 165, 96, -163, -107, -26, -143, 8, 27, -259, -98, 48, 117, -9, -224, -88, 121, 152, 103, 19, 226, -90, -37, 22, 99, -79, -111, 208, 111, 89, 14, 125, 43, 70, -59, 311, -186, 7, 49, 50, -104, 86, 2, -76, 39, -140, 119, 118, 14, 162, 36, -43, -202, -68, -71, -86, 42, 116, 3, 446, 21, -49, 95, 100, 41, 107, 177, -68, 120, 21, 7, 77, -172, 133, 311, 35, 218, -45, 68, -7, -201, 106, -132, -365, -17, -176, 91, -148, -56, -63, -20, -64, -236, 140, -111, -237, 19, -22, 136, -100, -130, 221, -14, -115, -56, 213, -50, -193, -219, 100, 273, -18, -132, -12, -114, 81, 411, 21, -126, 140, 125, 230, 27, 131]
5136A31k54O3Nj24J66J34L1k25L8Q7l85K97O6M5l59K44p3J45j29J9J22O1j76J50
5160G9k7J4j78K96M0l35k10L83N0k38J17J28l12J10m2L25k64o1j57K34k1L47o7
5183B11j8k36J63R8j73P6j70R4M9j61j56J93l86M57O0On2jql8J98k25O2p8O8K1
5209E4R1j78O3Q0n0J9J68k79J90r1j23K22n4j84l06K11J97j4K15O3j76j41j81
5232b04J99J21m31J59J19K04l34P0K40Rj91P2oK84j76k42L4j49J95n8J96k32K
5255a19M48m05Q0m7O2q9J35r3J22j70N3j7K61k73J16j94J08K50k13N2M7n2j59
5278i7K04j24K16k83K9k6j5P6Q2j0O8j17j66J73J47l4j2q9j07L14k57mNk27L81
5303A27k31j27J6pQ2K57l90J27j3R4k13K31L28k56K30l23j47j25O24p8L6m26K0
$$ y = [131, -123, -60, -55, -179, -13, 121, 152, -73, -35, 52, -333, -36, 30, 75, -284, -40, -113, 32, -97, -78, 44, 105, -71, 79, 52, 66, -112, 184, 224, -111, -321, 62, 112, -126, -9, 119, -193, -83, -125, 200, -64, -125, -282, -48, -69, 278, 211, 193, -43, 120, 218, 45, 121, -49, 45, 94, -67, -223, -30, -416, 41, 101, 107, 55, 54, 46, 8, 206, -19, 43, -35, 33, 54, 145, -33, 30, 110, 60, 79, 247, -32, 158, 67, -56, 166, 112, -72, -378, -167, 30, 16, 231, 294, 118, -23, -204, -5, 116, -315, -156, -37, 167, -167, -97, 143, 152, -39, 33, 27, 311, 135, -107, -73, -222, -27, -85, 111, -121, -119, 329, -76, 4, -43, 19, -70, 65, -28, 94, -76, -23, -40, 221, -52, 64, -130, -22, 228, 15, 67, 114, 62, -97, 107, -17, 199, -84, -55, -81, -96, -20, 62, 52, 120, 3, -163, 10, 157, 123, 111, 22, -85, 229, -28, -32, -27, -254, 127, -104, -231, -215, -222, -140, 117, -273, -146, -159, -65, -278, -47, 281, 25, 255, -68, -215, -340, 284, 206, 242, -184, -164]
5326a64L01k22n3J65J51j90r0J11k53P4L20k4J55l25o4M17l22j18N9J24J2M3J20
5349B27j92K0j22K83J0k52N7J38l43j61J94M3J18k8j3J64m2p7j42N98n25k2J83
5372A16k05K43k57R3K10k49K40l4j68k57M36j55J17j62j04K00j85j32L25j11j5
5393e4J35o5%R8k75J84m4K0J13J83k15l5j1o7O6J19k52M78n15Pk3L21j1k42P1
5418a4K47k49j65K64J42l31N7M3K8j67K11r6K8M1KM8j03j45mrJ21J10m19L96Q6
5443A22l69K16L04m25J7J9N0o4J04J18J22k83J57P5o9Q8k76J92l17K06L0J07O4
5466A88k97j8J34K17k31J06R0j98j32J53j8k02K73P9j13kJ28l54L04j05q9o5J78
5489B6Nk39K54l6m1L00k63J58p9j81P3k0j5p8K97k83kL22k86Q2P5m4M4q8j76J89
$$ y = [-164, 137, -85, -138, 27, 178, -12, -102, 9, -244, -170, 150, 126, 281, -44, -108, 309, -13, -131, -72, 52, 64, 107, 227, 35, 55, -67, 216, 226, -26, 31, 169, -174, -335, -141, -98, 20, -8, -21, 143, 101, 24, -118, 480, -45, -67, 116, -89, 154, -103, -10, 200, -49, 191, 157, -11, -268, 168, 13, 130, -32, -136, 64, -121, -253, 72, -39, -54, 81, 16, 16, 114, -161, 23, -21, -1, 112, 295, 80, 45, 34, -33, 33, 152, -100, 378, -137, -130, -153, 168, 157, -85, -14, 233, -16, -181, 83, 225, -106, -49, -6, 22, -145, 66, -30, -2, 39, 41, 89, -14, -159, -163, -172, -51, 59, -360, 36, 122, -247, -31, 273, -152, -135, -116, -66, -130, -26, 92, 214, -69, 88, 163, 94, 182, -94, 98, -219, -13, 17, 124, 188, -109, -127, 7, 224, -7, 99, 189, -9, -141, 12, -6, -208, 65, 144, 31, 29, 157, -197, 107, 2, -87, -152, 26, 31, -208, 46, 10, -31, 269, 6, 164, 85, -96, -23, -43, -58, -136, 161, -122, -124, 198, -88, -6, 69, 25, 69, -19, -195, -6]
5515fP3l5k74J19L92k43j6J51k74Km9L14N2l60j05M81k72n3J7K42k54L0J1J29
5539G2k76K14j71J58o0l50M39k23j5j39N02r1j59J42k7k03K51n3n2m1j11K17l9
5562a5J31l62J37p4J09J75j78ml00J75J86N2o9J12K62K8p36L13L27m04K32j70
5584g3L62l25kK12o4l56L67l12M30o5k22O1j49J76j22K3j42L1q0L02j08j35K9
5607a62R3j01J2J07k11J67K94k43QM1j14J14N9J1O8k22J67k47K39j8k63r0P1J99
5631b1j94J61j40L61l3q2l03L38N6k27Q0K5l07J21J91J23k50J68J18k19L1q3J06
5654B0j00rj13J51k6k71K34M26j32J06%l87J65O1m80J63K20m10M00o8j66M00k5
5677A59j87Q0K39k1j89o3R9q5l8j86K16l30L63Q8k56K02J19j48k72M04o2l16R
$$ y = [-6, 67, 32, -242, -123, 269, 26, 10, 161, -113, -111, -160, 154, 206, -154, -259, 222, -50, -103, -86, 156, -98, -68, -57, 72, -204, 10, -161, -3, -63, -413, 26, -197, -212, -351, 151, 60, -99, 43, 16, -187, 64, 11, -41, -82, -193, 24, -15, 116, -246, -109, -183, -74, 101, -77, -81, -381, -206, -20, 32, -37, 75, 337, 365, -371, -58, 269, -135, 97, -73, 289, -36, -38, 174, 110, -246, 121, -191, 239, 174, -48, 13, -136, 40, -82, -59, -201, -170, -250, 52, -56, -191, -162, -69, -170, -158, -51, -262, -95, 199, -44, -36, 5, -109, 5, 64, 75, 143, -79, 88, -159, 80, 62, -201, -291, -220, -21, -215, -54, -194, 167, 134, 52, -251, 87, 143, -84, -4, 21, -286, -165, 26, 149, -101, 67, 185, -34, -3, -86, 20, -80, -89, -202, -51, -77, -348, -114, 312, 180, 286, 286, -101, 64, 125, -355, -192, 28, -382, 18, -50, -216, 184, 159, -28, 52, 291, 270, 81, 18, 117, 32, -6, -192, 24, -306, 57, 145, -111, 91, 210, 62, -210, 194, 132, -184, -175]
5700a75K31j08K44LM5j33o8J25j88j0m7J00m1rk19L77P9j63LJ62j11o1K32m10
5724a42j2M1J28n9j38K44o3K60n21M69l7j28j40J45p9l09L45k9q5J22M0J03k98
5747a43J33K26j14l03L87k41k3Q1k26L68k61K95l38O1K17k69J05l4K21l88K63
5768A7o6%m7k6J65l7J28k13L81l98r4M5L94p3M9k32l9p7p1J79K7L8j1k74J56M44
5794C65m00L51l56j19J5K80m15N17l45J75M7r2M7n3P8j50O6P9k55P9j06L70j10
5817F8r6L05k51k18L0K44j83n5L71j9j3j52j24J41k07L6l0M2K56j51J84J51k26
5840A03l8j93J38j70k3p4L65J27m85J27r4L5J29K05j68j75J04K75j63N4r9L99
5862C79n29J98k00QL96k80j34M7L51n89M94j48o4k37M20l09Q0R3J32j32Q7k27
$$ y = [-175, 56, -52, 192, 195, 240, 107, 39, 164, -24, -34, -81, 19, -22, -31, -250, 127, 206, 43, 46, 208, 97, 36, 268, -142, -154, -113, 15, -44, -182, 62, -1, 259, -262, 207, 170, 42, -98, 47, -32, -341, 4, -25, -110, 12, 52, 155, -143, -10, 216, 102, -201, 186, -55, -78, 3, -223, 145, -116, 179, -159, -98, 119, -150, -45, -79, 142, -246, 17, -49, -49, -96, -122, 43, 6, 134, -79, 302, -96, -190, -145, 249, 176, 225, -7, -46, -123, -194, -15, 12, 50, 39, -235, -79, 365, -35, 316, -40, -159, -144, 136, -279, 238, -107, 68, 115, 23, 70, 17, 95, -55, 11, 90, -165, -86, -192, 178, 68, -28, 277, 26, -192, -162, 82, -101, -156, 215, 196, 183, 31, -93, 48, -159, -123, -153, -111, 145, -6, 178, 329, 103, 65, -128, 10, -160, -183, -257, 108, 235, -250, -123, -217, -182, -53, 152, -16, -191, -87, 188, 25, 79, -20, 379, -150, 48, -152, -144, 252, -28, -162, -115, 236, -353, 141, -7, -71, -308, 112, -197, -117, -24, 108, -24, 63, -164]
5884a64J95p0r0r7K21J50j05m5K11q6k50N2J37k3k17K09K05k97r7O5R4R2nj52
5908f7j36J24J75l3j31k84Q1m9J33P8J18J37p7j37L6M6q2L7J22P9l15J42j5K30
5932B12k65Q0k58M37j61K7q1M6k60o9L89R7m94p9M25P9k62lR0KJ14j56O5j72O06
5957D09m67K86l26J35j72J40K8l81N31m9J84k95J95l90K63o5j15J00Q8j85J22
5978C6m1j24K18j9O3j6L36l28l14L71j31j69K45l63M02k06j55K9N71m41L22j9
6000B67k30j96J47k42L39k00q0J06J26ok65M86M1k10j90K18k45k4K46j39J79j78
6022e0j83K71k7j48j94M78k21N13m79J4K8J1m0j16Q9K61p2k76L82j87R0m8k43
6045a47OQ7L01l36K42j31j87j03K93j44j09L34j44J27k31N1K73l45j10k39O75
$$ y = [-164, 31, -39, -129, -226, -5, 145, 40, -5, 206, 120, -130, -78, 59, 36, -181, 28, 233, -64, -161, -96, -2, 90, 85, -67, -203, -79, 96, 63, -68, -352, -271, -320, -187, -109, 9, 146, 69, -68, -32, 14, -68, -31, 91, 170, -145, -3, -18, 212, -53, 27, -231, 206, 45, 72, -9, 37, -223, -292, 97, 194, -300, -379, 46, 125, -137, -140, -50, -48, 66, -90, -25, -197, 409, -58, 228, -98, 37, -135, 5, 33, -348, 183, 134, 318, 23, 218, -172, 91, 26, -89, 11, 99, -86, 36, -5, -129, 89, 70, 133, 117, 453, 125, -189, 182, 51, -118, 127, -236, 166, -40, -195, -166, 405, -36, 286, 267, 37, -159, -12, -254, 85, -115, -195, -89, 37, 31, -234, 252, 293, 83, -107, 111, -134, -158, 88, -51, 128, -50, -233, 38, 11, -137, -331, 147, -74, 439, -40, -26, 2, 13, -27, -143, -54, 207, 135, -141, 241, 54, 144, 96, -147, -141, -54, 247, -89, 153, 22, -165, -268, 25, -119, -228, 106, -38, 89, -142, -91, 182, -163, -273, -512, 163]
6066A63n5k64J42o8K81j35M1k53K40j92J08o9j5L18l05L08j2l29O5J09j09j48
6088a79J76o9L09p9N8j58L39l99R1N8j61K7J34k53L82k44k20L51j30p7J8n0J86
6111A10R8l87J30r5J58Q4m43K90O3J36j97J54j8m4l6j08N10m97M6L7m7J88k81
6134a49K68q0p9K34l40K09K69n01kL67l04J37o2L6N6j35K04l2K85j95J7j24k28
6157a49J0K09q2k90K27L52m03N5J12j25J23J05J19l01K31m47M52l58j07L34k3
6178D4l2l8o7J90q8J8Q0L1l31J10K10N4k56J91j30J18P4j7n09O22k55MJ90L9l1
6203B21l53K09q7k11K38N3k25r8J72J47O1l02J12K21m6j95Q6k7j09L45k44N2J49
6226A69j77j23J55l22J89l8K03k02J79p0O3j2PO9k4n8J4j08J60k15L41j16l41
$$ y = [163, 108, -156, -14, -82, 199, 64, 105, -148, 92, -100, 8, -61, -76, 242, -63, 245, 233, -96, -31, 78, -31, -179, -3, -72, 237, 158, 216, 58, 397, -2, 89, 147, -14, 13, 147, -106, 276, 32, -188, 163, 33, -44, -26, -76, 110, 208, -179, -49, -144, 14, 98, -345, -55, 8, 144, -53, 101, 83, 39, 3, -105, 405, -92, -46, -9, -56, 132, -149, 119, 39, -40, 194, -146, 63, 332, -169, -171, 196, -108, 29, -33, 3, 59, -76, 128, 96, 381, 186, 203, 79, -149, -139, 70, -12, -302, -75, 277, -126, -71, 41, -84, 39, 144, 263, -38, 193, -254, 198, -160, -267, 67, 44, 12, -26, -93, 97, 9, 27, 107, 138, -193, -83, 127, 181, -75, 116, -14, 104, 178, 161, -348, 274, 19, 23, 213, 252, 221, -132, 77, -10, -221, 17, 70, -155, -253, -81, 66, 127, -175, -63, 158, 112, -83, 3, -24, -133, 212, -32, 20, 169, -8, -131, 24, -298, -109, -147, 56, -146, 33, -37, 26, 14, 21, 90, 66, 8, 22, -86, 74, -141, 200, 84, -257]
6249b57M10J00l71j10K15r0J14j98J21J5j27J8M0o8K35p2lM9j74l2K1K52n0rJ03
6274A32o%j78J43j49l0O7l9L5k28L35j88K93j83M5o9K3k61K11j3L23n15J69J83
6298A00L0l00J03M9J60q0k27L11j00p9qP9K41p7k68K86l94o5L10R8j65j52j8N5
6322a11Q6p7K78j91j08K67L12k37k05J55k35J67j11L98l52K5j61K06P4n73L92
6343aR3k82j59N08J70k61J80k68P0j7j21P5j40K1K24m6K5J16M9j99J9j09L2J20
6367I9j10j8j79J06K69m44M41m2l48K64J46k84K56k56K01J22l53j20L95J48n98
6388c05M88j51J01k22J35Qk31J45K20k39m4q4r1K25R4P7j20m2p4J13j13p0P3r4
6412b01L5kK75k32J58m5k36K15N0R6j65m1M84m11m2k7q6L24m64K48p9K62k33%
$$ y = [-257, 153, 253, -118, -228, -13, -103, 11, -187, -66, -51, -178, -160, -120, -188, 47, -25, -28, 21, -153, -185, -164, 88, 38, 29, 132, 126, 126, -52, 91, -58, -88, -21, -60, -25, -253, 82, -106, 187, 4, 49, -20, 3, -258, -47, -60, 263, -252, -83, 100, 130, -170, -67, -18, 142, 62, -165, 146, 46, -33, -41, 38, 279, 202, -66, 220, -174, -239, 71, 169, 4, -148, -166, -111, -25, -102, 176, -15, -123, 144, 456, 219, 14, 169, -66, 101, -10, 388, 36, 61, -100, 106, 180, -393, -1, 92, -190, -349, 159, 329, 68, 248, -20, 50, 33, -88, -13, -153, -132, 92, 46, 71, 187, 236, 37, 56, -53, -21, 99, -11, -29, -208, -102, 167, -277, 164, 122, -226, 38, 184, -100, 156, -100, 101, 223, -130, -250, 145, 293, -305, 183, 32, 133, -89, 46, 54, -177, -32, 188, -51, -95, -179, -270, -45, 49, 126, 6, -36, -110, 3, -110, -180, -107, -201, -166, -168, 107, -125, 33, -12, -248, -33, 17, 113, -52, -93, 391, -20, -62, -89, -175, 149, -315, -67, -146, 116, -117, -117]
6436a17K00J17j79Q6n9L7q8j71M95k00l80L02r9N4N8L3L4l93M67n3j13N3J4k92
6460a94J94Q6L7k66K29j77J15k3l24K73J41L7k52q1K35j00K93k03p8J80j86K21
6482A57L4p6k27R7j35M7Q0L26j17o4j61NK61j59j37J37Ll04L42j20p2J95j3J35
6506B34j14j14N0n01L85l81L54J67o6q1oR9j32N0N9O7m3l21K20j58J4J92p2K18
6530A20k12J56p4J84j42rO3j89Q2q5P3J77m69K68j5K02k03r6K42j48J26J41j10
6553H2n4j14k2l6j59L07N8k47J92o2K2k04J41m6J11o8m3Q0J87k07j54N3J34j21
6577a70J88N8J96j33k19K51k86k1J4L30k13j72K30L5k66J90J35n8m00L29p5J09
6599E2m9k98L85k4o2Ml9j35K90m5kl12L39J25l72J19k98P9M89q0k8k65K29j29
$$ y = [-117, 83, 200, 21, 107, 48, 85, -3, -174, 321, 121, -259, 43, -56, -2, 56, 89, 123, -270, 197, 144, 31, 84, 98, -194, 0, 86, 123, -143, 86, -91, 24, 1, -323, -50, 91, 128, -124, -205, 30, -70, 223, 20, -58, 122, -64, 157, 191, 115, -112, -15, -150, -103, -23, 303, 186, 122, -39, -34, 227, 68, -69, 68, 71, -233, 109, -11, -83, 112, 99, 234, 120, 6, 56, -445, -60, -441, -87, 80, 14, -67, -73, 26, -106, -56, 3, 70, 27, -294, -74, -232, -218, -26, -98, 120, -92, 64, -10, 174, 32, 23, 86, -103, -21, -106, -33, 144, -325, -57, -72, 130, -73, -169, 73, -75, 51, 192, 82, 28, -86, -108, -144, -303, 4, 62, -185, 7, -55, -33, -237, -96, -142, -31, -99, -142, -62, 125, -82, -236, -183, -49, -170, 18, 76, 272, 139, -80, 171, -115, -136, -122, 208, -5, -177, 53, 88, -178, 12, 147, 89, -311, 18, -57, 52, 3, -295, 90, 66, 4, 8, -31, -166, 124, 79, 77, -235, 104, 229, -143, -24, -322, -243, 246, 166, 138, -127, 102, -27]
6623b7j70J33J05L9k38L93m6k62o4l0K98k0JL8k09M3K80j83j99j05J69J87J23
6646B56n87K84K14j76O7M2P3k81K86k48j77J29J08O0q6O6Q5R9M6k52J08j08P8
6669H6k43L19m5k2j79L45j17k68K17L7j11J85k13J0k74M03L7o5m4J92l58J49M
6692D5j46r5Q2N7l4J81j0n8L72k56j18l4n4J90m0k40j4J22L7j05J82J5k58m1J22
6717i8L00l29Pr6M60l35K5Q8J07K4l0P0j53r2j9R9K0O9n4J13j74p1k5R3K61q4
6743A76j10k05K40k59L27M3k26J08O6l13J02M4K12j81J43l25J98J05l21J54J47
6764A25o8j06M1j94M04k97K79k85j19O0J1Q4r4J62k68L08n2L2k87K68P5L8l1k6
6788F0o4k01J75L3q1J49J13j60p7j8L49k63J01l48L39p8j73Nj26R1J77J13n8j02
$$ y = [-27, -197, -64, 41, 80, -158, 235, 189, -73, -137, -167, 131, 111, 112, 150, -59, -16, 264, 81, -118, -223, -54, 133, 256, -331, -47, 167, -9, 58, 100, 173, -108, 178, -70, -247, -118, -10, 50, -36, 30, 115, 214, 260, 8, 116, 8, 86, -157, 162, 117, 95, -84, 261, 144, -124, 93, 130, 19, 204, -9, 1, -273, 130, 167, 102, 58, 250, -108, 41, 45, -101, -196, -114, -57, -91, 90, 80, 22, 394, 138, 20, -14, -68, 122, 82, -158, -172, -50, -13, -118, 64, 79, -179, -220, -98, 202, -127, -120, -216, 244, -91, -66, 22, 129, 153, 123, 193, 40, -52, -71, 28, 48, 117, 63, 176, 2, -69, -94, -1, 260, 176, 66, -139, 101, -158, 169, 212, -14, 94, 160, -153, -51, -7, 205, 24, 167, -158, 40, 145, -176, -22, 125, 57, -49, -8, -202, 202, -95, 184, -101, -220, -160, -149, -65, -159, 3, -265, 43, -9, 23, -264, 4, 79, 117, 86, 60, -4, -205, -30, 3, -78, 71, 184, 24, -53, -71, 278, 15, 116, -232, 107, 29, -144, -139, -265, -174, 3, 116, 58, -44]
6812d4j15K42n9P6l74L17l7j17K5j4K73nk15K69l09Q9J69J33l01j84J86K7K72
6835C04l27oK6J20j76J08m8j11J73J65j85k5n9K6j33j33J57O1L90m68K02n9M5
6858D7r2J58j63J6j07q6J75J28lJ31l2k99J04K73n1j28l76K94J06j44M4oO9l87
6882c29K95M60m76J29N2j0m35j6N7J60o2R7l0J12K41k39n2J05P5k7j10J66k96
6905a33jJ80k72J50l8K65k34Q9k6pK27j00j31N8k22K63k38R8L9O8M0j59j17K91
6929I0j45O2l9N6o0J96j33J1J26j79j34k5k5K87j27l7P5k81K01J10k51N4M3o6
6953a91K58l46M32j6j19L9m25M85m0k42K29J16l65J38K41l6j86J06m7K03j35j25
6975b6LL5j51J66n8j83K64p3p9J12K8k77Q8K55q6p5j13J44j6K4J88l06L08l4l2
$$ y = [-44, -159, 83, 24, 100, -274, 43, 6, -111, -86, -100, 173, 168, -47, 222, -87, 2, 171, 304, 3, -181, 5, 32, 304, -23, -29, -3, 117, -59, 49, 1, -110, 63, 228, 43, 18, -41, -15, -148, -281, -124, -63, 327, -141, 61, 2, 47, -45, 113, -50, -34, -141, -227, -52, 76, 73, 204, 172, -127, -23, 250, 199, 71, -305, -11, 95, -49, -5, -11, 58, -329, -34, 426, -50, 79, 131, 121, -314, -330, -273, -113, -175, -78, -108, 4, 245, 6, -46, 59, 134, 107, -3, 163, -133, -134, 46, -226, -76, -114, 151, -83, 6, -20, -27, 200, 100, -31, 27, -195, 68, -170, -72, -33, 35, 75, -84, -201, 90, -55, 7, -32, 24, -36, 160, 27, 38, 164, -15, -149, -174, -199, 88, -39, -76, -1, -282, -81, 29, -222, -168, -125, -191, 67, -279, 153, 137, 18, 57, -368, 117, 77, -165, 64, 180, -185, -47, 194, 158, -28, 78, 31, 234, 99, -26, -23, 12, -139, 27, -31, -214, 50, -23, -102, 10, 38, -239, -151, 104, 18, -57, -170, -26, -42, -18, 170, -136, 172, 138, 106]
7000A06k32OK41j85n0j47J34j9M3K77O2l18L9K24j30p7M7K6P4k16P5k3L0j73K23
7025C7rK2J65n03K56lJ47k11J86j42j83M0J16j4J77j75K88j10j41M3J25j83j64
7048b36J62J53m3j70j15L98O0j64J41Mj7Pq3p8j42J06R3k51M3J43KJ22k4k02J02
7073A1m2Q0k34K46J21l07J81N6m4K1K2j1l4q7J40J12l27Q6J15j28k27j27M78J42
7097B43j29r8J08k60O8P5J31j87l79M25J46J7r5k35K02o1K8K19k11J61k17P5n6
7120c0Pj54K28q5j71o7M49m5j77j04M9k20M85k17O9Q8k34K79j78J29m51N20l4
7143A36rk2j16m6P8j59J63m09L66n8R2j40J48J0M5ll41L94lj83l7K56l3k03j9
7168i3J79k35J45j3N9K60l12J13j98j35K15m0O3k2J10O1P3m57K34P4Lp8K43k64
$$ y = [106, -126, -120, 121, -64, -114, -261, -127, -146, -103, 174, 236, -82, -43, 181, 51, -26, 21, 47, 121, -95, -20, -43, -13, -186, 37, 28, 50, 215, -288, -32, -35, 112, -99, 87, -55, -238, -198, -82, -96, 81, -94, 194, 84, -57, -14, 111, -72, -236, -74, 79, 36, -134, -249, 149, 209, 45, 186, 190, 173, 180, 97, 19, -123, -17, 76, -175, -132, 11, 13, 135, 111, -91, 11, -31, 49, -185, 61, 182, -125, 56, 112, 68, 89, 111, 100, 66, -21, 119, 231, -96, -10, 105, -23, -250, -377, 101, 243, 114, 16, 124, -136, -68, 7, 138, -49, -428, -3, 143, 160, 65, -170, 32, -29, -1, 218, 7, 168, -49, 26, -30, -23, -177, 51, -34, -205, -272, 177, 132, -45, -149, -100, -320, 165, -52, 17, 105, -129, 150, -28, 101, -350, 170, 136, 127, 105, -11, -57, 21, -138, 25, -384, -18, -76, 16, -124, 24, 34, 79, 76, -265, 129, 126, -57, -94, 162, 129, -74, -93, 86, -149, -4, -17, 42, 302, -10, 103, -95, -230, -15, -55, 8, -14, 96, 157, 230, -227, 7, 81, 84, 6, 249, -15]
7192a5j5P6q3J46j17p3M8K05j88m3j42L20l34j85L45N9J86j55j0l0m5K9j33L76
7216B22J20m52p5Q2lr1J43K15q4k3P6J20k59l1m2J36j52K9K82j06j93J23R9j90
7240e4j8J85j79J68j22q9K25j19Kj20O7j70PJ07n7J56K45k39J68n15J47L53j75
7263b7K06k41LP5m43M44k00K34K19k96K58m28K94k54J48q0N6R0j21j72L00j46
7285h1L9J96k11q1R3P1M1j06J86J1q3knk41J97J3J91k29K49l4j23k7Q8J32m14
7310a30j02J81J42k28P2Q8N5m3l0k10K71OO1j48k05L7O6J05J56j48j60L65j08
7333I3q6M7J56m11K90J12j19k12J50p8J0k55J70J63p1k69K66J57l9j88M8j22j62
7356c50M4L90N9m69L81O3j03l2K85pqj57k47L8K95j72J81j4j93k35M07p3r3J57
$$ y = [-15, -30, 46, -37, 109, -8, -81, -33, 172, -16, -59, -201, 119, -215, -400, -55, 4, 190, 35, 25, -5, -50, -21, -154, 222, 342, -110, -185, -103, -106, -197, -54, 161, 77, 54, 130, 250, -9, -40, -82, 54, -98, -69, 213, 107, -86, 37, 136, -54, -72, 113, -66, 102, -20, -109, 116, -3, -1, -121, -54, -224, -217, -110, -167, -11, 234, -5, 163, -352, -205, 148, -27, 179, -62, -59, 16, -427, 17, -183, 51, 270, -26, 232, -196, 98, -156, -8, -88, -32, 58, -63, -235, 65, -81, -42, 154, -57, -138, -45, 26, 67, -39, 147, 158, 75, 73, 68, -173, 24, 37, 228, -1, 248, 214, 91, 64, 152, 284, -130, -232, -51, 91, -137, -65, 23, 78, 35, 5, -205, 66, 72, 133, -15, -220, -183, -117, -12, 144, -4, -164, 201, 93, 7, 54, 210, -201, 89, 201, 82, -130, 20, -58, -48, -303, -133, 30, -41, -310, -44, 113, 74, -114, -66, -188, -350, -306, 84, 143, -326, 55, 118, 15, -17, 268, 261, 253, 96, -151, -113, 182, 10, 191, 177, -16, -251, 156, 83, -10, 147]
7380A47m5K3m70L17K86k24k24j09N70l17j41J74J29k78J08o9J7J57m9R8k14K97
7402A83l60j19N20j45m4J04j5j57P8j93J02k9j6J19j80R8J67Pk52J04k4K13K0
7425A81j03mJ4p5j88K84k30K82k52M81n12K94l18N3M56n12J1J46j5J39k17J58
7447G3j94O5j05K19l2l33L86j81j48L02m9J04k16J25j03J79l48K84K74n37L27
7468I2p9J51P1k44j70J54N5j75K20Nk57N3L1P5j19J51m8K21l16J24J00J32l79
7491a52J82Q8J84j28k31j02P0L9j26L0N0R1O2j5M6k21KJ02R4p5j21J17m3K4q1
7516a14J08j07m2K32K85l60p6k5Q9j14J43R9j55k10p2N25k00j59J40j72m5K43
7538A3Q0k04K0J84q1J41r9m2k9j2r9J72j9j63r0L14pr7o9J56k6j01J8p5m6J24
$$ y = [147, 102, 125, -345, -28, 258, 34, -190, -299, 271, -46, -187, -13, 116, -162, -54, -123, -106, 51, 2, 100, -114, 183, -177, -296, 224, 79, 35, 139, 124, -33, 45, -148, -46, -75, -91, 28, -152, -54, 113, 120, -132, -28, -52, 161, 181, 78, 74, 88, 13, -175, 109, -121, 161, -91, 390, -122, 172, -146, -93, 363, -149, -138, 8, -7, 132, -85, 73, -121, -56, -161, 58, 26, -307, 79, -102, -250, 52, 3, 107, -109, 16, -87, 92, -256, 28, 302, -235, 92, 13, 164, 235, -9, -179, -25, 30, -145, 75, 80, -177, -124, -93, -18, -137, 14, -34, 187, -129, -5, 95, 227, -152, 30, 118, 302, 174, -57, -159, -89, -50, -176, -146, -96, -5, 57, 42, 88, -133, -131, -29, 65, -10, -131, -14, -57, -33, -114, -6, -113, -155, 77, 362, 2, -74, -99, -10, -124, 19, 118, -37, -247, -319, 206, 6, -153, -13, -185, -230, 13, 93, -111, -91, 93, 12, 153, 54, 12, -17, -29, -128, 44, 25, -138, -228, 86, 79, -18, -87, 69, 43, -58, -40, -115, -161, -37]
7564c7j39j69L19J8l17L82n1j84L58K6p0pm2l0Pl51K55l0J75l58M09J4k25l53
7588d00K09K73l21J27J03j9N9k91N78k81l78M37j50J77P8j83o9K27j82M7N2l6
7610E7L1j14j17N16m25m0J16j97L1K56J27k92N7L6l06J60j90K58j21J6J74K0j72
7633a19O2J39L2j27k21Q4K90k5k34j50L51N0k74K61k89L22j37k06n3N72l82k0
7655g4J47k0j04J67J35j69o5j92j08L78j1J35k23k63L93l12l1Q7K13n9J13j40
7677cL31k23k00J16P1J27m67L04m5j6r7J69Q7q6m1l76K30K13l14R8N2J49j44L4
7701c1J54o7j74R1j95O5J65j63nJ38m5kK99o5j87L23j38l29L06l5q6k00J79L25
7725C23k45l01J98m2l83L90P9k44J92K8k65R8J22k34K85J78m13M9N3j7K66K39
$$ y = [-37, -176, -345, -26, -8, -325, 57, 6, -178, 180, 206, 136, 129, 87, 57, 64, -287, -32, -62, 113, -245, 164, 178, -47, -400, -191, 82, -239, -112, -9, -28, 31, -260, 318, 37, -341, 96, -54, 123, 201, 18, -51, 176, -6, 41, 93, 57, 88, -26, -143, 373, -52, -92, 24, -173, -142, 114, 241, -51, 6, 42, -264, -104, -294, -36, -157, -141, 33, 53, -119, -57, 82, 114, -13, -234, -150, 140, 115, -119, -269, 82, 132, -142, 119, -170, 152, 15, -191, -244, 328, -54, -74, 73, 53, -51, 116, 251, 82, 17, -175, -283, 95, 84, 219, -4, -267, 126, -186, -217, -130, 83, 24, 137, -3, 328, 105, -95, 21, 92, 219, -248, 56, 11, -5, -102, 67, 154, 68, 27, -349, -119, 94, -220, -122, -70, 79, -65, -31, 123, 56, -118, -27, -222, -157, 8, -155, -160, -22, -67, -69, 230, 165, -22, 301, 163, -166, 140, 105, 19, -181, -2, 323, 78, -223, -25, -67, -450, -60, 19, -225, -33, -5, -270, -172, -50, -284, 1, 179, -234, -185, -132, -149, 117, 356]
7747C56k21k95K63j21P3k53P5K6L24m71jN64k42J5j29r7J46j94K9K87Rj63K5R0
7771I5k4k93L63N2k42O3Q4j02m7J06j61J7Q3k70L34j46n7O0Q5J82m39M17l31K50
7795G9j93J9J40J13j71J30J11m71L72k73N9q2K91k49R9l09O45k47l1Lr3N7J38
7818A37k02p1L03j87j67K4N2J3r8L25j27l30L62J58J08k76n8k04L00n0k56L83
7840A39j36J06r1L45l68j82K32J8l8LK54l93J95k03kn3O8K08j46J03R5k33J78
7863I9k66K9Q1N2J67k40j7n5J8j34N9J22K51k89K3p3K39r8R4Ql30K34L50j93j20
7888A1M38k50M9m49mN2K49l56K12O8K27j81l42J79J90k52K21j65K2J86m4j57J65
7911F9k91M20j61q4J16Q6j08j30L83k96l6j6J36J38l71J80j65K0n3P0J13J97j74
$$ y = [356, 135, -160, 103, -18, 55, -198, -123, -97, 227, -244, -245, 319, 77, 92, -37, -134, 12, -182, -153, 134, 143, -20, 5, 95, 71, -222, 141, 193, -49, 14, 98, -4, -51, 55, -106, -89, -6, -276, 58, -88, -145, -85, 0, 182, -257, 160, -171, 79, -114, -95, 45, 158, -13, 117, 228, -243, 129, -144, -85, -167, 124, -125, -26, -335, 310, 63, 32, 35, -58, -1, 137, -65, -136, 167, -20, -187, -163, -111, -98, -196, 129, 2, -328, 34, 192, 300, 24, -34, -238, 62, 12, -244, 139, 3, 109, 18, 363, -5, -187, 45, 63, 25, 28, 282, -111, 84, -119, -121, -174, -106, 102, -44, 59, 154, -79, 99, -167, -138, -57, -5, 162, -78, -95, -150, -132, -266, -207, -85, 166, -123, -100, -173, 66, -32, 62, 70, -260, -26, 324, 131, 11, 449, 199, 248, -201, -205, -153, 96, -260, -48, 20, 247, 66, -276, -97, 93, -159, 62, -103, -81, 105, 61, -96, 69, -222, 198, 37, -47, 69, 155, 47, -83, 300, 4, -32, -48, 88, 226, -145, 35, -130, -110, -163, -93, 20, 217, 43]
7934D3Pl5mj76K34o1k54J21OJ02j42J7J96J40l12r3K59j5n2rJ21j64k90K91N1
7959a9K39m85J90K76k00j67n7L34L4r9P5k37J95j22l5J65m00L92J46j15l22J67
7981d5J37O6j53O7j79Q3J06j59J64k01L43j81ln07M56J00j26R5k6n3L1j12k08
8004c05J68L56j83L1l9K48j27j76ON7J1J02q0j50K01j87O8m36N59l43J34K57l28
8027a56R8PK6l6r4p6J71K7n2J99j47j47L76k01p5j26K83Jj43j79L22J25j98j03
8051i8K73k97P6j25P5J34j02R3p6o2J83o9J74j25O6j50P0l1N4P7j71n6L7J72K74
8076C96l86K48j10k89J15j56M26k92L5j5M6j46P3M1J73q7j92K77J01l28O8J84
8098A82J39k58k82K27p3J24p7J31k9o8j04pJ28N6R5j84K26l65K56l4M7j15J31
$$ y = [43, 50, 15, 11, -165, 69, 8, -246, -125, -119, -17, -159, -142, 54, 194, -118, -211, 48, 33, -19, -28, 93, -71, -361, -70, -19, 220, -265, -75, 201, 1, -166, -223, 111, 145, 46, 121, -116, 79, -43, -78, 87, -313, 79, 225, 110, -212, -45, 92, 158, 5, 72, -107, -24, 82, -77, 87, -114, 229, 48, 45, -462, -6, 94, -32, 63, 37, -16, 15, -97, -305, -137, 219, 36, 67, 28, 276, 149, -27, -21, 36, 47, 149, 69, -81, 120, -67, 1, -435, 124, -219, -85, 172, -156, -58, -51, -25, -61, -155, -231, -60, -33, -85, 114, -33, -180, 196, -5, -80, -206, 77, 78, -65, -244, 78, 203, 5, -98, 175, -122, -46, -171, -96, 38, -64, 29, -47, -109, 74, 5, 179, 54, 120, -30, 40, 9, 63, 140, -31, -87, -50, 122, 396, 10, 258, 148, -141, -26, -182, 244, -48, -13, -28, 18, -128, -55, -14, 159, 72, -120, 157, 258, -70, -2, 182, 321, 63, -219, 8, -65, 59, -18, 113, 84, 16, -88, -95, 33, 89, 184, 0, 226, -139, 117, 83, 130, 15, 146]
8121A46L5l74J09n4K63l20J45j03N4M1k2n3L38q6k38K63J55o7m48K92m7m8k97
8144c16N01k15J47k72J77J60k02K6l04K92p2K39o5l09J75J2ok01n3L43J8l21J16
8167a30L56k90R8J6N2n4R5m8p5M7k98J56J23J76k03J8m4K1J93m08K75o8R8O1
$$ y = [146, 181, -193, -84, -138, 125, -195, -50, -153, -99, -58, -80, -133, 205, 119, -119, 144, 299, 232, -216, 76, 29, -19, -316, 185, -30, 117, -155, 22, 182, -20, 6, -298, -6, -78, 161, 96, -213, -38, -26, -32, -233, -286, 57, 75, -246, -130, 226, -64, 34, 50, 102, 48, 143, 95, 20, 67, -231, -75, 48, 224, 21, 39, -5, 16, 209, -199, 76, 8, 106, 167]
8191A67
$$ Imaginary data points
##PAGE= N=2
##DATA TABLE= (X++(I..I)), XYDATA
0@%%%%%%qJ6j6K4l2M0m8N6p2Q8j04J20j41J68j95K28k68L09l57M11m70N35o07
29c23O87p73Q67r73J091j219J358j510J681j867K070k293K540k813L113l450L825
46B011m247M726n272N906o648P530q603R940j1666J3984j7287K2420l1571N2961
60C4184j95739j49967K36742J31175J21043N2087Q3252K3093j1342n6486l6090
71B31952m3444k6290l8757m3680o4323l8534k4825l1626n6591k8321K310k474
83a64603l9151k6788P066K3361K0972N1830Q9574J01633Q9559Q4572O1301J1157
95C10483l2692m6685o7150r8745j00311n7751k6118k4037j3069K1469L7780K3666
107g3160J2990J6587J2487K532N491P362p168j2073R888K4046Q925Q653M6731
$$ y = [0, 0, 0, 0, 0, 0, 0, -8, 8, -8, 16, -16, 24, -24, 32, -40, 48, -56, 64, -77, 91, -104, 124, -144, 165, -192, 219, -251, 284, -323, 364, -409, 458, -515, 576, -643, 715, -795, 886, -981, 1089, -1204, 1336, -1477, 1636, -1814, 2011, -2236, 2490, -2782, 3124, -3524, 4006, -4597, 5343, -6323, 7661, -9626, 12794, -18777, 34184, -161555, -311522, -74780, 56395, 177438, 229525, 312777, 335870, 324528, 268042, 231952, 188508, 162218, 123461, 79781, 15458, -23076, -47901, -79527, -136118, -164439, -162129, -164603, -203754, -230542, -223476, -200115, -179143, -127313, -37739, 63894, 153453, 238025, 299326, 310483, 277791, 231106, 163956, 65211, -35100, -92851, -118969, -143006, -156075, -134606, -96826, -73160, -60170, -43583, -31096, -28564, -23073, -15711, -22879, -34952, -25064, -1018, 7907, 16560, 63291]
120F3291P1524M5183J0964Q110m32m5498q8313r1864p6114o7240m9442j6956R578
133b27209K5613M6061N7858M4107L0136M1009N1257K9593O287J4691K5473K731
145A47607k6108k3151j2026k3195l2891k0110q225j4798j9645j1602j5013l0709
157h9866k5705j183R219P443K3402M8830M7780K3726J2724R355p432k4775j9470
170A4048p130o379k488J5504K0169J883p666M466N221j6663k3572l451M298j3679
184a5439k1726q546k135q195k620J5519K5168K6329L2976L3989J3657p408j0376
197G1193j6773l9069m8972k5825n063p883o843J4589K6293J3193L707J2705J5855
210G107O589O675J8184J5054N73j579K879r720k4850j7387j246l294j1429k293
$$ y = [63291, 134815, 179998, 190962, 199072, 198640, 153142, 64829, -27035, -103149, -170389, -219831, -236787, -227209, -201596, -155535, -97677, -53570, -23434, 17575, 68832, 98425, 104712, 119403, 144876, 147607, 121499, 98348, 86322, 63127, 30236, 10126, 1901, -12897, -32542, -44144, -59157, -89866, -115571, -116754, -107535, -100092, -76690, -27860, 19920, 43646, 56370, 65725, 58293, 33518, 14048, 6918, 539, -1949, 13555, 33724, 35607, 27941, 32407, 37628, 20965, -2607, -6058, -1760, -15439, -37165, -45711, -47846, -56041, -58661, -43142, -17974, 8355, 41331, 75320, 88977, 81569, 71193, 54420, 15351, -33621, -59446, -64509, -72392, -79235, -64646, -38353, -25160, -21453, -8748, 7107, 13696, 20371, 38555, 53609, 54182, 52603, 55482, 45762, 20912, 3525, 2279, -1015, -12444, -14737]
224a4737O964l939j7036j0351l318q686l618J6148K5850J6987J4769K3799J3470
237E6302j1979j9498p290o090j7286j2016O945R624j670j777L863k379r782j737
251a4770O115J82k589P965Q866p698j4353J41Q519N3J935K0648K7612J2841L548
266E9015N019m845k3180k6500j8562j8895k1883j0556L808r06q112J838J3835
279d9924P264L465J7596K9852K3061J5132J9156J5016k817j2961r408j1548k0985
292B2899j6179j609k296j4367j1207J10n134j6808j0235O021Q179K457Q466J6401
306a3302Q767n20K615N023j153K24J4056J8076P192L991J1480M187j6214k2047
320B2375j1808j0575j8719j4343k06J553o087k803M798J363j746R022J7652J2258
$$ y = [-14737, -7773, -11712, -28748, -39099, -42417, -51103, -54721, -38573, -12723, 4264, 19033, 42832, 56302, 44323, 24825, 17535, 11445, -5841, -17857, -10912, -1288, -2958, -4735, -872, -3251, -13033, -14770, -8655, -8473, -11062, -3097, 5769, -1929, -16282, -16141, -7622, -7569, -5634, 15014, 42626, 55467, 59015, 64034, 59189, 36009, 9509, -9053, -27948, -49831, -60387, -56579, -57485, -65597, -63759, -49924, -42660, -39195, -21599, 8253, 31314, 46446, 65602, 80618, 77801, 64840, 55432, 43884, 22899, 6720, 5111, 2815, -11552, -22759, -22649, -27783, -44591, -54826, -48805, -40626, -38169, -29703, -13302, -4535, -5055, -2440, 2583, 1430, 1654, 15710, 33786, 40978, 44969, 56449, 60636, 44422, 22375, 10567, -8, -18727, -33070, -33276, -31723, -37810, -40613, -35815, -34452, -36198, -27176, -9524, 2734]
334B734P762J5958J6806M04j0243l309m00r762j1122m74L500m987q318l369p743
349a2563j6574j1380n84l01k331R608K1002J3939L342P747J2985L626n214L28
363B3630O956K37n026j195j784j1423j2679n513m832j0639m307Q756N969m315
377a6165l221N950P57r193l639Q290Q979N164J0386J5181P057p89Q87m07r267
392A9970j0977j70J164p154q453R86R97j0174j0333O83L557j237K751J1105Q321
407A036J012K523M879j401o669K460P907J218l407L955O802n006j2540n371j493
422d095p436p411K592O053M48R42O107K494m378o37P122K718l079L305J0418K848
438A8011p050l618J676m374r543l032K968j153k417L152K945l771l732L798L157
$$ y = [2734, 10496, 26454, 43260, 43664, 33421, 30112, 29712, 19950, 8828, 8354, 11854, 6867, -1451, -4820, -12563, -29137, -40517, -41101, -41402, -43733, -34125, -13123, 816, 4158, 11905, 24890, 28516, 23302, 23630, 30586, 30823, 25797, 24602, 22818, 11395, -1284, -6797, -11629, -22268, -26575, -17819, -11850, -16165, -19386, -13436, -12679, -21872, -25511, -17221, -8242, -3078, 7308, 22489, 29546, 28757, 29644, 29237, 19970, 8993, 8823, 9987, 2833, -5620, -4634, -3637, -13811, -24144, -23461, -19904, -21141, -18390, -7285, 1036, 2048, 4571, 9450, 8049, 1380, 3840, 11747, 12965, 9558, 13513, 20315, 15309, 2769, -2602, -4095, -11531, -18942, -16350, -10297, -9849, -8907, -2800, -306, -4684, -5321, 1801, 4519, 1440, 4745, 15163, 18011, 10961, 7343, 9019, 4645, -4898, -7930, -4962, -6115, -8532, -5380, -2435, -6206, -9938, -6140, -2983]
453b983l058P42J0405P969k136k401L265l51r297o379J271J66l019J693N788o18
469A057m400R22K158m993n272M648P178r83k824M998M963m258n284K392L040j595
485A747l18N409K633m085j121J953m132p987q95M799j635n358Q69N318k567o126
501a1496P41M664J040J472Q121R004K958K411M735j358j0239p907k957o666j2137
516a7614n758L157J166l027L325J0091P305L651P679R177K666j744M1l072j0842
531F201j0219l041j943o345j195R169R082J877J794O697J720o929o547k207n025
546f911p910j989K157l03n77O706R603L538K224Q482P986j543n489r94k397r609
562B974r221k108m29k971L88O047L181k172R63L339k360n963J01N462N72k175
$$ y = [-2983, -6041, -5299, 5106, 13075, 10939, 8538, 11803, 11452, 2155, -4224, -2953, -2787, -5806, -4113, 1675, 1057, -3343, -2421, -263, -5256, -10528, -5880, 1298, 315, -2509, 2489, 7452, 3194, -2090, 302, 3342, 1747, 1429, 6838, 9471, 5386, 4265, 6218, 2086, -5901, -6796, -1997, -3632, -8990, -8121, -2803, -5370, -11496, -10755, -6091, -5051, -3579, 4542, 13546, 16504, 18915, 23650, 22292, 12053, 4146, 1189, -5477, -17614, -23372, -20215, -19049, -22076, -18751, -8660, -1355, 2296, 9975, 19152, 21818, 20074, 20115, 17043, 6201, -4018, -7059, -9002, -15347, -16542, -7373, 1709, 3586, 5380, 12077, 13797, 6868, 321, -1886, -6911, -14821, -16810, -14653, -14956, -15533, -8827, 776, 4314, 6538, 15020, 23006, 21463, 15974, 14980, 12583, 2974, -6247, -8355, -8784, -11755, -11367, -5320, -2139, -4311, -3348, -9, -2369, -8332, -8231, -2769, -2197, -4372]
578d372N379Q521K852j079K535L377m198o608l564m800r766p089q35n24l098L424
594a9845J1351R248M430P296J0832L661m829m069l071p719j1841n781j303k780
608a4420j016N753P873K471K185O205L812m787n569r88l870j0171p089l01j41
623b0053j585M181J0477R044O087R109J0437K556k629r08p19r019j1774n876m310
638d982r021p593l07J814j455M56O772O238J646L736P959M140j806J514L327j654
654A0784n378j185J632k436n001r7L071k009k483K262L600j235j778K625J094
669C466m195l521J410n82m543j403L307J073j964K058O225L139J94L779N905K11
685A4559l757m54J46n615p417j884j058n235n699P67J558j720O30N990N952K404
$$ y = [-4372, 1007, 9528, 12380, 11301, 13836, 17213, 13015, 6407, 2843, -1957, -11723, -18812, -19647, -20171, -23269, -19845, -8494, 754, 5184, 12480, 23312, 26973, 22144, 18075, 15004, 7285, -4556, -10337, -11640, -14420, -15436, -9683, -1810, 661, 2846, 9051, 12863, 8076, 2507, 1519, -2351, -12522, -19611, -19912, -20053, -21638, -17457, -6980, 2064, 8151, 17260, 27697, 30253, 27624, 26716, 25997, 16978, 5204, -672, -4982, -14003, -21596, -21903, -20089, -21544, -21088, -14316, -8078, -6432, -2696, 5263, 9403, 7597, 9111, 12438, 10784, 5406, 4221, 5853, 3417, -1584, -1681, 1390, -619, -3102, -840, 2760, 1525, -253, 2372, 3466, -729, -4250, -2840, -3422, -7965, -9368, -6061, -4988, -6952, -4894, 1331, 4470, 4664, 8443, 14348, 14559, 10802, 10348, 10494, 4879, -2538, -4422, -5480, -10715, -16414, -15647, -14089, -15809, -15179, -9189, -3237, -833]
701h33M398Q073L672q45J473L221k323o922m108j009n802q154k720J846j421j153
717a2607M234M950J233J016M883L194j965j908J139k336p032m369R42m53k621
732a1700K413P922N835J788M742N494K99k751r42j026o582p104k482k095o375
747a2564l772K384L510r75J350P654O009J441J196M395R07l581k614j016l816
762E08n407p57J174k347k997K871M092n47j013N054O382J416R3L217K452l502
778A0689m965k627l858o071l220K70j839j744L045N565L061J16N061O813J632
793A1928k925P8J376m136o830l330k093m275k575K121L295J169M085P793L823
808I504j621l20J769j955o672l942J138j005l216m74K830P64k78K778L730R79
$$ y = [-833, 3565, 11638, 15310, 14465, 15938, 19159, 16836, 9914, 5806, 4797, -1005, -9159, -11879, -10033, -11454, -12607, -8373, -3423, -2190, -1174, 3709, 6903, 4938, 3030, 4169, 1833, -5199, -9568, -8626, -9079, -11700, -9287, -1365, 4470, 6258, 11000, 16494, 16793, 14042, 13100, 12074, 5492, -1612, -4094, -6189, -12564, -16336, -13952, -10442, -11417, -10067, -2413, 3596, 5037, 6233, 10628, 11535, 7954, 5340, 4324, 508, -4899, -5656, -4482, -6829, -9826, -6955, -2863, -3410, -4423, 631, 7013, 8429, 8522, 11739, 14191, 10689, 5724, 3097, -761, -6832, -10052, -9782, -11621, -13365, -10320, -4755, -1694, -1578, 3483, 10296, 11928, 9003, 9081, 10457, 6321, -509, -3839, -5932, -10207, -12782, -10661, -7366, -6197, -2112, 5681, 9504, 7883, 7563, 9332, 7377, 705, -3237, -2099, -3104, -6320, -6794, -3964, -3200, -3478, -700, 3030, 4009]
824D009Q53M050J654m070l723L56j050n828l659K138R62k599j951J866Q79j627
840g740J24K704J882J748M706O233J660K38L908K041m843o324k154j605o386o172
856i980o86J185j449r18K890L696J356L860M928J477j693r9O63m733o364j652
872g519J730K1p97M515P559L355J410K486J761k940l601k191l755o583m170n51
888i270j710m777J40M966L083M13L808P489M081N22J325J785k069l850j883r51
904C102k889k376J772O97l171j835J428N85l436j456M030L393n90M07L181J442
920D284k396p83J055j059k241J234J572j815j754J800K232j484j771K755L108
935D737j284j470J089O26l782l703p72j594k837j86L387K449M88L648M958J144
$$ y = [4009, 4862, 8912, 10566, 6496, 2773, 3129, 2079, -3749, -7408, -5270, -4308, -6907, -8858, -6992, -6113, -7740, -7616, -4912, -3030, -1282, 3424, 9657, 11317, 11555, 15463, 17504, 12661, 6337, 4183, 2578, -3808, -9980, -10666, -9481, -10930, -11848, -8958, -5262, -3906, -46, 4882, 6359, 4666, 4567, 5230, 497, -5867, -7519, -5789, -5768, -6565, -2050, 5509, 8864, 10274, 12760, 14521, 11581, 7980, 5789, 2034, -4549, -8719, -9270, -10980, -15757, -15617, -10651, -7568, -7155, -3347, 4142, 8223, 8745, 10070, 11855, 9786, 5936, 4053, 3102, 213, -2163, -391, 306, -2865, -4700, -3272, -2687, -6123, -7579, -3549, -156, -746, -339, 2842, 4284, 1888, 1105, 2160, 1101, -1140, 94, 1666, -149, -1903, -103, 2129, 645, -1126, 1629, 4737, 3453, 1983, 3072, 3698, -84, -3787, -4559, -6153, -8990, -9176, -5789, -3340, -2852, 796, 5754, 6898]
951F898j889J073K166j856l583k31O58k794l615j048k14k442r84K744K387J61
967b569J755M262J589k776r19J812k43l499m75K620K03k205j80J357j152k227
983b647P47K230q20k04L258K014k189k396J173m53l760j851J902J225j504J47
999c128K773Q49j551N85K570N23j034K153K272j003k943j05N9l365k990N35J654
1016b146j092k37K357J891j296n94J524K87k063Q6L086L65k064N72J951j496k768
1033a637k57K141o04j211J850K563m66j037O22L70k643j614J721O20k462l26K137
1050b33K06k990j297K410L50j197J569L717J357q74J042P76j878k973m1O54j930
1067a332j530J835J809k078j391J552R49j782r08K534J577j501j72J985r00k250
$$ y = [6898, 5009, 6082, 8248, 6392, 2809, 2578, 3236, 442, -3173, -4221, -4435, -6877, -7861, -5117, -2730, -2569, -814, 3448, 5037, 2261, 1342, 3154, 2911, -588, -1063, 1557, 1760, -445, -625, 732, -420, -2647, -1900, 330, -490, -694, 2564, 4578, 2389, -7, 1166, 713, -3047, -4898, -2996, -1771, -3275, -3128, -355, 494, -1057, -472, 2098, 2621, 1587, 3740, 6012, 5009, 2066, 1961, 2020, -1345, -4335, -3800, -2146, -3238, -3475, -1118, 773, -523, -1117, 407, 694, -1369, -1283, 1803, 2168, 104, 676, 2627, 1131, -1637, -1894, 247, -357, -1568, 282, 2845, 2379, 1342, 1964, 2334, -309, -1923, -202, 418, -2044, -2370, -233, -27, -3017, -4314, -1904, -1554, -2751, -1182, 2535, 3892, 3018, 4060, 4836, 2958, -15, -56, 598, -1332, -2862, -1027, 782, -1296, -2687, -1135, -186, -1968, -2876, -342, 1235, -266, -438, 1547, 647, -1603]
1083a603r4K154K67j116J708L288k97j999L01N90k680k856K03O55j237j066K249
1100a533J078j473n25K072j38j574M76K802L41j700N60J882n43k466M27J648L4
1117A368r55J719J454j259j402M29j42l325j742J944M45j353l38K709Q34j998
1133a612o67K145M52r64J149K470J98j384Q87L72j979k623M12J469k098j073J892
1150i54J594j605j293J678J107j225j97K022J144q71j79J520r13l095j61J564
1166A36j062j753J424K796l65j644M55J434j364j816N19R81j023n52J795N09j500
1183a030n34J834L95k052P76K852L21j022M86J545p05k049j48J232j344j824P58
1200e09P40k054k212R35K30j651l87K604K179K23P82L298J195j802q44P25p25
$$ y = [-1603, -1697, 457, 724, -392, 1316, 4604, 4307, 2308, 2609, 3199, 519, -2337, -2134, -1479, -2716, -3782, -1533, -455, -1928, -2453, -381, -519, -2093, -1617, 1185, 1526, -174, 386, 2268, 1725, -741, -314, 1334, 1368, 413, 2132, 3586, 2327, 925, 1354, 1212, -2113, -3855, -1911, -1466, -2819, -3157, -448, 386, -1612, -2279, -134, 318, -646, 503, 2973, 3171, 1787, 2674, 3046, 1067, -1556, -1144, 325, -1773, -2846, -954, 640, -965, -2258, -580, 527, -698, -895, 1127, 2271, 1400, 1221, 2741, 1828, -1267, -1428, 136, -926, -2679, -1255, 1541, 1176, -468, -13, 1421, 57, -1759, -1240, -259, -1282, -1834, -39, 470, -1030, -1564, 270, 665, -1387, -611, 2241, 2562, 1540, 2026, 3571, 2866, 817, 669, 1901, 557, -1267, -509, 231, -1823, -4035, -3100, -2870, -4521, -4908, -2304, -125, 98, 880, 4178, 5373, 3571, 2727, 3452, 2727]
1217B727l030n52P52r00j753P90J634p67r19K255K312o59r18J149O79k602k679
1234b481k75j45k115m27K261J790R7K028L244K99p31R06J148j123l127O4L31j919
1252a75k548k80O05j209j017J472J468k75M79K473R14j258j9J503q3j692k42K146
1270B262o7j849l52J113r08j904K12R14j69m42J762J292r05n14J201K45k686j423
1288b218J132R0k001r19J921J043p00P16K534J349J07J349J993j130k143j88r15
1305B020l453l279j48N84j462p31K245K956oN92K909J596l99k57J806p99j959
1322B215o41O6j631k466OJ802j010j302J575K436m69j034P86P55r06j529P90j5
1340e72j290q74J877J11j184K30K255O17o62Q61K517R20j739L89Q75j077k334
$$ y = [2727, -303, -855, -103, -1003, -2756, -1966, -332, -1099, -2018, 237, 2549, 1890, 972, 2121, 2800, 198, -2481, -2756, -2901, -5016, -5443, -3182, -1392, -1295, 733, 3977, 4276, 3545, 4451, 5599, 4476, 1349, 1413, 1744, -175, -2723, -3003, -2398, -3607, -4624, -3152, -1684, -1959, -1480, 993, 1907, 649, 630, 2133, 2050, 358, 116, 2262, 2195, 346, -6, 1107, 199, -1705, -1493, -579, -748, -1190, 572, 1864, 959, 445, 1646, 1891, -795, -2218, -1086, -996, -2997, -3916, -1995, -952, -1652, -936, 1598, 2947, 3054, 4403, 6396, 5266, 3123, 2935, 2020, -1433, -4712, -4860, -4276, -5738, -6469, -4224, -1268, -1274, -682, 2227, 3823, 3424, 3167, 4973, 4174, 2215, 1574, 1640, 9, -2457, -2451, -649, -1659, -2961, -1386, 1050, 581, -453, 333, 1088, 182, -1347, -557, -572, -1862, -2736, -859, -748, -1932, -1702, 553, 1170, 508, 1369, 3886, 4806, 3067, 3456, 4331, 3254, 920]
1357I20r94p19j433k144j08L81j281n12K270J709m87J598L084K137l48L5J373
1374E481L2k534j092n64j438k436l62O43m62r01J824J964n24j14J502J534j392
1391A161j194R74J68k098j241K90L77p54J34K412J007J42J241J944l86j833L16
1408B660N48j728l063k65J64k266j617P19J313k81L73K228K254K49Q98K078M26
1425D690j274k01R34q50k807p86O90j148j994k42J545o8j008P96J725k09k99J716
1443A210O66q37r14Q76m23k093n10J123N8j228r3K071Q35q17J008J895L58q78
1461B307J27J048j129k205k85k67j568j785R87P98j084O7K242J557l00K54K117
1478B881M93j644q03O15j134j920o69O88r23j237R77J974n4L46J884J984j64o74
$$ y = [920, -74, -793, -2226, -4370, -4478, -4097, -5378, -5890, -3620, -1911, -2398, -800, 2284, 4421, 4073, 4108, 5481, 5513, 2979, 1887, 1323, -115, -2551, -2913, -2270, -2732, -3633, -1809, 155, -369, -483, 1019, 2553, 1161, -33, 941, 1109, -989, -2230, -1940, -1563, -2317, -2183, 229, 1236, 1378, 2619, 4563, 4177, 2344, 2660, 3208, 1480, -1583, -1848, -1684, -3950, -5567, -4848, -3535, -3816, -3443, -1215, 1039, 1288, 2186, 4264, 4690, 3416, 3215, 4149, 3299, 492, -294, 396, -752, -2746, -2988, -1443, -1511, -2519, -1723, 2, -207, -506, 1210, 1876, 1039, 125, 1001, 578, -1515, -2025, -902, -844, -2072, -2165, -94, 741, -76, 932, 2827, 3185, 2307, 2434, 3482, 2353, 148, -137, -404, -1972, -3757, -2770, -1972, -3056, -2989, -747, 810, 510, 764, 2881, 3374, 1730, 927, 1542, 408, -1512, -2181, -1493, -2416, -3653, -2676, -702, -756, -410, 1474, 3458, 3294, 2620]
1496B620P53N25j584j808M6l58j728j351N27J24r14N74J636M86k16Q38J352L57
1514A879j103M12R49r68j762L23K76j090j056R30J104q86L32J251J037o09J24
1531A143J159p9j513n99P33p61j963j48P03k09p77P39J755J52n47J238J431o88
1549A769n69P18k27j475j412J71k68j413l98J257L82q13O55K224J97l34P33J759
1567B956R4n63K17J81j090j510N3l29j399q79R67j6j120j92J566J019p51K33J405
1586H42L79r64l84O16j38j111k12Q82m92o32P97J310K94m60J339J098q77j218
1604A069O2j35j433j453L1L54j377k96J061R37k31R83J787L87k84M60J399q31
1622B490j878o2L20q78j572K34N67r70j28O36Q89m69k45Q43N88o63J87Q15K31
$$ y = [2620, 3373, 3898, 2314, 506, 552, 194, -1534, -2885, -2358, -2234, -3148, -2574, -938, -452, -668, 170, 1522, 1879, 776, 1188, 2137, 1169, -593, -270, 6, -1084, -2140, -1210, -106, -992, -660, 591, 1628, 1019, 1143, 2302, 2223, 710, 111, 844, 83, -1880, -2028, -1325, -1534, -2311, -1572, 183, 335, -212, 1026, 2457, 1769, 1200, 1918, 1691, 216, -1196, -1025, -1293, -2706, -3104, -1847, -1465, -2278, -1623, 601, 798, 464, 1197, 2956, 3050, 2487, 2704, 2885, 1795, 285, 338, 9, -1390, -2269, -1302, -1318, -2438, -2630, -1064, -45, -796, -563, 842, 1221, 257, -127, 489, 351, -760, -972, -90, -582, -1214, -417, 893, 1187, 727, 2066, 3164, 2287, 1069, 1131, 996, -437, -1890, -1859, -1505, -2882, -3178, -2117, -1180, -1411, -428, 1359, 1746, 1462, 1922, 3321, 2490, 612, 550, 870, -8, -1580, -1346, -779, -1749, -1877, -1241, -352, -821, -1066, -223, 365, -298, -111, 704, 935]
1641I35m51J09R73k7j135qO96j84j078J76M41n38o38L83N99p76l19O28L89r60
1661g85n18N72K2j182m19J143N89m70K20J819P36j11O44R92o26j046J82J18k044
1680a64j086K02J19q21r09J375Q94j93o5J213O12p12k74J79q7r64m77N70k54m80
1700a322N87J227M0n65Q15P46m42q74K43J12o29o12O49j03j39n31J039L65n94
1719A2M2O64K37j243k73R10k44j351J85Q60o7m89N54Q35r09R7K14M77p31p05P51
1740a74K13p22l3J064N06o33J80J214J8j468K8O42o61q89q1L71n23n45P20R09
1760A36j14l12Q25N62k64j014M01K59q21j199Q43K97n87j06J005N58n98O30O32
1779A133l00p33K16L23k40j178J38N28p8n12J029L99k13l04P74R1r94n76M13n21
$$ y = [935, 484, 593, 1566, 1539, 404, 396, 1092, 908, -170, 6, 447, -91, -729, -346, 253, -523, -842, -214, 175, -785, -1303, -731, -709, -1891, -2310, -1167, -578, -1048, -828, 991, 1727, 1616, 2260, 3252, 2626, 1580, 1762, 1880, -164, -1250, -1048, -929, -1750, -2659, -1284, -390, -583, -648, 565, 1177, 465, 191, 370, 283, -681, -1158, -588, -842, -1322, -735, 492, 532, -33, 782, 1528, 1086, 212, 455, 567, -62, -674, -25, -128, -267, -798, 241, 606, 12, 54, 718, 955, -288, -561, 349, 105, -1246, -1061, -201, -268, -757, -203, 632, -277, -180, 34, 511, -220, -925, -174, 39, -683, -716, 348, 854, 221, 401, 1615, 1633, 165, 193, 835, 174, -715, -796, -425, -948, -1493, -773, 136, 22, -290, 535, 1097, 833, -181, 220, 479, -342, -1541, -698, -401, -988, -1094, -89, 469, -129, 501, 1133, 833, 100, 316, 639, 399, -779, -641, -113, -191, -703, 326, 725, 512, 208, 982, 1073, 79, -497, -84, -605]
1799f05n93j61O92K06n24K30J522J31n23L47L41M4j204M60j26o76r17Q95P96p65
1819d30j19J067L77m74j84M76Q6q05p84O75k65q53O9O99J02j40O63J002m87j06
1839E69K35K51o30r54N50J83o81m96O17M89l46n45O96N03q55K33L24m5o75J70
1859d07Q69n34LM51Q41n87l31L61K84q65n62L9J47n42m37O88K49q1j57J002K56
1880F87n37m5N75j94r34l58K51J06q19L89Q02M19k82M57R59n22m32P25l58o59
1900B30j046M68K8p89l65J076Mj65L86P10L4n07Q7O91m24j032L48Pq1m50O37M23
1922B70q53k5O63N45o19n2O13r0k32k77O64j8l11m4M97l71l65m61M52l95r42R2
1944a259P63Q9n21O25Q84r3j35M51J42m38m10J35k06m89l19N68K6k66M07N80r5
$$ y = [-605, -1198, -1359, -667, -461, -985, -755, 767, 898, 375, 722, 1063, 1107, -97, 363, 237, -439, -1356, -461, 335, -430, -549, 518, 895, 421, 237, 713, 799, -6, -790, -115, -380, -1233, -1164, -465, -363, -503, 160, 1162, 675, 569, 804, 1055, 425, -529, 21, 204, -477, -973, -356, 133, -213, -758, -62, 441, -414, -181, 143, 98, -577, -407, 462, -72, -69, 382, 1223, 636, 305, 666, 950, 85, -477, -438, -291, -833, -1270, -582, -333, -414, -571, 431, 687, 150, 105, 680, 486, -448, -806, -555, -449, -1268, -879, -77, 342, 60, 517, 1476, 954, 522, 1247, 889, 230, -816, -348, -320, -1109, -1474, -398, -394, -559, -173, 537, 571, 64, 151, 842, 418, -614, -266, -259, -340, -790, -153, 270, -583, -608, 55, 600, -19, -71, 542, 452, 220, -57, 607, 589, 278, 234, 731, 360, -5, -466, -14, -409, -1351, -1259, -496, -407, -928, -303, 581, 488, 353, 804, 946, 508, 98, 233, 27, -462, -781, -213, -187, -453, -46, 534, 439]
1965D39K59R1J67j72o01k56L23p70p57J32L79o2j16O55M86J10j75J001N9o71j98
1986C23O50l42o30k09K90j25q35K70K24j67k47K72O40m05l9P19K09k1n65L98J87
2007E97o94l43J79J93o17N9L11L56k81M4P93J2o3J27L37m77q13j85L20l69n90
2028a104K99L92k51L47N04P15l71o4N11k7n32k25K65n65n08j64O96l17j23J5J72
2049c35L41m29N05L53p50j66N09M28j29k76P14L78o90J2J42r1r87o99J92L07o40
2070a311L85N72L25k57P19P42l16k99k45K11p72p74J43J34p7k50N42R10L0N60
2090I72P57L31q36k05Kq62j147n35K03n13j05N18R38M64k30R17N32j08j57K09
2110A145l98l27o27M6k05l03r0O61M79j05m5N98Kr57K1j1l26o42o3R32j8k14N13
$$ y = [439, 698, 789, 956, 784, 183, -73, 250, -520, -1277, -1145, -766, -828, -944, -289, 197, 307, 132, 1133, 1192, 521, 323, 973, 631, 1, -208, 82, -43, -878, -608, -384, -551, -798, -526, 114, -291, -330, 389, 598, 577, 12, 410, 597, -97, -440, -261, -68, -685, -626, -315, 41, -240, -196, 597, 609, 546, 673, 1010, 533, -280, -465, -145, -514, -1104, -805, -413, -664, -317, 187, 902, 531, 467, 978, 951, 419, 194, 459, -106, -614, -778, -82, -399, -522, -507, -335, 6, -423, 82, 435, -315, -481, 28, 456, 327, 51, 765, 1143, 453, 465, 607, 516, -471, -1170, -978, -671, -1311, -926, -354, -29, -286, 433, 1175, 859, 560, 315, 526, -246, -1020, -877, -743, -820, -1070, -528, 382, 412, 972, 1729, 2060, 1224, 1019, 1021, 159, -988, -1523, -1320, -1833, -1938, -1420, -482, -18, -248, 669, 1201, 1093, 936, 1145, 747, 420, -207, -161, -366, -669, -759, -98, 381, 276, 231, 829, 831, -126, -105, -116, -442, -1084, -1147, -215, -233, -447, 66]
2133F6M80j92k87N11m5p96l59J32N77k12l69J152L16l03R6L17k93p01m82K6n87
2154i53m93l76N32P4K3N94R64P57l07Q47J09o02q30k58j4m83q02p7M55P1N71O42
2176D44K37M9K18K59p98k75m38lj31o58j00M44L17n4M10M51M81k95L21K42p89
2197C32l75R6l21l87o3N21K23j49Q1N24j17o10j4l8%j58P7M44j65J95M22O41p68
2220C91L59J54n4m30p76K8k73m39j17L14L36K1K80N09L90k65K63j82l65l45P1
2241a30l6k75k96O73M57j85M1J67O35k83k85J78P3j015l12L19m86n93L27J53L26
2262e47p0M34M93R9k21K88M21n81P2K60j62k73j21K25K40o27L9p7l29r1k4L58
2284a94K30q59M30J78kq2J81L03j54k57N5L78j73k69M49L24l46Q3J35K00jm50
$$ y = [66, 546, 354, 67, 578, 533, -263, -622, -490, 87, -125, -494, 658, 974, 671, 767, 1084, 791, 90, -392, -366, -953, -1446, -1822, -1290, -1216, -1193, -599, 365, 1122, 815, 1662, 1771, 1169, 339, 81, 67, -416, -1218, -1295, -840, -769, -198, 444, 681, 730, 948, 1207, 409, 134, -304, -307, -438, -1096, -1196, -752, -435, -489, -79, 372, 853, 558, 879, 1121, 332, -43, 53, -268, -655, -718, -197, 26, -123, -42, 482, 365, -245, -259, -297, -297, -455, -378, 66, -99, 96, 518, 1159, 391, 750, 904, 850, 420, -356, -328, -601, -1040, -1157, -843, -507, -486, -206, 303, 693, 428, 691, 509, 144, -201, -130, -166, -441, -737, -64, 393, 208, 249, 416, 1051, 768, 483, 661, 734, -281, -593, -274, -760, -1353, -1026, -873, -547, -617, -183, 310, 409, 188, 476, 897, 316, 388, 648, 486, 213, 92, 317, 557, -70, -31, -108, -437, -528, -552, -194, 36, -823, -393, -215, -217, -299, -118, 185, 31, -226, -171, 207, 34, -235, 214, 538, 192, 275, 410, 610, 609, 159]
2306A59M10l05q03J45j14l97k63K16L12K70n2M54O40j21j53m5J57J6n43K59O5
2327C07k08k48M96J19n50k43M41J35l54r3o7n6k16j43K09k29O6O78j12J35L2J90
2349B89R5l82J78q5K30m78K30M40J00m03J6J29q9l76l6M9np80K14J47o5j50M13
2372c19O6J29j3L38N92p4m11J63N7l79j20J8J10o49L58L9Q4l78K53O2k42L7L12
2395C3L66m70j89J73K05k32k01K4L51K3l61K26L08Q8l3J08Q0m53l6L80m12l43
2417c65k08K91K27o49J1N03l3j35N66J96l15J80J35j60j45m07L68L19n80J43M95
2438D37j92r8L1J88l39j09N7j95R5n01J5Q5Q8j15J94M29l55j09O28L70l06jK37
2461E34K29n26k68L35J92q05K94K87l9j87l50N2p9k50Q5P1j09l00L08J94k35K66
$$ y = [159, 569, 264, -539, -394, -508, -905, -1168, -952, -640, -370, -422, 32, 672, 551, 398, 353, 510, 526, -17, 242, 307, 99, -149, 347, 466, -84, -327, 114, 249, -105, -198, -265, -321, -537, -680, -471, -700, -634, 44, -68, 67, 99, 289, 384, 2, 180, 95, 325, -153, 77, 517, 617, 214, 230, 359, 270, -106, -142, -93, -98, -878, -664, -517, -582, -732, -319, -253, -124, -137, 201, 793, 719, 308, 471, 528, 149, 29, 47, 157, -492, -134, -95, -11, -389, -136, -74, -316, -279, 33, 399, -71, -260, -87, 118, -114, -315, -291, 60, 83, -278, -52, 256, 344, 311, 419, 499, 46, 10, 390, -22, -365, -573, -282, -55, -704, -693, -190, -223, -358, 208, 404, 89, 269, 404, 244, 99, -308, 60, 379, -201, -58, 437, 245, 147, 178, 366, 27, -82, -25, -220, -125, -626, -611, -526, -438, -553, -359, 70, -285, -394, 234, 604, 298, 297, 534, 763, 237, -31, 304, 496, -309, -15, 272, 233, 46, -304, -252, -331, -581, -496, -425, -534, -834, -526, -332, -567, -301]
2483c01K20L63k3nK10K18m36J37K21l41l8l11L75j25j50n5J71k48n22J27K39r9
2505c73j98K57K60q7R5L4J14j84m6L56J16m3l38P44j58J87m59K04J2k51m57L46
2527A31p26J71j06j78N1l18K49O25l36K35N96j5j69L70M6k6r4n18j05J92k3J54
2549B06k2K16j05%K84n17l68l80L56j97m84M55j35K37K35K79K74m0L00K80J0j31
2571G53k11km02l73p3O4j74K11M61K54p9j03k59j74j8o79N21k45j55j23L16L19
2593a71j80M23L89K58J84Pl6j04n54r7k58l20k14k11N08J31J68M54L87j02k84
2614C78J9j72k83m32j16QQ9J22K26M65k16M12K6o6m5j7Pk88m36j02j25K33m30
2637g43N12K09L17l18L86j2J09n31J77j76o9j47L73k17J15J05O0K91l29r3K82
$$ y = [-301, -81, 282, 259, 254, 464, 682, 246, 383, 604, 263, 225, -86, 289, 164, 14, -41, 130, -118, -640, -513, -274, -373, -571, -314, -54, -141, -46, -12, 102, -82, -128, 228, 344, 301, -37, 707, 549, 736, 277, 481, 493, 242, -215, 131, -595, -424, -530, -708, -657, -975, -726, -101, -437, -202, 394, 379, 210, 580, 626, 600, 506, -12, -117, 75, 52, 206, 184, 400, 295, 295, 579, 62, -306, -686, -330, -527, -1011, -556, -691, -454, -219, 60, 334, 294, 594, 874, 884, 753, 542, 540, 138, -235, -308, -244, -418, -207, 254, 508, 429, 326, 67, -107, -125, -804, -283, -528, -683, -806, -490, -171, -351, 72, 461, 719, 903, 910, 874, 770, 216, 119, -139, -459, -673, -884, -376, -245, -77, 377, 764, 662, 378, 397, 225, -58, -490, -606, -598, -509, -387, -161, 304, 88, 500, 526, 460, 415, 398, 405, 117, -319, -421, -546, -313, -743, -231, -22, 295, -23, 363, 351, 460, -71, 106, -70, -139, -286, 87, -130, -15, 90, 150, 441, 112, 19, 301]
2658C01l20J3k89J51k17P1j50K31R3J74K89K33k20K1k1n0m19l93J58m8K81k22
2680c33O33P6J07P7r9j60K7l29j27j9l56K58K3j59J01O8OJ54K65Q2j62L6j16K73
2704C26j50o31J28K05j99K06L01K81k05j29j16n7o4j39Q8j84J73O2J85J59j92
2725D8j79M51l91O1j34K23k08j13J10P4K51n36L04O10k80p9K38J33j92k49j92
2746e0l36k80k45N40j93J43O1L95J07M5m6K8J32l28J48J10m4l16K92j45j58j84
2768c24M12j31K23o5k6J41k95k05m6n6k47J72K33J8K32p1K61O5R4l21L41j68K16
2791D53l97K87mk11k01n3k14j14M19N0m8k41L08J96n11K02K67j73J6K03J69L9
2813D42m01n6J09k81M6J55K0j50R4l8J77j72P3J9M4k06j46J82J01l23L8L95j39
$$ y = [301, -19, -6, -295, -144, -361, -290, -440, -209, -116, 58, 347, 580, 360, 381, 360, 310, -109, -502, -344, -392, -111, -333, 300, 376, 483, 560, 461, 301, 328, -1, -128, -147, -503, -245, -222, -381, -280, -212, -206, -52, 213, 295, 133, 169, 53, 326, 176, -455, -327, -122, -321, -115, 186, 467, 262, 133, 17, -40, -104, -243, -155, -339, -166, -104, 81, 240, 48, -131, 320, -71, -10, -144, 79, -129, -242, -132, -58, 193, -343, -39, 571, 291, 212, 450, 583, 391, 142, -50, -386, -666, -911, -371, -564, -421, -360, 35, 142, 187, 141, 169, 301, -27, 121, 231, 187, -129, 163, 18, -140, -324, 88, -43, 180, 115, 89, 230, -65, -270, -316, -372, -619, -447, -214, -196, 36, -35, 226, 291, 385, 64, 405, 237, 453, 56, 343, 339, 128, -73, -126, -340, -454, -35, 15, -33, -274, 34, 230, -281, -79, 188, 15, 31, 234, 403, 442, 41, -15, 94, -187, -141, 14, 34, -116, -22, -60, 117, -55, 18, 37, 81, -125, -271, -89, 12, -311, -273, 122, -17]
2836a7J23n8J15l5n8J7K82j46l1j4M0k74k83n4K69J00j90L7J60j01j57L32j24
2859f7oJ7M62k54j15J90l0k02k20K58M7k45l2R4L74o56L51k07L78j88o4Q0J55
2882A20r2o6K50K74l24j11m3n1j42J82k3k24K76q1M0m5Q9j10J50K09j40o5M3l34
2906b18J78o3j20m8L7N8L74r2P3L61pk4ol11j36j17m33K53k53j1l1k9K00K02K62
2931I9K55pQ8J68r1l34l84P1j68q1J56L22l27J92J91L65j31Qq8q6l9q9k54j80
2955c44l85N4J63O1J56J99N40j24j6p1L05j70m18m6j00l4m4nM69j67j62J75J84
2978B20M0p9j04J84m83qP0J4j71M6K63O1J04PQ4j45j0J46L9j60l32j5J02k0l24
3003d71N03J97l39K94P0q4p1O3J31k38l74j35J44J30l79M72K4K74k29Q7K56J8
$$ y = [-17, 106, 48, 163, 128, 70, 87, 369, 223, 192, 178, 218, -56, -339, -393, -124, -24, -214, -177, -17, -118, -275, 57, -67, -73, -56, 406, 152, 37, 227, 197, -5, -225, 33, 80, -165, -197, -103, 271, -385, -34, -241, 137, -51, -115, -35, 120, 28, -38, 212, 486, 162, 51, 8, -43, -185, -3, -26, -250, 26, -55, -15, -60, 29, -81, 69, 278, 138, 73, 116, -218, -40, -103, -223, -271, -234, -176, 198, 106, 179, 540, 533, 509, 503, 192, 56, -61, -494, -241, -494, -505, -536, -565, -365, -163, 99, 354, 347, 435, 603, 512, 178, -206, -135, -303, -384, -228, 94, -233, -41, 150, 515, 384, 392, 304, 218, 179, 90, -164, -344, -729, -675, -512, -451, -295, -96, 444, 320, 304, 233, 538, 368, -50, -96, -196, -230, -274, -279, 190, 23, -139, 36, 220, 260, 181, 77, 261, -222, -230, -160, -146, -317, -271, -8, 53, 157, 164, 248, 103, 93, 239, 278, 118, -214, -229, -127, -147, -471, 32, 229, -110, 184, 254, 170, 99, 162, 293, 55, -319, -454, -310, -180, -559, -87, -63, 211, -18, 69, 325, 343]
3025C43J45l22L31o20N9k36L78l55o7M5%o4J06Q1J98o8J04NL1j66k60M64p2n95
3049e35M94N3J67j17J97j4J59l7J43j82J2k48L1l96k69l4m05L72j95L15k16N22
3071a83K72m4K94m9Q7M37n8m77l84K94m7J09l91J28J27m33N55L3j97q5k39N4k49
3094d46k80j65P0J61j37N29Q7K97K84J50K04J38m08J99k63k05l60J46m09k62J28
3115e42L05q9K22L2M05l80q1K02J97m41m26Q3L18k40N57N7L96J98p3O4J49m99
3137D14k50M0k38j95k34J39l37K25p2J04K06L49p7N3J18q6l61N08l02q6QM9J8
3160gJ89M4M46k45J09j69n0o9j32k72q2l53r5J15J81J22p8O19m83M50N8L5j80
3183A53N7j67Q6j50K85k06J6q9J57K24O7l33R5Mn7j62j37j35m8N8r4L2J21N7j12
$$ y = [343, 488, 166, 497, -123, -64, -300, 78, -277, -344, -299, -299, -363, -257, -176, 22, -46, 58, 63, 94, -72, -332, 132, 60, -535, -41, 12, 179, 62, 259, 245, 404, 367, 510, 328, 340, 92, 123, -273, -542, -576, -981, -609, -804, -489, -705, -183, 89, 45, 339, 290, 377, 814, 756, 279, -105, 189, 142, 251, -140, -12, 115, -318, 237, 270, 73, -12, -251, -197, -446, -726, -891, -821, -660, -797, -268, -181, 116, 400, 550, 754, 892, 484, 683, 420, 215, -145, 1, -408, -670, -542, -237, -326, -104, -72, 333, -47, -128, 74, 271, -170, -596, -513, -195, -435, 122, 179, 575, 773, 700, 764, 913, 414, 164, 204, -34, -229, -463, -324, -661, -436, -508, -404, -198, 151, 74, 127, 245, 159, -202, 306, 4, -82, -74, -25, -7, 182, 226, 672, 427, 536, 367, 317, 248, 116, -156, -238, -591, -686, -571, -390, -268, -346, 273, -210, 240, 298, 333, 153, 210, 43, 129, -21, 264, 58, 74, -15, 142, 366, 433, 100, 195, 199, 142, -20, -157, -292, -340, -282, -376, -344, -223, -166, -278]
3208b78J68J33j47J28K24k0lj37K88j45j67k15L64k04J5Q5k99K65J70l58j3K9
3230a17N7j6j32m8Kk46J94J58l44K92N95k84J07K34Rk21Q9m4k98j24K70j71m1
3253g9j04Ok67K72J04p0J59k14K48l14L47l16L40J12k47k84L62k6K14p6K22J63
3275E52m26K41m39Q6p3l71J07J4o3m6R8j7l8L32O2J66k98M45j52M1J85n3J13J
3299D67k58J72K7k33k9m2j59j72J32j71l35L23p5K19l19J18J48n4K56k30J74K03
3321A62jl7J00O1k7l5K5j11j30J41Oj00l15J00j72p2r4j57P52k73K37k16R6J82
3345A22j55K67L0j97J09k2J9J62L1l5k41j53M0J97k74r7n8m8O8l0L0K31j05J14
3369EL5J09K1oR3K7J22l35K80k73Ol42L83k88J91L13j46k09o3P2r0l08P1K6Q2
$$ y = [-278, -110, 23, -124, 4, 228, 208, 205, 68, 356, 211, 44, -171, 193, -11, 4, 89, -210, 55, 225, -133, -146, -117, -60, -76, -208, -256, -254, -500, -306, -148, -492, -200, 395, 111, 218, 452, 461, 240, 329, 285, -13, -137, 133, -38, -79, -183, -177, -444, -172, -68, -138, 21, -193, 55, -259, 88, -228, 112, 224, -23, -307, 55, 29, 243, 167, 389, 552, 126, 367, -72, 14, -59, -430, -323, -309, -372, -418, -320, -337, -375, -43, 19, 185, -113, 332, 180, 221, 406, 353, 466, 467, 209, 381, 408, 175, 146, 104, -55, -227, -95, -266, -601, -278, -353, -134, -453, -335, -187, -241, 15, -215, -41, 162, 161, 124, 224, 285, 258, 223, 248, 137, 7, 148, 154, 54, -261, -161, -333, -405, -499, -656, 96, -177, 60, -156, -60, 122, -33, 234, 264, 67, 176, 154, 173, 335, 366, 331, 90, -63, -23, 174, -100, -197, -255, -303, -235, -265, -235, -4, -109, 5, 40, 149, 170, 164, 257, 284, 406, 71, 351, 78, 84, -258, 125, -163, 28, 341, 195, -14, -77, -5, -95, -403, -332, -306, -224]
3394b24J25O7j34L83m98N79m03N77k75L07M1j91K14o11M87k41m45j12J40p3M2
3415b45l1n2L70m08R9K20n6j8K03J48k14j45K74O0k03J31k72J04K0n6J21Q3N0
3438A83L04l65j34J7j98K01j49l63K20R4J07k22J69K54Q2P1j66N26j94j54k40
3459D3n7M8l27J68r2M1j41K01om2J51j52Q4k62K74K84m10K46J34J34j69j01Q0
3482A29O3l5J64l79N8O9m92L78l42NJ47j25L54l45N62l11n7L02l22L91j50o0O7
3505G1q6r0K02O1J1j8j15L52k23K69m30L43m00K8k65M1k63j69J92M28J70Rlo6
3529D9R4K46l35L10j13l29J90Jn2l82L0J06j29J08L6K89j51K59l4k4l09K19l53
3552b74j03k0K62K1J42l34N63Jj28J06j78K03l6j50QN2k38j18n8r4K66j82L28
$$ y = [-224, -99, -32, -166, 217, -281, 298, -105, 472, 197, 504, 545, 354, 568, -43, 444, 203, -242, -354, -214, -287, -245, -276, -328, 42, -366, -267, -47, -103, -121, 82, 230, 16, -129, 145, 205, 2, 133, -139, -35, -15, -71, 50, 133, 183, 487, 122, -12, 5, -193, 8, -141, -504, -284, -190, -83, -305, -136, 118, 200, 271, 105, 631, 437, 283, 43, -14, 34, -293, -125, -217, -176, -317, -116, -122, -164, -13, -165, -81, -343, -69, 215, -195, 51, 185, 319, 150, 49, 129, 192, 157, 321, -58, 0, 69, -423, -45, -387, -382, -235, -360, -6, -351, 211, -100, -157, 145, -177, 214, 64, 4, 71, -15, -105, 97, 158, 169, 151, 36, 388, 165, 434, 4, 347, -53, -25, -290, -249, -512, -681, -489, -61, 109, 118, 115, 49, 143, 389, 54, 364, 251, -78, 112, 113, 61, -321, -291, -185, -314, -206, -170, 119, -32, 227, 193, 169, -140, 79, -274, -377, -397, -135, -114, 28, -306, 257, 258, 130, 236, 58, 261, 225, 75, 83, 135, -103, -221, -279, -373, -107, -289, 39]
3575C9j32P3J67J51l80K05K31k45J03j82J6J01J2k92J95K91n05M4J73Q3j20k65
3597b37J91n5m02K40Nj20j51K60J15J62o3L6L63J60j97qj50J17k14K70Pn38K21
3620A2J61q3k95L65j43j56n8k67M1J06L2N3N4j07P2K49K58o6J61Q2j70RJ16j5
3644D11R3p01j27L04j26p9k2o1O9J69M12n49J24q0K2K59m24J48k00N06m08K91
3666C1K06K60J66p6pn5k86m6J23l65l82r1R9K0k06J66k46K50M2L29K39L8j07K48
3690C50p1J13k23m81L08K14J79M4k96Q8j9l2J44n16J85m98K74j96N1J13k3j60
3712d52o1N22P5P2K24J41k26J38j8j59k03pM25l68k39J94j08j5j36Kj13L3k18
3735d97J35m5l4J80L7j18J44j5K80l4J65K45J36l16LJ41j68m7k89L3K81k70j72
$$ y = [39, -93, -20, 147, 298, -82, 123, 354, 109, 212, 30, 46, 147, 159, -133, 62, 353, -152, -108, 65, 148, 28, -237, -46, -101, -503, -263, -258, -378, -529, -269, -154, 8, -55, -19, 344, 504, 307, 299, 149, 266, 52, 322, 329, -209, 12, 173, 90, -205, 160, 17, -139, -197, -464, -423, -317, -285, -232, -178, -285, -213, 36, 294, 228, 389, 471, 301, 310, 426, 411, 504, -197, -324, -20, -146, -225, -247, -308, -239, -70, 342, -207, -83, -163, -141, 118, -306, -158, -358, 148, -260, 31, 237, 497, 663, 587, 580, 525, 239, 193, 316, -49, -431, -522, -423, -403, -609, -443, -689, -439, -397, -68, 171, 209, 102, 350, 279, 392, 169, -312, -4, 210, 389, 433, 137, 225, 206, 174, 318, -198, -13, -511, -237, -433, -382, -269, -292, -452, -513, 9, 84, 156, 380, 521, 295, 433, 415, 256, 53, 46, 471, 103, -136, 58, -50, -65, -201, -199, -312, -279, -497, -362, -407, -441, -261, -224, -342, -198, -213, 67, 33, 198, 443, 579, 263, 266, 407, 239, 192, -97, -64, 217, -53, -225]
3758b25M5J89k92Q4RO6k53j3M30J36m75K09p0K20Q4J65J7j73K30M2N8q3J7m86
3782f9K23l52o3p4j75M38m27K36J63j68r7J84J13n1J15q3L01j73M1P3N0j57k05
3805a57N17om89N77k50k87j47J44k9k8K9k76r3J24J68M4j8J35P2L87k10Q7q3n6
3829A55L04p8j5l08O7L38j60l76k73J62J91l87p0J64j94L1r0Q8K65K0r9M37q8
3852H4K34j90j49L21N8n9p6L61j73j34K7M4k64j47k8l86J59J97k54M7j22P3l5
3875d12J12K11r8M85m5k94P06l75k02J07M4j39N6k9J30k1k06J47P4k74k19J27
3897a15j55Q9l56J51N4K72k19K20L12j56J52p6K38J67l88kk46J82j77L47j11k36
3919e3J02J4L8o7j38L4l62K01j31k3O6K40j01R5K81l48L10j19J37R9j16J13N9
$$ y = [-225, -180, 9, -283, -199, -190, -124, -377, -390, 40, 176, -299, -90, -160, 60, 144, 309, 326, 153, 383, 425, 483, 400, 417, -69, 154, -198, -261, -335, -510, -72, -499, -263, -100, -268, -365, -181, -68, -119, -4, -87, 214, 41, 82, 155, 205, 48, -157, 360, 354, -135, 442, 192, -95, -242, -98, -127, -155, -126, -402, -495, -371, -203, -159, -177, -42, 30, 417, 207, 294, 211, 155, 459, 381, 366, 58, 125, 463, 303, -73, -346, -184, 7, -380, -450, -286, -480, -449, -539, -451, -186, -166, -265, 172, 84, 318, 128, -21, 300, 358, 299, 223, 584, 411, 277, 304, 348, 84, -63, -91, -477, -318, -121, -375, -328, -450, -377, -412, -300, -89, -187, 298, 253, -41, 665, 290, 88, 195, 239, 100, 156, 127, 257, 236, 30, 177, 251, -23, -242, -115, -270, -181, -537, -386, -332, -60, -279, -59, 253, 97, 249, 173, 411, 578, 190, 188, -58, 124, -53, 294, 183, -53, 49, 63, 101, 34, -104, -70, -432, -231, -362, -385, -319, -79, -180, -85, 196, -152, 158, 39, 176, 275, 159, 272, 331]
3942C31l51K68j14j83K29l03j01j07O5J59Qk82J8j05P3O4O3L8N06l31L71j47j2
3965A57l6Q1j56L90l49L3J53k91Q0j52j62n7M7J72p1q9P3j45J56K84l00J12N4
3988a6J87j77j3K82r1J7l7KJ53q7pr8j85P2j50P2n7j3k11j45K61l8L0N3n4M84
4014B34j27k2o7K3J99j77N5K13K0l08L9J57j96n48K94J70k36j18K71l5r2K17P0
4037C6l15K90k04L39l62J6L37R1j47J87P9k65Q7j9J66j28p0k10Q5J77o20K88j18
4060b80J00k79K35K5j60K05j86J89L9l3M50j13k80K86j09J18M0j40O4l5k64L22
4082A94m76K80J1k6j78p3N2j92N7J69o9LK49k47M04j38m4J91J4r2L20j61J43l82
4106IL50l17M5J41k13r9l2J99k50k43Q1n7R9R6j68L44J01j19L1J61MK36l80L33
$$ y = [331, -20, 248, 134, -49, 180, -123, -224, -331, -266, -107, -99, -381, -363, -468, -395, -331, -268, -230, 276, -55, 316, 169, 157, 121, 202, 46, 436, 87, 120, 273, -18, 62, -90, -252, -309, -262, -90, -161, -250, -177, -322, -166, 118, -182, -70, -16, 171, -6, -19, 263, 172, 189, 152, 154, 307, 220, 213, 115, -70, 2, -148, -76, -133, -146, -357, -502, -241, -279, -249, -196, -250, 234, 107, 85, 18, 41, 240, 63, 118, 331, 351, 43, 82, 239, 43, -505, -211, -41, -277, -395, -124, -159, -251, -34, 36, -279, 11, -193, 146, -216, -200, 137, 228, 81, 268, 347, 82, 169, 150, 316, 188, 118, -92, -7, 170, -450, -162, -280, -180, -459, -224, -199, -359, -154, -340, -151, -112, -145, 305, 192, -88, 198, 89, 207, 247, 107, 171, 136, -128, 194, -282, -2, 9, -17, -195, -268, -216, -408, -351, -182, -251, -248, 1, -246, 158, 20, -24, 167, 181, 89, 409, 248, 391, 9, 359, 42, 87, 228, 15, -84, -116, 83, -167, -410, -329, -386, -287, -191, -359, -15, 86, -33, -2, 159, 163, 399, 19, 352]
4130C52k37L7k43K30K8k52J23k08K7J22j7l17K42j17J80K75n37P9O2J53k10M76
4152B48j75K4m5L36Rk8m2j7k3j26o5k16K92j45k23k48M8j01J69K48q6K0M1J72
4176F7P7J6QM9Q6k26J23j5k85M66pk68L1k32R4L22m28M8j3%k49K36j98O2K53l19
4202c02K5M24l03R7J46R2L8j92K9K41l08L54j98r8R7L7j10k10k63R5M65o10J66
4225b88L24j95J15r3L42j93K12k6rJ22m86L44N%pp7O8l6m47L25k21K6N1P4j32
4250b02j13J78p2M71m81J47J37k64L92r4k8o4J01j8K05k97L43k91o4J95l50O0
4272a09O5j95l5J55J7j11J31l0J44j30K17O2n7j19J57j1l21K55k37M02r6j83k15
4295b44L21r2Q0k66J67q8J96j11J1j71ln7K01K9k71L39J4j38k56L91R0J00r6j14
$$ y = [352, 115, 152, -91, 139, 167, -85, 38, -170, -143, -21, -38, -355, -113, -230, -50, 225, -312, -233, -171, -18, -228, 248, 73, 97, 52, 388, 397, 369, 327, 310, 287, 161, 96, -120, 172, 27, -196, -444, -396, -497, -328, -80, -166, -146, -105, 67, 144, 160, 168, 217, 303, 77, 200, 185, -100, 366, 359, 91, 122, -110, -16, 306, -122, -74, -87, -87, -336, -100, -298, -236, 17, -302, -277, 147, -156, -59, 87, 179, 217, 25, 54, 295, -13, 341, 143, 45, 142, 179, 69, -141, -404, -309, 156, -454, -288, 36, -159, -44, -137, 205, 12, 224, 198, 189, 311, -175, 169, 174, 174, 167, 90, 158, 122, -325, 0, -221, -195, -144, -70, -202, -315, -137, -209, 262, -219, -72, 65, -199, 193, 99, 71, 7, 108, 90, 295, -2, 341, 50, -14, 181, -169, -109, -44, -239, -274, -119, -102, -213, -82, -112, 32, -98, 119, 181, 124, 5, 162, 151, -170, 85, -152, 250, 154, -29, -244, 77, -15, 65, -201, -34, -122, 74, -37, -26, -197, -200, -257, -56, -27, -298, 41, 55, -83, -339, 52, 142, 242, 146, 32]
4319C2J99o1j17j57N9n1L41r8k98J3L45m37oK21l4n9L5J79j81J69j2L9J66r8k55
4344f6K62o6p2j94K42j80J85Mj75P5n4q2R8L8j19j15K49J52m06Q5L35M4m04J95
4368C1j07K21k18P4J22j53J24j59j2J88l19J60l2j7L2M9Q1q2j17J83n2j89N25
4391C33j69L79o50N01j69l99K55R8j16K3k32j66Q01m82K1m0j01J4K10j43P6M6
4413I0J9j01M5R6j52J80Pl8J47j32j56L5J44l29K3J90K92l05k84J41lqk43L04
4437c8J91k36k97J40K13J6J63j2k39K38Nj76R8J29p3L98l24l23j4K00l8J36k61
4460a04J24k3q6JQ0J31m12o7O03k43r2K20K43p6l51J14J63m2K91l94j3J85l6m13
4484a97N5K65l29j53L85k13K3K78k99pK21n1K2j70L58o5K47k35M7K53k59m9r8
$$ y = [32, 231, 170, 53, -104, -45, -96, 245, 147, -151, -138, 207, -230, -236, -15, -49, -108, -73, 106, -75, 94, 82, 121, 287, 189, -66, 196, 130, 58, -136, 106, -74, 111, 115, -60, 15, -39, -121, -23, 15, -104, -219, 30, 182, -224, -139, 196, 240, -164, 31, -76, 145, -73, 1, 123, -30, 94, -65, -77, 111, -208, -48, -80, -97, -65, -16, 65, -17, -134, 49, -3, -192, 333, 164, 543, -107, 394, 225, -174, 81, 179, 63, 86, -146, -312, 489, 7, 28, -12, -113, -99, 111, -32, 44, 90, 109, 8, 53, 149, -3, 177, 184, 146, 293, 161, 5, 40, 184, -145, -122, 68, 360, 55, -229, -88, -91, -99, -342, -38, 153, -83, -380, -240, -27, -11, 152, 140, -99, 139, 144, -32, 66, 195, 122, 520, 196, -127, -141, 59, 21, 157, -104, 20, -3, -89, -88, -8, 123, -289, -356, 247, 4, -88, 132, 375, 299, -52, 62, 225, 183, 474, 80, 67, 252, 216, -197, -142, 123, -206, -359, 26, -187, -164, 114, -185, -192, 29, -22, 0, -170, 188, 123, 370, 135, 182, 435, 176, 127, 29]
4507B9n7P7j78Q6o5J6k72J78K64m77L46n4M27m13J62K3l66M17j97M02j92n6J1
4530A11J8Qj7L4l45K61k28M3j45j03J28K59k49j09J90K90k90Q0O0J24k5j72K27
4553A50K1k4K3l37O2K33p2L2J81m86N8m5l9J20K1J67j30j03N9J25O9l77M85J60
4577C53k73k2j29K06k4K9j39n9k5j00K01Nj8k5Lj67L55k17k19N54l90kO4K14l01
4602a26L55k30J07k16M8L02l23j23L13J52k61K58k57J72m7j02j46K26k01J83k10
4623a26K90l66K6KL87k70O6K5j37J7P3j76rK57j50L66l34J40J67n3j47P1n8l4
4647B7k31J61j39N29m16J32R3j03k2j65L09j87R1j51J42l0k51P4M38k02j06k27
4669b34P4J79mJ68o2k07P0kr4n0J80o8K0ql4J22j02k19M79L8o6l71J00r3k73M23
$$ y = [29, -28, 49, -129, -43, -108, -92, -364, -186, 78, -399, -53, -107, 320, -93, 69, 92, -274, 143, -54, 348, 156, 100, 111, 129, 137, 120, 154, -191, 70, -158, -115, -260, -363, -235, 24, -225, -334, -144, 146, -144, -64, -4, 120, 95, -77, 150, 171, 147, 170, -167, -105, 128, 56, 88, 269, -217, -159, -204, -243, -123, -102, 65, -65, -168, -109, 16, 85, -292, 193, 353, 80, 58, -71, 135, 111, 140, 1, -58, -83, -183, 18, 23, 5, -20, -17, -184, 171, -46, -265, 289, -101, -103, -39, 175, -126, 229, -1, 106, -110, -62, 240, -83, -206, 107, 259, -2, 256, -1, 171, 124, 22, -124, 102, -99, 84, -126, 164, -202, -176, -174, 213, -57, 9, 34, -103, -86, -13, -189, -198, 59, -91, 275, -59, 81, 248, 195, 48, 119, 61, 27, -204, -43, -182, 347, -69, 63, 156, 53, 31, -134, 175, -12, 79, -72, 70, 40, -211, -137, 301, 99, -7, -234, -160, 19, 15, 183, 121, -86, -16, -18, -112, -162, 18, -50, -30, -38, -72, 50, -52, -271, 208, 246, 180, -191, -91, -184, -457, -34]
4695c4j01K42J3j36J7k86K32K59m6mJ3k88K35j81N6J08k8nq8J85J80k81m0J38
4719A60j41k01nJ84K06n2m56R2K73p6j12K62j53j17K58j66P6o6OK38k84J82R6
4742B04mk49r7L63j80K1m17J65K99k5m25L59k39N4R7j34L83K1j08l88P7L25J06
4765B08j38m2Q8k13K46L7j95k61K71J9k07K28p5r6J43l95K63r8J66J02J65j30
4787H6o20N44l3J80l8r7J34p3j79L24k26j72L85m09l4K17L1r2k64K34j31Q2N5
4810i6r0K21j46k85L11j27L37l27j40N94l26Q8J47L6k95Q8j12K56l20J70J02j8
4832F8l73K85Pn9k24K27q8j00L19k17J74K61r9L6j01nk86K00K94k38j39N4j02
4855a06J88l76K03l5J84L3k74L90l09J82k09J83o8k06L9J46K14q6j96P6R0j43
$$ y = [-34, -135, 107, 120, -16, 1, -285, -53, 206, 160, 156, 169, -119, 116, -65, -9, 99, 71, 66, -22, 163, 343, 62, 22, 160, 19, -182, -187, -3, 203, 151, -305, -213, 60, -16, -128, 134, -19, -136, 122, -44, 32, -34, -28, 210, -74, 108, 204, 200, -49, -146, 217, 37, 58, -359, -194, 105, 80, -345, 14, -225, -171, -74, -208, 175, 196, 88, -300, -223, 102, 208, 70, 28, 116, -97, 149, 186, -9, -270, 1, 20, -187, 41, -34, -130, 13, -382, -119, -217, -51, 51, 216, 86, -534, 10, -23, 157, 119, 22, 156, 83, -96, 228, 2, -170, 215, -194, -228, -11, 20, -72, -336, -102, -233, -151, -96, -186, 35, -111, -396, -85, -212, 125, -202, -342, 252, -74, 14, 161, 197, -98, -10, -122, 134, -186, -16, 86, 68, -305, -20, -13, -72, -296, -69, -157, -257, 62, -155, 19, 280, 181, 217, 116, 111, -175, 25, 319, 81, -58, -4, -106, 82, -294, -91, -126, 58, 91, -183, 207, -102, 80, -129, 54, -14, -220, -181, -35, 179, 93, -103, -27, 63, -80]
4877h0J60l4j71K10q7K93m26J29J39J86n10J42K50rj1k56L0R9M0J04j82r4j4J38
4901D6P9l2m6J23K0P8l50M66k29j91j25L21l70%L44%q7o6j17J54k61K66J04p7
4925E0r5j51K24o8r0p7M25k85P6J28k12K33j66L5L3j23k1J37J19k34M1L26l74
4948f9J19p8J1L4j52K17j51P5o3M4j11p5P7K16Q6k4j76j07J21q6M7J52Q3l27J58
4973B1O5k24K92k51J11m0p3j98J13J76j79J67K52k90NJ19J84k10j46L63r4j71
4995hj36J18n4K83k49k2M0j57L96J57k03j61N2k5J74r7j91j53J91j99L54j12o3
5018f5J14j91J68j1j04J30Q6Q2j44k14J48j73J57q5K42q5o5K18k50J83n9j68N
5041h1J11j58K69o6j90L50k43j03j8J43k45J69J20J86l04J94k91N1K83k96J79
$$ y = [-80, 80, 46, -125, 85, -2, 291, -135, -6, 133, 319, -191, -49, 201, 192, 181, -75, -45, 54, 94, 198, 16, -78, -92, 46, 125, 93, 47, 170, 190, 268, -82, 384, 155, -36, -161, 160, -210, -210, 134, 134, 47, -19, -136, 18, -243, 23, 127, 50, -45, -196, 28, -40, -130, -207, 218, -67, 9, 137, -75, 158, -8, 27, 60, -63, -84, 53, 172, -62, -21, 305, -69, 50, -28, -17, 17, -135, 82, -69, 6, -57, -13, -124, -199, -122, 94, 180, 156, -20, -127, -6, -92, -45, 107, 190, -137, 21, 86, -138, 154, -97, 14, -26, -99, -297, -184, -8, -187, -20, 232, -58, -53, 66, 250, 40, -106, 257, 163, -8, -144, -26, -80, 203, -46, -68, -28, -185, 211, 368, 165, 4, 56, 31, 205, 108, -83, -236, -45, -244, 110, -2, -65, 49, -142, 26, 15, -89, 41, 127, 209, 65, -149, -1, -174, -17, -102, 140, 55, -10, 208, -42, 141, 82, -86, -81, 30, -128, 141, 75, -115, 235, -8, -111, -129, 14, -231, -62, 58, 244, -60, 134, -157, -106, 177, -119, 60]
5062F0J49k00j89JK57k25j78K23m8K96k6K16l08q9J70RM5j66J16p0K84j34j87
5085FK65Qo14L15M09l02m15K27K04o8J09k09J26j43J36j70L54m83L02J06k28K82
5107B17n09K86L0j04q7M52k62r6K76k7J54k32NP0j67l10M13j74J1j26o4M55m17
5130b06L07k61L66m2k61K42LJ3n2k99J51J06k34J51J29j62K60l13K84k56J91j
5152A16j81R0r3N63l38n30J92P9J88K63k88Lm73M12j5n9J87oj08k6j59K57j9J19
5176A74J7k31n0p1J90p9k4n5N9q6L69l35J65K11pl99K50k52RO5j68L36j20N7l2
5201gR9j96J04O1J42M8o07J55k43L31o3J82N0p9K15k03M50o04J17J52K44k87l31
5224b70L60j45J33l63J23N06m20J47n7j09j00J0K39o6k18r0L67r0K01j87K23j29
$$ y = [60, 209, 9, -180, -179, 78, -147, -325, -102, -150, 146, 120, 336, 28, -61, 109, 118, 163, -3, 113, 43, 327, 193, 6, 271, 279, -335, -20, 389, 87, -328, -101, 103, 35, 144, -65, 61, -82, 54, -116, 238, -245, 57, 163, -65, 217, -292, -6, 24, -80, -167, 285, 23, -73, 203, 176, 330, 98, 103, 173, 6, -304, 109, -65, -54, -180, -244, 211, -206, 101, -160, 206, 164, -97, 145, 148, 161, 109, -190, -39, 67, -167, -16, 113, -49, 211, -102, 182, -74, 117, 116, -65, 25, -68, 495, 157, -373, -181, -102, 86, 349, 61, 64, -409, 3, -12, -71, 116, 110, 2, -24, -183, 74, 55, 174, 191, -40, -90, -161, 29, -50, -74, -129, -70, -156, 213, -122, 43, 254, 247, -152, 98, -154, -145, -80, -248, 88, -32, 25, -7, 92, -104, 0, 61, 203, 251, -356, -201, -444, -113, -176, 6, 56, -23, 192, -11, 439, -165, -48, 104, 348, 61, -270, 90, -55, 78, -285, -162, 344, -76, 71, 14, -95, -195, -185, 54, -12, -230, -320, 47, -43, 158, -29, 194, 65]
5246F5q3J89P9j79k1p7q4J34RK5q2M7j94L45m08K79k10K46R5m8k60K05j84l2P7
5271f7J7R7j63L46k90j89L47J00k72J16l87O19k70k18J33J94o5Q9m8o4j03n9L15
5294A78k74R9j49J17L24o07L00j95K08L50m61M49j85l11L47q1r9l34N8J50k17
5315c33J15M28j48r2j49L51k08K58l55K89j34L3l7J18j77K5K54l02j46K89K3p1
5337C1j07L10p9j76k60L87J7k35J72p8k18J56R2qL5J21N4j31J05k63L1J70np5
5361D6J15m7j45k50m8M58K84o67K77rl2J94m82L24j03O0j9J25j71J65p9pK25j92
5385B2j56N23l92m9K3L39k31l38J84j09q9K15kK70k23m9O2j3J44k88J63K10j20
5408I6r8K36k19M7j00P6R3p8J6Q5j99L78m11J54K3m25M57j5q5k79J83J87l7J68
$$ y = [65, -18, 171, 250, 71, 50, -27, -111, 23, 32, 57, -25, 22, -172, 173, -235, 44, -166, 80, 175, 127, -133, 72, -112, -144, -67, -50, 47, -116, 230, -60, -249, 98, 198, -74, 42, -345, 274, 4, -214, -81, 113, 48, 137, 89, 25, -78, -137, 178, -96, 3, -146, -29, 295, -312, -12, -207, 1, 351, -110, 339, 154, -157, 190, 109, 10, -324, -266, -116, -333, -218, 210, 62, -30, -179, 172, -36, 222, -133, 156, 22, 55, 18, 136, -41, -16, 238, -64, -210, 79, 102, 31, -76, 234, 155, -21, -281, 106, 123, -112, 60, -18, -236, -80, 12, 4, 39, 160, 214, 83, 188, -75, -44, 126, 121, 46, 161, 114, -31, -281, -329, 129, 413, -254, 23, 14, -18, 176, -306, 18, -85, -25, -44, 81, -90, 75, -4, -11, 214, 22, -134, 389, -3, -52, -29, 310, 79, -259, -75, -184, -273, -58, -60, 210, -13, -62, 0, -13, 131, -157, 6, 216, 96, -2, 234, 15, 62, -38, 38, 131, 53, 69, 154, -45, 333, -78, 76, 99, -326, 131, 116, 31, -248, -65, 122, 85, 253]
5432B53l10Q8O4j39r1M22k57l56K25K2j37J29L51m28k31L97J11j53K30k24j8K41
5454A89k89L26j64p9J14Lk73K46q8q2L67j48o4J24j50j09l5J50N4O9j12k3L0L3
5478H9j03L4k64K00J1L81j05r1k91L06l10o8L36j67L4J03p9O8j15J52j04j05K36
5501A48j73O9nk62k9L1O9K02O4J34m42J54K00j05Opl01L46j74J12r8k47K66J25
5525H3j87L0Q3J50j73p1R1J7M9j11J0P6Pm57M88M5M1l36J37K97j51k02j7J22k11
5550a90J91J16l05M50o16K33P2N9q5P0mj18K28l04L13m32L63j22J03k79J09K52
5572A04m0j66J53O4j81R2k6J36m2j74P0j01r1M1J03J13l32J84K56k59K87k60M31
5595C62l89K6k24J75J14j74P4J28k70J08m6K57j3j03j10K34N4k06K4k72N78k80
$$ y = [253, -57, 31, 95, -44, -135, 287, 30, -326, -101, -79, -216, -87, 264, -164, -395, 2, 113, -40, 190, -34, -52, 189, -100, 226, 62, -17, 97, 100, -173, 73, -15, -97, 270, 122, 58, 182, 32, -77, -112, 38, 92, 161, 49, 26, 56, 89, -14, 20, -244, -44, -33, 348, 243, 152, -139, 167, -143, -211, 125, -42, -8, 95, 16, 84, -31, 121, 17, -88, 148, -25, 44, 39, -223, -252, -221, -152, 50, 114, 248, -194, -40, 160, 55, 61, 54, -247, 99, -75, 37, -61, -308, -42, 83, -104, -74, 9, 159, -14, -85, 6, 23, 72, -39, -29, 47, 54, -403, 85, 130, 171, -165, -28, 269, 118, -84, -101, 21, -190, 1, 117, -188, 262, -354, -121, -49, 10, -75, -5, -9, -127, 101, -203, 110, -322, 41, -81, 22, -257, -148, 104, 64, -102, 51, 115, -66, 26, 0, 136, 94, -80, -10, -111, -202, -161, -58, 55, -277, -93, 163, -96, 191, -69, 362, -27, -1, -225, -50, 64, -110, -36, 92, -178, -70, -116, 141, 128, 25, -85, 149, 203, -3, 21, -251, 327, 47]
5617D7j54L34j04L4j52Q8m5j47J05J10k54L6J0Nj83l1J35J86r4R4K00J9k90J11
5641F0J19k08N4K71k21k65K50K5k11K88M4j93J17k70L39R8k59N0o9j53J4K14j
5664I3o2J66m77l7K06j8j33J68p7oK4K58j93r3l2M61Q9m79oM06m1o55M22j46P0
5689i2j27M97R0m89K10O8M1k74p8K61J5j46j33J84p4m8k0J27J44k03K81J18k92
5712F0r0J26pk36K18%q5K15k92K58j79Q3K10o8k36L9M0j76K59j25l8l39L17k86
$$ y = [47, -107, 227, 123, 157, 5, 93, 48, -99, 6, 116, -138, -102, -92, -87, -270, -301, -166, 20, -74, 20, 220, 239, -51, 60, 179, -29, 25, 296, 75, -190, 60, 85, -126, 162, 206, 13, 130, -140, 199, 297, 38, 88, 19, -134, -120, 94, 93, 31, 197, -280, -317, -111, -129, -262, -94, -171, -177, -153, 105, -88, -181, -213, 248, 337, -142, -148, 258, 217, -438, -16, -162, -92, -219, 278, 368, -121, 89, 157, 198, -76, -154, 107, 122, -24, -157, 27, -47, -95, -115, 12, 156, -47, 234, 352, 60, -30, 96, 89, -147, 71, 71, -14, 201, -91, 167, -12, 71, 281, 213, -23, 16, 56, -120, 139, 14, -24, -363, -46, -332]
$$ [...]
8191A02
##END NTUPLES=NMR FID
##END=
