##TITLE=1H_BAU-0301-19
 CDCl3, 8 sc, 
 4.2.2019
##JCAMPDX= 6.0         $$ Bruker NMR JCAMP-DX V2.0
##DATA TYPE= NMR FID
##DATA CLASS= NTUPLES
##ORIGIN= UXNMR, Bruker Analytische Messtechnik GmbH
##OWNER= root
$$ XWIN-NMR		Version 3.5
$$ Mon Feb  4 14:18:24 2019 Russian Standard Time (UT+4h)  she@DPX200
##.OBSERVE FREQUENCY= 200.1313
##.OBSERVE NUCLEUS= ^1H
##.DELAY= (6, 6)
##.ACQUISITION MODE= SIMULTANEOUS
##.ACQUISITION SCHEME= undefined
##.AVERAGES= 8
##.DIGITISER RES= 18
##SPECTROMETER/DATA SYSTEM= spect
##.PULSE SEQUENCE= zg30
##.SOLVENT NAME= CDCl3
##.SHIFT REFERENCE= (INTERNAL, CDCl3, 0, 15.7039)
##AUDIT TRAIL= $$ (NUMBER, WHEN, WHO, WHERE, WHAT)
$$ ##TITLE= Audit trail, XWIN-NMR		Version 3.5
$$ ##JCAMPDX= 5.01
$$ ##ORIGIN= Bruker BioSpin GmbH
$$ ##OWNER= she
$$ F:/spectra/data/she/nmr/H-F/1/audita.txt
$$ ##AUDIT TRAIL=  $$ (NUMBER, WHEN, WHO, WHERE, WHAT)
(   1,<2019-02-04 14:14:15.90 +0400>,<she>,<DPX200>,
      <created by zg, POWCHK disabled, PULCHK disabled
       configuration hash MD5:
       00 E9 B6 7A A2 85 ED C7 34 08 36 98 17 FE 4E 26
       data hash MD5: 16K
       48 1B BC B3 F1 8D 32 02 64 6F 83 D6 8E 00 BC 91>)
$$ ##END=
$$ 
$$ hash MD5
$$ 75 2A C8 55 4C D2 73 2A 76 31 A0 53 F5 C1 DD 43
##$RELAX= 
##$RELAX= 
##$RELAX= 
##$RELAX= 
##$RELAX= 
##$RELAX= 
$$ Bruker specific parameters
$$ --------------------------
##$DU= <F:/spectra>
##$EXPNO= 1
##$NAME= <H-F>
##$PROCNO= 1
##$TYPE= <nmr>
##$USER= <she>
##$AMP= (0..31)
100 100 100 100 100 100 100 100 100 100 100 100 100 100 100 100 100 100 
100 100 100 100 100 100 100 100 100 100 100 100 100 100 
##$AQSEQ= 0
##$AQ_mod= 1
##$AUNM= <au_zg>
##$AUTOPOS= <>
##$BF1= 200.13
##$BF2= 200.13
##$BF3= 200.13
##$BF4= 200.13
##$BF5= 200.13
##$BF6= 200.13
##$BF7= 200.13
##$BF8= 200.13
##$BYTORDA= 1
##$CFDGTYP= 0
##$CFRGTYP= 5
##$CHEMSTR= <none>
##$CNST= (0..31)
1 1 145 1 1 1 1 1 1 1 1 1 1 1 1 1 1 1 1 1 1 1 1 1 1 1 1 1 1 1 1 1 
##$CPDPRG= <>
##$CPDPRG1= <>
##$CPDPRG2= <>
##$CPDPRG3= <>
##$CPDPRG4= <mlev>
##$CPDPRG5= <mlev>
##$CPDPRG6= <mlev>
##$CPDPRG7= <mlev>
##$CPDPRG8= <mlev>
##$CPDPRGB= <>
##$CPDPRGT= <>
##$D= (0..31)
0 1.2 0 0 0 0 0 0 0 0 0 0.03 0 0 0 0 0 0 0 0 0 0 0 0 0 0 0 0 0 0 0 0 
##$DATE= 1549275255
##$DBL= (0..7)
120 120 120 120 120 120 120 120 
##$DBP= (0..7)
150 150 150 150 150 150 150 150 
##$DBP07= 0
##$DBPNAM0= <>
##$DBPNAM1= <>
##$DBPNAM2= <>
##$DBPNAM3= <>
##$DBPNAM4= <>
##$DBPNAM5= <>
##$DBPNAM6= <>
##$DBPNAM7= <>
##$DBPOAL= (0..7)
0.5 0.5 0.5 0.5 0.5 0.5 0.5 0.5 
##$DBPOFFS= (0..7)
0 0 0 0 0 0 0 0 
##$DE= 6
##$DECBNUC= <off>
##$DECIM= 32
##$DECNUC= <off>
##$DECSTAT= 4
##$DIGMOD= 1
##$DIGTYP= 9
##$DL= (0..7)
0 120 120 120 120 120 120 120 
##$DP= (0..7)
150 150 150 150 150 150 150 150 
##$DP07= 0
##$DPNAME0= <>
##$DPNAME1= <>
##$DPNAME2= <>
##$DPNAME3= <>
##$DPNAME4= <>
##$DPNAME5= <>
##$DPNAME6= <>
##$DPNAME7= <>
##$DPOAL= (0..7)
0.5 0.5 0.5 0.5 0.5 0.5 0.5 0.5 
##$DPOFFS= (0..7)
0 0 0 0 0 0 0 0 
##$DQDMODE= 0
##$DR= 18
##$DS= 0
##$DSLIST= <SSSSSSSSSSSSSSS>
##$DSPFIRM= 0
$$ [...]
##$SUBNAM2= <"">
##$SUBNAM3= <"">
##$SUBNAM4= <"">
##$SUBNAM5= <"">
##$SUBNAM6= <"">
##$SUBNAM7= <"">
##$SUBNAM8= <"">
##$SUBNAM9= <"">
##$SW= 20.0189088683792
##$SWIBOX= (0..15)
0 0 2 0 0 0 0 0 0 0 0 0 0 0 0 0 
##$SW_h= 4006.41025641026
##$TD= 16384
##$TD0= 1
##$TE= 0
##$TE2= 300
##$TE3= 300
##$TEG= 300
##$TL= (0..7)
0 120 120 120 120 120 120 120 
##$TP= (0..7)
150 150 150 150 150 150 150 150 
##$TP07= 0
##$TPNAME0= <>
##$TPNAME1= <>
##$TPNAME2= <>
##$TPNAME3= <>
##$TPNAME4= <>
##$TPNAME5= <>
##$TPNAME6= <>
##$TPNAME7= <>
##$TPOAL= (0..7)
0.5 0.5 0.5 0.5 0.5 0.5 0.5 0.5 
##$TPOFFS= (0..7)
0 0 0 0 0 0 0 0 
##$TUNHIN= 0
##$TUNHOUT= 0
##$TUNXOUT= 0
##$USERA1= <user>
##$USERA2= <user>
##$USERA3= <user>
##$USERA4= <user>
##$USERA5= <user>
##$V9= 5
##$VALIST= <valist>
##$VCLIST= <CCCCCCCCCCCCCCC>
##$VD= 0
##$VDLIST= <DDDDDDDDDDDDDDD>
##$VPLIST= <PPPPPPPPPPPPPPP>
##$VTLIST= <TTTTTTTTTTTTTTT>
##$WBST= 1024
##$WBSW= 4
##$XGAIN= (0..3)
0 0 0 0 
##$XL= 0
##$YL= 0
##$YMAX_a= 240386
##$YMIN_a= -198613
##$ZGOPTNS= <>
##$ZL1= 120
##$ZL2= 120
##$ZL3= 120
##$ZL4= 120
##$ABSF1= 10
##$ABSF2= 0
##$ABSG= 5
##$ABSL= 3
##$ALPHA= 0
##$AQORDER= 0
##$ASSFAC= 0
##$ASSFACI= 0
##$ASSFACX= 0
##$ASSWID= 0
##$AUNMP= <proc_1d>
##$AZFE= 0.1
##$AZFW= 0.1
##$BCFW= 1
##$BC_mod= 2
##$BYTORDP= 1
##$COROFFS= 0
##$CY= 11.3945322036743
##$DATMOD= 1
##$DC= 2
##$DFILT= <>
##$DTYPP= 0
##$F1P= 18.9103706918063
##$F2P= -1.10871071338519
##$FCOR= 0.5
##$FTSIZE= 0
##$FT_mod= 4
##$GAMMA= 1
##$GB= 0.15
##$INTBC= 1
##$INTSCL= 1
##$ISEN= 128
##$LB= 0.24
##$LEV0= 0
##$LPBIN= 0
##$MAXI= 10000
##$MC2= 0
##$MEAN= 0
##$ME_mod= 0
##$MI= 1.114404
##$NCOEF= 0
##$NC_proc= 0
##$NLEV= 6
##$NOISF1= 3.799351
##$NOISF2= 2.8
##$NSP= 1
##$NTH_PI= 0
##$NZP= 0
##$OFFSET= 15.70392
##$PC= 1
##$PHC0= -9185.61
##$PHC1= 13.20004
##$PH_mod= 1
##$PKNL= yes
##$PPARMOD= 0
##$PSCAL= 0
##$PSIGN= 0
##$REVERSE= no
##$SF= 200.130013532006
##$SI= 16384
##$SIGF1= 3
##$SIGF2= 2
##$SINO= 400
##$SIOLD= 16384
##$SREGLST= <1H.CDCl3>
##$SSB= 0
##$STSI= 0
##$STSR= 0
##$SW_p= 3612.71676300578
##$SYMM= 0
##$S_DEV= 0
##$TDeff= 0
##$TDoff= 0
##$TI= <>
##$TILT= no
##$TM1= 0
##$TM2= 0
##$TOPLEV= 0
##$USERP1= <user>
##$USERP2= <user>
##$USERP3= <user>
##$USERP4= <user>
##$USERP5= <user>
##$WDW= 1
##$XDIM= 8192
##$YMAX_p= 0
##$YMIN_p= 0
$$ End of Bruker specific parameters
$$ ---------------------------------
##NTUPLES= NMR FID
##VAR_NAME=  TIME,          FID/REAL,        FID/IMAG
##SYMBOL=    X,             R,               I
##VAR_TYPE=  INDEPENDENT,   DEPENDENT,       DEPENDENT
##VAR_FORM=  AFFN,          ASDF,            ASDF
##VAR_DIM=   8192,          8192,            8192
##UNITS=     SECONDS,       ARBITRARY UNITS, ARBITRARY UNITS
##FACTOR=    0.0002496,     1,               1
##FIRST=     0,             0,               0
##LAST=      2.0444736,     0,               0
##MIN=       0,             -198613,         0
##MAX=       2.0444736,     240386,          0
$$ Real data points
##PAGE= N=1
##DATA TABLE= (X++(R..R)), XYDATA
$$ plain form
0 0 0 0 0 0 0 0 0 0 0 0 0 -8 8 -8 8 -8 16 -16 24 -24 32 -32 40 -48 56 -72 80 -96 104 -120 140 -160 184 -207
34 -207 232 -262 294 -328 368 -408 456 -505 560 -620 686 -757 836 -923 1017 -1119 1234 -1358
52 -1358 1498 -1653 1827 -2021 2244 -2503 2800 -3151 3574 -4094 4748 -5606 6775 -8484 11203
67 11203 -16234 28586 -121754 -72095 239355 6445 -165960 45380 174798 -100199 -177158
78 -177158 91005 169900 -88177 -129799 85649 103552 -88252 -63544 93599 41500 -114217
89 -114217 -50789 102172 74586 -59056 -56007 31676 12359 -68427 -6991 108262 41512 -103552
101 -103552 -50146 78643 18552 -81487 16624 102339 -32362 -111983 52804 119027 -69792
112 -69792 -118472 76849 87353 -99374 -42986 148276 28869 -179142 -40517 153119 16164
$$ packed form
0@%%%%%%%%%%%qJ6j6J6j6K4l2M0m8N6o4P2q8J04j28J52j76K00k24K60l00L44l91
34b07M39m94N56o22O96p76Q64r61J065j180J306j443J593j759J940k136K353k592
52a358K856l151L480l848M265m747N303n951O725p668Q842j0354J2381j5259J9687
67A1203k7437M4820j50340M9659L11450k32910j72405K11340J29418k74997p6959
78a77158K68163P8895k58077m1622K15448J7903j91804K4708J57143n2099j55717
89a14217O3428J52961k7586j33642L049Q7683j9317q0786O1436J15253o6750j45064
101a03552N3406J28789o0091j00039R8111Q5715j34701p9621J64787O6223j88819
112f9792m8680J95321J0504j86727N6388J91262j19407k08011J38625J93636j36955
$$ plain form
123 16164 -119244 43090 125801 -79076 -144168 76469 131921 -71750 -97095 85904 74552
134 74552 -92500 -56047 91811 38557 -97318 -41075 93076 55963 -66734 -48482 47885
145 47885 16606 -72073 -12363 101178 39706 -92244 -48198 70403 22290 -77528 953
156 953 102206 -2836 -107414 13817 104177 -35752 -104227 48229 90554 -59181 -61430
167 -61430 85634 45829 -109515 -52737 97073 38397 -76392 4435 84650 -32404 -101096
178 -101096 29359 87878 -28690 -56601 48382 45232 -56449 -42632 47495 29311 -47149
189 -47149 -21513 53847 30076 -45421 -30929 30392 10053 -40758 -2986 59689 21518 -54224
201 -54224 -29891 39537 11559 -49366 3336 72035 1395 -72173 4607 62118 -26877 -64246
$$ packed form
123A6164j35408J62334Q2711k04877o5092K20637N5452k03671k5345J82999j1352
134G4552j67052L6453J47858n3254j35875N6243J34151l7113j22697J8252R6367
145D7885l1279q8679N9710J13541o1472j31950M4046J18601m8113r9818P8481
156I53J01253j05042j04578J21231R0360j39929o8475J52456M2325j49735k249
167f1430J47064l9805j55344N6778J49810n8676j14789Q0827Q0215j17054o8692
178a01096J30455N8519j16568k7911J04983l150j01681J3817R0127j8184p6460
189d7149K5636P5360k3771p5497J4492O1321k0339n0811L7772O2675l8171p5742
201e4224K4333O9428k7978o0925N2702O8699p0640p3568P6780N7511q8995l7369
$$ plain form
213 -64246 39191 65453 -38017 -49062 47528 32954 -68410 -37041 68512 32936 -55567
224 -55567 -5756 59229 -15610 -70983 12625 60800 -10647 -36491 28220 33676 -35786 -40256
236 -40256 24574 30122 -21896 -15614 34373 18600 -35654 -24893 20826 12294 -20508 -3287 33491
249 33491 14063 -33736 -22798 23487 10087 -29357 2952 46950 3327 -44377 -2958 31481
261 31481 -14061 -33869 24888 43737 -18574 -36596 19448 20599 -38549 -22269 45064 24472
273 24472 -34750 -8167 32830 -8971 -42606 5832 39490 345 -22008 13434 21585 -23559
285 -23559 -31540 15612 25360 -10828 -8809 22185 7760 -27582 -17563 13576 10895 -8800 -533
298 -533 20589 6496 -25272 -15588 15401 6411 -14034 7409 27651 -773 -26749 -5646 14339
$$ packed form
213f4246J03437K6262j03470j1045R6590j4574j01364L1369J05553l5576q8503
224e5567M9811O4985p4839n5373Q3608M8175p1447k5844O4711N456o9462m470
236d0256O4830N548n2018O282M9987j5773n4254J0761M5719q532l2802J7221L6778
249C3491j9428m7799J0938M6285j3400l9444L2309M3998m3623m7704M1419L4439
261C1481m5542j9808N8757J8849o2311j8022N6044J151n9148J6280O7333k0592
273B4472n9222K6583M0997m1801l3635M8438L3658l9145k2353L5442Q151m5144
285b3559p981M7152R748l6188K019L0994j4425l5342J0019L1139k681j9695Q267
298e33K1122j4093l1768R684L0989q990k0445K1443K0242k8424k5976K1103J9985
$$ plain form
311 14339 -4770 -15285 15173 27522 -9867 -25972 6412 10723 -21677 -10813 28831 16940
323 16940 -18499 -8097 13601 -5620 -23930 2786 27817 6618 -14332 4123 11653 -17283
335 -17283 -21162 12675 18771 -5182 -4050 11995 937 -19255 -12114 8621 9380 -3258 1574
348 1574 13771 203 -19818 -8910 9488 3706 -2717 9301 13574 -3598 -16868 -6691 7039
361 7039 772 -5450 10479 16105 -7964 -17602 1173 3848 -10729 -2172 17994 10956 -9416 -8421
375 -8421 3388 -2992 -12977 3306 21129 6004 -10591 615 3951 -13620 -11245 10741 12693
388 12693 -843 -1403 4320 -3048 -14009 -8056 7776 8810 31 3368 7071 -6076 -14313 -3303
402 -3303 5926 4276 3723 6140 4654 -3824 -11622 -5870 4614 1974 -784 9177 9130 -7207 -12255
$$ packed form
311A4339j9109j0515L0458J2349l7389j6105L2384M311l2400J0864L9644j1891
323A6940l5439J0402K1698j9221j8310K6716K5031k1199k0950J8455P530k8936
335a7283l879L3837O096k3953J132J6045j1058k0192P141K0735P59j2638M832
348A574J2197j3568k0021J0908J8398n782o423J2018M273j7172j3270J0177J3730
361G039o267o222J5929N626k4069r638J8775K675j4577Q557K0166p038k0372R95
375h421J1809o380r985J6283J7823j5125j6595J1206L336j7571K375K1986J952
388A2693j3536n60N723p368j0961N953J5832J034q779L337L703j3147q237J1010
402c303R229j650n53K417j486q478p798N752J0484k640k758R961m7j6337n048
$$ plain form
417 -12255 -2808 -289 -3119 3498 12947 7613 -8017 -10309 -28 -1029 -5805 6859 15314 558
431 558 -8263 457 -305 -9574 -4160 7794 7592 1463 993 1611 -5757 -12959 -5053 7846 7732 3857
447 3857 5333 -692 -11235 -9145 233 5275 7096 5031 768 -556 -3420 -7251 -2257 3800 601
462 601 327 7236 5965 -4350 -9527 -6049 -1612 402 5651 12934 6003 -10992 -11865 -564 -269
477 -269 -97 11309 10371 -5214 -8062 106 -627 -4514 -144 5214 3465 291 2713 2761 -7486 -12436
493 -12436 -1898 6315 5820 8115 6247 -7142 -13760 -5934 2026 6962 9807 4518 -3257 -4947 -4514
508 -4514 -2792 2142 3515 333 -11 3329 3946 -1829 -8141 -6003 -757 -76 5886 14358 4170 -13771
524 -13771 -11281 -622 -484 3987 14079 7748 -8287 -9888 -927 1377 -1295 1906 6027 791
$$ packed form
417a2255R447K519k830O617R449n334j5630k292J0281j001m776J2664Q455j4756
431E58q821Q720p62r269N414J1954k02o129m70O18p368p202P906J2899j14l875
447C857J476o025j0543K090R378N042J821k065m263j324k864l831M994O057l199
462F01k74O909j271j0315n177L478M437K014N249P283o931j6995q73J1301K95
477b69J72J1406r38j5585k848Q168p33l887M370N358j749l174K422M8j0247m950
493a2436J0538Q213m95K295j868j3389o618P826P960M936K845n289p775j690M33
508d514J722M934J373l182l44L340O17n775o312K138N246O81N962Q472j0188j7941
524a3771K490J0659J38M471J0092o331j6035j601Q961K304k672L201M121n236
$$ plain form
538 791 -3821 2812 3783 -8059 -9818 976 3974 4162 9645 4795 -9872 -12775 -4562 2612 8461
553 8461 10699 4408 -4706 -8565 -5493 406 3479 3901 3132 -563 -1517 1983 -1040 -7195 -3466 1022
569 1022 -743 5399 12435 1070 -12550 -8255 -1106 -605 5678 13535 6513 -8463 -10779 -1186 1689
584 1689 -1536 4306 9017 -1567 -7483 2118 2544 -8260 -5394 4275 3127 2176 6517 2515 -7951
599 -7951 -10175 -3297 4094 7708 7973 4547 -3716 -9580 -5276 882 2498 5428 5535 -1739 -3688 166
615 166 -3373 -6142 1064 3500 -443 3548 7347 -1451 -9404 -5412 579 1509 4105 9565 6057 -7295
631 -7295 -10412 -623 1061 -2257 6042 10227 -2244 -7748 -194 -1024 -6586 -804 6467 3950 393
646 393 1466 263 -5711 -7548 -249 5892 4688 4414 4380 -3341 -8799 -3913 131 1598 6323 5911
$$ packed form
538G91m612O633R71j1842j759J0794K998J88N483m850j4667k903Q213P174N849
553H461K238o291r114l859L072N899L073M22p69l695r54L500l023o155L729M488
569A022j765O142P036j1365j3620M295P149N01O283P857p022j4976k316R593K875
584A689l225N842M711j0584n916R601M26j0804K866R669j148r51M341m002j0466
599g951k224O878P391L614K65l426q263n864M304O158J616K930J07p274j949L854
615A66l539k769P206K436l943L991L799q798p953L992N991R30K596N460l508j3352
631g295l117R789J684l318Q299M185j2471n504P554q30n562N782P271k517l557
646C93J073j203n974j837P299O141j204k74l4p721n458M886M044J467M725m12
$$ plain form
662 5911 -1437 -3352 -2818 -6094 -3773 3990 4872 1650 2348 2081 -3390 -7426 -3156 3670 3076 1596
678 1596 6722 4952 -7359 -8581 915 106 -2468 6479 9085 -1524 -6673 -2998 -2675 -4043 591
693 591 7084 5984 -972 -2908 -1067 -4211 -5305 2627 6695 2911 2367 2112 -4038 -6115 -2380 -561
709 -561 2469 6451 3902 -1287 -2711 -4605 -5934 -1610 4295 5646 2989 258 -821 -3562 -6888
724 -6888 -1870 5937 3676 439 4922 2331 -7607 -6420 1191 748 181 5316 5883 -1073 -6167 -4763
740 -4763 -1357 -1051 672 6396 5776 -2196 -4207 -1667 -3729 -2997 3740 5671 3222 2103 -1193 -4947
756 -4947 -4072 -1916 473 4861 5679 1442 -1914 -3793 -4900 -3270 231 3931 5550 1869 -1869 -1034
772 -1034 -2806 -6132 -558 5966 3204 1368 3921 -185 -6942 -5542 271 3071 3410 3814 3393 -1510
$$ packed form
662E911p348j915N34l276K321P763Q82l222O98k67n471m036M270O826n94j480
678A596N126j770j2311j222R496q09k574Q947K606j0609n149L675L23j368M634
693E91O493j100o956j936J841l144j094P932M068l784n44k55o150k077L735J819
709e61L030L982k549n189j424j894j329M324N905J351k657k731j079k741l326
724f888N018P807k261l237M483k591r938J187P611m43n67N135N67o956n094J404
740d763L406L06J723N724o20p972k011K540k062P32O737J931k449j119l296l754
756d947Q75K156K389M388Q18m237l356j879j107J630L501L700J619l681l738Q35
772a034j772l326N574O524k762j836K553m106o757J400N813K800L39M04m21m903
$$ plain form
788 -1510 -7555 -5294 1321 1480 1089 4951 3463 -2860 -3813 -2184 -2402 -535 2420 4018 4914 1890
804 1890 -3626 -4561 -3120 -2259 1892 6638 5159 245 -4060 -5844 -3370 -416 1102 4546 5147 -1017
820 -1017 -3658 -502 -1837 -4124 472 4373 3128 2370 1772 -1259 -4876 -5796 -1114 5247 5364 2486
836 2486 1544 -2761 -8200 -4552 2358 3407 2965 2868 19 -2549 -3074 -2640 -19 1725 832 2690 5005
853 5005 1006 -3849 -3728 -3015 -1517 3124 5879 4526 -53 -6127 -6754 -1638 784 2070 5678 3735
869 3735 -3264 -4121 -1075 -1292 -1105 1419 3148 3460 1581 -745 -1024 -3014 -5566 -509 6092 4838
885 4838 1595 230 -3968 -7114 -3605 1974 5071 4485 557 -1755 -1827 -3740 -2996 2275 3357 809
901 809 2243 3196 -595 -3508 -3562 -2095 971 2967 3739 4046 -694 -7115 -5579 -377 941 2965 5628
$$ packed form
788a510o045K261O615J59l91L862j488o323r53J629k18J867K955J598Q96l024
804A890n516r35J441Q61M151M746j479m914m305j784K474K954J518L444O01o164
820a017k641L156j335k287M596L901j245p58n98l031l617r20M682O361J17k878
836B486r42m305n439L648O910J049m42r7k849k568n25M34K621J744q93J858K315
853E005l999m855J21P13J498M641K755j353m579o074o27N116K422J286L608j943
869C735o999q57L046k17J87K524J729L12j879k326k79j990k552N057O601j254
885D838l243j365m198l146L509N579L097n86l928k312p2j913P44N271J082k548
901H09J434R53l791k913n4J467L066J996P72L07m740o421J536N202J318K024K663
$$ plain form
918 5628 2300 -2985 -4126 -2765 -680 1124 1611 3455 3969 -433 -2865 -1092 -2395 -3579 1385 5174
934 5174 3544 918 -1767 -4208 -4237 -2741 1086 5826 4320 -882 -1400 -1528 -4530 -2606 3013 3807
950 3807 2251 1947 636 -1584 -3545 -3794 240 3395 2021 2046 2817 -2355 -6434 -3049 382 1142 3220
967 3220 3949 1364 -1770 -4229 -3583 352 1563 1713 4385 3555 -2082 -3707 -2097 -2141 -502 2800 3929
984 3929 2894 -538 -4169 -3162 -1457 -1870 1310 5506 2761 -1464 -1139 -1932 -3832 -1661 2211 4161
1000 4161 3600 717 -1032 -1672 -4350 -3473 2768 4499 1402 1462 638 -3984 -4771 -1304 953 2273 2821
1017 2821 1774 725 -1593 -4437 -2505 964 1208 2464 4604 1758 -2464 -3520 -3363 -1175 2163
1032 2163 3025 3177 2570 -2284 -5297 -2086 -252 -705 2407 4483 1334 -1680 -2087 -2199 -1901 -984 1686
$$ packed form
918E628l328n285j141J361K085J804M87J844N14m402k432J773j303j184M964L789
934E174j630k626k685k441k9J496L827M740j506n202n18j28l002J924N619P94
950C807j556l04j311k220j961k49M034L155j374K5P71n172m079L385L431P60K078
967C220P29k585l134k459O46L935J211J50K672q30n637j625J610m4J639L302J129
984C929j035l432l631J007J705m13L180M196k745m225L25p93j900K171L872J950
1000D161n61k883j749o40k678Q77O241J731l097O0q24m622p87L467K257J320N48
1017B821j047j049k318k844J932L469K44J256K140k846m222j056J57K188L338
1032B163Q62J52o07m854l013L211J834m53L112K076l149l014m07j12K98R17K670
$$ plain form
1049 1686 5033 3280 -1070 -1239 -1626 -4695 -2081 4012 4007 1513 1105 -1299 -4192 -3595 -1115 1765 3388
1066 3388 1981 834 311 -2760 -3978 -864 1060 1563 3623 3040 -206 -1776 -3303 -3469 482 3095
1082 3095 2196 2689 1849 -3189 -4815 -1883 -243 827 2779 3154 1291 -1913 -3883 -1868 -131 -625
1098 -625 2427 5547 1485 -2402 -1055 -1803 -3769 -99 3827 2955 1337 -54 -1987 -3144 -3226 -923
1114 -923 2737 2994 1251 1203 -870 -4245 -2720 395 997 3013 4113 760 -1744 -1704 -3145 -2209 2023
1131 2023 3051 1785 1572 69 -2923 -3601 -2255 361 2178 1881 2316 1966 -2740 -4933 -848 599
1147 599 -164 3725 5203 -203 -3059 -1672 -1950 -1828 1257 3402 2737 229 -1694 -1658 -2423 -3199 413
1164 413 3331 1628 1250 1584 -2444 -4472 -1112 437 1139 4223 3698 -727 -2367 -2262 -2627 -620 2242
$$ packed form
1049A686L347j753m350j69l87l069K614O093nk494m08k404k893N97K480K880J623
1066C388j407j147n23l071j218L114J924N03K060n83l246j570j527j66L951K613
1082C095q99M93q40n038j626K932J640J070J952L75j863l204j970K015J737m94
1098f25L052L120m062l887J347p48j966L670L926q72j618j391j933j157q2K303
1114i23L660K57j743m8k073l375J525L115O02K016J100l353k504M0j441R36M232
1131B023J028j266k13j503k992o78J346K616J817k97M35l50m706k193M085J447
1147E99p63L889J478n406k856J387k78J22L085K145o65k508j923L6p65p76L612
1164D13K918j703l78L34m028k028L360J549P02L084n25m425j640J05l65K007K862
$$ plain form
1181 2242 3213 2100 -158 -1507 -1789 -3170 -2552 1844 2882 523 1907 1711 -3630 -4300 71 794
1197 794 871 3975 3662 -853 -3157 -2493 -1315 -332 1220 3519 2807 -1510 -2525 -946 -2778 -2641 2432
1214 2432 3357 514 1312 881 -3426 -3409 -85 878 1772 3638 2396 -794 -2788 -2657 -1114 1 1389
1231 1389 3727 2331 -2029 -2055 -1105 -3498 -1795 3526 2839 49 1371 148 -3961 -3053 656 1686
1247 1686 1807 2695 2131 -709 -3430 -2514 170 -6 717 4082 2502 -2657 -2158 -977 -3386 -1421 3737
1264 3737 3111 492 730 -835 -3514 -2503 582 2255 2229 1700 1414 -639 -3478 -2029 695 -163 675
1281 675 4162 1754 -2670 -1559 -1265 -3613 -627 4061 2900 534 169 -1576 -3614 -2422 1068 3297
1297 3297 2070 819 1278 -985 -3979 -1344 1594 -462 540 4089 1331 -2627 -1439 -1455 -3242 -336
$$ packed form
1181B242R71j113k258j349k82j381O18M396J038k359J384j96n341o70M371P23
1197G94P7L104l13m515k304O64J178R83J552K299p12m317j015J579j832J37N073
1214B432R25k843P98m31m307J7L324R63Q94J866j242l190j994J31J543J115J388
1231A389K338j396m360k6R50k393J703N321o87k790J322j223m109R08L709J030
1247A686J21Q88n64k840k721R16K684j76P23L365j580n159M99J181k409J965N158
1264C737o26k619K38j565k679J011L085J673k6n29k86k053k839J449K724q58Q38
1281F75L487k408m424J111K94k348K986M688j161k366l65j745k038J192L490K229
1297C297j227j251M59k263k994K635K938k056J002L549k758l958J188j6j787K906
$$ plain form
1313 -336 3639 3191 920 -599 -1973 -2995 -2409 1086 3958 2009 158 958 -1246 -3888 -526 1891
1329 1891 -451 774 3544 516 -2409 -1231 -1603 -2733 30 3396 3207 768 -1357 -1998 -2824 -2551
1345 -2551 1658 4722 1586 -198 938 -1908 -4020 178 2226 -272 926 2941 106 -2324 -1459
1360 -1459 -1470 -1801 78 2847 3421 512 -1998 -1769 -2411 -2502 2082 4779 1300 -304 594 -2334 -3615
1377 -3615 553 2144 368 1188 2136 -344 -2217 -1822 -1201 -904 58 2563 3323 -85 -2342 -1364 -2219
1394 -2219 -2416 2614 4687 1038 -194 303 -2747 -3316 751 2132 971 1291 1329 -538 -2322 -2311 -583
1411 -583 -79 28 2424 3219 -812 -2505 -781 -2027 -1981 2909 4224 777 -13 -94 -2748 -2808 494 2120
1429 2120 1581 1170 752 -512 -2588 -2628 -61 517 -60 2435 2723 -1467 -2456 -599 -1796 -1344 2989
$$ packed form
1313c36L975m48k271j519j374j022N86L495K872j949j851Q00k204k642L362K417
1329A891k342J225K770l028k925J178l72j130K763L366j89k439k125o41q26K73
1345b551M209L064l136j784J136k846k112M198K048k498J198K015k835k430Q65
1360a459j1l31J879K769N74k909k510K29o42r1M584K697l479j604Q98k928j281
1377c615M168J591j776Q20R48k480j873L95O21K97R62K505P60l408k257R78q55
1394b219j97N030K073l649j232M97l050n69M067J381j161L20L8j867j784J1J728
1411e83N04J07K396P95m031j693J724j246M6M890J315l447p90q1k654o0L302J626
1429B120n39m11m18j264k076m0K567N78n77K495K88m190r89J857j197M52M333
$$ plain form
1446 2989 3616 732 -10 -581 -2581 -2323 206 2137 2109 780 324 -566 -3029 -2699 671 951 94 2545
1464 2545 2186 -2060 -2305 -395 -1402 -652 2864 3084 721 -271 -1040 -2098 -2011 -192 2371 2347 298
1481 298 156 -380 -3327 -2660 1149 1020 353 2521 1450 -2297 -2031 -476 -1009 183 2639 2577 795
1498 795 -678 -1438 -1544 -1689 -107 2759 2281 -147 90 -679 -3563 -2150 1574 1116 710 2406 835
1515 835 -2436 -2008 -628 -460 632 2251 2498 810 -1456 -1628 -999 -1607 -138 3112 2129 -492 -14
1532 -14 -865 -3501 -1690 1577 1115 989 1952 207 -2120 -1882 -820 69 960 1838 2376 688 -1954 -1573
1550 -1573 -786 -1648 373 3466 1585 -854 -89 -1220 -3397 -1013 1756 1194 1010 1489 -12 -1817
1566 -1817 -2136 -817 728 887 1569 2596 512 -2436 -1488 -501 -1519 784 3489 1331 -989 -410
$$ packed form
1446B989O27k884p42n71k000K58K529J931k8j329m56q90k463L30L370K80q57K451
1464B545l59m246k45J910j007P50L516K20k363r92p69j058Q7J819K563k4k049
1481B98j42n36k947O67L809j29o67K168j071l747K66J555n33J192K456o2j782
1498G95j473p60j06j45J582K866m78k428K37p69k884J413L724m58m06J696j571
1515H35l271M28J380J68J092J619K47j688k266j72O29o08J469L250r83k621M78
1532a4q51k636J811L267m62j26R63j745k327K38J062Q89Q91Q78N38j688k642L81
1550a573P87q62K021L093j881k439P65j131k177K384K769n62j84M79j501j805
1566a817l19J319J545J59O82J027k084k948R48R87j018K303K705k158k320N79
$$ plain form
1582 -410 -1600 -2732 -520 1572 1400 1049 676 -243 -1553 -2178 -638 1104 776 1441 2718 103 -2633
1599 -2633 -1177 -616 -1333 1422 3554 825 -1114 -746 -1772 -2246 -132 1866 1684 656 -66 -101 -1427
1616 -1427 -2369 -148 1529 380 1285 2760 -316 -2780 -979 -514 -960 1763 3297 844 -1082 -1462
1632 -1462 -1987 -1687 59 1709 2035 361 -615 -133 -1408 -2255 404 1577 201 1424 2527 -737
1648 -737 -2571 -828 -715 -714 1974 3041 707 -1312 -1814 -1782 -1332 -105 2046 2310 -226 -930 99 -1549
1666 -1549 -2211 929 1753 90 1354 2132 -942 -2351 -851 -487 -160 1856 2589 912 -1362 -2208 -1511
1683 -1511 -1005 -110 2268 2320 -580 -985 -49 -1816 -1796 1406 1603 135 1421 1562 -1177 -1943 -753 -302
1701 -302 273 1564 2216 807 -1803 -2322 -918 -865 -246 2651 2353 -1031 -1039 -98 -1928 -1467 1741 1747 344
$$ packed form
1582d10j190j132K212K092j72l51l73r19j310o25J540J742l28O65J277k615k736
1599b633J456N61p17K755K132k729j939L68j026m74K114J998j82j028p22l5j326
1616a427r42K221J677j149R05J475l076k464J801M65m46K723J534k453j926l80
1632a462n25L00J746J650L26j674r76M82j275q47K659J173j376J223J103l264
1648g37j834J743J13JK688J067k334k019n02L2M50J227K151K64k536p04J029j648
1666a549o62L140Q24j663J264P78l074j409J500L64L27K016P33j677k274q46O97
1683a511N06Q95K378N2k900m05R36j767K0L202J97j468J286J41k739p66J190M51
1701c02N75J291O52j409k610n19J404N3O19K897k98l384qR41j830M61L208Oj403
$$ plain form
1720 344 1172 880 -1259 -1929 -804 233 714 1160 1906 772 -2201 -2260 -510 -896 -152 2798 2025 -1172
1738 -1172 -823 -358 -2078 -990 1843 1703 659 957 392 -1266 -1926 -723 834 859 775 1779 485
1755 485 -2571 -1946 -115 -848 31 2892 1673 -1211 -788 -625 -1872 -694 1699 1938 1016 465 -52
1772 -52 -1167 -2045 -709 1424 950 466 1614 117 -2784 -1555 162 -863 326 2719 1226 -1141
1788 -1141 -673 -826 -1669 -477 1560 2079 1065 -8 -174 -1151 -2237 -415 1938 841 318 1635 -342
1805 -342 -2895 -1150 303 -617 509 2359 873 -956 -876 -867 -1233 -321 1422 2320 1003 -381 -209 -1111
1823 -1111 -2319 -85 2186 773 319 1355 -789 -2807 -817 279 -265 837 1965 651 -896
1838 -896 -1189 -845 -761 -330 1358 2494 681 -741 -80 -1157 -2298 336 2269 670 385 1006 -1151
$$ packed form
1720C44Q28k92k139o70J125J037M81M46P46j134k973n9J750l86P44K950p73l197
1738a172L49M65j720J088K833j40j044K98n65j658o60J203J557K5q4J004j294
1755D85l056O25J831p33Q79K861j219k884M23J63j247J178K393K39r22n51n17
1772e2j115q78J336K133m74m84J148j497k901J229J717j025J189K393j493k367
1788a141M68j53q43J192K037N19j014j073j66r77j086J822K353j097n23J317j977
1805c42k553J745J453r20J126J850j486j829Q0Rl66R12J743Q98j317j384J72r02
1823a111j208K234K271j413m54J036k144k018J990J096n44J102J128j314j547
1838h96k93L44Q4M31J688J136j813j422O61j077j141K634J933j599k85O21k157
$$ plain form
1855 -1151 -2522 -720 372 177 921 1517 554 -957 -1518 -623 -330 -415 1393 2490 329 -980 -37
1872 -37 -1284 -2060 692 2192 633 486 758 -1354 -2225 -773 378 653 924 1175 547 -1096 -1745 -441
1890 -441 -39 -377 1584 2434 -23 -986 -89 -1309 -1743 971 1948 617 504 276 -1342 -1976 -996 452
1908 452 1036 773 925 640 -1353 -1936 -95 150 -267 1712 2156 -399 -925 -141 -1295 -1220 1126 1718
1926 1718 687 396 -215 -1249 -1758 -949 610 1216 508 800 549 -1663 -1859 230 210 12 2007 1808
1944 1808 -648 -903 -341 -1204 -650 1114 1529 873 100 -567 -1065 -1600 -1080 934 1360 246 800 459
1962 459 -1922 -1775 355 274 347 1937 1361 -599 -895 -669 -970 -171 951 1468 962 -293 -818 -821 -1554
1981 -1554 -915 1241 1278 152 758 121 -2020 -1418 441 317 725 1879 970 -696 -948 -854 -683 26
$$ packed form
1855a151j371J802J092j95P44N96r63j511n61Q95K93q5J808J097k161j309R43
1872c7j247p76K752J500j559j47K72k112q71J452J151K75K71K51o28j643o49J304
1890d41M02l38J961Q50k457r63Q97j220m34K714R77j331j13k28j618o34R80J448
1908D52N84k63J52k85j993n83J841K45m17J979M44k555n26P84j154P5K346N92
1926A718j031k91o11j034n09Q09J559O06p08K92k51k212j96K089k0j98J995j99
1944A808k456k55N62q63N54J764M15o56p73o67m98n35N20K014M26j114N54l41
1962D59k381J47K130q1P3J590n76j960k96K26l01P99J122N17n06j255n25lp33
1981a554O39K156L7j126O06o37k141O02J859j24M08J154r09j666k52R4J71P09
$$ plain form
1999 26 853 1486 968 -638 -919 -713 -1630 -703 1495 1150 110 721 -251 -1922 -1058 393 475 991 1593
2018 1593 640 -454 -1137 -988 -226 144 637 1646 836 -967 -925 -715 -1631 -387 1596 985 242 596
2036 596 -584 -1813 -717 355 743 1169 1117 457 -394 -1277 -892 110 133 551 1633 563 -1220 -790
2054 -790 -817 -1562 -40 1701 913 245 226 -862 -1515 -602 346 965 1189 688 382 -385 -1370 -751 355
2073 355 96 598 1597 375 -1161 -743 -939 -1368 295 1537 917 445 -56 -1154 -1227 -487 435 1314 1023
2092 1023 334 265 -543 -1452 -364 506 -71 691 1489 -20 -1093 -670 -1075 -1009 568 1357 940 414 -590
2111 -590 -1228 -1013 -523 573 1586 796 -1 210 -709 -1467 -43 549 33 869 1278 -214 -906 -718 -1165
2130 -1165 -708 606 1211 1035 343 -872 -1203 -817 -540 863 1798 629 -34 137 -969 -1293 181 542
$$ packed form
1999B6Q27O33n18j606k81K06r17R27K198l45j040O11r72j671Q64J451Q2N16O02
2018A593r53j094o83J49P62L70M93J009q10j803M2K10r16J244J983o11p43L54
2036E96j180j229J096J072L88M26n2o60q51q83L85J002K3M18J082j070j783M30
2054g90k7p45J522J741p88o68j9j088o53R13R48O19K24n01l06p67r85O19J106
2073C55k59N02R99j222j536M18j96m29J663J242o20m72n01j098p3P40R22Q79k91
2092A023o89o9q08r09J088Q70n77P62P98j509j073M23m05O6J577P89m17n26j004
2111e90o38K15M90J096J013p90p97K11r19p58J424N92n16Q36M09j492o92J88m47
2130a165M57J314O05j76o92j215l31L86K77J403R35j169o63J71j106l24J474L61
$$ plain form
2148 542 78 933 859 -469 -721 -877 -1044 -275 633 1005 1172 147 -1178 -995 -766 -577 1090 1785 490
2167 490 2 -2 -1200 -1040 386 447 424 951 444 -448 -612 -950 -875 46 441 917 1169 -149 -1168 -741
2187 -741 -809 -439 1311 1648 333 107 -275 -1350 -797 449 498 669 831 106 -517 -732 -1104 -498 263
2206 263 314 885 1051 -492 -1102 -586 -823 -260 1462 1389 346 166 -566 -1280 -518 348 582 1006 648 -183
2226 -183 -417 -877 -1141 -139 390 263 1002 809 -778 -954 -493 -826 31 1414 1105 402 233 -784 -1163
2245 -1163 -343 231 699 1175 367 -285 -443 -1103 -1022 207 442 313 948 392 -906 -747 -505 -735 388
2264 388 1386 912 473 66 -917 -877 -218 111 925 1140 127 -267 -466 -1273 -868 422 375 401 1007 47
2284 47 -919 -553 -621 -412 750 1153 753 561 -221 -1054 -698 -274 90 1082 961 -53 -271 -660 -1433 -509
$$ packed form
2148E42m64Q55p4j328k52j56j67P69R08L72J67j025j325J83K29J89J667O95j295
2167D90m88mj198J60J426O1k3N27n07q92j64l38P5R21L95M76K52j318j019M27
2187g41o8L70J750L37j315k26l82j075N53J246M9J71J62p25o23k15l72O06P61
2206B63N1N71J66j543o10N16k37N63J722p3j043j80p32p14P62Q66K34M24l58q31
2226a83k34m60k64J002N29j27P39j93j587j76M61l33Q57J383l09p03j69j017l79
2245a163Q20N74M68M76q08o52j58o60Q1J229K35j29O35n56j298J59K42k30J123
2264C88R98m74m39m07r83M0O59L29Q14K15j013l94j99q07M05J290m7K6O06r60
2284D7r66L66o8K09J162M03m00j92p82q33L56M24L64R92j21j014k18l89p73R24
$$ plain form
2304 -509 587 350 586 806 -327 -913 -516 -593 -167 869 907 623 525 -507 -984 -431 -265 198 1242
2323 1242 757 -90 -178 -851 -1308 -228 502 400 863 634 -521 -684 -490 -647 139 951 713 702 321 -727
2343 -727 -823 -323 -357 370 1175 465 -146 -225 -1027 -1149 -14 431 437 889 321 -629 -610 -631 -532 495 927 625
2365 625 725 64 -933 -600 -280 -205 716 1181 245 -60 -306 -1233 -871 151 287 587 925 5 -604 -451
2385 -451 -754 -426 699 826 648 693 -252 -1024 -515 -382 -145 939 900 80 -53 -489 -1241 -526 126 215
2405 215 715 725 -165 -446 -512 -871 -118 774 625 655 670 -450 -810 -375 -408 156 1079 605 83 -9 -802 -1112
2427 -1112 -253 211 200 898 588 -376 -454 -588 -806 113 717 521 803 440 -629 -682 -369 -389 378 1124 443
2448 443 43 -127 -1009 -991 -79 77 338 918 278 -484 -383 -647 -609 303 607 597 841 142 -774 -466 -399
$$ packed form
2304e09J096k37K36K20j133n86L97p7M26J036L8k84r8j032m77N53J66M63J044
2323A242m85q47q8o73m57J080P30j02M63k29j155j63J94j57P86Q12k38j1l81j048
2343g27r6N00l4P27Q05p10o11p9q02j22J135M45OM52n68r50J9k1R9J027M32l02
2365F25J00o61r97L33L20P5R21M65r36l05k46r27L62J022J36L00L38r20o09J53
2385d51l03L28J125J27j78M5r45p72N09J33K37J084l9q20j33m36p52P15O52Q9
2405B15N00J0q90k81o6l59P53Q92j49L0J5j120l60M35l3N64R23m74n22r2p93l10
2427a112Q59M64j1O98l10r64p8j34k18R19O04j96K82l63j069n3L13k0P67P46o81
2448D43m00j70q82J8R12J56K61N80o40p62J01k64L8R12L04j0K44o99r16L08O7
$$ plain form
2469 -399 -320 708 960 290 171 -211 -1160 -788 18 74 523 858 13 -403 -373 -789 -401 457 523 707 794
2490 794 -99 -697 -339 -536 -234 954 826 255 136 -465 -1162 -544 44 168 724 687 -98 -323 -571 -836
2510 -836 -113 514 504 850 702 -445 -522 -208 -555 27 1027 594 89 96 -683 -1069 -385 -33 298 756 407
2531 407 -175 -300 -743 -776 184 524 451 978 498 -563 -456 -309 -556 336 962 426 135 6 -799 -850 -265
2552 -265 -105 347 771 206 -33 -184 -888 -565 387 397 538 1047 174 -668 -332 -360 -445 548 838 288 177
2573 177 -283 -870 -594 -252 -53 584 623 -28 -8 -236 -1033 -357 485 327 657 1047 -67 -615 -358 -436 -182
2594 -182 593 722 284 159 -447 -789 -389 -317 24 756 412 -110 131 -360 -1001 -93 491 269 746 857
2614 857 -232 -611 -388 -512 -3 694 553 417 30 -735 -741 -275 -394 194 797 262 -150 93 -610 -903
$$ packed form
2469c99P9J028K52o70j19l82r49L72Q06N6M49L35q45m16L0m16L88Q58O6J84Q7
2490G94q93n98L58j97L02J188j28n71j19o01o97O18N88J24N56l7p85k25k48k65
2510h36P23O27j0L46j48j147p7L14l47N82J000m33n05Pp79l86O84L52L31M58l49
2531D07n82j25m43l3R60L40p3N27m80j061J07J47k47Q92O26n36k91j29q05n1N85
2552b65J60M52M24n65k39j51p04L23R52J0J41N09q73q42L36k8q5R93K90n50j11
2573A77m60n87K76L42J99O37L9o51K0k28p97O76Q42j58L30L90j114n48K57p8K54
2594a82P75J29m38j25o06l42M00P2L41P32l44n22K41m91o41R08N84k22M77J11
2614H57j089l79K23j24N09O97j41j36l87p65oM66j19N88O03n35m12K43p03k93
$$ plain form
2634 -903 100 422 267 879 607 -271 -479 -451 -514 156 585 503 493 -127 -860 -518 -261 -324 453 874 56
2655 56 -65 83 -669 -667 186 303 403 845 368 -281 -449 -549 -368 352 465 508 563 -327 -956 -388 -330 -369
2677 -369 606 719 -59 -55 -118 -756 -477 228 228 577 634 113 -180 -486 -676 -136 481 371 512 537 -598 -765
2699 -765 -173 -413 -203 758 598 -151 -13 -248 -774 -295 238 318 651 501 -3 -97 -486 -652 193 517 191
2720 191 629 418 -737 -743 -165 -437 -30 725 407 -57 -28 -428 -639 -149 149 446 782 304 -64 -61 -603
2741 -603 -557 397 386 177 657 249 -766 -589 -222 -439 126 747 386 -13 -197 -583 -458 -123 44 647
2761 647 744 55 48 -64 -692 -450 538 344 241 693 23 -823 -466 -318 -378 282 629 297 49 -329 -642
2782 -642 -233 -97 99 852 560 -113 -16 -139 -798 -211 586 259 298 609 -144 -703 -399 -367 -173 413 398
$$ packed form
2634i03J003L22j55O12k72q78k08K8o3O70M29q2j0o20p33L42K57o3P77M21q18
2655E6j21J48p52KQ53J17J00M42m77o49j68j00J81P20J13M3N5q90o29N68N8l9
2677c69R75J13p78Mo3o38K79P05%L49N7n21k93l06j90N40O17j10J41K5j135j67
2699g65N92k40K10R61j60p49J38k35n26M79N33Q0L33j50n04r4l89j66Q45L24l26
2720A91M38k11j155oN78k72M07P55l18m64K9m00k11M90K98K97L36m78l68Ln42
2741f03M6R54j1k09M80m08j015J77L67k17N65O21l61l99j84l86J25L35J67O03
2761F47R7o89pj12o28K42R88j94j03M52o70q46L57J48o0O60L47l32k48l78l13
2782f42M09J36J96P53k92o73R7j23o59N87P97l27L9L11p53n59L04L2J94N86j5
$$ plain form
2803 398 318 177 -533 -544 -121 -157 222 1008 512 -206 116 -164 -781 -57 488 248 345 339 -294 -674 -468 -361
2825 -361 74 362 269 406 76 -657 -417 45 -205 346 1023 291 -155 118 -395 -708 159 465 290 410
2845 410 141 -421 -494 -596 -297 273 310 213 450 -112 -777 -318 2 -264 475 924 151 -193 -15 -427 -523
2866 -523 178 364 422 346 -4 -313 -448 -751 -227 434 223 203 497 -323 -805 -146 74 -105 651 791 67
2887 67 -151 -140 -540 -352 150 387 524 265 -159 -260 -452 -748 -20 405 88 241 503 -488 -698 -85 -30
2908 -30 -58 639 662 -6 -93 -266 -395 -129 51 375 576 94 -307 -131 -567 -674 188 454 21 339 322 -624
2930 -624 -653 40 -27 76 637 467 68 -157 -362 -280 -73 -18 437 568 -100 -301 -94 -587 -634 333 435 49
2952 49 382 232 -682 -499 42 -26 265 607 382 65 -333 -446 -150 18 -26 524 606 -242 -255 -86 -678 -469
$$ packed form
2803C98q0j41p10j1M23l6L79P86m96p18L22k80o17P24N45k40R7oo33l80K06J07
2825c61M35K88r3J37l30p33K40M62k50N51O77p32m46K73n13l13Q67L06j75J20
2845D10k69n62p3j02K99N70L7r7K37n62o65M59L20k66P39M49p73l44J78m12r6
2866e23P01J86N8p6l50l09j35l03N24O61k11k0K94q20m82O59K20j79P56J40p24
2887F7k18J1m00J88N02K37J37k59m24j01j92k96P28M25l17J53K62r91k10O13N5
2908c0k8O97K3o68q7j73j29K66J80L24K01m82m01J76m36j07Q62K66m33L18j7r46
2930f24k9O93o7J03N61j70l99k25k05Q2K07N5M55J31o68k01K07m93m7R67J02l86
2952D9L33j50r14J83N41o8K91L42k25l17l98j13K96J68m4N50Q2q48j3J69n92K09
$$ plain form
2974 -469 469 363 106 423 59 -613 -408 -98 122 392 451 325 161 -448 -448 21 -81 16 645 456 -369
2995 -369 -208 -72 -698 -307 460 286 125 254 -163 -534 -429 -181 253 485 314 372 99 -607 -428 143
3015 143 -82 47 778 244 -375 -169 -201 -664 -201 456 248 184 199 -249 -346 -417 -145 442 410 216 463 122
3037 122 -617 -227 238 -136 151 820 133 -454 -175 -298 -495 -40 335 257 159 -62 -265 -299 -450 -65 595
3058 595 364 149 473 -19 -680 -195 181 -91 276 637 -2 -366 -210 -377 -357 9 286 358 164 -210 -224
3079 -224 -205 -462 89 723 244 148 445 -140 -676 -57 166 -82 409 567 -26 -390 -385 -406 -238 24 186 502
3101 502 46 -401 -121 -215 -568 215 667 148 112 447 -253 -606 -21 155 18 458 413 -46 -299 -490 -342
3122 -342 -129 -48 239 593 -31 -380 -74 -243 -482 358 641 83 201 345 -348 -502 74 86 112 389 250
$$ packed form
2974d69R38j06k57L17l64o72K05L10K20K70N9j26j64o09%M69j02R7O29j89q25
2995c69J61J36o26L91P67j74j61J29m17l71J05K48M34K32j71N8k73p06J79N71
3015A43k25J29P31n34o19K06l2m63M63O57k08o4J5m48r7p1K72N87l2j94K47l41
3037A22p39L90M65l74K87O69o87n87K79j23j97M55L75p8r8k21k03l4j51L85O60
3058E95k31k15L24m92o61M85L76k72L67L61o39l64J56j67K0L66K77P2j94l74j4
3079b24J9k57N51O34m79r6K97n85n36O19K23k48M91J58n93l64Nk1J68K62J62L16
3101E02m56m47K80r4l53P83M52n19l6L35p00l53N85J76j37M40m5m59k53j91J48
3122c42K13Q1K87L54o24l49L06j69k39Q40K83n58J18J44o93j54N76J2K6K77j39
$$ plain form
3143 250 15 -291 -590 -264 40 -80 312 547 -203 -407 18 -314 -396 469 573 89 212 114 -364 -314 -34
3164 -34 99 256 281 92 63 -369 -577 -98 59 -76 384 553 -300 -343 47 -336 -289 520 463 192 227 -33
3186 -33 -269 -279 -66 203 406 114 49 86 -508 -599 97 -8 -165 509 370 -365 -248 -12 -346 -109 469 394
3208 394 232 93 -174 -221 -222 -166 376 398 29 137 69 -593 -536 170 -18 -76 525 304 -403 -225 -144 -280 4
3231 4 425 415 294 -1 -247 -152 -302 -203 417 480 -81 188 43 -665 -438 212 -7 33 491 101 -352 -203
3253 -203 -252 -187 58 301 424 334 -134 -220 -80 -329 -172 575 383 -156 139 -29 -673 -287 144 32 112 382
3275 382 25 -273 -236 -258 3 165 191 469 269 -290 -188 -17 -343 -25 673 214 -154 121 -174 -619 -216
3296 -216 143 -13 224 262 -38 -204 -336 -245 111 172 129 558 225 -364 -53 -13 -428 107 613 144 -63 163
$$ packed form
3143B50k35l06k99L26L04j20L92K35p50k04M25l32q2Q65J04m84J23r8m78N0K80
3164c4J33J57K5j89k9m32k08M79J57j35M60J69q53m3L90l83M7Q09n7k71L5k60
3186c3k36j0K13K69K03k92o5L7n94r1O96j05j57O74j39p35J17K36l34K37N78p5
3208C94j62j39k67m7jN6N42K2l69J08o8o62N7P06j88n8O01k21p07J78Q1j36K84
3231DM21j0j21k95k46R5j50R9O20O3n61K69j45p08K27O50k19M0M58l90m53J49
3253b03m9O5K45K43J23r0m68q6J40k49J57P47j92n39K95j68o44L86M31j12Q0K70
3275C82l57k98L7k2K61J62K6K78k00n59J02J71l26L18O98m59l68K75k95m45M03
3296b16L59j56K37L8l00j66j32R1L56O1m3M29l33n89L11M0m15N35N06m69k07K26
$$ plain form
3318 163 -299 -554 -93 10 133 269 136 38 -169 -412 -201 247 2 209 580 48 -416 -64 -24 -358 246
3339 246 537 90 -5 -32 -387 -414 -164 -54 247 184 -47 12 -203 -582 -103 339 -5 268 648 -52 -379 65
3361 65 -94 -239 240 396 71 -34 -129 -363 -263 -222 -40 378 110 -64 76 -262 -573 48 315 67 364
3382 364 501 -179 -323 -25 -144 -89 345 347 124 -82 -312 -362 -192 -299 46 428 19 -93 125 -366 -585
3403 -585 123 239 64 415 399 -203 -262 -36 -189 -13 287 210 134 -89 -370 -242 -170 -271 192 402 -108 -90
3425 -90 120 -424 -459 246 214 44 461 235 -233 -205 -180 -118 165 199 196 216 -240 -440 -118 -206 -269 343 359 -120
3449 -120 32 66 -477 -262 164 189 104 425 167 -146 -176 -263 -16 291 161 239 239 -325 -413 -63 -199 -191 434 305
3473 305 -169 28 -83 -496 -174 219 195 262 313 -17 -46 -249 -288 113 238 62 275 194 -482 -348 17 -285
$$ packed form
3318A63m62k55M61J03J23J36j33r8k07k43K11M48k45K07L71n32m64L52M0l34O04
3339B46K91m47r5k7l55k7K50J10L01o3k31N9k15l79M79M42l44K73L80p00l27M44
3361F5j59j45M79J56l25j05r5k34J00M1J82M18k68j74J40l38l11O21K67k48K97
3382C64J37o80j44K98j19N5M34Kk23k06k30n0J70j07L45L82m09j12K18m91k19
3403e85P08J16j75L51j6o02n9K26j53J76L00p7p6k23k81J28P2j01M63K10n10J8
3425i0K10n44l5P05l2j70M17k26m68K8K5O2K83L4lK0m56k00L22q8o3O12J6m79
3449a20J52L4n43K15M26K5q5L21k58l13l0q7K47L07j30P8%n64q8L50j36QO25j29
3473C05m74J97j11m13L22L93k4O7N1l30k9k03l9M01J25j76K13q1o76J34L65l02
$$ plain form
3495 -285 -128 432 185 -150 51 -105 -420 -101 133 220 403 188 64 -45 -285 -292 230 127 67 395 73
3516 73 -533 -235 -91 -264 43 366 90 -82 -43 -269 -224 -27 50 275 337 25 -22 22 -369 -139 284 36
3538 36 84 349 -11 -491 -179 -76 -270 134 335 138 41 -96 -310 -203 -7 88 406 301 -59 48 -28 -413
3560 -413 -105 363 89 92 330 -143 -360 -117 -113 -201 193 237 71 30 -193 -268 -39 -51 63 475 145 -139 119
3583 119 -109 -409 36 322 34 157 255 -208 -324 -190 -232 -45 207 120 130 51 -280 -269 22 -116 132 542
3605 542 150 -111 94 -159 -332 130 185 37 303 132 -228 -225 -215 -196 71 222 67 102 -22 -376 -157 68
3627 68 -101 285 474 16 -42 149 -259 -268 192 142 83 206 24 -243 -184 -296 -180 207 121 40 207 -166 -458
3650 -458 -17 28 -112 342 432 22 16 -5 -317 -100 199 161 170 208 -136 -194 -159 -341 14 233 -9 43 222 -279
$$ packed form
3495b85J57N60k47l35K01j56l15L19K34Q7J83k15j24j09k40pN22j03o0L28l22
3516G3o06K98J44j73L07L23k76j72L9k26M5J97P7K25O2l12m7M4l91K30M23k48
3538C6M8K65l60m80L12J03j94M04K01j97r7j37k14J07J96R5L18j05l60J07p6l85
3560d13L08M68k74LK38m73k17K43Mq8L94M4j66m1k23p5K29j2J14M12l30k84K58
3583A19k28l00M45K86k88J23R8m63j16J34m2J87K52q7J0p9l31J1K91j38K48M10
3605E42l92k61K05k53j73M62N5j48K66j71l60LJ0J9K67J51j55L5j24l54K19K25
3627F8j69L86J89m58n8J91m08rM60n0n9J23j82k67N9j12J16L87q6q1J67l73k92
3650d58M41M5j40M54R0m10ok1l12K17K99l8RL8l44n8L5j82L55K19k42N2J79n01
$$ plain form
3674 -279 -332 103 -44 -75 354 342 -114 40 -60 -282 -11 97 70 232 146 -149 -120 -184 -318 77 232 13
3696 13 166 147 -301 -291 98 -70 -2 395 285 -48 41 -136 -204 85 22 148 315 -67 -191 -88 -315 -334 173
3719 173 216 -55 227 115 -346 -198 70 -86 120 332 193 -27 -40 -167 -120 41 -53 198 236 -130 -144 -35
3741 -35 -356 -263 202 180 -50 209 -8 -253 -124 -31 -46 221 313 100 48 -79 -262 23 56 -17 280 203 -173
3764 -173 -91 -63 -415 -92 210 71 36 210 -100 -286 -117 -114 -20 277 187 110 117 -187 -142 101 -37 38 277 130
3788 130 -182 -52 -96 -322 -57 225 35 127 151 -207 -166 16 -123 170 335 143 146 94 -237 -233 156 -73 71
3811 71 302 34 -208 -25 -254 -315 21 168 11 214 8 -196 -46 -167 -142 233 240 48 177 90 -314 -115
3833 -115 105 -69 155 327 -24 -175 -28 -250 -227 169 84 129 189 -79 -211 -118 -124 -31 279 194 69 206 5
$$ packed form
3674b79n3M35j47l1M29j2m56J54j00k22K71J08k7J62q6k95K9o4j34L95J55k19
3696A3J53j9m48J0L89j68O8L97j10l33Q9j77o8K89o3J26J67l82j24J03k27j9N07
3719A73M3k71K82j12m61J48K68j56K06K12j39k20j3j27M7J61r4K51L8l66j4J09
3741c5l21R3M65k2k30K59k17k45J29R3j5K67R2k13n2j27j83K85L3p3K97p7l76
3764a73Q2K8l52L23L02j39l5J74l10j86J69LR4K97r0p7Pl04M5K43j38P5K39j47
3788A30l12J30m4k26K65K82j90R2K4l58M1J82j39K93J65j92Ln2l31ML89k29J44
3811G1K31k68k42J83k29o1L36J47j57K03k06k04J50j21K5L75Pj92J29q7m04J99
3833a15K20j74K24J72l51j51J47k22K3L96q5M5O0k68j32R3oR3L10q5j25J37k01
$$ plain form
3856 5 -329 1 43 -127 294 297 -79 -73 -148 -347 -127 80 78 160 142 -190 -177 -81 -240 -4 341 89 68 157 -130
3881 -130 -239 62 6 31 261 153 -87 -65 -127 -276 -15 32 -9 205 36 -232 -93 -120 -216 136 308 122 97
3904 97 220 -187 -186 18 -112 76 269 55 -95 -43 -234 -220 70 -11 38 261 -79 -239 -92 -91 -147 201 286 3
3928 3 213 65 -233 -75 47 -61 104 226 33 -44 -131 -272 -152 58 -33 97 234 -91 -152 -57 -179 1
3950 1 246 222 118 174 -7 -153 -36 -21 -25 243 160 -43 36 -140 -373 -80 44 -25 142 161 -141 -124 -79 -171 -3
3975 -3 227 141 166 167 -63 -161 22 -49 71 260 80 -23 78 -176 -287 -100 35 -19 184 82 -137 -6 -134
3998 -134 -135 82 251 56 213 124 -211 -27 -7 -123 72 213 41 11 50 -292 -256 64 11 17 261 -9 -189
4021 -189 -60 -115 -185 189 167 92 234 63 -132 -18 5 -119 237 256 -18 60 -20 -341 -105 64 -20 167 221
$$ packed form
3856El34L30M2j70M21Ll76Op5j99K20K07kQ2j8l32J3R6j59K36L45k52k1Q9k87
3881a30j09L01n6K5K30j08k40K2o2j49K61M7m1K14j69k68J39k7r6L52J72j86k5
3904I7J23m07JK04j30J88J93k14j50N2j91J4K90q1M9K23l40j60J47Jn6L48Q5k83
3928CK10j48k98J58J22j08J65J22j93p7q7j41J20K10r1J30J37l25o1R5j22J80
3950AK45k4j04N6j81j46J17J5mK68q3k03P9j76k33K93J24o9J67J9l02J7M5r2J68
3975cK30q6K5Jk30r8J83p1J20J89j80j03J01k54j11J87J35n4K03j02k19J31j28
3998a34jK17J69j95J57q9l35J84K0j16J95J41j72l0L9l42L6L20n3OK44k70j80
4021a89J29n5p0L74k2p5J42j71j95J14K3j24L56J9k74P8q0l21K36J69q4J87N4
$$ plain form
4044 221 -67 -83 -50 -195 -63 222 77 179 260 -22 -181 15 -124 -57 202 128 -37 71 -156 -258 -62 43
4066 43 -5 152 121 -126 -49 -53 -257 -28 221 79 236 198 -97 -152 -33 -120 15 211 72 21 86 -216 -249 13
4090 13 -78 3 243 74 -159 -52 -104 -256 57 76 77 180 113 -161 -6 -55 -112 74 249 17 57 -12 -229 -255
4114 -255 -85 -97 -13 228 13 -76 40 -220 -146 175 86 51 262 45 -109 2 -42 -51 180 153 -2 54 2 -260
4138 -260 -98 7 -115 167 181 -118 -69 -59 -253 -90 164 41 160 203 -109 -141 -6 -150 -99 202 77 59
4160 59 65 -150 -249 -16 -79 -27 148 151 -84 -11 -133 -177 8 116 91 177 179 -97 -27 33 -184 127 197 27 96 97 -267
4187 -267 -187 17 -160 -55 162 83 -48 20 -168 -107 55 80 38 241 184 -103 -56 -82 -136 120 143 -1 101 -14
4211 -14 -258 -157 -2 -145 12 232 -13 -45 12 -212 -110 87 79 206 300 39 -83 36 -94 -100 200 67 -21
$$ packed form
4044B21k88j6L3j45J32K85j45J02Q1k82j59J96j39O7K59p4j65J08k27j02J96J05
4066D3m8J57l1k47P7mk04K29K49j42J57l8k95n5J19q7J35J96j39n1O5l02l3K62
4090A3r1Q1K40j69k33J07n2j52L13J9JJ03o7k74J55m9n7J86J75k32M0o9k17k6
4114b55J70j2Q4K41k15q9J16k60P4L21q9l5K11k17j54J11m4rK31k7j55N6n2k62
4138b60J62J05j22K82J4k99M9J0j94J63K54j23J19M3l12l2J35j44N1L01j25j8
4160E9Ok15r9K33o3N2J75Lk35P3j22m4J85J08k5Q6Kk76P0O0k17L11P0j70O9Jl64
4187b67Q0K04j77J05K17p9j31O8j88O1J62K5m2K03n7k87M7k6n4K56K3j44J02j15
4211a4k44J01J55j43J57K20k45l2N7k24J02J97qJ27R4k61j22J19j30oL00j33q8
$$ plain form
4234 -21 151 -83 -231 -56 -47 -173 74 139 1 -29 -78 -225 -38 104 16 187 243 -13 -17 16 -142 -48 175 77
4258 77 10 170 -91 -190 -61 -131 -81 177 87 -10 20 -128 -193 58 81 65 286 156 -41 -18 -36 -193 30 171
4282 171 52 52 71 -128 -177 -85 -117 -2 197 17 24 102 -165 -156 51 38 71 210 66 -75 73 -127 -144 51 167
4307 167 51 117 -22 -182 -127 -116 -172 117 182 -22 80 80 -226 -104 107 -40 113 286 31 -45 72 -106 -135
4330 -135 74 139 45 112 -65 -218 -102 -112 -89 122 67 -56 85 -61 -238 3 59 -7 146 203 -77 36 -27
4353 -27 -133 -31 85 87 107 154 -139 -131 -80 -211 -116 150 30 -6 54 -112 -188 75 29 -8 149 200 -23 -5 -20 -99
4379 -99 28 79 76 146 46 -132 -97 -124 -231 -12 136 -8 8 73 -173 -164 33 -45 100 235 59 -37 40 -113 -124
4404 -124 93 46 61 160 31 -158 -95 -65 -162 74 91 -16 54 9 -132 -119 35 4 104 236 52 43 47 -184 -1
$$ packed form
4234b1J72k34j48J75Rj26K47O5j38l0m9j47J87J42q8J71N6k56mL3j58R4K23r8
4258G7o7J60k61r9J29p0N0K58r0r7L0j48o5K51K3j6K21j30j97K3j8j57K23J41
4282A71j19%J9j99m9R2l2J15J99j80PP8k67RK07j3L3J39j44j41J48k00j7J95J16
4307A67j16O6j39j60N5J1n6K89O5k04J02%l06J22K11j47J53J73k55p6J17j78k9
4330a35K09O5r4O7j77j53J16j0K3K11n5j23J41j46j77K41N6o6J53N7k80J13o3
4353b7j06J02J16KK0M7k93QN1j31R5K66j20l6O0j66p6K63m6l7J57N1k23J8j5p9
4379i9J27N1lP0j00j78L5k7j07K19J48j44J6O5k46RJ97p8J45J35j76r6P7j53j1
4404a24K17m7J5R9j29j89O3L0r7K36J7j07P0m5j41J3J54l1J00J32j84rMk31J83
$$ plain form
4429 -1 74 68 111 159 -53 -135 -51 -218 -152 82 119 -53 27 10 -196 -100 -34 33 146 171 12 44 -69 -211 55 84
4455 84 -31 144 107 -192 -131 -9 -192 -79 149 40 71 89 -82 -122 4 -36 108 158 36 44 57 -70 -137 76
4479 76 52 -68 198 43 -168 -53 -82 -196 -54 86 -6 48 27 -146 -54 -57 -31 86 182 54 8 111 -146 -120
4503 -120 116 -61 15 221 11 -150 -9 -77 -113 27 73 27 65 -76 -93 19 -81 -69 194 183 1 20 33 -188
4527 -188 -127 106 -31 20 122 -43 -165 -72 -167 -80 32 71 30 56 -92 -147 41 -79 -42 181 118 30 69 1 -151
4552 -151 40 48 -6 32 97 -89 -76 -44 -184 -7 8 16 81 114 -166 -60 57 -70 -5 216 57 -20 70 -77 -143
4577 -143 -19 48 -42 108 45 -68 -58 -95 -144 14 83 -25 112 44 -178 -30 86 -88 50 207 40 29 168
4600 168 -76 -106 51 8 49 147 -6 -18 -13 -145 -65 81 -6 6 229 -16 -143 42 -35 -60 137 122 45 64 45
$$ packed form
4429aP5oM3M8k12q2Q4j67O6K34L7j72Q0j7k06R6O6O7J13K5j59L2j13j42K66K9
4455H4j15J75l7k99O1J22j83J13K28j09L1J8j71m0J26m0J44N0j22QJ3j27o7K13
4479G6k4j20K66j55k11J15k9j14J42J40r2N4k1j73R2lK6J17R6j28m6J03k57K6
4503a20K36j77P6K06k10j61J41o8l6J40M6m6L8j41j7J12j00J2K63j1j82J9J3k21
4527a88O1K33j37N1J02j65j22R3r5Q7J12L9m1K6j48n5J88j20L7K23o3q8L9o8j52
4552a51J91Qn4L8O5j86J3L2j40J77J5QO5L3k80J06J17j27O5K21j59p7R0j47o6
4577a43J24O7r0J50o3j13J0l7m9J58O9j08J37o8k22J48J16j74J38J57j67j1J39
4600A68k44l0J57m3M1R8j53j2Nj32Q0J46q7J2K23k45j27J85p7k5J97j5p7J9j9
$$ plain form
4625 45 -115 -74 12 12 101 34 -25 -33 -64 -168 -84 64 -100 18 196 -85 -109 -23 -23 -44 214 131 36 130 22 -61 -4
4652 -4 54 36 162 94 -10 25 -65 -183 16 99 -81 71 81 -125 -100 2 -70 32 142 80 39 80 -82 -42 62
4677 62 -37 -54 216 29 -47 58 -96 -186 58 63 -90 50 66 -94 -141 -20 -116 71 147 116 75 67 -84 12 -3 -98
4703 -98 55 161 7 -75 80 -167 -204 65 -33 20 145 11 -130 -62 -115 -60 141 82 42 103 -15 -101 13 -2
4727 -2 -67 113 152 -24 -47 -28 -191 -83 79 -24 45 124 -64 -114 2 -115 8 89 65 86 159 -31 -80 36 -93
4752 -93 -59 192 71 -49 30 -27 -145 -71 66 -7 26 28 -88 -16 -16 -143 9 126 20 70 92 -93 -68 -4 -76 -53
4778 -53 143 9 -105 -2 -108 -180 -60 -39 -35 128 39 -152 2 -86 -151 58 94 -4 193 99 -127 -7 121 -74
4802 -74 -33 105 35 -3 -37 -102 -114 -14 -32 6 95 -84 -24 62 -83 -91 141 74 -12 194 57 -136 -13 30 -101 84
$$ packed form
4625D5j60M1Q6%Q9o7n9ql1j04Q4J48j64J18J78k81k4Q6%k1K58q3r5R4j08q3N7
4652dN8j8J26o8j04L5r0j18J99Q3j80J52J0k06K5J02p2J02J10o2m1M1j62M0J04
4677F2r9j7K70j87p6J05j54r0K44Nj53J40J6j60m7J21r6J87P6l1m1qj51R6j5r5
4703i8J53J06j54q2J55k47l7K69r8N3J25j34j41O8n3N5K01n9m0O1j18q6J14j5
4727bo5J80L9j76k3J9j63J08J62j03O9P9j88n0J16j17J23Q1k4K1P3j90m9J16j29
4752i3L4K51j21j20P9n7j18P4J37p3L3Kj16P2%j27J52J17j06N0K2j85K5O4p2K3
4778e3J96j34j14J03j06p2J20K1MJ63q9j91J54q8o5K09L6r8J97r4k26J20J28j95
4802g4M1J38p0l8l4o5j2J00j8L8Q9j79O0Q6j45qK32o7q6K06j37j93J23M3j31J85
$$ plain form
4828 84 107 -27 -3 -44 -86 -50 -52 -81 78 62 -76 56 -18 -163 -17 154 31 71 118 -14 -34 16 -16 -62 73 65
4854 65 -14 37 -138 -112 6 -38 2 138 74 -70 58 -28 -204 4 130 11 50 131 -63 -94 1 -96 -5 85 -8
4879 -8 43 36 -174 -96 -23 -76 16 115 -61 -26 31 -64 -118 73 98 -32 148 133 -31 -16 -61 -81 68 63 -28 65 35 -105
4907 -105 -54 52 -66 -7 149 -68 -37 52 -86 -51 80 80 46 47 27 -34 9 -88 13 62 21 20 45 -20 -151 49 -28
4934 -28 -169 89 97 -15 -32 73 -109 -70 70 46 105 118 17 -27 3 -89 -28 66 62 79 147 -57 -166 8 -41 -52
4960 -52 126 19 -90 -55 -47 -125 29 67 56 122 89 -43 20 14 -137 42 173 -15 39 64 -143 -154 19 8 -65 138
4986 138 -38 -65 6 -77 -56 35 34 69 113 65 -53 69 25 -92 114 76 -33 46 11 -141 -138 -11 -99 -16 50 -45 -60
5013 -60 -34 -113 -33 64 -19 114 175 -15 -75 59 -47 21 126 22 -8 54 -26 -127 -76 -22 -69 57 39 -28 37 23
$$ packed form
4828H4K3j34K4m1m2L6kk9J59j6j38J32p4j45J46J71j23M0M7j32k0N0l2m6J35q
4854F5p9N1j75K6J18m4M0J36o4j44J28q6j76K08J26j19L9Q1j94l1R5r7R1R0r3
4879hN1pk10P8P3n3R2R9j76L5N7r5n4J91K5j30J80j5j64J5m5k0J49nr1R3l0j40
4907a05N1J06j18N9J56k17L1Q9j38L5J31%l4Jk0o1M3r7J01M9m1jK5o5j31K00p7
4934b8j41K58Qj12j7J05j82L9J40k4N9J3j01m4L0r2O1R4mJ7O8k04j09J74m9j1
4960e2J78j07j09L5Qp8J54L8j1O6l3j32O3oj51J79J31j88N4K5k07j1J73j1p3K03
4986A38j76k7P1q3K1R1jL5M4m8j18J22m4j17K06l8j09P9l5j52LJ27q8Q3O6r5j5
5013f0K6p9Q0R7q3J33O1j90o0J34j06O8J05j04l0O2q0j01N1N4m7J26j8o7O5j4
$$ plain form
5039 23 -43 -4 59 8 139 153 -28 26 6 -50 4 81 -19 15 42 -126 -95 -50 -74 -75 42 -2 -21 25 -82 -111 36
5066 36 -20 57 165 100 -32 76 -10 -115 11 75 -3 37 48 -135 -67 -23 -130 -31 37 -38 21 40 -106 -42 30 -17
5092 -17 6 129 92 -42 48 -51 -161 95 55 -23 118 -23 -116 -60 -42 -80 102 10 -82 51 2 -176 -107 13 -29
5117 -29 42 110 -11 -19 41 -52 -79 69 48 19 93 -33 -88 -42 -59 -75 112 35 8 45 -6 -189 -18 43 -33 75 105
5144 105 -26 39 41 -91 -44 135 -26 28 81 -115 -62 -17 -134 -20 75 -28 -55 50 -60 -196 82 -57 -33 144
5168 144 127 -9 52 8 -42 47 95 22 48 51 -67 -47 -38 -100 -13 57 -44 12 70 -70 -62 37 -43 45 123 58 2 30 -89
5197 -89 -92 40 -3 -9 81 -1 -123 11 -55 -123 22 55 -70 16 9 -97 -42 64 -32 60 120 -23 0 68 -100 4 31
5224 31 -3 96 122 -96 -48 11 -40 -26 90 -22 -17 51 -14 -84 20 -24 43 80 105 22 71 59 -115 -17 76 -31 100
$$ packed form
5039B3o6L9O3n1J31J4j81N4k0n6N4P7j00L4K7j68L1M5k4jJ17m4j9M6j07k9J47
5066C6n6P7J08o5j32J08q6j05J26O4p8M0J1j83O8M4j07R9O8p5N9J9j46O4P2m7
5092a7K3J23l7j34R0r9j10K56m0p8J41j41r3N6J8l8J82r2r2J33m9j78O9J20m2
5117b9P1O8j21qO0r3k7J48k1k9P4j26n5M6j7j6J87p7k7L7n1j83J71O1p6J08L0
5144A05j31O5Kj32M7J79j61N4N3j96N3M5j17J14R5j03k7J05j10j36K78j39K4J77
5168A44j7j36O1m4n0Q9M8p3K6Lj18K0Ro2Q7P0j01N6N8j40QR9q0Q8P8o5n6K8j19
5197h9lJ32m3oR0q2j22J34o6o8J45L3j25Q6pj06N5J06r6R2O0j43K3O8j68J04K7
5224C1l4R9K6k18M8N9n1J4J16j12NO8o5p0J04m4O7L7K5q3M9j2j74R8R3j07J31
$$ plain form
5251 100 62 -90 -41 -15 -124 -81 79 0 -6 11 -59 -104 6 -46 9 105 45 -25 91 -11 -118 101 26 -57 108 63
5277 63 -56 20 -63 -138 11 71 -24 45 56 -61 -8 -15 12 19 169 57 73 102 -142 -44 61 19 -39 85 -21 -51 -33
5304 -33 -85 -83 15 -7 -83 70 25 -75 -15 -42 -25 70 108 -60 80 -7 -98 -37 63 2 68 112 -47 -84 -26 -100 -111 44
5332 44 -43 30 115 -59 -53 3 -47 51 79 47 13 104 55 -73 4 33 -43 40 75 -24 28 12 -131 -32 43 7 -9 65 -29
5361 -29 4 60 -78 -32 131 -4 -2 37 -10 -87 10 -7 -28 78 86 -49 10 -36 -78 37 44 -18 85 104 -85 -46 -4 -41
5389 -41 56 60 21 31 14 -63 -79 27 -58 1 79 -62 -39 -39 -92 -80 20 -35 -14 39 -37 -115 61 -24 -49 87 0 -5 61
5418 61 73 -125 -15 44 -45 40 81 31 -43 -39 -115 -28 68 -63 22 41 -40 -93 -2 -33 -60 126 36 -38 58 -25 -75 -12 17
5447 17 29 74 61 -69 -53 -56 -88 -7 8 -14 61 44 -85 -55 38 -136 2 73 11 73 101 17 -66 56 -26 -5 133 33
$$ packed form
5251A00l8j52M9K6j09M3J60p9oJ7p0m5J10n2N5R6o0p0J16j02j07K19p5q3J65m5
5277F3j19P6q3p5J49O0r5O9J1j17N3pK7PJ50j12J6K9k44R8J05m2n8J24j06l0J8
5304c3n2KR8k2p6J53m5j00O0k7J7R5L8j68J40q7r1O1J00o1O6M4j59l7N8p4j1J55
5332D4q7P3Q5j74ON6n0R8K8l2l4R1m9j28P7K9p6Q3L5r9N2j6j43R9P5l6j6P4r4
5361b9L3N6j38M6J63j35KL9m7p7R7j7k1J06Qj35N9m6m2J15Po2J03J9j89L9M2l7
5389d1R7Ml9J0j7p7j6J06q5N9P8j41K3%n3J2J00n5K1N3p6p8J76q5k5J36q7nO6
5418F1J2j98J10N9q9Q5M1n0p4Mp6Q7R6j31Q5J9q1n3R1l1k7J86r0p4R6q3n0O3K9
5447A7J2M5j3j30J6ll2Q1J5k2P5j7j29L0R3j74J38P1o2O2K8q4q3J22q2K1J38j00
$$ plain form
5475 33 -76 26 -52 -125 4 -28 -61 26 7 -82 -19 -10 -66 32 59 5 -13 63 -51 -20 60 -46 42 70 -43 -62 -5 -27
5503 -27 -34 -24 1 -18 113 -10 -117 2 -33 -88 71 79 9 177 91 -12 35 -19 -17 59 109 -21 16 17 -125 -19 -4
5530 -4 -41 5 75 -33 22 -10 -93 -73 91 65 -18 92 1 -64 51 14 -42 74 9 -55 51 -50 -95 47 -8 -37 60
5557 60 36 -117 -15 38 -74 58 75 -12 53 83 20 -2 -20 -43 -34 109 -6 -5 89 -76 -62 -26 -4 -44 50 53 -88 -18
5585 -18 -37 -88 41 112 -9 111 81 -23 2 28 -23 30 112 -15 -5 20 -48 -42 19 -70 -9 86 13 -53 58 -44 -39 75
5613 75 44 43 94 22 4 102 -27 -53 104 22 -17 45 -21 -90 -42 -20 -119 -18 -1 -35 27 -37 -70 9 28 20 34 122 -42
5642 -42 -34 -51 -47 -63 79 60 11 52 8 -111 3 33 -9 54 35 -49 34 -27 -52 19 132 -16 103 82 -43 2 16 -73
5670 -73 12 79 -29 -27 7 -31 -98 -10 9 -26 6 7 -60 15 -65 -90 56 -22 1 133 34 -109 -5 5 -41 20 80 39 35
$$ packed form
5475C3j09J02p8p3J29l2l3Q7j9q9O3Rn6R8K7n4j8P6j14L1Q0j06Q8K8j13j9N7k2
5503b7pJ0K5j9J31j23j07J19l5n5J59Qp0J68q6j03M7n4KP6N0j30L7Jj42J06J5
5530dl7M6P0j08N5l2q3K0J64k6q3J10r1o5J15l7n6J16o5o4J06j01m5J42n5k9R7
5557F0k4j53J02N3j12J32J7q7O5L0o3k2j8k3RJ43j15JR4j65J4L6K2m0R4Lj41P0
5585a8j9n1J29P1j21J20l0j04K5K6n1N3Q2j27J0K5o8OO1q9O1R5p3o6J11j02NJ14
5613G5l1jN1p2j8R8j29k6J57q2l9O2o6o9M8K2r9J01J7l4O2o4l3P9J9qJ4Q8j64
5642d2Qj7Mj6J42j9m9M1m4j19J14L0m2O3j9q4Q3o1k5P1J13j48J19k1j25M5J4q9
5670g3Q5O7j08KL4l8o7Q8J9l5L2Jo7P5q0k5J46p8K3J32r9j43J04J0m6O1O0m1m
$$ plain form
5699 35 52 -130 -61 32 -69 -28 135 -38 -85 4 -82 -64 113 28 -8 139 -56 -7 99 14 -98 55 40 -34 7
5724 7 19 -96 -17 -24 -63 46 35 -87 11 20 -55 -40 56 -6 23 44 1 -11 20 -36 -90 32 -9 -15 29 -3 -130 13 -68
5753 -68 -47 71 68 -26 -12 -52 -115 57 19 36 55 66 -30 48 55 -107 32 36 -49 60 10 -103 -93 -6 -125 -6 66 -17
5781 -17 -58 39 -128 -74 -29 -10 -29 103 23 -51 49 -26 -11 33 64 -29 80 -1 -102 -34 -19 -78 83 80 -6 13 17 -105
5809 -105 6 -16 6 30 99 19 -33 20 -73 -72 51 -34 49 86 -81 -76 -21 -35 -57 42 31 -40 36 36 -79 -35 8 -30 -17
5838 -17 97 11 -5 18 -18 -2 43 -13 -4 61 -5 -87 14 -14 -70 84 24 52 22 12 -68 9 24 -10 93 94 -36 55 -26
5867 -26 -90 -10 64 -33 25 66 -97 -64 43 -95 -69 96 -23 -10 -28 -38 -56 55 12 29 75 6 -10 65 -42 -34 43
5894 43 11 -116 41 -17 -134 -54 -65 -51 23 82 -37 59 26 -34 6 9 5 12 77 -53 28 82 -104 -40 47 -23 -19 32 12
$$ packed form
5699C5J7j82O9R3j01M1J63j73m7Q9q6J8J77q5l6J47j95M9J06q5j12J53j5p4M1
5724GJ2j15P9pl9J09j1j22R8Rp5J5R6o2K9K1m3j2L1n6n4J22m1oM4l2j27J43q1
5753f8K1J18lr4J4m0o3J72l8J7J9J1r6P8Pj62J39Mq5J09n0j13J0Q7j19J19P2q3
5781a7m1R7j67N4M5J9j9J32q0p4J00p5J5M4L1r3J09q1j01O8J5n9J61lq6J9Mj22
5809a05J11k2K2K4O9q0n2N3r3JJ23q5Q3L7j67NN5j4k2R9j1p1P6%j15M4M3l8J3
5838a7J14q6j6K3l6J6M5n6RO5o6q2J01k8n6J54o0K8l0j0q0P7J5l4J03Jj30R1q1
5867b6o4Q0P4r7N8M1j63L3J07j38K6J65j19J3j8j0j8J11m3J7M6o9j6P5j07QP7
5894D3l2j27J57n8j17Q0j1J4P4N9j19R6l3o0M0LmPO5j30Q1N4j86O4Q7p0MN1k0
$$ plain form
5923 12 -53 7 -91 -94 18 42 -68 8 -31 -67 50 31 -16 160 87 24 8 9 -60 20 83 -72 68 103 -34 -37 -2 -120
5951 -120 -11 68 42 -49 63 -43 -38 36 -70 1 102 5 -64 14 -22 -120 31 36 -61 40 10 -83 -113 41 -106 -36
5977 -36 80 -22 6 16 -49 -18 -1 -43 -13 103 -8 13 90 -13 -74 20 48 -15 115 23 -59 -27 -57 -46 74 23 -52
6004 -52 119 73 -88 -69 1 1 -20 101 10 -29 78 -76 -76 39 -36 -2 -6 -8 -45 -14 -130 -76 -17 15 -1 129 43 -67
6032 -67 40 23 -29 123 40 -61 59 71 -55 30 9 -18 76 76 -10 23 11 -53 -44 5 -59 -11 79 -58 -102 47 -37 -16
6060 -16 65 57 -38 54 -2 -51 -11 -7 -49 70 -32 -58 6 2 -94 41 2 -86 17 86 -88 4 19 -41 18 95 70 1 63
6089 63 -21 -44 76 -33 33 83 -43 -33 38 -23 -74 35 4 -20 142 -17 -91 83 53 -14 7 72 -8 61 9 -30 12
6116 12 6 -11 58 -3 -7 3 39 -118 -74 48 6 6 74 51 4 62 -8 -20 90 21 -23 101 30 -56 30 -17 -32 75 127
$$ packed form
5923A2o5O0r8lJ12K4j10P6l9l6J17j9m7J76p3o3j6Jo9Q0O3j55J40L5j37lL5j18
5951a20J09P9k6r1J12j06NP4j06P1J01r7o9P8l6r8J51Nr7J01l0r3l0J54j47P0
5977c6J16j02K8J0o5L1J7m2L0J16j11K1P7j03o1R4K8o3J30r2q2L2l0J1J20n1p5
6004e2J71m6j61J9P0%k1J21r1l9J07j54%J15p5L4mkl7L1j16N4N9L2j6J30q6j10
6032f7J07j7n2J52q3j01J20J2j26Q5k1k7R4%q6L3j2o4RM9o4M8R0j37m4J49q4K1
6060a6Q1qr5R2n6m9M0Mm2J19j02k6O4mr6J35l9q8J03O9j74R2J5o0N9P7k5o9O2
6089F3q4k3J20j09O6N0j26J0P1o1n1J09l1k4J62j59p4J74l0o7K1O5q0O9n2l9M2
6116A2oj7O9o1mJ0L6j57M4J22m2%O8k3m7N8p0j2J10o9m4J24p1q6Q6m7j5J07N2
$$ plain form
6145 127 -80 9 -6 -111 -55 -12 -31 -38 36 -48 8 -6 -80 -42 37 -51 40 45 -64 -39 56 -32 -57 77 16 -96 11 8
6173 8 -69 23 -23 -14 27 40 -47 -37 -14 -86 31 124 -3 36 52 -66 11 47 -105 43 111 -66 6 1 -46 -83 26 -19
6201 -19 -46 118 -27 -60 9 -8 -75 34 68 -25 82 72 -95 -30 0 -90 74 23 -49 56 7 -68 18 20 -6 9 73
6228 73 6 12 49 -94 -41 40 22 3 106 -20 -71 54 24 -60 9 61 -28 27 29 -24 2 -13 -43 -14 10 -39 4 30 4
6257 4 14 92 -28 58 102 33 -65 56 -16 31 108 12 -33 35 -9 -89 31 4 -67 84 54 -59 62 9 -72 33 89
6284 89 -17 47 33 -34 -9 88 -32 1 57 -7 15 -15 -95 27 7 -28 -15 66 -3 -26 12 -27 -84 45 59 -8 50 17
6312 17 -50 42 18 -8 70 75 -31 35 59 -100 -55 14 -60 42 103 -44 -20 47 -97 5 76 61 3 23 -32 -40 3 -9
6340 -9 -72 -29 4 -30 41 -56 -64 3 15 -100 26 68 -51 -43 34 -116 4 59 27 15 44 -18 27 44 -55 1 17 21 13 74
$$ packed form
6145A27k07Q9j5j05N6M3j9pP4q4N6j4p4L8P9q8R1Nj09K5R5q8k5J34o1j12J07l
6173Hp7R2m6RM1J3q7J0K3p2J17R3j27L9J6j18P7L6j52J48O8j77P2nm7l7J09m5
6201a9k7J64j45l3O9j7o7J09L4r3J07j0j67O5L0r0J64n1p2J05m9p5Q6Kk6J5O4
6228G3o7OL7j43N3Q1j8j9J03j26n1J25l0q4O9N2q9N5Kn3K6j5l0K9K4m9M3K6k6
6257DJ0P8j20Q6M4o9r8J21p2M7P7r6m5O8m4q0J20k7p1J51l0j13J21n3q1J05N6
6284H9j06O4j4o7K5R7j20L3N6o4K2l0q0J22k0l5J3Q1o9k3L8l9n7J29J4o7N8l3
6312A7o7R2k4k6P8Nj06O6K4j59M5O9p4J02O1j47K4O7j44J02P1j5n8K0n5qM3j2
6340io3M3L3l4P1r7qO7J2j15J26M2j19QP7j50J20N5l2j2K9o2M5J7r9N6J6MqO1
$$ plain form
6370 74 -81 -65 3 -45 -27 84 51 -43 -24 -10 -66 -4 78 41 99 29 26 43 16 -57 -4 58 -37 49 11 -129 -60 15 -49
6399 -49 -18 68 -10 -43 -1 9 -77 28 -15 -21 85 -22 -12 -15 27 -21 38 18 -11 23 8 -93 -6 -5 -67 -16 15 18 15 38 -97
6430 -97 -35 80 -7 18 84 -11 -8 70 -65 -22 75 -38 -52 45 27 -142 -27 32 -29 43 6 -77 -61 -1 -21 15 -47 19
6458 19 59 85 -7 -6 27 -63 -41 80 55 37 77 -82 -49 5 -7 -37 100 -24 -56 -14 -47 -77 -1 15 4 46 21 -97
6486 -97 15 -7 -33 -9 23 -1 -5 49 -79 -21 3 -39 14 23 -25 -66 60 -90 -5 91 7 22 146 4 -119 84 45
6513 45 -8 68 48 3 -9 1 -52 -9 6 -20 47 65 -27 33 -15 -82 -25 55 -20 57 89 -64 -40 4 -114 -66 73 -9 -30
6542 -30 3 -68 -21 -69 -93 -46 110 42 -15 28 -57 -69 40 18 -28 2 102 -46 -24 18 -21 56 88 -18 40 15 -9 -8
6570 -8 -59 -105 -1 105 34 42 43 -53 -40 67 68 19 56 4 -63 45 16 -30 26 26 -58 95 31 -51 18 -46 -77 23 73 15
$$ packed form
6370G4j55J6O8m8J8J11l3r4J9J4n6O2Q2l7N8p0lJ7k7p3N3O2r5Q6l8j40O9P5o4
6399d9L1Q6p8l3M2J0q6J05m3oJ06j07J0lM2m8N9k0k9L4j5j01Q7Jo2N1L1LlK3j35
6430i7O2J15q7K5O6r5LP8j35M3R7j13j4R7j8j69J15N9o1P2l7q3J6O0k0L6o2O6
6458A9M0K6r2JL3r0K2J21k5j8M0j59L3N4j2l0J37j24l2M2l3l0P6J6j1M2k5j18
6486i7J12k2k6K4L2k4mN4j28N8K4m2N3Rm8m1J26j50Q5R6q4J5J24j42j23K03l9
6513D5n3P6k0m5j2J0n3M3J5k6O7J8r2O0m8o7N7Q0p5P7L2j53K4M4j18M8J39q2k1
6542c0L3p1M7m8k4M7J56o8n7M3q5j2J09k2m6L0J00j48K2M2l9P7L2j06N8k5k4J
6570hn1m6J04J06p1QJr6J3J07Jm9L7n2o7J08k9m6N6%q4J53o4q2O9o4l1J00N0n8
$$ plain form
6600 15 50 56 -6 -30 -4 0 5 92 43 13 39 -48 27 41 45 -67 31 -21 -65 0 10 -98 49 22 -79 2 3 -67 -16 -5 -13
6631 -13 -31 45 -33 -29 39 -74 -47 10 -58 -53 -18 -10 -23 92 -31 -94 66 -2 -56 31 16 -67 49 5 -19 69 62 39 32 0
6661 0 -8 21 44 -20 7 11 -57 -72 -75 -86 -3 32 -22 20 50 -42 -25 25 -21 -2 33 5 31 53 -14 -64 -3 -52 -7 102 -19
6692 -19 -84 3 -44 -41 -59 -18 -65 12 66 -74 -4 10 -67 65 136 -7 -1 13 -15 18 33 -2 13 15 2 -70 -9 -61 -69 -8 -14
6723 -14 -53 56 16 -66 27 -11 18 40 60 -13 25 51 8 -46 53 23 -1 48 -38 -43 -14 -62 -44 47 -17 -7 29 -16 18 20 -22
6754 -22 9 113 51 -23 52 -2 -77 -19 -7 -47 59 -3 -12 25 -31 -74 -37 12 -33 -35 63 -29 -16 -3 -55 37 71 -60 -37 67
6784 67 17 -5 20 -12 -35 44 -15 -9 -16 -77 -77 26 45 -22 97 57 -48 36 10 -99 24 72 -21 20 45 -30 6 111 -7
6813 -7 3 63 -72 -30 -8 -6 -75 11 -16 -52 64 16 -71 31 24 -73 28 4 -73 58 6 -63 16 11 -4 13 12 -60 -63 5 -26
$$ packed form
6600A5L5Oo2k4K6MNQ7m9l0K6q7P5J4Mj12R8n2m4O5J0j08J47k7j01Q1Jp0N1J1q
6631a3j8P6p8MO8j13K7N7o8NL5Qj3J15j23o3J60o8n4Q7j5q3J16m4k4Q8pk3pl2
6661@qK9K3o4K7Mo8j5lj1Q3L5n4M2L0r2J7N0m6J9L5k8K6K2o7n0O1m9M5J09j21
6692a9o5Q7m7Lj8M1m7P7N4j40P0J4p7J32P1j43OJ4k8L3J5l5J5Kj3p2O1n2qO1o
6723a4l9J09m0q2R3l8K9K2K0p3L8K6m3n4R9l0k4M9q6nK9m8J8R1o4J0L6m5L4Km2
6754b2L1J04o2p4P5n4p5N8J2m0J06o2rL7n6m3L7M9m5kR8r2J3J3n2R2L4j31K3J04
6784F7n0k2K5l2k3P9n9Opo1%J03J9o7J19m0j05Q4k6j09J23M8r3M1K5p5L6J05j18
6813gJ0O0j35M2K2Ko9Q6k7l6J16m8q7J02pr7J01k4p7J31n2o9P9nj5J7jp2lO8l1
$$ plain form
6844 -26 90 90 -8 -6 31 -52 -16 77 -121 -36 80 30 19 51 23 -48 2 35 -10 78 27 -20 7 -39 -85 -11 -38 -86 53
6873 53 38 -95 -86 -5 -55 41 82 -36 -24 36 27 -33 9 -64 22 62 -46 30 -36 -35 -60 4 -17 -44 73 23 -38 16 23 -80
6903 -80 75 51 -14 44 -9 -48 -7 29 -61 9 68 -6 -17 23 -38 -64 20 -73 -124 61 -40 -51 -1 11 -8 11 20 24 17 25 -31
6934 -31 24 54 -46 46 -25 -101 32 24 -46 32 20 -46 60 43 -54 7 87 -34 6 59 -47 18 -1 -15 -28 14 0 -34
6962 -34 41 18 -51 13 1 -134 -47 0 -24 44 46 -24 8 -10 -93 13 70 8 37 20 6 27 5 -59 6 46 -18 -5 36 -1
6992 -1 -73 -45 23 42 39 -14 -10 58 -76 -96 36 14 -32 64 -5 -74 16 20 -50 1 -3 -16 -41 12 -78 -15 -23 -48 6 42 -18 -22 11
7025 11 -22 -42 56 13 30 133 68 -34 -17 16 -55 34 22 -43 15 77 20 20 12 -47 4 4 -33 42 -12 -88 -32 54 -7 49 93
7056 93 12 -24 58 -19 72 24 -16 -36 3 -39 -66 -17 -42 -13 6 8 -42 16 -3 -93 37 26 -17 107 86 22 37 53 -64
$$ packed form
6844b6J16%r8KL7q3L6R3j98Q5J16n0j1L2k8p1N0L3m5Q8n1m7K7m6m6P4k7m8J39
6873E3j5j33RQ1n0R6M1j18J2O0ro0M2p3Q6M0j08P6o6Jk5O4k1k7J17n0o1N4Pj03
6903h0J55k4o5N8n3l9M1L6r0P0N9p4j1M0o1k6Q4r3n1J85j01j1N0J2j9J9RMpQn6
6934c1N5L0j00R2p1p6J33qp0P8j2o6J06j7r7O1Q0j21M0N3j06O5j9j4j3M2j4l4
6962c4P5k3o9O4j2j35Q7M7k4O8Kp0L2j8q3J06N7o2K9j7j4K1k2o4O5M0o4J3M1l7
6992ap2K8O8J9ln3MO8j34k0J32k2m6R6o9o9R0Mp0N1mj3k5N3r0O3qk5N4L6o0mL3
7025A1l3k0R8m3J7J03o5j02J7L3p1Q9j2o5N8O2n7%qn9N1%l7P5n4p6N6Q6o1N6M4
7056I3q1l6Q2p7R1m8m0k0L9m2k7M9k5K9J9Kn0N8j9r0J30j1m3J24k1o4J5J6j17
$$ plain form
7085 -64 -34 -23 -38 5 -23 -88 -7 -7 13 -33 60 14 -11 47 -51 -53 4 13 -58 57 60 7 5 -29 -74 45 -6 -64 3 -55 -59 2
7117 2 22 -6 -16 -18 -37 -16 -6 -53 -13 87 36 42 127 -40 -8 19 -26 -18 47 60 -26 47 2 -71 49 -12 -86 45 35 -24
7147 -24 -11 -32 -48 55 45 -11 32 27 4 -36 38 -28 -65 -5 -87 -59 93 -96 -97 -45 -66 -52 43 11 -29 -24 31 -30 39 -16
7177 -16 16 3 55 -49 34 3 -7 59 79 18 -66 81 -78 -1 -1 -73 35 69 -98 22 -9 -72 -12 -11 9 -2 42 -45
7205 -45 -11 2 -55 -61 33 1 -6 39 12 -106 -12 -56 -48 -2 35 -98 2 4 -2 -4 88 3 -20 87 -11 12 46 -24 -7 76 -60
7236 -60 -13 57 0 -52 38 -44 25 10 36 -10 53 29 -63 60 49 -23 54 47 -79 -9 -30 -93 -37 52 -19 68 39 -26 -16 76
7266 76 20 -7 134 -7 8 71 -54 -65 31 6 -39 129 24 7 42 12 -42 76 79 -25 60 34 -58 1 60 -48 6
7293 6 25 -3 -39 27 -62 -89 89 -25 -41 55 -5 -49 24 -12 -6 96 53 5 51 -10 -59 -11 29 -16 47 72 -24 23 10 -42
$$ packed form
7085f4L0J1j5M3k8o5Q1%K0m6R3m6k5N8r8kN7Rp1J15Ln3kl4m5J19n1n8O7n8mO1
7117BK0k8j0kj9K1J0m7M0J00n1OQ5j67L2K7m5QO5J3q6P3m5p3J20o1p4J31j0n9
7147b4J3k1j6J03j0n6M3nk3m0P4o6l7O0q2K8J52j89jN2k1J4R5l2m0NN5o1O9n5
7177a6L2j3N2j04Q3l1j0O6K0o1q4J47j59P7%p2J08L4j67J20l1o3O0JK0j1M4q7
7205d5L4J3n7oR4l2pM5k7j18R4m4QM6L7j33J00KokR2q5k3J07r8K3L4p0J7Q3j36
7236f0M7P0n7n2R0q2O9j5K6m6O3k4r2J23j1p2P7pj26P0k1o3N6Q9p1Q7k9o5J0R2
7266G6n6k7J41j41J5O3j25j1R6k5m5J68j05j7L5l0n4J18Lj04Q5k6r2N9N9j08N4
7293FJ9k8l6O6q9k7J78j14j6R6o0m4P3l6OJ02m3m8M6o1m9M8M0m5O3K5r6M7j3n2
$$ plain form
7323 -42 -2 41 -2 34 44 -3 33 25 -35 -21 69 -45 -23 35 -30 -65 27 -25 -47 66 -41 -28 40 45 -39 58 -49 -41 27 -32
7353 -32 -54 33 -41 -63 23 -11 -118 0 23 -33 -2 -33 -50 -51 83 -7 -17 16 -82 14 72 -36 6 83 18 -30 -31 -15 -58
7382 -58 -6 -9 -27 61 58 -49 49 1 -45 -30 49 -62 -20 -50 -61 6 0 -49 -6 87 -20 -14 2 -25 -13 53 -5 -46 -9 -20 -36
7413 -36 -29 -5 -79 4 27 -69 21 -8 -56 17 -27 2 8 50 -37 19 -16 -32 -10 19 -51 16 26 -23 -8 -34 -63 -31 2 -60 -19
7444 -19 9 6 -76 -21 -59 38 54 -23 -59 91 -3 -37 41 90 -58 49 16 -45 42 55 -88 -9 81 17 14 24 -81 -22 57
7473 57 -82 16 63 -16 40 111 -32 -21 13 23 -53 37 -37 -65 4 20 -86 -14 -9 -79 -5 54 -57 46 31 -87 17
7500 17 74 0 19 97 -32 -4 29 52 28 84 -44 17 -32 -4 -78 25 -16 -15 91 19 15 9 12 -58 16 4 3 56 24 -68 -19
7531 -19 -10 -101 32 79 -26 -22 0 -77 -21 0 -42 -7 66 -24 -50 -14 -72 -23 47 -9 -11 31 7 38 28 -2 -2 62 13 -67 33
$$ packed form
7323d2M0M3m3L6J0m7L6qo0J4R0j14K2N8o5l5R2n2k2J13j07J3O8Nq4R7j07QO8n9
7353c2k2Q7p4k2Q6l4j07J18K3n6L1l1j7jJ34r0j0L3r8R6N8j08M2P7o5m8jJ6m3
7382e8N2lj8Q8lj07R8m8m6J5P9j11M2l0j1O7om9M3R3j07OJ6k7J2O6n8m1L7j1j6
7413c6PK4p4Q3K3r6R0k9m8P3m4K9OM2q7N6l5j6K2K9p0O7J0m9J5k6k9L2L3o2M1
7444a9K8lq2N5l8R7J6p7l6J50r4l4P8M9j48J07l3o1Q7J3j43P9R0o4lJ0j05N9P9
7473E7j39R8M7p9N6P1j43J1L4J0p6R0p4k8O9J6j06P2Np0P4N9j11J03j5j18J04
7500A7N7p4J9P8j29K8L3K3k4N6j28O1m9K8p4J03m1JJ06p2moLp0P4j2jN3l2r2M9
7531a9Rr1J33M7j05MK2p7N6K1m2L5P3r0k6L6n8M9P0n6kM2k4L1j0l0%O4m9q0J00
$$ plain form
7562 33 17 -39 13 22 13 48 19 -39 -47 28 -45 34 47 -6 -9 36 -7 -31 -34 -45 -2 35 -8 -52 46 -72 -32 6 25 -37 49 -5
7594 -5 -81 -30 59 -79 52 60 -26 42 52 61 20 40 -19 25 75 -13 7 90 -67 26 28 0 17 42 -51 -49 -4 -23 -61 59 26
7625 26 -29 71 7 -27 -6 6 -7 -9 -1 -59 3 22 -23 23 25 -34 34 79 -31 -37 29 -64 12 46 -53 26 85 27 22 59 -2 -9
7657 -9 74 -38 -17 46 -26 5 26 -15 -67 -64 -22 -53 -31 40 -4 21 33 -79 4 3 -11 -41 15 -12 -35 71 -9 1 -13 -57
7687 -57 -14 36 -30 -55 11 -38 -28 11 -11 -33 44 27 7 43 33 -45 -22 28 -12 56 14 -34 20 -28 -2 -10 -1 -38 25 70 -16
7718 -16 -64 66 -14 -21 55 11 -58 73 -26 -75 34 2 -106 15 26 -59 30 10 -41 14 46 -50 14 41 -19 21 74 -82
7746 -82 -4 40 -12 -21 25 -3 6 41 -9 9 40 -51 -36 46 20 -38 36 -4 -43 68 -34 -106 23 31 -49 66 101 -25 58
7775 58 66 -81 6 -9 -47 -3 52 5 -1 -60 -49 -74 -29 -59 -42 16 -39 -57 -52 5 35 51 6 -11 65 -18 -20 37 -13 -64 31 5
$$ packed form
7562C3j6n6N2RrL5k9n8qP5p3P9J3n3lM5m3k4lj1M3L7m3m4R8j18M0L8J9o2Q6n4
7594ep6N1Q9j38J31Qq6O8J0Rm1K0n9M4N0q8K0Q3j57R3Kk8J7K5r3KM5j9l8J20l3
7625B6n5J00o4l4K1J2j3kQn8O2J9m5M6Kn9O8M5j10oO6r3P6L4r9P9N9n8nL7o1p
7657iQ3j12K1O3p2L1K1m1n2LM2l1K2P1m4K5J2j12Q3jj4l0N6k7k3J06q0J0j4m4
7687e7M3N0o6k5O6m9J0L9k2k2P7j7k0L6j0p8K3N0m0O8m2m8N4m8K6qRl7O3M5q6
7718a6m8J30q0pP6m4o9J31r9m9J09l2j08J21J1q5Q9k0n1N5L2r6O4K7o0M0N3j56
7746h2P8M4n2rM6k8RL5n0J8L1r1J5Q2k6n8P4m0l9J11j02p2J29Qq0J15L5j26Q3
7775E8Qj47Q7j5l8M4N5m7on9J1k5M5l0J7N8n5j8NN7L0J6m5j7P6q3kN7n0n1R5k6
$$ plain form
7807 5 8 58 52 -25 11 34 -32 -19 45 -32 -6 74 -51 16 82 -37 1 -14 -26 -62 -31 44 47 62 -4 -98 12 -22 -24 48 -15
7838 -15 -33 8 47 -61 -14 18 -36 -9 84 -17 13 49 -62 -39 43 1 4 46 -59 -36 5 -50 -7 46 -26 56 -10 49 -101
7867 -101 -15 -4 -40 29 -6 -54 9 41 -28 33 21 -44 32 16 -46 -3 41 -58 5 48 -25 34 38 -14 -26 18 -20 -45 75 15
7897 15 21 67 -6 -41 20 9 -35 38 -30 -78 78 12 -81 14 2 -57 -27 49 -34 -14 43 -92 12 -47 -27 -11 77 -68 -58
7926 -58 -5 -57 -70 100 63 -38 79 60 -17 17 22 -18 71 60 5 35 -14 4 58 21 -37 63 23 -55 -3 51 0 -9 90
7955 90 -15 28 7 -28 -39 40 -63 4 23 -72 3 30 -53 16 92 -68 -67 57 36 5 26 -54 42 42 24 -14 16 -33 -27 -30
7985 -30 12 -54 10 42 -30 -29 29 -67 45 91 -54 -4 59 53 -49 2 12 -4 -13 0 14 45 -2 -29 11 10 -110 29 -32 7
8015 7 -81 27 -27 -23 47 -24 1 43 18 13 49 -30 -20 16 8 19 18 -35 -51 32 -63 -42 56 42 -10 79 38 -66 54 23 22 78
$$ packed form
7807ELN0op7L6K3o6J3O4p7K6Q0j25O7O6j19L8j5j2l6L1P5LJ5o6r4J10l4kP2o3
7838a5j8M1L9j08M7L2n4K7R3j01L0L6j11K3Q2m2LM2j05K3M1n5M3N3p2Q2o6N9j50
7867a01Q6J1l6O9l5m8O3L2o9O1j2o5P6j6o2M3M4r9O3M3p3N9Mn2j2M4l8k5J20o0
7897A5OM6p3l5O1j1m4P3o8m8J56o6r3R5j2n9L0P6q3K0N7j35J04n9K0J6Q8j45J0
7926e8N3n2j3J70l7j01J17j9p7L4Nm0Q9j1n5L0m9J8N4l7n8J00m0p8N2N4n1rR9
7955I0j05M3k1l5j1P9j03O7J9r5P5K7q3O9P6j60JJ24k1l1K1q0R6%j8l8L0m9Ol
7985c0M2o6O4L2p2JN8r6J12M6j45N0O3oj02N1J0j6rJ3J4L1m7k7M0jj20J39o1L9
8015Gq8J08n4MP0p1K5M2k5nL6p9J0L6qJ1jn3j6Q3r5K1R8j4n2Q9m1j04J20l1jN6
$$ plain form
8047 78 -18 -85 4 12 -18 10 24 6 76 17 -53 32 -10 -119 -2 67 -39 -22 -11 25 44 3 -9 -10 -26 43 -35 -3 -34 -100
8077 -100 32 27 -36 82 15 -37 25 65 -41 0 1 -10 29 39 -54 -8 51 -33 -18 74 4 -15 35 -4 -20 42 -34 -23 53
8106 53 -14 -39 7 -48 -17 80 9 -8 72 14 -57 16 1 -41 57 -23 -50 34 7 9 -7 40 7 -41 31 -73 -47 117 -4
8135 -4 65 48 26 -15 65 -19 5 65 -14 17 95 -14 58 -11 0 -46 44 47 -94 64 22 -31 -64 5 -3 -24 11 16 -28 -61 -50
8166 -50 5 20 20 -64 -4 11 -38 41 -15 13 12 21 10 51 -2 -63 13 -14 -41 35 -33 -61 32 -5 -61
$$ packed form
8047G8r6o7Q9Ql0K8J4j8P0n9p0Q5m2j09J17O9j06J7J1L6J9m1j2jj6O9p8L2l1o6
8077a00J32no3J18o7n2O2M0j06M1Jj1L9J0r3M6N9q4J5R2p0j9N0l9j6O2p6J1P6
8106E3o7k5M6n5L1R7p1j7Q0n8p1P3j5m2R8q0k7Q4k7Kj6M7l3m8P2j04K6J64j21
8135dO9j7k2m1Q0q4K4O0p9L1P8j09P2o9J1m6R0Lj41J58m2n3l3O9qk1L5Nm4l3J1
8166e0N5J5%q4O0J5m9P9n6K8jRj1M1n3o1P6k7k7P6o8k8R3l7n6
8191f1
$$ Imaginary data points
##PAGE= N=2
##DATA TABLE= (X++(I..I)), XYDATA
$$ plain form
0 0 0 0 0 0 0 0 0 0 0 0 0 0 0 0 0 0 0 0 0 0 0 0 0 0 4 -6 6 -8 8 -8 9 -12 14 -16 18 -21 23 -28 31 -34 40 -42 50 -53
44 -53 60 -67 73 -82 90 -100 111 -120 133 -146 161 -174 190 -208 228 -248 268 -288 306 -318 309
65 309 -252 66 547 -3070 28315 240386 43839 -198613 17294 163797 -80182 -178814 98423
78 98423 176589 -88397 -150557 86937 116791 -86559 -83640 89608 49773 -103294 -40540
89 -40540 114906 65713 -82070 -71537 38437 33071 -44441 -2973 91652 22132 -112803 -52898
101 -52898 88895 36947 -76309 1166 92015 -25379 -108067 42339 116041 -61878 -120456
112 -120456 74460 107909 -83520 -63146 122546 30477 -170143 -35730 171271 34455
122 34455 -133417 11770 116686 -67672 -137760 80288 142528 -71866 -114500 78110 84316
$$ packed form
0@%%%%%%%%%%%%%%%%%%%%%%%%Mj0J2j4J6j6J7k1K6l0L4l9M4n1N9o5P4q2R2j03
44e3J13j27J40j55J72j90K11k31K53k79L07l35L64l98M36m76N16n56N94o24O27
65C09n61L18M81l617L1385K12071j96547k42452K15907J46503k43979r8632K77237
78I8423P8166k64986o2160K37494K9854k03350K919J73248l9835j53067O2754
89d0540J55446m9193j47783J0533J09974n366p7512M1468R4625o9520j34935N9905
101e2898J41793n1948j13256P7475R0849j17394q2688J50406P3702j77919n8578
112a20456J94916L3449j91429K0374J85692r2069k00620J34413K07001j36816
122C4455j67872J45187J04916j84358p0088K18048O2240k14394m2634J92610O206
$$ plain form
133 84316 -90670 -65048 92633 46956 -93198 -35919 98612 49493 -81772 -56788 52871
144 52871 32207 -56000 -9493 89133 24085 -102282 -49747 78874 37257 -69915 -7874
155 -7874 90756 -2663 -107059 6490 106019 -24178 -103774 44289 100913 -51847 -76051
166 -76051 70614 49824 -101010 -49128 107165 49824 -85132 -18985 75996 -23472 -95395
177 -95395 32845 98726 -26314 -71526 37679 48268 -54996 -44216 53146 37586 -44675
188 -44675 -22633 51653 25056 -52046 -33490 36157 21403 -32425 -3033 51310 10142 -60937
200 -60937 -29914 44969 22456 -40939 -1498 61939 -1849 -75134 -973 66786 -14665 -61045
212 -61045 36152 67195 -38451 -58801 40333 38869 -58701 -33556 71548 37668 -62020 -21723
$$ packed form
133H4316j74986K5622J57681m5677j40154N7279J34531m9119j31265K4984J09659
144E2871k0664q8207M6507R8626o5048j26367N2535J28621m1617j07172O2041
155g874R8630r3419j04396J13549R9529j30197p9596J48063N6624j52760k4204
166g6051J46665k0790j50834N1882J56293n7341j34956O6147R4981r9468p1923
177i5395J28240O5881j25040m5212J09205J0589j03264J0780R7362j5560q2261
188d4675K2042P4286k6597p7102J8556O9647j4754n3828K9392N4343m1168p1079
200f0937L1023P4883k2513o3395L9441O3437o3788p3285P4161O7759q1451m6380
212f1045R7197L1043j05646k0350R9134j464r7570K5145J05104l3880r9688M0297
$$ plain form
224 -21723 54153 -8480 -66788 15945 69096 -9335 -47795 18364 32127 -34673 -37522 31648
236 31648 38165 -19978 -20932 28146 15358 -37752 -23375 28397 20256 -18032 -5766 26477 6122
249 6122 -36851 -21503 27575 18085 -23824 -1519 38942 -1104 -48549 -5299 37763 -3821
261 -3821 -29504 22669 40334 -22249 -42373 16625 27706 -28297 -19433 44509 24799 -41136
273 -41136 -19013 30784 -2966 -38325 9246 43552 -1079 -30572 4833 19061 -20410 -26667
285 -26667 21766 31998 -10367 -15834 15865 5946 -27201 -13265 21596 16302 -8854 -4942 13136
298 13136 706 -25996 -13206 20374 12910 -12473 2050 20783 -6000 -29571 -3811 20885
310 20885 2822 -11482 12458 22286 -13490 -29141 6059 18026 -13005 -8664 27343 14263
$$ packed form
224b1723P5876o2633n8308Q2733N3151p8431l8460O6159J3763o6800k849O9170
236C1648O517n8143r54M9078j2788n3110J4377N1772q141l8288J2266L2243k0355
249F122m2973J5348M9078r490m1909K2305M0461m0046m7445M3250M3062m1584
261c821k5683N2173J7665o2583k0124N8998J1081n6003Q864O3942j9710o5935
273d1136K2123M9797l3750l5359M7571L4306m4631k9493L5405J4228l9471o257
285b6667M8433J0232m2365n467L1699r919l3147J3936L4861n294k5156L912J8078
298A3136j2430k6702J2790L3580p464k5383J4523J8733k6783k3571K5760K4696
310B0885j8063j4304K3940R828l5776j5651L5200J1967l1031M341L6007j3080
$$ plain form
322 14263 -25477 -15408 13032 -646 -18394 6273 28239 3226 -21785 -3361 10902 -11819
334 -11819 -15542 17870 23339 -6804 -10894 7341 141 -17346 -6596 15111 12769 -4263 -4026
347 -4026 6626 -3533 -19697 -5848 15492 8227 -3998 3874 7265 -8564 -16989 -2200 13171
360 13171 6628 -3340 6544 10842 -10849 -19259 3252 10925 -4698 -962 15732 6022 -15698 -12514
374 -12514 3873 1937 -7054 5129 19065 2027 -17057 -4695 5775 -7461 -6081 15152 14543
387 14543 -4608 -7345 722 -3093 -10247 -2157 12456 10435 -2979 -3680 1251 -7601 -12760 1372
401 1372 11614 5877 749 1247 -948 -6807 -9411 -1132 9832 6742 -465 4625 4402 -10218 -12892
416 -12892 1297 6501 1657 3999 8739 906 -12987 -11766 2392 4979 -1260 5903 11983 -3481
$$ packed form
322A4263l9740J0069K8440j3678j7748K4667K1966k5013k5011J8424J4263k2721
334a1819l723L3412N469l0143m090J8235p200j7487J0750K1707k342j7032K37
347d026J0652j0159j6164J3849K1340p265j2225P872L391j5829q425J4789J5371
360A3171o543r968R884M298k1691q410K2511P673j5623L736J6694r710k1720L184
374a2514J6387j936q991J2183J3936j7038j9084J2362J0470j3236J380K1233o09
387A4543j9151k737Q067l815p154Q090J4613k021j3414p01M931q852n159J4132
401A372J0242n737n128M98k195n859k604Q279J0964l090p207N090k23j4620k674
416a2892J4189N204m844K342M740p833j3893J221J4158K587o239P163O080j5464
$$ plain form
430 -3481 -13499 -1654 3066 -4749 -107 11181 7873 -2350 -4070 -1998 -5324 -8084 1052 12506
444 12506 8414 -1567 -2541 -5005 -11133 -5329 6709 9181 5341 773 -3937 -4468 -3468 -4028 1130
459 1130 7289 3415 -247 4006 2025 -7675 -9527 -1598 4690 5355 5677 6674 -1283 -14810 -11731 4482
475 4482 7091 2301 7582 5564 -9609 -11002 1590 3566 -1282 2035 6590 3050 -2040 -1211 -339
490 -339 -6562 -8227 3751 11686 5745 1135 -1404 -10767 -12723 227 9449 8729 5660 -1260 -8303
505 -8303 -6625 -1569 1318 4679 4822 414 -896 1697 1226 -3717 -7178 -2590 4770 5053 4845 7371
521 7371 -2612 -17299 -10253 6423 7004 4639 8877 1386 -13310 -10833 2880 6288 1685 2173 4877
536 4877 -32 -5110 295 2927 -6365 -7113 5720 8756 2818 2818 -1584 -12947 -11069 2645 9353
$$ packed form
430c481j0018J1845M720p815M642J1288l308j0223j720K072l326k760R136J1454
444A2506m092r981r74k464o128N804J2038K472l840m568m710n31J000n60N158
459A130O159l874l662M253j981r700j852P929O288O65L22R97p957j3527L079J6213
475D482K609m790N281k018j5173j393J2592J976m848L317M555l540n090Q29Q72
490c39o223j665J1978P935n941m610k539r363j956J2950R222p20l069o920p043
505h303J678N056K887L361J43m408j310K593m71m943l461M588P360K83k08K526
521G371r983j4687P046J6676N81k365M238p491j4696K477J3713L408m603M88K704
536D877m909n078N405K632r292p48J2833L036n938%m402j1363J878J3714O708
$$ plain form
551 9353 8899 5409 -2776 -9831 -8546 -1091 5545 6506 3561 994 -1979 -2920 391 -479 -5237 -1140
567 -1140 5320 2859 3080 6299 -4185 -15421 -6600 5734 5481 5635 8187 -388 -13101 -10610 3158
582 3158 7582 2067 3229 6422 -2864 -9128 1090 4481 -5553 -3470 7457 5306 -708 1062
596 1062 -1887 -9875 -7847 2547 8821 7660 2827 -2458 -7803 -8868 -1269 6668 6187 4272 2653
611 2653 -3796 -5781 19 -381 -3265 3014 6030 46 4 2875 -4617 -10450 -2988 5330 5048 3593
627 3593 4655 178 -10186 -9909 3115 7328 1461 4482 7214 -4675 -10369 -91 2876 -3059
641 -3059 1198 7729 2808 -3511 -2667 -2131 -5210 -4465 3405 8380 3963 -443 -964 -5469 -7990 -247
657 -247 6028 4782 5067 3069 -4607 -6125 -1901 -1957 -11 6354 5469 -852 -1954 -1530 -4760 -5993 -55
$$ packed form
551I353m54l490q185p055J285P455O636R61k945k567k973r41L311q70m758M097
567a140O460k461K21L219j0484j1236Q821J2334k53J54K552q575j2713K491J3768
582C158M424n515J162L193r286o264J0218L391j0034K083J0927k151o014J770
596A062k949p988K028J0394O274j161m833n285n345j065P599P937m81j915j619
611B653o449j985N800m00k884O279L016n984m2K871p492n833P462Q318k82j455
627C593J062m477j0364K77J3024M213n867L021K732j1889n694J0278K967n935
641c059M257O531m921o319Q44N36l079P45P870M975m417m406n21m505k521P743
657b47O275j246K85j998p676j518M224n6J946O365q85o321j102M24l230j233N938
$$ plain form
674 -55 6519 4679 91 1849 841 -8481 -7806 4379 5866 321 5030 6514 -4775 -9445 -1902
689 -1902 1571 84 2997 6632 2830 -4945 -6236 -1901 -1554 -2038 4527 7528 889 -2365 -1317 -4607
705 -4607 -4947 1348 4365 4217 5042 1109 -4884 -4716 -2899 -2013 2377 6602 4674 -570 -3873 -3790 -3452
722 -3452 -3829 1167 7698 4187 -2273 304 -156 -7667 -4913 5108 5066 1225 3604 3024 -4194 -7352
738 -7352 -2827 2378 2889 2336 4529 2440 -5486 -6791 -1030 -238 -143 5118 5598 -18 -2378 -3322 -4826
755 -4826 -1798 2384 3853 5097 3733 -2004 -4950 -3851 -2299 588 3821 4810 3385 -1295 -5119
770 -5119 -3109 -1596 -2978 1737 7340 2859 -2207 -351 -2064 -6614 -2805 4688 5958 3272 1259
785 1259 -538 -3790 -6641 -2427 5059 4679 963 2176 643 -5500 -5185 -653 486 1493 3614 3060
$$ packed form
674e5O574j840m588J758j008r322O75J2185J487n545M709J484j1289m670P543
689a902L473j487K913L635l802p775j291M335L47m84O565L001o639l254J048l290
705d607l40O295L017j48Q25l933n993J68J817Q86M390M225j928n244l303Q3L38
722c452l77M996O531l511o460K577m60p511K754J0021m2l841K379n80p218l158
738g352M525N205N11n53K193k089p926j305N761P92R5N261M80n616k360r44j504
755d826L028M182J469J244j364n737k946J099J552K887L233R89j425m680l824
770e119K010J513j382M715N603m481n066J856j713m550L809P493J270k686k013
785A259j797l252k851M214P486l80l716J213j533o143L15M532J139J007K121n54
$$ plain form
801 3060 1298 -1812 -5675 -4475 302 2259 4278 6230 2270 -3803 -5890 -4193 117 3742 3586
816 3586 3486 2324 -3652 -5969 -1083 134 -1915 1919 5247 1876 -1046 -1459 -3087 -4255 -2078 3074
832 3074 7413 4969 -947 -2716 -3953 -6022 -934 6371 5272 1167 -315 -2638 -4347 -2760 -653
847 -653 1553 2968 1242 858 2026 -1654 -5529 -2903 682 2403 4963 5221 936 -3858 -6613 -4340
863 -4340 2481 5003 3120 3161 511 -5954 -5566 -29 990 245 2181 2751 1266 -1014 -2996 -2236 -1408
880 -1408 -1792 2575 7688 3983 -2222 -3213 -4099 -4556 575 5762 5485 1841 -2861 -4685 -2752 -2001 -878
897 -878 3616 4003 -184 -440 819 -2348 -4079 -1620 1392 3736 4201 2330 334 -3230 -6853 -3167
913 -3167 3846 4423 2841 2913 -1076 -5957 -4737 -838 1720 2765 2148 1679 1204 -2495 -4326 -928 431
$$ packed form
801C060j762l110l863J200M777J957K019J952l960o073k087J697M310L625j56
816C586j00j162n976k317M886J217k049L834L328l371k922m13j628j168K177N152
832C074M339k444n916j769j237k069N088P305j099m105j482k323j709J587K107
847f53K206J415j726l84J168l680l875K626L585J721K560K58m285m794k755K273
863d340O821K522j883M1k650o465L88N537J019p45J936N70j485k280j982P60Q28
880a408l84M367N113l705o205r91q86m57N131N187k77l644m702j824J933P51J123
897h78M494L87m187k56J259l167j731K459L012K344M65j871j996l564l623L686
913c167P013N77j582P2l989m881J220L899K558J045o17m69m75l699j831L398J359
$$ plain form
930 431 -420 3324 5817 1734 -2440 -3669 -3807 -1742 1245 3682 5214 1900 -4230 -4441 -1733 -2454
946 -2454 -473 4663 4145 81 -1030 -1507 -2694 -2544 -863 2816 5041 2075 -316 -85 -3257 -5566
962 -5566 -568 4004 3024 2278 1550 -1959 -4242 -4167 -1710 2548 3597 1681 1875 661 -4191 -4547 -352
979 -352 1246 2040 3913 3060 104 -2868 -4555 -2113 1426 1294 2221 4451 627 -4509 -3193 -1327
995 -1327 -1865 554 3989 3791 1198 -2113 -3296 -2066 -1959 -422 4853 5356 44 -1688 -1085 -3764
1011 -3764 -3268 1647 3618 2676 1540 -513 -2112 -2953 -3635 -845 3249 2780 1560 2080 -888 -4623
1027 -4623 -3469 -608 1875 4124 3429 1059 -446 -3591 -4924 -251 3015 1463 2183 3001 -1080 -4181
1043 -4181 -2910 -1183 -58 1216 2620 3687 939 -3781 -3332 -987 -1789 553 5721 4188 -795
$$ packed form
930D31q51L744K493m083m174j229j38K065K987K437J532l314o130k11K708p21
946b454J981N136n18m064j111m77j187J50J681L679K225k966k391K31l172k309
962e566M998M572r80p46p28l509k283P5K457M258J049j916J94j214m852l56M195
979c52J598P94J873q53k956k972j687K442L539j32R27K230l824n136J316J866
995a327n38K419L435j98k593l311j183J230J07J537N275N03n312j732O03k679
1011c764M96M915J971r42j136k053j599q41o82K790M094m69j220N20k968l735
1027d623J154K861K483K249o95k370j505l145j333M673L266j552P20Q18m081l101
1043d181J271J727J125J274J404J067k748m720M49K345q02K342N168j533m983
$$ plain form
1058 -795 -1810 -2289 -3543 -1387 2110 3559 3099 389 -1884 -1948 -2979 -2936 977 3151 1942 1835 692
1075 692 -2746 -3401 -2096 -754 2811 4691 1842 131 -562 -3844 -4121 636 2851 2238 2292 1255 -1490
1092 -1490 -3667 -3754 -656 2099 1311 2004 3568 -685 -4897 -2086 -50 -1176 1861 5053 2388 -985
1108 -985 -1842 -2480 -2189 -575 1726 3880 2643 -794 -1761 -2214 -3924 -1528 2641 2503 1972 1799 -1601
1125 -1601 -3876 -1904 -902 318 3807 3901 590 -581 -1455 -3071 -2172 476 2569 3198 1361 -243
1141 -243 -939 -3762 -4612 577 3312 1046 2223 2926 -2576 -5034 -1367 481 640 2832 3724 1325
1157 1325 -1654 -2811 -1661 -656 -581 2109 4062 1048 -1516 -914 -3070 -4143 429 3010 1883 2517
1173 2517 1315 -3199 -3871 -1271 42 1633 3752 2965 363 -1866 -2556 -1405 -1003 -185 3173 3454
$$ packed form
1058g95j015m79j254K156L497J449m60k710k273o4j031M3L913K174j209j07j143
1075F92l438o55J305J342L565J880k849j711o93l282k77M757K215o13N4j037k745
1092a490k177q7L098K755p88O93J564m253m212K811K036j126L037L192k665l373
1108i85q57o38K91J614K301K154j237l437r67m53j710K396M169j38n31j73l400
1125a601k275J972J002J220L489R4l311j171q74j616Q99K648K093O29j837j604
1141b43o96k823q50N189K735k266J177P03n502k458L667J848J59K192Q92k399
1157A325k979j157J150J005P5K690J953l014k564O02k156j073M572K581j127O34
1173B517j202m514o72K600J313J591K119p87k602k229o90J151M02Q18L358K81
$$ plain form
1189 3454 -533 -1052 -342 -3901 -3923 1793 3108 1113 2256 1389 -3109 -4148 -1208 1227 2079 2569 2767
1206 2767 1094 -2843 -3429 -262 -192 -551 3322 3607 -974 -1666 -832 -3524 -2831 1848 2746 1701 1901
1223 1901 140 -2868 -3275 -1286 1186 2362 2362 2664 702 -3345 -2989 -59 -731 44 4256 2782 -2052
1240 -2052 -1454 -918 -3689 -1990 2617 2954 1189 849 -126 -2342 -3417 -1115 2316 2281 1282 2768 1011
1257 1011 -3989 -3072 430 -633 275 4414 2674 -1837 -1962 -1780 -3070 -1089 2502 3041 1525 -119
1273 -119 -836 -1805 -2959 -836 2682 1850 839 2731 518 -4147 -2400 366 -1065 885 4744 2120
1289 2120 -2103 -2214 -2133 -2634 -478 2887 3600 1058 -1293 -939 -1508 -3128 -185 3461 1374 268 2751
1306 2751 266 -4054 -2011 381 -744 1225 4246 2059 -1733 -2796 -2537 -1928 -187 2609 3918
$$ packed form
1189C454l987n19P10l559k2N716J315j995J143q67m498j039K940K435Q52M90J98
1206B767j673l937n86L167P0l59L873K85m581o92Q34k692O93M679Q98j045K00
1223A901j761l008m07J989K472J176%L02j962m047L56K930o72P75M212j474m834
1240b052N98N36k771J699M607L37j765l40r75k216j075K302L431l5r99J486j757
1257A011n000R17L502j063R08M139j740m511j25J82j290J981L591N39j516j644
1273a19p17r69j154K123L518q32j011J892k213m665J747K766j431J950L859k624
1289B120m223j11Q1n01K156L365P13k542k351L54n69j620K943L646k087j106K483
1306B751k485m320K043K392j125J969L021k187l792j063K59O09J741K796J309
$$ plain form
1321 3918 911 -2150 -1142 -1280 -2845 548 3716 907 153 2455 -275 -3587 -1432 257 -526 1579
1337 1579 3772 1850 -1663 -3170 -2477 -1306 -122 2875 4317 231 -2880 -1042 -1431 -2801 1369
1352 1369 3989 545 -3 1917 -755 -3090 -1181 329 209 1509 2910 1784 -1663 -3749 -2070
1367 -2070 -673 -300 2802 4387 -237 -3039 -1107 -1617 -2329 1965 3848 667 122 1043 -1180 -2581
1383 -2581 -1015 524 900 1354 2179 1591 -1882 -3931 -1540 -220 -293 3106 4188 -787 -3065 -1037
1399 -1037 -1915 -1879 2355 3640 911 98 174 -1316 -2162 -1098 1086 1674 942 1571 1485 -2335 -3989 -823
1417 -823 3 -431 3093 3660 -1102 -2674 -1074 -1843 -1388 2327 3408 1478 2 -556 -1240 -2046 -1321
1434 -1321 1481 2183 450 1171 1139 -2708 -3609 -172 191 -101 3031 2915 -1261 -2306 -1297 -1717 -641
$$ packed form
1321C918l007l061J008j38j565L393L168k809p54K302k730l312K155J689p83K105
1337A579K193j922l513j507O93J171J184K997J442m086l111J838l89j370M170
1352A369K620l444n48J920k672k335J909J510j20J300J401j126l447k086J679
1367b070J397L73L102J585m624k802J932n10p12M294J883l181n45R21k223j401
1383b581J566J539L76M54Q25n88l473k049K391J320p3L399J082m975k278K028
1399a037q78L6M234J285k729q13P6j490q46J064K184N88p32O29q6l820j654L166
1417h23Q26m34L524N67m762j572J600p69M55L715J081j930j476n58o84q06P25
1434a321K802P02j733P21l2l847r01L437L63k92L132j16m176j045J009m20J076
$$ plain form
1451 -641 2138 3153 1724 -303 -1145 -1166 -2081 -1265 2155 2382 76 886 695 -3155 -3110 378 352 192
1469 192 2716 2218 -1230 -2107 -1517 -1185 -180 1755 3132 2008 -767 -1467 -831 -2159 -1226 2651 2433
1486 2433 -148 681 97 -3300 -2566 583 598 769 2409 1461 -1126 -2148 -1648 -615 364 1459 3092
1503 3092 1887 -1326 -1487 -743 -2264 -748 3144 2222 -222 516 -510 -3369 -2099 611 947 1192
1519 1192 1882 1050 -975 -2463 -1709 134 488 1156 3198 1736 -1916 -1512 -596 -2120 -364 3076 1873
1536 1873 -87 296 -1033 -2835 -1627 524 1214 1494 1422 766 -926 -2699 -1528 603 507 1323 3367
1553 3367 988 -2421 -1368 -636 -1922 321 3130 1558 -219 -108 -1248 -2415 -1592 401 1767 1381
1569 1381 760 860 -859 -3176 -1357 1205 555 1377 3271 528 -2531 -1281 -675 -1351 834 2695
$$ packed form
1451f41K779J015j429k027q42k1r15Q16L420K27k306Q10j91l850M5L488k6j60
1469A92K524m98l448q77N90L32J005J935J377j124k775p00O36j328R33L877k18
1486B433k581Q29n84l397P34L149J5J71J640r48k587j022N00J033R79J095J633
1503C092j205l213j61P44j521J516L892r22k444P38j026k859J270K710L36K45
1519A192O90q32k025j488P54J843L54O68K042j462l652M04R16j524J756L440j203
1536A873j960L83j329j802J208K151O90K80p2o56j692j773J171K131r6Q16K044
1553C367k379l409J053P32j286K243K809j572j777J11j140j167Q23J993J366l86
1569A381o21J00j719k317J819K562o50Q22J894k743l059J250O06o76K185J861
$$ plain form
1585 2695 1361 -136 -715 -1329 -1715 -1344 387 1988 1117 394 932 -1093 -3273 -942 1252 401 1776
1602 1776 3064 -81 -2643 -1282 -701 -814 1263 2603 1273 -648 -1327 -1104 -1346 -1466 715 2319
1618 2319 579 22 1093 -1246 -3416 -477 1443 594 1953 2720 -448 -2552 -1647 -760 8 1503
1634 1503 2214 1339 -840 -1835 -968 -959 -1355 956 2318 185 2 1022 -1633 -3021 -176 1234 719
1651 719 2066 2409 -595 -2496 -1705 -479 461 1409 2220 1502 -1329 -2303 -569 -864 -1368 1474 2391 -231
1669 -231 -229 850 -1653 -2655 81 1261 1072 2029 1783 -480 -2333 -2029 -262 942 1204 2050 1394 -1754
1687 -1754 -2358 -407 -881 -1076 1914 2074 -495 -120 441 -1899 -2071 283 1325 1204 1629 1370 -476
1704 -476 -2418 -2007 347 1094 838 2167 1403 -2244 -2413 -236 -925 -776 2161 1965 -600 -348 -80 -1662
$$ packed form
1585B695j334j497n79o14l86L71J731J601q71p23N38k025k180K331K194q51J375
1602A776J288l145k562J361N81j13K077J340j330j921o79K23k42j20K181J604
1618B319j740n57J071k339k170K939J920q49J359P67l168k104R05Q87P68J495
1634A503P11q75k179r95Q67Rl96K311J362k133j83J020k655j388K845J410n15
1651G19J347L43l004j901P91J226R40R48Q11p18k831r74J734k95n04K842R17k622
1669b31KJ079k503j002K736J180j89R57k46k263j853L04J767J204K62Q46o56l148
1687a754o04J951m74j95K990J60k569L75N61k340j72K354J042j21M25k59j846
1704d76j942M11K354P47k56J329p64l647j69K177o89J49K937j96k565K52K68j582
$$ plain form
1722 -1662 -1620 426 1596 1559 1134 855 -338 -2466 -1896 800 1023 625 2234 1107 -2487 -2084 -157
1739 -157 -1047 -277 2324 1693 -411 -511 -523 -1501 -1226 514 1931 1485 477 659 -290 -2657 -1535 1348
1757 1348 857 461 2230 702 -2642 -1916 -338 -889 124 2185 1567 -219 -862 -942 -1132 -982 532
1774 532 2312 1548 -82 382 -425 -2626 -1089 1667 760 502 2028 264 -2457 -1603 -418 -663 368
1791 368 2053 1581 -200 -1248 -1077 -843 -1070 691 2726 1240 -496 344 -630 -2669 -575 1815 554
1808 554 487 1707 -99 -2249 -1445 -437 -333 553 1691 1674 -110 -1736 -1067 -551 -950 995 2948 983
1826 983 -698 172 -910 -2443 -45 1764 633 568 1160 -447 -1955 -1381 -408 150 541 1372 1671 -312
1844 -312 -1936 -819 -428 -1052 1219 3000 636 -784 65 -1192 -2129 207 1758 858 634 694 -578
$$ packed form
1722a662M2K046J170l7m25k79j193k128N70K696K23l98J609j127l594M03J927
1739a57q90P70K601o31k104j00j2r78K75J740J417m46j008J82r49k367J122K883
1757A348m91l96J769j528l344P26J578n51J013K061o18j786o43q0j90J50J514
1774E32J780p64j630M64q07k201J537K756r07k58J526j764k721Q54J185k45J031
1791C68J685m72j781j048J71K34k27J761K035j486j736Q40r74k039K094K390j261
1808E54o7J220j806k150Q04J008J04Q86J138j7j784j626O69N16l99J945J953j965
1826I83j681Q70j082j533K398J809j131o5N92j607j508N74R73N58L91Q31K99j983
1844c12j624J117L91o24K271J781k364j420Q49j257r37K336J551r00k24O0j272
$$ plain form
1861 -578 -1786 -1545 -183 647 426 1196 1635 -671 -2136 -579 -385 -860 1485 2834 386 -758 -132
1878 -132 -1313 -1685 413 1624 1080 523 203 -605 -1697 -1698 155 1002 300 1062 1492 -1122 -2154 -334
1896 -334 -351 -708 1727 2461 179 -629 -472 -1282 -1314 389 1565 1461 476 -202 -516 -1639 -1833 501 1259
1915 1259 174 1085 1262 -1356 -1975 -160 -220 -247 1760 1955 121 -591 -728 -1125 -888 324 1555 1524
1933 1524 100 -452 -427 -1834 -1649 788 1199 144 1112 840 -1699 -1823 -55 -142 226 1744 1606 184
1951 184 -750 -918 -795 -524 222 1669 1553 -234 -559 -353 -1844 -1511 1022 1144 254 976 415 -1701
1969 -1701 -1427 -158 96 670 1559 1297 185 -912 -1160 -461 -320 153 1756 1446 -566 -632 -517 -2014
1987 -2014 -1075 1206 1082 350 901 -72 -1666 -1240 -226 346 932 1271 1135 270 -1252 -1149 -129 -331
$$ packed form
1861e78j208K41J362Q30k21P70M39k306j465J557J94m75K345J349k448j144O26
1878a32j181l72K098J211n44n57l20q08j092jJ853Q47p02P62M30k614j032J820
1896c34j7l57K435P34k282q08J57q10l2J703J176j04r85o78l14j123j94K334P58
1915A259j085R11J77k618o19J815o0k7K007J95j834p12j37l97K37J212J231l1
1933A524j424n52K5j407J85K437M11j055R68k72k539j24J768q7L68J518j38j422
1951A84r34j68J23K71P46J447j16j787l25K06j491L33K533J22q90P22n61k116
1969a701K74J269K54N74Q89k62j112j097k48O99J41M73J603l10k012o6J15j497
1987b014R39K281j24p32N51r73j594M26J014N72N86L39j36q65j522J03J020k02
$$ plain form
2005 -331 243 1953 1127 -895 -587 -708 -1887 -691 1255 1040 525 642 -392 -1358 -1109 -288 691 1113
2023 1113 995 1109 163 -1467 -1179 -16 -341 491 1993 872 -892 -602 -897 -1551 -170 1198 949
2040 949 607 287 -556 -1034 -1054 -227 1023 1031 692 1112 100 -1646 -890 93 -274 652 1970 584 -969
2059 -969 -729 -1154 -1293 49 1109 1081 634 -122 -625 -761 -1025 -134 1247 861 554 1091 -130 -1716 -800
2078 -800 15 -272 916 1741 291 -798 -950 -1333 -915 371 1003 1114 465 -587 -669 -676 -982 231 1428
2097 1428 613 446 1049 -468 -1604 -518 -29 -28 1186 1517 206 -786 -1217 -1345 -497 404 1047 1415 241
2116 241 -940 -605 -628 -964 551 1432 416 443 757 -761 -1375 -405 -182 182 1282 1106 194 -665 -1452
2135 -1452 -1283 -153 447 1091 1430 -6 -1123 -527 -752 -750 846 1326 329 483 423 -851 -989 -339 -84
$$ packed form
2005c31N74J710q26k022L08j21j179J196J946k15n15J17j034r66K49Q21R79M22
2023A113j18J14r46j630K88J163l25Q32J502j121j764K90k95o54J381J368k49
2040I49l42l20q43m78k0Q27J250Ql39M20j012j746P56R83l67R26J318j386j553
2059i69K40m25j39J342J060k8m47p56n03j36k64Q91J381l86l07N37j221j586R16
2078h00Q15k87J188Q25j450j089j52l83M18J286O32J11o49j052q2pl06J213J197
2097A428q15j67O03j517j136J086M89JJ214L31j311r92m31j28Q48R01O43L68j174
2116B41j181L35k3l36J515Q81j016K7L14j518o14R70K23L64J100j76r12q59p87
2135a452J69J130O00O44L39j436j117N96k25KJ596M80r97J54o0j274j38O50K55
$$ plain form
2154 -84 488 1139 872 262 -703 -1722 -977 8 325 1238 1441 -304 -1160 -568 -886 -571 1090 1164 327 459
2174 459 41 -882 -721 -372 -96 832 940 577 225 -821 -1647 -691 65 242 1293 1200 -554 -1034 -576
2193 -576 -920 -201 1287 1040 426 454 -345 -822 -543 -327 238 922 695 397 273 -1064 -1538 -366 49
2212 49 288 1426 1028 -678 -885 -726 -969 93 1169 874 698 235 -682 -648 -460 -338 492 1103 378
2231 378 304 111 -1302 -1244 -111 -27 438 1420 603 -721 -708 -920 -792 367 1083 936 776 4 -852 -481
2251 -481 -499 -270 903 1029 177 265 -194 -1437 -945 -21 -21 618 1227 281 -562 -605 -949 -568 596 865 994
2272 994 855 -306 -900 -487 -598 -135 1118 856 97 294 -509 -1445 -663 11 20 786 1008 6 -422 -743
2292 -743 -1012 -240 651 804 1136 826 -508 -740 -405 -716 67 1295 618 157 187 -805 -1308 -369 68 222
$$ packed form
2154h4N72O51k67o10r65j019P45R85L17R13K03j745q56N92l18L15J661P4q37J32
2174D59m18r23J61L49K76R28J08l63l52j046q26R56P56J77J051r3j754m80M58
2193e76l44P19J488k47o14K8p99m77K79K16N65O84k27k98j24j337m74J172M15
2212D9K39J138l98j706k07J59k43J062J076k95j76m63r17L4J88J22Q30O11p25
2231C78p4j93j413N8J133Q4M65R82q17j324J3k12J28J159P16j47j60p72q56L71
2251d81j8K29J173J26q52Q8m59j243M92R24%O39O09r46q43m3l44L81J164K69J29
2272I94j39j161n94M13j11M63J253k62p59J97q03r36P82O74RP66K22j002m28l21
2292g43k69P72Q91J53L32l10j334k32L35l11P83J228o77m61L0r92n03R39M37J54
$$ plain form
2312 222 978 700 -179 -368 -810 -928 133 581 679 1127 472 -746 -654 -479 -714 414 1213 456 168 -20
2332 -20 -1086 -1079 -179 -76 456 889 438 -199 -349 -946 -708 336 553 721 1139 128 -736 -504 -563 -515 679
2353 679 1095 343 268 -253 -1233 -806 -312 -27 740 918 88 -168 -447 -1088 -435 489 544 818 1053 -153
2373 -153 -741 -477 -697 -257 826 758 337 339 -559 -1133 -581 -209 31 892 775 22 -87 -633 -1061 -141 479
2394 479 488 1070 844 -444 -577 -460 -690 62 912 604 418 219 -795 -990 -364 -337 184 992 525 -39
2414 -39 -156 -848 -962 53 427 550 1061 546 -527 -493 -571 -652 354 875 417 495 113 -914 -727 -292
2434 -292 -290 412 963 316 -8 -172 -976 -698 213 348 735 1157 171 -548 -422 -670 -460 594 738 396
2454 396 510 -200 -1019 -587 -324 -238 623 836 173 48 -415 -1113 -416 224 267 837 1020 -77 -455 -312
$$ packed form
2312B22P56k78q79j89m42j18J061M48R8M48o55j218R2J75k35J128P99p57k88j88
2332b0j066PR00J03N32M33m51o37j50n97K38J044K17J68M18j011q64K32n9M8J194
2353F79M16p52p5n21r80M27M94K85P67J78q30k56k79o41O53R24N5K74K35j206
2373a53n88K64k20M40J083o8m21Kq98n74N52L72K40Q61j17p53j09n46m28R20O20
2394D79RN82k26j288j33J17k30P52Q50l08j86j99j014j95O26K7N21Q08m67n64
2414c9j17o92j14J015L74J23N11n15j073L4p8q1J006N21m58P8l82j027J87M35
2434b92KP02N51o47l24j64q04K78R11J35L87M22r86p19J26k48K10J054J44l42
2454C96J14p10q19M32K63Q6Q61K13o63j25m63o98O97O40M3N70J83j097l78J43
$$ plain form
2474 -312 -806 -282 795 632 414 410 -446 -971 -505 -435 -42 783 579 151 121 -584 -1043 -178 236 311 1065
2495 1065 829 -246 -355 -444 -792 10 745 506 454 302 -633 -822 -522 -502 156 774 363 143 12 -871
2515 -871 -920 14 135 421 1059 509 -340 -250 -479 -716 224 731 451 534 121 -741 -592 -584 -483 408 798 163
2537 163 287 -85 -975 -619 143 106 652 1125 250 -342 -288 -566 -490 400 528 477 545 -200 -694 -549 -685 -329
2559 -329 629 603 110 279 -337 -1046 -406 187 116 773 947 44 -291 -287 -597 -199 435 411 597 470 -471 -548
2581 -548 -382 -727 -119 871 481 132 349 -488 -1061 -231 151 279 923 769 -98 -309 -501 -599 22 339
2601 339 356 690 176 -685 -402 -403 -746 57 811 284 206 333 -724 -919 -70 174 453 979 536 -109 -261
2622 -261 -702 -488 328 314 389 758 24 -784 -259 -492 -711 320 771 220 334 141 -701 -684 -96 120 617
$$ packed form
2474c12m94N24J077j63k18mq56n25M66P0L93Q25k04m28l0p05m59Q65M14P5P54
2495A065k36j075j09q9l48Q02P35k39n2j52r35j89L00K0O58O18m11k20j31q83
2515h71m9R34J21K86O38n50q49R0k29k37R40N07k80Q3m13q62J49QJ01Q91L90o35
2537A63J24l72q90L56P62l7N46M73q75n92N4k78P6Q90J28n1O8p45m94J45j36L56
2559c29R58k6m93J69o16p09O40N93p1O57J74r03l35Ml10L98O34k4J86j27r41p7
2581e48J66l45O08R90l90l49K17q37n73Q30L82J28O44j54q67k11j92r8O21L17
2601C39J7L34n14q61K83jl43Q03P54n27p8J27j057j95Q49K44K79N26m43o45j52
2622b61m41K14Q16j4P5L69p34q08N25k33k19J031M51n51J14j93q42J7N88K16M97
$$ plain form
2643 617 908 308 -37 -320 -782 -240 410 180 469 656 -278 -699 -262 -552 -544 524 653 179 310 -90
2663 -90 -723 -450 -187 175 854 627 212 104 -501 -808 -67 386 122 613 630 -483 -563 -192 -582 -354 600
2684 600 510 216 209 -340 -586 -334 -240 295 856 510 153 83 -636 -795 155 276 157 720 469 -591 -528 -307
2706 -307 -576 -66 499 392 312 7 -520 -482 -344 -289 547 887 272 282 172 -826 -645 299 249 302 797 287
2728 287 -587 -471 -432 -470 129 485 408 366 -101 -583 -276 -352 -183 698 828 80 206 103 -844 -468 328 138
2750 138 349 769 73 -504 -548 -498 -325 191 400 375 324 -405 -599 -134 -427 -184 911 631 17 250 -82
2771 -82 -826 -272 353 211 515 597 -65 -386 -635 -617 -70 304 292 488 281 -633 -530 -83 -390 128 934
2792 934 533 51 245 -219 -686 -153 210 284 497 334 -157 -383 -678 -585 122 202 203 621 161 -754 -348 -61
$$ packed form
2643F17K91o00l45k83m62N42O50k30K89J87r34m21M37k90QJ068J29m74J31m00
2663i0o33K73K63L62O79k27m15j08o05l07P41M53k64M91J7j113q0L71l90K28R54
2684F00r0k94pn49k46K52R4N35N61l46l57p0p19j59R50J21j19N63k51j060O3K21
2706c07k69N10N65j07q0l05n27L8J38N5Q36L40o15J0j10r98J81R44n0N3M95n10
2728B87q74J16L9l8N99L56p7m2m67m82L07p6J69Q81J30p48J26j03r47L76P96j90
2750A38K11M20o96n77m4N0J73N16K09k5n1p29j94M65k93K43J095k80o14K33l32
2771h2p44N54O25j42L04Q2o62l21k49J8N47L74j2J96k07r14J03M47l07N18Q06
2792I34m01m82J94m64m67N33L63P4K13j63m91k26k95R3P07Q0JM18m60r15M06K87
$$ plain form
2814 -61 -433 240 944 341 61 162 -348 -632 -94 252 441 552 102 -86 -303 -822 -425 314 117 246
2834 246 632 -78 -742 -224 -103 -362 434 863 276 122 35 -486 -440 -98 168 604 408 -27 -86 -388 -888
2855 -888 -249 386 35 284 666 -152 -697 -144 -238 -209 560 732 279 126 -213 -443 -272 -110 214 715 314
2876 314 -135 21 -405 -894 -44 406 -25 320 611 -346 -548 -161 -186 49 559 565 246 111 -305 -322 -215
2897 -215 -227 314 745 139 -212 104 -639 -878 148 385 50 406 372 -411 -469 -175 -192 169 414 464 461 7
2919 7 -486 -200 -175 -289 505 802 -22 -172 31 -688 -702 292 336 138 379 204 -456 -357 -275 14 320 306 432
2942 432 358 -170 -520 -74 -233 -267 640 698 -177 -120 -62 -763 -525 299 323 266 371 -25 -345 -424 -343 84 379
2965 379 276 491 416 -443 -460 55 -294 -148 759 635 -187 -91 -197 -713 -315 202 279 353 242 -77 -236 -488
$$ packed form
2814f1l72O73P04o03k80J01n10k84N38L46J89J11m50j88k17n19L97P39j97J29
2834B46L86p10o64N18J21k59P96M29n87j54q7n21M6L42K66M36j96m35n9l02n00
2855h88O39O35l51K49L82q18n45N53r4K9P69J72m53j53l39k30J71J62L24N01m01
2876C14m49J56m26m89Q50M50m31L45K91r57k02L87k5K35N10Ol19j35m16j7J07
2897b15j2N41M31o06l51L16p43k39J026K37l35L56l4p83n8K94j7L61K45N0lm54
2919Gm93K86K5j14P94K97q24j50K03p19j4R94M4j98K41j75o60R9Q2K89L06j4J26
2942D32p4n28l50M46j59l4R07N8q75N7N8p01K38Q24K4n7J05l96l20p9Q1M27K95
2965C79j03K15p5q59j7N15l49J46R07j24q22R6j06n16L98N17P7P4j11l19j59k52
$$ plain form
2987 -488 -378 293 406 136 531 339 -536 -370 161 -273 -27 740 426 -155 -111 -352 -655 -222 178 345
3007 345 377 72 -158 -218 -540 -355 473 351 114 617 146 -617 -342 31 -256 161 689 308 -146 -217 -387
3028 -387 -446 -183 64 447 342 -166 -60 -177 -658 -256 513 249 148 607 25 -619 -185 39 -139 298
3048 298 577 226 -88 -316 -384 -195 -177 27 546 280 -200 -44 -184 -732 -60 581 237 235 590 -49 -508
3069 -508 -189 -72 5 351 420 221 -91 -494 -359 -192 -269 175 609 100 -341 -11 -243 -679 111 507 159
3090 159 265 425 -141 -484 -185 15 149 294 295 221 -108 -628 -364 -99 -257 182 693 -1 -327 15 -307
3111 -307 -543 231 510 189 350 297 -211 -377 -241 32 311 294 292 274 -255 -699 -220 -32 -291 283 657 -156
3133 -156 -239 51 -400 -518 272 451 276 356 145 -181 -319 -339 28 379 136 153 294 -418 -683 -11 -58 -262
$$ packed form
2987d88J10O71J13k70L95j92q75J66N31m34K46P67l14n81M4k41l03M33M00J67
3007C45L2l05k30o0l22J85Q28j22k37N03m71p63K75L73k87M17N28l81m54p1j70
3028c87n9K63K47L83j05n08J06j17m81M02P69k64j01M59n82o44M34K24j78M37
3048B98K79l51l14k28o8J89J8K04N19k66m80J56j40n48O72O41l44kL55o39m59
3069e08L19J17P7L46O9j99l12m03J35J67p7M44M34n09m41L30k32m36P90L96l48
3090A59J06J60n66l43K99K00J34J45Jp4l29n20K64K65j58M39N11o94l26L42l22
3111c07k36P74K79l21J61n3n08j66J36K73K79j7kj8n29m44M79J88k59N74L74q13
3133a56q3K90m51j18P90J79j75Q0k11l26j38k0L67L51k43J7J41p12k65O72m7k04
$$ plain form
3155 -262 453 549 -187 -258 -12 -363 -173 273 423 387 297 -1 -129 -296 -433 211 420 45 196 341 -517
3176 -517 -567 12 -116 -108 478 397 -191 -262 -165 -379 -122 227 406 467 48 -119 15 -313 -427 312 452 -23
3198 -23 279 205 -625 -515 54 -80 22 546 316 -99 -174 -311 -273 -1 226 467 512 -27 -210 7 -402 -358
3220 -358 483 340 -43 331 84 -676 -448 20 -91 69 417 222 -50 -307 -372 -117 32 43 535 429 -195
3241 -195 -122 31 -484 -210 493 271 21 331 5 -552 -376 -84 -39 171 293 205 -24 -359 -317 53 45 60
3263 60 647 378 -260 -1 56 -487 -137 567 223 -32 255 -173 -479 -315 -116 97 227 144 142 -33 -493 -319
$$ packed form
3155b62P15R6p36p1K46l51J90M46J50l6r0k98j28j67j37O44K09l75J51J45q58
3176e17n0N79j28QN86q1n88p1R7k14K57L49J79O1m19j67J34l28j14P39J40m75
3198b3L02p4q30J10N69j34J02N24k30m15p5j37L8K72K27K41M5n39j83K17m09M4
3220c58Q41j43l83L74k47p60K28M68j11J60L48j95k72k57o5K55J49J1M92j06o24
3241a95P3J53n15K74P03k22k50L10l26n57J76K92M5K10J22q8k29l35M2L70qJ5
3263F0N87k69o38K59N7n43L50P04l44k55K87m28l06J64J99K13J30q3kj75m60J74
$$ [...]
8191b5
##END NTUPLES=NMR FID
##END=
