##TITLE=1H_BAU 9-2021
 CDCl3,8 sc, 
 10.03.2021
##JCAMPDX= 6.0         $$ Bruker NMR JCAMP-DX V2.0
##DATA TYPE= NMR FID
##DATA CLASS= NTUPLES
##ORIGIN= UXNMR, Bruker Analytische Messtechnik GmbH
##OWNER= root
$$ XWIN-NMR		Version 3.5
$$ Wed Mar 10 10:22:08 2021 Russian Standard Time (UT+4h)  she@DPX200
##.OBSERVE FREQUENCY= 200.131506
##.OBSERVE NUCLEUS= ^1H
##.DELAY= (6, 6)
##.ACQUISITION MODE= SIMULTANEOUS
##.ACQUISITION SCHEME= undefined
##.AVERAGES= 8
##.DIGITISER RES= 18
##SPECTROMETER/DATA SYSTEM= spect
##.PULSE SEQUENCE= zg30
##.SOLVENT NAME= CDCl3
##.SHIFT REFERENCE= (INTERNAL, CDCl3, 0, 15.7039)
##AUDIT TRAIL= $$ (NUMBER, WHEN, WHO, WHERE, WHAT)
$$ ##TITLE= Audit trail, XWIN-NMR		Version 3.5
$$ ##JCAMPDX= 5.01
$$ ##ORIGIN= Bruker BioSpin GmbH
$$ ##OWNER= she
$$ F:/spectra/data/she/nmr/H-F/1/audita.txt
$$ ##AUDIT TRAIL=  $$ (NUMBER, WHEN, WHO, WHERE, WHAT)
(   1,<2021-03-10 10:20:31.31 +0400>,<she>,<DPX200>,
      <created by zg, POWCHK disabled, PULCHK disabled
       configuration hash MD5:
       00 E9 B6 7A A2 85 ED C7 34 08 36 98 17 FE 4E 26
       data hash MD5: 16K
       A9 10 13 0F 02 0F 31 98 CE 02 D9 91 84 07 36 34>)
$$ ##END=
$$ 
$$ hash MD5
$$ 55 82 D0 DB BE C8 AF B8 87 7C 5F A5 41 41 38 AE
##$RELAX= 
##$RELAX= 
##$RELAX= 
##$RELAX= 
##$RELAX= 
##$RELAX= 
$$ Bruker specific parameters
$$ --------------------------
##$DU= <F:/spectra>
##$EXPNO= 1
##$NAME= <H-F>
##$PROCNO= 1
##$TYPE= <nmr>
##$USER= <she>
##$AMP= (0..31)
100 100 100 100 100 100 100 100 100 100 100 100 100 100 100 100 100 100 
100 100 100 100 100 100 100 100 100 100 100 100 100 100 
##$AQSEQ= 0
##$AQ_mod= 1
##$AUNM= <au_zg>
##$AUTOPOS= <>
##$BF1= 200.13
##$BF2= 200.13
##$BF3= 200.13
##$BF4= 200.13
##$BF5= 200.13
##$BF6= 200.13
##$BF7= 200.13
##$BF8= 200.13
##$BYTORDA= 1
##$CFDGTYP= 0
##$CFRGTYP= 5
##$CHEMSTR= <none>
##$CNST= (0..31)
1 1 145 1 1 1 1 1 1 1 1 1 1 1 1 1 1 1 1 1 1 1 1 1 1 1 1 1 1 1 1 1 
##$CPDPRG= <>
##$CPDPRG1= <>
##$CPDPRG2= <>
##$CPDPRG3= <>
##$CPDPRG4= <mlev>
##$CPDPRG5= <mlev>
##$CPDPRG6= <mlev>
##$CPDPRG7= <mlev>
##$CPDPRG8= <mlev>
##$CPDPRGB= <>
##$CPDPRGT= <>
##$D= (0..31)
0 1.2 0 0 0 0 0 0 0 0.06 0 0.03 0 0 0 0 0.0002 0 0 0 0 0 0 0 0 0 0 0 0 
0 0 0 
##$DATE= 1615357230
##$DBL= (0..7)
120 120 120 120 120 120 120 120 
##$DBP= (0..7)
150 150 150 150 150 150 150 150 
##$DBP07= 0
##$DBPNAM0= <>
##$DBPNAM1= <>
##$DBPNAM2= <>
##$DBPNAM3= <>
##$DBPNAM4= <>
##$DBPNAM5= <>
##$DBPNAM6= <>
##$DBPNAM7= <>
##$DBPOAL= (0..7)
0.5 0.5 0.5 0.5 0.5 0.5 0.5 0.5 
##$DBPOFFS= (0..7)
0 0 0 0 0 0 0 0 
##$DE= 6
##$DECBNUC= <off>
##$DECIM= 32
##$DECNUC= <off>
##$DECSTAT= 4
##$DIGMOD= 1
##$DIGTYP= 9
##$DL= (0..7)
0 120 120 120 120 120 120 120 
##$DP= (0..7)
150 150 150 150 150 150 150 150 
##$DP07= 0
##$DPNAME0= <>
##$DPNAME1= <>
##$DPNAME2= <>
##$DPNAME3= <>
##$DPNAME4= <>
##$DPNAME5= <>
##$DPNAME6= <>
##$DPNAME7= <>
##$DPOAL= (0..7)
0.5 0.5 0.5 0.5 0.5 0.5 0.5 0.5 
##$DPOFFS= (0..7)
0 0 0 0 0 0 0 0 
##$DQDMODE= 0
##$DR= 18
##$DS= 0
##$DSLIST= <SSSSSSSSSSSSSSS>
$$ [...]
##$SUBNAM2= <"">
##$SUBNAM3= <"">
##$SUBNAM4= <"">
##$SUBNAM5= <"">
##$SUBNAM6= <"">
##$SUBNAM7= <"">
##$SUBNAM8= <"">
##$SUBNAM9= <"">
##$SW= 16.9725357007746
##$SWIBOX= (0..15)
0 0 2 0 0 0 0 0 0 0 0 0 0 0 0 0 
##$SW_h= 3396.73913043478
##$TD= 16384
##$TD0= 1
##$TE= 0
##$TE2= 300
##$TE3= 300
##$TEG= 300
##$TL= (0..7)
0 120 120 120 120 120 120 120 
##$TP= (0..7)
150 150 150 150 150 150 150 150 
##$TP07= 0
##$TPNAME0= <>
##$TPNAME1= <>
##$TPNAME2= <>
##$TPNAME3= <>
##$TPNAME4= <>
##$TPNAME5= <>
##$TPNAME6= <>
##$TPNAME7= <>
##$TPOAL= (0..7)
0.5 0.5 0.5 0.5 0.5 0.5 0.5 0.5 
##$TPOFFS= (0..7)
0 0 0 0 0 0 0 0 
##$TUNHIN= 0
##$TUNHOUT= 0
##$TUNXOUT= 0
##$USERA1= <user>
##$USERA2= <user>
##$USERA3= <user>
##$USERA4= <user>
##$USERA5= <user>
##$V9= 5
##$VALIST= <valist>
##$VCLIST= <CCCCCCCCCCCCCCC>
##$VD= 0
##$VDLIST= <DDDDDDDDDDDDDDD>
##$VPLIST= <PPPPPPPPPPPPPPP>
##$VTLIST= <TTTTTTTTTTTTTTT>
##$WBST= 1024
##$WBSW= 4
##$XGAIN= (0..3)
0 0 0 0 
##$XL= 0
##$YL= 0
##$YMAX_a= 864438
##$YMIN_a= -798426
##$ZGOPTNS= <>
##$ZL1= 120
##$ZL2= 120
##$ZL3= 120
##$ZL4= 120
##$ABSF1= 10
##$ABSF2= 0
##$ABSG= 5
##$ABSL= 3
##$ALPHA= 0
##$AQORDER= 0
##$ASSFAC= 0
##$ASSFACI= 0
##$ASSFACX= 0
##$ASSWID= 0
##$AUNMP= <proc_1d>
##$AZFE= 0.1
##$AZFW= 0.1
##$BCFW= 1
##$BC_mod= 2
##$BYTORDP= 1
##$COROFFS= 0
##$CY= 11.3945322036743
##$DATMOD= 1
##$DC= 2
##$DFILT= <>
##$DTYPP= 0
##$F1P= 15.9154993809931
##$F2P= -4.1035820241983
##$FCOR= 0.5
##$FTSIZE= 0
##$FT_mod= 4
##$GAMMA= 1
##$GB= 0.15
##$INTBC= 1
##$INTSCL= 1
##$ISEN= 128
##$LB= 0.24
##$LEV0= 0
##$LPBIN= 0
##$MAXI= 10000
##$MC2= 0
##$MEAN= 0
##$ME_mod= 0
##$MI= 1.114404
##$NCOEF= 0
##$NC_proc= 0
##$NLEV= 6
##$NOISF1= 3.799351
##$NOISF2= 2.8
##$NSP= 1
##$NTH_PI= 0
##$NZP= 0
##$OFFSET= 15.70392
##$PC= 1
##$PHC0= -11117.36
##$PHC1= 9.40094
##$PH_mod= 1
##$PKNL= yes
##$PPARMOD= 0
##$PSCAL= 0
##$PSIGN= 0
##$REVERSE= no
##$SF= 200.130013532006
##$SI= 16384
##$SIGF1= 3
##$SIGF2= 2
##$SINO= 400
##$SIOLD= 16384
##$SREGLST= <1H.CDCl3>
##$SSB= 0
##$STSI= 0
##$STSR= 0
##$SW_p= 3612.71676300578
##$SYMM= 0
##$S_DEV= 0
##$TDeff= 0
##$TDoff= 0
##$TI= <>
##$TILT= no
##$TM1= 0
##$TM2= 0
##$TOPLEV= 0
##$USERP1= <user>
##$USERP2= <user>
##$USERP3= <user>
##$USERP4= <user>
##$USERP5= <user>
##$WDW= 1
##$XDIM= 8192
##$YMAX_p= 0
##$YMIN_p= 0
$$ End of Bruker specific parameters
$$ ---------------------------------
##NTUPLES= NMR FID
##VAR_NAME=  TIME,          FID/REAL,        FID/IMAG
##SYMBOL=    X,             R,               I
##VAR_TYPE=  INDEPENDENT,   DEPENDENT,       DEPENDENT
##VAR_FORM=  AFFN,          ASDF,            ASDF
##VAR_DIM=   8192,          8192,            8192
##UNITS=     SECONDS,       ARBITRARY UNITS, ARBITRARY UNITS
##FACTOR=    0.0002944,     1,               1
##FIRST=     0,             0,               0
##LAST=      2.4114304,     0,               0
##MIN=       0,             -798426,         0
##MAX=       2.4114304,     864438,          0
$$ Real data points
##PAGE= N=1
##DATA TABLE= (X++(R..R)), XYDATA
$$ [...]
2218c90k51J620l406N092l342K36Q98j702K586j600n54J252r89O86R62l011L350
2235A437k656R32J691l733M095k966R53J342k885K864j415o13K011j627N89J186
2251A205l054L762k373K68J715m047M807k884M35Q89k647L459j089j031J281j785
2267a089J476R29l061L276k760J401K273n480M700k866J373K106m670L203o47
2282A64p08K535l575N59L079l606L764l365l50L920m126L691l854J190K417k787
2298a052K338k307k04L314k792P30M76l320N918l757n67K880m970O406l289j192
2314a388K477l218M034j242k610K870j631J052J770n122M162j612M06K503n802
2329c351M922j868j15K501m756L482j57j336K221l300J293K662l972L964l725
$$ plain form
2218 -390 -641 979 -2427 2665 -677 -441 457 -1245 1341 -259 -813 439 -550 136 1098 -1913 1437
2235 1437 -1219 -287 1404 -2329 1766 -1200 -247 1095 -1790 1074 -341 -954 1057 -570 19 1205
2251 1205 -1849 1913 -460 -192 1523 -2524 2283 -601 -166 723 -1924 1535 446 -585 696 -1089
2267 -1089 387 1316 -1745 1531 -1229 172 2445 -3035 1665 -1201 172 2278 -2392 811 164
2282 164 -544 1991 -1584 -1025 2054 -1552 2212 -1153 -1503 2417 -1709 1982 -1872 -682 1735 -1052
2298 -1052 1286 -1021 -1225 2089 -703 27 503 -2817 3101 -656 -1223 1657 -3313 3093 -196 -1388
2314 -1388 1089 -2129 1905 663 -1947 923 -708 344 2114 -3008 1154 -458 -52 2451 -3351
2329 -3351 1571 -297 -412 2089 -2667 815 658 -678 1543 -1757 -464 2198 -1774 2190 -1535
2344a535K12M587n483M169k959j78M101m365K268r43j199L886l204M8J780l563
2360b378M764k489j389L708n195N587k721j603L823m121L677o13l299L563j810
2375d96N4K708n241M126r53j621L984n619M254j277q29L051m535L226j36k042
2391a346L102k989N96K963m926M270k117j317N161n885M145j901j812N055m681
2406a682K520l59k485M102k596m93K762m018M430j883k386M802n294M418j280
2421E58k757M370l759K415J73k816L188j264p19K942n009L711m83k058M319n716
2437b905L897k56k122L626m438K762N98k580K395j619l31L356m389L149j390j797
2453b044N310o097L493o16k170N008m769J277J600k685L353j968j486M033l715
$$ plain form
2344 -1535 -1323 3264 -2219 1950 -1009 -1187 2914 -1451 817 -126 -1325 2561 -643 -595 1185 -2378
2360 -2378 2386 -103 -1492 2216 -2979 2608 -113 -1716 2107 -2014 1663 1050 -2249 1314 -496
2375 -496 -442 2266 -2975 1151 198 -1423 2561 -3058 1196 -81 -910 2141 -2394 832 696 -1346
2391 -1346 1756 -1233 -637 2326 -2600 1670 -447 -1764 3397 -2488 1657 -244 -2056 2999 -1682
2406 -1682 838 479 -2006 2096 -500 -993 1769 -2249 2181 298 -2088 2714 -2580 1838 558
2421 558 -2199 2171 -1588 827 1000 -1816 1372 108 -611 2331 -2678 1033 550 -1508 2811 -2905
2437 -2905 992 736 -1386 2240 -2198 564 1162 -1418 977 -642 -973 2383 -2006 1143 -247 -2044
2453 -2044 3266 -2831 662 46 -2124 2884 -1885 -608 992 -1693 1660 -308 -1794 2239 -1476
2468a476K152j3l162M930l892K248n17k206L939k938J560m08j942L593j597j230
2484i59K472l715L841o00l315M736m663M010o15l688L939k497J947P72l767K459
2500C57M35j385K784m649K496J735l085L439m577K769J143k144J780l086J973
2515a5J667j996N90j486P15L136l823J117n09q63N110n615J439Q57j782M634m296
2532a120m65J790q32K044j259k753L568p65J006j046l282M750k014K022j948k772
2548c076M833j152R3j011k440L657J238k995J066k248K418K516m223J365k366
2563b325L741M94k995Q85j772L802L36l815J029K95P75K859n569N28L324j935
2579c43L269n009K98L279q10R41l750P91K257P86q16k776M2L756r29l59j783j920
$$ plain form
2468 -1476 676 663 -2499 2431 -1461 787 270 -1936 2003 -935 625 217 -1725 1868 271 -959
2484 -959 1513 -2202 1639 1039 -2276 2460 -2203 1807 1192 -2496 1443 -1054 893 1665 -2102 357
2500 357 792 -593 2191 -2458 38 1773 -1312 2127 -2450 319 1462 -682 1098 -1988 -15
2515 -15 1652 -344 246 -1240 -525 2611 -1212 -95 -604 -1467 3643 -1972 -533 324 -1458 3176 -1120
2532 -1120 -1585 205 -627 1417 158 -2595 973 208 1214 168 -3114 1636 -378 1644 -304 -3076
2548 -3076 1757 605 698 -313 -2753 904 2142 -853 213 -2035 383 2899 -1324 41 -2325
2563 -2325 1416 1910 -1085 -200 -1972 1830 2166 -1649 -620 -325 450 3309 -2260 -1732 1592 -343
2579 -343 2926 -2083 -1785 1494 684 1625 -2125 -1334 923 1709 893 -1883 -1841 1915 986 627 -1156 -3076
2597c076O309k628q87o84j460N344j785k073m49N85K348j95k862KR58K389m90
2614A346l820K798j667L720r08m519L309l94J504k11l562J068K940p87r6k505
2630a784K57L347j316K51l182K366J661j115N59m014L113K136k134m67o69J55
2646h36L511k128k097J709j111L440k041j577L55P30K293k715j22k99J111J826
2662B049k258j468K008k31J226m47l914M162j013M81J48k984K809j43L51j390
2678f14o58J676K77l50n28j178J640J200k590J873k510K090J398l111J741j523
2694a167J234R54j214o60R02j13P76p65q50J233j035K059k404P73Q68j226K116
2711A481k685J098O68j066J302p01r43J805j273K59J048k428K705j928M79J167
$$ plain form
2597 -3076 3233 605 -282 -966 -2426 2918 1133 -940 -1389 -804 1544 1349 -1513 -1511 -553 1836 1346
2614 1346 -2474 324 -1343 2377 1469 -3050 259 -135 1369 1158 -2404 -1336 1604 817 721 -1784
2630 -1784 -1527 1820 504 755 -2427 -61 1600 485 1044 -2970 143 2279 145 -322 -991 -836
2646 -836 2675 547 -1550 159 -952 2488 447 -1130 -775 -45 2248 -467 -589 -888 223 2049
2662 2049 -209 -1677 331 100 1326 879 -3035 1127 114 595 743 -2241 568 425 776 -614
2678 -614 -1272 404 681 331 -197 -1375 265 1465 -1125 748 -1762 328 1726 -1385 356 -1167
2694 -1167 67 1021 -193 -853 49 -64 712 -53 -903 330 -705 1354 -1050 -277 591 -635 1481
2711 1481 -1204 -106 562 -504 798 97 -846 959 -314 -55 993 -1435 1270 -658 -179 988
2727I88j946K165j789P81K69p99N05j21m48R35n28l47R49j641K383k161N20P94
2745E09j411K601k539P03M82o24R76p37r35J218l62N0Q42k662K872j153J86Q15
2763H31k735K870r53o0o4q42R93Q15j121k9k65K74J692k117R20j411J530J271
2781A599k957K135k181J779J072k758Q77L78l62K180k196q93K624k126K288j892
2797d33j070K838j354J271k105P3J205K16L88j780j38J852o52l93M33k438L983
2814A896j607j072J485k892L767r68j183N72j046J538P18k079O72n9M9J685l015
2831a539J496n41Q73J387l421K041q34Q10P18k177J084N00l01P43j892M05J995
2848A347j984K066k594J18K935l224K521j806q14K920j698J13M22j778K101K85
$$ plain form
2727 988 -958 1207 -582 199 468 -331 174 53 -395 540 12 -335 614 -1027 1356 -805 -285 509
2745 509 -902 1699 -840 -137 345 -279 697 -40 -975 243 -119 -69 773 -1889 983 -170 16 831
2763 831 -1904 966 13 -47 -111 -953 40 855 -266 -295 -560 -286 1406 -711 209 -1202 328 1599
2781 1599 -1358 777 -1404 375 1447 -1311 -434 -56 -418 1762 -434 -1327 1297 -829 1459 -433
2797 -433 -1503 1335 -19 1252 -853 -780 425 641 1029 -751 -889 963 311 -82 351 -2087 1896
2814 1896 289 -783 702 -2190 1577 609 -574 -2 -1048 490 1208 -871 -199 -258 -209 1476 -1539
2831 -1539 -43 -584 289 1676 -1745 296 -538 272 990 -1187 -103 397 96 839 -1053 -648 1347
2848 1347 -637 1429 -1165 -1047 1888 -1336 1185 -621 -1435 1485 -213 -100 322 -1456 645 930
2864I30k433K263k070K307p9j786J059j323K428j180m66M02q60J644l72j439J538
2881E63j019N47J387l678L077p22q03K811m120K400j83o03J710k257O40Q89j450
2898h11J507r01j223L018k625J522m83j417K807k349J306q80k77J724j262N82
2914B38m97m78J495o08o26J169k071K380n28j465K329l250L259j002j564K337
2930A118k097J114R25k431J368N46j348K675l279J555N07j498K577k882J447k78
2946A9k42R94j521Q33M47m70L21m79o81K316k336J519r38r44L049l180K308j165
2964a50n71K122k140N00O65j421J818k76k166K669j996J358L51k337K520j473
2980e27Q77l24o24P62j48M15o09n81J124j48o83J414k675K465p6k193L133l212
$$ plain form
2864 930 -1503 760 -1310 997 918 -868 191 -1132 1296 116 -350 52 -808 836 464 -975 563
2881 563 -456 91 1478 -2200 877 155 -648 2163 -1957 443 260 -343 1367 -890 -250 639 -811
2898 -811 696 -205 -1428 1590 -1035 487 4 -1413 1394 -955 351 -529 -806 918 -344 238
2914 238 -259 -737 758 150 -476 693 -1378 1002 474 -991 1338 -1912 1347 345 -1219 1118
2930 1118 -979 135 1060 -1371 -3 543 -805 1870 -1409 146 653 -845 1732 -1150 297 19
2946 19 -223 771 -750 83 530 60 381 -98 -779 1537 -799 720 -218 -1162 1887 -1293 1015 -150
2964 -150 -721 1401 -739 -239 426 -995 823 547 -1619 1050 -946 412 763 -1574 946 -527
2980 -527 350 26 -598 164 16 431 -178 -759 365 217 -466 948 -1727 738 662 -1531 1602 -1610
2998a610K150O17k114J368q32L68R68j217j08P44o75J373j871R57J72p98K059
3015A551k808J392J77o54J641k078K52J215n14j8j01j145K073r14P6k62q12K496
3033A567k199J279p73p19K300j623K7K20p01J371M53k826K171p97L21J293k985
3050a621J652o5R87j054o98P19n40J969j482j211J348O28r27J208k783J767J884
3067A781l136K225k036P49J758j216m58o43J109K32M55j488l59J194J368k092
3083e57J04M97r61L220l134K8J123p15J557j059j636J266J607j293K26j405J035
3100i7J160k74j525n20K365j336J671j883j294L136j184o8k86r77J045K135k898
3117h30O24j12J66J986k305l9k5J712p66o78j46o55K350o72j337O0Q04j61J191
$$ plain form
2998 -1610 540 1157 -957 411 -421 -53 915 -302 -410 334 -341 1032 -839 118 290 -508 1551
3015 1551 -1257 135 312 -342 1299 -779 -527 688 174 156 55 -1090 983 69 145 -117 -929 1567
3033 1567 -632 647 -126 -845 1455 -168 -141 79 -622 749 1202 -1624 547 -250 71 1364 -1621
3050 -1621 31 -34 953 -101 -799 -80 -620 1349 -133 -1344 4 632 -295 913 -1870 -103 1781
3067 1781 -1355 870 -1166 -417 1341 125 -333 -976 133 365 820 -668 -1027 167 1535 -557
3083 -557 -453 44 -917 2303 -831 -803 320 -395 1162 103 -1533 -267 1340 47 273 -1132 -97
3100 -97 1063 789 -736 -1256 1109 -227 1444 -439 -1733 1403 219 151 -135 -1112 -67 2068 -830
3117 -830 -206 -318 -152 1834 -471 -510 -535 1177 411 -267 -413 -1068 1282 610 -727 -667 137 -24 1167
3136A167k120l99K544j421J270j669m24J421M63p73r60P97l30J278q81o78j26
3153h41J701n39l22J60j825L236j506l29L05q69J506o6j064m15J421n83Q82j134
3171b82k14Q90N0M66j757J130r88J240P1j630J317m72M34j17k32l93J358q55L19
3190C35j6j080J605j460O04l41O23J2l75L86j220J266j88m55N40K39j271J357
3208E61n87q12J830k067J356k15n31P93m70k1J27J56m87O39n35N8K69P6l85O6
3228a79P46j267J417j530O37J243j610Q95o78pP56J31j418J356q49N72Q61j782
3246g06Q00p96J526n27l73k31m01J862j233j04J53J44L25O15k001P09Q02o96J260
3265A128k314J101O53j73M2j349O17M25N16m58r80J07J565r09l7l67p37K680j960
$$ plain form
3136 1167 -953 -1352 1192 -229 1041 -628 -1052 369 832 59 -901 -104 -434 844 -37 -715 -841
3153 -841 860 321 -1 159 -1666 1570 64 -265 40 -829 677 611 -453 -868 553 -30 852 -282
3171 -282 -496 394 444 910 -847 283 -705 535 606 -1024 293 -179 255 138 -94 -487 871 16 335
3190 335 319 -761 844 -616 -12 -353 270 282 -93 293 -927 339 151 -304 236 475 -796 561
3208 561 -26 -838 992 -1075 281 66 -465 328 -142 -163 -36 120 -367 272 -263 -205 64 140 -245 -179
3228 -179 567 -700 717 -813 -176 1067 -543 352 -326 -333 423 554 -864 492 -357 215 1076 -706
3246 -706 94 -702 824 297 -76 -307 -708 1154 -79 -183 -30 114 439 1054 -947 -238 564 -132 1128
3265 1128 -1186 -85 568 395 437 -912 -295 130 646 188 -792 -685 880 -29 -66 -433 -1170 1510 -450
3284d50N38l87l55J664q92k78p35Q86L95j22q56Q2J75J255n98j300J378j228J938
3303A110q47j558J556o67J287p92j299R29R71l67k0j422O82J130n50O07k071J745
3321D24K26k59j5j753J805J45m01k36p72Q40J220j398J68n63k11K349k266P78
3339H1m78j10K240k269n2K76K32J013n98j497J118J0L87j34j557J611l27Q83j096
3358b67p40J264j069K079j692j59Q86m8J14o9j644J434O17j380J370j938J687
3375D45K51j276J025j444J545l19o76L23n57K68J372j453m1N97p08K009j929M13
3393a55K77p9Q24j160J76l00Q42Q8r25L20K27j62O68j077m23K049k016J828p71
3412B31j583K575j709Q91j11j277J127M49p20O9k88M80O47j298P24r33J101o8
$$ plain form
3284 -450 88 -299 -654 1010 118 -160 -895 -9 386 264 -592 -510 -335 920 322 -978 400 -828 1110
3303 1110 263 -1295 261 -406 881 89 -1210 -281 690 323 303 -1119 -437 693 143 750 -1321 424
3321 424 650 391 376 -1377 428 573 172 -64 -836 4 1224 -174 -6 -569 -780 1569 -697 81
3339 81 -397 -507 1733 -536 -588 -312 -80 933 335 -1162 -44 -34 353 219 -1338 273 -54 829 -267
3358 -267 -1007 257 -812 1267 -425 -584 302 254 368 299 -1345 89 706 -674 696 -1242 445
3375 445 696 -580 445 -999 546 227 -449 -126 -683 -415 957 -496 -537 60 -648 1361 -568 -155
3393 -155 122 43 867 -293 -117 -417 425 513 -412 -92 135 -27 641 -436 -859 1190 -826 1002 231
3412 231 -1352 1223 -486 405 294 -983 144 593 -127 -58 -346 134 781 -517 207 -726 375 307
3430C07o36P30j620K043p48l73O48o37N06K14p99O0N42q11J420j405M69J3m24
3449e01J391j690Q87jl41N55m49m92Q07j18L6L52j136J367o70K42j57p05J122
3468D99o36Q86j325L61N66n87O10k19n09O53J51j074J412j775J400J96j521J329
3486D17r32O46L15n66Q1N6M32l45J56r62R82j85L21p59L69J28m76Q98j327J017
3506B66k90P9K45p69O9O53j25l76L38q66J350n85n0M7k98J034j090J95K96j83
3526f0K49l16k04L43K80m28P00j105N55J23p2J21n90L18J07M23j031O42J91j31
3546A15M45r80J36L70M14q78Q13q67M20O76j191Q38k53r4M42J9q84N19L67n17
3566i0K81o31O21qL09n95l74P58j37M36r34K78L6L38l73k87J76J11O61j024M79
$$ plain form
3430 307 -329 401 -1219 824 76 -297 351 -286 220 434 -365 -305 237 -574 846 -559 -90 -77 -501
3449 -501 890 -800 87 86 -255 300 -149 -641 166 48 84 436 -700 667 -3 239 82 -623 499
3468 499 -137 749 -576 -215 351 -236 374 155 -354 299 450 -624 788 -987 413 609 -912 417
3486 417 -515 131 446 -120 -39 17 449 104 260 -702 280 95 416 -343 26 154 -322 576 -751 266
3506 266 -24 55 300 -469 -400 253 128 -248 90 -776 574 -11 -61 -14 -312 722 -368 -173 123 -60
3526 -60 189 -127 -331 12 292 -136 564 -541 14 137 65 186 -404 -86 21 444 -587 55 246 115
3546 115 560 -420 -284 86 500 -378 435 -432 -12 664 -527 311 58 -36 406 425 -459 60 427 -90
3566 -90 191 -440 181 173 482 -113 -487 271 134 570 -364 -86 -50 288 -85 -372 -196 -85 576 -448 31
3587C1m13P22kn85K66o81J383p90o9k69J8P76j62p58O2J011p32R57j344J10Q74
3608D05l90K27o35K84LQ47q14k15M06k34N77n90j16l33J308j005L66k93l50J386
3628H34j108K50p9J40M13L7q88L13K72k32Q50j267O93j83J17J07q94P01m6O81
3648G11p72m03M75K92k06k92j42J3P80p31M75o92M87M68q49R73j269P06R8l39
3668b17p1L93k28K38R9q24Q19m83L95j19j3j12k44Q22q65N08k05J34M71m78k35
3689b15M75m94J95M65q84Q48m28m7M93q07P06o62M99n2j07m1O7o1L06j79k73M12
3711B16m81P81p30k0K57j76O84p33L06k15o9O29m65K11o12K47P77l94r50J234
3731D97r55Q82L7j465J184k87K87o9o77L60L01J17o15J93k43P18l17j11o02J039
$$ plain form
3587 31 -382 340 338 -247 19 -662 721 -69 -138 -407 -389 387 225 -533 -471 540 -192 765 -579 -469 405
3608 405 15 242 -393 -109 -106 741 -73 -288 118 -116 461 -129 -245 -578 730 -275 91 -202 -552 834
3628 834 -274 -24 -103 37 450 487 -401 -88 184 -48 802 -465 228 45 162 269 -625 76 30 711
3648 711 -61 -464 11 303 97 -195 -337 -324 456 -275 200 -492 -5 463 -386 587 -682 24 122 -217
3668 -217 -288 105 -123 115 214 -610 209 -274 121 2 -11 -123 -367 455 -410 98 -107 27 498 20 -215
3689 -215 260 -234 -39 426 -458 390 -38 -85 408 -399 307 -355 144 92 -15 -56 11 -50 256 77 -196 216
3711 216 -265 516 -214 -234 23 -153 531 -202 104 -111 -180 449 -16 195 -417 -170 607 213 -737 497
3731 497 -458 424 461 -1004 180 -107 180 111 -566 -206 95 212 -403 -210 -453 265 -52 -163 -765 274
3751B74R1q20Q90j437J480K39j015N10o78K46P77p91l24N94j46O65o88l19L23
3770a29J61P41j223O90n18M70Q87j546K84L39P4M12r10o78J702n07k40J36j052
3789i07J169p5K60p31KN50J41N8p92l48J098k8n72L31j047J411J8j203R14p98
3809e49P94N15j196k61O23N61j92l59m50L43Q80m16j056P93LL2Q16k203J163N70
3829D11m11Q15j354l7J095J9q14J68q14J270L01q55j07R4O81n29O10j400N15J575
3849A233j450M10m96J2J022j82j268P70k30L40N63j377N42o0N04j11l36j28p0
3868c12J035q86m7J83K8K87J63j208O09M10o27O27p86K95Q25m63o4o29L88J91
3888A9M98m03q45Q11K30l92K01n62k10J762j622L65J39n53J252n59m99K15J24
$$ plain form
3751 274 365 -455 435 -1002 478 717 -298 212 -466 -220 557 -234 -558 36 -110 555 -133 -452 -129
3770 -129 32 773 -450 240 -278 192 1079 -467 -183 156 230 642 -268 -946 756 249 9 145 -907
3789 -907 262 187 447 -284 -282 268 409 467 -325 -673 425 397 -175 156 -891 520 538 -665 249 -549
3809 -549 245 760 -436 -697 -74 487 295 -64 -514 -171 709 293 -763 30 33 65 881 -1322 -159 411
3829 411 0 815 -539 -576 519 538 -276 -108 -922 348 649 -206 -313 -219 462 -67 543 -857 -342 1233
3849 1233 -217 193 -303 -291 731 549 -719 51 -179 161 724 -653 -111 -171 333 222 -114 -242 -312
3868 -312 723 -163 -210 -27 1 288 451 -757 -148 262 -365 262 -524 -229 596 133 69 -560 -172 19
3888 19 517 114 -731 80 310 -82 119 -443 -653 1109 -513 -148 -9 -562 690 131 -368 -153 -29
3907b9l14R74r86j35Q86l12k11J16K24o49J308j003l18P31p85J103l52m00J18
3926c4K06k71K58m17j97R30m13P2n94N48L02j44l2q18J101l71k8n5k06j60N41
3947B18M4k02j19m06Q20m24o3o9K43J47j04K67o89O13m23j38K16P5j8J48J6p29
3969e77P66l29J37J67n34J91L89P5p10L21k42P09j30m37J98k4L01l56J25n51P79
3990B68o4j36n0l09O45l35L16n36L96m95N89qn47L90p3K67l93j5O0J00J76l06
4012f0J60m56N31o5jj79k2M16q09O78n91O49j80ok33O5J60JK25m53J61J16J02
4035B09j78R2m2m51O36n91K00j57j5O61m68r1K13L0k85L80n09O97n7m11K66n08
4057c79N25o4Pk75L29K27l85J07l08L20p3L29m71K08j83K02J86j061R21o3n3R
$$ plain form
3907 -29 -343 631 -355 -490 396 84 -127 -11 213 -436 872 -131 -449 282 -503 600 248 -152 -34
3926 -34 172 -99 159 -258 -455 475 62 134 -460 88 390 246 214 -604 497 126 98 43 -163 -323 218
3947 218 262 60 -59 -465 355 -69 -132 -201 42 189 85 352 -337 276 -147 -285 -69 6 -12 136 152 -577
3969 -577 189 -140 -3 164 -370 -179 210 285 -425 -104 -346 363 233 -204 -6 -30 271 -85 40 -511 268
3990 268 204 68 18 -291 354 19 335 -201 195 -300 289 281 -266 124 51 318 -75 -90 -30 70 246 -60
4012 -60 100 -356 175 110 109 -70 -92 324 -485 193 -398 251 71 65 -168 -103 57 58 283 -170 -9 107 209
4035 209 31 123 81 -370 266 -325 -125 -282 -297 364 -104 -195 18 48 -237 143 -366 331 274 -137 129 -379
4057 -379 146 82 89 -186 143 370 -15 92 -216 104 31 360 -111 97 -86 116 302 -759 162 99 46 55
4079E5k96L08j72L69J63n18Q3M71n43J94j00k77R04q77N84n62J22N23l37m6k58
4100b10K84j47J47m55N58j51J49k03j85N58l67M61m69r6J34j79K44j43l37L84
4120b3J60j55P5j85L45m9l78M32m01O79n79J58L0m48O21l45nL45m72K23J16l51
4142b07L49k58l1M96o51M44j79K1J51l24M35l26O8k4J59j14K28k08K74k29k70
4163a96L86l10M00n12J39K72m64N71p03N67l5l32K17l2J74p0j29J34O9m61O59
4184C44l48p5J87l44N99n55N0k1J71k51M5L07k27j26K28J50m03P11r01L04K30
4205G5k70M59n25KJ92K12j47J27k51o6K27J79k34l25P68n01K96j50m22R59q86
4226b81M92l09qQ4K29l36K09l50L92O5o10K75Q4M36j68m47L73o15R48n14m72P13
$$ plain form
4079 55 -241 67 -105 264 427 -91 -8 463 -80 114 14 -263 641 -236 348 -214 -92 431 94 48 -210
4100 -210 74 -73 74 -381 177 26 175 -28 -213 345 -22 439 -30 -126 8 -171 73 -70 -407 -23
4120 -23 137 -18 57 -128 217 168 -210 222 -179 500 -79 79 109 -339 282 -63 -68 277 -195 28 144 -207
4142 -207 142 -116 -147 349 -302 142 -37 -16 135 -189 246 -80 -12 -36 123 9 237 29 303 74 -196
4163 -196 190 -120 280 -232 -93 179 -285 286 -417 150 115 -217 0 -32 142 72 -57 77 146 -315 344
4184 344 -4 -79 108 -236 363 -192 -142 -163 8 -243 -198 109 -118 -244 -16 134 -269 442 -459 -155 75
4205 75 -195 264 -261 -259 -67 145 -2 125 -126 -192 35 214 -20 -345 423 -78 218 68 -354 605 -281
4226 -281 211 -98 -106 -22 207 -129 80 -270 122 187 -423 -148 -64 372 204 -243 130 -485 463 -51 -523 190
4248A90k70J58Pm48J54N94m82K94l06q4J31J17l7o15P41l2r4L00q22N50M08o95
4270b41K75l46j19J137r90K14Q2k06O82l85j56k25L67J28j92k11n8M00J27k78
4290Ek57M58m37P34l65o38J079n53L46k23n37L32N84k85l31M1l08R49m79l09j17
4311c11O73J36o60N70j153Q95L27n86L40l79J40M31k65p72N93J5K14j30l38j09
4331c69O07j10k90L98r23Q37K68q96N66p0j94L45J36r51O76K92m51N4m35R63j13
4352C40k90l83J50M38l4K22r11M54J00J46j90j6j30K18K06p39N49j54K22O6l34
4373g0PJ52K35k58k10l22M55J25J59n12K33J90k42L37p15L26Q7K75k19k82q5K13
4395a21M88o22K77k34K57N1j29j10Q1J59k17L29q36O44J90k11N1k96J10J99K2
$$ plain form
4248 190 -80 78 85 -363 -209 385 -97 197 -109 -193 -62 55 18 -597 144 112 18 318 -504 46 454 -241
4270 -241 34 -312 -431 706 -284 -70 12 -194 488 103 -53 -278 89 217 25 -186 -244 156 283 5
4290 5 -252 206 -231 503 138 -500 579 26 372 149 -388 -56 528 243 -88 -47 -355 594 115 -194 -311
4311 -311 362 498 -162 408 -745 150 477 -109 231 -148 -8 423 158 -614 -21 -6 208 78 -260 -369
4331 -369 238 128 -162 236 -687 150 418 -478 88 18 -176 169 305 -646 30 322 -129 -75 -510 453 340
4352 340 50 -333 -183 255 221 443 -468 -14 86 232 42 26 -104 114 320 -419 130 -24 198 264 -70
4373 -70 -63 89 324 66 -144 -466 -11 114 273 -239 -6 184 -58 279 -436 -110 -23 252 33 -249 -334 -121
4395 -121 367 -255 22 -212 45 96 -33 -143 -62 97 -120 209 -627 17 207 -4 47 -249 -139 60 82
4416H2l44J92J32j12J69j63J23j09J76j50J72k94j78M43m28K83k95K07L6J12j05
4437e1m3J98Pm4j54k3m3J24J22l02K35M0K79n92K33j87K79O2k50K60n47O18l38
4460a17L69l94N7j3K10j01l41M00k41L14k24k06M43k09J10J5l20L77J43l76Kj07
4482b09J76q8j14M40l36L65l06o9J67l47O73l72J7N4k08M17j84j90J44r4R1M22
4504D49q72M82l5k04N88n51K19n2R0J17m08m7N33l33J50m5j49J61l49L27k61J89
4526aJ51k14J25l06K79Q9l00J32J27j64K26l1j83J22j02L88l57k42K95Q1L51o51
4548a85J36K1J64n2j84N3l0j43L09K1m07N01m57K93j5k48J13k3J84k02J62R9k75
4571a65M7K70l78K97M1k16L07k87J6K38l49L70k44J27N3k08o0K7K49l2j75l8K67
$$ plain form
4416 82 -262 -70 62 -50 119 -44 79 -30 146 -4 168 -126 -304 139 -289 -6 -301 -94 -58 54 -51
4437 -51 -94 104 111 67 -87 -110 -153 -29 93 -209 26 66 345 -247 -14 -201 78 140 -110 150 -397 221 -117
4460 -117 252 -142 -85 -98 112 11 -330 70 -171 143 -81 -287 156 -53 57 72 -248 129 272 -104 -102 -209
4482 -209 -33 -121 -235 205 -131 234 -72 -141 26 -321 352 -20 -3 51 -157 260 76 -114 30 -64 27 449
4504 449 -423 59 24 -180 408 -143 76 24 114 231 -177 -224 309 -24 126 81 -68 93 -256 71 -190 -1
4526 -1 150 -64 61 -245 34 123 -177 -45 82 -82 144 113 -70 52 -50 338 -19 -261 34 115 466 -185
4548 -185 -49 -28 136 84 -100 -47 -77 -220 89 110 -297 204 -253 40 25 -223 -110 -133 51 -151 11 110 -165
4571 -165 -118 152 -226 71 112 -104 203 -84 -68 170 -179 191 -53 74 127 -81 -141 -114 135 103 -72 -110 157
4594A57n50M49r2J29k1p9K23m33M20j51J13j48j49L25k24R2r5jj12L51k55L44
4616B93j39KK42k60j59m2j92K95N9j00k34L89j84O0n1QO0n1m6k27N53o16N37m39
4640b42K8J42L5J9JQ9J40m17M6L47l40L29J96n76L01l40L24m7pK3k78K93j41Q9
4664A4K25k86j4O8j19L11j67P9Mm06M59k78p5J87k75N97k94J3M5l2J38J8j79O4
4688I7j10n4L15p89O85Kn0J61n17M01k48J49k12J51J38J72n21N54k10j12L32q31
4710d97P63m13pL53n82O20q9l04K47j58K4P0q7L66k40L2J88l49J67m97J75K92
4732G4m78M59m3j73M58k42m3K01l52K35J8k91L97n28M98j33q9K06k25L13l78j66
4754b82L52n7j7J91o43O14j8j08K01q21P43k03O1J18l60P3M5L34l71oL23j94P5
$$ plain form
4594 157 -393 56 -36 93 72 -7 216 -217 203 52 165 17 -132 193 -31 61 -34 -35 -147 204 -51 293
4616 293 154 156 398 138 -21 -63 -255 40 99 -1 -235 154 -30 30 -21 -13 47 -4 -50 -277 276 -340 197 -242
4640 -242 -214 -72 -37 -18 -17 72 212 -205 -159 188 -152 177 373 -203 98 -242 82 35 28 51 -227 66 -75 14
4664 14 239 -47 -61 7 -112 199 32 111 115 -291 168 -110 -185 2 -273 324 30 43 88 56 194 212 33 97
4688 97 -13 -67 248 -541 144 146 96 257 -260 141 -107 42 -170 -19 119 291 -230 324 114 2 334 -497
4710 -497 266 -147 -154 199 -383 237 148 -156 91 -67 -43 27 -60 306 66 98 286 -63 104 -393 -218 74
4732 74 -404 55 12 -161 297 55 12 213 -139 96 114 -177 220 -308 190 57 -32 174 -51 262 -116 -282
4754 -282 70 13 -4 187 -456 158 140 32 233 -588 155 -48 13 131 -229 -156 -111 223 -148 -154 169 -25 50
4777E0k78Q9P7L25l02K0j56n9O08l80j61j59J91K62p8j46j66J06L15J84o32J87
4799a03qL11l71k6J96k25O10n84J9K44R1r7k55j41M77O1J6L5l32K73k42J89J0
4822A48n60P24k54J09j19k32K30L8j78K1o3j15Q37o69np3M4M7J80k37k05N83j55
4845I6j87j62K33K73k03j49k87N61j69K12k32k69L41M8N0k16l07L54K15k18j27
4866a43M05l33Q2Q9k60J6K50J78n33K17q1J04J82j13l5J57Qr0K04k03K40k77P6
4889A40k49lL76O6l24Q3k35R6K25m28J3R3N7L80l31K52l61L47L3l48J25k88N09
4912B28m0j61j97J64k12M06l83o9N63n93O94l58l10M12k50M37j77k95O4K16oJ5
4934A48j99K21j90J86o1k29M16m21J23n4p4K23k0J88M6m71J54J57k41L6k45L80
$$ plain form
4777 50 -228 -139 -62 263 -39 -19 -175 -234 374 -6 -167 -326 -135 127 49 -97 -263 -157 158 342 -290 -103
4799 -103 -111 200 -171 -197 -1 -226 384 -200 -181 63 154 57 -198 -339 138 199 215 250 -82 191 -51 138 148
4822 148 -412 312 58 167 48 -184 46 84 -94 -73 -136 -251 586 -83 -88 -161 -117 -70 110 -127 -332 251 96
4845 96 -91 -253 -20 253 50 -99 -386 175 6 218 -14 -283 58 106 156 -60 -367 -13 202 -16 -143
4866 -143 262 -71 11 100 -160 -144 106 284 -249 -32 -113 -9 173 60 25 182 190 100 304 101 341 64 140
4889 140 -109 -112 264 330 6 89 -146 -50 175 -253 -240 -147 -90 290 -41 211 -150 197 230 -118 7 -281 228
4912 228 188 27 -170 -6 -218 188 -195 -264 299 -294 400 42 -268 144 -106 331 154 -141 -77 139 133 148
4934 148 -51 170 -20 166 105 -124 292 -129 -6 -60 -134 89 69 257 303 -168 -14 143 -98 -62 -307 73
4956G3J57l01K12j68J12K0l12J61O1j92L66j93k58K47J00L96l14n4k4k34M57m43
4978a31J35O5p9ok93K49J23K5k26J33k19L38k15j53O38o56O40l52p0k5r9N45j28
5001B39l11M4j15O9J19j27K91l66L55J10l10j94l4L36j17j31P0p2L09k01j10J33
5023a3J13r4J3K7m6J07m73N24l62J10J54r6K3j67M38j21J3l40j3L31J17k29J39
5046A55o2m48N62j67L40m02rK40j66J87j95Q4j12j01M1k9R7J6m5j69N09n74K94
5069D6P1j87R9l39O19l71O6jNP7k23J17K47mj42J47n07O40m26m5L17n46N92k66
5093a4jJ91m14K28l3J20j61J90M4K25n94N4o4L01Ok43L94m26J04L46l12K11l74
5116b22K6L43j66J88j36j4M16m58Q2P1j86J61j75K19l8j24J70k30j44K71J3q2
$$ plain form
4956 73 230 -71 141 -27 85 105 -207 -46 15 -177 189 -4 -262 -15 85 481 167 113 89 -145 312 -131
4978 -131 4 69 -10 -16 -309 -60 63 88 -138 -5 -224 114 -101 -254 384 -272 368 16 -54 -79 -178 367 239
5001 239 -72 -28 -143 -74 45 -82 209 -157 198 308 -2 -196 -230 106 -11 -142 -72 -144 165 -36 -146 -13
5023 -13 100 6 19 46 0 107 -366 158 -204 -94 60 -36 -13 -180 258 137 150 -190 -203 128 245 16 155
5046 155 93 -355 207 40 380 -22 -31 209 43 230 35 119 7 -94 -53 -82 15 31 -14 -183 326 -248 46
5069 46 117 -70 29 -310 309 -62 4 3 8 85 -138 -21 226 222 80 227 -280 360 -66 -111 206 -340 252 -14
5093 -14 -15 176 -238 -10 -43 77 -84 106 150 375 -219 -165 -229 72 78 -165 229 -197 -93 253 -59 152 -222
5116 -222 -196 147 -19 169 33 19 435 -23 59 130 -56 105 -70 149 111 -13 157 -73 -217 54 67 -15
5138a5K08j89K15l78n6M30j72J55k63Q5K66m43L42k63O3J92l89K86l3j07K47k84
5160a03p5N00n31M05j73J04J17m09L12l14R6q2L64k56N3k64M47k41R7K37n57N56
5182B83m60Q1J42p4K96o75K78K22l94M43l8l66N47k21l4J72o10N60n72L75M11
5203C66o56L67m67L06L12l05J38K83m33K56m40K94L00p85P48n67M48R5n57M37
5223A40l32L69M2k27l11L45l23M75k64j14L23j43J20l28K33K73j40m7l50K82J09
5244A32k95J48O1p7K23p0j40J55l34M49j39j32kj70J59N5J57m53J08J87J29k4
5266A27j55R9O3O5m37M88n01N6K90j86J18R3l2M9p0k80K45q7J87r7j90N16l61
5289@J87l46L15R0l03J02l68M15j73K78l44J72K3j66L47m47K11j31K63j55o0O
$$ plain form
5138 -15 193 4 219 -159 -215 215 43 198 -65 20 286 -157 185 -78 -15 177 -212 74 41 -66 181 -103
5160 -103 -178 322 -209 196 23 127 244 -165 147 -167 -71 -153 211 -45 8 -256 191 -50 47 284 -273 283
5182 283 -177 -96 46 -28 268 -407 -129 93 -301 142 104 -262 285 64 30 202 -408 152 -420 -45 366
5203 366 -290 77 -390 -84 228 -77 61 344 -89 167 -273 21 321 -464 284 -283 165 260 -297 140
5223 140 -192 177 219 -8 -319 26 -297 178 -86 -200 123 -20 100 -228 5 278 138 91 -259 23 132
5244 132 -163 -15 46 -31 192 122 -18 137 -197 252 113 -19 -21 -191 -32 23 180 -273 -165 22 151 127
5266 127 -28 71 134 199 -238 250 -251 -195 95 -91 27 120 88 137 67 -213 32 -55 132 35 -155 361 0
5289 0 187 -159 156 246 -57 45 -323 92 -81 197 -147 25 48 -118 229 -218 -7 -138 125 -30 -90 -84
5311h4M2N38m16j91k47L28P8N6m35J40K06pK07m82L06o5N4J46k02j27M46j76j80
5334f5L67j62l2p8l5J38l07K09n7r1k18M40M6j35n3k79J98q4L46J01k90K57l11
5357i5L97l45J29Q8J1J0l86N3L38k96o9p9J74K90k79P6r5o1L39q7r7k9J24j53
5381d2J72l58JM42k59K03m80M10k10K32k43J5K2k06P27n79J0K54r9p8k0j68j04
5404c58M07l00K69k19j5L05j07K6k9Q7j46J11j5M1r3N4J04l50K92j25L27l72Q5
5427b1N6k58P50n93k7j78L30J08k11l9M1K96j40k18j12L79m11K61qj94J98ML35
5450C48m52n5R5J53j61J55k36oL74l57J82l18j6N56l60M48m21l2R3O5k0n2L4L2
5474D9n2j19J78k19L52m20K39j06K8M77n67J60n5k38M64j31J2K9k35Q7J14k26
$$ plain form
5311 -84 -42 496 80 -111 -358 -30 48 104 -331 -191 15 8 215 -267 39 -26 28 174 -28 -155 291 115 -65
5334 -65 302 140 108 30 -5 133 -174 35 -22 -113 -331 109 155 20 -33 -312 -114 -198 148 249 -41 216 -95
5357 -95 302 -43 86 174 185 195 -191 -138 200 -96 -165 -244 -70 220 -59 17 -78 -139 200 113 16 -13 111 -42
5381 -42 130 -228 -227 215 -44 159 -321 89 -121 111 -132 -117 -95 -301 426 -153 -143 111 12 -66 -86 -254 -358
5404 -358 49 -251 18 -201 -216 89 -18 8 -21 66 -80 31 16 57 -36 18 122 -228 64 -61 266 -106 -21
5427 -21 35 -223 527 -66 -93 -271 59 167 -44 -83 -42 254 114 -104 -216 163 -248 13 5 -189 9 13 348
5450 348 -104 -159 -64 89 -72 83 -153 -159 215 -142 40 -278 -294 262 -98 350 -71 -103 -10 55 35 -17 17 49
5474 49 -3 -122 56 -163 189 -231 8 -98 -70 407 -160 0 -55 -293 171 40 52 81 -154 -67 47 -179
5496a79M97m19K36M5m09K45k2P7k75K67j25j17L98k45j40K12q3o8K86k28Q6J15
5518A54l05O6n0K01%j09r5q5L02M2o1k27N4L53j46k38j8K51k10K05l73M30k08
5541f7J75Pl44K42J43m3j76k06J41R4J21l8M1m3P8n16P10k79j20L88n79N63m07
5564a15J27K33l75J39k94K21J87j80K1L5j95N04l51k0M23m99M78k79j05j40N4
5585a31J63oL5N8j06j05Q3k57M09l57J1L60k71L56n90M14J01l47L57j68RK61k16
5608F3n2L06n34L36l31J62J15k42M19n13L12Kk44K69O9j96K70k05j93P6k90O72
5630B71n57K02m1j8K96m23L50p8j05K44j3o8j06P5l3Qk37M65l67J19l8j45L11
5653A12J8k87L31k77K30k9l32O97p33M05p3k51K53Q9j39J96l66M36m57J91P1l37
$$ plain form
5496 -179 318 -101 135 180 -229 16 -6 71 -204 63 -62 -179 219 -26 -166 46 -37 -105 181 -47 39 154
5518 154 -151 -85 -135 66 66 -43 -138 -223 79 121 60 -167 -113 240 94 -144 -162 89 -121 84 -289 141 -67
5541 -67 108 115 -229 13 156 113 -63 -269 -128 -34 87 49 90 47 125 -391 319 40 -80 308 -271 292 -115
5564 -115 12 245 -130 9 -285 -64 123 -57 -36 -1 -196 308 -43 -63 360 -139 339 60 -45 -185 -131
5585 -131 32 26 61 119 13 -92 -9 -266 143 -214 -203 157 -114 242 -348 66 167 -180 177 9 18 279 63
5608 63 11 317 -217 119 -212 -50 65 -177 242 -271 41 43 -201 68 137 -59 211 6 -187 -111 -401 271
5630 271 -286 -84 -125 -143 153 -270 80 2 -103 141 128 60 -46 29 -4 4 -233 232 -135 -16 -54 -199 112
5653 112 130 -157 174 -103 127 98 -234 463 -270 135 62 -189 64 153 14 210 -156 280 -177 14 85 -252
5675b52M14j95r8N1j01J99K35l81L06k85J47m4k70N68n50J90J09k98L67k13L0
5696g1K06m40J92J96l99N88m59K43j4j06L47j59k1M9l37K28m27N27om51K22K06
5718A14j66L72l90j52K84k57M02k32J02j21j2L3K22k33R9k56K2K77k25J76l4n5
5740c0l0j49K87J9K4l9j44J04M2L3j7j68P3J60l24M84m43q9L18l08J55j3m4J83
5764H4j92J31l1j08K04%k95N26k42j36P7l7K43l30P8j57K84l4n7k65J39K44j69
5787d3R4l15L47j01kJ3J09r5J43p8l99L80j54L27j47j88Qj69N64j50L5j70k33
5810b24L64j72L0j7K05q1k20j27J67L9R9J68l53K1J7L80k66m01M20j83L33k03
5832dL8p3K3j0n5j50K89L9q0J30l40L95k35j41J64k71K44M18n15o0M6L0M35m86
$$ plain form
5675 -252 162 -33 -131 -80 -181 18 253 -128 178 -107 40 -4 -274 294 -256 -66 43 -255 112 -101 -71
5696 -71 135 -305 -113 83 -316 272 -187 56 42 -64 283 124 103 152 -185 43 -384 143 137 -314 -92 114
5718 114 -52 320 -70 -222 62 -195 207 -25 77 -44 -56 -23 199 -34 65 -191 -169 108 -117 59 25 -30
5740 -30 -60 -209 78 97 121 82 -62 42 84 117 100 -68 5 165 -159 325 -118 -207 111 -197 -42 -55 -99 84
5764 84 -108 23 -8 -116 88 88 -207 319 77 -59 18 -19 224 -106 -28 -185 99 65 8 -257 -118 126 -43
5787 -43 51 -264 83 -18 -20 -7 102 7 150 72 -327 53 -101 226 79 -109 -101 -270 294 144 179 9 -224
5810 -224 140 -32 -2 -19 186 105 -115 -242 -75 -36 63 231 -122 -101 -84 296 30 -371 49 -134 199 -4
5832 -4 34 -39 -16 -26 -81 -231 58 97 17 147 -193 202 -33 -174 -10 -281 -37 381 -134 -194 -148 -118 317 -169
5856a69J3J31j33M10k44j44K1j06L73l55J94O7L2J3J47n42K34m1Pj52r6N91l90
5879a39J1J53j36K63k64J43J33m49M43J7l67L61l00Q0K97k64O9o0J89M1j86j5
5901B0p7K05k26o0J49l0M1J91j66j88K55l50N55m39O2J28l12L47k03J88j51q0
5923a41M41m83O9K55j58k2J05l32M97k56Ko4j88L83r4O7k14J09M4J24q5j49J59
5946F9j26J71j98N5j7K67p7q8J04m5J07j55l3k41J23J14J79k62J27%j03L16l55
5969f8N2J57L9J42l24j14K1nK18l67K50m8MJ63k30J54J11j64j45r2J58Q8j56K86
5993A30j71J52L8k80L05k44pj67L44k64K87m4R8j16j99J94m46N39k58M1j25K17
6015B4J11j18j38Q6O8n9K01l64n4L07k49J32lN24n71R3j4P0j6R3J44k03R3n8J6
$$ plain form
5856 -169 -156 -25 -158 252 8 -136 -115 -221 152 -203 -9 58 90 103 250 -292 -58 -99 -92 -244 -340 251 -139
5879 -139 -128 25 -111 152 -112 31 164 -285 158 175 -192 169 -131 -51 246 -18 51 -9 180 221 35 20
5901 20 -57 148 -78 -138 11 -19 22 213 47 -141 114 -236 319 -120 -58 70 -242 105 -98 90 -61 -141
5923 -141 300 -183 -114 141 -17 -39 66 -266 231 -25 -23 -87 -275 108 14 81 -133 -24 20 144 59 -90 69
5946 69 -57 114 -84 -29 -46 221 144 56 160 115 222 67 34 -207 -84 30 209 -53 74 74 -29 287 -68
5969 -68 -16 141 180 322 -2 -116 -95 -100 118 -249 1 -47 -43 120 -110 44 155 -9 -154 -246 -88 0 -156 130
5993 130 -41 111 149 -131 174 -70 -77 -244 100 -164 123 79 177 61 -138 56 -390 149 -109 -68 -193 24
6015 24 135 17 -121 -35 33 -26 175 -189 -243 64 -185 -53 -56 468 -103 -10 -24 46 30 123 267 64 157 99 115
6040A15L8Q3l13O7M06o17N23m62J86J60l58L70l92L95j81M1R4k07J83j26j1l8
6062d4J48l39K61j08J60r4j57K38op3Kk34L64m2p7J44q4j07K43l83L56l8l16L48
6086A62m13N04n00L19j17j77J69P8r9K94j60j65K35k06N07n70J60J78m44L52l27
6107b20J9J49j00R1kJ33M8J17m16N18m31J97j98l9J15r5N44p10N24r5m55J29J28
6130d9o5J76mj52L11k17Mr4J69P6m55N79l67J15J82j22j94oJ96R6p3j54J41l87
6154b94Q49o91J34L10n64M25p0o6r9k3l2N3o2J27L01n38O02q24N55O2qm4k98J62
6178c3J41k52l5K64j54L79l09J59K6j56N9l17L63qj43J99l16r4J46K53r5j07k0
6201e0n3j14J99J96n02N02l66L74j47k56L93k73L12j83j63J40l5k95K92P1j19
$$ plain form
6040 115 153 236 -77 -10 396 -221 302 -160 26 186 -172 198 -194 201 20 61 155 -52 131 5 -6 -44
6062 -44 104 -235 26 -82 78 -16 -173 65 59 -14 -12 -246 118 76 -1 143 59 -48 195 -188 168 130 -186 162
6086 162 -251 253 -247 72 -45 -222 -53 25 -74 220 60 -105 130 -76 431 -139 21 199 -245 107 -220
6107 -220 -201 -52 -152 -61 -63 70 118 235 -181 337 -94 103 -95 -134 -19 -114 430 -280 244 149 -306 -177 -49
6130 -49 -114 62 58 -94 217 0 4 -90 79 155 -300 279 -88 27 209 87 -107 -113 83 179 106 -48 93 -294
6154 -294 555 -136 -2 308 -256 169 99 33 -66 -89 -121 -68 -130 -3 298 -240 362 -462 93 155 147 103 -195 -33
6178 -33 108 -144 -179 85 -69 310 1 160 186 30 89 -228 135 127 -16 183 -133 -227 -81 172 77 -30 -50
6201 -50 -103 -217 -18 178 -324 178 -188 186 39 -217 176 -97 215 32 -131 9 -26 -321 -29 42 -77
6222g7J82l66O20m73K67r0j29L2j66J23o5J06q6K31l87K82j37P8N00o01J96k5
6244A5L6M4k71L05m50L48r8L00k21J03k53J98J83n32K09K48p1j98K26k63J05L4
6266cj01K15p7lq5J79o7n5l5k18N33m23K22r1K10p8m79M10M3j50N3r2K28j28j09
6291a01J13j39J2L68m46PK86k17K60k16j82K32P2l5Roj4L6o2o9R3O1j11J04M2
6316I7r8J03j84J38j40L9P8J00q0M9j34o6K24l33J50k01J15J90K29j0l06L47k47
6339F0r8K50k22p7K33j97r9K64j88L43m95M33r1j30K31k97J18j15J62L2m44L12
6361a5J34M8q8j23k84N83k86K54k15k26N43l48n0n7j22K24K25p7n0J0m2K31k30
6384C9K0k19K30j11m3J78q1N7j51Om1k5P7O2k33J5L72k2p8l37J52K92j47K23n37
$$ plain form
6222 -77 105 -261 359 -114 153 63 -66 -34 -200 -77 -142 -36 -122 109 -278 4 -133 -55 445 -156 40 15
6244 15 51 95 -176 129 -321 27 -71 229 8 111 -142 56 239 -293 -84 164 93 -105 121 -142 -37 -3
6266 -3 -104 111 34 31 -54 125 58 3 -32 -250 283 -140 82 -9 201 123 -356 54 97 -53 0 -92 136 8 -101
6291 -101 12 -127 -115 253 -193 -186 100 -117 143 -73 -255 -23 49 14 23 17 3 39 -23 -92 1 62 -49 55 97
6316 97 -1 102 -82 56 -84 -45 33 133 53 102 -32 -98 126 -207 -57 -258 -143 47 276 266 -40 307 60
6339 60 -38 212 -10 -87 146 -51 -150 114 -74 269 -226 207 116 -14 217 -80 38 -77 85 117 -327 -15
6361 -15 119 167 79 -44 -328 255 -31 223 8 -218 325 -23 -73 -130 -252 -28 197 120 70 80 38 269 39
6384 39 59 -160 70 -41 -84 94 13 70 -81 -75 -116 -141 -64 -2 -235 -220 152 130 52 -285 -133 159 12 235 -302
6409c02K88j7j41Q0j50J10o2O4L26p9k99N46l50Q8q0k84M29k99K72k72J82M7k71
6432a74L01k11K57m8k81q5J60K9J26nj13K65k70K37n49M47j87K41j93L0R1q7O7
6455D8q8N9l5K11M1k63J07j85J43o3K34k95k30M80l5k62L25k80J60O6l36K79l38
6478b57K94M1k58K43l18K69Kl1ok30L68l01J66k59K65l2K70l16l0J91k03K25k70
6501a77J57J22j63K51m07J18P9J63N0l15j46K62J04k98M33r9j68N7j13J08j96
6522a78K4K34k11K29J16j83J0j47J11r8k5L65l73L64l32L36J7j97J54l39P9J69
6544A25j24J28P1j17p9Jl2J0k40K17J40l20L82j67J08k55k1L17j89L5j4j20K52
6567A08k22J17J71k75K07k59K27l8n4L5j14K4N8KJ46J29l05J62L2l35L49l59M08
$$ plain form
6409 -302 -14 -31 -172 -92 -242 -132 -194 -130 196 117 -182 364 14 102 22 -262 167 -132 140 -132 50 97 -174
6432 -174 127 -84 173 125 -156 -241 -81 -52 74 69 -44 221 -49 188 -361 86 -101 140 -53 -23 68 -19 48
6455 48 -40 19 -16 195 236 -27 80 -105 38 -25 209 -86 -316 164 129 -133 192 -88 72 138 -198 81 -257
6478 -257 37 78 -180 63 -255 14 16 -15 -21 -251 117 -184 -18 -277 -12 -44 226 -90 -120 71 -132 93 -177
6501 -177 -20 102 -61 190 -217 -99 -20 143 193 -122 -268 -6 98 -200 233 134 -34 23 -90 18 -178
6522 -178 -154 80 -131 98 214 31 41 -106 5 -93 -118 247 -126 238 -94 242 259 62 216 -123 -44 125
6544 125 1 129 200 83 4 5 -27 -17 -257 -40 100 -220 162 -5 103 -152 -173 144 -45 -10 -24 -144 108
6567 108 -114 3 174 -101 106 -153 74 36 -18 17 -97 -73 -15 -13 133 262 -43 119 151 -184 165 -194 214
6590B14k91j19M39k70K19k52L05m56K05k03K35k47J00Ok1M03n35M78l61m8K97
6611I8j81K29K9j62P2j51r1L68k16J31p1j42J73j46J04J51k24L61o96L80j77j63
6633c24N1K53o8J41qJ22Q9j50n0k31R0Q0o7J67j76R5Rjj80J36O8j4J32l23K36
6658G7k28L14k43L9K6rJ89l22J47k1K32k31J71l34J17m6L54j96j69K06Nj09l7
6681f8k67M20J01k27J69j55Q6nj03j11OK10Kk71M20l90R1J25k14L10k38L4r3o
6705a74K09j73K07k18K53k82N32m43JJ43N7nm5L6r4m0O5M0k58K82m7MJ22Rk10
6730b9L6J31j61j24M44m80M15k40J91j45k1J03l76L05j13J74q9K85l6j90j62O8
6752a4N0P8o4R5k18q3L68j74o3L6j81L22j28k5Q7k16J32k25K33l5K70k65r8K10
$$ plain form
6590 214 -77 -196 243 -27 192 -60 245 -211 -6 -209 26 -221 -121 -115 -136 267 -268 210 -151 -199 98
6611 98 -83 146 175 13 85 -66 -157 211 -5 126 55 -87 86 -60 44 195 -29 332 -364 16 -161 -324
6633 -324 -273 -20 -88 53 45 167 256 106 56 -175 -85 -5 -72 95 -81 14 23 22 -158 -22 46 32 164 -159 77
6658 77 -151 163 -80 -41 -15 -24 165 -157 -10 -31 201 -30 141 -193 -76 -122 232 36 -133 73 78 -31 -68
6681 -68 -335 85 186 -41 128 -27 59 54 -49 -160 -154 56 58 -213 207 -183 -92 33 -181 129 -109 -75 -168 -174
6705 -174 35 -138 69 -149 104 -178 354 -89 -88 55 112 107 62 98 4 -36 29 69 -189 93 46 50 172 181 -29
6730 -29 7 138 -23 -147 297 -183 232 -8 183 38 17 120 -256 49 -64 110 21 306 270 80 -82 -14
6752 -14 36 114 50 145 -73 -156 212 38 -25 11 -170 152 24 -1 86 -130 2 -223 10 -25 245 -20 -118 92
6776I2k32j24K04o8J59K2l8J30ml43K86j97K13k63K20l19K41n3J71r9k07Q9O9
6799e1M11n60M02j54j38M5o4oK18p2k02J75r3K10j89j24K85k53L42l24L37m32
6821b37N27j89k17L43k78K61k62l5J40o9n1k20K34K9l0j36J89J64l05P4J22N9
6843A13m10L34l76L83p4J65l5J36k94m9M5N4K96l32r1k35L44L80m03j9q2K17o0
6866GkK9J69j29k44K11k24J51q4K33k06j48K18N5R7j30j16N9K5o7K19n5j99K87
6890A56q7p8k9K02l69j0L68o5J18j03j54r5K31k72J21J97Lqk73P0O1o2l3N6J54
6915I9j21J1Q6l03L37j25j4K2LN7k53M6J61J34o2J65k03p2J34K50n68O0J14L3
6939in0j07L4J14J70k36K68k4L0j69L4J00L7N7j25k30Lj57L60J50l28M2J4K1N8
$$ plain form
6776 92 -140 -264 -60 -128 31 53 15 145 141 -202 84 -113 100 -163 57 -262 -21 -74 97 -2 -209 -120 -51
6799 -51 360 -200 202 48 -90 -45 -109 -115 103 31 -171 4 -89 121 -68 -192 93 -160 182 -142 195 -237
6821 -237 290 101 -116 227 -51 210 -52 -87 53 -16 -67 -287 -53 -24 -54 -190 -1 163 -142 -68 54 113
6843 113 -297 37 -339 44 -30 135 100 236 -58 -107 -62 -8 288 -44 -135 -370 -26 354 -49 -68 -150 67 7
6866 7 5 34 203 74 -170 41 -183 -32 -116 117 -89 -237 -19 36 133 3 -113 -54 -29 -96 123 68 -131 156
6890 156 69 -9 -38 164 -205 -215 153 88 206 103 -51 -146 85 -187 -66 131 134 126 -147 -77 -16 -78 -111 -55 99
6915 99 -22 -11 75 -228 109 -16 -30 -8 -5 52 -201 -155 6 140 78 243 40 -32 102 352 -216 -156 -42 -9
6939 -9 -59 -166 -132 -18 152 -84 184 160 190 21 55 155 192 249 124 -106 -103 -260 100 250 -78 -36 -22 -1 57
6964E7k1j24j3oJ8M5k1j1O7M1k81J09J83K05k82j83J80L68k94j50J51mo9l17N55
6989B03k34j17K19j96K53k27o4J75M0r4J64j27J52J16n91L70Kj14j4R8J36k34
7011h4R4j05R6j15J98j61J86q3p4k90J91L75l19K40j90J49n1j79K09j21K14j82
7033bk2K29q6j04M0j12l3K30m03J98m3J38J58m44M44j14n5pR5J6n3L0j66p1K6
7058a11K72l05L50l26L5K73l17L78j83k02L59k11k03J38j2O1K28m41J17j58K86
7079B8j40l7N0J37m1j42L14j71Q5k0j51O5J5K32k55J3k20N46j51p4j31q4J49J92
7103B09l3k85K14j83P9n8J46k3l92L51M7m2j16J55M7k51L72m40K91o7J60j08k20
7126a47n2L01r1J01J9j14r9J16J39k9r7J02j47P3j8J85l96J57j56J86l06J19J53
$$ plain form
6964 57 36 -88 -101 -107 -89 -44 -65 -76 -9 32 -249 -140 43 248 -34 -217 -37 331 37 -113 38 34 -35 -352 203
6989 203 -31 -148 71 -125 128 -99 -163 12 52 -42 122 -5 147 263 -328 42 44 -70 -84 14 150 -84
7011 -84 10 -95 1 -114 84 -77 109 26 -48 -338 -147 228 -91 149 -41 108 57 -122 87 -34 180 -2
7033 -2 -24 205 119 15 55 -57 -90 140 -263 -65 -108 30 188 -256 188 74 19 12 107 123 70 100 -66 -137 -111
7058 -111 161 -144 206 -120 -85 188 -129 249 66 -136 223 12 -191 -53 -65 -4 224 -217 -100 -258 28
7079 28 -112 -149 -99 38 -3 -145 169 -2 83 63 -88 -23 -8 224 -31 -18 -238 308 157 83 -48 -132 17 209
7103 209 176 -109 105 -78 1 -57 89 66 -326 25 72 30 -86 69 116 -135 237 -203 88 21 181 73 -147
7126 -147 -199 102 11 112 131 17 -82 34 173 144 47 149 2 75 57 242 -154 3 -153 33 -273 -154 -1
7149ak33L58k6k62m2R5M04m18P1R1j6j85J34J56r1Q8q0J91k92o2J14J1J34l6j26
7174b3L32k76j46L35k66M9K2p0L86l21J31N2l16O8q4K12r9p9J08J20k10J08k18
7197a85J76J39j92M1j21L01k64M2o2J79P7m3R9l42J28R4K4j72r5J84p2K70m97
7220b91K17j00K24K9k41J86j59K76o0k8k74L02J54k52l0K2K34k24N9K6k25M65
7242C10k79K2q2O7n0K4Lq1J33J54k4l54R4j60K69p8k19J05P6Q7l40M63k32P5J66
7267A49k40M2J68k22M3K48k03k90L46J74k45J97k25K46J30l37J01Lk50Q8O5K95
7289B83j88J59k19J21k29J45k70J16K73j81n5m6P4k11N39j91k16L33k51J45k62
7310a31L88j20j13N1j43k8L50k60L0J41k33J7J5J58j63J6j58Q1J09P2r7M32m49
$$ plain form
7149 -1 -234 124 98 -164 -206 -111 293 -125 -54 37 21 -164 -30 126 35 123 43 234 -58 -120 -6 5 139 103 -23
7174 -23 309 33 -113 222 -44 5 27 -43 343 22 153 205 -111 -43 -127 85 -14 -93 15 135 -75 33 -185
7197 -185 -9 130 -62 -21 -142 159 -105 -63 -125 54 131 88 187 -155 -27 67 91 -81 -176 8 -64 206 -291
7220 -291 -74 -174 50 79 -162 24 -135 141 81 53 -221 81 235 -17 -47 -25 209 -15 44 70 -155 310
7242 310 31 53 -29 38 -12 12 15 -66 67 221 197 -157 -63 -223 46 -32 -251 -146 -70 17 -323 140 -92 -17 149
7267 149 -91 -49 119 -103 -60 188 -15 -305 41 215 -30 167 -58 188 318 -19 82 85 -165 -77 -12 283
7289 283 95 254 35 156 -73 72 -198 -82 191 10 -45 -91 -17 -228 311 120 -96 237 -14 131 -131
7310 -131 257 137 24 75 -68 -96 254 -6 24 165 -68 -51 -36 122 -41 -25 -183 -102 7 79 -18 414 -35
7333c5J33r4J74q6l08K23K78l75J79j28p6J76lJ70k59l0ML40k53k9j69M13k70
7356b5P6j49K0j28J31J77L1p9M0k50j2o3K54j36j01P3J73O6l6l35K47J77K30m76
7380i5K87k77OrJ68J00k71K20l73L77k04Q9J2J91j52k51K33q4N3k0%k02L09O1
7404A68o51P17q6mJ81m29J5K45k85L07o3k11J31m3K82j19k87L22j65Q6k60L3R0
7427b6J11p4m5M9q3j1r6L29j52K54k62j29J34J09J18j94j01J52K7j11J34k73K
7450a38J30l6j41J17J85k35q2J09j02J29Rj8l1J09J6K26k5j20j15m5K00l00K77
7473A19j90J07m2j74O7O5J70J01k93J46o0m7O7J2k94M24l26K91mj17rpL5o3r0
7498a12J32R5j34L3J11j42K2k68L68j02k15J72o2J67k25J92K5L9n0J26l25Q8J27
$$ plain form
7333 -35 98 4 178 92 -216 7 285 -90 89 -39 -115 61 58 228 -31 -61 -57 283 30 1 -168 245 -25
7356 -25 51 -98 -78 -206 -75 102 133 54 94 -156 -168 -231 23 -113 -214 -141 32 98 62 -273 -26 151 381 -95
7380 -95 192 -85 -79 -88 80 180 -91 129 -244 133 -71 18 30 221 69 -182 51 -33 20 0 0 -202 107 168
7404 168 -483 234 148 144 325 -104 -89 156 -129 178 115 -96 35 -8 274 155 -132 190 25 111 -149 -116 -26
7427 -26 85 11 -34 15 -68 -79 -175 154 2 256 -6 -135 -1 108 226 32 -69 83 110 -1 133 -140 -138
7450 -138 -8 -44 -185 -68 117 -118 -200 -91 -193 -64 -55 -73 -104 5 21 247 222 102 -13 -58 142 -158 119
7473 119 -71 36 -6 -180 -113 -48 122 223 -70 76 16 -31 36 48 -246 178 -148 143 139 22 13 6 41 -22 -112
7498 -112 20 115 -19 14 125 -17 5 -263 105 3 -212 -40 -102 65 -160 32 57 96 46 172 -153 -65 62
7521F2j60L59k38Q8K50l68J46k17J79k69Q5J56Om1j53K06j19K8o3J58k99K44K02
7544B42j00j77j56K28k7n4L1J75j79Oq6LK84j50j38m1n5K14m8K17k74L35m85K64
7568B9l1K34Lm11Q9R4o1k03Q0j96N71m47J97L07k74j3J51J78j39q2j88J75K1j21
7592c7Q4Rq5O3j16J45q9r2L9J07k21J25P4Lj4n5K32j24j32K03j24qLp7k69N97
7618B41l64o1J60J48J26l48J34J24k78L07k12pJ29n4J3J2k33L47j55J94j25j45
7640d7K18j38P0o2j08R8J30j40q4R9o0Q5q6K82Kk81N2R0j75N9J61n07J85L57j70
7665C0P5Q9j36Q0l36J2L73k56J7R1j9J57k81L3J71m1j05n4p8n8K78m7n8o2K37
7690A12M5K9k87J35n1j01J48m8J23j47j33J20K18O1n3pl22J88r6J79o4N5J01k22
$$ plain form
7521 62 -98 261 23 111 361 -7 139 -78 101 -168 -83 73 79 38 -115 91 -28 0 -63 95 -204 40 242
7544 242 142 -35 -191 37 10 -44 -13 162 -17 -11 -97 -94 190 40 -98 -139 -194 20 -28 189 -85 250 -235 29
7568 29 -2 232 235 -176 -87 7 -54 -257 -177 -373 198 -249 -52 255 -19 -32 119 297 158 76 -112 63 84 -37
7592 -37 47 56 -29 34 -82 63 -26 -118 -79 28 -193 -68 6 9 -5 -60 172 48 -84 119 -5 -13 -10 -87 -356 241
7618 241 -123 -184 -24 124 250 -98 36 160 -118 189 -23 -30 99 45 58 70 -163 184 29 223 98 -47
7640 -47 171 33 103 41 -67 31 161 21 -63 36 -24 61 -25 257 259 -22 30 120 -55 4 165 -342 -157 200 30
7665 30 105 194 58 138 -198 -186 187 -69 -52 39 20 177 -104 -71 100 59 -46 -100 -178 -236 42 -5 -63 -125 112
7690 112 157 186 -101 34 -17 -118 30 -18 105 -42 -175 -55 163 224 171 164 -158 30 -66 113 49 104 205 -17
7714a7K36j08n9j8k5p8N6R3o0J14k90J09r4J68L3j95K83k19o3q4J26J46Nj91L60
7739B28l19J19o0J61o1J7P4J11m19J50M8k47P8J84j5J32j29l12L45o3P5l22K85
7762F0K9Q0j17j01P7j56n3kK31p9l0m5J8m5R5M9O0m4N1r9J78k99J99j51J58o5
7788ap4J3r3Q7J31OK6j61O3J4rM3N0j39q1K3Q2r9K89J3j16j34K93j85r3P6n5J45
7816A14j09n5N1K54l74n1M72l48p3J32M3m9j04J11O5n2j15K46j84P6J66J2j95
7839C3J09l93J34Q5k99L78j30K89j83k33K75r8Q1o6k3J53k05J48k17J72k4j55
7861a69K02KQ6p1oj14K56l68R1J58j93J58p2J94l76L64K0J3j47n1p2O5J83p5Q5
7886A63k63k6J02O8Q6j59Q4q9J93k48n3J86k80L31J7j71j63K59N1l44M42o8p4
$$ plain form
7714 -17 219 111 52 34 9 -69 -13 80 20 134 -156 -47 -141 27 60 -135 148 -71 -134 -218 -92 54 59 -132 228
7739 228 -91 28 -32 129 68 85 159 270 -149 1 49 -198 -120 64 49 181 52 -260 85 22 97 -225 60
7762 60 89 169 52 -49 28 -128 -181 -183 48 -31 -61 -106 -88 -133 -38 11 71 27 78 -21 157 -142 57 -94 64 -1
7788 -1 -75 -62 -155 -68 63 69 95 -66 -3 11 2 45 95 -44 -125 -102 -20 -119 170 183 67 -67 226 41 -52 24 -31 114
7816 114 5 -50 1 255 -119 -170 302 -46 -119 13 56 7 -97 14 79 27 -88 158 -26 50 216 228 33
7839 33 142 -251 -117 -32 -331 47 -83 206 23 -210 65 -33 48 -18 -41 112 -93 55 -162 10 -14 -169
7861 -169 33 35 121 50 44 -70 186 -182 -91 67 -126 32 -40 154 -222 142 162 175 28 -23 -95 -30 153 78 163
7886 163 -100 -126 -24 44 130 -29 55 -34 159 -89 -142 44 -236 95 112 -59 -222 37 88 -256 186 118 44
7909D4j32L50l04J4R7Nj22Jj35J74K53j21J16l91L34j97P2r6J17o2q6K47r6j73
7933i1j47J36K80k75j30J99R0p9M8J5j00n0K8J08J90j66J93j12p7l7j7p7r4k2
7957a87J86Q7k02Q3J70l60J21L9K7l6J47j92J84j26J9J32j71j3P7m9Q2mM9L5p5
7982B3k9N3k0r6K01k3m3j70qN5J69j17m1J99JJ39j56k07K08j00o5k08K33J7K5
8007D0j56K60q3l7m5q8j1L8K04J9k66L7l3K05j72J52k30J48p8o6K69j49j01K05
8031F2k7r6M1j16J54J25m50L27J89l57k8L07k2q8j82J15K24j2j41k49l1J96k07
8054b66N32l84J08j20K28K82k74m0j0j03R5k74K22l8J05k89K98j72l1nN4K55j75
8077bj12RJ44j35K40j80J68k94j6o6J27J07j68L80l11n1K79k81K48j16K4k36M62
$$ plain form
7909 44 -88 262 -42 -28 69 74 -48 -47 -182 -8 245 124 240 -151 183 -14 58 -38 79 17 -69 178 82 -91
7933 -91 -238 -102 178 -97 -227 -28 62 -17 31 46 -54 -104 -76 32 222 56 249 137 60 23 6 -71 -165 -187
7957 -187 -1 86 -116 -33 137 -223 -102 -63 -36 -72 75 -117 67 -59 -40 92 -79 -92 -15 -64 18 14 63 98 23
7982 23 -6 47 27 -69 132 109 66 -104 -112 -57 112 -5 -46 153 154 293 137 -70 138 38 -27 -235 -2 15 40
8007 40 -116 144 61 24 -21 -109 -120 -82 122 141 -125 -88 -121 84 -88 64 -166 -18 -96 -162 107 -42 -143 62
8031 62 35 -61 -20 -136 18 143 -307 20 209 -148 -176 131 109 21 -161 -46 178 166 25 -224 -255 -59 -266
8054 -266 266 -118 -10 -130 98 380 106 66 56 -47 48 -226 -4 -42 63 -226 72 -100 -131 -136 -82 173 -2
8077 -2 -114 -105 39 -96 144 -36 132 -162 -178 -244 -117 -10 -178 202 -109 -160 119 -162 86 -30 -6 -242 220
8100B20l34q0K20M2q7j08O6M7J46j58jL0o5J68qK01m46L40j09k25J28j73K17k9
8124BK41l22j21K33O7M5k88K40k48J68J16k23J48l3o6q4K06R0%k26K08j16k9j16
8148a08J62j05k9J55k58J89J2L35l75M1k28J73J91j73L6r5K37j37q2mL45m08p9
8171b05J11lp6M80l51L5J45j25j04L06j58KL57l03o1k15K33n0k15K01
$$ plain form
8100 220 -114 -194 26 68 -19 -127 -61 -14 132 -26 -27 3 -62 106 98 299 -147 193 84 -141 -13 -186 31 2
8124 2 243 -79 -200 33 100 145 -143 97 -151 17 133 -90 58 25 -41 -125 81 171 171 -55 153 37 8 -108
8148 -108 54 -51 -80 75 -183 6 18 353 -22 19 -209 -36 155 -18 18 -77 160 23 -59 -63 282 -126 -205
8171 -205 -94 -97 -173 307 -44 -9 136 11 -93 213 55 57 414 111 50 -165 68 18 -197 4
8191D
$$ Imaginary data points
##PAGE= N=2
##DATA TABLE= (X++(I..I)), XYDATA
0@%%%%%%%%qJ6k4L2m0N6p2Q8j12J42j73K08k52L08l68M36n16O05p07Q25r59J109
30E94j275J458j662J889k144K425k734L078l452L859m308M799n335N922o563P262
46C813q026Q861r772J0767j1858J3060j4385J5848j7472J9286k1321K3627k6260
59a3832K9294l2843L7058m2158M8472n6526O7214q2171J04870j45040L30033j042797
71g98426Q87084J77788p92520J390512j234668j18224R57751n71023K48606q7303
81E9577n01294N68622J11518j13184m48291K84270J31310j31986M68544q73284
91d44198K09279P23852p44012N23360l77251l92888J049601n67960r8667K15767
101I6883n31353Q25370k76292l15729K74837m42826P68910k83746m31853M98383
$$ plain form
0 0 0 0 0 0 0 0 0 0 -8 8 -16 16 -24 32 -40 48 -64 78 -95 113 -139 169 -199 237 -279 326 -381 444 -515 594
30 594 -681 777 -885 1004 -1140 1285 -1449 1629 -1823 2036 -2272 2527 -2808 3114 -3449 3813
46 3813 -4213 4648 -5124 5643 -6215 6845 -7540 8308 -9164 10122 -11199 12428 -13832
59 -13832 15462 -17381 19677 -22481 25991 -30535 36679 -45492 59378 -85662 244371 -798426
71 -798426 88658 266446 -526074 864438 -370230 -488454 469297 -101726 146880 59577
81 59577 -441717 126905 238423 125239 -323052 -38782 92528 -39458 429086 -444198
91 -444198 -234919 488933 -255079 268281 -108970 -501858 547743 -20217 -118884 96883
101 96883 -434470 390900 114608 -201121 73716 -369110 399800 116054 -315799 182584
111A82584n23951O12544M5244q28348O78428k14501m418M96723q51337K97413
121a09619L28680k67957K32040l58924M6575J99155J07037j24550l44230M06578
131A14785j36582O7015K37598p42991N08733K66031o05460O10870n25917q8794
141b94712Q33781p64414K14392J09296m28742O63724k67747k82274K76008j47217
151h7905K17919m2419k18511Q9985o798K51018k31940r6529J87716k09287L85336
162B38585k24996k60433L97833k38365J74780L0545l78889L35634k1509o9043
172a5858J25370l14648K40332M9472j16097J23754k91437K57547L3193j64190
182g2562J78247k73922J71031J62732k74991J53431r3323k8734K63654k59889
$$ plain form
111 182584 -341367 271177 316421 -511927 166501 -48000 -52418 444305 -407032 -109619
121 -109619 219061 -48896 183144 -175780 -129205 69950 176987 52437 -291793 114785
131 114785 -21797 45218 282816 -460175 48558 314589 -290871 319999 -205918 -294712
141 -294712 539069 -225345 -10953 98343 -330399 333325 65578 -216696 59312 -87905
151 -87905 130014 87595 -130916 -40931 -47729 203289 -28651 -125180 62536 -146751 238585
162 238585 13589 -246844 150989 -87376 87404 117949 -260940 74694 53185 -15858
172 -15858 109512 -205136 35196 84668 -31429 92325 -199112 58435 91628 -72562
182 -72562 105685 -168237 2794 165526 -109465 43966 -49357 -78091 185563 -74326
192g4326L9191N0842q3428K03741j77069J278L2659j1176J27839j67030L0934
203b6545L7030m3147J39018j43234l9142J50446j28186J26651n7322j38270K17900
214I5199j18761M3255J2450j26490J47683l7594j9124K0506p3969Q0287J2412
225C5854n6889M0578p1916P7291J5210q3774Q0504r0702P3012K3815q7232O5075
237B0826m7596K9756L6438o9636K1486J8420k7571N4711n8161K918L7639m1084
249b1854N7319o0793J4841K2365k2101K9601l7100J0742J2622n852K178m99k2008
262b0539L5476j5189n620J6230l5558M7219k9298O386N449j6675K1965j0479L081
275B448q170J0162q304J4177j6112N680N725j1234J7826k1956J9040j5743J2486
$$ plain form
192 -74326 -35135 15707 -67721 136020 -41049 -39771 -7112 -18288 109551 -57479 -26545
203 -26545 10485 -32662 106356 -36878 -76020 74426 -53760 72891 15569 -122701 95199
214 95199 -23562 19693 32143 -94347 53336 15742 -3382 17124 -56845 23442 35854
225 35854 -21035 19543 -52373 24918 40128 -43646 36858 -53844 19168 42983 -44249 20826
237 20826 -26770 2986 39424 -30212 -8726 9694 -17877 36834 -21327 -18409 19230 -21854
249 -21854 35465 -25328 -10487 11878 -10223 19378 -17722 -6980 5642 -210 1968 1469 -20539
262 -20539 14937 -252 -5872 10358 -25200 22019 -7279 -893 4556 -12119 9846 -633 2448
275 2448 -5722 4440 -3864 10313 -5799 -119 5606 -5628 12198 -9758 9282 -6461 6025
288F025l437n630Q629j0356J4928j7488J5946j3353R581m423j756P792j3293J5021
302H186j3850J2783j3599J2430p852K00P620j4802J9811k1617J7343r324J236
315a435L062m541M153n598Q577j2150J6099j9563J7854q795m817J7209k4114K3615
329I556j7431P937J592o716M736K502o971M714M436j7078K8202l1121K3065n423
343B000j6032L3325l6628K5850p521q873J8401j5690J433J5575k2893J6888K864
356H699k8767M6634m5595K7637J868l4597N4164m7925K3148O373l1571L9321k0876
369a487r701L3336m3519L1264P293m9201O6734n9522L0935J7448o1949P1944n3164
382a9589J9854K5673o0606N3562j9315j6105N1927p0969M1228J6648o1253Q7311
$$ plain form
288 6025 2588 -3042 5587 -4769 10159 -7329 8617 -4736 4845 422 -1334 6458 -6835 8186
302 8186 -5664 7119 -6480 5950 -1902 -1702 5918 -8884 10927 -10690 6653 -2671 -1435
315 -1435 1627 -2914 1239 -4359 4218 -7932 8167 -11396 6458 -2337 -7154 10055 -14059 9556
329 9556 -7875 62 1654 -5062 -326 2176 -4795 -81 4355 -12723 15479 -15642 7423 2000
343 2000 -14032 19293 -17335 8515 994 -7879 10522 -5168 -3735 11840 -11053 5835 8699
356 8699 -20068 26566 -19029 8608 10476 -24121 30043 -17882 5266 11639 -19932 19389 -1487
369 -1487 -11188 22148 -21371 9893 17186 -32015 34719 -24803 6132 23580 -38369 33575 -19589
382 -19589 265 25938 -34668 18894 -421 -16526 35401 -35568 5660 22308 -38945 48366
394D8366q7320L4628M1264q3453R1855p5652J4081O1741q5654O4610l1385k9858
406c6777R4237r3134L8790J6821q1533J35110j04617J1554O1547j10567J34146
417F5577p3172l7411R1886r1803P6717q794q3326R8258n7004L3217J6715r8801
429f7941J14667p1093M4084J7107j28771J61617r0345J4432P6385j82971J64064
440E1235r223j11281J58608j70540O5933J25612k02738J45254p8526k3648J59068
451A09754j69158O7497j7637j9448J11614j25867M0693m846k3454J29151j55530
462e7231L5893N3673r8808J83639j66216j5353J38519j45422J65720j14897p3531
473i4014J78159j31081J05348n1998j29221K24890j29417L8045M5257k20591K75817
$$ plain form
394 48366 -38954 -4326 36938 -46515 45340 -30312 -16231 45510 -40144 24466 -6919 -36777
406 -36777 57460 -35674 3116 19937 -61596 73514 -31103 -19549 41998 -68569 65577
417 65577 -7595 -45006 46880 -44923 31794 23000 -60326 37932 -19072 14145 30860 -67941
429 -67941 46726 -24367 19717 36824 -91947 69670 -20675 -6243 70142 -112829 51235
440 51235 42012 -69269 89339 -81201 -15268 110344 -92394 52860 -25666 -49314 109754
451 109754 -59404 8093 -9544 -28992 82622 -43245 -2552 -7398 -30852 98299 -57231
462 -57231 -21338 32335 -66473 117166 -49050 -64403 74116 -71306 94414 -20483 -94014
473 -94014 84145 -46936 58412 6414 -122807 102083 -27334 10711 55968 -164623 111194
484A11194q7885q8234J59232k42000J99665M8836k00951J45908j03044M8721J17002
495A08444j64932L4678l801N1093L7622j16847O9903r5142J36823M4683k48627
506a46103K18692j21059J9693K21024l64707J61229J05938k06556K75881k27943
516f3911p6053L02543k23609J09845l7965j51561K49820r3384q138l0244o0010
527h2667J68620p4263M950m9606o3434K20458j19718l5525N1735j45338K48963
538A24175q0874j33912J30224j36297J90217l0126j69691J34967r5870J44645
548G7458R1k18063J85998q3423O2339J09921l19109K11749K1814j01303J97976
559A45448k85120Q4733J76637j63983R8063j12108k5333J79586p6533k2930o2860
$$ plain form
484 111194 23309 -64925 94307 -147693 51972 100808 -100143 45765 -57279 -8558 108444
495 108444 -56488 -21810 -25611 25482 63104 -53743 16160 -78982 57841 102524 -146103
506 -146103 72589 -48470 -28777 192247 -172460 -11231 94707 -111849 164032 -63911
516 -63911 -139964 162579 -61030 48815 10850 -140711 109109 15725 7587 -22657 -82667
527 -82667 85953 11690 16640 -32966 -96400 124058 4340 -31185 20550 -124788 124175
538 124175 43301 -90611 39613 -96684 93533 63407 -106284 28683 -67187 77458
548 77458 77549 -140514 45484 -37939 24400 134321 -184788 26961 48775 -52528 145448
559 145448 -139672 -54939 121698 -42285 55778 -56330 -81663 97923 21390 -1540 -64400
570f4400L3701J09859q1630L9569j36427O5224J79598k14528J02526p3375n8659
581i8542K81995k21252k8787J10815j42105K18641p6886j75327J76560p7690R5537
592F2959j0437j66430J30876k0371O9503m2976j28695J34480k8086M9338j2695
603C7466j65508J63414N855m4996O1396j79253J32708P1722j10986O3370j26015
614i0827R1114Q6496j09505L1681q0080P2311R0654j26788L2215m3225K7650J31556
626A13252j63042K5319J6493k6506J44757j48352j4503O7155l5283J00179r7506
637a8037n0154R0437k4626N5470o0088p1281J14366l3062L3888l6674q4028J28490
649D4701l1714M796j6103p4873J09711n493l2604J044n7343Q5453J7268o5354
$$ plain form
570 -64400 -30699 79160 -2470 37099 -99328 -34104 145494 -69034 33492 -39883 -98542
581 -98542 183453 -37799 -66586 44229 -97876 120765 43879 -131448 45112 -32578 62959
592 62959 52522 -113908 16968 -3403 66100 23124 -105571 28909 823 50161 37466
603 37466 -128042 35372 41227 -3769 57627 -121626 11082 82804 -28182 35188 -90827
614 -90827 287 86783 -22722 8959 -71121 1190 91844 -34944 -2729 -45954 -18304 113252
626 113252 -49790 -24471 -7978 -34484 110273 -38079 -52582 14573 -20710 79469 -18037
637 -18037 -68191 22246 -2380 53090 -6998 -78279 36087 3025 36913 239 -83789 44701
649 44701 12987 17783 1680 -73193 36518 31025 -1579 -535 -57878 27575 44843 -20511
661b0511K4436n4283P5452K7833q8555M0773m2417N6646L4073q9626K8266o585
673a4498K5818L6394p7945Q985K6079j312M2291p8264Q551M1767k2259M6725p2834
686c0502K306N3682k5535K1490l6057j8635N6323p950j6596m449k1713M6111l266
699A5209j7003j0549r896M9033k5975J626j3328j3509N4667k5660j7925J4158
711H48j7814K8900J2362n2365K7418O53q15K3196m1553J0819J1274P516o867j2258
725h686L784J463J8763j3216j5439J1995P500o796J3100k5964M710K7369k6077
738g494J4964j2583l333J9037n223r476M46O328m273J2176j4301j955Q087L327
752E727o389J136p62p570K2718k0338L596M987q484J1896n492m145K67Q128q686
$$ plain form
661 -20511 3925 -50358 25094 52927 -35628 5145 -37272 19374 53447 -36179 -7913 -14498
673 -14498 11320 47714 -30231 -21246 4833 3521 45812 -32452 -23901 17866 -4393 42332 -30502
686 -30502 -28196 25486 -49 21441 -14616 -33251 23072 15122 -1474 -5923 -27636 18475 15209
699 15209 -1794 -12343 -22239 26794 819 2445 -10883 -24392 30275 4615 -13310 848
711 848 -16966 11934 24296 -28069 -651 2 -813 22383 -19170 -8351 2923 10439 3572 -8686
725 -8686 -4902 -3439 15324 2108 -13331 -1336 6164 -632 12468 -13496 -8786 18583 -7494
738 -7494 7470 -5113 -8446 10591 5368 -4108 -3662 2666 -1607 10569 -3732 -5687 2400 5727
752 5727 -662 474 -288 -7858 14860 -5478 -1882 3105 -5379 6517 1025 -3120 -2853 5275 -3411
767c411O976n042k206O569k482n61m266R660j2644J3175o188o636J4099j2730
781e687P278j061k956J099M299p352N827j469l499P597r557J0188j0024Q449l917
796g85l491J1414j4873J1861m203l981Q088l929m795J1064j0918M486P442j8046
810a0666K0988j6071O897M477j3725J6693j3802P378J225q520R697l972n187J4085
824I497j6910Q618P297k2175L0038k5941Q835J2225k6171K7942j7743p7J4884
837A0319j9064J2326Q93j5382K2710j8468N060J1939k7137L2814k5123P276J3255
850A1418k9835L4061k2434Q17J9418k9629K3988k521k2326L5685l1811J0559K0459
863A7849m4200M7604l0044l99L0870m6620L9307j4749j2901L2878l5995J8730
$$ plain form
767 -3411 3565 -1477 -3683 2886 404 -157 -4423 5237 -7407 5768 -420 -7056 7043 -5687
781 -5687 1591 530 -2426 -1327 2972 -4380 1447 -22 -3521 4076 -5481 4707 -5317 3132 -785
796 -785 -4276 7138 -7735 4126 -77 -4058 4030 101 -4694 6370 -4548 -62 7380 -10666
810 -10666 10322 -5749 1148 5625 -8100 8593 -5209 2169 3394 -5126 4571 599 -4588 9497
824 9497 -7413 1205 8502 -13673 16365 -9576 -741 11484 -14687 13255 -4488 -4565 10319
837 10319 -8745 3581 4474 -10908 11802 -6666 -1606 10333 -16804 16010 -9113 -1837 11418
850 11418 -18417 15644 -6790 -5973 13445 -16184 7804 5283 -17043 18642 -13169 -2610 17849
863 17849 -26351 21253 -8791 -9190 21680 -24940 14367 -382 -13283 19595 -16400 2330
875B330Q450k9771L8539l0372N974K4636m5124M8300l3240K024L2725n1904M7795
888B0362k4583j0998M4050n2083L0563N720m1060O0185m6147L361M0652o5425
900c5403O3864l1293j9642N5642o1014M3532q419l2153N0632l9661J6031J2307
912A4423m1964N1391l2212L590K6343n8361O7377l8093o049M5068p5423P1356
924B7446k0403l7581O8068p1354L8006K9430p9273P5083l9523r952O7137r0043
936d2959N5978o872k9163O2326p0305L3331P077k5859M7341n6839K1904K2096
948A8056m1079N7841n8620O807N5254p3985P0527m8340k0172Q6145q6027N1856
960A8263j3760m8851R5582o6537O847L1541p1207R1216l7546l7442O6440p8480
$$ plain form
875 2330 10780 -18991 19548 -10824 -4850 19786 -25338 22962 -10278 -8254 24471 -27433 20362
888 20362 -4221 -15219 28831 -23252 7311 13031 -28029 32156 -13991 -10630 30022 -35403
900 -35403 28461 -2832 -22474 33168 -27846 15686 7267 -24886 25746 -13915 2116 14423
912 14423 -27541 23850 -8362 -4772 21571 -36790 30587 -7506 -13555 31513 -43910 27446
924 27446 7043 -30538 37530 -33824 4182 33612 -45661 29422 -10101 -20053 47084 -42959
936 -42959 13019 6147 -23016 39310 -30995 2336 9413 -16446 30895 -25944 -4040 18056
948 18056 -23023 34818 -23802 -16995 38259 -35726 34801 -13539 -33711 52434 -33593 18263
960 18263 4503 -44348 51234 -15303 -8456 23085 -48122 43094 5548 -31894 34546 -43934
972d3934P5297j0787o3957P3323n6378M3814R206o7474N6525k4309J7622J7097
984B6045o7480N5588j7468Q081K8374q9532P9553j9201j5456N9564j12998P7600
996A2670J9086o5092P8069q6699K1464Q0953r5895N2535k6593k8992J00649q2464
1008b0309J4714L864k7636Q0542o4296J956P228j7742P0707o1097j0444L2287
1020I774l5824P4257n0344m2177P1667n1791O1795k8256o4847Q5615m0392L4113
1032B3590j1355o8476Q2447k0890K768J1044p8862Q3709k02l7930M2713q6735
1044e8179P2915K8822p1842M8704o0186M1230M9717p5047K2728j8269J6494N1295
1056D8382o8285Q383J017P320N4639p9533J5006J1413n938O1528q4024P039L5480
$$ plain form
972 -43934 31363 20576 -43381 29942 -26436 17378 26584 -40890 15635 -8674 8948 26045
984 26045 -41435 14153 -3315 4766 33140 -56392 23161 3960 -11496 48068 -64930 12670
996 12670 31756 -33336 44733 -41966 -20502 60451 -35444 17091 -9502 -38494 62155 -20309
1008 -20309 -5595 -1731 -29367 51175 -13121 -11165 -3937 -21679 49028 -12069 -22513 9774
1020 9774 -26050 48207 -2137 -44314 27353 -24438 37357 9101 -55746 29869 -10523 23590
1032 23590 12235 -56241 26206 5316 8084 19128 -59734 23975 23773 -14157 28556 -58179
1044 -58179 14736 43558 -28284 20420 -39766 1464 51181 -23866 -1138 -19407 -2913 48382
1056 48382 -19903 -11520 -10503 -3183 51456 -28077 -13071 -1658 -7596 53932 -30092 -23053 12427
1069A2427k0177N0669o1781j9212O2235k5882K8791l6550l7542P9857l1663J5578
1081A6750k2516m4473Q8118l0220n504k579m6559P7696o208m1831J8689l4420
1093c3057N0781J8887o2604K1329j6025L7514J4905n6042J6354r241L9802L317
1105B5920n3495K0579k134K5249J5219o5577K3306J9697n863L1585o8179J5520
1117a8173M0046k1664K5279n2776O370M6677k0367O277l0632m560N3117k1326
1129H268r887p761j6631N8000k0998k2445M704j1673M4732j4094k5152j17O762
1142f292K8769j3822k1771J584O026K9442j5698l2153K5233r446K7655m940m8085
1155c3498L8005k287N928N979m0221J8509K3565j1686o63j8458L110K9194j1746
$$ plain form
1069 12427 -7750 42919 -18862 -38074 24161 -1721 27070 -9480 -47022 32835 1172 16750
1081 16750 -5766 -50239 37879 7659 2155 -424 -46983 30713 24505 -17326 1363 -33057
1093 -33057 17724 36611 -25993 -4664 -20689 16825 31730 -24312 -7958 -17199 22603 25920
1105 25920 -27575 -6996 -9130 16119 31338 -34239 -10933 8764 2901 34486 -33693 -18173
1117 -18173 21873 209 25488 -27288 -20918 25759 5392 11669 -18963 -23523 29594 8268
1129 8268 -1619 -9380 -26011 31989 10991 -11454 -6750 -18423 26309 12215 -12937 -13054 -6292
1142 -6292 22477 8655 -13116 -11532 -5506 23936 8238 -23915 1318 -8128 19527 14587 -33498
1155 -33498 4507 2220 8148 14127 -26094 -7585 15980 4294 3631 -14827 -11717 17477 5731
1168E731o540j6217J3780J8294j3003N17k2532K0213J7740j9779q02p842N610
1181d830K3599j6776j4735J1081j945J8403j1793j5048Q819M454J3234j8012k777
1194f326K569N410J2587j8071o298J2378J75M147k632k0136K1036J562n823L210
1208C788j5647J3614N146l108q281p41P328J645J217r832j228R505K859r563N180
1223A882r627Q998R173j8292Q864m728L998N872q226k419L620L639k041l10m907
1238d504L675K272K521r060M350K132n488J2541j5573N703N122p629P929n467
1252a476k587O938j465l619M575o330O224j645j154J532m729R207r803P302k396
1267E74n264J1217r634K736M282p549N060K286r689J2130p871l60P551j1757J2295
$$ plain form
1168 5731 -809 -17026 -3246 15048 2045 2562 -19970 243 17983 -1796 -2598 -10440 -4830
1181 -4830 18769 1993 -12742 -1661 -3606 14797 3004 -12044 -3225 1229 14463 -3549 -6326
1194 -6326 -3757 1653 14240 -3831 -10129 2249 2424 6571 3939 -16197 4839 6401 578 3788
1208 3788 -11859 1755 6901 3793 -4488 -5229 2099 3744 4961 -4871 -6099 3406 6265 -3298 1882
1223 1882 -7745 1253 10426 -7866 998 -3730 268 6140 -2086 -4505 -885 2754 713 403 -4504
1238 -4504 -829 1443 3964 -5096 -746 1386 -4102 8439 -7134 -1431 3691 -3938 3991 -1476
1252 -1476 -4063 2875 1410 -2209 2366 -3964 2260 615 -539 993 -3736 5471 -4332 2970 574
1267 574 -4690 6527 -3107 -371 3911 -3638 1422 3708 -5981 6149 -1722 -2082 5469 -6288 6007
1282F007q066J753K964o372Q254o731J681L007n532N379o99p382J2223j0471L935
1297e0N677j5232J7612j1799K734O461j3393J3316o247k039P452j0351O966K880
1311C987j1444J4365j2285L664R958j9241J9231j2443R06J1908j7421J3443n102
1324d74m213J1580j2007N070L933j1355J5781j3144L328Q790j8252K2084j6379
1337e258J779J3235k1064J9982q662p997J9061j8187P824P439k0554K3333j3641
1350b710k148J6517k4811K2135r788m642J5788k0805J6276m477p730J5911j7551
1363h035R595N481j8561K3814j8861K989J6946k9806K8674j5305n454K4383l0303
1376a4443K0493k053j6079K5783k1215M422J3587k4794K5248j3479n728K1443
$$ plain form
1282 6007 -2059 -306 2658 -3714 4540 -2191 -510 2497 -3035 2344 1645 -5737 6486 -3985 -50
1297 -50 5627 -9605 8007 -3792 -1058 5403 -7990 5326 -921 -2960 4492 -5859 1107 3987
1311 3987 -7457 6908 -5377 -1713 8245 -10996 8235 -4208 -3302 8606 -8815 4628 -474
1324 -474 -4687 6893 -5114 -44 3889 -7466 8315 -4829 -1501 7289 -10963 11121 -5258
1337 -5258 -3479 9756 -11308 8674 12 -7985 11076 -7111 713 8152 -12402 10931 -2710
1350 -2710 -4858 11659 -13152 8983 -805 -5447 10341 -10464 5812 1335 -6395 9516 -8035
1363 -8035 1560 7041 -11520 12294 -6567 -3578 13368 -16438 12236 -3069 -8523 15860 -14443
1376 -14443 6050 3997 -12082 13701 -7514 -3092 10495 -14299 10949 -2530 -8258 13185
1388A3185k7481K3885j0701p757K1541k5080J9074m736j2814K3607k1915R681
1400D89Q874k5954L0883j8754k970K3997l6137L1705r926j5687L1135l2320J8876
1413D211M907k4757K8477j8100P67J8603k9656K4290q206q486K3600l0806K2687
1426G531n534j0225K3076k9177J9959m9j6379K5505k5882R284J6515l1716L1140
1439A4048j8554o727L3524m0767K6272m366j9429L7293l2773R394J1096k3423
1451a4412K8680j6775p680K2210k3806K1822r179j4532K7171k5224K1294p956
1463A613j7440L0592k4323J5307m39k4152L2743j6513r32J5322l2444L1375m823
1476E886j7247K5758l3717K6701L235k4437K5571k5693J6743J2129k9404K1154
$$ plain form
1388 13185 -14296 9589 -1112 -8869 12672 -12408 6666 1930 -10884 12723 -9192 489
1400 489 9363 -16591 14292 -4462 -7432 16565 -19572 12133 2207 -13480 17655 -14665 4211
1413 4211 9118 -15639 12838 -5262 -4495 14108 -15548 8742 536 -7950 15650 -15156 7531
1426 7531 1997 -8228 14848 -14329 5630 5581 -10798 14707 -11175 -1891 14624 -17092 14048
1439 14048 -4506 -11233 22291 -18476 7796 3430 -15999 21294 -11479 -2085 9011 -14412
1451 -14412 14268 -2507 -10187 12023 -11783 10039 860 -13672 13499 -11725 9569 1613
1463 1613 -15827 14765 -9558 5749 5310 -18842 13901 -2612 -3544 11778 -20666 10709 5886
1476 5886 -11361 14397 -19320 7381 10616 -13821 11750 -13943 2800 14929 -14475 6679
1488F679j2528L060K2161l4948J7454l31r129K8516l5921J2686Q392j3314K5300
1501A8077k9960M985J6374j4682J7839j9540n411K6445j8809J3253j1472j3346
1513a6247L4144k1984Q578n611j5744L5234j8939n34J904j6665L1551j1213j3228
1526h754J2779j8561K7521k851k6677K3235j8435K1168L963l2703K3008q136R132
1539D689Q651l0465J4481O979l149R823k5914R439J3964p586Q400k5480J3009
1552c159J2539q909P877k5501J4361J6279j5281P579j8127M310K8206k3642K762
1565g06l388q569L5270k3960o867Q265r797K7570j4788j5561J1790j569J4208
1578A1898o661j9322J2413L314Q879o846j8960J6341R14Q932r287j8275K0721
$$ plain form
1488 6679 -5849 -2789 19372 -15576 1878 1547 -7582 20934 -14987 -2301 6091 -7223 18077
1501 18077 -11883 -6898 9476 -5206 12633 -6907 -12318 14127 -4682 8571 -2901 -16247
1513 -16247 17897 -4087 4491 -1120 -16864 18370 -569 -1103 801 -15864 15687 4474 -8754
1526 -8754 4025 -14536 12985 10134 -16543 6692 -11743 9425 13388 -19315 3693 -4443 4689
1539 4689 13340 -17125 -2644 4335 1186 11009 -14905 -5466 8498 912 9312 -16168 -3159
1552 -3159 9380 471 8348 -17153 -2792 13487 -1794 5785 -12342 -8032 20174 -3468 -706
1565 -706 -4094 -12663 22607 -1353 -8220 45 -9752 17818 3030 -12531 -741 -2310 11898
1578 11898 5237 -14085 -1672 1642 10521 3675 -15285 1056 1970 10902 1615 -16660 4061
1591D061r86N187o694j8449K0176N305o896P74j8458J7225J3068j7651M962j4864
1605a3240J3394J5619j9917J621o426R392J3796j6517n429L494M991J2125j4939
1618b036q139Q598K607J1502j6863n213Q841L169R212j7779k983J0212K751M460
1632H339j2758o877J5784M6k13o190j1375K0571j779m136l252q838J7375J38p035
1647b00m050k503J1402L449j0211k470n6R175M138j3513J846j405R734K862j4409
1662f211L461j34Q098J298j1931N68N855K595J393r936j136R889j730K730j0761
1677e952J236Q886k369J925r989L076P298j637j690m968K57Q861k396m414k53
1692b129k550J0605m732l462N33j849R376n366k408l73R33N831l270m419K302
$$ plain form
1591 4061 3075 8262 1568 -16881 3295 8600 1704 2478 -15980 1245 14313 -3338 1624 -13240
1605 -13240 154 15773 -4144 -2523 -8949 443 14239 -2278 -7707 -4213 778 12903 -2036
1618 -2036 -10175 -1577 1030 12532 -4331 -9544 -703 2466 11678 -6101 -9084 1128 3879 8339
1632 8339 -4419 -11296 4488 4534 4321 -1869 -13244 7327 5548 1412 -1840 -10678 6697 6835 -200
1647 -200 -4250 -6753 4649 8098 -2113 -4583 -4639 4536 8674 -4839 -2993 -4398 5336 8198 -6211
1662 -6211 -2750 -2884 5214 6512 -5419 -4851 1004 3599 4992 -4944 -6080 3809 2079 4809 -5952
1677 -5952 -4716 4170 1801 3726 -6263 -3187 4111 2474 784 -4184 -3927 4934 2538 -1876 -2129
1692 -2129 -4679 5926 1194 -2268 -1735 -3584 5792 426 -1982 -2355 -1422 4409 1139 -3280 -978
1707i78J93L466q4p961O246j667L091L13q003O820j770K565j122m691L733J026
1723A177l34L50l473J900L262m318L919n736L442L254n808N261n872L382K431
1738B837m696L178k227R8L598m037P87K153m620O701n565J261K467n586P497o170
1754b324K192J844m293M475k347j021L851m371J668K299n436O820n867J731L497
1769B718o509P351o239K280K731m919M538l019n87M470m710J931J311n535Q937
1784D749o897J344L527p323R662o573L92L562o183P155l064l092N563n141L271
1799I52J973q076R421o117K000L675r535R737n241Q72L736p872O767j359k818
1814a885N102o702L589L645p729Q266p342K194N864j0205R449o738R10O543r471
$$ plain form
1707 -978 -785 2681 2597 -5364 882 -785 2306 2619 -5384 1436 -334 2231 1109 -3582 151 1177
1723 1177 843 1193 -2280 -380 2882 -1436 2483 -3253 189 3443 -2365 2896 -2976 406 2837
1738 2837 -1859 1319 -908 -810 2788 -1249 -462 1691 -2929 3772 -1793 -532 1935 -3651 3846 -2324
1754 -2324 -132 1712 -2581 1894 -453 -1474 2377 -1994 -326 1973 -3463 3357 -2510 -779 2718
1769 2718 -3791 3560 -2679 -399 2332 -2587 1951 -1068 -1655 2815 -1895 36 1347 -4188 4749
1784 4749 -2148 -804 2723 -4600 5062 -1511 -1119 2443 -3740 3415 351 -2741 2822 -2319 952
1799 952 2925 -5151 4270 -1847 153 3828 -5707 4030 -1211 -339 3397 -4475 2292 933 -1885
1814 -1885 3217 -3485 104 3749 -3980 4286 -3056 -862 5002 -5203 4246 -2492 -1582 4961 -4510
1829d510O734k541l030Q336p804K065L659q464J1116p662m45P052j0906J1422
1843E022o581j679P458q908P680k149n329Q756o734K269L939j0096J1053o305
1857a604j17O782j1660J0910n056j678P325j0119P643j124m854Q315q248L231
1871b54M790j0256J0974p582J00Q739j2974J1256n735k613J0057j1313O678M5
1885A912o625J0290p728M14O461j0703J1049n615k792Q761j1192J0052m470l434
1899c620Q326r160P044q57o581R134p160K495M632j1215J1835o215j508R263j4167
1914g754J2051l882m692J0021j1242O484J982q070R257o201p1P659j1353R091
1928C280m043k690R648j2033Q823k772l427Q563r876N624R66o156R265p679J60
$$ plain form
1829 -4510 2224 -317 -3347 4989 -2815 -750 2909 -5555 5561 -2101 -2546 4506 -6400 5022
1843 5022 -1559 -3238 4220 -4688 2992 843 -4486 4270 -2464 -195 3744 -6352 4701 -1604
1857 -1604 -1721 5061 -6599 4311 -745 -2423 4902 -5217 2426 1302 -3552 4763 -3485 -254
1871 -254 4536 -5720 5254 -2328 -2228 6511 -6463 4793 -942 -3555 6502 -4811 1867 1912
1885 1912 -4713 5577 -2151 -1737 4724 -5979 5070 -545 -3337 5424 -5768 4284 -186 -3620
1899 -3620 4706 -4454 2590 1733 -4848 4286 -2874 -379 4253 -6962 4873 -1342 -2850 6413 -7754
1914 -7754 4297 415 -4277 5744 -5498 986 2968 -5102 4155 -2046 -2117 5542 -5811 3280
1928 3280 -763 -3453 6195 -5838 2985 213 -3214 5349 -4527 1097 2063 -4093 5172 -2507 -2347
1943b347P835j1043J0347n522l855J1852j2555Q395k500n631J1209r129L253J903
1957B212o931R203m573k746O530q685R151l594m607Q790r994R771l566n748R406
1972D619q458O310J85q828R887m347p90O854j2847R740q6n961R531j2447P569
1987I31K554o749O304p213L447N048o703L246l079M75P189r015M309k292n98R081
2003F935j1799N560j470j729R539j1007K243L420m310Q176o782m441J0286p081
2017b460O036k875p902J2714o126K735j568o573R383j560j106j038m270P280N00
2032C170m133J004m913Q696k33o140L688o874J0175n31p900M885m819O758K603
2047E436j0325L842R17L99O260j1931K729M864k494O237j1334K336N631j782K681
$$ plain form
1943 -2347 5488 -5555 4792 -730 -4585 7267 -5288 3107 607 -5024 6185 -2944 309 2212
1957 2212 -4719 4484 -89 -2835 3695 -4990 4161 567 -4040 4750 -5244 4527 961 -4787 4619
1972 4619 -3839 2471 2656 -6172 3715 -632 -1422 5432 -7415 2325 2239 -3722 5809 -6638 931
1987 931 3485 -3264 3040 -4173 -726 4322 -2381 865 -2214 -1739 5450 -3565 744 -1548 -2146 6935
2003 6935 -4864 696 -774 -2503 7036 -3971 -1728 1692 -2618 5558 -1224 -5665 4621 -2460
2017 -2460 3576 701 -7201 5513 -613 2122 554 -6019 3364 1804 698 -340 -4610 2670 3170
2032 3170 -963 41 -4872 3824 3591 -2549 1139 -5735 4440 3909 -3991 894 -3925 2833 5436
2047 5436 -4889 -1047 -130 269 6529 -5402 -2673 2191 -303 5934 -5400 -3064 2567 785 3466
2062C466p751J052O236j379k98m378j357R160l509j045l022j810J0669n438o44
2077d8l156k83R272m710k563r89j40P579k471o953L789j405O612r73r562O058
2093E7j115N456k020p984N067J502K721k005o564L269N030j359o72o672M028N716
2109D455l382N61p543N805M606l716m79n352M829M936l674k778j464K266O674
2124E744n884k326O77O50P236p611j027J043J350N350o553k099K377K057K578
2139C562l732m843N173J294J018k505n428O871o3J249l388l413N777k2J41l163
2155a472k076M519J992l329k86k802M509K701n314J740l375N029J495m875O74
2170h70j111M232M06l756o16J183J639J847m730J10K163m38L452o299J758J958
$$ plain form
2062 3466 -4285 -3233 3003 1624 1326 -3052 -4409 4751 1242 197 -2825 -4635 6034 596 -48
2077 -48 -3204 -3487 5785 1075 -1488 -2477 -2617 4962 2491 -4462 -673 -2078 4534 3561 -6001 57
2093 57 -1058 4398 2378 -5606 -539 963 3684 1679 -4885 -1616 3414 2055 1383 -5289 -1261 4455
2109 4455 1073 1634 -5909 -104 4502 786 307 -5045 -216 4720 1046 -1732 -3196 -930 5744
2124 5744 -140 -2466 -1789 -1139 6097 -1514 -2541 -1498 -148 5202 -1351 -3450 -1073 984 3562
2139 3562 -170 -5013 160 1454 2472 -33 -5461 1410 1347 2596 -792 -4205 1572 1550 1691 -1472
2155 -1472 -3548 971 2963 -366 -652 -3454 1055 3756 -1558 182 -3193 1836 3331 -1544 -870
2170 -870 -1981 2251 2657 -1099 -1715 -532 1107 2954 -1776 -1666 497 59 3511 -2788 -1030 928
2186I28p13K631n366J521K079m32L94j932j295M240j361n84k69k527N217k845
2202c14P97j122j507M775k980P31j137l92K800j244j651J436j479K303L10l859
2218b533M315l937L048J40l440L590k492K109j58k293K013l23n37J840k650J500
2234A92Q95k631L780m215K403M71k672L878l422J547M43j844K041n77j422K802
2250A669l093J946Q00l321M162m035K795M68l232L651l163J961L80k198J620l49
2266F1l31J941l126J340Q68k066M018n063K527J138k994M481m741J386K155k802
2282a208K452j812j292L906k507L46Q14l385N267l497J041M8k453M748l355P43
2298a44l4j589L572j573j789K546k774K911N13m731N221l722K450J247n304M979
$$ plain form
2186 928 215 2846 -2520 -999 1080 648 1042 -890 -2185 2055 694 110 -159 -2686 2531 -314
2202 -314 483 -639 -2146 2629 -351 380 -757 -1149 1651 407 -1244 192 -1287 1016 1326 -2533
2218 -2533 1782 -2155 893 1033 -2407 1183 -1309 800 642 -1651 362 39 -498 1342 -1308 192
2234 192 1087 -1544 2236 -1979 424 895 -1777 2101 -1321 226 669 -1175 866 289 -1133 1669
2250 1669 -1424 522 1322 -1999 2163 -1872 923 1391 -1841 1810 -1353 608 988 -1210 410 61
2266 61 -270 1671 -1455 -115 753 -1313 2705 -2358 169 1307 -1687 2794 -1947 -561 1594 -1208
2282 -1208 1244 -568 -1860 2046 -461 -115 699 -2686 2581 -916 125 173 -2280 2468 -887 -144
2298 -144 -178 -1767 1805 232 -1557 989 -1785 1126 1639 -3092 2129 -1593 857 2104 -3200 1779
2314A779k625J278J287l927K646K55j364K574l849J665K233l623M396m938J727
2329d86K812m286M335l965J110K586l251J980j237r40M048l774P30J453m015O196
2345C296m583L40K463l917N312l815j66K106k931L132n42k559L166k519J421J572
2361A776n177N680l535J361J713n387N997l153L33K263m237K944M17k666L628
2376A957l505O60L394m885M585l676N76L318m625M410l264M61K499l333K611q33
2392C50k236M283l440M35K525m961O214l788m47L158m791N106k317j334K897l288
2408a634K576Ql099L831k431O02K670n584N260k628l38L116n508M953j910n83
2424f99K787m147K130J248k874L156k733K06L376m820M459l200j62L760m838L999
$$ plain form
2314 1779 -846 432 1719 -2208 438 693 -671 1903 -1946 -281 1952 -1671 2725 -2213 -486
2329 -486 2326 -1960 2375 -1590 -480 2106 -1145 835 -402 -1342 2706 -1068 -338 1115 -2900 3296
2345 3296 -1287 -947 1516 -2401 2911 -904 -1070 1036 -1895 1237 695 -1864 1302 -1217 204 1776
2361 1776 -3401 2279 -1256 105 1818 -3569 2428 -725 -392 1871 -2366 578 995 -1671 1957
2376 1957 -1548 -888 2506 -2379 2206 -1470 -894 2424 -2201 2209 -1055 -594 1905 -1428 1183 350
2392 350 -1886 2397 -1043 -608 1917 -3044 3170 -618 -1065 2093 -2698 2408 91 -1243 1654 -1634
2408 -1634 942 950 -2149 1682 -749 -147 2523 -3061 2199 -429 -767 2349 -3159 1794 -116 -699
2424 -699 2088 -2059 71 1319 -1555 1601 -1132 -926 2450 -2370 2089 -1111 -1273 2487 -2351 1648
2440A648k430k77L128l645J570L63k292L789k624o85L298m645N446l285j238M400
2456B521n012M477j965j898L610l022J564P76l349L907j254j376K899m237M045
2471A686j106j768K837l959M016j486j206K069k409K398J62k866K823j720M34
2486i5K698n516M104r30j111L801n944L683J87j474K330l589J581K011k564J887
2502A059k083j000M812m200J970j151j296M777m231J536r23l33L159k516l90N41
2518b69p58L093k237j974L091k689M368k639k778M622l136L231j758l095L871
2533I43o99M39L2l362L195J290k213J147l636M182L52k049J274m123M814K20k631
2550h25R51k114K732J993l858L04M81O1L624m772J73J009L14K919n169J563K56
$$ plain form
2440 1648 -782 -1059 2069 -1576 -6 357 -1935 1854 -770 -1455 1843 -2802 2644 -641 -1879 2521
2456 2521 -2491 1986 21 -1877 1733 -1289 275 1051 -2298 1609 355 -1021 1878 -2359 1686
2471 1686 580 -1188 1649 -2310 1706 220 -986 1083 -1326 1072 1234 -1632 1191 -529 -95
2486 -95 2603 -2913 1191 261 -850 2951 -2993 690 877 -597 1733 -1856 -275 1736 -828 1059
2502 1059 -1024 -2024 2788 -1412 558 -593 -1889 2888 -1343 193 -730 -1063 2096 -420 -810 -269
2518 -269 -1027 2066 -171 -2145 946 -1743 2625 -14 -2792 1830 -1306 1925 167 -2928 943
2533 943 244 683 715 -2647 548 1838 -375 772 -2864 1318 1670 -379 895 -3228 1586 1806 -825
2550 -825 126 -1988 744 2737 -1121 -817 -336 -275 3349 -1423 -1250 -241 73 2992 -2177 -614 -358
2567c58J412J496m708Q76K058m29J669l060k069N663k438R75j842k309N518j918
2583E36O1j918l71L358l95r76k101M07L212k41k860P38j481M549n27m607K611
2600ek052M214n96l680J020P44J785j02l042J44K386O68J84m440K338J231MJ572
2618B373n698L133J649r34N84l153P05L634j062j716n32l25L771j582j129j382
2634a664P46L961l423Q0j527J141L767l135j224P87k33K666p58m049L152l45J560
2651A502p42l054K130M04J670k323j222J625L1J813k243j528K206O37j063R23
2667G66l300K635J586k505J663l102K696P80j263m95q78J919M62r07o04j12M96
2684a63K086l076Q33Q6o53L316l787J198M92n33J525j769l66J194OK05n23j474
$$ plain form
2567 -358 1054 2550 -2158 -1282 776 347 2016 -1044 -3113 2550 112 1087 -755 -3064 2454 536
2583 536 597 -1321 -1692 1666 1271 295 -1806 -1399 1813 1572 -1288 -550 -2031 2518 1991 -2616 -5
2600 -5 -2057 2157 1561 -2119 -1099 -355 1430 1328 -1714 -1570 816 1484 1668 -2772 -434 797 801 2373
2618 2373 -3325 -192 1457 523 1107 -2046 -1341 2293 1231 -485 -1017 -1342 2429 847 -282 -1664
2634 -1664 -918 3043 -380 -300 -1827 -686 3081 -54 -1278 -491 -724 1942 1184 -2865 287 -58 1502
2651 1502 760 -2294 -164 240 1910 -413 -1635 -10 21 1834 -409 -1937 269 906 -157 766
2667 766 -2534 101 1687 -818 845 -2257 439 1219 -44 -539 -1417 502 964 57 -547 -659 -163
2684 -163 1923 -1153 -320 -234 -887 2429 -1358 -160 332 -201 1324 -445 -811 383 389 594 71 -1403
2702a403K117o64O47o33j224K538k360K139j312q59K380j852O10K61j159J214
2718D40M19j935K074j919Q17Q60j968K416k099J224j97r72J368q57J05O6k07M77
2736A12J54j153J430j157Q31N7j717K552j940J657n38j497K031j425Q31l3j214
2753a019J281M80j295J185j889J281J240k696K407k706K037Q77j860J004j128
2768h01J066Q06j291n55J148m70J529j876j88R67q07K730l532J118K42n69K384
2785A901k898K68J333r76J336m88k547L419j040l34O11k798L462r48m9k88j324
2802a360K247o87L16j224j62J554M0j528Q80j720K171J290l845K661k034J582
2818A81J384l330J941m89N16P87j975KJ583o32J248k020l15K340j993K401k941
$$ plain form
2702 -1403 714 50 697 64 -1160 1378 -982 1157 -155 -1014 1366 -486 124 385 -774 440
2718 440 859 -1076 998 -921 -104 756 -1212 1204 -895 329 132 -840 528 -329 -224 -158 -365 112
2736 112 266 -887 543 -614 217 274 -1443 1109 -831 826 288 -1209 822 -603 228 195 -1019
2753 -1019 262 742 -553 632 -1257 24 1264 -1432 975 -1731 306 1183 -677 327 -801
2768 -801 265 1071 -220 -775 373 -97 1432 -444 -632 335 -472 2258 -1274 -156 86 -483 1901
2785 1901 -997 -729 604 -372 964 476 -2071 1348 308 -26 585 -2213 1249 301 252 -36 -1360
2802 -1360 887 200 516 -708 -870 684 724 -804 76 -1644 527 1817 -2028 633 -1401 181
2818 181 1565 -1765 176 -313 203 990 -985 -983 600 -32 1216 -804 -1119 1221 -772 1629 -1312
2835a312M18J819j123J314k276M50J525m81l5n89j089K763j315j29L33k205M326
2852B394k664L1Q52k500L661j489j212J401r48N70J780l279J644J8p00J891k969
2869a519J863p52J053K07j983J510o31R14J10j922R68O87j264K176k388J41K250
2886A420k947L205k744K44K274k620J851j201n80J980j109NN66j844K626r26j031
2903h31J868k679K834q86j009J383j781K024p50l33J90m01O68L94j691J538p69
2920b31J88J725l584L149k021P23J954l878K690m39o03J725k174j33K452k035
2936d92J436q17j369K799k444J863j445m30J973j778J468j186l6J295r31k41L93
2953E8r93J791q45q55J687k475L336j979m55J643k492K825j290j069J636j181
$$ plain form
2835 -1312 -894 925 -198 1116 -1160 -710 815 334 299 -290 -1379 1384 69 -60 273 -1932 2394
2852 2394 -270 -239 613 -1887 1774 285 -927 474 -474 96 1876 -1403 241 259 -441 1450 -1519
2869 -1519 344 -408 645 852 -1131 379 -252 662 772 -1150 -182 505 -759 1417 -971 -830 1420
2886 1420 -1527 1678 -1066 -822 1452 -1168 683 -518 -1098 882 -227 -222 344 -1500 1126 200 -831
2903 -831 1037 -1642 1192 306 -703 680 -1101 923 173 -160 30 -371 297 691 -1000 538 -231
2920 -231 -43 1682 -1902 1247 -774 -51 1903 -1975 715 276 -327 1398 -776 -909 1543 -492
2936 -492 944 127 -1242 1557 -887 976 -469 -899 1074 -704 764 -422 -458 837 -94 -335 58
2953 58 -935 856 11 -844 843 -1632 1704 -275 -730 913 -1579 1246 -44 -1113 523 -658
2969f58N14J346k886J964L48j588K585l157J607L59r62J536k000J080l30O83j44
2986B97p86P13K93j157J188j148J65K230l336K778j537o27K941l262J502k71l26
3003c43J131q27q76J254l76L47k88j046K388j902J811j626o55K491k195J555j119
3020b76n24J841o79n86N21j059J208L36j759J271j298K327q73j281J317j840K799
3037A445j363j029J246q85R29Q25k795J076J429j582J957k402P12J142n86K14
3053C33j760J864n03Q32p16j337J537O97j351P79r16o65L603l328Q04J1r36K997
3071A945j956p13OJ227J40k71r41m56J482O25j250j112J962j278K335j750j935
3088a940L026r85N48o58j125R09J593j171p29L65l84J822r49r44p58K362o45n32
$$ plain form
2969 -658 -144 1202 -1684 280 628 -960 1625 -1532 75 434 -528 1008 -992 88 -242 441 297
2986 297 -489 224 517 -640 548 -600 -435 1795 -1541 1237 -300 -927 2014 -1248 254 -17 -343
3003 -343 788 -39 -915 339 -37 310 22 -1024 1364 -538 1273 -353 -1008 1483 -712 843 -276
3020 -276 -800 1041 362 -224 297 -762 446 782 -977 294 -1004 1323 450 -831 486 -1354 1445
3037 1445 82 -947 299 -586 343 1168 -1627 -551 878 -704 1253 -1149 -437 705 119 333
3053 333 -1427 437 -66 766 50 -1287 250 947 -404 375 -541 -1206 2397 -931 -127 -116 -1052 1945
3071 1945 -11 -724 -718 509 649 378 -563 -1019 463 1088 -162 -1274 688 -590 1745 -5 -1940
3088 -1940 1086 101 649 -9 -1134 -225 1368 197 -532 -167 -551 1271 322 -622 -1380 982 337 -195
3106a95N53k399L319l37j718O57n23N70J885k478p65K165j260J907j907p40J341
3123G5M61J22j778P64k14J319R4j758L64R50j85K33m13j811L129j028n31kq72
3142a081J807k1m72j311J005L28L50k73j393Q04J027l7j720J319j488K145J54
3159A143k459J816r56O83N81j208n21J378k99j04L2j220J661k51J91j250P31L55
3177C03n12J088j961P25Q58n30R2j62m64Q84j23q53J429j616J478n26n04N25r36
3196h05J435j207R55r43N18M30q15M16j17j70R3R46j810J903j311O8J320j572
3214f66J213o49r0L02P6m62L97J29o76R81m82K4p08J310j032O81n0j468K288j759
3234f41N16P34j176J097J61j446Q29J14o49J605j959O70M06j30O34j395Q46r27
$$ plain form
3106 -195 358 -2041 1278 941 -777 -120 -643 -73 1812 -666 -1431 734 -526 1381 -526 -1266 75
3123 75 536 658 -1120 -356 -570 749 843 -915 -551 399 214 447 34 -1777 1352 324 -207 -209 -1081
3142 -1081 726 705 233 -1078 -73 255 605 332 -1061 -257 770 733 -987 332 -1156 989 1143
3159 1143 -1316 500 -456 227 808 -400 -921 457 158 54 86 -1134 527 276 467 -783 -52 303
3177 303 -209 879 -1082 -357 501 -29 63 -99 -563 321 198 -655 774 -842 636 110 -394 131 -805
3196 -805 630 -577 378 -565 -47 383 -432 -16 -133 -303 -210 736 -1074 829 -482 -414 906 -666
3214 -666 547 -102 -192 110 186 -276 121 250 -426 555 73 97 -611 699 -333 348 298 -1170 1118 -641
3234 -641 -125 609 -567 530 691 -755 74 188 -461 1144 -815 -145 261 131 765 -630 216 -711
3252g11J740q57r50R10r9L4K85r73j48J538j079J110j406j77J720j224N17j349
3270a119R63O10k83n4r62P16R38m50q51L95q64K259r29j446J246q26J903j253
3288gm43k21N79J203j015n99J33P07J38L26k294J874l62K91P30k898K482j56Q
3307D76j49j352J013P58j30r05r2k26J851j122j57p34O04J415j524M39j319J058
3325i6J428j398j56m17P42Q35j100q02J100q21J813j436j107J751p03J973k079
3342d73p11J267j79P56n37j257Q78Q26o99L76j347J189M57p23K19j221J842o62
3360AL94m51j150J989l67m61n7p73M67J723j930P86l94k57K002k499J176r18O54
3379f5J219j642M41j21J49R57j045p24J483q86P11l18j248J683j008J043q72j90
$$ plain form
3252 -711 1029 172 -778 132 33 67 352 -621 -769 769 -310 800 -606 -783 937 -287 230 -1119
3270 -1119 -156 454 171 117 -845 -129 809 359 -492 -97 -961 1298 369 -1077 169 -657 1246 -7
3288 -7 -450 -671 -92 1111 96 -503 -370 337 475 801 -1493 381 19 310 1040 -1858 624 468 476
3307 476 327 -1025 -12 746 616 -289 -381 -607 1244 122 -35 -769 -165 1250 -274 165 -1154 -96
3325 -96 1332 -66 -222 -639 103 938 -162 -964 136 -685 1128 -308 -1415 336 -367 1606 -473
3342 -473 -1184 83 -96 660 123 -1134 -256 570 -129 247 -1100 89 546 -177 42 -1179 663 1
3360 1 395 -56 -1206 783 416 -45 -102 -875 -408 1315 -615 171 -223 -480 1522 -977 199 -719 -65
3379 -65 1154 -488 -47 -168 -19 938 -107 -831 652 -234 477 159 -1089 594 -414 629 -243 -433
3397d33N61O8N40j275K29L60K5J84m1j454K141q74n17J443k750K655m96q96J012
3416D82j140M53R30j045j83M92m46J242r09k26J76J25Q50j578J014q10O35O96
3434G58j587Q15k73L16N15n19o73R22n67P99m80p64J713j647J136o55m69J135
3452D75r74R69o70q5M39M20o72N05r92P17O54j196P66r83J021j50J00j56j064
3471h76J557q47R3J49k33M18K49j175O63J81p68J818k105R76O7l16Q45j182q8
3490e74N71L40n32L20o90M58L05j02j27n96J156j087J157j065P8J094q90N23q38
3509d99L84M19K03j113N80j7j33N67j075J022p23Q44j47p48P82m56M44j81q5j58
3529i0N21n98O64p79J75J157j334O45o68M33J36J28l37n04R75q22M69q5m32P50
$$ plain form
3397 -433 128 196 736 -539 -310 50 75 259 218 -1236 905 31 -486 957 -1793 862 366 -530 482
3416 482 -658 -205 725 -320 -503 -11 -457 785 -124 -350 -174 -49 801 -777 237 -573 62 758
3434 758 -829 -14 -287 29 544 25 -648 274 -293 506 26 -738 975 -672 464 -191 -660 475
3452 475 -499 470 -200 -285 154 574 -98 407 -585 132 786 -410 356 -627 394 244 344 188 -876
3471 -876 681 -166 -73 76 -157 261 510 -665 -2 179 -589 1229 -876 100 167 -149 696 -486 -574
3490 -574 -3 337 -195 125 -565 -107 198 96 -31 -627 529 -558 599 -466 -388 706 -184 339 -499
3509 -499 -115 304 507 -606 -26 -43 -176 391 -684 338 -385 459 312 -436 346 -110 334 153 68 -90
3529 -90 431 -167 497 -282 -107 1050 -284 361 -307 126 262 390 53 -451 524 -298 171 86 -346 404
3549D04O8q03Q4L04m35J301j244j01N94l66N90j49m22J6Q92j106M10n27L94M18
3569C22o00J81n93J100m06K40m39k98P88m10K71o33L34n5O77o67j60K98M8N65
3589E63j206P53k33N24k63p65M65J21J31J15l02l41J075o66J95q3q19J382m78
3608A68r3k32J07L45R0j84q57R63k23M47n83m6n6P69n15o24P12p73J151p26l75
3629e35O17j70L89k43m70q3R30k46J76n42j00O87l75L58j136P70K32l19m0m32
3649e32O33m3J36m36Q4j44Q59n68nL5l48R40j192Q43m21l95R63n76j32N9O10l59
3671A1M06q78L87L50m44L47o41O04k98N90l69K0N26j037P87l05j14L32j08n86
3691d20O21m84K15O32j110J017p46L46L4k54L03k69L94m87K10L66m80j43L16k56
$$ plain form
3549 404 472 -331 -247 57 -378 923 -321 -422 172 -194 396 247 -175 -159 733 -373 37 -490 -96 322
3569 322 -278 -97 -690 410 4 244 -195 -493 295 -115 156 -477 -143 -198 479 -188 -348 -50 -2 563
3589 563 -643 110 -123 401 138 -627 -162 -41 90 205 -97 -438 637 -29 166 83 -736 646 168
3608 168 75 -157 -50 295 385 201 -656 307 84 531 -52 -98 -154 615 100 -524 188 -585 566 -160 -535
3629 -535 82 -88 301 58 -412 -495 435 189 365 -177 -277 410 35 393 -743 27 259 -60 -100 -532
3649 -532 101 58 194 -242 -158 -302 557 -11 -16 19 -329 611 -581 262 -159 -554 409 -167 -299 -240 370 11
3671 11 417 -461 -74 276 -168 179 -462 142 -156 434 65 85 611 -426 361 56 -58 274 166 -420
3691 -420 201 -283 -68 564 -546 471 -275 71 105 -149 154 -115 279 -208 2 368 -112 -255 61 -195
3711a95K58K02r14R02o17P71n89j95P15o63R58q02j56O3J65K61j3p72P10L25j134
3732g20J512j555Q34K81p91N85r33N27N70R8p79K21J14J74M1k03l44N72M92j203
3752e07O46n73K26J282j667L05K45j33Q15o30p86Q69n8K05L1j238J273j55N66
3771G16j235K8R01m92R26j118k57O77j64K33k91q53J298J84r14Q79j255J020M71
3790G54r10J75p27J270n48K93o49j24Q45P7j005K82l66N52J166j974O98L54n74
3809d11J175j361K85O48r2m6m82k24L98Q89m59o75m3J066p84R56j458oJ772j358
3829b10N46p70l43J504l87r35O22l11M68P94j398K6O95J05l16J4k81m93J918j201
3849D7k92J92l88R71R8j158L60M51l62Q28j605N26Q28l75K28q78N47r3P45n38
$$ plain form
3711 -195 63 265 -649 253 -364 407 -182 -377 338 -325 633 -169 -325 -262 -97 164 151 -621 89 414 -720
3732 -720 792 -763 71 352 -439 146 -787 -260 310 408 -371 -150 -36 138 179 -24 -368 204 696 -507
3752 -507 139 -434 -208 1074 -593 -288 -43 -176 639 9 -777 92 34 239 270 -968 305 150 716
3771 716 -519 -491 410 -82 844 -274 -531 146 -18 215 -76 -929 369 553 -361 518 -737 283 754
3790 754 -156 19 -708 562 14 307 -342 -466 379 456 -549 -267 -633 -81 1085 -889 -191 163 -411
3809 -411 764 -597 -312 336 244 198 -284 -508 -110 779 320 -355 -398 668 -116 840 -618 -624 1148 -210
3829 -210 336 -434 -777 727 340 -595 27 -284 184 978 -420 -394 301 406 90 104 -177 -670 1248 47
3849 47 -245 -53 -441 530 628 -530 -170 281 -81 747 -858 -332 496 121 349 -529 18 -75 670 132
3869A32r01P92K02O4J8r29L3J318j024J07j2m34R71l07j12l65M47J23J99k35p30
3890f43Q64J00l58j79M08q81J583o85j070J335j160J080L8r35J26N47l4l5j72
3909g1n29J176l76l38LJ06O9M99j50j160J028k20K69Oq90M75O15o20j41L66m63
3930c46Q86m25n58J84j03R70n99p2k25K83K35m08R4j12K57P4k7p30N78J8N5K42
3952B71n69K02K6L26j03q1l01J40L06l85K43j78K94k62J70m40K75N28n79M11p29
3973d35M83QP3l31KP7Q7P26q02r5J05J46P0m27L77m08N61l55J66k26L03K25l33
3996cj18J24J20J6R0m94L40j65L5K44k72L9J56p9k23K6K14J70k49j68L78l85N78
4019C74n73K34Q6l40N41k97j69k1M12l03K06k52K6L04l08K62n94M85k77J08L21
$$ plain form
3869 132 -769 23 225 289 307 -622 -589 729 -295 -188 -200 -634 337 30 -82 -447 0 123 322 87 -643
3890 -643 221 321 -37 -216 192 -689 894 209 -861 474 -686 394 432 -503 -377 170 136 101 -71
3909 -71 -600 576 200 -138 -135 -29 40 539 389 -771 257 37 306 312 -578 -103 512 -108 -249 117 -346
3930 -346 540 115 -443 -259 -362 608 9 -63 -288 -5 230 -178 -84 -196 61 135 108 -622 -44 -26 29 271
3952 271 -298 -96 -70 256 153 72 -229 -89 217 -168 75 -103 191 -71 99 -341 -66 462 -117 294 -435
3973 -435 48 56 129 -202 -200 -123 -36 690 -112 -207 -102 44 114 -313 64 -344 217 -138 28 -198 105 330 -3
3996 -3 -121 3 123 139 229 -265 75 -90 -55 189 -83 -44 112 33 -190 -164 50 220 -29 -197 181 -204 374
4019 374 -199 35 121 -219 322 25 -144 -165 247 -56 150 -102 -76 228 -80 182 -412 73 -204 -96 225
4040B25p43J008p42J6M51n56L97P8l81L48j73n1R05j164L56j69J68K68k71J31
4060A01j20O01n49k81j7L58j49K05k33q2N35p37Q69o53M8M75n23M31l89J46r6
4081f0J82k26j25K77J35j08j19K26m54P19n46J26o4j11N48n79K27l43L21K5O5
4102A16j37NKJ89r8m24M42l50L2N53r42R76o17M00j49k14K43L08l91r4J11l70
4124d09Q33m48M5l66N56n4l58K74o10Q37m52pN36m82J99K00m36P0M25l92J70j80
4146d9K19k5m64O04n41M30k07K27j66k24K92k21K61R0m28p9M96n34L71P2l82M68
4168B10n05L99j71m2J37j50K52p4k39K72q4l88P73m96J76J32n07N77o44M24k08
4189a56K77j72j65J84j00J27kj9n9L97m60K07j37l17Q10o64N50l19k65N58k65
$$ plain form
4040 225 -518 490 -252 -236 215 -341 56 134 -247 101 -72 -123 782 -382 -26 -195 -27 241 -30 101
4060 101 -19 582 33 -248 -265 93 -56 149 -84 -166 369 -368 501 -152 -104 371 -152 279 -110 36 -60
4081 -60 122 -104 -229 48 183 75 -44 182 -272 447 -99 27 -37 -148 400 -179 48 -295 26 51 116
4102 116 -21 -16 -14 175 77 -347 95 -255 -223 330 -612 364 -253 147 -2 -216 27 335 -56 -150 -39 -409
4124 -409 424 -24 21 -345 211 157 -201 73 -537 300 -152 -159 377 -105 94 294 -142 -72 353 -39 131 -49
4146 -49 170 145 -319 285 -256 174 -33 194 28 -196 96 -125 136 226 -202 -281 215 -319 52 124 -258 210
4168 210 -295 104 -67 -109 28 -122 130 56 -183 89 5 -383 390 -106 70 202 -305 272 -372 52 -156
4189 -156 121 -51 -216 -32 -132 -5 -7 -26 -85 312 -148 59 -78 -395 415 -249 301 -18 -283 275 10
4210A0r5J60j58j23O21p20M13j86N50k57l08M27q64J013m43k88N47l97K56J0n23
4231c55J22J97j18L21m40o6L11KL14p18N73j78J15L01p78N37J45l64J07j2k22
4252b06M58m88J57Ql33P90j54p9n03M23L0k38L10n54L02P39o79N9J91o23R25n14
4274B1m14O84m65N78l43m70M17R0Q3l37L46m00N29M1l77m20M38K21j47J38j055
4295h42J186k93j44J39n33N03L02j99k77l8L16j15J62k20j05L25K17p01N42o33
4315d08M65N33j199N35j0K29R3J07q67Q36j42k38N9l62M65J43P0n44K7M01j59
4336C4N96j206K20M69k51J48k28l18P24K96o13K56n67O66J74m46p3j57O44l10
4356E8K7k27n1M52j9l21R9J05j79L49o02L86N5JK00m22o3jL76q2k37j29J32N00
$$ plain form
4210 10 -85 75 -83 -206 415 -305 108 -78 472 215 -93 334 -530 483 40 -248 299 -98 158 168 -355
4231 -355 -233 -36 -154 167 -273 -339 -28 -26 288 -430 143 -35 80 381 -397 140 285 -79 28 16 -206
4252 -206 252 -236 -79 -71 -404 386 232 153 -350 73 103 -135 175 -379 -77 662 -17 42 233 -390 535 21
4274 21 -393 291 -174 404 61 -409 8 98 181 -156 190 -210 319 360 -17 -437 1 222 75 213 -842
4295 -842 344 51 -93 46 -487 16 318 119 -158 -196 120 5 167 -53 -158 167 384 -317 225 -408
4315 -408 57 590 -609 -74 -84 145 238 345 -522 314 172 -66 -7 -369 96 239 309 -235 -208 193 34
4336 34 630 -576 -356 113 -138 10 -218 -536 188 484 -129 127 -440 226 400 -46 -119 -276 368 58
4356 58 85 -142 -193 259 240 -81 18 123 -56 293 -309 77 132 133 333 -89 -152 -153 223 141 -96 -225 -93 407
4380D07l51k62J12L12r9K0l19j07O57j15m23jJ84J43K84o01K9n4K49J78m38J74
4402b1j64L48k54J32j13N8M47j70j17n11K62L87M6n60j8L43j07L06l84j5q3K57
4424F9j46l9MJ50L27n29J28J07p8J58j76J05k17M08j18M4j92q3K56n3j10k55L76
4447A36j95J57j76l7K35RJ79n08K97k24K71J36n28K11n0K58j77k19K8M59l45P5
4469hL32o08N61l21O8J6l15K59j35L2p9L03j68M16o73N04k57k7J0k95M33m48M81
4492H1J7l8j19jK45j47j68L91j25l29N98m53l48N62l07M32n53K39K17j36p6j22
4514a40J16J6J11J48j24j53J97j50p2k31J95M75m87K81j22j15K24l96K28n3J69
4535A17j80o1k6K31J35j34j74k63N46n55P41l56n2R8j46l5L01k44j66M82m38K08
$$ plain form
4380 407 56 -206 -94 218 119 139 -180 -287 370 255 -168 -169 15 158 442 -159 -130 -184 65 243 -195 -21
4402 -21 -185 163 -91 41 -72 -14 433 263 146 -365 -103 284 330 -230 -248 95 -12 294 -90 -105 -188 69
4424 69 -77 -116 -112 38 365 -164 -36 71 -7 151 -25 80 -137 271 153 197 5 -78 178 125 15 -240 136
4447 136 -59 98 -78 -115 120 129 308 -200 97 -127 144 280 -248 -37 -87 171 -6 -225 -197 262 -83 -8
4469 -8 324 -284 277 -44 24 40 -275 -16 -151 -119 -198 105 -63 353 -320 184 -73 -100 -90 -385 48 -400 81
4492 81 98 60 -59 -60 185 38 -130 261 136 -193 405 -48 -396 166 -141 291 -262 -23 194 58 -18 -140
4514 -140 -24 -8 103 251 127 -26 171 21 -51 -282 -87 388 -99 182 60 -55 169 -227 1 -52 117
4535 117 -63 -124 -150 81 216 82 -92 -355 191 -364 377 21 -31 67 -79 -114 187 -57 -223 259 -179 29
4557B9k15K9K09j26M20o91M40l12J40J87l03J93K38m77J39M20o95N09l65J46J92
4578A07m56N93l74J35j0M8K7j85R6K3K11k97L6N7l2j58J51K19m31M04l79L57M3
$$ plain form
4557 29 -186 -157 52 -74 346 -345 95 -217 -77 110 -193 0 238 -239 -100 320 -375 134 -231 -85 107
4578 107 -349 244 -130 5 -5 43 70 -115 -19 4 215 -82 -46 11 -21 -179 -28 191 -240 164 -215 142 185
$$ [...]
8191b6
##END NTUPLES=NMR FID
##END=
