##TITLE=1H_BAU 10-2021
 CDCl3,8 sc, 
 11.03.2021
##JCAMPDX= 6.0         $$ Bruker NMR JCAMP-DX V2.0
##DATA TYPE= NMR FID
##DATA CLASS= NTUPLES
##ORIGIN= UXNMR, Bruker Analytische Messtechnik GmbH
##OWNER= root
$$ XWIN-NMR		Version 3.5
$$ Thu Mar 11 10:04:27 2021 Russian Standard Time (UT+4h)  she@DPX200
##.OBSERVE FREQUENCY= 200.131506
##.OBSERVE NUCLEUS= ^1H
##.DELAY= (6, 6)
##.ACQUISITION MODE= SIMULTANEOUS
##.ACQUISITION SCHEME= undefined
##.AVERAGES= 8
##.DIGITISER RES= 18
##SPECTROMETER/DATA SYSTEM= spect
##.PULSE SEQUENCE= zg30
##.SOLVENT NAME= CDCl3
##.SHIFT REFERENCE= (INTERNAL, CDCl3, 0, 15.7039)
##AUDIT TRAIL= $$ (NUMBER, WHEN, WHO, WHERE, WHAT)
$$ ##TITLE= Audit trail, XWIN-NMR		Version 3.5
$$ ##JCAMPDX= 5.01
$$ ##ORIGIN= Bruker BioSpin GmbH
$$ ##OWNER= she
$$ F:/spectra/data/she/nmr/H-F/1/audita.txt
$$ ##AUDIT TRAIL=  $$ (NUMBER, WHEN, WHO, WHERE, WHAT)
(   1,<2021-03-11 10:03:06.15 +0400>,<she>,<DPX200>,
      <created by zg, POWCHK disabled, PULCHK disabled
       configuration hash MD5:
       00 E9 B6 7A A2 85 ED C7 34 08 36 98 17 FE 4E 26
       data hash MD5: 16K
       52 FC 4E 13 83 44 79 1E 88 C3 99 A6 15 CC 0C CC>)
$$ ##END=
$$ 
$$ hash MD5
$$ 3A 1D 97 7D 66 CA 00 42 A8 89 98 22 A3 E4 14 6B
##$RELAX= 
##$RELAX= 
##$RELAX= 
##$RELAX= 
##$RELAX= 
##$RELAX= 
$$ Bruker specific parameters
$$ --------------------------
##$DU= <F:/spectra>
##$EXPNO= 1
##$NAME= <H-F>
##$PROCNO= 1
##$TYPE= <nmr>
##$USER= <she>
##$AMP= (0..31)
100 100 100 100 100 100 100 100 100 100 100 100 100 100 100 100 100 100 
100 100 100 100 100 100 100 100 100 100 100 100 100 100 
##$AQSEQ= 0
##$AQ_mod= 1
##$AUNM= <au_zg>
##$AUTOPOS= <>
##$BF1= 200.13
##$BF2= 200.13
##$BF3= 200.13
##$BF4= 200.13
##$BF5= 200.13
##$BF6= 200.13
##$BF7= 200.13
##$BF8= 200.13
##$BYTORDA= 1
##$CFDGTYP= 0
##$CFRGTYP= 5
##$CHEMSTR= <none>
##$CNST= (0..31)
1 1 145 1 1 1 1 1 1 1 1 1 1 1 1 1 1 1 1 1 1 1 1 1 1 1 1 1 1 1 1 1 
##$CPDPRG= <>
##$CPDPRG1= <>
##$CPDPRG2= <>
##$CPDPRG3= <>
##$CPDPRG4= <mlev>
##$CPDPRG5= <mlev>
##$CPDPRG6= <mlev>
##$CPDPRG7= <mlev>
##$CPDPRG8= <mlev>
##$CPDPRGB= <>
##$CPDPRGT= <>
##$D= (0..31)
0 1.2 0 0 0 0 0 0 0 0.06 0 0.03 0 0 0 0 0.0002 0 0 0 0 0 0 0 0 0 0 0 0 
0 0 0 
##$DATE= 1615442585
##$DBL= (0..7)
120 120 120 120 120 120 120 120 
##$DBP= (0..7)
150 150 150 150 150 150 150 150 
##$DBP07= 0
##$DBPNAM0= <>
##$DBPNAM1= <>
##$DBPNAM2= <>
##$DBPNAM3= <>
##$DBPNAM4= <>
##$DBPNAM5= <>
##$DBPNAM6= <>
##$DBPNAM7= <>
##$DBPOAL= (0..7)
0.5 0.5 0.5 0.5 0.5 0.5 0.5 0.5 
##$DBPOFFS= (0..7)
0 0 0 0 0 0 0 0 
##$DE= 6
##$DECBNUC= <off>
##$DECIM= 32
##$DECNUC= <off>
##$DECSTAT= 4
##$DIGMOD= 1
##$DIGTYP= 9
##$DL= (0..7)
0 120 120 120 120 120 120 120 
##$DP= (0..7)
150 150 150 150 150 150 150 150 
##$DP07= 0
##$DPNAME0= <>
##$DPNAME1= <>
##$DPNAME2= <>
##$DPNAME3= <>
##$DPNAME4= <>
##$DPNAME5= <>
##$DPNAME6= <>
##$DPNAME7= <>
##$DPOAL= (0..7)
0.5 0.5 0.5 0.5 0.5 0.5 0.5 0.5 
##$DPOFFS= (0..7)
0 0 0 0 0 0 0 0 
##$DQDMODE= 0
##$DR= 18
##$DS= 0
##$DSLIST= <SSSSSSSSSSSSSSS>
$$ [...]
##$SUBNAM2= <"">
##$SUBNAM3= <"">
##$SUBNAM4= <"">
##$SUBNAM5= <"">
##$SUBNAM6= <"">
##$SUBNAM7= <"">
##$SUBNAM8= <"">
##$SUBNAM9= <"">
##$SW= 16.9725357007746
##$SWIBOX= (0..15)
0 0 2 0 0 0 0 0 0 0 0 0 0 0 0 0 
##$SW_h= 3396.73913043478
##$TD= 16384
##$TD0= 1
##$TE= 0
##$TE2= 300
##$TE3= 300
##$TEG= 300
##$TL= (0..7)
0 120 120 120 120 120 120 120 
##$TP= (0..7)
150 150 150 150 150 150 150 150 
##$TP07= 0
##$TPNAME0= <>
##$TPNAME1= <>
##$TPNAME2= <>
##$TPNAME3= <>
##$TPNAME4= <>
##$TPNAME5= <>
##$TPNAME6= <>
##$TPNAME7= <>
##$TPOAL= (0..7)
0.5 0.5 0.5 0.5 0.5 0.5 0.5 0.5 
##$TPOFFS= (0..7)
0 0 0 0 0 0 0 0 
##$TUNHIN= 0
##$TUNHOUT= 0
##$TUNXOUT= 0
##$USERA1= <user>
##$USERA2= <user>
##$USERA3= <user>
##$USERA4= <user>
##$USERA5= <user>
##$V9= 5
##$VALIST= <valist>
##$VCLIST= <CCCCCCCCCCCCCCC>
##$VD= 0
##$VDLIST= <DDDDDDDDDDDDDDD>
##$VPLIST= <PPPPPPPPPPPPPPP>
##$VTLIST= <TTTTTTTTTTTTTTT>
##$WBST= 1024
##$WBSW= 4
##$XGAIN= (0..3)
0 0 0 0 
##$XL= 0
##$YL= 0
##$YMAX_a= 973859
##$YMIN_a= -899250
##$ZGOPTNS= <>
##$ZL1= 120
##$ZL2= 120
##$ZL3= 120
##$ZL4= 120
##$ABSF1= 10
##$ABSF2= 0
##$ABSG= 5
##$ABSL= 3
##$ALPHA= 0
##$AQORDER= 0
##$ASSFAC= 0
##$ASSFACI= 0
##$ASSFACX= 0
##$ASSWID= 0
##$AUNMP= <proc_1d>
##$AZFE= 0.1
##$AZFW= 0.1
##$BCFW= 1
##$BC_mod= 2
##$BYTORDP= 1
##$COROFFS= 0
##$CY= 11.3945322036743
##$DATMOD= 1
##$DC= 2
##$DFILT= <>
##$DTYPP= 0
##$F1P= 15.9154993809931
##$F2P= -4.1035820241983
##$FCOR= 0.5
##$FTSIZE= 0
##$FT_mod= 4
##$GAMMA= 1
##$GB= 0.15
##$INTBC= 1
##$INTSCL= 1
##$ISEN= 128
##$LB= 0.24
##$LEV0= 0
##$LPBIN= 0
##$MAXI= 10000
##$MC2= 0
##$MEAN= 0
##$ME_mod= 0
##$MI= 1.114404
##$NCOEF= 0
##$NC_proc= 0
##$NLEV= 6
##$NOISF1= 3.799351
##$NOISF2= 2.8
##$NSP= 1
##$NTH_PI= 0
##$NZP= 0
##$OFFSET= 15.70392
##$PC= 1
##$PHC0= -11114.64
##$PHC1= 8.000941
##$PH_mod= 1
##$PKNL= yes
##$PPARMOD= 0
##$PSCAL= 0
##$PSIGN= 0
##$REVERSE= no
##$SF= 200.130013532006
##$SI= 16384
##$SIGF1= 3
##$SIGF2= 2
##$SINO= 400
##$SIOLD= 16384
##$SREGLST= <1H.CDCl3>
##$SSB= 0
##$STSI= 0
##$STSR= 0
##$SW_p= 3612.71676300578
##$SYMM= 0
##$S_DEV= 0
##$TDeff= 0
##$TDoff= 0
##$TI= <>
##$TILT= no
##$TM1= 0
##$TM2= 0
##$TOPLEV= 0
##$USERP1= <user>
##$USERP2= <user>
##$USERP3= <user>
##$USERP4= <user>
##$USERP5= <user>
##$WDW= 1
##$XDIM= 8192
##$YMAX_p= 0
##$YMIN_p= 0
$$ End of Bruker specific parameters
$$ ---------------------------------
##NTUPLES= NMR FID
##VAR_NAME=  TIME,          FID/REAL,        FID/IMAG
##SYMBOL=    X,             R,               I
##VAR_TYPE=  INDEPENDENT,   DEPENDENT,       DEPENDENT
##VAR_FORM=  AFFN,          ASDF,            ASDF
##VAR_DIM=   8192,          8192,            8192
##UNITS=     SECONDS,       ARBITRARY UNITS, ARBITRARY UNITS
##FACTOR=    0.0002944,     1,               1
##FIRST=     0,             0,               0
##LAST=      2.4114304,     0,               0
##MIN=       0,             -899250,         0
##MAX=       2.4114304,     973859,          0
$$ Real data points
##PAGE= N=1
##DATA TABLE= (X++(R..R)), XYDATA
0@%%%%%%qJ6j6K4l2L2m0N6p2R1j15J41j69K04k45K89l40M01m69N44o32P33q41
29d48R58j089J237j404J587j787K006k247K514k802L115l461L839m249M698n190
45b723N725o308O944p644Q416r266J0206j1249J2413j3724J5206j6897J8855k1143
59a1189K3855k7135L1183l6313M3039n2238O5554q6451J23619k07241O76581l0456
71E12808j412058J538879j115619L63818J045583j538736M47880L71621l78196
80a64020O30226n95392k23354L87669K49579j29376m50808L56586k93413M60514
90B28211K60154j198531Q30766L1173l53406P72032j045345J91091P59472o66134
100a90517M63444n07043j27426Q44333o13671K87347l45075j73250R08636p05487
$$ plain form
0 0 0 0 0 0 0 0 -8 8 -8 16 -16 16 -24 32 -40 51 -64 77 -92 112 -133 156 -184 217 -252 292 -340 393 -448
29 -448 510 -579 658 -746 841 -946 1060 -1187 1327 -1475 1640 -1821 2018 -2231 2467 -2723
45 -2723 3002 -3306 3638 -4006 4410 -4856 5350 -5899 6514 -7210 7996 -8901 9954 -11189
59 -11189 12666 -14469 16714 -19599 23440 -28798 36756 -49695 73924 -133317 543264 512808
71 512808 -899250 639629 -475990 -112172 933411 -605325 -157445 214176 -164020
80 -164020 466206 -129186 -352540 35129 284708 155332 -295476 61110 -232303 228211
90 228211 488365 -710166 120600 151773 -201633 570399 -474946 -283855 475617 -190517
100 -190517 272927 -234116 -361542 482791 -130880 156467 -188608 -361858 546778 -158709
110a58709K00873p2618m33695J051795n97695k93261N36508o32213O96477K1010
120C18472p91471N55576j08897J23912Q7872l85016Q9100R0920L35866l82664
130f6330j28612L07214l27360N54096k31219o27768Q50449m09352K7621M86521
140D35260j030511O90657K41086o38609N90667n15365L9032N71199m82753O8255
150c1082k5421m8479L20433k11784n0718q2646J31002K22663l47311J75514j75708
161a23537M8999M18141n34081J51222R3488k04262M24437l23629j35797K99694
171A14675j84975K22704j53065j88310L06386j73063J87000j39474j89539L45975
181A48314j99156J29291m8606k49000L62836j21501o6022J36325k83119K49461
$$ plain form
110 -158709 42164 -30454 -464149 587646 -10049 -303310 233198 -399015 297462 318472
120 318472 -472999 82577 -26320 97592 185464 -199552 -110452 -19532 316334 -66330
130 -66330 -194942 112272 -215088 339008 107789 -519979 330470 -78882 -51261 435260
140 435260 -595251 95406 336492 -302117 288550 -226815 -187783 383416 -99337 -31082
150 -31082 -56503 -104982 215451 3667 -47051 -129697 1305 223968 -123343 52171 -123537
161 -123537 -74538 343603 -190478 -39256 54232 -150030 274407 -49222 -185019 114675
171 114675 -70300 152404 -661 -188971 117415 -55648 131352 -8122 -197661 148314
181 148314 -50842 78449 29843 -219157 143679 22178 -43844 92481 -190638 58823
191E8823O4992k28901J56872j55523J29298P0371j58848P6321j04709J47830J2258
202F8784j40471R2491q7628R4752P3664k07379J26074l0274k5940J76943k51405
213a10389R2286P2373j07794J50918j51062Q789R4622o0914N5009p1937j6516
224d4615R8761o4712L5357l1729n0858J27029q9063L9267k2996n2690J28488r1778
236a9539J9665J1656n6194Q3093k0463m8700M3862l3742L5672J1994o7149O2322
248B2477m5320L7140R570n9314M9163k4801K4680q007k1306J6873j694J557J2037
261A3055l1172J1043K6004l6618L5295l4953J4849J2502k1042K5149l2190J9967
273A889K493n615m185P744q254N759P084j7444J5540j5259K1887k0024P773M026
$$ plain form
191 58823 123815 -105086 51786 -103737 25561 95932 -62916 13405 -91304 56526 68784
202 68784 -71687 20804 -66824 27928 101592 -105787 20287 -9987 -35927 141016 -110389
213 -110389 -18103 54270 -53524 97394 -53668 -44879 49743 -11171 43838 -28099 -44615
224 -44615 54146 -10566 24791 -6938 -57796 69233 -19830 19437 -3559 -56249 72239 -19539
236 -19539 126 11782 -44412 38681 18218 -30482 13380 -20362 15310 27304 -39845 22477
248 22477 -22843 14297 23867 -35447 13716 -11085 13595 5588 -15718 1155 -539 1018 13055
261 13055 -18117 -7074 18930 -17688 17607 -17346 -2497 10005 -11037 14112 -18078 1889
273 1889 4382 -1233 -5418 2326 -5928 -169 6915 -10529 5011 -10248 11639 -8385 -612 3414
287C414j2043J6714j4092J1634j5134J7192r737K002J620l702Q118j4061J9913
300A1838j9197J1537l229J712l213J277P366j7406K2308j9891J4281q914L033
313A502M980j2994J5813j1933N204m143R946j6152J4838o532n088J4244k0757
326a1072K4745k4417J4474R76j4316J6541q914j822N233L50j0122J7509k2981
339a3816K2676j3292n664K6966m1093L8332j8839m817K0015k2407J5477k510j1214
352a0186J8174j2395n328L0423m6620L9969j1983j9835M4711n4765M3995j5541
364F19j4678L8176m5355K5866J2079l8985M1159k2187j3384N1523o5297M9830
376A9366j7428k6885P1134q2217N0801m841l7761O7454o0120J6409K5325n0548
$$ plain form
287 3414 -8629 8085 -6007 5627 -9507 7685 -2052 -50 1570 -2132 5986 -8075 11838
300 11838 -7359 4178 949 2661 -552 725 8091 -9315 12993 -6898 7383 -1531 1502
313 1502 6482 -6512 9301 -2632 2572 -1571 8375 -7777 7061 529 -4559 9685 -11072
326 -11072 13673 -10744 3730 4706 -9610 6931 -1983 -3805 1428 1778 -8344 9165 -13816
339 -13816 8860 -4432 -10096 16870 -24223 14109 -4730 -9547 10468 -11939 3538 1028 -10186
352 -10186 7988 -4407 -9735 20688 -25932 14037 2054 -17781 26930 -27835 16160 619
364 619 -14059 24117 -21238 4628 16707 -22278 18881 -3306 -16690 34833 -30464 19366
376 19366 1938 -24947 46187 -36030 14771 9930 -27831 39623 -20497 -4088 21237 -29311
388b9311O3103m1905j9332P2648q8090P4702k5924n3188J02629r3987N9960q735
400A2570o3643J01755p2903K0680L1736q9613J01516l7117l8165Q2972j16796
411f7008J04743j3613q1904J19768j24813Q1456L1354j19196J09814o4478J2295
422a1582P1502j17992P0624j1047k2401Q4334j28123P8452q161l1390J03611j64292
434h6465J06200N251p9047J52806j80256N4650J18763j76599J55280q5128q2617
445i7162K24707j84249O3167K6000j34514K04258j15046j1697M8606q9767J41403
456G5706p5260k7344M3468p8081J49344q6996o0317J16810j40178J67937n0702
467C4387j44731J88973j40049J12593P305j84461J91690q8897L9617O0735k18183
$$ plain form
388 -29311 33792 -8113 -27445 45203 -42887 31815 5891 -47297 55332 -38655 21305 12570
400 12570 -51073 50682 -22221 -1541 30195 -59418 42098 4981 -33184 49788 -67008
411 -67008 37735 24122 -57782 61986 -62827 18629 49983 -69213 40601 -23877 -11582
422 -11582 59920 -58072 12552 1505 -20896 63438 -64685 13767 5606 -25784 77827 -86465
434 -86465 19735 24986 -54061 98745 -81511 -26861 91902 -84697 70583 -14545 -97162
445 -97162 127545 -56704 6463 32463 -102051 102207 -12839 -24536 24070 -65697 75706
456 75706 446 -26898 16570 -61511 87833 837 -59480 57330 -82848 85089 34387
467 34387 -110344 78629 -61420 51173 58478 -125983 65707 -23190 16427 77162 -141021
478a41021J95702l1912n9480J46337k63746J81217O3836j85950K04981k18826
488a08862O7398J89894k34094J10946m7929m5350J85235j36690j5111J1012Q857
499a4694J00196j24505M9058p2166M8643J64626k71463J45007k1216j04737L11935
510B10684l06076K17K26026k55640K49542q8898k36180L38094j59022K8897O5518
521G3162k35762K27521j7677m9679J7061j21210J60832j8115k5140q764j25706
532a23477K10019l9752r1822R2218j83605K05803L1500j99885J42880j36752J32874
543D0001P5304k17676J22609q0119Q8065J00775k56765J43318k7265j1868J94369
554A70748l15870J14952J08249j53595K28905k38194k5456K37636j60853Q4730
$$ plain form
478 -141021 54681 22769 -36711 109626 -154120 27097 90933 -95017 109964 -108862
488 -108862 -41464 148430 -85664 25282 -22647 -67997 117238 -19452 -34563 -23551 -14694
499 -14694 85502 -39003 10055 -62111 -13468 151158 -120305 24702 3486 -101251 210684
510 210684 -95392 -95175 130851 -124789 124753 35855 -200325 137769 -21253 7644 73162
521 73162 -162600 64921 47244 -2435 14626 -106584 54248 36133 10993 2229 -123477
532 -123477 86542 46790 -45032 47186 -136419 69384 100884 -99001 43879 -92873 40001
543 40001 115305 -102371 20238 -59881 28184 128959 -127806 15512 -11753 -23621 170748
554 170748 -145122 -30170 78079 -75516 153389 -84805 -110261 127375 -33478 51252
564E1252o8475r5613J95198m5082l0692n3193j3861J35310o9725L5218j11361
575g1024j0111K25652j88133N7403k1779j27092K98233j56635r5998J44003j62033
586a07514J92907K582k26239J68162n8507O5052M5835j93810J11951m497N2971
597D8893L108j58422J17662n383K9877K6376j84087J32910M0308o2579Q4737j82173
609a08773R0657J13397j22587O9586j18340N0738J19521j09647K8241p3830M0474
620b0563J19639j22968J8548k9358k096J50889j45073j908L1972m5053J53643
631A07672j27237m2026P9321m5617J02593p5536p4333R3768k2424N2696m2858
642F019q8865J13124k5998K6477j7933j00875J23209j7430m453l549q5007J02877
$$ plain form
564 51252 -17223 -112836 82362 37280 6588 -46605 -60466 74844 5119 40337 -71024
575 -71024 -81135 144517 -43616 13787 -7992 -135084 163149 6514 -89484 54519 -107514
586 -107514 85393 87975 -138264 29898 -28609 36443 82278 -111532 419 -4078 48893
597 48893 52001 -106421 11241 5858 35735 62111 -121976 10934 51242 -11337 73400 -108773
609 -108773 -18116 95281 -27306 42280 -76060 -25322 94199 -15448 12793 -61037 -20563
620 -20563 99076 -23892 -5344 -34702 -36798 114091 -30982 -32890 -918 -45971 107672
631 107672 -19565 -61591 17730 -27887 74706 -830 -75163 18605 -3819 48877 6019
642 6019 -82846 30278 4280 30757 12824 -88051 35158 17728 13275 9726 -75281 27596
654B7596O733l8165R301o4877P7601L1711p0742K5411n2891O4016M0293r0146
666c4159L8775m0377M6614M6882r2581K4156j262J7231M3245p4563K062K8780
678D803m243M5326p4356J213M6457k4882M5988o5402m977N5404k5020K1233l3828
691a2284k1368N7350q649j6285j544k4628M5171n78j8570r466r716M7381k4386
704B428j01j0780j4853N2558k2639j9779J4027j6407K8569J0007n0575K8948j939
717e36j68K3314m2282J1172J2610M867o737j1104L464K217J6997j2639j5308J2063
731b070P949p282J1373k4215O966K3381k4197J4845j4092j266J9444p295r750
744f209L659L944l147J1419j4500j153R077K745p880K582r71n735K0207j9642
$$ plain form
654 27596 34329 -3836 5465 -59412 18189 49900 -20842 4569 -48322 15694 55987 -34159
666 -34159 4616 -35761 10853 57735 -34846 -10690 -11952 5279 48524 -26039 -23977 4803
678 4803 560 45886 -28470 -27257 19200 -5682 40306 -25096 -30073 25331 311 21544 -12284
691 -12284 -33652 23698 15049 -1236 -2780 -27408 17763 17185 -1385 -10851 -20567 26814 2428
704 2428 2327 -8453 -23306 29252 6613 -13166 861 -15546 13023 23030 -27545 1403 -536
717 -536 -704 22610 -19672 -8500 4110 8977 2240 -8864 -5400 -3183 13814 1175 -14133 -2070
731 -2070 5879 -1403 9970 -14245 -7279 16102 -8095 6750 -7342 -8608 10836 3541 -6209
744 -6209 -2550 1394 -1753 9666 -4834 -5987 3090 5835 -2045 537 -434 -6169 14038 -5604
758e604N250K799o343J1378p116l632L219N179q152Q262p417oO480l185j582k077
774b547Q506j2237J2772p285m370J1785j1023O784k088k004J646K674o800P323
788C136m333j535O597q937Q943q752Q515o527K57Q721j4130J2187m703l509P469
803C399m199l734R857j1424P506K347j3769J9983j8353J0756J512j1716J4700
816F865j2259P926j191o302R574n774k603J2952j8607J3050J570j7214K7380k7067
830a1700J5041L893j9900K6560k0852N231J1662j9306J4611k112j2190K1523k0800
843h339J1266L936k0348L0920k9214J5172N016k3693L1734k5298P950J1905k6297
856a5290K7176j1863j2909L2734l7027K1672P419l5306M6522l7771J3381J6560
$$ plain form
758 -5604 -354 2445 -3898 7480 364 -3268 -49 5130 -3022 5240 -2177 -2183 4297 1112 -470 -2547
774 -2547 5959 -6278 6494 -791 -5161 6624 -4399 2385 297 -1707 -61 2613 -4187 3136
788 3136 -1197 -2732 3865 -5072 3871 -4881 3634 -2893 -2636 6085 -8045 4142 -561 -4070 3399
803 3399 -800 -4534 5323 -6101 1405 3752 -10017 9966 -8387 2369 3881 -7835 6865
816 6865 -5394 2532 1341 -4961 4613 -1161 -3764 9188 -9419 3631 5201 -12013 15367 -11700
830 -11700 3341 7234 -12666 13894 -6958 -1727 9935 -9371 5240 3128 -9062 12461 -8339
843 -8339 2927 6863 -13485 17435 -11779 3393 8409 -15284 16450 -8848 -898 11007 -15290
856 -15290 11886 23 -12886 19848 -17179 4493 11912 -23394 23128 -14643 -1262 15298
868A5298l8951M2091k5300j596K6135l6759K6602k297k1994L6415l5976J8861
880B529R060l4438M7351m2540J8517J6271m2817M8892l4942N403K9054m8471M1380
893A5249j3163k3668N4779n7747K6560J7806n2337O6070m9546O874L5423n4982
905b8682N2111k8101j2103M2893m5277K8977l914k7912M8536m2671K1853M776
917A0486m0181O5352n5850K0643J9477n8633P6293m7345o954M8833p0287O1432
929B3266q733n3756P7476o3268K5905L2774p9631P4007l5786n53L8850o7021N2615
942A6145j5731q945L3294n6797M2406j707k4711M6451o6515M2687J6498n5510
954c2435P1135p3200K8326M6888q0742O8684m5239n786P1460q2762M1487k063
$$ plain form
868 15298 -23653 18438 -6862 -8458 17677 -19082 7520 5223 -16771 19644 -16332 2529
880 2529 11589 -22849 24502 -18038 479 16750 -26067 22825 -12117 -6714 22340 -26131 15249
893 15249 2086 -21582 33197 -24550 2010 19816 -32521 33549 -15997 -9123 26300 -28682
905 -28682 23429 -4672 -16775 26118 -19159 9818 5904 -22008 26528 -16143 5710 10486
917 10486 -29695 35657 -20193 450 19927 -38706 37587 -9758 -16712 32121 -38166 23266
929 23266 14533 -39223 38253 -25015 890 33664 -45967 28040 -7746 -8299 30551 -36470 16145
942 16145 414 -8531 24763 -32034 10372 8665 -16046 30405 -36110 6577 23075 -32435
954 -32435 38700 -34500 -6174 40714 -40028 28656 -16583 -22369 49091 -33671 7816 5753
966E753m1547Q8343p5718R300L8212o4211Q6391n6624j8362N7294n7603O1256
978C2484l1359l5690N9701l8399L2142j2238m3294O3014l6252K6913q497n6298
990d7773Q9162n4284K0233J5264q4043J05066l7456k6098N5377r0338P5300J8326
1002C8736q1312P1691n8642K5034N7903r4667N0832k1591P073M8206p6102L3253
1014D14q765P410M1465p5169K8943J1158j6460N7023q2142J8287M3566m6540O4510
1027D3700p2795j126O7892n4293M5097m7631j5997P6062m9590K1857k1645l4744
1039d3213R2702n3193k235J3824n7775J00084m1458l4184L9259n2419P4850j4001
1051B2241n7296M1662k4550M0365M465o3905L8885j0018K7893O448p0530N2153
$$ plain form
966 5753 -35794 52549 -23169 -13869 24343 -39868 46523 -10101 -28463 28831 -28772 32484
978 32484 1125 -34565 25136 -13263 18879 6641 -36653 26361 -9891 17022 8525 -47773
990 -47773 41389 -12895 7338 22602 -61441 43625 6169 -19929 35448 -54890 20410 38736
1002 38736 -42576 29115 -29527 -4493 53410 -41257 9575 -12016 -4943 43263 -32839 414
1014 414 -8351 -941 40524 -34645 -5702 5456 -11004 46019 -36123 -17836 25730 -20810 43700
1027 43700 -29095 -30221 37671 -16622 28475 -19156 -35153 40909 -8681 13176 -8469 -43213
1039 -43213 49489 -3704 -5939 7885 -49890 50194 8736 -25448 13811 -38608 36242 22241
1051 22241 -35055 6607 -17943 22422 26887 -37018 1867 -8151 19742 26190 -44340 7813
1063G813j2330J9563J4159p9262N6110M096n451K2410p1300L9581L2725l3405
1075e291K6617n7328K3565N2919n1724K5868m5057J6526O0291o0463J8548k3585
1087a9114O17O6958n6044q673J4209j6670N9394l8639l1796L2857j3580M4152
1099C3671l3462k8975K9820l863L4025l6772k2610L3219n240K5687k6697l7207
1111c8404N3217r606O061k989n2343O0021j070j4198N504m2900M9104R672k7119
1124e050N187k5967L2501K2496m0818P820j2481J8508L1554m9762Q137j58J1094
1137C061K5573m0916j651J0293J3654Q553k8736l317J2335J0445J0816l6502K571
1150a3821K3460r898K3099l9316l000L8253j9544J2946j9918j4695L8612n194
$$ plain form
1063 7813 -4517 15046 29205 -50057 6053 10149 4698 27108 -44192 -4611 28114 -5291
1075 -5291 21326 -36002 -12437 40482 -11242 14626 -30431 -13905 46386 -14077 4471 -19114
1087 -19114 -18497 48461 -7583 -16256 -2047 -18717 40677 2038 -29758 3099 -10481 33671
1099 33671 209 -28766 1054 -2809 31216 -5556 -28166 5053 -187 25500 -1197 -38404
1111 -38404 14813 5207 11268 8279 -44064 15957 14887 689 6193 -36707 12397 22069 -5050
1124 -5050 137 -25830 6671 29167 -11651 -3831 -16312 2196 33750 -16012 -7875 -8033 3061
1137 3061 28634 -12282 -13933 -3640 10014 18567 -10169 -13486 -1151 9294 20110 -16392 -13821
1150 -13821 9639 -259 22840 -16476 -19476 18777 -767 12179 -7739 -22434 16178 10984
1162A0984j4779M60j2398K4982N862k1452j052m134K5137o431j1858k252m976
1175a1907K8637j1125j4798M573k033J6177J791k5896R594P194Q20Q266k4321
1188a3028O638R688M052k971j5863R575K494Q111n317j5408J0337Q407m879K624
1202D460j3059K006K0269j5379L232o069j205J6295q100n165k584O750K464k36
1216C679n938l961P644N902p921k678L558m816J5198j2137m666R490o478R611
1230F487o085n770M803L996k661l73l160N19N067q62k848m294R158o355M754p63
1246A613r786J4254p368P13K659o679N272K989o947L685o47k640P367p894M318
1261I09l221L367L97n335Q293r347O918L52p106Q029l588k451P353p828K498N808
$$ plain form
1162 10984 -3795 -3335 -15733 9249 15111 -6341 -7393 -11527 13610 7179 -4679 -6931 -11907
1175 -11907 16730 5605 -9193 -4620 -6653 9524 11315 -14581 -4987 2207 3027 11293 -13028
1188 -13028 -6390 3298 7350 4379 -11484 -1909 585 8696 3379 -12029 -1692 6715 1836 4460
1202 4460 -8599 -6593 13676 -1703 1529 -4540 -5745 10550 2450 -2715 -5299 1451 3915 3679
1216 3679 -2259 -6220 1424 7326 -595 -3273 285 -4531 10667 -1470 -6136 3354 -3124 6487
1230 6487 402 -5368 -565 3431 770 397 -2763 -2244 2823 1961 -887 -5181 3977 -2378 2376 1613
1246 1613 -8173 6081 -1287 -574 2085 -4594 678 3667 -3280 405 -242 -2882 4485 -3409 909
1261 909 -2312 1055 1452 -3883 4410 -4937 1981 2333 -4773 3256 -332 -2783 4570 -3258 -760 5048
1277E048j1668J2178p476N7O759j0157R444o067K229J722n232O170k965j572N590
1292D060p816M436L522j0442J3450j1769M199O541j3487J4461j0657K190P343
1305F031j1431Q448k671m494J0836j0816L860M778j3092J7858j3894K216R530
1318G159j6706J7414j0289j584J0297j2479R725k167p642J2648j0703M256M908
1331D837j4286J8005j3836M548P118j8167K1685j4191Q49J2424j9652J5703k420
1344B617j1461J9227j7601N968J0384k1642K2903j4290n87J5356k2255J9076r487
1357a792k469J3565j7749J3237l280q625J7860j8078Q236O801k0185K6115k0230
1370f594L662J5013k7302K8106j5254n472K1540k5447J6821L01j7523K4702j8890
$$ plain form
1277 5048 -6620 5558 -1918 -1861 4898 -5259 4185 -1882 347 2069 -3163 3007 42 -1530 4060
1292 4060 -3756 680 4202 -6240 7210 -4559 -360 6181 -7306 7155 -3502 -1312 6031
1305 6031 -5400 3048 377 -4117 6719 -4097 -237 4541 -8551 9307 -4587 -2371 7159
1318 7159 -9547 7867 -2422 -4006 6291 -6188 3537 1370 -6272 6376 -4327 -71 4837
1331 4837 -9449 8556 -5280 -732 6386 -11781 9904 -4287 -3438 8986 -10666 5037 2617
1344 2617 -8844 10383 -7218 -1250 9134 -12508 10395 -3895 -4482 10874 -11381 7695 -1792
1357 -1792 -4261 9304 -8445 4792 1512 -7113 10747 -7331 905 7706 -12479 13636 -6594
1370 -6594 -2932 12081 -15221 12885 -2369 -7841 13699 -11748 5073 5374 -12149 12553 -6337
1383f337M623J2360k5205K6094j5169j420J6575k5334K3249j1230l979J6701k2965
1396a2037J8262l480j3456K3717k3268J0738R859k7026L1365k1615J553K1226
1408A5838l4621K9895j1860r923K7078l0045J6080N052k1001K6937k0328K407
1420d491J6978k6648K5553j5661k167J9888k6640K2986j2668l933K0736k5905
1432a1972J8669m852j3683K8940k7409R515J1580k8429L6000k3839l535K5565
1444A6550l4231L0667j1278j6539L0584k5741J3402M690k4175K7781j4151j05
1456b546J3120k7314K7810j1522m082J5374k8031K7683r025q565J8418k6910K2242
1469F652J902k1831K4824k2428J0094J6895l3917K7257j4650k50K4171l6127K2424
$$ plain form
1383 -6337 -1714 10646 -14559 11535 -3634 -5054 11521 -13813 9436 -1794 -5773 10928 -12037
1396 -12037 6225 2745 -10711 13006 -10262 476 10335 -16691 14674 -6941 -5388 15838
1408 15838 -18783 11112 -748 -10671 16407 -13638 2442 7494 -13507 13430 -6898 -4491
1420 -4491 12487 -14161 11392 -4269 -6436 13452 -13188 9798 -2870 -6803 13933 -11972
1432 -11972 6697 1845 -11838 17102 -10307 -792 10788 -17641 18359 -5480 -9015 16550
1444 16550 -17681 12986 1708 -14831 15753 -9988 3414 8104 -16071 11710 -2441 -2546
1456 -2546 10574 -16740 11070 -452 -4534 10840 -17191 10492 1467 -7098 11320 -15590 6652
1469 6652 8554 -13277 11547 -10881 -787 16108 -17809 9448 -5202 -5452 18719 -17408 5016
1482E016n018o893K4040l0917J1955Q509j5629K4230k4755J305K1064k3581K3513
1495A2839j9410n676K8461k4588J6774j1705r427K8112j9357N795j601j4036K9265
1508A5446j5481m982R911j9550L0260j3151j1702J5610j9823K7764r260j7479
1520a2437J8612j4639J8129p67k4938K1305q063P038Q590l2917K5470l465k597
1533f79J4549l3763K1912N939j0924J2829k4384J1019J6668j6408P360j3303K896
1546f289K1847j9167M592r453M178K0043k0394M807q518N143K0094k2683K042
1559c758L72k226K3405k2177o644J5365j2117K3785j6513j6513K4804j1238J3729
1572A0274q696j8373K1746j013L52k561j6230J7482N374o995r97j3921J8404L520
$$ plain form
1482 5016 -2 -6895 17145 -13772 -1817 6692 -8937 15293 -9462 -8157 12907 -10674 12839
1495 12839 -6571 -12247 16214 -8374 8400 -3305 -12732 15380 -3977 1818 217 -13819 15446
1508 15446 -35 -5017 4894 -14656 15604 2453 -9249 6361 -13462 14302 5042 -12437
1520 -12437 6175 -8464 9665 8898 -16040 5265 -2798 4240 12830 -20087 5383 1918 -679
1533 -679 13870 -19893 2019 7958 -2966 9863 -14521 -3502 13166 -3242 4118 -9185 -6289
1546 -6289 15558 -3609 983 -8470 -4292 15751 -4643 164 -8354 -3211 16883 -5800 -3758
1559 -3758 -3386 -5612 17793 -4384 -11028 4337 -7780 16005 -508 -17021 7783 -3455 10274
1572 10274 1578 -16795 4951 3938 4290 1729 -14501 2981 8355 1360 363 -13558 4846 8366
1586H366p866q45j3460K1636J25r779J163j0639J7760N167j7418L954m898R777
1600C043J1852k4084N969O01L955J3430k4202L765O510J500Q403j7652j668J2336
1614C758l36L385j1780n517J6640k701J479j0779l660J6347l607M76j0820k98
1628g413J5050l919l292o272j587J5676l401q800J412m827J6143l390j2291N358
1642a553l526J2871k601j2215L873J981O842r89j1500K902O138J901L76j2222
1656g722N155N445O14N37j2712P817M223k82q98r128N067P472l155k654m348J739
1672b830J0140o353j688l066J492R586p313j029l083L773O354o171k101l59K373
1687b75N437m584n307M929q95N311m604n052O294j974N167n316l348M783J35K131
$$ plain form
1586 8366 500 -345 -13805 7831 7956 -1823 -660 -11299 6461 11628 -5790 -1836 -6734 3043
1600 3043 14895 -9189 -3220 -2619 1336 14766 -9436 -5671 839 2339 10742 -6910 -8578 3758
1614 3758 3422 6807 -4973 -10490 6150 3449 4928 -5851 -9511 6836 3229 3705 -7115 -7413
1628 -7413 7637 3718 426 -5846 -7433 8243 4842 -3958 -2546 -7373 8770 5380 -6911 -1553
1642 -1553 -5079 7792 5191 -7024 -3151 -1170 5672 4683 -6817 -3915 2223 4124 4500 -7722
1656 -7722 -2567 2878 3492 4029 -8683 -866 3357 3075 2177 -6951 -1884 5588 2433 -221 -4569 -2830
1672 -2830 7310 957 -731 -3797 -2305 7281 -32 -1061 -4144 -371 5983 -188 -2289 -2648 -275
1687 -275 5162 578 -4729 200 -695 4616 12 -5040 1254 -720 4447 -869 -4217 566 701 2832
1703B832l493k972M160J252j116J34n837O749J8k341K096o523P385q15k276J043
1719B96l644M598N38k700N15r16J183L198n257K586j273O60L964p111M841k394
1735i16R05K884n550L210j99p62K453k983j23L601m623M731l261j276N325o145
1751b729N084l206k19L744m967L805j085j983L559l257O81L014n692N545k785
1766d91j341N541p502O057l202n89M614n557L477q01k049M365m102P02L054n228
1782c052O167m377q84N735p671P505m549j438N838o500N029j449l525O243m098
1797a026L46L066o897P452k764k210N682q750Q284k630k863N447p045N752l96
1812A448m008M966m386J898L627p906P350l886m52O366r995P964l405j589O881
$$ plain form
1703 2832 -661 -3633 527 1779 663 797 -5040 1709 1727 -614 1482 -5041 2344 1529 -747 296
1719 296 -3348 1250 1788 -912 -397 -1313 -130 3068 -2189 397 -876 -216 3748 -3363 1478 -916
1735 -916 -11 2873 -2677 533 334 -428 2025 -958 -1081 2520 -2103 2628 -633 -1909 3416 -2729
1751 -2729 2355 -851 -1070 2674 -2293 1512 427 -1556 2003 -1254 -573 2441 -3251 2294 -491
1766 -491 -1832 3709 -3793 2264 -938 -1527 3087 -2470 1007 206 -1843 2522 -1580 -878 2176 -3052
1782 -3052 3115 -1262 -2146 3589 -4082 3423 -1126 -2564 3274 -3226 1803 354 -3171 3072 -1026
1797 -1026 -680 2386 -4511 2941 177 -2033 3649 -5101 3183 553 -2310 3137 -3908 1844 1448
1812 1448 -2560 2406 -1980 -82 3545 -4361 2989 -897 -1349 5017 -4978 2986 -419 -2008 4873
1827D873q916N528j24l996O885o792J202N297p992P890m758k282Q358r851P926
1842C248l592l197Q408q489M926k93n185Q023n216n2M833q609Q803l747k935P665
1858D591j0082Q821l049l549P568q608O037Q7n796P686o261J644M980r466R004
1873C607m635j624Q465j1733R231k987l921R160j0185N412J632o617Q557o146
1887a784l44O885r697Q366l260m034R465j0266P374k085m120Q485q321M876K47
1902A787n722Q051n622M33N004r185R725m635l016Q815j1620R376k211n541R650
1917E289r669N494J761p806Q695n175n18O617j0065P758j542m187Q344j0260P344
1932B080j109m408P859q520M887J380n861P277n678M74O326r609P902l421l333
$$ plain form
1827 4873 -4043 1485 1361 -2635 4250 -2542 -1340 3957 -4035 3855 -903 -3185 5173 -4678 3248
1842 3248 -344 -3541 4867 -3622 1304 1011 -4174 3849 -1367 -1419 3414 -5195 3608 -139 -3074 4591
1858 4591 -5491 3330 281 -3268 4300 -4308 1729 1816 -3980 3706 -2555 -911 4069 -5397 3607
1873 3607 -1028 -2652 5813 -5920 3311 324 -3597 5563 -4622 790 2422 -4195 4362 -1784
1887 -1784 -2128 4757 -4940 3426 166 -3868 5597 -4669 2705 620 -3500 4985 -3336 1540 1787
1902 1787 -3935 4116 -1506 -1073 3931 -5254 4471 -164 -3180 5635 -5985 3391 1180 -4361 5289
1917 5289 -4380 1114 2875 -4931 3764 -1411 -1929 4688 -5377 2381 839 -3348 4996 -5264 2080
1932 2080 971 -3437 4422 -4098 789 2169 -3692 3585 -2093 -1619 4707 -4902 3000 -421 -3754
1947c754J0047j1537P290q38n177R318q769L120K855o154P478m601j997O836p552
1962c435O263k679m210Q958q402O029k239l892Q354p305L895j06n365Q571m660
1977b23j368M778q372Q764j841n933Q599q755O713K76p267P378m719K980J964
1992B974o949M950n15r02L920p862N094L92k355M814q903O339O1k644N144q628
2008e070N307L081n727M771m927M3Q066q576L714j137l294J0057q737J654R76
2023B01k988P715n627j522K642j269M260l011l960M535j655L821l047m215O223
2038B103l171M892l999m734P800l259K199j391n482P226j5k613K067o770P060
2053A913J703n745L676n969N945K394o106J966k428L931K586n612p2P36J603L758
$$ plain form
1947 -3754 6293 -5244 2046 1208 -3969 5349 -3420 -300 2555 -3599 3879 -722 -2719 4117 -3435
1962 -3435 2828 149 -4061 4897 -3505 2524 285 -3607 4747 -2558 1337 1231 -4134 4437 -223
1977 -223 -1591 3187 -5185 3579 1738 -4195 4404 -4351 2362 2638 -4629 2749 -1970 1010 2974
1992 2974 -3975 975 460 -442 3478 -4384 710 1102 -1253 3561 -5342 997 1058 -1586 3558 -5070
2008 -5070 237 3318 -2409 2362 -2565 -2522 5544 -3032 682 -455 -3749 6308 -2429 -775 201
2023 201 -2787 4928 -699 -2221 421 -848 3412 401 -3559 976 -679 3142 95 -4120 2103
2038 2103 -1068 3824 -175 -4909 2891 -368 1831 440 -5042 2184 2169 -444 1623 -5147 1913
2053 1913 3616 -2129 1547 -4422 1523 3917 -2189 -223 -2651 1280 3866 -1746 -1818 -1082 521 4279
2069D279o844P38J768K80M223p888J639K048O45K855p238J079L684k5R65m493
2085b285j303O587k201O38l191k650Q503l584j38k207j708O979k343j917r10l67
2101b097N177j010m269J289j021M757l05n608K717j216M706j523m584K437ML457
2117B911j395m599J886K365L24L01n422K634L398j537J071n915L741K446j343
2132H66k6m194L303K604j532j554j540J400L751k615j525m59K58M851m068p44
2148a224k61J125L330l717o05K11J388K032k466k228K160N06J898j886l543M216
2164I36j081K090k588k266L741l43R75k016j470K461R66j227j76k152K860Q90
2180A600k121Q00k797L759N4k215J436k420L148M7k074L34j71Q41J771l024O28
$$ plain form
2069 4279 -2565 -1827 -59 221 4444 -3444 -1805 243 888 3743 -3495 -2416 1268 1243 2208 -2285
2085 -2285 -3588 2999 798 1436 -1755 -4405 4098 514 376 -1831 -3539 3440 1097 -820 -1730 -2097
2101 -2097 3080 2070 -2199 -910 -1931 2826 2521 -3087 -370 -1586 3120 1597 -2987 -550 -546 2911
2117 2911 1516 -3083 -1197 1168 1492 1793 -3629 -995 2403 866 1937 -3978 -237 2209 866
2132 866 840 -3354 -51 2553 1021 -533 -2073 -673 3078 463 -1062 -1521 -1263 3588 -480 -1224
2148 -1224 -1485 -360 2970 -747 -1352 -1141 247 2279 -187 -2415 -255 251 2149 263 -3280 936
2164 936 -145 1945 -643 -2909 832 489 1464 -552 -2022 439 1405 178 2 -2150 710 1600
2180 1600 -521 279 -2518 1241 1295 -920 516 -1904 1244 1291 -783 -449 -620 221 1992 -1032 -404
2197d04O94n77K632l809J415J60OJ651l489J777K14p3O39j711J72J851j222Q67
2215G93j125j075L212k529J416q85q56K451k154J065m47o05J762j075m96R19j304
2232i33J605m54j460K344k638K253n88j226K177k491K189q19r18J923j411O4J224
2249H41j970J759k89j676K966k975K120p14j034K233k128J697q42q71K009j062
2265F4L5O69j949K011l98j357K251l235L269r84j495K462l065K895n75j548J753
2282H03j081K34J650l104J790K20j380K838l492J878O5p39J960l353K110j85n42
2299c28J313k137M49J782j930J815j591o15L392l821K650j241j104L559l447J454
2315B00l14q96K174j379o27J491j902K502p60k156L017k975K913p48k241K923
$$ plain form
2197 -404 290 -287 2345 -1464 -49 111 117 1768 -1721 56 270 197 836 -875 -703 1148 -74 793
2215 793 -332 -1407 1805 -724 692 -193 -1049 1402 -752 313 -134 -739 1023 -52 -548 371 -933
2232 -933 672 218 -1242 1102 -1536 717 129 -1097 1080 -1411 778 -41 -959 964 -447 -383 841
2249 841 -1129 630 341 -1335 1631 -1344 776 62 -972 1261 -867 830 -12 -883 1126 64
2265 64 99 768 -1181 830 432 -925 1326 -1909 1360 376 -1119 1343 -1722 1173 598 -950 803
2282 803 -278 -44 1606 -1498 292 512 -868 1970 -1522 356 421 -318 1642 -1711 399 214 -328
2299 -328 985 -1152 -703 1079 -851 964 -627 -1242 2150 -1671 979 -262 -1366 2193 -1254 200
2315 200 -114 -1010 1164 -215 -842 649 -1253 1249 489 -1667 1350 -1625 1288 540 -1701 1222
2331A222k460K420o93j657J973j116qJ613k815K243k03j340K684l846K805j16
2347G06j725K723l328K103N00k026K022j664RK479k932J538k63j224L275l591
2363a398J969o14j303L642l667J772n5j551K768j862m60K041k695K323l81k395
2379a866L547l158K012k0k261L216k330J471k75j648K106j251K20J357k817K299
2395F02k34j707L107l693K559j94k037L355l114J471P08j952K021j484k32J987
2411A163k200J617m37j385L198l298J865j5j828L415l057J091L88j576K210j219
2427f8o62J845k099J547j54k083L157k788K241l87k104L121k433J315K86j845
2443a111J989q66n15J482k450J752K62j795K569l013K195J62k219K697k198J001
$$ plain form
2331 1222 -1238 1182 489 -1168 805 -311 -319 1294 -1521 722 519 -821 1863 -1983 822 706
2347 706 -1019 1704 -1624 479 979 -1047 975 -689 -680 1799 -1133 405 142 -1082 2193 -1398
2363 -1398 571 -43 -1346 2296 -1371 401 346 -1205 1563 -299 -759 1282 -1413 910 529 -1866
2379 -1866 1681 -1477 535 515 -1746 1470 -860 611 336 -1312 794 -457 -237 1120 -1697 602
2395 602 368 -1339 1768 -1925 634 440 -1597 1758 -1356 115 823 -1129 892 -592 -824 1163
2411 1163 -1037 580 143 -1242 1956 -1342 523 508 -1320 2095 -962 129 517 -1059 1151 -68
2427 -68 -730 1115 -984 563 409 -1674 1483 -1305 936 549 -1555 1566 -867 448 734 -1111
2443 -1111 878 12 -503 979 -1471 281 543 -1252 1317 -1696 499 661 -1558 1139 -1059 -58
2459e8R05j908J516m72n92K057k527R98N71j789K867k984J334R67j967K239k101
2476i44J050L48j158J465j378K5J601k002J197j56j214L028k635R81L81j740K878
2493A727k428O52O89j274J904j128j108J936j576J243J01k276K984j853J059p6
2509E76j861K285j301O31j9j402J724q8o08L79j234J288K62j555J679k045J993
2526G04K38k015J690j775J470J050k392J031k06k3J668k427K91J273j102J982
2542A457k504L49J144q21J787k634N74J164o74O87j013l29K127j166M3k23j438
2559a470K895j310k18l9r14K436j097l13n92J75J490p54j033P42m96J391r5k294
2577a496J985q73J305J9k582J744j73P05j21j565P25P26J56l82j179Q60J039o31
$$ plain form
2459 -58 847 -1061 455 -17 -609 1448 -1079 -81 490 -1299 1568 -1416 -82 885 -1082 1157 -944
2476 -944 106 454 -704 761 -617 -592 1009 -993 204 48 -1166 1862 -773 208 589 -1151 1727
2493 1727 -701 -49 640 -634 1270 142 -966 970 -606 637 738 -1538 1446 -407 652 576
2509 576 -1285 1000 -301 330 311 -1091 633 545 -63 316 -918 370 632 -923 756 -1289 704
2526 704 942 -1073 617 -1158 312 1362 -1030 1 -205 -228 1440 -987 -696 577 -525 1457
2542 1457 -1047 -698 446 -375 1412 -1222 -648 516 -158 529 -484 -813 1314 148 191 -32 -1470
2559 -1470 1425 115 -103 -142 -1056 1380 283 -30 -622 -447 1043 289 -744 -2 -498 893 798 -1496
2577 -1496 489 -384 921 940 -1642 102 -71 634 513 -1052 -327 399 555 173 -1006 -146 893 262
2595B62N19k162J593J067j491N93j470J296R47j038k91n54N63J244r10p68J76
2612d24j40J918k010K45l0J13K144k393lJ80M81J038j137p78R28K26O6l57j320
2631a253J426J73L34j009p86J522k65N44q98p77J594j5n55J4j073J160J028j646
2649d82N62p54Q05J172j879N10l69J289m25r14L4j11J088K4j163J05Q32n73J443
2668A194k316P20R45o56Q89j360K03O86o6J60r38MR12j29k63k27j14J039j017
2687c34N03j37p02J450j129L85j67l42R48l22p38N63j33L41J50j120O93l2L64
2706B41j82p42J206j107J187m46p14Q20m54L03J77o34J27P77j055J035p72K19
2724a4M00r47J142r48M65L3k47M07j09l62M35l05J23r4m85R21q03O31k02n27R56
$$ plain form
2595 262 781 -1381 212 1279 -212 381 -1089 207 1154 116 -175 -729 -166 1078 168 -600 -424
2612 -424 -564 1354 -656 -411 -441 -328 1816 -577 -580 -400 81 1119 -18 -796 132 358 424 67 -1253
2631 -1253 173 346 680 -329 -1115 407 142 686 -212 -989 605 590 35 49 -1024 136 1164 -482
2649 -482 80 -674 131 1303 -576 -66 -435 854 429 -485 -451 -562 526 550 -613 -508 324 -249 1194
2668 1194 -1122 -402 543 -113 776 -584 -381 305 239 399 -539 -535 377 248 -15 -242 -356 683 -334
2687 -334 169 32 -670 780 -349 36 -131 -473 475 153 -585 -22 -155 186 336 -784 -91 -123 241
2706 241 59 -683 523 -584 603 157 -557 263 -191 112 289 -345 -218 559 -496 539 -233 -14
2724 -14 386 -561 581 -367 98 131 -116 291 182 -180 255 -50 73 -21 -506 415 -388 243 41 -486 470
2745D70j030P57M1o88P58o02K76J61n78K48M62p87J035j119O84M54r36J024j317
2764f87M38M68k10K18m38q9N10o2k15J23n05R62o99K45j57m72J200r45N56o23
2784c82K25O07p76k04N85l18O62j19j271J401o39L06K73j041R92k38K94l61m25
2803d29O85j37L91m07l48P3O20p92P69j252J060K29j017J045j152Q41L13o96L42
2822A38j03r8O41p16j14K02k06Q07r48j8N36n15J129j021J05K42n16O79l86n4
2842b16K21k7M20m08q63J455q43O63k21q86J346q26L97N1q39J170n69l78P39o22
2862b36J13M53r04R51n01kM94q79P70l15L95r7j43J30o12P49j20n20M26k45l56
2883d49J132j300M05K98o36J373j265P9P88o52O76q24J02P81o44K22L35j162J265
$$ plain form
2745 470 -560 197 238 -450 308 -294 -18 143 -435 -187 275 -512 523 -596 88 542 -394 630 -687
2764 -687 -249 219 9 227 -211 -300 210 148 -67 56 -449 513 -186 59 -98 -570 630 -315 241 -382
2784 -382 -157 450 -326 -530 55 -263 399 280 -991 410 -229 77 350 -691 301 63 357 -4 -429
2803 -429 256 119 510 103 -245 -172 448 -344 425 -827 233 462 -555 490 -662 179 492 -204 138
2822 138 35 -63 578 -138 -252 -50 -256 551 -397 -415 121 -394 735 -286 -181 61 -455 224 -162 -216
2842 -216 5 -22 398 -10 -873 582 -261 402 181 -705 641 -185 212 263 -576 594 25 -353 386 -236
2862 -236 -123 330 -574 377 -124 -126 368 -511 259 -56 339 242 99 229 -383 366 246 -274 152 -93 -449
2883 -449 683 -617 -212 86 -550 823 -442 -363 425 -227 449 -375 -273 508 -136 86 421 -741 524
2902E24n75k1N00j131J126p77K89M1l84M58kM3J71n07L45m5n06O37p37P10J03
2923B62q37J264j148O54K28j104R51l08j57J111j066k1O40q98Q92n06k01R00j181
2942e25R95p57J22L41k46L55n99lN90l06JJ00m84J010o16Q8K04j059J110o74J22
2963b31J36n10J145n13l21M58l81K52N02j222J182p10JP73j166R23l38j03M33
2982C10m14m3J47k3l7p7K9J61l10O88o92L81L02o92P48q87O04J10o86M41j48o2
3004a50L51l23k37O36n13P24o54M5M63o42R72j019L90J86q5O0q0n72O62k29%K37
3026B22o94Q43l03n8p1m85J061n95J19n8l26P11m53j09L70k89L41J43n47L49l91
3047b20k4O05q59K17L31j2J53k30J09j95K77o7l96J71Q6p0L09m41J99P10j043
$$ plain form
2902 524 -51 -72 428 -703 423 -354 -65 -24 -408 50 48 91 262 -245 100 55 -451 186 -551 159 262
2923 262 -575 689 -459 195 423 -681 270 -38 -195 916 -150 -171 469 -429 463 -43 -244 656 -525
2942 -525 470 -287 -165 176 -70 285 -314 -317 273 -33 -32 68 -416 594 -22 66 270 -789 321 -353 -231
2963 -231 -95 -605 540 27 -294 164 -217 35 537 -685 497 -213 -212 561 -605 318 -20 -123 310
2982 310 -104 -147 0 -23 -60 -137 -108 53 -257 431 -261 120 422 -270 478 -409 195 305 -381 60 -88 -150
3004 -150 201 -122 -359 277 -236 488 -166 -121 342 -300 672 -347 43 229 144 204 124 -448 214 -15 -15 222
3026 222 -472 371 68 10 -61 -546 515 -80 39 -19 -345 366 -87 -196 174 -115 226 369 -178 171 -220
3047 -220 -244 361 -498 -281 50 38 191 -39 70 -125 152 85 -311 -140 -54 -124 185 -256 -57 653 -390
3068c90O31n58J46M24m32j03k03O56k14K09n21L34k42O66k61m91N29n34J103j007
3088b58j65M44j84K83j92l38N81R0m44M55n92J62L93o8j66n76Q64o59M64l60k67
3109e33P93l45R2L3l12MQ34q70K85j79K41M17n87j3O0M97k66k77m9jN16k54k28
3132a42m5N94m76N90r73P4N78l32L46l76j67L62J0J33m11qJ99L13k72rk44O12
3154C56l87m3J24n42O45j06pJ95l01L38k72j72J61J07Jm0l56j6M99j56J52o97
3176e17N19q5K62p8j77K40l92J32m8K81n17M21J44l5Q6k14J68m92M91j74p3K75
3198B17l95K32j89K71k04K12r8K70n55M16l12KN97n79J95l60K20K34k94k11L69
3219C8J91m61M27n00K28K0J29j15j7K49n12N21l98R6M21p75N91k33j37K35K40
$$ plain form
3068 -390 241 -317 -171 253 -179 -282 -485 171 -43 166 -355 -21 -263 403 142 -349 180 -354 749 -258
3088 -258 -423 21 -163 120 -72 -410 171 261 -183 272 -320 -158 235 167 1 -575 289 -370 94 -266 -533
3109 -533 260 -85 7 40 -272 -268 566 -304 -19 -198 43 460 -127 -140 -80 417 151 -126 -175 -176 340 86 -142
3132 -142 -187 407 -69 521 -452 -378 200 -132 214 -162 -329 33 43 176 -235 -243 -44 269 -3 -12 -256 356
3154 356 -31 -74 50 -492 153 47 40 235 -66 272 0 -172 -11 96 97 57 -299 -315 184 28 180 -517
3176 -517 2 -83 179 101 -76 164 -228 -96 -144 137 -380 41 185 150 236 22 190 -302 189 15 -58 217
3198 217 -178 54 -135 136 -68 144 46 316 -239 177 -135 -133 464 -115 80 -280 -60 174 -120 -331 38
3219 38 229 -232 195 -305 -77 -57 72 -43 -60 189 -323 198 -200 -104 317 -458 133 -100 -237 -2 238
3240B38o23N90k93M83M6p67O04l58M44l94j01J22j09N34k12j77j12K17k46O01
3260D87p07K08J0jK22n38M59oL6J7n12M16O2j47q8J62k27N17m35J24k19L3O86
3283E59p22K98j49j50M61l56kM4L2L61j86k05J6m7K77k12l40M16l57O12n70pL75
3306A48j88J07m12J24J46K40n0J98n78L85J20k41J08n45O94k44n5pl37N84ok61
3328g0j39J46J54j44M9rK3J14J6k06J76k36M0N07p78K47K24M4O7j27l59K46M9
3351C4q4N8k83M46o2R1l68M0J37j34M08n99J25M43p4j39k0l76Q74l42o80O11m80
3374c74Q23l66j44K33l79M10o5J0j74R3k3K06l32J61K5m06M98j39J69j57k04K56
3396A21k68J95O6mn7p5J09K0k00K37k68q1M61o57N29k7k81N85n20K34j45k21L58
$$ plain form
3240 238 -385 205 -88 395 441 -326 278 -80 364 -30 -131 -9 -118 416 204 27 -85 132 -114 487
3260 487 -220 -12 -2 -3 219 -319 140 134 170 187 -325 91 153 6 -82 80 -147 370 -65 59 -160 -127 559
3283 559 -163 135 -14 -164 297 -59 -61 -17 15 376 190 -15 1 -46 231 19 -321 95 -262 350 -220 -227 148
3306 148 -40 67 -345 -221 -75 165 115 313 -265 120 240 -1 107 -438 256 12 -43 -50 -387 197 191 -70
3328 -70 -209 -63 91 -53 -4 -13 10 124 140 -66 110 -126 -86 421 -357 -110 114 158 225 98 -261 -15 34
3351 34 -50 8 -275 171 109 200 -168 -128 9 -125 283 -316 -191 252 178 39 19 -357 517 175 -505 106 -374
3374 -374 449 83 -61 172 -207 203 138 148 -26 67 44 250 -82 79 104 -302 196 57 226 69 -135 121
3396 121 -147 48 114 110 53 -22 87 107 -93 144 -124 -205 256 -401 128 101 -180 405 -115 119 -26 -247 111
3419A11j05n0J97j53R0L5k53K62l79L47L3m7k31k6N50o79L40n6q8N60k10l61L57
3442B44j88l0K94o65N98k29p5K29m75K22K17k90Q6j32J67K23m57K98J24m93N96
3463B64m94J62K1j38M04n58M24K6j12Q5k3n9J6k06L10k67o4K12j99L23j29j18
3485a20K55k62M01k26Q6r3P7j26J84j51n2K49k31j2k43L35j27J01R2l98K37RR0
3508G5N5l39K35K03l91K16M6p8K71p05N85k57p2M27m60L11p0m9J7m2k47J49j54
3531b74K16J74k83L41k22K36k43j2J52k5qL6K4j45K20p4j24K13k07R5j88J46j69
3554a21M09l22MR7k87L67j85L5k21L00r2J19k17l6M12k88o7k32L31Kj21J95m09
3577c27M17k52j4J68M4j10L03k89j58K93m68M69k74L19K4k55M05n45K57P0L0J8
$$ plain form
3419 111 6 -44 153 0 90 125 -128 134 -245 102 135 88 -143 -169 381 -298 42 -14 -102 458 248 -113 244
3442 244 56 26 320 -345 253 24 -51 178 -297 -75 142 -148 -62 -194 -27 196 -261 37 161 -332 264
3463 264 -230 -68 -47 -185 219 -339 85 111 -1 84 61 2 18 -188 122 -145 -209 3 -196 127 -2 -120
3485 -120 135 -127 274 48 134 41 118 -8 176 25 -27 222 -9 -21 -264 71 -56 45 137 -261 -24 -15 75
3508 75 130 -209 26 229 -162 54 100 22 293 -412 173 -84 -156 271 -189 122 52 3 20 -22 -269 -120 -274
3531 -274 -58 116 -167 174 -48 188 -55 -67 85 60 52 88 112 -33 187 113 -11 202 -5 90 -98 48 -121
3554 -121 288 -34 -30 67 -220 147 -38 -3 -224 76 -16 103 -114 -150 262 -26 -93 -325 6 8 -113 82 -327
3577 -327 90 -162 -176 -8 36 -74 229 -60 -218 75 -393 76 -198 121 145 -110 295 -250 7 77 107 125
3599A25k22J8M80l02k7J21n87M24J14j09j04j63K38K22J5l62L67k97K16O7m51
3620b17J88J41K76n62J46or9K33l42K79l64M88J39p5m77K35O3M54l48k78M71k92
3642E3J48k61J19k81K18J32l79K04q9kO4L07l42L48j37o9l2k18K24J88k43pk48
3665c03M76Kk38p8K35m07M16l28J47J01j90M06l15J58n5L2q7k30L49j23K03o3
3687A08n41M10J85r9J33q0j29L37o62M29j26k61N55o04L82j56L09m09J73p9J65
3708D0k70K93P8j74K20l23K70l85L8N52l69K20k22J42j8l23M72j26o4N7j99k26
3730c17N67k92L15n01j46L97l35N71l30O5P5l0n9j79L42P2k69k18L24l9J21l42
3752b08J88j96J12O26p00R2JL08ml34m5J43J30kK64o06J73j02J80q7J46j21kL28
$$ plain form
3599 125 -97 -79 401 99 72 193 -394 30 144 35 -69 -232 6 228 243 -119 248 -49 167 234 -217
3620 -217 -29 112 388 -174 -28 -34 -133 100 -242 37 -327 161 300 225 -252 -17 46 500 152 -126 345 53
3642 53 201 -60 59 -222 -4 128 -251 -47 -136 -138 -74 233 -109 239 102 33 1 -217 7 195 -48 -55 -303
3665 -303 173 175 -63 -141 94 -313 103 -225 -78 23 -167 239 -76 82 27 59 -28 -258 91 -32 171 108
3687 108 -433 -23 162 63 196 116 -13 324 -338 91 -35 -296 259 -345 37 -119 190 -219 -46 -125 40
3708 40 -230 63 141 -33 187 -136 134 -251 -213 339 -30 190 -32 110 92 -231 241 115 51 108 -91 -317
3730 -317 250 -42 273 -228 -374 23 -312 259 -71 -6 69 39 -20 -199 143 215 -54 -272 52 13 134 -208
3752 -208 -20 -216 -104 522 -178 -86 -85 223 219 -115 -160 -17 113 111 375 -231 -58 -160 20 -67 79 -42 -44 284
3776B84l45n1J96Rk36L38n26K58K04o3pj08q8K92k27j73K29Q6j31j24L37l23J0
3799a59K80q6k17j10L03O03o85K1j21q3N73n35K07j2O4J9m07K52P5M0p1K68k83
3822f4K46k31K7N1k47N26n53L48q8k13J56J64n9j05J9J25J46m37K62j82j66L45
3844G0J7r0j04J40p3j37M25m70L24K83q43J20N52k06K98o47J51M50k29N8m55J90
3866a76J46J53k31j2j7K61j73r0J93m42O09Rl02j9j51M70k21J0j01K31l5J73j17
3889A68j21j2k99K33j00K51m10M61R2m88K90j63l3L62m33J28K45k57J58L9k97
3910a86L16k13J91j67K04p6J22q4m04M40k24J43N93p91O6K39j77k47M5J20J25
3931C5M8l86N01m81M18m9l05K43k65M31j49k30K13J15o4J34k28m4J88R9k4o47
$$ plain form
3776 284 -61 -112 84 93 -143 195 -331 -73 131 68 61 -47 -135 157 -70 -243 -14 72 -59 -183 154 -169 -159
3799 -159 121 35 -182 -292 11 614 -71 -50 -171 -254 319 -216 -9 -21 43 62 -345 -93 -18 22 -49 219 -64
3822 -64 182 -49 -22 29 -218 308 -245 103 15 -198 -42 122 63 -42 -23 102 248 -189 73 -109 -275 70
3844 70 87 -3 -107 33 -40 -177 248 -222 102 385 -458 -338 214 8 306 -341 -190 260 31 89 -366 -176
3866 -176 -30 123 -108 -120 -137 124 -49 -139 54 -388 221 230 -72 -91 -242 228 7 17 -84 147 112 285 168
3889 168 47 35 -264 -31 -131 120 -290 171 263 -225 65 -98 -131 231 -202 -74 171 -86 72 111 -186
3910 -186 130 -83 108 -59 145 69 191 107 -297 143 -81 62 655 -136 -70 169 -8 -255 -210 -90 35
3931 35 83 -303 198 -283 135 86 -219 24 -241 190 41 -189 24 139 75 209 -19 -63 125 224 200 -447
3953d47M69M2N1k07K00j55n3J86j47k98L32L4r4L1k9k4J54o2K99l71J32O7p9Q7
3977A18k70N6J62O0k79J01m7Q8J60l96J42n8M24m35J82J43j41J77k83R1j32nJ77
4000C5J1k48J92L1o9o5j06K08M3j14J54p9j22J40J14k71L39m70L16N2j72K96k36
4023b1Q8k50K27k38K12K8O0q4r5O7n0K90m67K28l37L59r5j66L91k37J72j35J9
4046c4J83j5k27J79M5l97N71l74K62m58Q2L12l58L33l00R4J15j21J82p6O2k55
4068a95Q2R5J54l42L96j59j31R9m5K44m24N27j96j69j13jo8M00p5j1P7k30K71
4091A86l09j74L25m16M39pQ9j24L6o8K21m43M77k51j42L14m08M01l31L77o1l82
4113b51L56j13j04R5J10P1j67l7M8Ok23M76l88J45r2j94N75k47J93m40J84K99
$$ plain form
3953 -447 22 64 115 -92 108 -47 -100 86 -61 -359 -27 7 -87 -56 -85 -109 45 -17 282 -89 43 110 31 118
3977 118 -152 -96 66 126 -153 -52 -99 -11 149 -247 -105 -163 261 -174 8 151 10 187 -96 -5 -137 -142 35
4000 35 46 -202 -10 21 -48 -113 -219 -11 32 -82 72 -7 -129 11 125 -146 193 -277 39 91 -81 215 -21
4023 -21 67 -183 44 -194 18 46 106 22 -73 -6 -56 234 -233 -5 -342 17 -78 -244 147 -90 82 -53 -34
4046 -34 149 134 -93 86 131 -266 305 -69 193 -265 -183 129 -229 104 -196 -102 13 -108 74 -2 60 -195
4068 -195 -113 -18 136 -206 190 31 -100 -1 -46 198 -226 301 105 -64 -177 -178 -246 154 79 68 145 -85 186
4091 186 -123 -297 28 -388 51 44 133 9 45 -23 198 -245 232 -19 -161 153 -255 146 -185 192 131 -251
4113 -251 105 -8 -112 -17 93 164 -3 -40 8 14 -209 267 -121 24 -68 -262 313 66 259 -181 3 302
4135C02j61L7k36O9R9k65n0M10l38P4lJ30J27j00l0M0j61M5J83r1k07RJ42J02
4159A27l64K35j73L58k42O1J59j41M02m90J78j49P6N6o6j19L7N3J08j78k09N06
4181B25l19J31L63o18N76p15M70q9r6Q0N9j44L2J10o3o4O0P4k93L42k02n9L60
4204B20k92K52j49r4J24k99K87O2k19J36j5k48K65j35J39j56o2N35o84N11l06
4225a28K55P7j50R4k60K14p2J99n41N43m97M07k17K89k97k37M81k62O7J21k87
4246b01M76k50Q8m6j28M8K75l56K45N7l47M66l60L9j96L65Qj59J04k26J84K57
4268C43l94K6J95n29O47k37n22R49o34N77j31n59K82j75K18j6P2j09JJ6R9l09
4290a90O4K03n7J04m56N63k97j1J45m68L44L69k07k07o9M7L89l51J77j81N8J85
$$ plain form
4135 302 141 178 -58 11 110 -155 -205 205 -133 -59 -62 68 195 95 65 105 -56 -11 172 81 -126 -117 25 127
4159 127 -237 -2 -175 183 -59 2 161 20 422 -68 110 -39 37 93 27 -92 -55 -2 106 -72 -281 225
4181 225 -94 37 400 -218 358 -357 113 24 -72 8 67 -77 -45 65 2 -62 -2 72 -221 121 -81 -140 220
4204 220 -72 180 31 -63 61 -238 49 111 -108 28 13 -235 30 -105 34 -122 -184 351 -333 178 -128
4225 -128 127 204 54 148 -112 102 30 229 -312 231 -266 141 -76 213 -84 -321 160 -102 -35 86 -201
4246 -201 275 25 113 67 -61 -13 262 -94 151 208 -139 327 -33 6 -190 175 183 24 128 -98 86 343
4268 343 -51 -25 170 -359 288 51 -471 478 -156 421 290 -269 13 -162 56 40 112 3 4 20 119 -190
4290 -190 -126 77 20 124 -332 231 -66 -77 68 -400 -56 313 106 -101 -170 -123 266 -85 92 -89 -31 154
4312A54l57L30k73K23K42p11M45p7j3J63j00l19M85k52R9J75n12O81m60K42n33
4333c68K69L85k36j06k11L55J51j16j30J71l72N22k94l44M49m13O98j80k43j8
4353c1J63o4j13J85k55K26m8P3n8qp6K30j03j50k19L88l7q8q4r7J62J18j63k2
4377g1j91N25j93j32k6k34O95k38pl97J15L79j88r9l7Q6P7K51m12k4J72p8K4j35
4401a38k2Q1M59k79k96RJ50N27k59r6l77J77O7J08k03j0M06l36L70m70L99k31
4423C6p9k8l4r7K61O6n26M52l28K64p0J58J69k97L05k68L4k46J42K32n0k01j63
4446b68L81m14N05k61R5l9J41N7m04L55k86K98k03r7J46p4j36J86P5k9J21k69
4468a20o0K01J0K60k73K83m19J01k6o1K50j20l5L7L51p04M17r6O1kk20M4R0K93
$$ plain form
4312 154 -203 127 -146 77 319 -392 53 -24 -37 126 26 -293 192 -60 39 214 -298 383 -77 165 -368
4333 -368 -99 286 50 -56 -267 88 239 123 -7 164 -208 314 20 -324 125 -288 410 230 -13 -31
4353 -31 132 68 -45 140 -115 111 63 136 78 70 -6 224 121 -29 -248 140 103 15 -69 -166 -4 114 -49 -71
4377 -71 -262 263 70 -62 -88 -322 373 135 128 -269 -154 225 37 -62 -99 -13 64 315 -97 -121 51 -27 -3 -138
4401 -138 -160 -79 380 101 -195 -186 -36 491 232 136 -241 -64 3 111 -92 -102 304 -32 338 -132 267 36
4423 36 -43 -71 -105 -202 59 125 -401 51 -277 -13 -83 75 244 -53 252 -16 18 -228 -86 146 96 -105 -268
4446 -268 113 -301 204 -57 38 -1 140 197 -207 148 -138 160 -43 -140 6 -68 -204 -18 57 28 149 -120
4468 -120 -180 21 31 291 18 301 -118 -17 -43 -104 146 26 -9 28 379 -325 92 -4 57 55 -165 -121 -31 262
4492B62j39k73O3Q5N2Mk34K40Q7k73M19n34K91J15n76N01l46J19J61m2P5j32r5
4515a70J45R3j45K39o81P36n22K60R9k88L25k86L82j62l6J41j56N5j53J29J93
4536A98r1l62L33q9J40J5m60N89m05K87j13k98K87J62j17J32l59R1J44j50J41
4557G5j96L5L62m84M54l44L27j78O7m18R1K38o6n7K10j18j8N90p61J65o7q0L52
4580A79m83M70j80K0K3o9J01j8j6l01J50LK48k93N0j02jM21l10J66l16M65p0j16
4604B1N8j27K7p6m2J25J0m7J57k29J04K78k24J95l91K13L5k38J62j75K1L92j23
4627A26l44K27k88M51o4K4M9m18N96m61K52l34N6M44k38J07j59j35j3K67k74Q0
4649d9r0K26N4k80K98l70J40N5j59M26r9r4r2k2J63Pl57L90k21O4ll22O12k89
$$ plain form
4492 262 123 -150 -87 -2 50 54 -180 60 147 -126 293 -241 50 165 -411 90 -256 -137 24 -18 57 -75 -170
4515 -170 -25 68 -77 162 -519 217 -305 -45 54 -234 91 -195 187 25 -11 130 -26 29 -124 5 198
4536 198 107 -255 78 -11 129 144 -316 273 -132 155 42 -256 31 193 76 208 -151 -60 84 -66 75
4557 75 -121 -86 276 -208 246 -98 229 51 118 -300 -209 29 -37 -94 116 -2 -20 570 -191 -26 -93 -173 179
4580 179 -304 166 -14 6 29 -40 61 43 27 -274 -124 -121 127 -166 -116 -218 -219 202 -108 58 -258 207 137 21
4604 21 79 -48 -21 -97 -139 -14 -4 -51 106 -123 -19 259 35 230 -161 52 87 -151 11 -164 -143 249 126
4627 126 -218 9 -279 172 108 132 181 -237 359 -102 150 -184 -128 316 78 185 26 -109 -122 145 -129 -49
4649 -49 -139 87 141 -139 159 -211 -71 -16 -175 251 152 58 -34 -56 107 114 -243 147 -74 -10 -13 -335 277 -12
4673a2j1j30P2J69l54L0J69Q7Q5j4JJ25l90qL38j35J25m47M36m2l04M40l80J18
4697c2J77m15L42O1j25m0k34K46mm69P22o22N37j96j34N11m11J86M9n2j44m8Q7
4720hR6j31J18J21k60M86n28K25j55j08N33n15K12R6k54J67o6l11N92m84K25Q3
4742A34m94N85n59L02K30l51K19j15K37j47k55K83o5K44q3k80L60l03p7N62p19
4763b92M16j80k2K81j87J51k72J5M8l2N4J27k44M9K29l08M12k76M62l99j66O16
4785D82o36K20K4k08L75k91q6K04J40l58K89l70N48m04K14m0r0K10k91M28n15
4806a55L09J5n3j72L9N1O4P7o24P13m22K05k42M7J22j20M63m03RJ52k40L08J02
4829B45n72L0O22k07r3k40J13Q3j7J83j55j16P3L24m94L69l07K83K9k34j6j68
$$ plain form
4673 -12 -23 -153 -81 88 -266 -236 -67 20 105 91 92 217 -173 -181 157 22 147 -300 136 94 -210 230 -150 -32
4697 -32 145 -270 72 133 8 -32 -266 -20 -24 -493 229 -393 144 -52 -186 325 -86 100 149 97 -47 -95 -8
4720 -8 88 -43 75 196 -64 422 -106 119 -36 -144 389 -126 86 182 -72 95 29 -282 310 -174 51 134
4742 134 -360 225 -334 -32 198 -153 66 -49 188 41 -214 69 4 248 165 -115 245 -58 -135 427 -292
4763 -292 124 -56 -78 203 16 167 -105 -90 -42 -74 -20 107 -137 -88 141 -167 245 -31 431 32 -134 482
4785 482 -154 66 90 -118 257 -34 -120 84 224 -134 155 -215 333 -71 143 103 13 223 -68 360 -155
4806 -155 154 169 116 -56 -17 34 98 175 -449 264 -158 47 -195 -148 -26 -146 317 -86 -77 75 -165 143 245
4829 245 -327 -297 325 118 25 -215 -102 -19 -36 147 -8 -124 -51 273 -221 148 -159 124 153 -81 -97 -265
4851b65O96m65j53K91j9Q1k76J78p7J91j48m6p1J95K8q5Ok87M35r7J63l54J7P2
4875A0M5K23l89J9J90K9Qj96K74l11L42l43n8j3J29L28j80k9n4L53o01L20j66
4898g0K42j6l32K71j99K38l76J81m6M6L5l7L50k96rj64N24j14m3l73K28J33j67
4921Flk13PJ04P4J63j15R9k12J27k64K34l05M08k7j78K36n33O99m94K79j49r3
4944a50L79l64J23j6pP0j7k13J84l4J72Q0n45N06k52K40j50k65J72o1K31k47n4
4967b18L69K4l31K48p8j57K97j71P9j71J24J33k02J35l56N24l28N1J9K90m88K56
4989D9j25J45p5m95P78l62J12Q7l69N32l93p7K82n9M7j11r6J92m17L48r5j56J77
5012h1k0K61kk96J71j09Q5m7p6Q4J11k5l44K07L8J72m26K43j46J71j42J5K50r0
$$ plain form
4851 -265 431 -34 -187 104 85 166 -110 68 -9 182 34 -12 -83 112 140 55 61 -226 209 112 275 -79 -62 10
4875 10 55 278 -111 -92 98 127 135 -61 213 -98 244 -99 -157 -170 -41 287 107 78 24 377 -224 96 -70
4898 -70 172 156 -176 95 -104 134 -242 -61 -107 -61 -26 -63 287 -9 -18 -182 342 228 185 -188 40 173 6
4921 6 3 -210 -203 -99 -25 138 23 122 -90 37 -227 7 -298 110 83 -95 141 -392 307 -187 92 -57 -150
4944 -150 229 -135 -12 -28 -35 35 18 -195 -11 -45 127 207 -338 168 -84 156 6 -259 -87 -148 83 -164 -218
4967 -218 151 175 -156 92 14 -143 154 -17 62 -109 15 148 -54 81 -275 249 -79 -28 -9 281 -207 49
4989 49 -76 69 -6 -501 277 -85 27 114 -255 277 -116 -193 89 30 77 -34 -130 62 -355 -7 -102 -258 -81
5012 -81 -101 160 158 -138 33 -76 9 -38 -114 -30 81 56 -288 -81 -43 129 -297 -54 -200 -29 -171 -156 94 4
5036DK62l90l3J88l7M0j33Q4P8Jk65M83m73Q2p4P7K0j2L52j67J02k98Ok19N22
5061B00j43J77j01l09K80m95P64m66j15L88l19J57q3K0m3RQ3N1M4j06q5K61j81
5084a2j41M02m91K63n9j85M48l38J3K53j48K81k23p4pJ22j05K46m27N21n52J90
5106b3M49n75M32m00m2J19k4L1j8n1J18r7j20M64m91N23n04J70K44n51P85q13
5128c74M32p3j05J51J8k24J64P0k89K89m50N91n10K81L02k48N31p26K28j2j6r4
5150f4j87K24k8o0J72l3j18L41k96n1L61k49L33k25j16K84l61J65j25K75m27J71
5172a4J01J26j55J74l80rM71o03O35m79K31N4k33J82k4P4o0p9nJ02n66N59m07
5195c05L58m6k52N58o50N37l34K9K53l74RM24j08j97J04l56M23k90L53n5k23J74
$$ plain form
5036 4 266 -124 -157 31 -6 34 -99 -15 63 64 -201 282 -191 -109 -183 -106 -86 -98 254 87 189 -109 -103 -322 200
5061 200 57 234 133 -176 104 -391 373 -93 -208 180 -139 18 -65 -45 -88 -79 4 55 99 -7 -92 169 -12
5084 -12 -153 249 -242 21 -38 -223 225 -113 -100 153 5 286 63 -11 -18 104 -1 245 -182 339 -213 -23
5106 -23 426 -149 283 -117 -159 -40 -64 -33 -51 -102 16 -81 -201 263 -228 295 -209 -39 205 -346 439 -374
5128 -374 58 -15 -120 31 49 -175 -11 59 -230 59 -391 200 -310 -29 273 25 556 -170 58 46 30 -64
5150 -64 -251 -27 -55 -115 57 24 -94 247 -49 -100 261 12 345 120 4 288 -73 92 -33 242 -185 -14
5172 -14 87 213 58 232 -148 -157 314 -289 346 -133 98 152 -81 101 77 151 91 12 7 109 -457 102 -305
5195 -305 53 7 -245 313 -337 200 -134 -105 148 -226 -217 207 99 -98 6 -350 73 -217 136 81 -142 32
5217C2k18K73j77n9K04q8K11j67k81L46N2j91O9k07J98n6j79M41l22L56j42k52
5239a57K63j22R3jj76j41L56j02j13l4K82M0j06O2m74M20k22K91Rm89K44K76j27
5262G2k02K60n42P31j50j65j24k80P27o01K50k77Q5M81l57j59K56J31j61J6k03
5283b12J92n3J31K33n98L40j7L72k82j46k47K72K19l86J69j49K14j15K80n11O6
5304b28L92r5O5k36N5J19ML03o00L17pO1l16K31j64M03l87j06J15k03N41l23q0
5327a39j8K51j16L5j38m9K82l8J01m95L51K84l00J21k52K23k64L52l57J85k72
5348b53N56j26m05M41k98J93j49k1J60j23K09l86N2J51L8N5M1m72L64r9N1K38
5370B17n95N24k18K50P1n60L13N6K40k02j23o6M40o05K08m1K46J62n60M40l73
$$ plain form
5217 32 -186 87 -90 -149 55 -33 178 11 -270 76 128 -63 6 -201 -3 -59 -238 203 -119 237 95 -157
5239 -157 106 -16 77 76 -100 -241 115 13 -100 -134 148 188 82 144 -330 90 -132 159 168 -321 -77 199 72
5262 72 -130 130 -412 319 169 4 -120 -400 327 -274 -24 -301 -216 265 -92 -251 5 136 -25 -9 -212
5283 -212 -20 -73 58 291 -307 33 16 388 106 -40 -287 -15 204 -182 -13 -162 52 -63 217 -294 -228
5304 -228 164 69 134 -102 -47 72 76 379 -221 96 89 150 -166 65 -99 304 -83 -189 -74 -277 264 -59 -139
5327 -139 -157 94 -22 13 -125 -174 108 70 171 -324 27 311 11 132 -120 103 -161 191 -166 19 -253
5348 -253 303 177 -228 213 -85 108 -41 -62 98 -25 184 -202 -150 1 39 94 135 -337 27 -72 -21 217
5370 217 -378 146 -72 178 249 -311 2 58 298 96 -27 -93 347 -258 -50 -91 155 317 -243 197 -176
5391a76J47J67l8Q6p50P00j80L3m0l1R4J97l53J73J7m38P41n72J87r5O4j19J31
5414e5K27k28J95N7k05r1Q9K05k35j22j29N00l99M87m74o3K88n9P4j7J2l9p9n4
5438a15J28m08K71N17q04N82l92J71K92k89J08l89N00l11k7o0J60j9K30j95J28
5459G8j86k10O42k80J43j25j93N39l95q4n3K60P5j46l53M33K23l23J81n86N45
5480A85k62L33k04k31L95l00L30l04j41J52K1J48j27j6R9r7j56L37j50j4J13l25
5502b14L52l14L63k46L0l4p3mk2J27P0J42j81K37n17K03K73l13L5j11K45n2J0
5525FJ94m67K94L3k6%k26j50N77l15J02p6r9J65l1N7j05MK28j60j12J57n2K9J72
5550A99k03J50l24M95m06j32L83l70M00l34j38J83m9L13l76J82P5J7r6J46k92
$$ plain form
5391 -176 -29 138 100 186 -564 136 -44 -11 -51 -82 12 209 -144 29 46 -392 349 -223 -36 -131 -67 -186 -55
5414 -55 172 -56 139 196 -9 -100 -11 194 -41 -163 -292 208 -191 296 -178 -241 47 -12 62 45 57 18 -61 -115
5438 -115 13 -395 -124 393 -411 171 -221 -50 242 -47 61 -328 172 -139 -166 -226 -66 -85 145 -50 78
5459 78 -108 -318 324 44 187 62 -131 408 13 -71 -124 136 211 65 -288 145 368 45 226 -360 185
5480 185 -77 256 52 -179 216 -84 246 -58 -199 -47 -26 122 -5 -21 78 -19 -175 162 12 -2 111 -214
5502 -214 138 -176 187 -59 -29 -63 -136 -140 -162 -35 35 177 -4 233 -284 -81 192 -121 -86 -197 48 -4 6
5525 6 200 -267 27 60 34 34 -192 -342 235 -80 22 -54 -153 12 -19 38 -67 -63 165 5 -107 50 -2 27 199
5550 199 -4 146 -178 317 -89 -221 162 -208 192 -142 -280 -97 -146 167 -209 -27 48 65 -31 115 -177
5571a77K35J33k90L37m93N70m64M84m07K0K16l95L17%m9p3j20K52K06o21K36M08
5593C25n57L72l33J66J58k17K43k43K44j71Q5m1K15k77k0q1q0K19k01K86j81K27
5615A38o8j27K55k46J28J87k75j70L77k46j6L3k4L67o10O95n38K35J26l57K78
5636A42l0j49L3K4m2J29k26M47n46Q6K56k14L01l16J78J27l24K07l55L15n2K7
5658A8J15k6m66N36j93j6J54m41N44n32N23k73J12O1l22J45K62j73K00j43m66
5679c81N13j83L26N4m90N08n96M55n2m12M53q9j82J27k3j03J13j96M47l62R2M70
5701D89p23L91k80K36Q7k31K76k69K6J67l9k6j11o6L41m08O9N15q75L85k6J29
5723E7k91K17J34k01J85oj51O8J01l89L70l60K04M04p51M23K06k31K8l13J45J57
$$ plain form
5571 -177 58 191 -99 238 -255 315 -149 335 -72 -52 164 -231 86 86 37 -36 -156 96 302 -319 -83 325
5593 325 -232 140 -193 -27 131 -86 157 -86 158 -13 72 31 246 -31 -51 -132 -212 7 -194 92 -89 138
5615 138 70 -57 198 -48 80 267 -8 -178 199 -47 -63 -30 -54 313 -297 398 -140 95 221 -136 142
5636 142 112 -37 -4 20 -22 107 -119 328 -218 -132 124 -90 211 -105 73 200 -124 83 -272 43 -9 18
5658 18 133 107 -359 177 -16 -32 122 -319 225 -307 216 -57 55 116 -206 -61 201 28 228 85 -381
5679 -381 132 -51 275 329 -161 347 -249 206 154 -258 195 106 -76 51 28 -75 38 -158 289 -73 19 489
5701 489 -234 157 -123 113 200 -31 245 -24 2 169 130 104 -7 -73 268 -140 -71 444 -431 -46 -72 57
5723 57 -234 -17 117 -84 101 95 -56 12 113 -276 94 -266 -62 342 -409 14 220 -11 17 -296 -151 6
5745Fo2J58j19J28ll92L09r2o3K47m53M88j06M2j51L3j86L36j37j7J84l62K98
5768H6k15K45n7J30nl15K75j67j40J97j10J50j82M97l87K4J09j50j30J12j23J08
5790d8p4j59L69Ll42J14J75j53R5J52J08q6k28nnk2O6j09K70m41K08J56k07K98
5814A35n0k43jK19l22M47k57L01j77p9K67n4j2l06K06j54K28k19j96J76j2P8N0
5837B5M5k17L20k0o4J21l71L85k15q5p7J12L45l59J70j53J11l24K45k39K14l0
5859f1j69K89o8N3j67K42m7k98K92J18j20l43K41j06R5P4J65k36j18J57n9J59
5881I3k89K39k48K54l0J6jO3M0k20Q0k13M22k33k22K57k51J73Q9j06p6M5K16q8
5905A0N0j34k26K06R6k84N39k15KL06n68L08k25J74K5k14J65m5N4J84k53J70j27
$$ plain form
5745 6 -56 102 -17 111 108 -284 25 -67 -130 117 -336 152 46 88 -63 -30 -216 120 -17 -34 150 -212 86
5768 86 -129 116 59 189 184 -131 144 -23 -163 34 -76 74 -108 389 2 26 135 -15 -145 -33 -156 -48
5790 -48 -122 -281 88 91 -251 -137 38 -115 -20 132 240 154 -74 -79 -84 -106 -40 -149 121 -320 -112 44 -163 135
5814 135 85 -158 -159 60 -262 185 -72 229 52 -27 240 186 174 -132 74 -80 148 -71 -267 -91 -103 -25 25
5837 25 70 -147 173 153 89 210 -161 224 9 -76 -153 -41 304 -55 115 -38 73 -251 -6 -245 -31 -61
5859 -61 -230 59 -9 44 -123 119 72 -226 66 184 64 -279 -38 -144 -49 25 190 -46 -164 -7 -66 93
5881 93 -196 43 -205 49 19 35 34 97 137 -83 -3 -216 206 -27 -249 8 -243 -70 19 -87 -163 -118 98 10
5905 10 60 -74 -300 -94 2 -282 257 42 44 350 -218 90 -135 39 64 -150 15 -30 24 208 -45 125 -2
5928bj25K18j24n0K07l84M22k80LM0J17qn9K0M6o3j77K01mj37j65OK87r1L81l51
5954g2J8R8j62n6Q8J28j99j4M1K36j97J32r0r0N7k89L08l4R5%j24P0N3lk8%J35
5981A01J0k04J88J2M0j18j88M46m52J49R2k67L04k55L36O8k94M8o8K16jk55N9
6004c3j18l9L93l40NN5m1K69j68n8J08r4j24J23j8JJ53q4n1nK26j81N1m4l9J07
6030E4j53K05j94J37o0K6n0pJ58j55p2Q0oj47L30o4k48K89l66N54l78j16J65N
6054a3K48k40k2J8j23J37K06n60M89j48l1M5j33K85j39K81l22kj61J88K38r8j61
6077a8l9K37m95L27j23J58J82l93K82l26K04%q8lK36j08O6k08m5J28l31L46n3
6100f4r6M85n47N62n01K1J64J86j30j02j67K10k07O8M60o65M61k79J11k7k10M10
$$ plain form
5928 -2 -127 91 -33 -83 124 -260 162 -118 -115 -75 42 34 -25 -5 41 -22 -199 2 -2 -139 -304 -298 -11 -102 279 -72
5954 -72 -54 44 -118 -174 -86 42 -157 -171 -130 106 -91 41 -49 -139 -82 -371 -63 -97 -2 -2 -126 -56 -3 -6 -34 -34 101
5981 101 111 -93 95 107 147 29 -159 287 -165 -16 76 -191 113 -142 194 262 -32 16 -52 164 163 -92 -33
6004 -33 -151 -190 203 -137 -132 -77 -118 151 -17 -75 33 -61 -185 -62 -80 -79 74 -10 -61 -66 160 -21 30 -14 -53 54
6030 54 -99 106 -88 49 -11 15 -35 -42 116 -39 -111 -31 -37 -184 146 82 -166 123 -243 311 -67 -183 -18 -13
6054 -13 235 -5 -27 -9 -132 5 211 -349 140 -8 -39 6 -127 158 19 300 -22 -24 -185 3 241 143 -18
6077 -18 -57 180 -315 12 -111 47 229 -164 118 -208 -4 -4 -92 -95 141 33 99 -109 -154 -26 -357 -11 -64
6100 -64 -160 325 -222 340 -161 -140 24 210 80 -22 -189 21 -186 -118 342 -323 138 -141 -30 -57 -267 143
6122A43m97M33q6k0M1O0j7j00m3n5K99l92K67j13R6L84m01J94j40L5j22P6j78
6145a36J54J14j60K02l48L51l25L98j89j27l3J27Q2m84K34K53j74n4K62m00J91
6166f2M4q8L71n29L35j63j18K60l68K52J59o3o4l6K18o2J30j78J08k05K05k92
6188a46Q3n0R6J4k02L95m05L03j75K14l41K37j47J76k48l9P16n27Q0j90M6Q5j85
6211b10L24l26L17j72J34j58J68n2J3P3mj49l11L85K2L7J32l09L72k06k44K70
6233A06j74o3M20l61J43N8l74M05o3O7j79%K48j50k2j12J38j14K02m19L36o0L0
6256F2l3q8J74k41K9lk8K01k84M21N5j77j92J05q8J02K46l04N0j89J90j17l7J15
6280c1P9j63K3N5l02L20k7j01J63p8J17m5j44M0K80m84K77O1l29O77o67L15L7
$$ plain form
6122 143 -354 79 -7 -27 14 74 57 -43 -86 -141 158 -234 33 -80 16 400 -1 193 53 88 -34 42 -136
6145 -136 18 132 -28 174 -174 177 -148 250 61 -66 -99 28 110 -374 -140 113 -61 -115 147 -253 -62
6166 -62 -18 -106 265 -264 71 -92 -210 50 -318 -66 93 30 -34 -70 148 86 216 38 146 -59 146 -146
6188 -146 -63 -113 -17 -3 -205 190 -215 88 -87 127 -214 23 -124 52 -196 -235 481 -46 34 -156 -110 -25 -210
6211 -210 114 -212 105 -67 67 -91 77 25 38 111 107 -42 -353 32 54 91 223 -86 286 80 -164 106
6233 106 -68 -131 289 -72 71 129 -245 160 97 164 -15 -15 233 83 61 -51 87 -27 175 -244 92 32 62
6256 62 29 -59 115 -126 -97 -100 -128 73 -211 210 265 88 -104 1 -87 15 261 -43 7 -182 8 -109 -146 -31
6280 -31 48 -115 -92 -37 -339 -19 -46 -147 16 -62 55 10 -134 -94 186 -298 -21 40 -289 388 -279 36 73
6303G3j27J65j25q3L33j94j62K99k38J43l36M56k99k55L53p3L22m93L7J40P0N5
6325F1P7k13N4K68k68J57l39J47L4O3k5j0J9j70K91k43rJ18J08L1m23L12k49K70
6349F1l3J13j30j26K49j41%j18J22j06J54l04J22L22k87J93k61J79k1J2J92j55
6371C7l9J89l50J01J95j13j5l42L97n1jM0j51K17N8q5r4J1O5k00J48j2l29L29
6395EJ32q6r8J04l15N13k47k3j69J97L4J03l32L3K60k55K60j84k30M15J13m16
6417a86Q0J20k51L64j25p5J47j06O5l19K23p8K22j59k3J70r0K63k17ml6K06j91
6440@Q6J2j24J16j49K48j25j03o9J52Q3K2l11J25k1O6n8o9N7K14l4n8k28J66j28
6465a30J66l3Rj71K07R4l21K81l07L59k60K93k52P4R7l23L02r2o1m6LK92k66J11
$$ plain form
6303 73 -54 111 -14 -97 236 42 -120 179 -59 84 -252 204 -95 -350 3 -70 252 -241 -204 -64 6 61
6325 61 138 -75 -21 247 -21 136 -203 -56 -22 41 16 6 25 -145 146 -97 -106 12 120 151 -272 40 -209 61
6349 61 28 141 11 -115 134 -7 -7 -125 -3 -109 45 -259 -137 185 -102 91 -170 9 -12 0 192 37
6371 37 -2 187 -163 -62 133 20 5 -337 60 9 8 48 -103 114 172 87 -7 4 69 -131 17 5 -324 5
6395 5 137 51 -47 57 -258 255 8 -15 -184 13 47 150 -182 -149 111 -144 116 -68 -298 117 230 -186
6417 -186 -106 14 -237 127 2 -73 74 -32 33 -286 -63 -141 81 -78 -101 69 -21 242 25 21 -15 191 0
6440 0 86 98 -26 90 -59 189 64 -39 -108 44 127 149 -162 -37 -58 8 -50 -119 -62 152 118 60 -168 -2 -130
6465 -130 36 3 12 -159 48 142 -179 102 -205 154 -106 187 -65 9 106 -217 85 -7 -68 -114 -111 181 -85 26
6489B6j2L6k90J79o9J30J07K2l3k34j3K76j30k1P2J48l28J41Nj38O6M3p9j21K66
6514D9J46n4l15L50k75K05k7j56J12R0j11J4kk71L77l32L37l21P1K60l86J33L07
6537B01N0j12k58J25L51k91j40J77j84K15j79j05J28Q2o3k78M50m62M15K04l47
6558b1N7q9J71m1j57K44m7o1J5j26J32j02k34K92j00k78K23K9M10k57J6K21m80
6581a83J85j44L5M5P2k02J35k12L78j44j07K71m1L4j92J07k71M78o4k01o3N1P2
6604C9M6k06J6K83m48L77j91j08M21j4k53Q3k09j0J93k2K00j32k91N04n92O64
6626C50l30O1J46q8k32N3j73P0J85j42L15k00n8n9L7J32l29M23j99M6J93k29o
6649c4J21j37K3O7k17J90k81L67j71J13n2J88q6j44j79M79k95k03J86K07k19J71
$$ plain form
6489 26 14 50 -240 -61 -130 0 107 129 96 -138 -151 125 -5 -26 46 194 -134 7 12 -126 -60 -17 -96 -217 49
6514 49 195 141 -174 176 -99 106 79 -77 35 125 14 28 26 -245 132 -200 137 -184 -113 147 -239 -106 201
6537 201 251 139 -119 6 357 66 -74 103 -81 134 -45 -150 -22 60 -3 -281 169 -293 122 326 -21
6558 -21 36 -53 118 77 -80 164 117 56 71 -55 77 -25 -259 33 -67 -345 -122 -93 317 60 76 297 -183
6581 -183 2 -142 -107 -62 10 -192 -57 -269 109 -35 -142 129 88 122 -70 37 -234 244 180 -21 -84 -33 39
6604 39 85 -121 -105 178 -270 107 -84 -192 229 215 -38 45 -164 -174 19 -3 197 65 -226 278 -314 350
6626 350 20 81 227 139 -93 -40 -213 -143 42 -100 215 15 -43 -102 -65 67 -262 161 -38 8 201 -28 -34
6649 -34 87 -50 -27 40 -177 13 -268 99 -72 41 -11 177 91 -53 -232 247 -48 -251 -65 142 -77 94
6671I4j82J82r4p8n4N8J64k49K39j00J6K21k36j8j99J72j36L22l8j67Q1N3K40
6694B91n74K26O6J07J05j99P6l60J13R4O9J03l09O9J05j47K43j74j21K29k34J60
6716f2j0M0p0K20q3o2p7O0N1m4J85k12J69o3j82K20k2j03q0M9J35n4jm5rl5K32
6743A47q7P9j85o3k5NK91j86M6P2M9M2n11K48j5L3J19%o1J55l26J44J94j37P0
6768I8j62Q1o2q0lM7K1J28k25L07k79J4J53q5OP5R0k38j3K66j21j66J85J45k36
6793e4O5j9R7O1m6j64j95M08k14q3N36n79J40J12r2k7p0J12o2K68q7J1j50k0N3
6818AL1l8j25K62m06L16k45J99j36L32n2j79K72k39j0j16L36l30Q8J75k97o0J60
6841f1Qj22M36k53L9k01K25Q5j20J6k5J11l9q4O8j87O7j59Q7J11j38R6O7J8M3
$$ plain form
6671 94 -88 94 0 -78 -132 -74 90 -159 80 -20 -4 217 -19 -37 -236 -64 -200 122 84 -83 -2 51 291
6694 291 -283 -57 9 116 221 22 98 -262 -149 -55 14 117 -192 -123 -18 -165 78 -96 -217 12 -222 -62
6716 -62 -72 -32 -102 118 35 -27 -104 -44 7 -37 148 -64 105 42 -140 80 58 -45 -125 -76 59 5 4 -41 -50 -85 147
6743 147 60 139 -46 -109 -134 -129 162 -24 22 94 143 185 -326 -78 -93 -60 59 59 -2 153 -173 -29 165 28 98
6768 98 -64 17 -45 -125 -128 -81 -60 68 -157 150 -129 -115 38 -47 -41 34 124 -114 -127 139 18 -148 37 182 -54
6793 -54 11 -8 89 150 104 -60 -255 153 -61 -144 392 -187 -47 65 -27 -54 -124 -12 -74 194 107 118 -32 -52 1
6818 1 32 -6 -131 131 -275 41 -204 -5 -141 191 139 -40 232 -7 -17 -133 203 -127 -39 136 -161 -221 -61
6841 -61 -53 -175 261 8 47 -154 71 156 36 52 27 138 99 15 83 -104 -37 -196 -109 2 -136 -40 27 45 88
6866H8K7n27J72R3j99M15M2k09j00M53l20J7J26k35R8l0M6K0M2j9o4r8K32j75
6890a05L15l44R0N6l2J54j97M9R1q6O1m5q6K23j45J29j13n4q5J64k19J72l0j1
6914d8k66L13P3j50J80P7j46r2J2l8L67J8k09j56q5J1Q4P4o1J00j11P0N2j60j70
6939b61K36J14k28P1j02K50j06j32J17k0j6K53l35P6m0m5J95N1k24M10j01Qj89
6962a8O3%k0lJ2j58K05j7j06k6O4l66M36k70MjQ3J23j68J53l1o2j4J91j01J36
6988A09j81J89j96Jp2K77k34l9P9nJ80p2k7M5l36L93k24k2j4J57j48j78L28k5
7012a5J25j91K9J24j21qk0J33m29K48J48k61L18j81K25l20K74j79P7j56K49k18
7034a49J07l1m9L69l83K50j79K53O5l35l0L4J26m3j24J03N9k16J03J97l11K45
$$ plain form
6866 88 115 -412 -240 -147 -346 69 111 -98 -198 255 -65 -48 78 -157 -59 -89 -43 -23 19 0 -64 -162 70 -105
6890 -105 210 -134 -44 12 -20 134 -63 -14 77 -9 52 7 -79 144 -1 128 15 -39 -124 40 -179 -7 -37 -48
6914 -48 -314 -1 72 -78 102 179 33 -59 -47 -85 282 300 91 -65 -150 -139 -55 19 -42 58 -53 17 69 -91 -261
6939 -261 -25 89 -139 -68 -170 80 -26 -158 -41 -61 -77 176 -159 -83 -123 -168 27 78 -146 264 163 171 -18
6962 -18 45 45 25 22 34 -124 81 64 -42 -68 -4 -370 66 -204 -200 -201 -118 5 -163 -10 -41 -103 -117 74 -27 109
6988 109 -72 117 -79 -78 -150 127 -107 -146 -67 -72 108 36 9 54 -282 111 -113 -135 -149 8 -140 -318 10 -15
7012 -15 110 -81 -52 72 -49 -57 -77 56 -373 -125 23 -238 80 -101 124 -196 78 -101 -24 -180 69 -149
7034 -149 -42 -73 -122 247 -136 114 -65 188 253 -82 -112 -78 48 5 -119 -16 43 -173 -70 127 -184 61
7056F1R8r8rJ8j60M1jJ32K6k65Q8J80k20Q6o0j20K51j87L2J83k40J86jj19L18
7081B20k16N7j26J2m3K18k37J59j62J56M42k07l23r4L52j87j58J44l9k39L60O2
7103A51j25J6j26M3LJ36k05jR0J30j40O7L0j86P1R3j45J09J37k57J21N7J0q6K3
7128A6j26K71n7J9L6l18J57k1j2O5j24N2J62j50K93k52N5j60K2J02R5j77k3j42
7152b17K85j33R0k17j7N2K48O2j09j31K95j59n9l4O8M2P9k02l8J42k5N5k99P5
7176a47J74j04O7k39K36k9J01K10l09j64K75k74K57Or8j39J98J36j48R3J34j98
7198C8J26k18L3J41k13J36k27K86k30J15%j8J4J95l38j70L57J65j56p8L27m09
7220a24L14k98K06j10J28j19n7O6J83j46P6j35n3K9j24P0j29L35K8j94J07L8j35
$$ plain form
7056 61 159 61 52 70 -90 -49 -50 82 108 -157 -69 111 -109 -23 -83 -203 48 -139 -107 76 -164 22 21 -98 220
7081 220 4 61 -65 -53 -96 122 -115 44 -118 38 480 273 -50 -144 208 21 -137 7 -32 -271 89 151
7103 151 26 42 -84 -41 -38 98 -107 -108 -18 112 -28 39 69 -117 -46 47 -98 11 148 -109 12 69 79 -7 16
7128 16 -110 161 104 123 159 -159 -2 -23 -35 30 -94 -42 120 -30 263 11 66 -94 -72 30 125 -52 -75 -217
7152 -217 68 -65 25 -192 -209 -157 91 153 44 -87 208 49 -10 -44 24 66 145 -57 -95 47 22 77 -222 -147
7176 -147 27 -77 -10 -249 -13 -42 59 269 -40 -204 71 -203 54 60 -38 -177 21 157 9 102 236 38
7198 38 164 -54 -21 120 -93 43 -184 102 -128 -13 -13 -31 -17 178 -160 -330 27 192 36 -42 285 -124
7220 -124 190 -108 98 -12 116 -3 -60 6 189 43 119 -16 -69 -40 -164 -94 -223 112 140 -54 53 91 -44
7243d4J23j93R7k24L54k54K82j69J10l3Mj52J25j19j94N22l27J43P2k34M48l96
7265e9j2J60j38J30o2qK7j38K07p0k10JJ00l3k4K5j39L42O8k22O1K26j57j16K37
7290A96l28L30j53j21J3K9J44O6j23o6j5J0j60L35j40J74n1m2j45N8p2L31l69
7313i9J72k13L7nO2m9j06K63j56j46J73J34M8K8o3q4k4j45J82j0j75K08Q8R0k80
7338g0MJ9J19k53PJ51j68J24J08j12q0K91q7j6r7M7n5M2m8M1j35K47j83K03k21
7363a22J67K2l22K51J55j69R6j28l1J65k2R2k99J09p2J75O8k11J6j73L63Q5n7
7386A58k46Q7k22J39j84J02J47P4RM3j95K24r3l0n6k7k7j09R1N6M5j26K13j45
7410g2P5J0ol9n6J44j91J51N9K2k70K28j23K54O2k10k49k29O37j85j20K13m2K22
$$ plain form
7243 -44 79 -114 -17 -241 113 -141 141 -28 82 49 53 -99 26 -93 -287 235 -92 51 123 -111 337 -59
7265 -59 -71 89 -49 81 19 11 38 -100 107 37 -173 -172 -72 -105 -129 -104 -243 99 167 -55 6 232 75 -41 196
7290 196 -132 198 45 -76 -63 -34 110 176 53 -13 -28 -18 -178 157 17 191 140 98 -47 11 -61 270 -99
7313 -99 73 -140 -103 -108 -46 -95 -201 62 -94 -240 -67 67 115 143 80 -4 -28 -173 9 -1 -176 32 120 210 -70
7338 -70 -66 -47 72 -181 -174 -23 -191 -67 41 -71 -151 140 53 37 -60 -13 -68 -26 -74 -33 -168 79 -104 99 -122
7363 -122 45 67 -255 -4 151 -18 78 -50 -81 84 62 154 -145 -36 -108 67 135 -76 -60 -233 130 215 158
7386 158 -88 -1 -223 -84 -268 -166 -19 55 64 107 -88 136 43 13 -43 -70 -97 -206 -115 -59 -14 -140 73 -72
7410 -72 3 13 7 -32 -88 56 -135 16 75 97 -173 55 -68 186 248 38 -211 -440 197 12 -108 105 63 285
7434B85k00r9m7j4j5K21j25j21M7j54K4J53O7n8r7J2O5J35M4J0nl68J42K0n9m2
7460a79J6k5J65o4m9K79l3j7j51J44k26N6N9R7p1J46j53r3O8J9J29l3P5k79k9
7485a49J31j26j49J84K24J45l99j5J39R7k8K20k63K5o9q8O5J88Kk96Q0j29K46
7508C5p6m13M00M32m32N3j04J12P1j04M9rM4l7K47k77l6nj13Q5J62j16n5L54k51
7533A6j2j62M80k75k95P5J95Q0q9N5l55L21l26K66j27K73k20K84j31N7j13r7L3
7556f7l6R7K24k76j59M05k7K6o70M80J40k11J67K4k39M2J15l00J21J10J27k08
7578a15J71m8K2k6K6m5m7j10K26Mrr1o3K78q2j1k66K09L4Op0J3r7J72k63K44j60
7605i8P2J01j65n8L60j52J0P9m20L37l76K63K02l03J19j15L3J87L6M7k47Q3K09
$$ plain form
7434 285 85 -14 -61 -75 -90 131 6 -115 -68 -222 -198 -45 22 -36 -133 -121 -56 79 123 133 128 -240 -98 -78 -137 -179
7460 -179 -163 -188 -23 -87 -136 143 110 93 -58 86 -140 -84 -25 72 1 147 -6 -99 -31 -12 117 84 159 -120 -149
7485 -149 -18 -144 -293 -109 115 260 -139 -154 -15 82 54 274 11 36 -33 -121 -56 132 134 -162 -82 -211 35
7508 35 -41 -454 -54 378 -54 -1 -105 7 78 -26 23 14 58 21 268 -9 -45 -50 -163 -78 84 -32 -87 267 16
7533 16 4 -158 322 47 -248 -173 22 102 13 68 -287 34 -292 -26 -153 120 -100 184 53 110 -3 -100 -67
7556 -67 -103 -6 218 -58 -217 188 161 187 -483 -3 137 -74 93 117 -122 -80 35 -265 -144 -34 93 -115
7578 -115 56 8 30 4 30 -15 -62 -172 54 58 49 -42 -105 173 91 80 -186 23 57 63 -7 6 -91 81 -182 62 -98
7605 -98 -26 75 -90 -148 212 60 70 149 -271 66 -310 -47 155 -148 -29 -144 -111 76 112 159 -88 -5 204
7628B04l02J34J27k49M5L04l24k7K07j32j48j54M99m83J34K27r2J59j87L19l76
7649a15j6Q4j03K02r2m3OQ4O8l53J75J14K0j3L08k30k25K78k24nl4K81j96j71
7673b00L63k78R4Oj16M3L5l4J53k32k16L37K43k59l7J24P9k39L8K12J01m11K24
7696C0R7j02j11j05L74n4k38m6L19j31k68K68Q5J67k38p1o5j40K78k36L68l02
7718a21m6n6J69o4j32M68k84R9k41J60j45L69k46M9j22J07r4R4r2Q6J55rJ06K1
7742B31j94j38J04p2j26o6K07p6L64k75o4N3l01K79J56mj07J16j3j46J13o0P4
7765E5L3k34O2j87K81j54m9M95k34n1n9R7J1K4j75j48M13m0k30J26Oj25Q5j30
7789a28N4K0R8Q8p7L9j36L8q1r1N6qK09m2q8O5P5k88R5L04j87P3r2J45k43o1L45
$$ plain form
7628 204 -98 36 163 -86 -41 263 -61 -88 119 -13 -161 -315 184 -299 -165 62 -30 129 -58 261 -115
7649 -115 -131 -47 -150 52 -40 -83 -77 7 75 -278 -103 11 31 18 326 96 -129 149 -75 -80 -114 167 -29 -200
7673 -200 163 -115 -21 -15 -131 -88 -53 -87 66 -166 -382 -45 198 -61 -98 26 105 -134 -96 116 217 -194 30
7696 30 127 25 -86 -191 183 129 -109 -155 164 33 -235 33 118 285 47 -24 -89 -229 49 -187 181 -121
7718 -121 -167 -223 -54 -118 -250 218 -66 33 -208 -48 -193 176 -70 -21 -143 -36 -130 -36 -128 -42 113 104 210 231
7742 231 37 -101 3 -69 -195 -261 -54 -130 234 -41 -105 -52 -353 -74 82 78 -29 87 74 -72 41 -19 55
7765 55 88 -146 -84 -271 10 -144 -193 302 68 17 -42 55 66 90 -85 -233 180 140 -90 36 42 -83 2 -128
7789 -128 -74 -54 44 132 55 94 -42 -4 -85 -176 -120 -128 81 39 -49 16 91 -197 -102 202 15 88 -4 141 -102 -163 182
7816A82j67o1J83M8N3k03n2m1J13r5K9k7j29O7O9k18K67k4j63J72j58K44j30n8
7840i9J68J24k15R0p9k76M25k03j82K38N2l2P6j27n1j59K11J18j90Q2J81r5Q5
7863A42j65j52J84po7J02N6K52m55j4L7q0m9L44o8j8J27m61M18k67K02Qj76n3
7887a60J8J12N8k4J00%k47K20j2j26J74j21o6M42m89j11K66k56K65k03M75l47
7909c2J86M8j39j83O3L8P8j68j5J9L6M2mp8J96k9J48k41l8n1K27r0o8J25j53J11
7935B8k6q8J63R4j43j05N4O4k15K64j42J53l32K33k18K71k28K63j21K08j88k02
7957b13R3J58J05l46K14L0n5kK9P0j4j07J4j9M82m35q4Pj12L93K02k98n7l9k4
7982hQ2k17K77k63K77M2j79n6L8lM8j01j50J81j84J75J72n9o4j5J33l04L59m07
$$ plain form
7816 182 15 -46 137 185 238 35 -17 -58 55 -40 -11 -38 -167 -100 -31 -249 18 -6 -169 3 -155 89 -41 -99
7840 -99 69 193 -22 68 -11 -287 138 -65 -247 -9 43 11 87 -40 -91 -250 -39 79 -111 -29 152 57 142
7863 142 -23 -175 9 2 -65 37 93 345 -110 -124 -87 -167 -216 128 60 42 169 -292 126 -141 61 69 -107 -160
7887 -160 -142 -30 28 4 104 104 -143 77 65 -61 113 -8 -74 368 -121 -232 34 -222 43 -160 315 -32
7909 -32 154 202 63 -120 -57 -19 59 -109 -124 -105 -69 -27 -31 -109 87 58 206 -35 -73 -124 103 13 -55 70 -83 28
7935 28 2 -86 77 171 28 -77 -23 41 -174 90 -52 101 -231 2 -216 55 -173 90 -31 177 -11 -213
7957 -213 -120 38 143 -203 11 41 -14 -16 13 83 69 -38 -24 -43 439 4 -80 -73 -185 208 410 112 55 16 -8
7982 -8 74 -143 134 -129 148 190 11 -45 -7 -10 38 -63 -213 -32 -216 -41 131 72 8 -7 126 -178 181 -226
8006b26J89nj31J06L7j7j35K55n4k00m9J13J84k47L08Q6q6k43J88P7k51J31j72
8029a42K38k48j1M1J41m3j02j52O4J02K75k14P6J11M2K4r4j45m1O2J84j35K9r9
8053c7L7R4l02K01Q1N8j80k1k6J47Kj66J16M6k58K38J36k69J11j28j3K9M8J88
8077A32j58p6K79k05q3M1J34j86J33l98J07L01M2J84k23N1k36J25N9M5R8j3k63
8100a10J08m3lJ75R2j62r5N8k6j09O2J11K2j67M65m33J14k00L7J92j49r0Q8J25
8124F2j89J35N5M2k10n4J62m5r2q7J27L7q0k14L53K07l9k31J26m4k64L62k74J43
8148a2P3O2j25J31K4j34L8k2k07K53m3mj25R3j73J50r4j7P8q1J00PO6j88K44l70
8174b76L12r6k56L82O0l34J38J57k07q3J73J84r4k40P7j22K23
$$ plain form
8006 -226 -37 -42 -173 -67 -30 -47 -182 73 19 -181 -230 -117 67 -180 128 214 128 -115 73 150 -101 30 -142
8029 -142 96 -152 -163 -122 19 -24 -126 -278 -214 -112 163 -51 25 136 178 202 108 -37 -78 -16 168 33 62 -37
8053 -37 0 94 -208 -7 74 132 -48 -69 -95 52 54 -112 4 50 -208 30 166 -103 8 -120 -133 -104 -56 132
8077 132 -26 -102 177 -28 -111 -70 64 -122 11 -387 -280 21 63 247 24 75 -161 -36 23 68 166 153 -110
8100 -110 -2 -45 -48 127 219 57 -38 20 -6 -115 -53 58 80 -87 378 -55 59 -141 -104 88 -61 -151 -63 62
8124 62 -127 8 63 105 -105 -159 3 -42 -134 -221 -94 -57 -137 -351 2 209 170 -61 65 21 -243 119 -155 -12
8148 -12 61 123 -2 129 153 19 57 35 -172 81 38 34 -91 2 -171 -21 -115 -132 -54 -135 -35 -28 38 -150 94 -276
8174 -276 36 -60 -316 66 126 -208 -70 87 -120 -203 -30 154 60 -180 -103 -225 -2
8191b
$$ Imaginary data points
##PAGE= N=2
##DATA TABLE= (X++(I..I)), XYDATA
0@%%%%%%%Qj6J9k7M0m8N6p8J02j28J60j98K43k96L58m26N06n98P01q19R57j113
29e97J285j476J689j925K188k483K809l167L561l993M467m986N553o173O849p589
45c988Q398r279J0241j1296J2447j3706J5095j6627J8319k0199K2298k4653K7321
58A4371l0373L3894l8012M2907m8835N6188o5591P8101r5674J22516j70620L97591
70B96463j170402R61206K49406r51757J588943j369013j65983J075719o21209
79a06627K85091j40289n37111O63286Q3723j26019m73330L00274J25291r3504
89a9215M91912j021667L12297P95089q74391O14405m34718m13458J164971o54028
99c8803p7693J83040n32204R46006m02862k95368L01331m83905Q72796l73927
$$ plain form
0 0 0 0 0 0 0 0 0 8 -8 11 -16 24 -24 32 -46 56 -72 88 -110 133 -163 195 -231 275 -323 378 -441 516 -597
29 -597 688 -788 901 -1024 1164 -1319 1490 -1677 1884 -2109 2358 -2628 2925 -3248 3601 -3988
45 -3988 4410 -4869 5372 -5924 6523 -7183 7912 -8715 9604 -10595 11703 -12950 14371
58 14371 -16002 17892 -20120 22787 -26048 30140 -35451 42650 -53024 69492 -101128 296463
70 296463 -873939 87267 336673 -615084 973859 -395154 -561137 514582 -106627
79 -106627 178464 38175 -498936 164350 248073 122054 -351276 -51002 74289 -19215
89 -19215 472697 -548970 -236673 558416 -315975 298430 -136288 -549746 615225 -38803
99 -38803 -116496 66544 -465660 480346 77484 -217884 83447 -400458 472338 98411
109I8411m35337N30530n63574P31038o8964q62130Q04374l19912P6544M87879
119D78859r76766M30141L15984k97037K35007l98160R5666K02716J18020j80375
129B4055l52921M78623j76837J04186J75783p81827O69950J42907n95264O86526
139C75181o98821R3292Q30113r20790L50002L5951l93811P30016l99281k24274
149b22422K88647j56315K67320j26927k04586J23288J0573K45141l04955k5682
159a05918J57126j83144M27425l66127j62327M21585l03364K51412o3465l61669
169b88466M20448r5727l2558P5614l11543L29241l7335q1303R5828l02378L42376
180A14197m3496j39349J56596k85917K68631P0431k77969K07018j60561N3346
$$ plain form
109 98411 -336926 193604 -369970 361068 292104 -570026 234348 -85564 -9020 478859
119 478859 -497907 -67766 248218 -48819 186188 -211972 -116306 86410 204430 24055
129 24055 -328866 149757 -27080 77106 252889 -528938 141012 283919 -311345 375181
139 375181 -323640 -230348 599765 -321025 28977 64928 -328883 401133 1852 -222422
149 -222422 66225 -90090 177230 50303 -154283 -30995 -20422 224719 -80236 -105918
159 -105918 51208 -131936 295489 -70638 -232965 188620 -114744 136668 73203 -288466
169 -288466 131982 36255 3697 79311 -232232 97009 59674 -21629 74199 -228179 114197
180 114197 70701 -68648 87948 -197969 70662 141093 -136876 70142 -90419 -37073
190c7073K38360l27122J10414J9491m4646J81477k19466N5302R061K1028J03275
201A10101j98917P7612J9651k1153J23534j89765L2194J22399j33542J60356j40143
212c7673o3803K22301j68561Q8355l5718r4360J66071p2972j329k857n6405J09569
224E2618l5083m1344M2272p8179J09642k8850o0924O8944q9918J12724l4438o5445
236d7981P7371o4670N2873J7186p7931M3060O136j4814M4463p5288L9859J1762
248A2026k8253N3683p6977M0731Q992j4879J8420l5579K2501M827o144N923j2586
261g315r696M1841l5593J0483L800k2698M2475l6742K1142j3506j545K1568j8834
274d620K706R82M230q467J7122k1205J2270l285L042L062j6541K4491k3024J7795
$$ plain form
190 -37073 201287 -125835 -15421 4070 -40576 140901 -78565 -23263 -14202 6826 110101
201 110101 -88816 -11204 8447 -12706 110828 -78937 -46743 75656 -57886 102470 -37673
212 -37673 -101476 120825 -47736 40619 4901 -89459 76612 3640 2311 -546 -56951 52618
224 52618 17535 -23809 18463 -59716 49926 21076 -39848 29096 -60822 51902 17464 -47981
236 -47981 29390 -35280 17593 34779 -43152 -92 6044 -8770 35693 -39595 264 12026
248 12026 -16227 37456 -39521 1210 10202 -4677 13743 -21836 665 5492 -652 5271 -7315
261 -7315 -17011 24830 -10763 -280 3520 -19178 23297 -13445 7697 -5809 -7354 14214 -4620
274 -4620 -1914 -932 3298 -5169 11953 -9252 3018 -267 2775 5837 -10704 13787 -9237 8558
288H558q941K020j254n70Q879j6034J6149j3532J2848j3328J1070m098o637J3610
302H740j3173R503j0483J5142j8297J3548l542o499J2737j6480J8087j8556J3519
315D246m693l179L412J303l456k930J3449k1791K2955j8422J0855j273j1811K3197
329A1862k5764J7223l125o257N277L891j1072J2046o613k807J6090k9673L6693
342A7771k9628R623J6815l3685L3385j9738L524J0166j5624J0916L724k0272L1042
355A8019k5386r0L3011n2161N0173l0815J38L1166m8429M5821k6427o161L6851
368B5710m2251J8079J5406m2908N3649l5570o523M4997o8201P2149m2944j4231
380b2638N9527p2465N9109k0432l2683O0036m9890K4304J4189o4559Q3309m9083
$$ plain form
288 8558 -383 1637 383 -187 8692 -7342 8807 -4725 8123 -5205 5865 1767 -4870 8740
302 8740 -4433 5070 -5413 9729 -8568 4980 1438 -5061 7676 -8804 9283 -9273 4246
315 4246 -447 -3626 -214 1089 -2367 -5297 8152 -13639 9316 -9106 1749 476 -11335 11862
329 11862 -13902 3321 196 -6061 -784 3107 -7965 4081 -2532 -5339 10751 -18922 17771
342 17771 -11857 -2234 14581 -19104 14281 -5457 -1933 8233 -7391 3525 7249 -13023 18019
355 18019 -7367 -7457 25554 -26607 23566 -7249 -7111 24055 -24374 21447 -4980 -11141 25710
368 25710 -16541 1538 16944 -25964 27685 -7885 -14408 30589 -37612 34537 -8407 -22638
380 -22638 36889 -35576 23533 3101 -29582 30454 -19436 4868 19057 -45502 37807 -11276
392a1276n313N8347j03248R9780l7005k9959P1759r8913Q3888j1862n5787Q0263
404D0674q0439M3028M2305j03238R4745n8125K385Q7829j43019J08272l7262l5154
416c7999J18695j45935O7987K6955p2904J02599r1566K844P5433q2397Q2573p1590
428b5305j1459R5562j04102J01022q9624r843J28628j49275J17578o0863p9023
439h6704K04660j63575L0862P6909j79608K14136p4429j06338J65343j65845J34920
450E0331N138j43320J35268q7449P3181J1363j16346J00889n8231O3291J6108
461E0223j52327J52764o9023J7962R0769k25794J79028j8198o3295J32564k17211
472a22538J36699M8843j17429J34881j80735Q1872J28507j94059J53871j35094
$$ plain form
392 -11276 -16589 41758 -61490 38290 1285 -28674 43085 -55828 28060 16198 -39589 40674
404 40674 -39765 3263 45568 -57670 37075 -21050 -18665 69164 -73855 34417 -2845 -37999
416 -37999 80696 -65239 2748 29703 -43201 59398 -32168 -29324 46109 -36288 46285 -25305
428 -25305 -36764 58798 -45304 55718 -33906 -43749 84879 -64396 53182 -7681 -86704
439 -86704 117956 -45619 -14757 62152 -117456 96680 22251 -84087 81256 -84589 50331
450 50331 55469 -87851 47417 -40032 33149 44512 -71834 29055 -29176 34115 50223
461 50223 -102104 50660 -18363 -401 90368 -135426 43602 25404 -37891 94673 -122538
472 -122538 14161 63004 -54425 80456 -100279 -18407 110100 -83959 69912 -65182
482f5182k208K34033k68986J28040k1481j16978K83199k16323j9483J19001j29531
493g5899J68654p0764j11737J08568k8579Q2064q7517l3725O2423n5980J80083
504A37591j98590k2932J88250k08664K32229j11251k13234L57070j96359K0444
514a5446J38527l35426K89550K3921k02843J92672k09225J20301J22952j88957
524f3974P4459q1858R3555O4765j31405M7991q4916J19975P0632k05961J18847
535B2110p2964M3874J63722k77328J08918K1051l7161J70668k43731N9904P7336
546C6399o0497J52137k25049L1153J54170j44572J76230j83423o7506K88054k16660
557e9564J10146l9660j83692L16955j22728o7193P4853j39942J77245Q953j27449
$$ plain form
482 -65182 -67390 166643 -102343 25697 4216 -112762 170437 -45886 -65369 53632 -75899
493 -75899 92755 21991 -89746 18822 -9757 72307 -15210 -48935 13488 -42492 137591
504 137591 -60999 -83931 104319 -104345 127884 16633 -196601 160469 -35890 -15446
514 -15446 123081 -212345 77205 101126 -101717 90955 -118270 2031 124983 -63974
524 -63974 10485 -71373 22182 86947 -44458 3533 -81383 38592 109224 -96737 22110
535 22110 -50854 -6980 156742 -120586 -11668 9383 -27778 142890 -100841 -40937 36399
546 36399 -24098 128039 -97010 -65857 88313 -56259 119971 -63452 -130958 157096 -59564
557 -59564 50582 10922 -172770 144185 21457 -45736 29117 -110825 66420 75373 -52076
568e2076K5317k6942J27781m2457o2566J3275p3405K21024j11384j08322J40842
579E1087j57901K05025r331k50589K15286p2678K2039J28890k75545J27352Q2855
590F6490q6503J07783j83707N9941J03938o1983M7183j47696P7360Q7507p5341
601e028N3962j37214N5597J42888j42538N7776p2206j9285J97919j56956M808
612b0277L894l8931J64941j19164l1413K6732k0749J32057j05573n3101P0606
623I022m4412J22159q2432r7422J29249o2831Q8494m1073j27838J45046l3628
634D334K4634n440j16503J13453J3614k6120J0068r9538R9727L1707o2603L4183
646B1516r6394R0459M5987q5945L5350o5788O5263N3771r0271K0057k4245L2002
$$ plain form
568 -52076 -26759 -53701 74080 31623 -30943 -17668 -91073 129951 18567 -89755 51087
579 51087 -106814 98211 88880 -161709 53577 -19101 2938 131828 -143717 -16365 66490
590 66490 -20013 87770 -95937 -35996 67942 5959 53142 -94554 -17194 70313 -5028
601 -5028 48934 -88280 -32683 110205 -32333 25443 -46763 -66048 131871 -25085 -20277
612 -20277 -16383 -55314 109627 -9537 -40950 -14218 -34967 97090 -8483 -61584 9022
623 9022 -35390 86769 4337 -93085 36164 -26667 61827 20754 -107084 37962 4334
634 4334 28968 23528 -92975 20478 34092 7972 18040 -81498 18229 49936 -12667 21516
646 21516 -74878 15581 61568 -24377 10973 -54815 10448 64219 -26052 -5995 -30240 1762
658A762O5598r6604J0702Q445N718P2899j04425J3004K7311j1836O8755r2101
670c0772l714N1707j6198L6606n4783k4446O5204j7503J7556l4485l5942Q1967
682C5197l1632R834j8935m0067Q0871k4547j2275j261l0669N4496N035m2776J1528
695e201j1042K5952J7123m2685O714n866L6255q148l1043J8317j9867M1271n913
708A5867m1779K5332j928N550K0591m7796J1310L1044k6044K4655k9733m260L1915
721A4724r465l753j3354R619L635Q848p675j7667J3134J3067j1591K338n853q734
735a2727L3385k3420j345P544j3937K3448p767j2190L666R035n890N810o309q262
749h959J4958p05n547l721P736r288J4908q379j0506J7071j2103R588l668o537
$$ plain form
658 1762 67360 -29244 -18542 -10097 -4379 68520 -35905 -22901 4410 -7426 61329 -30772
670 -30772 -34486 17221 1023 37629 -17154 -41600 23604 6101 23657 -10828 -46770 35197
682 35197 3565 13399 -5536 -45603 35268 10721 -1554 -2815 -33484 21012 26047 -16729 -5201
695 -5201 -16243 9709 26832 -15853 -9139 -15005 21250 13102 -17941 376 -19491 21780 15867
708 15867 -25912 -580 -2508 3042 23633 -24163 -12853 18191 -7853 16802 -12931 -17191 14724
721 14724 5259 1506 -11848 -2229 1406 10254 2579 -15088 -1954 11113 -478 1860 -3993 -12727
735 -12727 20658 -2762 -4107 3437 -10500 12948 5181 -7009 -3343 5692 -198 5612 -697 -8959
749 -8959 5999 5294 -253 -3974 3762 -5526 9382 1003 -9503 7568 -4535 5053 1385 -5152
763e152M324N626o636R65K592p897J1550n704n61k742P359o344J448N956j4824
778a0040J6041q164r7M227n352K988J818l694J068M282r143J0741q266L761j07
793F3k090N468j0328J4172j2418M440N143j0218Q851j547n700P433k833m810J3217
808H843j7722J4136l240q437J6982j9295J3489l801l643Q193j0090P403L04q311
822e189J1933q214m117J8356k4663J9777o002j1878K5795k9012J9588k840j4130
835a0596K3084j7953L134J1282j8892J5956m339j0608K2028k6478K1137n697j4505
848a2447K9064l2459K2768l022j7150K7690k5605J0845J0908k8617L0500j4318
860a843j1937L5995m4311L0368j557k7133M4206m2841K2040Q132l1336L8531k6623
$$ plain form
763 -5152 -828 4798 -1838 -873 1719 -6178 5372 -332 -893 -3635 3724 -2620 -1172 4784 -10040
778 -10040 6001 -2163 -2260 1967 -3385 -397 1421 -2273 -1205 3077 -6066 4675 -3591 170 63
793 63 -2027 3441 -6887 7285 -5133 -693 4450 -5768 3083 1536 -4164 3269 436 -4374 8843
808 8843 -8879 5257 2017 -6420 10562 -8733 4756 955 -2688 5505 -4585 2818 3122 -5189
822 -5189 6744 -1470 -5587 12769 -11894 7883 1881 -9997 15798 -13214 6374 3534 -10596
835 -10596 12488 -5465 -2331 8951 -9941 6015 1676 -8932 13096 -13382 7755 2058 -12447
848 -12447 16617 -15842 6926 3904 -13246 14444 -11161 -316 10592 -18025 12475 -1843
860 -1843 -13780 22215 -22096 8272 6715 -20418 23788 -19053 2987 11119 -20217 18314 -8309
873h309Q60K5035l5819K8572q572j6760L8069m3453L0216m117k5370M7957m9531
886b1222K7567M545l3132M8443l9817Q659K6796m8560M8145k1043k3667N8256
898C4970o1683L7216L434m6228O5972n1422J7138J9277m8057N2917k7239q097
910a1802L2090m4272L8723j0023k3310M2892n2058M4574q104l7558O2223o3993
922c0618M2019R309o0184P1920m8437P257M6226q1613O1907p223m1686P5122p8811
935c4812L3128K8263n8485O4052n4620J4497L3576m8462M3740l7002M976M0346
947B9197n2748M0464k6462j1742O4686p5351M4278q607l9769R0122q2162K3380
959d714K5267o0078Q5129n5272j7060N9165o6806O4412j9091n7422Q6307o3062
$$ plain form
873 -8309 -7449 17586 -18233 10339 1767 -14993 23076 -20377 9839 5722 -19648 28309 -21222
886 -21222 6345 10890 -22242 26201 -13616 -4957 21839 -26721 21424 381 -23286 34970
898 34970 -26713 10503 13937 -32291 33681 -17741 -603 18674 -29383 23534 -3705 -11802
910 -11802 20288 -23984 14739 4716 -18594 24298 -27760 16814 8710 -28848 33375 -30618
922 -30618 11401 20710 -39474 32446 -15991 -8734 37492 -44121 17786 10563 -31123 43999 -34812
935 -34812 -1684 26579 -31906 32146 -22474 -7977 25599 -22863 20877 -16125 -11149 29197
947 29197 -23551 16913 -9549 -21291 43395 -31956 12322 3715 -36054 54068 -28094 -4714
959 -4714 20553 -39525 45604 -9668 -26728 32437 -34369 30043 10952 -46470 39837 -23225
971b3225L6635J1025p6834Q6653m1171P815K3829o9902O6812j2240j7348K7796
983A9845n7522N3301Q40l0281L6100o6470O5779J405n3403O4139q0578N8942L1729
996D3826r1374P4400m9063P720P5594j06722M4879J2519m2731Q7273q4856M744
1008b3791M7239m4463O0876o0752l462M4186l0965M4111n3680p928N8042m1575
1020a2162L7603l5871l2299Q7266n5429K1859q522n3520R8715m7759n132J2123
1032F872n0894Q4732k9217l0566K9292m8689P3361j0474o3495N8345n0534N4230
1044B2963J5721r0647O7016k7629K2666L0426q7558M5804R784n694K8851o9000
1056c7297K6446K9920j7650K5924o7185L1359L4839l2210L3338o7614K7629N0438
$$ plain form
971 -23225 13410 24435 -52399 34254 -6917 898 24727 -45175 21637 9397 -7951 19845
983 19845 -37677 15624 16464 -13817 22283 -44187 21592 22997 -30406 33733 -46845 12097 43826
996 43826 -47548 26852 -22211 -14491 61103 -45619 -740 11779 -30952 56321 -28535 -23791
1008 -23791 23448 -21015 39861 -20891 -24353 19833 -11132 32979 -20701 -28629 29413 -12162
1020 -12162 25441 -10430 -42729 44537 -10892 10967 2445 -51075 47640 -119 -5251 6872
1032 6872 -44022 40710 11493 -19073 10219 -38470 34891 24417 -39078 19267 -31267 22963
1044 22963 38684 -51963 15053 -12576 10090 40516 -47042 -1238 8546 2852 31703 -37297
1056 -37297 -10851 19069 1419 27343 -39842 -8483 26356 -5854 27484 -40130 -12501 37937
1068C7937m7891K5752m2845O259O5616n2139O174j1686j3032P4974n5153p170
1080a3204R165k0918P4352n4578j8129K6884k3974O0945l5449m3902M8496j6335
1092f647K9178p365n9597N1788j390Q403l877n0483M6851K784N533j3091l8480
1105c6393M6355L002m458m234m2038M8071J4905l3251J6671m1731L7249L1601
1117C5749n1084J7971k5234K5153L2909m9357O458l268J1623L2252m5043m958
1129a6829J8254l357L3112m2503j1257L1404q433K3393l3035j3350K9362K796
1141I557M184k5023o310K3869M012J323k3659r067L8537j3511K718j2093k2141
1154b7604N0555j6452j0871L448k1037L5829L242l0126P267j410J1913J3491k9737
$$ plain form
1068 37937 -9954 15798 -27047 -20788 44828 -7311 -1137 -12823 -25855 49119 -6034 -13204
1080 -13204 -4039 -24957 49395 -5183 -23312 3572 -20402 40543 5094 -38808 9688 -6647
1092 -6647 22531 15166 -44431 7357 5967 14370 10493 -39990 6861 9645 15178 2087 -36393
1105 -36393 9962 12964 8506 4272 -37766 10305 25210 -8041 8630 -33101 4148 35749
1117 35749 -15335 2636 -22598 2555 35464 -13893 -7435 -10703 920 33172 -11871 -16829
1129 -16829 1425 -1932 31180 -11323 -22580 8824 391 23784 -9251 -22601 6761 9557
1141 9557 13741 -11282 -17592 6277 10289 11612 -12047 -21114 17423 3912 6630 -5463 -27604
1154 -27604 22951 6499 -4372 -924 -21961 13868 17110 -13016 -5749 -7159 4754 18245 -11492
1167a1492J394O323J3485K022k4604Q458j974J9266k792k5900J2316M262O126
1180F890L799k3888L793K0495q787M716j5679j266K0816o066j577j4150Q683R072
1194F851k464r65j4921R328J2534q798k732k451m175K1601j1888r044Q240p222
1208f106J6312p047r696L086N106L579m768l321k434P436M082o564o750R130l666
1223a621O231j674j3853J5372m705K083Q1r057O916M155l089l166J008j134N754
1238C301k364k134l331O866k60n077P286j2128J1008L08q216P786o208K663M720
1253D220o180RM781n992O744l902k068M167l365N532q096O860l135j784P840j0208
1269d577N966J231n941O612k380m958J0486j0372M619L852j0764J2774j0092L748
$$ plain form
1167 -11492 -10098 -3775 9710 11732 -12872 -4414 -6388 12878 10086 -15814 -3498 764 6890
1180 6890 10689 -13199 -9406 11089 2302 7018 -8661 -9927 10889 4823 3246 -10904 -2221 6851
1194 6851 4387 3422 -11499 -2171 10363 1565 -1167 -3618 -7793 13808 1920 -7124 1116 -6106
1208 -6106 10206 3159 -6537 -3451 1655 5234 466 -2855 -5289 2147 6229 -335 -7085 2045 -1621
1223 -1621 4610 2936 -10917 4455 -250 1833 1914 -7143 -227 3928 839 -2327 -1319 -2453 3301
1238 3301 937 -1197 -4528 2338 2078 -2999 4287 -7841 3167 3475 -4741 3045 -3163 -500 4220
1253 4220 -1960 -1951 2830 -3162 3582 -320 -2388 1779 -1586 3946 -4150 2710 -425 -2209 5631 -4577
1269 -4577 1389 2620 -3321 3291 911 -4047 6439 -3933 686 4538 -6226 6548 -3544 204
1283B04K275n889P018o599L969P79m373N053l035k288Q763j0635O343P92r249
1298f872J5458j5012P466J605r590J4260j1154J960N637q819Q617l199o058J2433
1312F732j2951Q652R54j3119J9232j5724P077M070j4021J6126r880J035P140j2189
1326f866J0027j301p494J2930j4370R003K175j2272J8143j8663J1168L362j6010
1339a0168K0614j5764L017J1784j9135J5123l455j0844K1423k0729Q937O796j9503
1352a1904K4368j8584M690R169j7397J8689j2263M61J0376j6240J5131n801q711
1365h016J9926k1921J4087J787j9469K8624k4819J0178R419k5202K7565j6155
1377c996k202J8271k4917J7784p86j5877K4791k2808R716Q713k2698K6373k0201
$$ plain form
1283 204 2479 -3410 3608 -2991 978 1757 -2616 2437 -598 -2886 5877 -4758 1585 2377 -6872
1298 -6872 8586 -6426 1040 2645 -6945 7315 -3839 -1879 3758 -5061 3556 357 -5701 6732
1312 6732 -6219 2433 3387 -9732 9500 -6224 853 4923 -9098 7028 -2852 -1817 5323 -6866
1326 -6866 3161 1860 -5634 7296 -7074 1929 4104 -8168 9975 -8688 2480 5842 -10168
1339 -10168 10446 -5318 -2301 9483 -9652 5471 2016 -8828 12595 -8134 803 7599 -11904
1352 -11904 12464 -6120 -1430 7739 -9658 9031 -3232 -2771 7605 -8635 6496 695 -8016
1365 -8016 11910 -10011 4076 5863 -13606 15018 -9801 377 9796 -15406 12159 -3996
1377 -3996 -6198 12073 -12844 4940 4154 -11723 13068 -9740 -24 8689 -14009 12364 -7837
1390g837O276J0734k1827K2728j5136J234J4506k3040J9515o239j1209K5793k8181
1403a2683J5081N944k4559L3958k8020P440J6669l0661L0216j5960o766K4828
1415A5487k7316J6437Q93j9097K8832k2902P065R716k3540K8846k0594M087J1073
1428H987k2054K6257j7340j018J6391k4574K3452q273j5114K9832k9222J7110
1440D434N785l0618L7938k5256M597J7979l5143L1639r784j0842K2816k7682J6819
1453B682O381k1084K3052k1104R687J2272k5678K4795k0211Q020J4559k8025K3511
1466H857j4562J265K0835l0864J7661l76j3766K9869l1315Q722J3797k3698L1458
1479A7883k6866N30K1678k4918K4490j7148p972K6938k2061J3221m164j7734L2500
$$ plain form
1390 -7837 -1561 9173 -12654 10074 -5062 -3828 10678 -12362 7153 914 -10295 15498 -12683
1403 -12683 2398 8342 -16217 17741 -10279 -2839 13830 -16831 13385 -2575 -9341 15487
1415 15487 -11829 4608 5501 -13596 15236 -7666 -601 9115 -14425 14421 -6173 -2086 8987
1428 8987 -13067 13190 -4150 -5168 11223 -13351 10101 1828 -13286 16546 -12676 4434
1440 4434 10219 -20399 17539 -7717 -3120 14859 -20284 11355 1571 -9271 13545 -14137 2682
1453 2682 9063 -12021 11031 -10073 -386 11886 -13792 11003 -9208 -1188 13371 -14654 8857
1466 8857 -5705 -4440 16395 -14469 3192 2816 -10950 18919 -12396 -3674 10123 -13575 17883
1479 17883 -8983 -8453 13225 -11693 12797 -4351 -12323 14615 -7446 5775 1611 -16123 16377
1492A6377k0044L236O359k4096L4902j6732n270J2002k1905K8528r299j3107J5367
1505F318j7185K0008j14k2858K0556j4024J2572P188k9961K4113j0711P018J0098
1518A3018l1052K2021k707j245J2242k8765J5862R020j2792J6588k7071J0190
1530d691J9667k3144J8194k1719L969K5803k4802J0152r922k779K6675k0023k103
1543d723L392p052K3895j5359r115Q977o326K1900j7183p142R157n303K0733j8371
1557b520q947J5205p261J5359r992j9639K5672p674M900J907k8096K8949j669
1570F194o313O068k2808K0481P618j2869K587j1884J1474J2920j6225N52o283
1583h488J0008J2275j8869K951o524J2396R624k0644M421l128R078J0405k1286
$$ plain form
1492 16377 -3667 -431 5928 -18168 16734 2 -5268 6734 -15171 13357 4058 -9049 6318
1505 6318 -10867 9141 9027 -13831 6725 -7299 5273 12461 -17500 6613 -4098 2920 13018
1518 13018 -18034 3987 1280 35 12277 -16488 -626 8394 -4398 12190 -14881 -4691
1530 -4691 14976 -8168 10026 -11693 -7724 18079 -6723 3429 -6493 -9272 17403 -2620 -4723
1543 -4723 -1331 -8383 15512 153 -8962 15 -6311 15589 -1594 -8736 421 -4882 15851 -2520
1557 -2520 -11467 3738 -3523 11836 1844 -17795 7877 203 5103 7010 -21086 7863 6194
1570 6194 -119 5949 -16859 3622 11240 -1629 958 -10926 548 13468 -2757 -2205 -8488
1583 -8488 1520 13795 -5074 -2123 -8647 3749 13373 -7271 -2850 -5978 3100 13505 -7781
1596g781J291O865j11J2964k0490l210J6331o516J1774j7317n537J8840n298M254
1610F059j1020o113J7239o43m554m342p376J7396K65q866j224o523J7564k085
1624E777q298j671l361J6216l494r284k04j22J1697l19j4389M826L96P437L207
1639H414j8694Q038K740L762K627j5881N824O360J530j208j0093J808J0136j710
1653C653j405q064J707J1143n305L93r031M034J0281o452l36o218L411R154m925
1668B040m750l32Q73Q805m679p133L856r67R300o588n074L308M44O985o831l551
1684d294L199J924L076l309o366N668K130n46k19q024Q096L24l22p99o012P064
1700A590lm45j934k931M168K633l486L44k950L298M120o915L467l609L048L965
$$ plain form
1596 -7781 -6490 375 264 13228 -7262 -10472 5859 -657 11117 -6200 -11737 7103 1805 6059
1610 6059 -4961 -11074 6165 5522 968 -3374 -10750 6646 6911 -1955 -3179 -9702 7862 5777
1624 5777 -2521 -4192 -7553 8663 5169 -4115 -4319 -4441 7256 6937 -7452 -2626 -2230 5207 8414
1639 8414 -10280 -2242 498 4260 6887 -8994 -3170 3190 4720 3512 -6581 -4773 5363 3653
1653 3653 2248 -5816 -4109 7034 1729 2122 -6909 -2875 7406 954 618 -5600 -2189 6965 2040
1668 2040 -2710 -3042 -2169 6636 1957 -5176 -1320 -2287 7013 425 -4649 -1341 -897 6088 -743 -4294
1684 -4294 -1095 829 3905 596 -5770 -102 2028 1482 1263 -6761 1335 1659 1337 538 -5474 1590
1700 1590 1587 1142 -792 -3723 445 3078 -408 -64 -3014 284 4404 -2511 956 -2653 395 4360
1716D360o608K680j974K316K254m313L32J444n10K939l919j003L832l075M793
1731C548n464Q19L153m040N439n422Q96L048k883K137j224k322M489k713J72K118
1747A751n369O701m237O09K345n154O235m199O58K068l672L289o60k483M415m135
1763a838J196K620n703P104n158Q37L437n806O152m352M33K974m140L756j412
1778A00k304M880m112J679J759o346Q131n404J381K978p427Q338m532J73L291
1793B585o028N409k90m260N262n037K399L692p808P586n688J888M504q688P498
1808C024m419R17M013o904M333l42k589O175o679J724L714o988Q692p398J138
1823a589N408q222Q757o397k13O126p197N470j412m748Q101o275J665L476q616
$$ plain form
1716 4360 -2248 432 -1542 774 3028 -1285 -953 491 -19 2920 -999 -2002 1830 -1245 3548
1731 3548 -1916 -1097 2056 -1984 3455 -1967 -1071 1977 -906 1231 7 -2315 2174 -539 -367 1751
1747 1751 -3618 3083 -1154 -545 1800 -3354 2881 -1318 -660 1408 -2264 1025 365 -2118 2297 -1838
1763 -1838 -642 1978 -3725 3379 -1779 -942 2495 -3311 2841 -1511 -1078 1896 -2244 1512 100
1778 100 -2204 2676 -1436 243 2002 -4344 3787 -1617 -236 2742 -4685 3653 -879 -706 2585
1793 2585 -3443 1966 1676 -2584 2678 -2359 40 3732 -4076 3510 -2178 -290 4214 -4474 3024
1808 3024 -1395 -478 3535 -3369 964 622 -1967 4208 -2471 -747 2967 -4021 4671 -2727 -1589
1823 -1589 3819 -4403 4354 -2043 -2256 3870 -3327 2143 731 -4017 4084 -2191 -526 2950 -5666
1838e666J0644o661Q5N123r301R337m225j924O251p901O053nn701P422o146K343
$$ plain form
1838 -5666 4978 -1683 -1598 3525 -5776 3561 -664 -2588 3663 -4238 1815 1810 -3891 3531 -2615 -272
$$ [...]
8191a19
##END NTUPLES=NMR FID
##END=
