##TITLE=1H_93-2025
 200.13MHz, CDCl3,
 8 sc
 
 11.8.2025
##JCAMPDX= 6.0         $$ Bruker NMR JCAMP-DX V2.0
##DATA TYPE= NMR FID
##DATA CLASS= NTUPLES
##ORIGIN= UXNMR, Bruker Analytische Messtechnik GmbH
##OWNER= pz
$$ XWIN-NMR		Version 3.5
$$ Mon Aug 11 14:51:22 2025 Russian Standard Time (UT+4h)  she@DPX200
##.OBSERVE FREQUENCY= 200.1313
##.OBSERVE NUCLEUS= ^1H
##.DELAY= (6, 6)
##.ACQUISITION MODE= SIMULTANEOUS
##.ACQUISITION SCHEME= undefined
##.AVERAGES= 8
##.DIGITISER RES= 18
##SPECTROMETER/DATA SYSTEM= spect
##.PULSE SEQUENCE= zg30
##.SOLVENT NAME= CDCl3
##.SHIFT REFERENCE= (INTERNAL, CDCl3, 0, 14.3821)
##AUDIT TRAIL= $$ (NUMBER, WHEN, WHO, WHERE, WHAT)
$$ ##TITLE= Audit trail, XWIN-NMR		Version 3.5
$$ ##JCAMPDX= 5.01
$$ ##ORIGIN= Bruker BioSpin GmbH
$$ ##OWNER= she
$$ F:/spectra/data/she/nmr/H-C/1/audita.txt
$$ ##AUDIT TRAIL=  $$ (NUMBER, WHEN, WHO, WHERE, WHAT)
(   1,<2025-08-11 14:49:55.14 +0400>,<she>,<DPX200>,
      <created by zg, POWCHK disabled, PULCHK disabled
       configuration hash MD5:
       00 E9 B6 7A A2 85 ED C7 34 08 36 98 17 FE 4E 26
       data hash MD5: 16K
       CC 1E 67 5C CA 60 07 DD 59 E8 C6 70 2A 22 C2 67>)
$$ ##END=
$$ 
$$ hash MD5
$$ 00 E7 D0 46 5F 75 5D 14 FC 88 B4 19 B3 69 31 5B
##$RELAX= 
##$RELAX= 
##$RELAX= 
##$RELAX= 
##$RELAX= 
##$RELAX= 
$$ Bruker specific parameters
$$ --------------------------
##$DU= <F:/spectra>
##$EXPNO= 1
##$NAME= <H-C>
##$PROCNO= 1
##$TYPE= <nmr>
##$USER= <she>
##$AMP= (0..31)
100 100 100 100 100 100 100 100 100 100 100 100 100 100 100 100 100 100 
100 100 100 100 100 100 100 100 100 100 100 100 100 100 
##$AQSEQ= 0
##$AQ_mod= 1
##$AUNM= <au_zg>
##$AUTOPOS= <>
##$BF1= 200.13
##$BF2= 200.13
##$BF3= 200.13
##$BF4= 200.13
##$BF5= 200.13
##$BF6= 200.13
##$BF7= 200.13
##$BF8= 200.13
##$BYTORDA= 1
##$CFDGTYP= 0
##$CFRGTYP= 5
##$CHEMSTR= <none>
##$CNST= (0..31)
1 1 145 1 1 1 1 1 1 1 1 1 1 1 1 1 1 1 1 1 1 1 1 1 1 1 1 1 1 1 1 1 
##$CPDPRG= <>
##$CPDPRG1= <>
##$CPDPRG2= <>
##$CPDPRG3= <>
##$CPDPRG4= <mlev>
##$CPDPRG5= <mlev>
##$CPDPRG6= <mlev>
##$CPDPRG7= <mlev>
##$CPDPRG8= <mlev>
##$CPDPRGB= <>
##$CPDPRGT= <>
##$D= (0..31)
0 0.7 0 0 0 0 0 0 0 0 0 0.03 0 0 0 0 0 0 0 0 0 0 0 0 0 0 0 0 0 0 0 0 
##$DATE= 1754909394
##$DBL= (0..7)
120 120 120 120 120 120 120 120 
##$DBP= (0..7)
150 150 150 150 150 150 150 150 
##$DBP07= 0
##$DBPNAM0= <>
##$DBPNAM1= <>
##$DBPNAM2= <>
##$DBPNAM3= <>
##$DBPNAM4= <>
##$DBPNAM5= <>
##$DBPNAM6= <>
##$DBPNAM7= <>
##$DBPOAL= (0..7)
0.5 0.5 0.5 0.5 0.5 0.5 0.5 0.5 
##$DBPOFFS= (0..7)
0 0 0 0 0 0 0 0 
##$DE= 6
##$DECBNUC= <off>
##$DECIM= 32
##$DECNUC= <off>
##$DECSTAT= 4
##$DIGMOD= 1
##$DIGTYP= 9
##$DL= (0..7)
0 120 120 120 120 120 120 120 
##$DP= (0..7)
150 150 150 150 150 150 150 150 
##$DP07= 0
##$DPNAME0= <>
##$DPNAME1= <>
##$DPNAME2= <>
##$DPNAME3= <>
##$DPNAME4= <>
##$DPNAME5= <>
##$DPNAME6= <>
##$DPNAME7= <>
##$DPOAL= (0..7)
0.5 0.5 0.5 0.5 0.5 0.5 0.5 0.5 
##$DPOFFS= (0..7)
0 0 0 0 0 0 0 0 
##$DQDMODE= 0
##$DR= 18
##$DS= 0
##$DSLIST= <SSSSSSSSSSSSSSS>
$$ [...]
##$SUBNAM0= <"">
##$SUBNAM1= <"">
##$SUBNAM2= <"">
##$SUBNAM3= <"">
##$SUBNAM4= <"">
##$SUBNAM5= <"">
##$SUBNAM6= <"">
##$SUBNAM7= <"">
##$SUBNAM8= <"">
##$SUBNAM9= <"">
##$SW= 18.0517328524113
##$SWIBOX= (0..15)
0 0 2 0 0 0 0 0 0 0 0 0 0 0 0 0 
##$SW_h= 3612.71676300578
##$TD= 16384
##$TD0= 1
##$TE= 0
##$TE2= 300
##$TE3= 300
##$TEG= 300
##$TL= (0..7)
0 120 120 120 120 120 120 120 
##$TP= (0..7)
150 150 150 150 150 150 150 150 
##$TP07= 0
##$TPNAME0= <>
##$TPNAME1= <>
##$TPNAME2= <>
##$TPNAME3= <>
##$TPNAME4= <>
##$TPNAME5= <>
##$TPNAME6= <>
##$TPNAME7= <>
##$TPOAL= (0..7)
0.5 0.5 0.5 0.5 0.5 0.5 0.5 0.5 
##$TPOFFS= (0..7)
0 0 0 0 0 0 0 0 
##$TUNHIN= 0
##$TUNHOUT= 0
##$TUNXOUT= 0
##$USERA1= <user>
##$USERA2= <user>
##$USERA3= <user>
##$USERA4= <user>
##$USERA5= <user>
##$V9= 5
##$VALIST= <valist>
##$VCLIST= <CCCCCCCCCCCCCCC>
##$VD= 0
##$VDLIST= <DDDDDDDDDDDDDDD>
##$VPLIST= <PPPPPPPPPPPPPPP>
##$VTLIST= <TTTTTTTTTTTTTTT>
##$WBST= 1024
##$WBSW= 4
##$XGAIN= (0..3)
0 0 0 0 
##$XL= 0
##$YL= 0
##$YMAX_a= 288106
##$YMIN_a= -381721
##$ZGOPTNS= <>
##$ZL1= 120
##$ZL2= 120
##$ZL3= 120
##$ZL4= 120
##$ABSF1= 10
##$ABSF2= 0
##$ABSG= 5
##$ABSL= 3
##$ALPHA= 0
##$AQORDER= 0
##$ASSFAC= 0
##$ASSFACI= 0
##$ASSFACX= 0
##$ASSWID= 0
##$AUNMP= <proc_1d>
##$AZFE= 0.1
##$AZFW= 0.1
##$BCFW= 1
##$BC_mod= 2
##$BYTORDP= 1
##$COROFFS= 0
##$CY= -3
##$DATMOD= 1
##$DC= 2
##$DFILT= <>
##$DTYPP= 0
##$F1P= 0
##$F2P= 0
##$FCOR= 0.5
##$FTSIZE= 0
##$FT_mod= 4
##$GAMMA= 1
##$GB= 0.15
##$INTBC= 1
##$INTSCL= 1
##$ISEN= 128
##$LB= 0.25
##$LEV0= 0
##$LPBIN= 0
##$MAXI= 10000
##$MC2= 0
##$MEAN= 0
##$ME_mod= 0
##$MI= 1.114404
##$NCOEF= 0
##$NC_proc= 0
##$NLEV= 6
##$NOISF1= 3.799351
##$NOISF2= 2.8
##$NSP= 1
##$NTH_PI= 0
##$NZP= 0
##$OFFSET= 14.38212
##$PC= 1
##$PHC0= -1558.971
##$PHC1= 8.392288
##$PH_mod= 1
##$PKNL= yes
##$PPARMOD= 0
##$PSCAL= 0
##$PSIGN= 0
##$REVERSE= no
##$SF= 200.129724274929
##$SI= 16384
##$SIGF1= 3
##$SIGF2= 2
##$SINO= 400
##$SIOLD= 16384
##$SREGLST= <1H.CDCl3>
##$SSB= 0
##$STSI= 0
##$STSR= 0
##$SW_p= 3205.1282051282
##$SYMM= 0
##$S_DEV= 0
##$TDeff= 0
##$TDoff= 0
##$TI= <>
##$TILT= no
##$TM1= 0
##$TM2= 0
##$TOPLEV= 0
##$USERP1= <user>
##$USERP2= <user>
##$USERP3= <user>
##$USERP4= <user>
##$USERP5= <user>
##$WDW= 1
##$XDIM= 8192
##$YMAX_p= 0
##$YMIN_p= 0
$$ End of Bruker specific parameters
$$ ---------------------------------
##NTUPLES= NMR FID
##VAR_NAME=  TIME,          FID/REAL,        FID/IMAG
##SYMBOL=    X,             R,               I
##VAR_TYPE=  INDEPENDENT,   DEPENDENT,       DEPENDENT
##VAR_FORM=  AFFN,          ASDF,            ASDF
##VAR_DIM=   8192,          8192,            8192
##UNITS=     SECONDS,       ARBITRARY UNITS, ARBITRARY UNITS
##FACTOR=    0.0002768,     1,               1
##FIRST=     0,             0,               0
##LAST=      2.2672688,     0,               0
##MIN=       0,             -381721,         0
##MAX=       2.2672688,     288106,          0
$$ Real data points
##PAGE= N=1
##DATA TABLE= (X++(R..R)), XYDATA
$$ [...]
2233I42m38k229L020j551q73K413j941O8J482k067J345O47k143K481o65j985L075
$$ 942 504 -1725 1295 -256 -1129 1284 -657 -589 893 -1174 171 818 -1325 1156 491 -1494 1581
2250A581j608q74K123j805L48J400k380J494L99k068K548q75j535K480j722j97
$$ 1581 -27 -901 1222 -583 -235 1165 -1215 279 678 -1390 1158 283 -1252 1228 -494 -691
2266f91J965j995R16J043k343J766L44k537K535p12j565K527j711k55J825k281
$$ -691 1274 -721 195 1238 -1105 661 1005 -1532 1003 291 -1274 1253 -458 -713 1112 -1169
2282a169J073J147k497J528Q17k129K202q24j169J961j266j31J947k627J196Q46
$$ -1169 -96 1051 -1446 82 899 -1230 972 148 -1021 940 -326 -457 1490 -1137 59 905
2298I05k612K107L26k133J864j33j150J957j969N01J519k405R68J553k667J741
$$ 905 -1707 400 726 -1407 457 324 -826 1131 -838 -337 1182 -1223 -255 1298 -1369 372
2314C72M01j763J936p98r75J892j873P6J944k295Q65J093k297J450O14j922K169
$$ 372 773 -990 946 148 -827 1065 -808 -732 1212 -1083 -218 875 -1422 28 642 -1280 889
2331H89r26j012K139j726r9K012j970Q14R87k191J597l15j570K674j403j114K351
$$ 889 -37 -1049 1090 -636 -735 1277 -693 121 1108 -1083 514 199 -1371 1303 -100 -1214 1137
2348A137j675oJ391j670N23Q95j860J941l87j419K532j371p76K106j507l27J633
$$ 1137 -538 -544 847 -823 -300 595 -1265 676 289 -1130 1402 31 -745 1361 -146 -473 1160
2365A160k031R23O14j920K040m93j560K208r68j184K439j663k69J702j902J186
$$ 1160 -871 52 666 -1254 786 293 -1267 941 -27 -1211 1228 -435 -704 998 -904 282
2381B82M36j971K304p89j279K253j167j018K131j724KJ726k413J486K49j666J869
$$ 282 718 -1253 1051 262 -1017 1236 69 -949 1182 -542 -540 1186 -1227 259 508 -1158 711
2398G11o85j263K269j180p18J994j973Q96J256k470J579M74j980J700m07j160
$$ 711 26 -1237 1032 -148 -866 1128 -845 51 1307 -1163 416 890 -1090 610 203 -957
2414i57J880j397P1J499k085J129J000k370J206R40k067J242j4n86J245j121j21
$$ -957 923 -474 -403 1096 -989 140 1140 -1230 -24 916 -1151 91 77 -509 736 -385 -506
2431e06J559k119J023J300k685J630N55j967J479r8j108J658j114J17J484k112
$$ -506 1053 -1066 -43 1257 -1428 202 757 -1210 269 171 -937 721 -393 -276 1208 -904
2447i04R08J250k567J713L38j767J873o10p11J339j384J93J291j742R09O11k213
$$ -904 4 1254 -1313 400 738 -1029 844 234 -477 862 -522 -329 962 -780 129 740 -1473
2464a473J921J54j889J908l57p67J693j743L05J282j779J167K47j943J994l49
$$ -1473 448 602 -1287 621 264 -503 1190 -553 -248 1034 -745 422 669 -1274 720 371
2480C71j571K113p13j009J480j290n5J107r94P62O07j804J898k69j968K057n24
$$ 371 -1200 913 200 -809 671 -619 -674 433 -561 201 808 -996 902 633 -1335 722 198
2497A98j066J512j168K23P01j369J338K36k110K188M17k435J983n11r99J662r25
$$ 198 -868 644 -524 -301 400 -969 369 605 -1505 683 1100 -1335 648 137 -862 800 -125
2514a25o8O73j537J415K35j945K431m91j627J660n88p75J164r12M87P28j735J359
$$ -125 -193 480 -1057 358 593 -1352 1079 588 -1039 621 33 -742 422 -490 -3 725 -1010 349
2532C49J58k090K502l72j353J535o88m02R38j271R80N89j931J522L31k267J895
$$ 349 507 -1583 919 547 -806 729 41 -361 577 -694 286 875 -1056 466 797 -1470 425
2549D25P2j588J238k80l06J094j548J010J069k557J644P21j895J292K40j340J167
$$ 425 497 -1091 147 -133 -439 655 -893 117 1186 -1371 273 994 -901 391 631 -709 458
2566D58n38J25O52j682J222L91j791J393Q14k184J407k2j069J221p88O82P45k156
$$ 458 -80 45 697 -985 237 628 -1163 230 1044 -1140 267 245 -824 397 -391 291 1036 -1120
2584a120J317J119k714J825L62j966J573J30j101J028j076M22P71j758J561O23
$$ -1120 197 1316 -1398 427 789 -1177 396 526 -575 453 -623 -201 570 -1188 373 996
2600I96k503J709O29j867J608o6q61R78r84M40N98j791J383Q31k493J683N90j897
$$ 996 -1507 202 831 -1036 572 506 -355 623 -361 79 677 -1114 269 1100 -1393 290 880 -1017
2618a017J228p8p59R23p22O54O20k321J797N16j958J507L80j543J122mp53R30
$$ -1017 211 133 -626 297 -425 229 849 -1472 325 841 -1117 390 770 -773 349 345 -408 522
2636E22j380R82N49j901J650N35k437J588M32j346J030O9m00O58j169N58R47k039
$$ 522 -858 124 673 -1228 422 957 -1480 108 540 -806 224 293 -107 551 -618 -60 887 -1152
2654a152J602N02j933J063N40j383J018k74p2P08j586J179P11j915J352O64k008
$$ -1152 450 952 -981 82 622 -761 257 -17 -89 619 -967 212 923 -992 360 1024 -984
2671i84J447J43j101P36p69M33R13j518N50J084k120J032J061k044J351L28j121
$$ -984 463 606 -495 241 -528 -95 818 -700 -150 934 -1186 -154 907 -1137 214 542 -579
2688e79R77n85o1J039j419Q98P96k015J034N00j682J445Q6j042J454j156k51J382
$$ -579 398 -187 -248 791 -628 270 1066 -949 85 585 -1097 348 434 -608 846 -310 -561 821
2706H21j819R52P04j512R20L05j227R28p5n37J080o99L77O08j754O91J126j630
$$ 821 -998 -46 658 -854 66 371 -856 72 -3 -540 540 -159 218 826 -928 -237 889 -741
2724g41Q15N90j646J061j64p28J501j071N5J295j985P35J269j901J108L22j101
$$ -741 74 664 -982 79 -85 -813 688 -383 -328 967 -1018 -283 986 -915 193 515 -586
2741e86Q14m81L0R66j237M49R21j708M31J179j674R23M52r95Q67j81q46J252r21
$$ -586 228 -253 -223 743 -494 -45 876 -832 -401 778 -896 27 479 -516 351 170 -676 576 -345
2760c45J18J202j804J075N37j517R00J62q27R71n88J8P90j362M14J218j496N88
$$ -345 -227 975 -829 246 783 -734 166 328 -499 472 -116 -98 692 -670 -256 962 -534 54
2778E4N78j330Q88K65j223J546o78m67J042r28L59P53j606Q29K59j349J320j34
$$ 54 632 -698 190 455 -768 778 100 -367 675 -253 106 859 -747 82 341 -1008 312 178
2796A78q09J218q76k93J190j089K84R81j290O28J10j061J562m95j055J672j027
$$ 178 -631 587 -289 -582 608 -481 -197 784 -506 122 232 -829 733 238 -817 855 -172
2813a72n31J364j354K86Q92j087Q95j02j345J711m27r35J597r42p1J139j255J17
$$ -172 -703 661 -693 -407 485 -602 293 191 -1154 557 130 -805 792 -150 -221 918 -337 -220
2831b20R64j181P28J47j299J590n73o44J414q20p58J155p42K4P79j134P57R9j017
$$ -220 744 -437 291 438 -861 729 156 -488 926 106 -652 503 -239 -215 564 -570 187 286 -731
2850g31J514n71p02J358j080j91J093j203K20R70j515Q52kq09J258o58k60J072
$$ -731 783 212 -490 868 -212 -403 690 -513 -293 677 -838 14 12 -797 461 -197 -457 615
2868F15j047K61R90j644P13P34j175P60M69j016P14m19k65R47j170L60J158j643
$$ 615 -432 -171 819 -825 -112 622 -553 207 676 -340 374 -45 -310 637 -533 -173 985 -658
2886f58N67Q63j496R18M24j159R02m67j76P81q49J38J160j349L24R62j661Q37
$$ -658 -91 772 -724 194 618 -541 361 -106 -282 499 -350 -212 948 -401 -77 885 -776 61
2904F1P5q75J088l87k43P51j108L94J041j594Q50N56j112N96L9p79J197m86l97
$$ 61 136 -739 349 -38 -281 470 -638 -244 797 -797 53 609 -503 93 132 -647 550 64 -333
2923c33J108j093P2Q95j306Q04L29j188J144l77q29J346l98p46J170p86k25J126
$$ -333 775 -318 -246 649 -657 147 476 -712 432 55 -774 572 174 -572 598 -188 -413 713
2941G13j137P94J76j302J322l81q75J343r54m29J210o95j73O54p74P37n0j143
$$ 713 -424 370 546 -756 566 185 -690 653 -301 -730 480 -215 -388 266 -508 229 179 -964
2959i64J633l96j187J790r76k79J114q57J01M76r22O58K99j269J124l40q38J541
$$ -964 669 273 -914 876 -100 -379 735 -122 -21 455 -467 191 490 -779 345 5 -833 708
2977G08o95m43Q67p88j4O35r11R18K21j258J185j10q28J076n44o98J450j259M53
$$ 708 13 -430 437 -351 -365 270 -641 277 498 -760 425 315 -513 563 19 -679 771 -488 -35
2996c5P49j180P47J03j120J036j62p81J370p05k83J297j311M30N19j148O75j05
$$ -35 714 -466 281 384 -736 300 138 -643 727 22 -261 1036 -275 155 674 -474 201 96
3014I6o94R87o58m38J505j213K6J041j055N2P50j169J144j31q73J126o23k25Q23
$$ 96 -598 389 -269 -707 798 -415 -389 652 -403 -351 399 -770 374 243 -630 496 -127 -352 471
3033D71l83o05J366j254O66jj017J006p4q69J337n05n80J111p68k23Q61r35M46
$$ 471 88 -517 849 -405 261 260 -757 249 175 -694 643 138 -442 669 -99 -322 539 -396 50
3052E0M72j191J336m37r26J435p71n90J104q95j09R49o20J25L22r11R62o5j270
$$ 50 522 -669 667 230 -696 739 -32 -622 482 -413 -522 427 -193 -68 254 -657 305 240 -1030
3071a030J353J03j260J430q49J08P66q70L47L09j387J306j24j508J859l93m79
$$ -1030 323 426 -834 596 -253 -145 621 -249 98 407 -980 326 202 -1306 553 160 -319
3088c19Q54q36J86L44r33R83j44p41J223m39p99J189l90n95Q61l40k72J67m15
$$ -319 535 -301 -115 229 -704 279 135 -606 617 178 -621 568 178 -417 444 104 -168 -1 -416
3107d16P67l06q45J304j96j276J458l65o58Q93k45j81L70r01R34j93j018J644
$$ -416 351 45 -800 504 308 -968 490 125 -533 360 115 -66 304 -597 337 144 -874 770
3125G70n10p42Q46l08n05M69j06K18K10r46R04n3j206J248M1r27J085m94j18M16
$$ 770 260 -482 364 56 -449 20 -86 132 342 -604 300 247 -959 289 330 -597 488 -6 -124 292
3145B92n85K04N95r23R04n2j225J196l27j106J404l35j41O22r38M50j1o36J113
$$ 292 -293 -89 506 -417 487 435 -790 406 79 -1027 377 42 -99 523 -415 35 24 -612 501
3164E01J13j460J242j19r16R13l09l53Q52q88M83L42j231J262l00r10J456n55
$$ 501 614 -846 396 277 -639 274 -35 -388 464 -424 59 401 -830 432 132 -778 678 123
3182A23q01J365p17K58L27q24O13J8q24P15M05j321J190k00p22R18o96j22N32
$$ 123 -678 687 -30 228 555 -269 344 362 -462 253 658 -663 527 327 -395 523 -173 -295 237
3201B37o27O98L08j484J361j19j126J097j09m98N90m12m4L77o57P59k37q15O14
$$ 237 -390 308 616 -868 493 374 -752 345 236 -262 328 -84 -128 249 -408 351 114 -701 -87
3220h7L96j186R01K08n56M61n1l65N76r31R02j20p53J166k05j151J271p7q36Q53
$$ -87 309 -877 24 232 -324 137 86 -279 297 -634 268 148 -605 561 356 -795 476 399 -437 416
3240D16o99M00J19r51R00l6r46J277j5j091J058l80k92N93q75O31K77p94M98L24
$$ 416 -283 117 236 -715 185 149 -797 480 465 -626 432 52 -240 353 -522 109 386 -408 90 414
3260D14j042J206k09r93P98l69j98P44q18K73M75j138J336Mj090J093l19p52J058
$$ 414 -628 578 369 -624 174 -195 -393 351 -467 -194 281 -857 479 483 -607 486 167 -585 473
3279D73o85J16L26m84K41L98o84M81K68j010P72r7o08Q38q02N8J108r94L71J39
$$ 473 -212 -96 230 -254 -13 385 -299 182 450 -560 212 115 -493 345 -457 -399 709 -285 86 225
3299B25q73Q58L9o72R33m49p24J311p55j90N23n01K39M59q68N13L17j198J125
$$ 225 -648 210 249 -423 510 61 -663 648 -107 -297 226 -275 -36 423 -445 68 385 -813 312
3318C12J09n61K99k15j61N55q07O35O12j303P43O7o49N99m8l35O65p70L2Q72j008
$$ 312 421 -140 159 -56 -217 338 -469 166 778 -525 218 285 -364 235 187 -148 517 -253 -221 651 -357
3339c57N82K15m93K39P6q70R14k14l23O65p48J50P17j215O22M07p82O07K60j152
$$ -357 225 440 -53 186 262 -608 306 92 -231 434 -314 -164 553 -662 -40 367 -415 192 452 -700
3359g00J108k31p63J058p64K76K75p77O95M48j029P02l5p37R12k89l45P37q32
$$ -700 408 177 -586 472 -292 -16 259 -518 177 625 -404 298 263 -474 438 149 -196 541 -291
3378b91L5Q04j033M73K71p02O77J50q15Q21k74l45P42p59P1O89j114P02L40j055
$$ -291 -256 548 -485 -12 259 -443 234 384 -431 390 116 -229 513 -246 -175 514 -600 102 442 -613
3398f13Q63j41j007J441n63l29O36o62K73L52n65O84o6r73J133o6r92P66l68k18
$$ -613 250 109 -898 543 -20 -349 287 -375 -102 250 -315 369 303 -670 463 397 -595 171 -197 -415
3418d15P81m26r2N64q34P04O7r69Q50m42k36O60j85k33P95r38J29N86o54O44J17
$$ -415 366 -60 -152 412 -422 282 349 -620 230 -212 -448 212 27 -206 589 -349 -220 366 -288 356 473
3439D73r40N78Q2o09O41k37k16N22n88J1Q94r78K52M60q96N93j86j37Q31r04K92
$$ 473 -467 111 193 -416 225 -12 -228 294 -294 -283 611 -367 -115 345 -551 42 -144 -281 550 -354 -62
3460f2O45p67K46M94q49L6O26q40P42o07j34R33p03P3Q38j076J39P05p76N11J80
$$ -62 583 -184 62 556 -293 -257 369 -471 271 -336 -470 463 -240 -167 671 -405 -266 439 -337 174 354
3481C54o20M69j06m28P20o14J88M17n67M17J03p44N04J53q39P52Ol31N97n63j01
$$ 354 -266 203 97 -331 389 -225 -37 380 -187 230 333 -411 93 246 -593 159 165 -166 431 -132 -233
3502b33Q26q18K80M68o80J07Q8l91N04k3j94L74m35J2M11o33L49J66m72P26k51
$$ -233 593 -225 55 523 -157 -50 38 -353 151 128 -66 308 -127 -115 296 -337 12 178 -294 432 181
3523A81m00L77N3n16P41o22J30M38q80M92J56m37L1O44q65Q02k36m27M65l65L82
$$ 181 -219 158 211 -305 436 -186 -56 382 -498 -6 150 -287 -256 388 -477 325 89 -338 127 -238 144
3544A44M18r91M78K53p84O05m2m53N31o8l18N21n38J09M38o44L69M43p95L49K17
$$ 144 562 -429 49 302 -482 123 81 -372 159 91 -227 294 -244 -135 303 -341 28 471 -324 25 242
3565B42n33O01m28l9N03o90J52N96r01N67J48o68M47R6n57N70k10o2P42p91L85
$$ 242 -291 310 -118 -157 346 -344 -192 404 -497 70 218 -450 -3 93 -464 106 -104 -166 576 -215 170
3586A70J77p74P51N8p96O75k12k54O45o35P6M49j008O02L39m75K37J56l97M00
$$ 170 347 -427 324 382 -414 261 49 -205 440 -195 -119 330 -678 -76 263 -212 25 181 -216 184
3606A84l10j85O58n07q6R41r09J88O19r52N79P7k90M61m16p15J268o62n65R93
$$ 184 -126 -311 347 -160 -246 695 -214 -26 593 -359 220 297 7 468 52 -663 605 -57 -622 371
3626C71q45L56M04n08L68K8o53P85l55j04O48o06j59Q13r84K05O42p94K55K07
$$ 371 -474 -118 286 -222 146 174 -479 306 -49 -153 495 -111 -270 543 -441 -236 406 -388 -133 74
3646G4l02N91p9o16Q91q59J52N44n16J55L66n47K74O5m85N49l19j71O19m14j59
$$ 74 -228 363 284 -332 559 -300 -148 396 -120 35 401 -146 128 193 -292 257 -62 -233 386 -28 -187
3667a87O58l23k27J08n03M99Q2k31K30K4k21M05o05L18M03o26J39L55p33N06J96
$$ -187 471 148 -79 29 -474 25 107 -124 106 130 -91 314 -291 27 430 -196 -57 298 -435 71 267
3688B67p44N01P9l07M78n87K16L55m13P2K05n22M77J57m66M26J4l53M69l99K5
$$ 267 -477 24 103 -204 274 -313 -97 258 -155 -83 122 -400 77 234 -232 194 208 -145 324 -75 -50
3709e0J05m42N13K24n06L08Q5n05L35q8j76L12l21JL57k71j37J59j66P00m55k80
$$ -50 55 -387 126 350 -156 152 237 -268 67 -21 -197 115 -206 -205 152 -119 -256 -97 -263 437 -18 -298
3731b98M49j00k57M30k11J55J0n10O01R6n04N5K59m90N75l30j09N01n96M16J46
$$ -298 151 51 -206 224 13 168 178 -332 269 365 -139 -84 175 -315 260 -70 -179 322 -274 142 288
3752B88l08J55k69K33J27j46m58O56m78n7M40o24O79J84o99L58J47m71M21k12
$$ 288 -20 135 -134 99 226 80 -378 278 -200 -257 183 -441 238 422 -277 81 228 -243 178 -34
3772c4m71Q87n70j01N47m95O1K08j96M23k21l98O42q1m02O57m93Mj21m6K81M1
$$ -34 -505 382 -188 -289 258 -237 -176 32 -164 259 38 -360 282 201 -201 456 -37 -33 -154 -200 81 122
3794A22n13N56qm14L55O8l58N26l34R3K82o50M96k06l54P08k27l55L28J61m91
$$ 122 -391 165 157 -257 98 166 -192 334 0 93 375 -275 221 15 -339 369 142 -213 115 276 -215
3815b15J49J5j63K13l27K07K98k11N2K72n43N61k35l52L88l20R0M80l65j16O37
$$ -215 -66 -51 -214 -1 -328 -121 177 -34 18 290 -253 308 73 -279 109 -211 -121 359 -6 -122 515
3836E15q80K67K59n91N92L65q45P26k78k83M29n20J50K72l49R6J84m16M71M0l03
$$ 515 -365 -98 161 -430 162 527 -318 408 130 -153 276 -244 -94 178 -171 -75 109 -307 164 204 -99
3857i9K31j41J21l3n00M55O7j63P7K00m97M98J1l10K48q7j34K36j10j81l5l2L13
$$ -99 132 -9 112 79 -421 34 101 -62 15 215 -282 216 227 -83 165 78 -56 180 70 -111 -146 -178 135
3880A35l53O7K68M6m07N81l72p7L29l61k0Q4k14N09J54m68K13j70j48L20k02J33
$$ 135 -218 -151 117 163 -244 337 -35 -112 217 -144 -164 -80 -294 215 369 -99 114 -56 -204 116 -86 47
3902D7L08k86k15p3j7L01J44m27K60K2k1J06j77J9J70k89R5J06k49K55J31n02
$$ 47 355 69 -146 -219 -236 65 209 -218 42 64 43 149 -28 -9 161 -128 -33 73 -176 79 210 -292
3924b92L20p4N7Q8j24n4K04k05J56M0k50K79k88J13K42j61k23N03o30O6M94l90
$$ -292 28 -46 11 99 -25 -79 125 -80 76 116 -134 145 -143 -30 212 51 -172 331 -299 -233 261 -129
3946a29J85K99q09N74q2k45J28j68K34K64n16JM17l79M77q7k67K01J00l88P2j00
$$ -129 56 355 -454 120 38 -207 -79 -247 -13 251 -265 -264 153 -226 251 164 -103 98 198 -190 -118 -218
3968b18L89r1k40J54K81m04K19R2k18j12J01j23M25l52K5K73l56O5K47n38J61
$$ -218 171 80 -160 -6 275 -129 90 182 -36 -148 -47 -170 255 -97 -72 201 -155 -90 157 -381 -220
3989b20K79m17O15L1l80L32m27RJ84l62L98K84l71J44P5m23M62j34j42J66k67
$$ -220 59 -358 257 288 -92 240 -187 -178 6 -356 42 326 -45 99 174 -249 213 79 -63 103 -164
4010a64L08mk14LJ82k76J78J26k30K72j39J4K10j97J22K37n84L12K0k93K89l3
$$ -164 144 140 -74 -71 111 -165 13 139 -91 181 42 56 266 69 191 428 -156 156 176 -117 172 139
4032A39l03K43Qk01P8j69L05L7k53oM86m89K67r6k30L70m3k31J69j67J84J15m97
$$ 139 -164 79 87 -114 -36 -205 100 137 -116 -122 364 -125 142 46 -184 186 143 -88 81 -86 98 213 -284
4055b84K80N3j64K5K61j88o5m6R8Q5j93k7K92k25L4M07m07M5J52o6R6k33n5K87
$$ -284 -4 49 -115 -90 171 -17 -82 -128 -30 55 -138 -165 127 -98 -64 343 -64 -19 133 67 163 -70 -125 162
4079A62k81O6L07l61j4K54k79J26J72m85K31J18k4j22k11M48j9l57K9O23l99P
$$ 162 -119 -53 254 -107 -121 133 -146 -20 152 -333 -102 16 -8 -130 -341 107 88 -269 -240 383 -16 -9
4101im1p2L08k12K4J23k34J76j8l7M9O9k25M8K08l12K30j87J26qj63J68M0k78
$$ -9 -50 -122 186 -26 -2 121 -113 63 45 8 57 126 -99 -51 157 -155 75 -112 14 6 -157 11 51 -227
4125b27N13j32k50J54R3m11M49l40L05j85k24M20K30k39k45K52n23J57K38o5J6
$$ -227 286 154 -96 58 151 -260 189 -151 154 -31 -255 165 395 156 -89 163 -360 -203 35 -30 -14
4146a4o5lL61l52j72L36j54J00J56n00L88j07j17K71j59L1K81m62M45j31J8K4
$$ -14 -79 -82 279 -73 -245 91 -63 37 193 -307 81 -26 -143 128 -31 0 281 -181 264 133 151 175
4168A75r3l3op6n2J48Q9l03K79l77K46J97Rk41N4M1p2N9j18K37k63R3J51k83K30
$$ 175 82 49 43 -33 -85 63 152 -151 128 -249 -3 194 203 -38 16 57 -15 44 -74 163 -100 -7 144 -139 91
4193I1K1m24K94nJ51K44k54J21j30k2N5j96j02pO9k96M14J66l74J53q9k6L11l38
$$ 91 112 -312 -18 -23 128 372 118 239 109 87 142 -54 -156 -163 -94 -390 24 190 -184 -31 -120 -146 165 -173
4217a73J44L6j00J76J65j49K4L2o1r8j92k7J04m9J8L51m13L3L46k61j08L67j52
$$ -173 -29 7 -93 83 248 99 123 155 94 -4 -196 -223 -119 -168 -150 201 -212 -179 167 -94 -202 165 13
4240A3L27n42J17K70m3l18M84r0q5p4k28J40M3j10K13j90O0K04r6k81M01l84M2
$$ 13 340 -202 -85 185 142 -176 308 218 133 59 -169 -29 14 -96 117 -73 -13 191 95 -186 215 -169 -127
4263a27J16q1P9L3j54j5K38o2K61p05Q6M72j90O0J8j69k4L38j75K49r8r7j9p5
$$ -127 -11 -92 -13 20 -134 -149 89 27 288 -417 -331 141 -49 11 29 -140 -164 174 -1 248 150 53 34 -41
4287d1j60J15n4J37K72l45q8L6n5J81j7m4J13j04Q0j91J07J40J89n48K02L19l45
$$ -41 -201 -86 -140 -3 269 -76 -164 -128 -183 -2 -19 -63 50 -54 26 -165 -58 82 271 -277 -75 244 -101
4310a01K01p4p1K36l76L44k55J18j48J54nj02M32l78J64j99j75J34pQ1p5L7J08
$$ -101 100 26 -45 191 -185 159 -96 22 -126 28 23 -79 353 -25 139 -60 -235 -101 -108 -27 -102 -65 43
4333D3P8k66K85m16J89J06l27j1J95L7M9J76l86R0M55l42K09j35l05L47J91o22
$$ 43 121 -145 140 -276 -87 19 -308 -319 -124 -87 -38 138 -248 -158 297 -45 164 29 -276 71 262 -360
4355c60N53m06J70k8q3K95K5l34N7P0j52J69J57k33j20J94k8m3J79nJ16j31J69
$$ -360 193 -213 -43 -71 -154 141 166 -168 -111 -41 -193 -24 133 -100 -220 -26 -54 -97 82 77 193 62 231
4378B31k15j39K25N2k79J61k89R2N72m36J42o6k9L7J67j77J24o4k49N51k75k01
$$ 231 16 -123 102 154 -125 36 -253 -161 411 -25 117 51 22 59 226 49 173 109 -140 411 136 -65
4400f5L63l60j67M33m90J48O2n5L68l70J61Jj56M13J11k56n7pm23M44j65P6J04
$$ -65 298 -62 -229 204 -286 -138 -76 -131 237 -133 28 29 -127 286 397 141 84 77 -346 98 -67 9 113
4423A13N1l10R0Q8j1J59J7N0l06K56k62K05j22L63k83l01M12l3n53M38R3j99L35
$$ 113 164 -146 -56 32 21 180 197 247 -59 197 -65 140 18 381 98 -203 209 176 -377 61 154 -45 290
4446B90o74L85J20j95K69m46J24Jj18K50K12l12n7L57l18k8L36m6J46k37j00r9
$$ 290 -384 1 121 -74 195 -251 -127 -126 -244 6 218 -94 -151 206 -112 -140 196 150 296 59 -41 -140
4468a40J12n6K6LJ89o0j16J7K98n07ljM7M03j63J93j22k52K22LJ6N7q8m51M56
$$ -140 -28 -84 -58 -55 134 74 -42 -25 273 -234 -237 -238 -191 212 49 242 120 -132 90 93 109 166 78 -373 83
4493H3k64J9L94n5k29J25l45L93l0k56R0p4J45o1K16k24Pn3k9K53l86K2M37l96
$$ 83 -181 -162 232 177 -52 73 -272 121 91 -165 -75 -149 -4 -65 151 -73 -66 -119 -148 105 -281 -259 178 -218
4517b18L50kk86L77k13J02k61J54Q0n0m9j86K47o6J5k52J03K37m9l5J90o3K2k9
$$ -218 132 130 -156 221 8 110 -151 3 83 33 -16 -202 45 -21 -6 -258 -155 82 33 -2 188 125 147 118
4541A18k23Q2L04k38j18j81J70J97J2m41O70m85JM16n57K61J1o0N8K37m55M80
$$ 118 -105 -23 281 43 -75 -256 -86 111 123 -318 352 -133 -132 284 -273 -12 -1 -61 -3 234 -221 259
4563B59l13K13L5j52r1J39p5J88m7p9o6OP6L3j67P2J68n73L22k35K8L24J68m21
$$ 259 -54 159 194 42 -49 90 15 203 156 77 11 17 93 126 -41 31 199 -374 -52 -287 -259 65 233 -188
4587a88K82l9n1P1l4k46K16n2j07K05j08J43k57l5M20m0l80J26j27J68Oj66L4
$$ -188 94 55 4 75 41 -205 11 -41 -148 57 -51 92 -165 -200 220 180 -200 -74 -201 -33 -27 -193 -159
4610a59L71l14p5K03P9j71J56j44J65l00K14l1j78L96mr8j68Q9q5L4j26M11j61
$$ -159 212 -102 -177 26 105 -66 90 -54 111 -189 25 -6 -184 212 208 110 -58 31 -54 -20 -146 265 104
4633A04J44j56jk06J76N8l93K70J73l90M86l45o2N28n47M13m1l86J24J20k08L85
$$ 104 248 92 91 -115 61 119 -274 -4 169 -221 265 -80 -142 386 -161 252 211 -175 -51 69 -139 246
4655B46O1m56rK47l4L73n76J78L46k63n3J79j30j51J13o0K17m78K79J4K4l37M08
$$ 246 307 -149 -158 89 55 428 -148 30 376 113 60 239 109 -42 71 11 228 -250 29 43 67 -270 138
4678A38l33l1M51l69J72mm8L0K13l57K51l8n45O10m36K97Q8o5J35k91k34K39J52
$$ 138 -195 -226 225 -144 28 24 -24 6 219 -138 113 75 -470 140 -296 1 89 24 159 -132 -366 -127 25
4701B5k17J27J18m9n4n9O9L51m43o8K99k83K25k03PK6J80O8J16k10N6Q0l87J86
$$ 25 -192 -65 53 4 -50 -109 -40 311 -132 -200 99 -184 41 -162 -155 -129 51 119 235 25 81 161 -226 -40
4725d0J2p2M4R5j00J62o7M3o6j69O6Q8K1r8J47j48K13l74J3L04q4p1L55n14K73
$$ -40 -28 -100 -56 39 -61 101 34 77 11 -158 -92 -4 17 -81 66 -82 131 -243 -230 74 -10 -81 274 -240 33
4750C3J72m82M46o3j56L30m84P9L49j98N3j15j01K37R8j92j4L2o9J33L5k83J38
$$ 33 205 -277 169 106 -50 280 -204 -125 224 26 79 -36 -137 100 198 6 -8 24 -45 88 123 -160 -22
4773b2j7j30J61l1p0j2j82K84k31J94R1m1p0L15l00n6Q3k22J26J64j39K53o6q1
$$ -22 -39 -169 -8 -39 -109 -121 -303 -19 -250 -56 35 -6 -76 239 -61 -117 -34 -256 -130 34 -105 148 82 1
4797AJ60l6k42L25l71J69K03j83j63K19j09n8l3J64q8j9j16K42j5j21K0K56l49
$$ 1 161 125 -117 208 -163 6 209 26 -137 82 -27 -85 -118 46 -42 -61 -177 65 50 -71 -51 205 -144
4820a44L86j51K56k73j86J15j31r2L9J80o4J18k4j26J67l05J86qn8J33m3k3r4
$$ -144 242 91 347 74 -112 3 -128 -220 -181 -1 -65 53 29 -97 70 -235 -49 -57 -115 18 -25 -48 -142
4843a42p7K44J68m52K05K28j59KR0j65L21l13J02j93J93l9j04p9J45N1l47J46
$$ -142 -219 25 193 -259 -54 174 15 17 107 -58 263 -50 52 -141 52 13 -91 -170 -25 26 -321 -175
4865a75J69l53O04k68j28K4K38l20J05k28M93P7m62K51j6l1K3M2j98K19j78K69
$$ -175 -6 -359 245 -23 -151 -127 111 -209 -104 -332 161 238 -224 27 11 -20 3 45 -153 66 -112 157
4887A57j31j12L23l11Q0j24J65K2R5J52l59K28k54J05J17k35K25k08O0J1Kk12
$$ 157 26 -86 237 -74 6 -118 47 69 164 316 -43 185 -69 36 153 -82 143 -65 -5 6 8 -204
4909b04M53k16j11J55j56K90l49jj4k7R8J96o6M4j70R4k30J73J73j11K43l95Q2
$$ -204 249 33 -78 77 -79 211 -138 -139 -153 -180 -82 114 48 92 -78 16 -214 -41 132 21 264 -131 -49
4932d9J46l7K3O1j1k6j32M2j70K54j69Q4J90k38j51J59R4n3J31j26l8k53M24k53
$$ -49 97 60 83 144 133 107 -25 17 -153 101 -68 16 206 -32 -183 -24 70 17 148 22 -16 -269 155 -98
4956i8P6lk76K44K4M2o8J42j44K72l63MO1q2K77l3l63K48J62k82M85k65k78J87
$$ -98 -22 -25 -301 -57 -33 9 -59 83 -61 211 -152 -148 -87 -169 108 75 -288 -40 122 -160 325 60 -218 -31
4980c1LJ34o1r5j00J62r8K88p7l81M84m31J63M8L0k6J23m08K93M4r8K6J66k19
$$ -31 -28 106 45 -50 -150 12 -86 202 125 -256 228 -203 -40 8 38 12 135 -273 20 64 -34 -8 158 -61
5004f1kJ44j48L3kJ36J50n39K63qK59j15J47l25P3K74o29O64l78k36L18K05m25
$$ -61 -63 81 -67 -34 -36 100 250 -289 -26 -34 225 110 257 -68 5 279 -350 314 -64 -300 18 223 -202
5027b02J43L1j52J54k52K18o5j63L55j63J73j84nL6k2J75l27P3M0o7P6J22Q7j93
$$ -202 -59 -28 -180 -26 -278 -60 -125 -288 67 -96 77 -107 -112 -76 -98 77 -250 -177 -137 -204 -128 -6 81 -112
5051a12J95K36n01K31K51l98J6J80k70K01J49l11L25j69l93M83J9j42K4K17l01
$$ -112 83 319 -182 49 300 -98 -82 98 -172 29 178 -133 192 23 -370 113 132 -10 14 231 -70
5072g0J73mJ06L2l52K09j64l1K84n53L47K57k84J41J7k61J82j27%J28j18J87K2
$$ -70 103 99 205 237 -115 94 -70 -101 183 -370 -23 234 -50 91 108 -153 29 -98 -98 30 -88 99 121
5095A21k33P3K43k30J35l19K51J47k15p1K43j17k54L15k07L43N9l42J15J4j82
$$ 121 -112 -39 204 -26 109 -210 41 188 -27 -98 145 28 -226 89 -118 225 284 -58 57 71 -111
5116a11J84R5r5k4L8q8L42n53K83j85j96K43J58l0J92l77k27N30k20o4J48j84
$$ -111 73 168 73 49 87 -1 341 -212 71 -114 -310 -67 91 61 253 -124 -351 179 -41 -105 43 -141
5138a41L74m68J0K68o5k85L18q6J27m4p0n0K12j6j50M7j19l3L19l73M98k86pR6
$$ -141 233 -235 -225 43 -22 -307 11 -75 52 8 -62 -112 100 84 -66 -19 -138 -171 148 -225 273 -13 -20 76
5162G6k81N6K79q8N8Kk91K73j3k08L84o8j57L38l73k49J93k25K27K02m47L37l41
$$ 76 -205 -149 130 42 100 102 -189 84 71 -137 247 179 22 360 -13 -262 -69 -294 -67 135 -312 25 -316
5185c16R7M00j63o2%Q3j19j5Q4p4j38L25R9l07K66m9l01JK22m8J17n9M2o3J2j41
$$ -316 -219 181 18 -44 -44 39 -80 -95 -11 -85 -223 102 201 -106 160 111 -190 -189 33 -15 102 43 85 22 34 -107
5211a07P4K0k60K21J20l69J53r9L33l5k38J36J97n16M46l06J24L26l68J22J2L71
$$ -107 -33 -13 -273 -52 68 -301 -148 -247 86 51 -187 -51 146 -370 76 -230 -106 220 -148 -26 -14 357
5233C57l53J05l42M30l7l21L04K0p9J04k12J22o1k39K62o6k80M00k44j13J24O0
$$ 357 4 109 -233 197 160 -161 143 163 84 188 -24 98 37 -202 60 -6 -286 114 -130 -243 -119 -59
5255e9r0L08K1l40M05l84L5J59k83L92j44J62l40L0o6L47k75O6K03k28J6L01o03
$$ -59 -149 159 180 -160 245 -139 -104 55 -228 164 20 182 -158 -128 -194 153 -122 -56 147 -81 -65 236 -367
5278c67M63j6k94K05L3K6J08l3M6j53l1j37J79p6J25k86J56J76K5m05M49k89m6
$$ -367 96 80 -214 -9 24 50 158 125 171 18 -13 -150 29 -47 78 -208 -52 124 149 -256 193 -96 -142
5301a42K70q9j18K62n65J58J90K67k70j30p8K76k58J25L58m50LJ56j03R6J08j19
$$ -142 128 39 -79 183 -382 -224 -34 233 -37 -167 -245 31 -227 -102 256 -194 -191 -35 -138 -42 66 -53
5323e3K53j85n8m3o0J75o5M1k4J70k93J98J88m93L45n5j82K67m20L38L56l86k19
$$ -53 200 15 -43 -86 -146 29 -36 5 -19 151 -142 56 244 -249 96 41 -141 126 -294 44 400 14 -205
5346b05M09m32M24j59l14M14l16Q7O5ro4J39j77K82N1l91N67m31k61P14m41j00
$$ -205 204 -228 196 37 -277 137 -179 -92 -27 -36 -100 39 -138 144 195 -196 371 -60 -321 393 -48 -148
5368a48J32K6mL57j54q9K3m01M55j33J13K23o07K07n4j77K61J7l54J55J32q7L05
$$ -148 -16 10 6 363 209 120 143 -258 197 64 177 400 -207 0 -54 -231 30 47 -307 -152 -20 -107 198
5391A98J78m02Kk0j30L75l13o5M38m43L77J7k02j87L13l82L04j69J80K35k37K84
$$ 198 376 -26 -24 -44 -174 201 -112 -177 261 -182 195 212 10 -177 136 -246 58 -111 69 304 67 351
5413C51M2m12O6L1j63J99j90o4J24k12o5M35l32J01L62l73J39o2j19P7K5p7L59
$$ 351 393 -19 47 78 -85 114 -76 -140 -16 -228 -293 142 -190 -89 273 -100 39 -23 -142 -65 -40 -117 242
5436B42l65J63K64k89j04J19l17N98l15N5j14j4j68P9J81L8K43m09o0M16l58n3
$$ 242 -123 40 304 15 -89 30 -287 311 -4 51 -63 -77 -245 -166 15 53 296 -113 -173 243 -115 -168
5458a68L11k77K90j36j48K48j57mL76m93n6K78jJ0k27j97L25o9o8L99l98J4L53
$$ -168 143 -134 156 20 -128 120 -37 -41 335 -158 -214 64 63 73 -154 -351 -26 -95 -163 236 -162 -148 205
5481B05j78K37j37m2j7j21N0K49l81n2J26q3J67N8m81N80m46K45L67k02l15L11
$$ 205 27 264 127 85 68 -53 -3 246 -135 -187 -61 -144 23 81 -400 180 -266 -21 346 144 -171 140
5503A40k69K94R3l40q7K20l39K67n0m0M17j89k19N9R1j12K44j47L8J91l21R2L3
$$ 140 -129 165 258 -82 -169 51 -288 -21 -71 -111 306 117 -102 -43 48 -64 180 33 71 262 -59 33 66
5526F6j64K34n3k65M16n59J05L18m58J54N56m99J83L33n90M21k43j02L45j95j7
$$ 66 -98 136 83 -182 234 -325 -220 98 -360 -206 350 -149 34 367 -223 198 -45 -147 198 3 -14
5547a4R0o4j66K00J50l69p7N2K83p2l84N91L2k90L02m20M6K80k77J12j99r0M55
$$ -14 76 12 -154 46 196 -173 -250 -198 85 13 -371 220 252 -38 264 -156 -110 170 -107 5 -194 -284 171
5570A71j26k07M83l03o0K19m89pM86l67J92l37J16L54j08k31J46N5l24L92j34
$$ 171 45 -162 321 18 -42 177 -312 -319 167 -200 -8 -345 -229 125 17 -214 -68 -13 -337 55 -79
5591g9l8N86o57N9J99j00K37l88J24p7J68k08K61j60O0n1j51k8K10J27j43J98
$$ -79 -117 469 -188 -129 70 -30 207 -181 -57 -134 34 -174 87 -73 -13 -64 -215 -243 -33 94 -49 149
5613A49l81L34l78k8M90l77J12P3pp6J12j68K83l12P3K94j87K45p3l31J14K93
$$ 149 -232 102 -276 -304 186 -191 -79 -6 -13 -89 23 -145 138 -174 -101 193 6 251 178 -153 -39 254
5635B54m47L79k16j87L15k00j24M63l18J1K56l84K93N5k73L64M7k32K41o00J70
$$ 254 -193 186 -30 -217 98 -102 -226 237 -81 -70 186 -198 95 150 -123 241 288 56 297 -303 -133
5656a33M37k26j00K50m99O6L44l29L41J09o79M36j73j79K34j19J82K15k19J45
$$ -133 304 78 -22 228 -271 -205 139 -190 151 260 -419 17 -156 -335 -101 -220 -38 177 -42 103
5676A03J3l14K63k56j92N04k55J61J67l14N6K97j74j0N1l88RJ69L24J3p8p8L00
$$ 103 116 -198 65 -191 -383 121 -134 27 194 -120 -64 233 59 49 100 -288 -279 -110 214 227 149 71 371
5699C71k25l22K69l31K18J90j00K37m12P7K01j27J1K52n13N8J48j39LM6n7K62
$$ 371 146 -176 93 -238 -20 170 70 307 -105 -28 173 46 57 309 -204 -146 2 -137 -134 -88 -145 117
5721A17j88j15R2K3k68M82m27J82K14m11M76Jl00N40k30k99K80n63L45K25m81
$$ 117 -71 -186 -94 -71 -339 143 -284 -102 112 -299 177 178 -122 418 188 -111 169 -394 -49 176 -305
5742c05L34J62l44K62k1n02O13l38j65L71j39J98P8k26R4j12l08L78J4k97L92
$$ -305 29 191 -153 109 88 -414 199 -139 -304 67 -72 126 204 -22 72 -40 -348 30 44 -253 139
5763A39L7n19O25l89P8J10k08L47r7j87L76n87J16M99l63j83K84N8j02P7k78M9
$$ 139 176 -343 282 -107 -29 81 -127 220 123 -64 312 -275 -159 340 -23 -206 78 136 34 111 -167 -118
5785a18K61k55M04k23k36J37j31j75N99r9l12L31m49J57L13k31J74k8n05O59m75
$$ -118 143 -112 292 69 -167 -30 -161 -336 263 164 -148 183 -266 -109 204 -27 147 119 -386 273 -202
5806b02O7J37K38l25K94k65K26k3m38M75j36j5Q3L4k88K49j10q4J17k66L24J92
$$ -202 -135 2 240 -85 209 -56 170 147 -291 184 48 33 116 150 -138 111 1 -83 34 -232 92 284
5828B84k42j5J59n37N50j80k19N29m58J27N7l18L58N3k99K65J06k77L60k03j29
$$ 284 42 27 186 -351 199 19 -200 329 -129 -2 55 -263 95 148 -151 114 220 -57 303 100 -29
5849b9r1j09K23K20m48L44j43K77j36l65j9N53j32j22N3r0J99l19K09PR5k89L39
$$ -29 -120 -229 -6 214 -234 110 -33 244 108 -257 -276 277 145 23 76 -14 185 -134 75 82 177 -112 227
5872B27Q7l15J22j34j51K87l03o8J59OJ42K4k13N66k13k86J14q2q1N31o08K50
$$ 227 314 -1 121 -13 -164 123 -180 -248 -89 -83 59 83 -130 436 223 -63 51 -31 -112 419 -189 61
5894F1Q2j87lK00l04J79J6l2R9L5l35K90j52N9K73m26L92m09j6L31k30J40Pm54
$$ 61 143 -44 -47 153 -151 28 44 12 111 146 -189 101 -51 8 281 -145 247 -162 -178 153 -77 63 70 -384
5918c84L49K74r6Jr6M5J77K26p21M51k65k4L01k97N9K17l19kM05l23J45L14n33
$$ -384 -35 239 143 144 48 93 270 496 -225 226 -39 -63 238 -59 0 217 -102 -104 301 -22 123 437 -96
5941i6L30j74k86K06oN9L75p66L85Q8m9K0L4k94N63k14j32P8k92J08L48m93L46
$$ -96 234 60 -226 -20 -26 33 408 -358 27 115 66 86 120 -174 389 175 43 121 -171 -63 285 -208 138
5964A38j30j48J60Q6k56J21J24j61L39m38K2L54k65RK86m09L44l22K03r4M09l99
$$ 138 8 -140 20 106 -150 -29 95 -66 273 -165 -143 211 -54 -45 241 -168 176 -146 57 -37 372 -27
5986b7J21j66r1M54k48P7J18m27K69k47J96j92J8M68k15j3j83K59l88M20j52m93
$$ -27 94 -72 -163 291 43 120 238 -189 80 -167 29 -163 -145 323 108 95 -88 171 -217 203 51 -442
6008d42M33j98R9J38k5j09L24l77j25L38k60L71j74k14N09k30l3K67m09J14J58
$$ -442 -9 -207 -108 30 5 -104 220 -157 -282 56 -204 167 -7 -221 288 58 25 292 -117 -3 155
6029A55m06K39J79l65N15k54k00K52k71J3M53m87O1K86o1j01K49m16L24k3l66
$$ 155 -251 -12 167 -198 317 63 -137 115 -156 -143 310 -177 -116 170 109 8 257 -159 165 142 -224
6050b24M21l67J14J11j91J47L34m44K43j14j24J12p6o6L23j53k16M07k69j1R5
$$ -224 197 -170 -56 55 -136 11 345 -99 144 30 -94 18 -58 -124 199 46 -170 237 -32 -43 52
6071E2k79K16J62l98M21j45k09L63k31o2L87k14j60N97m89J73j09O3k70L41l08
$$ 52 -227 -11 151 -247 174 29 -180 183 -48 -110 277 63 -97 500 11 184 75 138 -132 209 -99
6092i9J56P1l12L09j00M7o1J28l90N14l92R2m6j42M55k18k17N03n02K59j70J76
$$ -99 57 128 -184 125 25 72 11 139 -251 263 -129 -37 -83 -225 230 12 -205 298 -204 55 -115 61
6114F1n0M9j23O3k3m19L84J5q4K34n48K85J19k27K65N4j16K11J22l39J97Qk7j22
$$ 61 11 60 -63 0 -23 -442 -58 -43 -127 107 -441 -156 -37 -264 1 55 -61 150 272 -67 130 138 111 -11
6138a1J4qL57n40J56Q7l19K53o5o4K80k90nL12m50K97m7j35K23K51j24K1p9l32
$$ -11 3 -5 352 -188 -32 55 -264 -11 -76 -140 140 -150 -155 157 -293 4 -43 -178 45 296 172 193 114 -218
6162b18M75m58m1L08j83J98J80m32J80k06o3N70m15K0N01m64L06j99l79L48J75
$$ -218 257 -201 -242 66 -117 81 261 -171 9 -197 -260 310 -105 -85 416 -48 258 59 -320 28 203
6183B03m48K48J78r3r8j07j82K16P1J7o2j15J1L19m00J02K77j99J92l30K85K37
$$ 203 -245 3 181 88 -10 -117 -299 -83 -12 5 -57 -172 -161 158 -242 -140 137 -62 130 -200 85 322
6205C22l66J38j20l67O47k34k03M06j78j27L01l53J14L80o29j1M43m05K09J73
$$ 322 -44 94 -26 -393 254 20 -183 223 45 -82 219 -134 -20 360 -269 -280 163 -242 -33 140
6225A40j00J94Rl25L6k72j60P28k95j82M30o82L96JJ69j26j27j32M10j53J9J48
$$ 140 40 234 243 -82 -46 -318 -478 250 -45 -227 203 -479 -83 -82 87 -39 -166 -298 112 -41 -22 126
6247A26k26J4K36k97K15L60p79N21M3k52J63k93r4L76n09K29L57r5k19Q7j41L48
$$ 126 -100 -86 150 -147 68 428 -351 170 213 -39 124 -169 -263 113 -396 -167 190 95 -124 -37 -178 170
6269A70q9k81L46l75K06J93l01P7L23k80J24j24O8J04k91J81J21m40N27K0l38
$$ 170 81 -200 146 -229 -23 170 -131 -54 269 -11 113 -11 57 161 -130 51 172 -268 259 279 -59
6290e9O3J28m13L25K81p01M67J02l34J69j46Q8J56j30q6J20k69R2M59o16K83L38
$$ -59 4 132 -281 44 325 -376 91 193 -141 28 -118 -30 126 -4 -90 30 -239 -147 312 -304 -21 317
6312C17n49J87K6q6L56m76R5J7j26J69J38l70M32J0o8J8l48P1M02k21K35O1m71
$$ 317 -232 -45 -19 -105 251 -225 -130 -113 -239 -70 68 -302 130 140 72 90 -258 -187 215 -6 229 290 -181
6335a81M78j86j99L20k06l18O68l84l5J24k07K3K06l68K26Qj77M16n7l28K36l65
$$ -181 297 111 -88 232 26 -292 376 -8 -43 81 -126 -103 103 -265 -39 -31 -208 208 151 -177 59 -306
6357c06K25L14l69J81L13m24L9j3m57O67k18k56N16l87J2K07l64L9L74Qq4q7j46
$$ -306 -81 233 -136 45 358 -66 -27 -40 -497 170 -48 -304 212 -175 -163 44 -320 -281 93 101 17 -70 -216
6380b16L89k54j54L60j08j42M97n10J42J05k12K75l15O5J00k1K98l77q7L21o0
$$ -216 173 -81 -235 125 17 -125 372 -138 4 109 -103 172 -143 -78 22 1 299 -78 -165 156 96
6401I6j40J10p2qJ75j84Op9j34K89N7r3o0K38m47K99N9j65O7J46m79L62%k15L13
$$ 96 -44 66 -6 -14 161 -23 -17 -96 -230 59 116 23 -37 201 -246 53 112 -53 14 160 -319 43 43 -172 141
6426A41k51R2J67n31O90j84l68R4J89k83L22j26J24J62k93J76N5k77J58J35m82
$$ 141 -110 -18 149 -382 308 124 -244 -150 39 -244 78 -48 76 238 -55 121 176 -101 57 192 -290
6447b90L20l5j64K34j3j04K60j28n4r3k43M73n6l87M56l05J51J65l38R7L36n65
$$ -290 30 -5 -169 65 52 -52 208 80 26 -67 -310 163 107 -280 176 -129 22 187 -151 -54 282 -283
6469b83N16j89qL7K94o64M42j18k00M29l55k02N03j40l1J16k45L72J28o11K60
$$ -283 233 44 36 73 367 -297 145 27 -173 256 -99 -301 202 62 31 147 -98 274 402 -209 51
6490E1n4k95O10n70J01K22k63L13J36m41O17l71k95M63l86O5j8l1K82k0k99N39
$$ 51 -3 -298 312 -258 -157 65 -198 115 251 -190 427 56 -239 224 -162 -97 -115 -146 136 116 -183 356
6512C56k12k27J36J45l78L12l10L66q8l12K03K00j83JK24m11K45j28JL00p8k69
$$ 356 144 -83 53 198 -180 132 -178 188 100 -212 -9 191 8 9 233 -178 67 -61 -60 240 162 -107
6534a07M27q9n22M24k03J6j57L54M5k02l71O21k01k5L59m45j60M11j87N9j74o6
$$ -107 320 231 -291 133 -70 -54 -211 143 188 -14 -385 236 35 10 369 -76 -236 175 -12 47 -127 -193
6556a93J21K33k79K50k06j44M85l55K80l57K05j9K06l91K46j80l3N51n03mK72
$$ -193 -72 161 -118 132 -74 -218 267 -88 192 -165 40 21 227 -164 82 -98 -131 420 -83 -87 185
6577A85l36R2J75j18J55M7l25J70K14m69M87l44lK87m85K43q1J36J30l29O7J96
$$ 185 -151 -59 116 -2 153 200 -125 45 259 -210 277 -67 -70 217 -268 -25 -106 30 160 -169 -102 94
6599I4o5j74M02l05j22K84k76K93j03k25jL86k78J32n9k34M30l92J1O61p98M75
$$ 94 29 -145 257 -48 -170 114 -162 131 28 -197 -198 188 -90 42 -17 -251 179 -213 -202 459 -339 136
6621A36R0l89M09l72J49K20l84j21N46k20k44K20n6J53K14p73N29j5m98N54j79
$$ 136 226 -163 246 -126 23 243 -141 -262 284 64 -180 40 -16 137 351 -422 107 92 -406 148 -31
6642c1j33L77k79k0L01m33r0L59l40O97n78J80J86j04j27K87%k47k2j8R4O0n41
$$ -31 -164 213 -66 -86 215 -218 -308 51 -289 408 -170 10 196 92 -35 252 252 5 -17 -35 59 119 -422
6665d22M50j29m4M37k80k33O13l67K0K51m13L38k15k10L81k92l2K63k0j76J24
$$ -422 28 -101 -145 292 12 -221 392 25 45 296 -117 221 6 -204 177 -115 -147 116 96 -80 44
6686D4l65Q8N7k07O25n03J48L60l09K27l1j22k8L7k8r0jK3K72o9k82L40j33k72
$$ 44 -321 -233 -176 -383 242 -261 -113 247 -62 165 134 12 -16 21 -7 -97 -98 -75 197 128 -154 186 53 -219
6710b19M76k55k89L46l25k2O33o48M27N7k71J96nl65L23k12J51J54m10J93J16
$$ -219 257 2 -287 59 -266 -288 345 -303 124 181 -90 106 101 -264 59 -153 -2 152 -258 -65 51
6731E1k61K64K4j21J00k35M1K88l6j18J12k91L23R6o03K72J88l00M04k62j2J44
$$ 51 -210 54 78 -43 57 -178 -137 151 115 -3 109 -182 141 237 -366 -94 94 -206 198 -64 -76 68
6753F8k36L37J44m57J74O9l58K41J58m81K92k07j15P05k28l94N71m57L5L00m34
$$ 68 -168 169 313 -144 30 99 -259 -18 140 -341 -49 -256 -371 334 106 -288 283 -174 -139 161 -273
6774b73N17j23k99M78k96k28M43l52L60k88pP5L76n21K51L7l46K89q1k36K80K5
$$ -273 244 121 -178 300 4 -224 219 -133 227 -61 -68 7 383 -138 113 150 -196 93 12 -224 56 81
6796H1k38J51N2j9Q9j14O0k2j17K31pk13n6J45m6K37l51L40k58l6J94j60j33L92
$$ 81 -157 -6 46 27 116 2 62 40 -77 154 147 -66 -122 23 -23 214 -137 203 -55 -91 103 -57 -190 202
6820B02j2k11q3J1p6K83q9J12K68m64L90m54N1J38j2j33K63m94J91K54r0lj57
$$ 202 190 -21 -104 -93 -169 114 25 137 405 -59 331 -123 -72 66 54 -79 184 -310 -119 135 45 42 -115
6843a15O2L69j17m12L01k23M0J87j01O1K20n69O09l09l2L0L8q3L18m99J16L09
$$ -115 -53 316 199 -213 88 -135 -95 92 -9 52 272 -297 312 3 -29 1 39 -44 274 -225 -109 200
6865B00j59k79L12k22l0L68n01M02j00k18J9kK66K4l27J14J82k27M5J13j70L44
$$ 200 41 -238 74 -148 -178 190 -311 91 -9 -227 -208 -210 56 80 -247 -133 49 -178 -133 -20 -190 154
6887A54j40J59J63o68L91J55m31L54j21k44L32L19o45J85j14j12M81k99j12M88
$$ 154 14 173 336 -332 59 214 -217 137 16 -228 104 423 -222 -37 -151 -263 218 -81 -193 295
6907B95k46j08L47p35N38p0k66K22k00N8J04K95j71p8o6J7L30n38L52k44j19M06
$$ 295 49 -59 288 -447 91 21 -245 -23 -223 -165 -61 234 63 -15 -81 -64 266 -272 80 -164 -283 123
6929A23R8m02J95K5j25L58k88Q8O2l01R1k9j63O59k90k81K03n5l13M67j8O1J7
$$ 123 221 -181 14 39 -86 272 -16 72 134 -167 -76 -105 -268 391 101 -180 23 -32 -345 122 104 165 182
6952A82j60K35j71n03O96k92Q3O6k35K04J00l13L34j33l69M32l33j61N30j25k42
$$ 182 22 257 86 -417 279 -13 70 136 -99 105 205 -108 226 93 -276 156 -177 -338 192 67 -175
6973a75K83k56M01k34l88M53k27J71J09J5q7K74l72j48L65l29o2K41J20j29Q6
$$ -175 108 -148 253 19 -369 84 -143 28 137 152 65 339 -33 -181 184 -145 -207 34 154 25 111
6994A11l26M00k83j99N97l88nN8k57M65n3l37Q0M64l93J36M3k65L98j80j21J7
$$ 111 -215 185 -98 -297 300 -88 -93 -35 -292 173 120 -217 -137 327 -66 70 113 -152 246 66 -55 -38
7016c8J42K2L8k96M1K84o41M47j2J14l9n1j20K5p5K96q3r8M1N9m8M7r0n4L53l30
$$ -38 104 126 164 -132 -91 193 -448 -1 -13 101 62 11 -109 -84 -159 137 54 -44 -3 56 8 55 -35 -89 264 -66
7042f6o9J45r3O3k41L21JL42k56K7n9k63K99k81M3K37j80L27Q5p10L50p9j41L15
$$ -66 -135 10 -83 -20 -261 60 61 403 147 174 115 -148 151 -130 -87 150 -30 297 382 -328 22 -57 -198 117
7066A17k17j60M50n38L77k2p5m8L82k79Q2J14o01P66j86n2j55j49K42J32l02J92
$$ 117 -100 -260 190 -348 29 7 -68 -116 266 -13 69 183 -418 348 162 110 -45 -194 48 180 -122 70
7088G0JkK0O4k96L32r7j41J51k84J05N8m3J2R5l75L86q8j08J17j32p2K77Q5k30
$$ 70 71 69 89 153 -143 189 92 -49 102 -182 -77 -19 -62 -50 45 -330 56 -32 -140 -23 -155 -227 50 135 -95
7113i5J75l05J92M12l64L0K22k10j54K86n68L98j39K47j83j24Q5P6L4M3P6m39
$$ -95 80 -225 -33 379 15 45 267 57 -97 189 -379 19 -120 127 -56 -180 -95 -19 15 58 134 -305
7135c05M20k90J72l6p4OQ4L53q5j33r7p6k2j60N83m99J04J42n49L50L40k74K2
$$ -305 115 -175 -3 -39 -113 -107 -23 330 245 112 15 -61 -83 -243 340 -159 -55 87 -462 -112 228 -46 -24
7158b4J22k90N14m9o00N54k02j42K97j58k9J6k24K83M7nr2K08l08K48n7j00j11
$$ -24 98 -192 322 273 -327 227 25 -117 180 22 -7 9 -215 68 115 110 18 226 -82 166 109 9 -102
7181a02J28N8L15m86J67k38N9K13k16rM97m02j62K92j75L15p0p02M67pk88M28
$$ -102 26 84 399 -87 80 -158 -99 114 -102 -111 386 -16 -178 114 -61 254 184 -518 -51 -58 -346 82
7203H2j75l34R91m12j80K3l6n3J32m7k0K83l21R0k6R7J02m53J10J80p5J43k35
$$ 82 -93 -427 564 152 -28 -5 -41 -94 38 -9 -29 254 -67 23 -3 94 196 -257 -147 33 -42 101 -134
7226a34o5M98m89L04K4l37L66rJ00j96j16m1J75J55k17k72M40m26M22k31j61M05
$$ -134 -199 299 -190 114 138 -199 167 158 258 62 -54 -95 80 235 18 -254 186 -240 182 -49 -210 195
7248A95j0l23M19m11K80P0k31j89J58m9l2K26j15L86m02L06j54j97O0j76j76L64
$$ 195 185 -138 281 -130 150 220 -11 -200 -42 -91 -123 103 -12 374 -28 278 124 -73 -13 -189 -365 -1
7270akl44N83j60k03L34l26j70J25O1J77J30k38J88j48Qj9r6N6k41J27j6p5J28
$$ -1 -3 -347 236 76 -127 207 -119 -289 -164 -103 74 204 -34 154 6 14 -5 -101 -45 -286 -159 -175 -250 -122
7294a22L12l19K53J64k31j12L18l95J99O1l99L11P8k28J60k96N8J71M4k81O55
$$ -122 190 -129 124 288 57 -55 263 -132 67 128 -271 40 118 -110 50 -246 -188 -17 27 -254 401
7315D01l08k52M86p68L57M13m55K14m04K00L95m62J23J19J1j85K75j03j35K48
$$ 401 93 -159 327 -441 -84 329 -126 88 -316 -116 279 -183 -60 59 70 -115 160 57 -78 170
7335A70L3j78r5l30N36j15j28N83p88J98K40k96L60kn59N94m35J00J28J73m12
$$ 170 203 25 -70 -400 136 21 -107 476 -312 -114 126 -170 190 188 -371 223 -212 -112 16 189 -223
7356b23L93m56J19J70k99L88On22N48k7j83K49j60o2K74k33J0l9N7J36j66k74
$$ -223 170 -286 -167 3 -296 92 98 -424 124 97 -86 163 3 -59 215 -18 -8 -47 10 146 -20 -294
7378b94J06K02n82R78o54J91J57o1j47J98k59K82ll46L38j51j83K97r8P9q5j20
$$ -294 -188 14 -568 410 -244 -53 104 43 -104 94 -165 117 114 -232 106 -45 -228 69 -29 50 -35 -155
7400a55K36J83l03K62k51j61M67j87k91M37k23Q6j38K1j3N4n9K81r2l93K63j16
$$ -155 81 264 -39 223 -28 -189 278 91 -200 237 14 100 -38 -17 -30 24 -35 246 154 -239 24 -92
7422i2M6j39J26l7j89J34J03Q6k31p1K97l02N89l74j20l0j8K50J9k49K64l8j96
$$ -92 -46 -185 -59 -96 -285 -151 -48 38 -193 -264 33 -269 320 -54 -174 -204 -222 28 47 -202 62 24 -172
7445a72L22j30j83K07M0j12K23m22J45L49j66m26M09l59M20k62N9j4L44l46L47
$$ -172 150 20 -163 44 84 -28 195 -227 -82 267 101 -325 84 -275 145 -117 -58 -72 272 -74 273
7466B73m6k11k77J33R6K00l64J26Rn9L96j71l42L61j13JK90l02N5K13l67J81N9
$$ 273 227 16 -261 -128 -32 168 -196 -70 -61 -120 276 105 -237 124 11 12 302 0 55 268 -99 82 141
7489A41r3m4P5k25J61J26m82N76j60j8k0J21l0l15j55M91J06j49k63k1K97r0j91
$$ 141 48 4 79 -146 15 141 -341 235 75 57 37 158 128 -187 -342 149 255 106 -157 -178 119 29 -162
7512a62L01m0n6J85k40m74O53j90K7j8O5j28L60k16J95k27k67M18J56l54J72j26
$$ -162 139 99 43 228 -12 -486 167 -23 4 -14 51 -77 283 67 262 35 -232 186 342 -12 160 34
7534C4m6p2k01M79k06MK56k08r1O0J4j65K31l34K4J63no0L25k31J86l76R9J49
$$ 34 -12 -84 -285 194 -12 -8 248 40 -51 9 23 -142 89 -245 -221 -58 -63 -123 202 -29 157 -219 -120 29
7558B9l7j02L49k46j42O04m13j80J45n5J22m3k96M83k2m40J08J98j39R3k38J99
$$ 29 -8 -110 239 -7 -149 455 42 -138 7 -48 74 31 -265 218 196 -244 -136 62 -77 16 -222 -23
7580b3L1k36M69k95k60M31K79l49K07m45k03M25l67M66j96K09l8n4l05O01l12
$$ -23 8 -228 241 -54 -314 117 396 47 254 -191 -394 31 -336 130 -66 143 105 51 -254 347 35
7601C5k05M05k01r5M00l78k1J42k61L61j08k75M27k26P5J75k70k3K32l84n5K83
$$ 35 -170 235 34 -61 339 -39 -60 82 -179 182 74 -201 226 0 75 250 -20 -43 189 -195 -250 33
7623C3m06O50k98j29L62n4n71O10j7l03M72j43j0k48j4L23j85k4L15j64k98m4
$$ 33 -373 277 -21 -150 212 158 -413 197 180 -123 349 206 196 -52 -66 257 72 48 363 199 -99 -143
7645a43K22n68O50k1o6k19L40l5M5n01K02J68p0J80l26K47O6P6k91K25k82k00
$$ -143 79 -489 161 140 74 -145 195 160 205 -296 -94 74 4 184 -142 105 171 247 -44 181 -101 -301
7667c01J61o5K34j90J52K33k97q2J6k3L83m4l39L12l66K7M17k04j84K29k92L19
$$ -301 -140 -205 29 -161 -9 224 -73 -155 -139 -162 221 177 -162 150 -216 -189 228 24 -160 69 -223 96
7689I6j46k3P4J93l76J13J18j14N5K99k60J71n10L88K72k40r7L24l58K18j32p7
$$ 96 -50 -73 1 194 -182 -69 49 -65 -10 289 29 200 -310 78 350 110 13 337 -21 197 65 -12
7711a2o6q8J98Jl09L52k04J97q2q5J53k21l7J5n0R0L4K61O0n8j45k02K37N2o5
$$ -12 -78 -166 32 33 -276 76 -128 69 -13 -98 55 -166 -203 -188 -238 -148 -114 147 207 149 4 -198 39 91 26
7736B6L54j99l61M43j62O1mn61M33K44k26L1J62k10j0m2q3K55k11l0K36l16J09
$$ 26 380 181 -180 263 101 162 158 -403 30 274 48 79 241 31 21 -21 -104 151 -60 -90 146 -170 -61
7759f1L76o05M43o6k65K74M3k80J08j20rK38j36J61j42J05j22R2l4Q0m38L41p8
$$ -61 315 -290 153 87 -178 96 139 -141 -33 -153 -162 76 -60 101 -41 64 -58 34 0 80 -358 -17 -95
7782i5r9K01J19m20K94J92l26K92n1J2j7j00L9O0k32K46Q5j58m6m5J22J35j30
$$ -95 -194 7 126 -294 0 192 -134 158 107 119 102 2 41 101 -131 115 200 42 -4 -49 73 208 78
7805G8J35J68o08J11Q2Q7r4J96k54K69R1k23j1L2r4o5j00J64M1o6K46ll57R2J2
$$ 78 213 381 -227 -116 -34 53 -41 155 -99 170 261 38 27 59 -35 -100 -200 -36 5 -61 185 182 -175 -83 -71
7830g1k64J48J91q7J92j65j98M24k58L08r1l99M26q1k35L07J21l55M44p17M75
$$ -71 -335 -187 4 -83 109 -56 -254 170 -88 220 129 -270 156 75 -160 147 268 -87 357 -360 115
7851A15K54p47N27K27j59Q6N8o19M65k45l05M45l5j35K07k16r0J65m8K4J51k88
$$ 115 369 -378 149 376 217 303 361 -258 207 -38 -343 102 67 -68 139 -77 -167 -2 -50 -26 125 -163
7873a63J92j43J77K32m40J69N7k24K33R3j98Q3j15j9J63j87l70M94%k71J18q2
$$ -163 29 -114 63 295 -145 24 81 -143 90 183 -15 68 -47 -66 97 -90 -460 34 34 -237 -119 -201
7895b01K26l4j71J21O0j88N14n12j43K56N2j92P3k4L2N13l87Rq6j25L94j20J85
$$ -201 25 -9 -180 -59 1 -187 327 -185 -328 -72 -20 -212 -139 -163 -131 382 -5 4 -82 -207 187 67 252
7918B52k58K02k94J65K51k35J58j80k7j30o7K66l76N4J37q9L09k53q5K18J09j02
$$ 252 -6 196 -98 67 318 83 241 61 34 -96 -163 103 -273 -219 -82 -171 138 -115 -200 18 127 25
7940B5P7J89l16o6J60k6l8J4NJ15m4k45L03l93J56N4J5j59M78m33L43l07J7q4
$$ 25 102 291 -25 -91 69 43 5 19 24 139 95 -150 153 -240 -84 -30 -15 -174 304 -129 214 -93 -76 -160
7964a60m0J34l7k23K22K2J06N1n15M31K06l76P9J36j05J67j43j65J19O3m02L94
$$ -160 -200 -66 -103 -326 -104 -82 24 75 -440 -9 197 -179 -100 36 -69 98 -45 -210 -91 -28 -430 -36
7986c6nM7o1l16M22J04j73j0M5l17R5L29k31j46K45N7j24j23N9L76l62M21j62
$$ -36 -41 6 -55 -371 51 155 -18 -28 17 -300 -205 124 -107 -253 -8 49 -75 -198 -139 237 -125 296 134
8009A34k95J49J77l37K21k04J80L6J63j97j28J09O7pk52O50n15n8Q9N7k26M52
$$ 134 -161 -12 165 -172 49 -155 25 61 224 27 -101 8 75 68 -184 466 -49 -107 -18 39 -187 265
8031B65l10pK37k98J68K06l14L12j95j27J41l00M5L93m28K98J69m86O5L74l46
$$ 265 -45 -52 185 -113 55 261 -53 259 64 -63 78 -222 -177 216 -212 86 255 -231 -166 208 -138
8052a38J03R8j42M75m62j6J26j24j14K11no4k10N38j92J00J7p2J0Q0q0j22k0o7
$$ -138 -35 63 -79 396 -66 -82 44 -80 -194 17 12 -52 -262 276 84 184 201 129 139 219 139 17 -3 -70
8076g0J42L0n7j04P2K43j87J85m18J59K67o57M81j24m19L44J76j74J83l6k79J95
$$ -70 72 102 45 -59 13 256 69 254 -164 -5 262 -395 86 -38 -457 -113 63 -111 72 36 -243 -48
8098d8j5J2P2k81L79K9n37L57P3N1Q5q0l08K47q3j05L97m65K14n3l0M3rk33M25
$$ -48 -63 -51 21 -260 119 148 -389 -32 41 92 177 97 -211 36 -47 -152 245 -220 -6 -59 -89 -46 -55 -288 137
8123A37k72k0M99m28oK82n26K4L96l45J58j8J48j39n0p3L05j88O8N20o38pJ0J36
$$ 137 -135 -155 344 -84 -90 192 -334 -310 86 -259 -101 -119 29 -110 -160 -233 72 -116 -48 472 -166 -173 -163 -27
8147b7J40o2j96n6L0K35j5j94l9L76l19K94q9r3l7J06l02K64k57J28Q1j72J45
$$ -27 113 51 -145 -201 -171 64 49 -145 -184 192 -127 167 78 -15 -52 54 -248 16 -241 -113 -32 -204 -59
8170e9L9J4j72l2K55K1K6%k3j35J33K50m37O7M4k0J08j09n70R39k65
$$ -59 -20 -6 -178 -210 45 66 92 92 69 -66 67 317 -120 -53 -9 -29 79 -30 -600 339 74
8191G4
$$ Imaginary data points
##PAGE= N=2
##DATA TABLE= (X++(I..I)), XYDATA
0@%%%%%%%%%lJ1j6J6k4L2l9M7n6P2q8J04j23J47j76K08k41K81l28L77m33M96n67
$$ 0 0 0 0 0 0 0 0 0 0 -3 8 -8 8 -16 16 -23 24 -32 40 -48 56 -67 80 -96 112 -129 152 -176 201 -232 264 -303
32c03O47p31Q27r35J051j180J321j475J645j830K030k248K490k753L041l355L697
$$ -303 344 -387 440 -495 556 -624 697 -778 867 -963 1067 -1181 1309 -1444 1597 -1758 1939
49A939m075M488m943N446o006O632p334Q129r036J0081j1304J2756j4514J6694
$$ 1939 -2136 2352 -2591 2855 -3151 3481 -3853 4276 -4760 5321 -5983 6773 -7741 8953
63H953j9481K3190k8392L6285m9830P9381k61688J47436K47700l65357J65116
$$ 8953 -10528 12662 -15730 20555 -29275 50106 -211582 -64146 183554 -181803 -16687
74a6687J40791j72538j18385J82332L2680j71400R1130K80659k56185j72261L14770
$$ -16687 124104 -48434 -166819 15513 48193 -123207 -32077 248582 -7603 -179864 134906
85A34906p813k44140J58106J18512j04815o6012K7279j5436j06918Q0273K04740
$$ 134906 127093 -117047 41059 159571 54756 -11256 16023 587 -106331 -26058 178682
96A78682j92353j52131K23930j3790j56557J22621O9426o8702l9854N174J6474
$$ 178682 -13671 -165802 58128 44338 -112219 10402 79828 11126 -28728 -23554 -7080
107g080p6928K7109J55770j03732o4912J81035o1151j42769P0085K0255J0859
$$ -7080 -84008 -56899 98871 -4861 -69773 111262 50111 -92658 -22573 -2318 8541
118H541M2702k8647n677m1482j1856Q1372n8780j2164J26931n8947o7125M4366
$$ 8541 51243 22596 16919 -24563 -36419 44953 -13827 -25991 100940 41993 -25132 19234
130A9234l9688K3099K3792p2495M3550K2222m3941M5207m1165l9710Q1100j4843
$$ 19234 -20454 2645 26437 -46058 -2508 19714 -24227 20980 -20185 -59895 21205 6362
142F362k0844J4016m3268M9900J0905p5944P0429K1464o3824N2035j7669l5476
$$ 6362 -14482 -466 -43734 6166 17071 -58873 11556 33020 -30804 21231 3562 -31914
154c1914P3720j2546k9316K420l3719N2814R83p0253P1332N879o4397O6685j4401
$$ -31914 41806 29260 -56 2364 -31355 21459 22442 -47811 23521 29400 -34997 31688 17287
167A7287n8197M9482l834j2056O513k0804N4142k4610p6871Q7521O593p1397P3343
$$ 17287 -40910 8572 4738 -7318 -805 -21609 32533 7923 -68948 18573 25166 -46231 27112
180B7112q456o4291N0593P734j6626m255j2338N6927k7305n6172R3485j8341p9012
$$ 27112 18656 -45635 4958 12692 -3934 -8189 -20527 36400 9095 -47077 46408 28067 -50945
193e0945Q2182n651o0457N2067J175k3368l074r268N2015k8513n7447P8485j7798
$$ -50945 31237 25586 -34871 17196 18371 -4997 -8071 -17339 34676 6163 -51284 27201 9403
206I403o2549P6746r154m8031M5420q473p367Q195k0296M4263j6336m9344P0651
$$ 9403 -53146 23600 14446 -33585 11835 3362 -4005 4190 -16106 28157 11821 -37523 33128
219C3128j3705n4823O1681j4019l5469M1747j5007k5N644l4417L9833o661m6822
$$ 33128 19423 -35400 26281 12262 -23207 18540 3533 3508 9152 -25265 14568 7907 -38915
232c8915N9537j0730m4734N1160j6198j8883L6486l0254Q920J8762m1124L4932
$$ -38915 20622 9892 -34842 16318 120 -18763 17723 -12531 -3611 15151 -25973 8959
244H959M393m4317M4487q048k9287M6031k2454r552L3942l8160J4353K3565m4539
$$ 8959 13352 -30965 13522 5474 -23813 22218 -236 -9788 24154 -14006 347 23912 -20627
257b0627K9857O641m0566M1029o949k6017L6653k7072l937L1835m0762J4702K1649
$$ -20627 9230 15871 -24695 16334 9385 -16632 20021 -7051 -10988 20847 -19915 -5213 16436
270A6436m4650K8254Q819l4682L7149r434j9257L8380k6870j153L2880l9446J3019
$$ 16436 -28214 40 8859 -25823 11326 1892 -17365 21015 -5855 -7008 25872 -13574 -555
283e55K0457l8733K8437M232l2386L6419j3650j9551L7337k8469m359K9148l7161
$$ -555 19902 -18831 9606 13838 -18548 17871 4221 -15330 22007 -6462 -10821 18327 -18834
296a8834J4171J8204l7500K9821J999k9828L8303j3918j7504L6548k8729k714
$$ -18834 -4663 13541 -23959 5862 7861 -21967 16336 2418 -15086 21462 -7267 -9981
308i981K8302l5146J5416J4515l5553L0634l01k8159L7547j4897j8200L4827k6200
$$ -9981 18321 -16825 -1409 13106 -22447 8187 7886 -20273 17274 2377 -15823 19004 -7196
321g196k73K5628l3129J7134J2498l2728L1676j300k9317L5152j5222j6397L2031
$$ -7196 -7469 18159 -14970 2164 14662 -18066 13610 12310 -17007 18145 2923 -13474 18557
334A8557k7335m06K2142l1290J9198J0389l2644L1127k074k5985L4464j4811j4678
$$ 18557 -8778 -9184 12958 -18332 866 11255 -21389 9738 7664 -18321 16143 1332 -13346
347a3346K9886k4350K927K0567k9850J9497Q071l1265L1298m459k6489L2927j6553
$$ -13346 16540 -7810 -4883 15684 -14166 5331 13402 -17863 13435 8976 -17513 15414 -1139
360a139j3833K9742k4367K068J8551k7324K1193N714k9601L1182p101k3525L5005
$$ -1139 -14972 14770 -9597 -7529 11022 -16302 4891 10605 -18996 12186 5085 -18440 16565
373A6565j7778j3723K9487k2840L162J8398k6250J8629L233k6398L1227r253k2484
$$ 16565 -1213 -14936 14551 -8289 -5127 13271 -12979 5650 8883 -17515 13712 4459 -18025
386a8025L4038j9111j0641L0463k2328J946J5615k4265J8368K390k4478K8232
$$ -18025 16013 -3098 -13739 16724 -5604 -3658 11957 -12308 6060 8450 -16028 12204
398A2204j1319j9856L2094j8127q541K7948k4451M096J7994k4219J6429K808k2566
$$ 12204 885 -18971 13123 -5004 -13545 14403 -10048 -5952 12042 -12177 4252 7060 -15506
411a5506K7254p745j4044K8107k1687l431K7551k7187O973J8281k8184J3757K928
$$ -15506 11748 4003 -10041 18066 -3621 -7052 20499 -6688 285 18566 -9618 4139 7067
424G067k2383K3314p453j0735K3904k3098J709K4371l1387R880K0464k8630J6051
$$ 7067 -15316 7998 545 -10190 13714 -9384 -7675 16696 -14691 -4811 15653 -12977 3074
437C074P992k3049J6418o399n055K2493k1728O016J9377l7913J0290K1933k7348
$$ 3074 11066 -11983 4435 -1964 -7019 15474 -6254 -238 19139 -18774 -8484 13449 -13899
450a3899J5420Q494k1352J4421p007m487J9252k0705J0995K1041l4625J0473J5409
$$ -13899 1521 10015 -11337 3084 -3923 -8410 10842 -9863 1132 22173 -12452 -1979 13430
463A3430l0847J6611J1085j5882J7104j0083j1752J3035j8820J3431K1331l0626
$$ 13430 -17417 -806 10279 -5603 11501 1418 -10334 2701 -16119 -2688 18643 -11983
475a1983J0074J0859k8329J7882M891j6055K5246o084j0373J5759k1350K695J8663
$$ -11983 -1909 8950 -19379 -1497 3394 -12661 12585 6501 -3872 11887 -9463 -6768 11895
488A1895j9579J5833Q146k5573J6042p752j8655L2878m260j2281J7528j9820l517
$$ 11895 -7684 8149 16295 -9278 6764 -988 -19643 13235 8975 -3306 14222 -5598 -9115
501i115J2999j4922J5968M840j7805K3339j2950k3084L0279q437j1975K6263j2141
$$ -9115 3884 -11038 4930 9770 -8035 15304 2354 -20730 9549 1112 -10863 15400 3259
514C259p644N067j4298J3537J501r584K8143j5734k3515L0067j3599j4908K9917
$$ 3259 -4385 682 -13616 -79 1422 -8162 19981 4247 -19268 10799 -2800 -17708 12209
527A2209o295o321O328j4315R473k403q244K7320j4782j6709K8920j9645j6805
$$ 12209 5914 -407 5921 -8394 1079 -1324 -9568 17752 2970 -13739 15181 -4464 -21269
540b1269K7996q028j162J2388j4712N307l633r956K3553j0999q041K9047k2663
$$ -21269 6727 -1301 -2463 9925 -4787 520 -3113 -13069 10484 -515 -8556 20491 -2172
553b172j4824K4834j2714K277J7244j5521K718k300r723J7184j2475l518K8709
$$ -2172 -16996 7838 -4876 -2599 14645 -876 1842 -458 -10181 7003 -5472 -8990 19719
566A9719k2072q290K3417k1907o27K0846j1664M392J403r413R324j5285J651K8847
$$ 19719 -2353 -10643 12774 -9133 -9760 11086 -578 3814 5217 -4196 5128 -10157 -8506 20341
580B0341k1897l631K2039k6387k332K0897j2398M859M018o657Q837j5516j439
$$ 20341 -1556 -5187 16852 -9535 -11867 9030 -3368 1491 5509 -1148 7689 -7827 -9266
593i266K2440k0503J794K5455k3661l322J3142j4955P972N223m980J2532j7011
$$ -9266 13174 -7329 -5535 19920 -3741 -7063 6079 -8876 -904 4319 -661 11871 -5140
606e140n875K0874j8906M28K4022j7394J92Q809j5256R281k72p547J8674j1730
$$ -5140 -11015 9859 -9047 -8619 15403 -1991 -1799 7010 -8246 1035 763 -6784 11890 160
620A60p012J9525j8940m668J8965j2335N896N615j5373J1503n608j1128K2554
$$ 160 -6852 12673 -6267 -10935 8030 -4305 1591 7206 -8167 3336 -2272 -13400 9154
633I154q726r011K0442j3296o207J1965r711Q123J821j2234J7311p317j5776K2401
$$ 9154 428 -8583 11859 -1437 -7644 4321 -5390 2733 4554 -7680 9631 2314 -13462 8939
647H939q518j1531K0598p855o114P660r282Q060m37j0583K0880p295j6203K2332
$$ 8939 421 -11110 9488 1633 -4481 3179 -6103 1957 1520 -9063 11817 4522 -11681 10651
661A0651q623j2278J9701p515m313P525r417Q454k431j2650J9927p037j4683K1774
$$ 10651 2028 -10250 9451 1936 -2377 5148 -4269 4185 1754 -10896 9031 1994 -12689 9085
675I085r119j1364J7247q319j621Q980r341R038k157j1629J8779o807j2314K0932
$$ 9085 -34 -11398 5849 -2470 -4091 4889 -4452 4586 2429 -9200 9579 2772 -9542 11390
689A1390j0532r472J7161r982j924Q624r947P756j422j0768J6741q031j0267J9763
$$ 11390 858 -8614 8547 -1435 -3359 5265 -4682 3074 1652 -9116 7625 -406 -10673 9090
703I090j1061o629J7206j1778o65R210r879P321r2r886J4528q158q675J9484j1472
$$ 9090 -1971 -8600 8606 -3172 -3837 5373 -4506 2815 2723 -7163 7365 -793 -9468 10016 -1456
718a456n942J5614j1720K73R058j0347P961j587r205J5761q277q419J8389j1253
$$ -1456 -7398 8216 -3504 -3231 5827 -4520 3441 1854 -7351 8410 133 -8286 10103 -1150
732a150n479J5091j0981M02O811j0595Q996j642j0209J6004q488q495J8374j0341
$$ -1150 -6629 8462 -2519 -2117 4694 -5901 3095 1453 -8756 7248 -1240 -9735 8639 -1702
746a702m217J3720j0686K032N661j0132J0753k524j0931J5989o881r148J6115
$$ -1702 -5919 7801 -2885 -853 4808 -5324 5429 2905 -8026 7963 1082 -8066 8049
759H049r142l891J0835j0288M136L805j1579J1509j371j1301J5758n269r355J5012
$$ 8049 -1093 -4984 5851 -4437 -301 3504 -8075 3434 2063 -9238 6520 1251 -8104 6908
773F908q270k171J0095j0970N606L942j2534J1654p83j1980J4419m744p577J2777
$$ 6908 -1362 -3533 6562 -4408 1198 5140 -7394 4260 3477 -8503 5916 1172 -6405 6372
787F372r193KR005j2214P073M840j3707J1640L99j0953J3053n153n495J1430j0219
$$ 6372 -2821 -2819 6186 -6028 1045 5885 -7822 3818 4217 -6736 6317 1164 -4331 7099 -3120
802c120J558Q715j4030P329M999j3610J0994l52j0126J2323n451m016J1286j1106
$$ -3120 -1562 7153 -6877 452 5451 -8159 2835 2483 -7643 4680 -771 -4787 6499 -4607
816d607K256R364j2979O745N040j2730J0518m54q660J1683p310l283J1435j1554
$$ -4607 -2351 7013 -5966 779 5819 -6911 3607 3153 -5507 6176 -1134 -4417 7018 -4536
830d536K289Q921j2934O186M372j1027J0194j873p970J2071p756k792J2205j1839
$$ -4536 -2247 6674 -6260 -74 4298 -6729 3465 1592 -6378 5693 -2063 -4855 7350 -4489
844d489J713Q510j1569O564K852j0103J0443l481o803J3304q731l670J2855j0706
$$ -4489 -2776 5734 -5835 729 3581 -6522 3921 440 -6363 6941 -1790 -5460 7395 -3311
858c311J484Q234j0849O546J963r354J0792m473o747J2906q605l374J1933j1127
$$ -3311 -1827 6407 -4442 2104 4067 -5287 5505 1032 -5715 7191 -1414 -4788 7145 -3982
872c982J276P916j1091O984J453r252J1034m330n949J2658q262k092J1353j1120
$$ -3982 -2706 5210 -5881 1103 2556 -6696 4338 8 -5941 6717 -1545 -3637 7716 -3404
886c404K788P183j1231P456J490r555J0195m155o270J0923q394o33J0112j1659
$$ -3404 -616 6567 -4664 2792 4282 -5273 4922 767 -5503 5420 -2974 -3607 6505 -5154
900e154L664O713j1757Q184J783r770J0691k727o052R910p891M04Q735j1375N285
$$ -5154 -1490 5223 -6534 1650 3433 -6337 4354 1627 -4425 5485 -2406 -2002 6733 -4642 643
915F43N194j2962Q669J492j0515J1068k876n830R153p354J021P162j1061P193
$$ 643 5837 -7125 1544 3036 -7479 3589 713 -5117 4036 -3318 -2297 4865 -6196 997
929I97M743j2769J0349M96j1331J1737j508o899Q731o548P52M642r951Q142L081
$$ 997 5740 -7029 3320 3816 -7515 4222 2714 -4185 4546 -2002 -1250 3392 -6559 1583 4664
944D664j2528J1288k60j2007J2255j463p023Q978m045J17L543r675Q671J640j1038
$$ 4664 -7864 3424 3164 -8843 3412 1949 -5074 3904 -141 -24 3519 -6156 2515 4155 -6883
959f883J2899j802j2820J3031j996q561R405l086N70K539q587P801j31j0381J4957
$$ -6883 6016 4214 -8606 4425 2429 -6132 3273 187 757 3296 -5291 2510 2379 -8002 6955
974F955k266j2374J3798l559r359R379k871J262K863q142P303k024j0010J3996
$$ 6955 4689 -7685 6113 2554 -6805 2574 -297 965 3828 -4314 2989 965 -9045 4951
988D951k468r956J4140m352q634Q637m740J261M905o569P413j497j1036J1510
$$ 4951 2483 -7473 6667 2315 -6319 2318 -2422 -1161 3744 -2825 4588 3091 -7945 3565
1002C565l099q036J4519m551p005Q262p388M02M914o826Q309P83r325R230m823
$$ 3565 466 -7570 6949 2398 -4607 3655 -3733 -3331 1583 -5243 3066 3849 -5476 3754 -1069
1017a069o894J3270n148k751R958q869m43M360q629P422L309p579Q298n105o605
$$ -1069 -7963 5307 159 -2592 7366 -1503 -1946 2414 -6215 1207 4516 -3063 5235 130 -6475
1032f475J0350p009j311J1285q393K214M105j1567O639L177o887R700l226n390
$$ -6475 3875 -3134 -4445 6840 -1553 661 4766 -6801 -162 3015 -3872 5828 2602 -2788
1046b788Q470q763j296R416q039M593M896j2044N904J350q444R442j394m478Q929
$$ -2788 5682 -3081 -4377 5039 -3000 1593 6489 -5555 349 1699 -6745 2697 1303 -3175 5754
1061E754p342k022O906q162N662N426j0858P625Q80j0724R072j519m532Q870n677
$$ 5754 -1588 -3610 3296 -4866 796 6222 -4636 2989 3869 -6855 2217 698 -3834 5036 -641
1076f41r53M876q999O292L439j0561J0167J311j1301Q471r87n262P729m182L11
$$ -641 -1594 3282 -5717 575 4014 -6547 3620 4931 -6370 2101 1114 -4148 3581 -601 -290
1091b90L785q609O647J511j1112J1065J170j0809R186j316n849P157m222J113
$$ -290 3495 -5114 1533 3044 -8068 2997 4167 -6642 2544 1228 -4621 2536 -1686 -573
1105e73L929q027P067J129j0737J1298K00j0192R709j902n577P153n120R47M352
$$ -573 3356 -4671 2396 3525 -7212 4086 4286 -5906 3803 1901 -3676 3477 -1643 -696 3656
1120C656q421O632R69r658R635J71q605R390k978m263P759n912Q17N259q234N488
$$ 3656 -4765 1867 2836 -6822 2813 2984 -5621 3769 791 -3472 4287 -1625 -808 4451 -3783 1705
1136A705J480q853Q666q24p525R385m302l825P930o577P74O241q004M689J652
$$ 1705 3185 -5668 2998 2174 -5351 4034 -268 -4093 3837 -2740 -1966 4275 -3729 960 2612
1151B612p616Q407j979n694R620n512k793Q218p654M11O041p048M252Q76p470
$$ 2612 -5004 3403 1424 -4270 5350 -162 -2955 5263 -2391 -1980 4061 -2987 1265 2141 -5329
1166e329Q215k872n344J0299n899l120R042p485N95N476o922N026R46o952Q443
$$ -5329 2886 14 -5330 4969 -930 -4050 4992 -2493 -1898 3578 -3344 1682 2628 -4324 4119
1181D119l547n715J0121n133l294Q244p195J123M172p396O554K88p176Q745k660
$$ 4119 572 -5143 4978 -155 -3449 4795 -2400 -1277 2895 -4501 2053 2341 -4835 3910 1250
1196A250o272R605m916k578P172o053J835L271p832O917J24p937R077k303o271
$$ 1250 -5022 4583 -333 -2911 4261 -1792 43 3314 -4518 2399 2523 -5414 3663 1360 -4911
1211d911Q004m579q35N589o622M034K557q485P584M13p982Q465j748n316P332
$$ -4911 3093 -1486 -2321 3268 -3354 680 3237 -5248 2336 2749 -5233 3232 1484 -3832 3500
1226C500m571p27N360p880M771L079q962P068J108q070P881j739l966O557n412
$$ 3500 -1071 -1798 3562 -4318 453 3532 -5430 1638 2746 -5324 2557 818 -3148 3409 -2003
1241b003J069N475q340M843L478r036O412J106o586O487k981k780O528o617J192
$$ -2003 -934 4541 -3799 1044 4522 -4514 1898 3004 -3582 2905 -76 -2856 3672 -2945 -1753
1256a753N995q365L897M109q451N736O43n249O723l395j867O835p006P69O836
$$ -1753 4242 -4123 -226 3883 -4568 1168 1811 -3438 3285 -110 -1977 4858 -2148 -1379 5457
1271E457q705K976L835p380N135m86m876P448m920j578P313o866M51O711p975
$$ 5457 -3248 -272 3563 -3817 1318 832 -4044 3404 -1516 -3094 4219 -2647 -2196 4515 -3460
1286c460L387K947n962N533j683m312P860m946k408P698o290m33N647o815L214
$$ -3460 -73 2874 -3088 2445 762 -3550 4310 -636 -3044 4654 -1636 -2069 3578 -3237 -23
1301b3J764n725O792k487m690Q363m858k946Q034n819J47M781o017L560J079n686
$$ -23 1741 -3984 2808 321 -4369 3994 -864 -3810 4224 -1595 -1448 3333 -2684 876 1955 -3731
1317c731P214k451m944P887m422l225P291n598N91M203n927M280P61n809P021
$$ -3731 3483 1032 -3912 3975 -447 -3672 3619 -1979 -1388 2815 -3112 1168 1929 -3880 3141
1332C141k159m641P314l963k276O238n347J217L335o556M898Q92o590O947j546
$$ 3141 982 -3659 3655 -308 -2584 3654 -1693 -476 2859 -3697 1201 2093 -4497 2450 904
1347I04m837P147m015j047N334o034K212M059p278N071J179o416O495j733l485
$$ 904 -3933 3214 -801 -1848 3486 -2548 -336 3723 -3555 1516 2695 -3721 2774 1041 -2444
1362b444N700m379n84N054o838L112L378p092M590J756n827N610j722k806N794
$$ -2444 3256 -1123 -1707 3347 -3491 -379 2999 -4093 497 2253 -3574 2036 314 -2492 3302
1377C302m644K09M930p120L209M098p723M519J756n834N101k061k430N494n108
$$ 3302 -1342 -1133 3797 -3323 -114 3984 -3739 780 2536 -3298 1803 -258 -2688 2806 -2302
1392b302N52M921o701L280L538o704M519R47n075N634k514k366N798m659N0M741
$$ -2302 -1750 3171 -3530 -250 3288 -3416 1103 2050 -3025 2609 95 -2271 3527 -1132 -1082 3659
1408C659o499K993K446o118M646J9m552O137l068k738O392n060M37M695n703L162
$$ 3659 -2840 153 2599 -3519 1127 1146 -3406 2731 -337 -3075 3317 -1743 -1306 3389 -2314 848
1424H48J754n989N507p05m457O547l341k831O274m628m22L745m829L239J212n017
$$ 848 2602 -3387 2120 1415 -3042 3505 164 -2667 3607 -1021 -1443 2302 -2527 712 1924 -3093
1440c093N081j338m287P036l025l007O165m153l98L313m917L546J147n614N735
$$ -3093 1988 650 -3637 3399 374 -2633 3532 -621 -1019 2294 -2623 923 2070 -3544 2191
1455B191j731m181O769l500k581O276m079J2K851m796L926N17m775N995k005l874
$$ 2191 460 -3721 3048 -452 -3033 3243 -836 -824 2027 -2769 1157 1674 -3101 2894 889 -2985
1471b985O153l896k194N938m239N48K866m995L181N56m557N692j787k962N861
$$ -2985 3168 -728 -2922 3016 -1223 -675 2191 -2804 377 933 -3624 2068 281 -2681 3180
1486C180m135k013O050m310Q17L216m897L453N1m679N207j389k964N898m509j469
$$ 3180 -955 -2968 3082 -1228 -411 2805 -2092 1361 1412 -3267 1940 551 -2413 3485 -1024 -2493
1502b493N091m517P19L595m696L206Q91m469M813k000k294N558m034j040N155
$$ -2493 2598 -1919 -1200 2395 -2301 905 1796 -2673 2140 140 -2154 3404 -630 -1670 3485
1517C485n023J001K445m513L928L3m400N003k308k204N568m194o71M871m926J561
$$ 3485 -1538 -537 1908 -2605 1323 1356 -3044 1959 -349 -2553 3015 -1179 -1850 3021 -1905 -344
1533c44K376m384L863n0l803M376j515k847N496m149o05M348m852J795J942m698
$$ -344 2032 -2352 1511 1461 -2342 2034 519 -2328 3168 -981 -1586 2762 -2090 -295 1647 -3051
1549c051M451L3m670N191j812k847N252l483l16L526m564K584J250m364M972m23
$$ -3051 1400 1433 -3237 1954 142 -2705 2547 -936 -1252 2274 -2290 294 1544 -2820 2152 1729
1565A729m821N045j882k422M326l170J79L638m464K244R62m408M735j12m137N565
$$ 1729 -3092 1953 71 -2351 1975 -1195 -1016 2622 -1842 402 1364 -3044 1691 1579 -2558 3007
1581C007k527k677M490l485O2L492m056K457O43m494M818j113l813N688k099k709
$$ 3007 480 -2197 2293 -1192 -1130 2362 -1694 763 1406 -3088 1730 617 -3196 2492 393 -2316
1597b316M535l457K43L136l074K494N4l892M486j762l368N714k561k154M454l814
$$ -2316 2219 -1238 -995 2141 -933 1561 1615 -2277 2209 447 -2921 2793 232 -1922 2532 -1282
1613a282k09K600l103K999o1l717M741j824l520N711k186j817M440l218l0J988
$$ -1282 -1491 1109 -1994 1005 944 -2773 1968 144 -3376 2335 149 -1668 2772 -446 -476 1512
1629A512l419K960j29l228M768k045m025N384k195j706M148k879N27J799l918
$$ 1512 -1907 1053 924 -2304 2464 419 -3606 1778 -417 -2123 2025 -854 -327 1472 -2446
1644b446L665m29l606N398j593l565M826k479j405L435l083J342J706m297L516
$$ -2446 1219 790 -2816 2582 989 -2576 2250 -229 -1634 1801 -1282 60 1766 -2531 985
1659I85L9m182M954q87l318M143j920r56K960l407K158J316m251L956L66m747
$$ 985 1024 -3158 1796 909 -2409 1734 -186 -1142 1818 -1589 569 1885 -2366 1590 1956 -2791
1675b791M383r10k791L727k416j69K720m112K627J507m440L509N45m024M163j023
$$ -2791 1592 682 -2109 1618 -798 -967 1753 -2359 268 1775 -2665 844 1389 -2635 1528 505
1691E05k255L618k645K2L254m447K291J659m687L249P12l347L623j647j306L654
$$ 505 -1750 1868 -777 -755 2499 -1948 343 2002 -2685 564 1276 -2071 1552 -95 -1401 2253
1707B253l529J78L390m600K122K138l569K632l32k551L905k228j010L787l917
$$ 2253 -1276 -1098 2292 -2308 -186 1952 -1617 1015 683 -1868 2037 -191 -1201 2586 -1331
1722a331K92L318m368J726J740l102K574o09k220L749k609q01M503l951K15L312
$$ -1331 -1039 2279 -2089 -363 1377 -1725 849 240 -1980 1769 -840 -1641 2862 -1089 -874 2438
1738B438l666R57J784l400L164q94k347M006k891j369M314l276N41K318l223J540
$$ 2438 -1228 -271 1513 -1887 1277 383 -1964 2042 -849 -2218 2096 -1180 -639 1679 -1544 -4
1754dO98k736L507q52k826M658k713j225L596k893L98J993l264K242L80l586L930
$$ -4 694 -2042 1465 613 -2213 2445 -268 -1493 2103 -790 -392 1601 -1663 579 959 -2627 1303
1771A303j444k441M396k176j355L396k730Q56J872l617L060J71l610M070r63k747
$$ 1303 -141 -2582 1814 -362 -1717 1679 -1051 -195 1677 -1940 1120 1291 -2319 1751 788 -1959
1787a959L841j983q87K501l036J426J274l485L101J15l177L537o93k385L453k062
$$ -1959 1882 -101 -988 1513 -1523 -97 1177 -2308 793 908 -2269 1268 575 -1810 1643 -419
1803d19j31K370l201J349J865m018L002O33l475L195j085j743K863j937J14K425
$$ -419 -550 1820 -1381 -32 1833 -2185 817 1450 -2025 1170 85 -1658 1205 -732 -618 1807
1819A807l368J594J897m030K832O63l099L010j122j078K809k709K40K962m087
$$ 1807 -1561 33 1930 -2100 732 1395 -1704 1306 184 -894 1915 -794 -554 2408 -1679
1834a679J530J747l559K437l1k340L247j881o70L173l143M57K942m006J722K024
$$ -1679 -149 1598 -1961 476 445 -1895 1352 -529 -1199 1974 -1169 -712 2230 -1776 -54 1970
1850A970l708K453J0j959K724j738j264L339l038O9K907l420J158J628k944K264
$$ 1970 -1738 715 725 -1234 1490 -248 -1512 1827 -1211 -1142 1765 -1655 -497 1131 -1813 451
1866D51q5j945L202k115p10L724l405K09K673l334J431Q92k455K511o58k269L713
$$ 451 366 -1579 1623 -492 -1202 2522 -883 -674 1999 -1335 96 988 -1467 1044 386 -1883 1830
1883A830k136j397L204k390M49J936k876J942P99l373L302n63k520L700j763j306
$$ 1830 -306 -1703 1501 -889 -440 1496 -1380 562 1361 -2012 1290 727 -1793 1907 144 -1162
1899a162L086k481N42J445k973K172P3k900L771j186k372L662j736j017K511k443
$$ -1162 1924 -557 -15 1430 -1543 629 702 -2198 1573 387 -1985 1677 -59 -1076 1435 -1008
1915a008J129J314l166K637K68l015L283o90k583L353j722r44K421k359R85J126
$$ -1008 121 1435 -1731 906 1174 -1841 1442 752 -1831 1522 -200 -1144 1277 -1082 -97 1029
1931A029k997K754J72l056L481q02k160L037j966k75K341k731R90J529l182K370
$$ 1029 -1968 786 958 -2098 1383 581 -1579 1458 -508 -783 1558 -1173 -183 1346 -1836 534
1947E34O81l119K799p01j751L226k386l64K837l209J120J902k892K007J83k182
$$ 534 1215 -1904 895 194 -1557 1669 -717 -1081 1756 -1453 -333 1569 -1323 684 867 -1315
1963a315K813j758q66L055k814o5L137l525O64J820k676K103p1k115L081j703
$$ -1315 1498 -260 -1126 1929 -885 -950 2187 -1338 -674 1146 -1530 573 502 -1613 1468 -235
1979b35r12L049k899J34K894l184J171J417k637K026k81j833K827j913j020L499
$$ -235 -1147 1902 -997 -863 2031 -1153 18 1435 -1202 824 543 -1290 1537 -376 -1396 2103
1995B103l064J49K679l143P95J576k344K139k23k076K976j801q04L131l012M53
$$ 2103 -961 -812 1867 -1276 -481 1095 -1249 890 667 -1409 1567 -234 -1038 2093 -919 -466
2011d66K248l150J756M81k447K448m77j845K562j398j111K903k780R02K046l078
$$ -466 1782 -1368 388 869 -1578 870 393 -1452 1110 -288 -1399 1504 -1276 -374 1672 -1406
2027a406J848O87k843K572k82j715K660j586j161K631k544O45J760k694J772Q53
$$ -1406 442 1129 -1714 858 576 -1139 1521 -65 -1226 1405 -1139 -494 1266 -1428 344 1197
2043A197l043K624m72k063L395j722m08K213k642Q50J244k647K481K06k795K790
$$ 1197 -1846 778 306 -1757 1638 -84 -492 1721 -921 -71 1173 -1474 1007 1213 -1582 1208
2059A208r02k078K949j573m54K300k426P44J508k766J971N72k236K664j183j781
$$ 1208 306 -1772 1177 -396 -850 1450 -976 -232 1276 -1490 481 1053 -1183 1481 298 -1483
2075a483K946j682r91L066k494M60J354l093K447j24k252K988p44j862K586j435
$$ -1483 1463 -219 -1210 1856 -638 -178 1176 -1917 530 406 -1846 1142 398 -1464 1122 -313
2091c13r21K590j920N71J499k936K337j54k320L045j304j435K884k096n55K215
$$ -313 -1234 1356 -564 7 1506 -1430 907 753 -1567 1478 174 -1261 1623 -473 -1028 1187
2107A187k287R92J431k993K510k00k432L174j200j368K686j721j98J908k462J065
$$ 1187 -1100 -108 1323 -1670 840 640 -1792 1382 182 -1186 1500 -221 -419 1489 -973 92
2123I2J042k725K188J32k277K618j277r39K258j868K34J868k607J495J121k762
$$ 92 1134 -1591 597 729 -1548 1070 -207 -1146 1112 -756 -522 1346 -1261 234 1355 -1407
2139a407K306j56k174K815j352p58K190k323L77J841k902J751Q66l135K849m59
$$ -1407 899 743 -1431 1384 32 -726 1464 -859 -482 1359 -1543 208 1074 -2061 788 329
2155C29j662K201j273m72K163k046L96J679k719J532Q99k241K027j38j851K106
$$ 329 -1333 868 -405 -877 1286 -760 -364 1315 -1404 128 1027 -1214 813 675 -1176 930
2171I30j431m40K373k080L86J572k738J523O44k281K036J43j581K454j622q85
$$ 930 -501 -941 1432 -648 -262 1310 -1428 95 739 -1542 494 637 -944 1510 -112 -997
2187i97K417k042M51J685k871J438M46j901K098n07j418K548j563p66K172j910
$$ -997 1420 -622 -171 1514 -1357 81 527 -1374 724 217 -1201 1347 -216 -982 1190 -720
2203g20L00J372k018J754J79k479K941j168j121K215j667l40K075k237M36J264
$$ -720 -420 952 -1066 688 867 -1612 1329 161 -960 1255 -412 -752 1323 -914 -478 786
2219G86k436J855N67k337K708j090j358K542j536j41J721k153R65P43k236K158
$$ 786 -1650 205 772 -1565 1143 53 -1305 1237 -299 -440 1281 -872 93 836 -1400 758
2235G58J5k300K856r22j778K517j687k66K045k360J126J146k736K359p5k120K908
$$ 758 773 -1527 1329 407 -1371 1146 -541 -807 1238 -1122 4 1150 -1586 773 698 -1422 1486
2252A486r43j527K276j907P0J803k416J540R13k691J948N7j945K081o90r76K085
$$ 1486 543 -984 1292 -615 -545 1258 -1158 382 1295 -1396 552 609 -1336 745 55 -921 1164
2269A164k014M20J720k654J778Q23k545J811K48k087J955n40p06J924k287M96
$$ 1164 -850 -430 1290 -1364 414 1237 -1308 503 751 -1336 619 79 -627 1297 -990 -494
2285d94J729k747J198J150k337K042qj838K482j233p35K529k387n0K215k522J008
$$ -494 1235 -1512 -314 836 -1501 541 533 -1305 1177 -56 -791 1738 -649 -699 1516 -1006 2
2302BP89k030K045k78j760K283j703j49K067k402R67J565k405J187N13k063K170
$$ 2 791 -1239 806 528 -1232 1051 -652 -801 1266 -1136 -169 1396 -1009 178 691 -1372 798
2319G98m86j297K154j235p16K294k274N04J656k554J220O58k108K058m09j434
$$ 798 312 -985 1169 -66 -782 1512 -762 -258 1398 -1156 64 722 -1386 672 263 -1171
2335a171J940j353j54J761j529L78J550k478J493N40k174K230p00j543K352j318
$$ -1171 769 -584 -738 1023 -506 -128 1422 -1056 437 977 -1197 1033 333 -1210 1142 -176
2351a76o13J767k007R78R89k356K165O8k228K461n87j473K077j332j34J625j984
$$ -176 -789 978 -1029 -51 938 -1418 747 815 -1413 1048 461 -1012 1065 -267 -401 1224 -760
2368g60P37Q82k164J949L26k490J873j20j381J908j040j25J273j853J242P69k463
$$ -760 -23 859 -1305 644 970 -1520 353 233 -1148 760 -280 -405 868 -985 257 1026 -1437
2385a437J837M98k262K093k36j406J661j160n0J394j906J373L42j794J378K06
$$ -1437 400 898 -1364 729 493 -913 748 -412 -462 932 -974 399 741 -1053 325 531
2401E31j715K143j023o64J820j514j21J707k247R22J148j783J420r6j628K076
$$ 531 -1184 959 -64 -728 1092 -422 -543 1164 -1083 -161 987 -796 624 528 -1100 976
2417I76j438n43K099k059N11J656k235R91P06j632J473m75r08J803j159n15K108
$$ 976 -462 -1005 1094 -965 -454 1202 -1033 -42 664 -968 505 30 -878 925 -234 -749 1359
2434A359k121K41J674j625M51O84j450J069j57p01J544j394K1J741j783j54K027
$$ 1359 -762 -521 1153 -472 -21 663 -787 282 125 -576 968 -426 -405 1336 -447 -601 1426
2451A426k349Q48Q78j445J163j28j212J806j337l50J681k075Q47J335j951N88
$$ 1426 -923 -75 803 -642 521 393 -819 987 -350 -700 981 -1094 -247 1088 -863 -275
2467b75J097k004J607k13r28J388o65m80J565j983P75J286k479J734K74j690J550
$$ -275 822 -1182 425 212 -716 672 7 -473 1092 -891 -116 1170 -1309 425 699 -991 559
2484E59j90j119J228q59Q8J206j779P77J297k428J447R42k296J544p7r03J305
$$ 559 369 -750 478 -381 -293 913 -866 -89 1208 -1220 227 1169 -1127 417 340 -563 742
2501G42j069Q1J202j701R89O59k309J433Q03k030J412N2o40J189j430O37R53j984
$$ 742 -327 -246 956 -745 244 903 -1406 27 830 -1200 212 264 -376 813 -617 20 973 -1011
2519a011J324R06k471J357O98j757J343l90n42J298j867R19J168k072R40J336
$$ -1011 313 1219 -1252 105 803 -954 389 -1 -543 755 -1112 -193 975 -1097 -157 1179
2535A179j793O44M68j524J540p33j50J331j912N61J909k730R49J564j831O26K20
$$ 1179 -614 30 498 -1026 514 -219 -369 962 -950 -389 1520 -1210 -261 1303 -528 98 318
2552C18j021J133r17J6J717k131M19J695j982K48J319j558J159j53p90J150j310
$$ 318 -703 430 -487 -471 1246 -885 -466 1229 -753 -505 814 -744 415 262 -528 622 -688
2569f88M61J370j906N44J766k553M85J263j368N37M44p15J090j196l1J756k049
$$ -688 -227 1143 -763 -219 1547 -1006 -521 742 -626 -89 355 -360 730 -466 -497 1259 -790
2586g90N79J807k489Q07R07j323P42l05j23J054j350M4J713k244P11J308j851
$$ -790 -211 1596 -893 -86 821 -502 240 -65 -188 866 -484 -440 1273 -971 -260 1048 -803
2603h03N10R61j452R98o4m25Q41j296N49J297k058O78J702k271O58P60j145P33
$$ -803 -293 668 -784 214 150 -275 566 -730 -181 1116 -942 -264 1438 -833 -175 585 -560 173
2621A73j26n97J305j522L09J565k149Q71J162j648P37L55p69N35j88k05J171j838
$$ 173 47 -550 755 -767 -458 1107 -1042 -171 991 -657 80 435 -334 201 13 -192 979 -859
2639h59N04J660j912L01J442k021P95O55j159P11l26o2J160j355J81J742k366
$$ -859 -355 1305 -607 -306 1136 -885 -90 565 -594 117 -209 -271 889 -466 -285 1457 -909
2656i09L85J675j234o9P56p78N38p43o7J238j301r1J890j965L87J168j851R99
$$ -909 -524 1151 -83 -152 604 -174 364 -379 -446 792 -509 -600 1290 -675 -288 880 -971 28
2674B8L54q71J166j071p6J440j709O8J735j543M30R08j786R93j7n70J234o75m66
$$ 28 382 -489 677 -394 -470 970 -739 -671 1064 -479 -49 859 -927 66 49 -521 713 38 -428
2693d28J500j705J00J449j480K14J346j635Q41j70p20J576j273R4J578j864q3
$$ -428 1072 -633 -533 916 -564 -350 996 -639 202 32 -688 888 -385 -291 1287 -577 -660
2710f60J395j237Q7R88o97J86L4p89R76q31K32J437j440K40J108j651N39N81r52
$$ -660 735 -502 -415 573 -124 62 96 -693 283 -548 -316 1121 -319 -79 1029 -622 -83 498 -454
2729d54P98r9o76J248j395k52J708j482K22J236j578O63O03j103J060l76k65J033
$$ -454 344 245 -431 817 -578 -830 878 -604 -382 854 -724 -61 542 -561 499 123 -142 891
2747H91j216j55J487j363l3J345j504M70N12j021J217o29l85J194j137k59J544
$$ 891 -325 -480 1007 -356 -389 956 -548 -78 434 -587 630 1 -384 810 -327 -586 958
2764I58j509J90R72r83O54M24j064Q49m02p26J674j389k04J492j625J90J242j564
$$ 958 -551 -361 611 -372 282 706 -358 491 89 -637 1037 -352 -556 936 -689 -499 743 -821
2782h21J010J76j040J155l52p37J386p57n06J307j493P33M96j012O80J54j357
$$ -821 189 365 -675 480 128 -609 777 20 -486 821 -672 61 557 -455 225 379 -978
2799i78J429l57j013J348r73J08J010j239N58O76j521J413n2j093J103m12o34
$$ -978 451 94 -919 429 -544 -436 574 -665 -107 569 -952 461 409 -684 419 7 -627
2816f27J323q67j45P40r92P95L19j379J117K63j409J647p76p50J412q50J10R55
$$ -627 696 -171 -316 424 -568 227 546 -833 284 547 -862 785 9 -741 671 -179 -69 886
2834H86j406R65K78j400Q77j19p57J203o74m51J187r67o5R45r37J60Q33j308R78
$$ 886 -520 445 723 -677 200 81 -676 527 -147 -598 589 -378 -443 502 -435 -275 558 -750 228
2853B28K25j328J593p28m14J224j156K28R49j134M52M05j182J219n37p92J371
$$ 228 453 -875 718 -10 -424 800 -356 -128 821 -313 139 544 -638 581 44 -748 623
2870F23p37m95J493j145k00J094r96L47M38q28R73m59m10R47o53l76J202j259
$$ 623 -114 -609 884 -261 -461 633 -363 -16 422 -406 567 108 -302 645 -8 -384 818 -441
2888d41q6J122j397O51O58r40Q15n43k65J213j321M2J410j256K72P04j166P16
$$ -441 -527 595 -802 -151 507 -433 382 -161 -426 787 -534 -492 918 -338 -66 638 -528 188
2906A88K33j062P85k49m72J245q51l24J517j397o8J108j052N86J44r83J245l85
$$ 188 421 -641 144 -105 -577 668 -183 -507 1010 -387 -455 653 -399 187 331 -652 593 208
2924B08p48J364j201J29Q47j152M98L95p14M61K88j231J316l93p10J132n99J5
$$ 208 -540 824 -377 -248 599 -553 -55 340 -374 87 375 -856 460 67 -643 489 -110 -95
2942i5O92j312M95P88j382J228J29j151J227l29r65J199q54J98P13j531J068M45
$$ -95 597 -715 -220 568 -814 414 543 -608 619 290 -675 524 -330 -132 581 -950 118 563
2960E63j530J238J76j242J276n10l35P59q39N44L35r35O04O55j618R65K30j229
$$ 563 -967 271 447 -795 481 -29 -364 395 -444 100 435 -500 104 759 -859 106 336 -893
2978h93J298l92m72P61r60L17J080j249O18P69j894J390J8j113J225l01n48R68
$$ -893 405 13 -459 302 -658 -341 739 -510 108 877 -1017 373 391 -722 503 202 -346 622
2996F22q35J13R08j462Q19J81j047J009k10o55Q73m41l72Q14n91J64Q34j323P96
$$ 622 -213 -100 808 -654 165 346 -701 308 98 -557 316 -125 -497 317 -274 -110 724 -599 197
3015A97L59j193Q74j55q97J476p02m34J285j145J62M61p73N39M13j169Q93K2r14
$$ 197 556 -637 237 82 -815 661 -41 -475 810 -335 -173 288 -485 54 467 -702 191 213 -701
3034g01J277m12n39R59p10o4Q58j204Q32L08j276P30J6o09J086o58j12R15j098
$$ -701 576 164 -375 584 -126 -190 668 -536 296 604 -672 58 74 -535 551 -107 -219 696 -402
3053d02J68P69j586J111M50j137J249j73o53O66l85nK79r29O60M47j252Q80M86
$$ -402 -234 535 -1051 60 510 -627 622 449 -204 462 77 72 351 -578 82 529 -723 157 643
3072F43j380R21J82r91R75m55r2O21q88Q36K77j133O70L40j114R88l01n76M93
$$ 643 -737 184 366 -625 350 -105 -197 424 -464 372 649 -484 186 526 -588 400 99 -477 16
3091A6j32k8M69j019P26N89j648J350K19j135P35j14o10J011q47M82O27j457O81
$$ 16 -116 -144 325 -694 32 621 -1027 323 542 -593 142 28 -582 429 -418 64 691 -766 -85
3110h5O73j282R25L75j282R43j27m54N96p01J50R26j555J077M45j583J283O2j078
$$ -85 588 -694 231 606 -676 267 140 -314 282 -419 -269 657 -898 179 624 -959 324 386 -692
3129f92P09J22j13O14j107M69N19j423J060L44j196R81J25r57O87j54k10P05q57
$$ -692 17 139 26 640 -467 2 521 -902 158 502 -694 287 412 -545 142 -12 -222 483 -374
3148c74L45L63r71P34O55j176P61L0j016P67l55j16P43q63M59P10j650Q46N18
$$ -374 -29 334 -637 97 752 -424 337 367 -649 118 -237 -353 390 -473 -14 696 -954 -108 410
3167D10j037R16L16j079O64k05j54L21p06P68O46j651P83M08j178Q87J43m88L13
$$ 410 -627 289 605 -474 190 -15 -169 152 -554 214 860 -791 -8 400 -778 109 252 -236 77
3186G7k69l6N36q33N85L40r83O59N70j547J132K58p00O64p09o5R73j196L94Q44
$$ 77 -192 -228 308 -525 60 400 -583 76 646 -901 231 489 -211 453 -256 -321 652 -544 -150 694
3206F94j495R38L90j078N38J61o91R34o26J77P23j198P07L79j132M76M70p84N53
$$ 694 -801 137 527 -551 -13 148 -543 391 -235 -58 665 -533 174 553 -579 -103 367 -417 136
3225A36j61k60M81n54J70Q34j315P73P25j563Q61M65q92M00j21L9L35o52J97O78
$$ 136 -25 -285 196 -358 -188 646 -669 104 829 -734 127 592 -300 100 -21 18 353 -299 -102 576
3245E76j149M97P86j484N57O97j133N67j10J47M06p20K68P63j313P40M73j146
$$ 576 -573 -76 710 -774 -217 480 -653 -86 -196 -49 357 -363 -95 668 -645 95 568 -578
3263e78N46K12l91M83j76l45O88o88j17J015j393M25M90p89P41J73n53M12ql12
$$ -578 -32 180 -211 272 96 -249 439 -249 -366 649 -744 -319 171 -618 123 296 -257 155 147 -165
3283a65P06p02K18N22j124N84O48j190O69l1q97R99l75m46Q26n22J83O71r84L54
$$ -165 541 -161 57 579 -545 39 687 -503 166 135 -762 237 -138 -584 242 -280 -97 574 -410 -56
3303e6N77q22O19j59o68J128m97n19P29o65k5P94r15N53M82o60K70l01m01J034
$$ -56 521 -301 318 159 -509 619 122 -397 332 -333 -358 436 -479 74 556 -104 166 -135 -536 498
3323D98o36r4R00j082J44Q68q80K12M29o08M84k30l83O84l15m18R76r18L06L95
$$ 498 -138 -232 668 -414 -270 598 -282 -70 359 -249 235 5 -378 306 -9 -427 549 -369 -63 332
3343C32n56J71L60n89O62k87o22J014n70j96J231j165k87J003j035N24ll92M54
$$ 332 -224 -53 307 -282 380 93 -529 485 -85 -281 950 -215 -502 501 -534 -10 -13 -405 49
3362D9L7m08Q40p41L8O99j009K52O74q48P63p0n14L64j64j71L06j38%Q04j378
$$ 49 86 -322 518 -223 -185 514 -495 -243 431 -417 346 276 -238 126 -38 -209 97 -41 -41 763 -615
3383f15N92L30r35O86L39r60P02k9m77N28m85M03N58j046K72M74p96P22J44q38
$$ -615 -23 307 -628 58 397 -563 139 110 -367 161 -324 79 637 -409 -137 337 -459 263 407 -431
3403d31P01l2p50R69o24J81J68q80N19M96q35N15M05q95O86J8n43J072r10l31
$$ -431 270 238 -512 457 -167 14 182 -698 -179 317 -518 -3 402 -493 193 211 -332 740 -170 -501
3423e01J044j080P15Q5p72P47m4o64O17r3n01P98m99j0O91o60J72O09j356Q65
$$ -501 543 -537 178 263 -509 238 194 -470 147 54 -447 351 -148 -158 533 -127 45 654 -702 163
3443A63J02n99R64o33k44O82o05k90P14n91K81K55n77R48m96m93R94o84n93J264
$$ 163 265 -334 630 -3 -247 435 -170 -460 254 -337 -56 199 -378 570 74 -419 575 -109 -702 562
3463E62p64k36Q48p32K59J29n91P52R3o09J31o4j90J035q18MN62p98L62J37l35
$$ 562 -202 -438 410 -322 -63 66 -525 227 320 -289 -158 -222 -412 623 -195 -191 371 -427 -65 72 -263
3484b63P00l99n57J037n95l90J011q45P2O29p03J97J78l39M50k94m39R35l73k50
$$ -263 437 38 -519 518 -77 -467 544 -301 -229 400 -303 -106 72 -267 183 -111 -550 385 12 -238
3504b38N16m47j57O52n37N25j68m94N75k52j29M82m97j32N87n84J75L95p61L82
$$ -238 278 -169 -326 326 -211 314 146 -348 227 -25 -154 328 -169 -301 286 -298 -123 272 -489 -107
3524a07M19n32M31j73l42M71k57L3P11p34j51O95q73L91K68m86N98k74n80Q32
$$ -107 312 -220 211 38 -304 167 -90 -57 654 -80 -231 464 -409 -18 250 -236 362 88 -492 340
3544C40m64j57P35j008N43J76n64L63j17j48L51q7k61Q88o90k24N83o04J35O01
$$ 340 -124 -281 454 -554 -11 165 -399 -36 -153 -301 50 -37 -298 590 -100 -324 259 -345 -210 391
3564C91n28K93J65n43O03o27K50M39j012L43R11q89J61M81q77M63K9l75O31k93
$$ 391 -137 156 321 -222 381 -246 4 443 -569 -226 685 -204 -43 438 -439 24 53 -322 309 16
3584A6k95P65l34n22P37n57J61L03n77P40k45n38Q30l86m98R32p88l15Q66j75
$$ 16 -279 486 152 -370 367 -190 -29 274 -303 437 192 -346 484 98 -400 532 -256 -571 295 120
3604A20k27K61o15N92l23k97J082o81m53R75n49K8J61L0j59K44m53M84l37k64
$$ 120 -107 154 -461 131 -192 -489 593 -88 -541 434 -115 -87 74 104 -55 189 -264 220 -117 -381
3624c81P81n14k99O51j40l87O30p52L71R5l78N39k46k69N73m5m57M23k06l4L44
$$ -381 400 -114 -413 238 98 -289 341 -411 -40 55 -323 216 -30 -299 274 229 -228 195 -11 -45 299
3645B99q07R04j53m07J95K86n53L25j23j40M04j72j66K36l38L06O6m53N14j38
$$ 299 -508 396 243 -164 31 317 -236 89 -34 -174 230 58 -108 128 -210 96 162 -291 223 85
3665H5l88N17m49k52R57m68r1M19o70K71m6j40M51k61j76L34j62j52M09k13J48
$$ 85 -303 214 -235 -487 470 2 -89 330 -340 -69 -115 -255 196 -65 -241 93 -69 -221 188 -25 123
3686A23J35n14M63k35l10Q57k70p21N42k45l3N00o34L3M91m79P17m65n8J40o2
$$ 123 258 -256 207 -28 -338 519 249 -472 70 -175 -208 292 -342 -309 182 -297 420 -45 -103 37 -25
3707b5k03O10n93M8L17m55K73L94o97K52K07m55L81m3l04N50m24K76J30m94K66
$$ -25 -228 382 -211 -163 154 -301 -28 366 -331 -79 128 -327 54 11 -293 257 -167 109 239 -255 11
3728A1J34n22N45j16j26O9M13p39K72k74L69L03m68J71Q8q14R49R4o58M18J48
$$ 11 145 -377 168 52 -74 -5 408 -331 -59 -333 36 339 -129 42 130 -684 265 359 -299 119 267
3749B67l84M25l48j29L75m22N86J08o26M16j05o54L68K68m11K77k33J83K74m16
$$ 267 -117 308 -40 -169 206 -216 370 478 -148 268 163 -491 -123 145 -266 11 -222 -39 235 -181
3769a81M48j01l19K11J15m02L06O3l95Q20p27J20L94o67M88j92j56M71l66l0J62
$$ -181 267 166 -153 58 173 -229 77 140 -255 565 -162 -42 352 -315 173 -19 -175 296 -70 -100 62
3790F2j83k66O93l69J93J31m85J60J29k23N61k25j86L95n24K25P1m34L17J34k40
$$ 62 -121 -387 306 -63 130 261 -224 -64 65 -158 403 178 -8 387 -137 88 159 -275 42 176 -64
3811f4o7K29j99L08J20o40P34o73j7L77pj2J48o74M45J17l31L42l2n04M05k91
$$ -64 -131 98 -101 207 327 -313 421 -252 -269 108 101 89 237 -437 8 125 -206 136 104 -400 5 -286
3833b86N1M15j60k76O25o75J76N12o53L69l08P5K61j35k34K36k44J40K46m75K43
$$ -286 -235 180 20 -256 369 -306 -130 382 -271 98 -210 -135 126 -9 -243 -7 -251 -111 135 -340 -97
3854i7J39m49O92p5n12L78l19L51r8k53N4L52j29j22R1j38M16m19J3J95m8J7R3
$$ -97 42 -407 285 210 -302 76 -243 108 10 -243 -189 163 34 -88 3 -135 281 -138 -125 70 22 39 132
3877A32m19K42L45l03j7l2m43O56K02n61L99l88J17J45l33N80l21j13M8J26k88
$$ 132 -287 -45 300 -3 -20 -52 -495 161 363 -198 201 -187 -70 75 -258 322 1 -112 -64 62 -226
3898b26K70l42P6K14J22k2K40m93J01Mj38M31l7k80K93o7l52N02j63o6j02j38
$$ -226 44 -298 -222 -8 114 92 332 -161 -60 -56 -194 237 200 -80 213 146 -206 296 133 67 -35 -173
3920a73M12m6l93K06J39j91M09j90k06N9j78j51L16l21L95j18p8J11Q5M1J7l99
$$ -173 239 193 -200 6 145 -46 363 173 -33 26 -152 -303 13 -308 87 -31 -109 2 87 128 145 -254
3942b54J20L79n44J52M19l38K57M4n01J97K51m30L20p5j50P26q23m6O14n33J88
$$ -254 -134 245 -299 -147 272 -66 191 235 -266 -69 182 -248 72 -3 -153 573 -250 -296 318 -215 -27
3963b7K1J51r2k10j9N31n60j63Q63p12M2L55l52K50J99o24M37l57J44L11m49P0
$$ -27 -6 145 53 -157 -176 355 -205 -368 495 -217 -175 180 -172 78 277 -347 90 -267 -123 188 -261 -191
3985a91N18j98j33M0n01O29J38l81K32l50j26L91l33O3M12l58K22J09l79K91K69
$$ -191 327 129 -4 36 -465 164 302 -79 153 -197 -323 68 -265 -202 210 -148 74 183 -196 95 364
4006C64p13M12k6j95K80k96J10N9k36J53K54m19K45L77n83L06l2j86K60j96j76
$$ 364 -349 63 37 -158 122 -174 -64 -5 -241 -88 166 -253 -8 369 -214 92 60 -126 134 -62 -238
4027b38M39m74R9L70j82k55N91m78K67m6%M2k14K4M15o09L05O9l16L79l69j52
$$ -238 201 -273 -174 196 14 -241 350 -128 139 93 93 135 -79 -55 360 -249 56 125 -191 188 -181 -333
4049c33N63k35q9Qk74J50N12m36j3L50n24J91K59j69l7K10k03O22p77K74J56n43
$$ -333 230 -5 -94 -86 -360 -210 302 -134 -147 203 -321 -130 129 -40 -77 133 -70 552 -225 49 205 -338
4071c38K86L92l93OL06l23L28l79J53J52l04J21K03l41j37M89j88j60R6rj01P8
$$ -338 -52 340 -53 -47 259 -64 264 -115 38 190 -114 7 210 -131 -268 221 33 -127 -31 -40 -141 -63
4093f3k65O82l34j12J71j96n4L46m99K03j35K55J19l80k6K05K29j78J79j46r8
$$ -63 -328 354 20 -92 79 -117 -171 175 -324 -121 -256 -1 118 -262 -288 -83 146 -32 147 1 -97
4114i7M09l95j12K87j48k7K25k87M7J62j47L61n30k3M46l16L84l08O9J46k94J08
$$ -97 312 -83 -195 92 -56 -83 142 -145 -98 64 -83 278 -252 -275 171 -145 239 -69 0 146 -148 -40
4136d0K83j60l19M14m39J32M28o09M48n11K96K67p6k05M52n20k18N36j76J34m8
$$ -40 243 83 -236 178 -261 -129 299 -310 138 -373 -77 190 114 -91 361 -159 -377 159 -17 117 69
4157F9k01J36J51l66N09k65j34J93j29J40R2k69j6N0m3J77o9P6N5q6r9J79q9L
$$ 69 -132 4 155 -211 298 33 -101 92 -37 103 195 -74 -90 -40 -83 94 25 101 156 70 -29 150 61 64
4181F4J65m60L12K24m41K82j55Q2o0k36J74J61l00K07l3k7M4J27k22K35l28O1
$$ 64 229 -231 81 305 -136 146 -9 73 13 -223 -49 112 -188 19 -14 -41 3 130 -92 143 -185 -124
4203a24J87Q4k09J91j95j92K00q1p0l5K57J97m31K63L67m69l2K16k5ok5l1k46
$$ -124 63 147 -62 129 -66 -258 -58 -139 -209 -244 13 210 -221 42 409 -60 -92 124 99 93 68 37 -209
4226b09J81K7K27q7j55j25L41j69Q4k25M8P2j4j08J44j87J63p3L2K30l07j06M04
$$ -209 -28 -1 226 139 -16 -141 200 31 115 -110 -62 10 -4 -112 32 -155 8 -65 -33 197 -110 -216 188
4249A88j75j22M9J68k00K86m54L66k46J7J83L9k13K18k78L3K54m18N64k55j65
$$ 188 13 -109 -60 108 -92 194 -260 106 -140 -123 60 99 -114 104 -174 -141 113 -305 259 4 -161
4270a61K20J43l28L58j55j59K42k64n8L07k70m5J62k76K90m3M8K4N8J02J08q3
$$ -161 59 202 -126 232 77 -82 160 -104 -162 145 -125 -170 -8 -284 6 -37 11 35 93 195 303 220
4292B20j73k22J30K25R0m13J59O4m21M29j54O2M7j40r3K35j24MJ97l47L40j34
$$ 220 47 -175 -45 180 270 -143 16 80 -341 88 -66 -4 43 -97 -190 45 -79 -75 122 -225 115 -19
4314a9J0Q2J9j21N6J78j18k9k06J14J73o6J93q5r3K29n06J35M8j24o8L12k49J03
$$ -19 -9 73 92 -29 27 205 87 58 -148 -34 139 73 266 181 88 317 -189 -54 -6 -130 -198 114 -135 -32
4338c2L07l19J94J40j73q0k06n2K82k40R5L05k21m1J71m56N25P8l29j10J31O3
$$ -32 275 -44 150 290 117 37 -169 -221 61 -179 -84 221 0 -41 130 -326 199 277 -52 -162 -31 32
4360C2J68l69K58j63k26K61Q1n0j56L47m31L60J09l10L11k63r2M35l24k27M06
$$ 32 200 -169 89 -74 -300 -39 42 -8 -164 183 -248 112 221 -89 222 -41 -133 302 -22 -249 157
4381A57k22K49j62p7J59j03j93L85j58j02J82k47K73l1m04N09k89p4J93j34J12
$$ 157 -65 184 22 -55 104 1 -192 193 35 -67 115 -132 141 110 -294 215 -74 -148 45 -89 23
4402B3L26l48O2J3l87K50J74m75M18k39k59N47k38J01K51l24J88j14p8J43J10
$$ 23 349 1 63 76 -311 -61 113 -362 56 -183 -442 105 -133 -32 219 -105 83 -31 -109 34 144
4423A44j99k43O30l19m3K82l34K94j17j35J57m27K46J9K60k85J93k84L30k43J0
$$ 144 -55 -298 332 13 -30 252 -82 212 95 -40 117 -310 -64 -45 215 -70 123 -161 169 -74 -64
4444f4K47m23N46l22K76n1j36m65M81j7k41L23j38p0j08J16p9J33j80L89r3k03
$$ -64 183 -240 306 -16 260 209 73 -392 89 72 -169 154 16 -54 -162 -46 -125 8 -172 217 124 -79
4466g9J59J52k50K69k99l3K30o5k64K61l22L03J2m00N89j67j99n0J53j23M15m3
$$ -79 80 232 -18 251 -48 -81 149 84 -180 81 -241 62 74 -326 263 96 -103 -153 0 -123 292 249
4488B49l89N50n25K86q1j07K0R2l18L12o0J0L1j61J41R5j97j05K23j75L41j53
$$ 249 -140 410 -115 171 90 -17 3 95 -223 89 29 39 70 -91 50 145 -52 -157 66 -109 232 79
4510G9j03J20k19J70K91k11k35J53K67k98j2k4L71k17Q0j67m12K63J67J03k01
$$ 79 -24 96 -123 47 338 127 -108 45 312 14 2 -22 349 132 212 45 -367 -104 63 166 -35
4531c5J36m29J86K53j22J45j11q7M04m91K85j49nQ3K09n50J72K41l77L05j96J98
$$ -35 101 -328 -142 111 -11 134 23 -64 340 -151 134 -15 -20 63 272 -278 -106 135 -242 63 -133 65
4553F5oL8j34L7k41M45l8j34J79k23l30L55j48j22K73J74j01J29k46j4R8k91J34
$$ 65 59 97 -37 0 -241 204 166 32 211 -12 -342 13 -135 -257 16 190 89 218 -28 -42 56 -235 -101
4576a01J09r1J45n8m2J6j64J69J79j47k86L17k1J76j67j80L50o8k11R5j34J19
$$ -101 8 -83 62 4 -38 -22 -186 -17 162 15 -271 46 25 201 34 -146 204 136 -75 20 -114 5
4598EK05k95K45k70J17J53l3M7j32o0m0oj06m0j2P7J30N62n75J24J6k32K02r0
$$ 5 210 -85 160 -110 7 160 127 174 42 -18 -58 -64 -170 -210 -222 -145 -15 547 -28 96 112 -120 82 -8
4622hj55M26k29k74K71l19M53j54K6J60k15j84M07k77R8K22k79r5K46j93K16J02
$$ -8 -163 263 34 -240 31 -288 165 11 37 197 -18 -202 205 -72 26 248 -31 -126 120 -73 143 245
4644B45l37J80J6L7Q9m97J58L19m71J18N98o74J01J43L31Nl80j52L61j28k61M18
$$ 245 -92 88 104 141 230 -267 -109 210 -261 -143 455 -219 -118 25 356 361 -19 -171 190 62 -199 219
4666B19l11J61j46K03l7k29r7M60j52k79J15K45l12J88kO4l09J61K97j33l41j68
$$ 219 -92 69 -77 126 89 -140 -237 223 71 -208 -93 152 -160 28 26 90 -219 -58 239 106 -235 -403
4688d03M33j80J84j20L5K4J73j04k7j54J03L75n51j20L27j77L65rj62L61l04k73
$$ -403 30 -150 34 -86 -51 -27 146 42 15 -139 -36 339 -212 -332 -5 -182 183 174 12 373 69 -204
4710b04L38k8O3n1j44J04l67L29r0R5j80K36j70J73l19Q8K18j9o0L15m80p0K71
$$ -204 134 106 169 118 -26 78 -289 40 -50 45 -135 101 -69 104 -215 -127 91 72 12 327 -153 -223 48
4733D8k16M3K25j25J42J8j83LJ09j00K86j27l06K76j09q8K42j03K8j3k48K00k97
$$ 48 -168 -125 100 -25 117 135 -48 -45 64 -36 250 123 -183 93 -16 -104 138 35 63 50 -198 2 -295
4756b95M09K2k27J17J67m40J87J09R2j57L5j61K10M8n3q3J65j55J27k32J01J98
$$ -295 114 136 -91 26 193 -247 -60 49 141 -16 19 -142 68 116 63 -20 145 -10 117 -115 -14 184
4778A84l52j08M16m01L38j34J62m73L79j4j02J55r8J27j05N5J37j42o6J13k68
$$ 184 -168 -276 140 -261 77 -57 105 -368 11 -3 -105 50 -48 79 -26 29 166 24 -42 71 -197
4799a97N0M84n70K53j95L60J8j00j26k6j6L3Q8j78J07L4J31j51n7j34J11r1O1
$$ -197 -147 337 -233 20 -175 185 203 103 -23 -49 -65 -32 56 -122 -15 19 150 -1 -58 -192 -81 -172 -111
4822a11Q4j08J22j08o9J62k5L4j2k23l2L04K4l66K33m6K87K2m33N22l84J71L4
$$ -111 -27 -135 -13 -121 -190 -28 -53 -19 -31 -254 -286 18 42 -324 -91 -137 150 172 -261 261 -123 48 82
4845H2r7j06R7K45n03M07l91J88r7K11L26j09q7k71o6J70Q5j71k6J24n5L1j80
$$ 82 -15 -121 -24 221 -282 125 -266 -78 -175 36 362 253 166 -105 -171 -1 84 -87 -113 11 -44 -13 -193
4868a93M07l30K62j7m1j71P8L3j8J20n7j14Q6K09o26L71j53K08o4j02K2J78j61
$$ -193 214 -116 146 129 88 -83 -5 28 10 130 73 -41 45 254 -372 -1 -154 54 -10 -112 -90 88 -73
4891g3L34k59j63k0J21J65L5j6j61RK5kj01j37Q3K3J2J55J92k99J95m6j55q6J62
$$ -73 261 2 -161 -181 -60 105 140 124 -37 -28 -3 -5 -106 -243 -160 -137 -125 30 222 -77 118 72 -83 -169 -7
4916gN8J7j28j35K34jp7J14k07kK09q1Q8k25j6J71J9K22j0m74J75%j20J25k04
$$ -7 51 68 -60 -195 39 38 -39 75 -132 -134 75 -6 82 -143 -159 12 31 253 243 -231 -56 -56 -176 -51 -255
4941b55J92J11j36J34L7l32J66L99k22j65K69n18M58r9j10K46l68L48lk54J11
$$ -255 -63 48 -88 46 83 -249 -83 316 94 -71 198 -320 138 39 -71 175 -193 155 152 -102 9
4962IL00l77J20p2j14J86r1KkJ46n2J74k91J3P6k85M78m08J71K60k60J13p4P1
$$ 9 309 -68 52 -20 -134 52 -39 -37 -39 107 55 229 -62 -49 27 -258 220 -188 -17 243 -17 96 22 93
4986I3o7L2J27j22j08j33L16m4m40L90O2r9J72j79R4j24j1K12j87n4J98M6k20
$$ 93 26 58 185 63 -45 -178 138 94 -346 44 106 7 179 0 94 -30 -41 171 -16 -70 128 174 -46
5009d6J87l17O2M45k77k07K63j34j0J02j93J47O1k33J66j0q7J0j09j6J63O5K60
$$ -46 141 -176 -114 331 54 -153 110 -24 -34 68 -125 22 83 -150 16 6 -81 -71 -180 -196 -33 32 292
5032B92j29k24J96r8k7p9j15K71Mr8K44P1l66m8J14j76J70J83k54k0J68j18J49
$$ 292 163 -61 135 37 10 -69 -184 87 91 -7 237 308 -58 -106 8 -168 2 185 -69 -89 79 -39 110
5055A10k10j6M36m25J37J90m36K35m9q0K06p1j26J47OQ3J28m41J35J99j47L34
$$ 110 -100 -116 320 -105 32 222 -214 21 -28 -108 98 27 -99 48 54 137 265 -176 -41 158 11 345
5077C45n32j5K24J82rK28m56j56K27m5j82J52n6k14N16l40J44l5k57K10J57l22
$$ 345 -187 -202 22 204 195 423 -33 -189 38 -7 -189 -37 -93 -307 209 -131 13 -22 -279 -69 88 -234
5099b34N23k79l3K88l15K4J86j47J70k48o1K20l78L79K81o84K20J57N8j08J87
$$ -234 289 10 -23 265 -50 -26 160 13 183 -65 -126 94 -284 95 376 -308 -88 69 127 19 206
5120B06l24o7L05n0k66j1J60K55l09J95Q5k06J23l79L00J06p7j57K44j54J28j08
$$ 206 -118 -185 120 70 -196 -207 -47 208 -101 94 179 -27 96 -283 17 123 46 -111 133 -21 107 -1
$$ [...]
8191d5
##END NTUPLES=NMR FID
##END=
