##TITLE=1H_92-2025
 200.13MHz, CDCl3,
 8 sc
 
 8.8.2025
##JCAMPDX= 6.0         $$ Bruker NMR JCAMP-DX V2.0
##DATA TYPE= NMR FID
##DATA CLASS= NTUPLES
##ORIGIN= UXNMR, Bruker Analytische Messtechnik GmbH
##OWNER= pz
$$ XWIN-NMR		Version 3.5
$$ Fri Aug  8 13:59:56 2025 Russian Standard Time (UT+4h)  she@DPX200
##.OBSERVE FREQUENCY= 200.1313
##.OBSERVE NUCLEUS= ^1H
##.DELAY= (6, 6)
##.ACQUISITION MODE= SIMULTANEOUS
##.ACQUISITION SCHEME= undefined
##.AVERAGES= 8
##.DIGITISER RES= 18
##SPECTROMETER/DATA SYSTEM= spect
##.PULSE SEQUENCE= zg30
##.SOLVENT NAME= CDCl3
##.SHIFT REFERENCE= (INTERNAL, CDCl3, 0, 14.3821)
##AUDIT TRAIL= $$ (NUMBER, WHEN, WHO, WHERE, WHAT)
$$ ##TITLE= Audit trail, XWIN-NMR		Version 3.5
$$ ##JCAMPDX= 5.01
$$ ##ORIGIN= Bruker BioSpin GmbH
$$ ##OWNER= she
$$ F:/spectra/data/she/nmr/H-C/1/audita.txt
$$ ##AUDIT TRAIL=  $$ (NUMBER, WHEN, WHO, WHERE, WHAT)
(   1,<2025-08-08 13:58:49.42 +0400>,<she>,<DPX200>,
      <created by zg, POWCHK disabled, PULCHK disabled
       configuration hash MD5:
       00 E9 B6 7A A2 85 ED C7 34 08 36 98 17 FE 4E 26
       data hash MD5: 16K
       AD 12 FA 8C 8E B5 F6 7C AB 94 F6 AB AF 77 32 F3>)
$$ ##END=
$$ 
$$ hash MD5
$$ 8B 5F B9 63 1B DE 33 40 A5 27 1F 0E A6 CC E5 D3
##$RELAX= 
##$RELAX= 
##$RELAX= 
##$RELAX= 
##$RELAX= 
##$RELAX= 
$$ Bruker specific parameters
$$ --------------------------
##$DU= <F:/spectra>
##$EXPNO= 1
##$NAME= <H-C>
##$PROCNO= 1
##$TYPE= <nmr>
##$USER= <she>
##$AMP= (0..31)
100 100 100 100 100 100 100 100 100 100 100 100 100 100 100 100 100 100 
100 100 100 100 100 100 100 100 100 100 100 100 100 100 
##$AQSEQ= 0
##$AQ_mod= 1
##$AUNM= <au_zg>
##$AUTOPOS= <>
##$BF1= 200.13
##$BF2= 200.13
##$BF3= 200.13
##$BF4= 200.13
##$BF5= 200.13
##$BF6= 200.13
##$BF7= 200.13
##$BF8= 200.13
##$BYTORDA= 1
##$CFDGTYP= 0
##$CFRGTYP= 5
##$CHEMSTR= <none>
##$CNST= (0..31)
1 1 145 1 1 1 1 1 1 1 1 1 1 1 1 1 1 1 1 1 1 1 1 1 1 1 1 1 1 1 1 1 
##$CPDPRG= <>
##$CPDPRG1= <>
##$CPDPRG2= <>
##$CPDPRG3= <>
##$CPDPRG4= <mlev>
##$CPDPRG5= <mlev>
##$CPDPRG6= <mlev>
##$CPDPRG7= <mlev>
##$CPDPRG8= <mlev>
##$CPDPRGB= <>
##$CPDPRGT= <>
##$D= (0..31)
0 0.7 0 0 0 0 0 0 0 0 0 0.03 0 0 0 0 0 0 0 0 0 0 0 0 0 0 0 0 0 0 0 0 
##$DATE= 1754647128
##$DBL= (0..7)
120 120 120 120 120 120 120 120 
##$DBP= (0..7)
150 150 150 150 150 150 150 150 
##$DBP07= 0
##$DBPNAM0= <>
##$DBPNAM1= <>
##$DBPNAM2= <>
##$DBPNAM3= <>
##$DBPNAM4= <>
##$DBPNAM5= <>
##$DBPNAM6= <>
##$DBPNAM7= <>
##$DBPOAL= (0..7)
0.5 0.5 0.5 0.5 0.5 0.5 0.5 0.5 
##$DBPOFFS= (0..7)
0 0 0 0 0 0 0 0 
##$DE= 6
##$DECBNUC= <off>
##$DECIM= 32
##$DECNUC= <off>
##$DECSTAT= 4
##$DIGMOD= 1
##$DIGTYP= 9
##$DL= (0..7)
0 120 120 120 120 120 120 120 
##$DP= (0..7)
150 150 150 150 150 150 150 150 
##$DP07= 0
##$DPNAME0= <>
##$DPNAME1= <>
##$DPNAME2= <>
##$DPNAME3= <>
##$DPNAME4= <>
##$DPNAME5= <>
##$DPNAME6= <>
##$DPNAME7= <>
##$DPOAL= (0..7)
0.5 0.5 0.5 0.5 0.5 0.5 0.5 0.5 
##$DPOFFS= (0..7)
0 0 0 0 0 0 0 0 
##$DQDMODE= 0
##$DR= 18
##$DS= 0
##$DSLIST= <SSSSSSSSSSSSSSS>
$$ [...]
##$SUBNAM0= <"">
##$SUBNAM1= <"">
##$SUBNAM2= <"">
##$SUBNAM3= <"">
##$SUBNAM4= <"">
##$SUBNAM5= <"">
##$SUBNAM6= <"">
##$SUBNAM7= <"">
##$SUBNAM8= <"">
##$SUBNAM9= <"">
##$SW= 18.0517328524113
##$SWIBOX= (0..15)
0 0 2 0 0 0 0 0 0 0 0 0 0 0 0 0 
##$SW_h= 3612.71676300578
##$TD= 16384
##$TD0= 1
##$TE= 0
##$TE2= 300
##$TE3= 300
##$TEG= 300
##$TL= (0..7)
0 120 120 120 120 120 120 120 
##$TP= (0..7)
150 150 150 150 150 150 150 150 
##$TP07= 0
##$TPNAME0= <>
##$TPNAME1= <>
##$TPNAME2= <>
##$TPNAME3= <>
##$TPNAME4= <>
##$TPNAME5= <>
##$TPNAME6= <>
##$TPNAME7= <>
##$TPOAL= (0..7)
0.5 0.5 0.5 0.5 0.5 0.5 0.5 0.5 
##$TPOFFS= (0..7)
0 0 0 0 0 0 0 0 
##$TUNHIN= 0
##$TUNHOUT= 0
##$TUNXOUT= 0
##$USERA1= <user>
##$USERA2= <user>
##$USERA3= <user>
##$USERA4= <user>
##$USERA5= <user>
##$V9= 5
##$VALIST= <valist>
##$VCLIST= <CCCCCCCCCCCCCCC>
##$VD= 0
##$VDLIST= <DDDDDDDDDDDDDDD>
##$VPLIST= <PPPPPPPPPPPPPPP>
##$VTLIST= <TTTTTTTTTTTTTTT>
##$WBST= 1024
##$WBSW= 4
##$XGAIN= (0..3)
0 0 0 0 
##$XL= 0
##$YL= 0
##$YMAX_a= 191737
##$YMIN_a= -290398
##$ZGOPTNS= <>
##$ZL1= 120
##$ZL2= 120
##$ZL3= 120
##$ZL4= 120
##$ABSF1= 10
##$ABSF2= 0
##$ABSG= 5
##$ABSL= 3
##$ALPHA= 0
##$AQORDER= 0
##$ASSFAC= 0
##$ASSFACI= 0
##$ASSFACX= 0
##$ASSWID= 0
##$AUNMP= <proc_1d>
##$AZFE= 0.1
##$AZFW= 0.1
##$BCFW= 1
##$BC_mod= 2
##$BYTORDP= 1
##$COROFFS= 0
##$CY= -3
##$DATMOD= 1
##$DC= 2
##$DFILT= <>
##$DTYPP= 0
##$F1P= 0
##$F2P= 0
##$FCOR= 0.5
##$FTSIZE= 0
##$FT_mod= 4
##$GAMMA= 1
##$GB= 0.15
##$INTBC= 1
##$INTSCL= 1
##$ISEN= 128
##$LB= 0.25
##$LEV0= 0
##$LPBIN= 0
##$MAXI= 10000
##$MC2= 0
##$MEAN= 0
##$ME_mod= 0
##$MI= 1.114404
##$NCOEF= 0
##$NC_proc= 0
##$NLEV= 6
##$NOISF1= 3.799351
##$NOISF2= 2.8
##$NSP= 1
##$NTH_PI= 0
##$NZP= 0
##$OFFSET= 14.38212
##$PC= 1
##$PHC0= -1558.083
##$PHC1= 10.7923
##$PH_mod= 1
##$PKNL= yes
##$PPARMOD= 0
##$PSCAL= 0
##$PSIGN= 0
##$REVERSE= no
##$SF= 200.129724274929
##$SI= 16384
##$SIGF1= 3
##$SIGF2= 2
##$SINO= 400
##$SIOLD= 16384
##$SREGLST= <1H.CDCl3>
##$SSB= 0
##$STSI= 0
##$STSR= 0
##$SW_p= 3205.1282051282
##$SYMM= 0
##$S_DEV= 0
##$TDeff= 0
##$TDoff= 0
##$TI= <>
##$TILT= no
##$TM1= 0
##$TM2= 0
##$TOPLEV= 0
##$USERP1= <user>
##$USERP2= <user>
##$USERP3= <user>
##$USERP4= <user>
##$USERP5= <user>
##$WDW= 1
##$XDIM= 8192
##$YMAX_p= 0
##$YMIN_p= 0
$$ End of Bruker specific parameters
$$ ---------------------------------
##NTUPLES= NMR FID
##VAR_NAME=  TIME,          FID/REAL,        FID/IMAG
##SYMBOL=    X,             R,               I
##VAR_TYPE=  INDEPENDENT,   DEPENDENT,       DEPENDENT
##VAR_FORM=  AFFN,          ASDF,            ASDF
##VAR_DIM=   8192,          8192,            8192
##UNITS=     SECONDS,       ARBITRARY UNITS, ARBITRARY UNITS
##FACTOR=    0.0002768,     1,               1
##FIRST=     0,             0,               0
##LAST=      2.2672688,     0,               0
##MIN=       0,             -290398,         0
##MAX=       2.2672688,     191737,          0
$$ Real data points
##PAGE= N=1
##DATA TABLE= (X++(R..R)), XYDATA
$$ [...]
$$ plain form
2031 -1298 -2003 1774 -253 -1606 1083 392 -265 -747 -159 1227 -1252 -538 2253 -999 -1332 2029 -317
2048 -317 -1174 1226 805 111 -200 4 648 -1532 -724 1532 -1305 -972 1487 -906 -788 987 158 559
2066 559 219 50 715 -1111 -825 1486 -857 -337 1702 -600 -432 454 -561 261 -228 -573 838 -1024
2084 -1024 -1319 974 -910 -250 1532 -226 148 636 -424 639 -154 -600 1284 -376 -1127 1008 -654
2101 -654 -756 1145 101 400 152 -447 611 -753 -1016 1427 -248 -739 1246 -510 -685 787 84
2118 84 487 -121 -724 592 -1077 -1665 1042 -583 -923 1238 -144 -845 535 77 584 -237 -317 1184
2136 1184 -716 -1306 1540 -166 -619 1630 -52 -671 185 -265 123 -496 -422 1249 -811 -1150 1592
2153 1592 -675 -706 1674 287 -421 42 -305 123 -451 -263 1378 -903 -1148 1129 -913 -716 1550
$$ packed form
2031a298p05L777k027j353K689o91o57m82N88J386k479P14K791l252l33L361k346
2048c17q57K400m21o94l11K04O44k180Q08K256k837L33K459k393J18J775q29M01
2066E59l40j69O65j826K86K311k343N20K039k302J68Q86j015Q22m89l45J411j862
2084a024k95K293j884O60J782j758L74M88j060J063p93m46J884j660p51K135j662
2101f54j02J901j044K99k48n99J058j364k63K443j675m91J985j756j75J472p03
2118H4M03o08o03J316j669n88K707j625l40K161j382p01J380m58N07q21q0J501
2136A184j900n90K846j706m53K249j682o19Q56m50L88o19P4J671k060l39K742
2153A592k267l1K380j387p08M63l47M28n74J88J641k281k45K277k042J97K266
$$ plain form
2170 1550 183 -257 121 -557 22 -563 -552 1413 -265 -475 1375 -799 -800 1526 -46 271 523 -191
2188 -191 146 -871 -886 1102 -569 -400 1316 -885 -952 637 -159 380 672 -126 700 -316 -562 1013
2206 1013 -447 -170 1501 -449 -502 592 -611 -9 201 -214 365 -256 -763 860 -524 -419 1230
2223 1230 -199 -252 628 -434 169 259 -281 821 -82 -476 632 -931 -693 940 -307 60 698 -580
2241 -580 289 -90 -289 832 -394 -569 788 -658 -430 895 -181 138 554 -686 198 -100 -708 473
2259 473 -385 -803 687 -873 -460 717 -508 368 629 -115 679 4 -382 686 -296 -467 754 -462
2277 -462 -291 782 -242 369 474 -471 535 -299 -724 616 -730 -728 595 -397 -332 832 -116 339 330
2296 330 -346 512 -609 -822 462 -861 -541 973 -373 -219 803 -195 205 203 -318 562 5 -300 736
$$ packed form
2170A550j367m40L78o78N79n85J1J965j678k10J850k174jK326j572L17K52p14
2188a91L37j017j5J988j671J69J716k201o7J589p96N39K92p98Q26j016k46J575
2206A013j460K77J671j950n3J094j203O02K10m15N79o21n07J623j384J05J649
2223A230j429n3Q80j062O03R0n40J102r03l94J108j563K38J633j247L67O38j278
2241e80Q69l79j99J121j226j75J357j446K28J325j076L19M16j240Q84k98o08J181
2259D73q58m18J490j560M13J177j225Q76K61p44P94o75l86J068r82j71J221j216
2277d62J71J073j024O11J05r45J006q34m25J340j346KJ323r92O5J164r48M55r
2296C30o76Q58j121k13J284j323L20J514j346J54J022r98M00kn21Q80n57l05J036
$$ plain form
2315 736 -609 -118 1005 -481 227 949 -334 105 86 -606 -153 -539 -431 289 -917 -461 858 -786
2333 -786 194 643 -734 177 632 -505 35 -244 -367 570 -374 57 991 -569 583 548 -958 114
2351 114 72 -768 78 -123 -110 558 -380 573 765 -535 692 534 -795 363 431 -959 193 -40 -265
2370 -265 254 -497 323 206 -754 378 136 -970 634 143 -956 502 247 -199 419 229 277 156 -540
2389 -540 593 -116 -764 572 -155 -842 577 45 -618 708 130 136 162 -502 633 -330 -406 783 -389
2408 -389 -612 934 -23 -572 669 -198 -179 69 -469 153 -558 -258 466 -509 -320 1215 -264 -440 763
2427 763 -204 -145 208 -74 167 -134 -29 711 -436 -239 1109 -802 -330 1002 -505 -198 478 -261 -2
2446 -2 -122 36 794 -376 336 730 -648 -44 892 -640 -386 612 -376 -62 207 91 279 -593 50 345
$$ packed form
2315G36j345M91J123j486P08P22j283M39j9o92M53l86J08P20j206M56J319j644
2333g86R80M49j377R11M55j137N40k79j23R37r44M31R34j560J152l5j506J072
2351A14m2q40Q46k01J3O68r38R53J92j300J227j58j329J158O8j390J152k33k25
2370b65N19p51Q20j17r60J132k42j106J604m91j099J458k55m46O18j90M8j21o96
2389e40J133p09o48J336p27o87J419n32o63J326n78OK6o64J135r63p6J189j172
2408c89k23J546r57n49J241q67J9K48n38O22p11L00P24r75J89J535j479j76J203
2427G63r67N9L53k82K41l01J05P40j147J97J348j911M72J332j507L07O76p39K59
2446bj20J58P58j170P12L94j378O04R36j532K54R98r88L14K69j16J88q72O43K95
$$ plain form
2466 345 -831 45 633 -632 3 691 -308 158 290 15 291 -431 -41 306 -912 208 493 -681
2484 -681 298 529 -521 78 144 -343 308 -199 450 191 -554 395 612 -635 514 450 -459 272 -168 -510
2504 -510 141 -159 138 305 -569 186 -2 -597 455 -18 -195 840 162 -667 401 -186 -99 459 -117
2523 -117 431 377 -417 471 -359 -498 435 -109 -442 398 -385 -279 300 -140 514 448 -192 532 -307 -370 685
2544 685 -366 -66 697 -521 -228 445 -333 130 215 10 425 -350 -245 310 -595 -123 951 -255 144
2563 144 450 -464 15 180 20 172 -486 -176 342 -719 119 655 -611 115 324 -725 43 -108 33
2582 33 206 -294 158 276 -456 72 634 -423 136 458 -464 -178 48 -195 265 -146 -226 174 -557 192
2602 192 529 -442 377 422 -491 62 -142 -199 91 -262 160 364 -495 43 430 -600 229 341 -655 -15
$$ packed form
2466C45j176Q76N88j265O35O88r99M66J32k75K76p22L90L47j218J120K85j174
2484f81R79K31j050N99O6m87O51n07O49k59p45R49K17j247J149o4r09P31m40l42
2504e10O51l00K97J67q74P55j88n95J052m73j77J035o78q29J068n87Q7N58n76
2523a17N48n4p94Q88q30j39R33n44l33Q40p83J06N79m40O54o6o40P24q39o3J055
2544F85j051L00P63j218K93O73p78M63Q5k05M15p75J05N55r05M72J074j206L99
2563A44L06r14M79J65j60J52o58L10N18j061Q38N36j266P26K09j049P68j51J41
2582C3J73n00M52J18p32N28N62j057N59L22r22K86K26k43M60m11q0M00p31P49
2602A92L37r71Q19M5r13N53k04n7K90l53M22K04q59N38L87j030Q29J12r96O40
$$ plain form
2622 -15 -65 -573 364 -164 358 503 -90 53 221 -511 279 172 -161 460 -170 -216 144 -433 163 554 -531
2643 -531 58 176 -764 -114 72 -382 352 -90 -34 345 -356 96 541 -257 387 318 -670 79 -198 -355 560
2664 560 33 -374 227 -517 -209 421 -146 214 520 -563 234 -155 -113 377 63 148 466 -298 -287 66 -706
2685 -706 -21 265 -247 307 53 -160 417 -176 21 457 -169 -104 479 -386 288 172 -241 421 -76 21 381
2706 381 -50 4 452 -161 -235 370 -525 166 182 -189 508 138 -141 201 -132 -87 288 -516 -130 355 -482
2727 -482 245 79 -198 381 -121 -24 340 -409 16 505 -246 177 316 -258 507 387 -186 457 -53 -39 291
2748 291 -252 146 125 -557 74 115 -373 197 34 -299 217 -204 -147 88 -296 -8 130 -274 51 147 -200
2769 -200 461 -56 -469 120 -157 12 299 -23 164 182 -382 387 237 -187 497 -27 1 414 -134 -42 323
$$ packed form
2622a5n0n08R37n28N22J45n93J43J68p32P90j07l33O21o30m6L60n77N96L91j085
2643e31N89J18r40O50J86m54P34m42N6L79p01M52M45p98O44o9r88P49k77j57R15
2664E60n27m07O01p44L08O30n67L60L06j083P97l89M2M90l14Q5L18p64J1L53p72
2685g06O85K86n12N54k54k13N77n93J97M36o26O5N83q65O74j16m13O62m97R7L60
2706C81m31N4M48o13p4O05q95O91J6l71O97l70k79L42l33M5L75q04L86M85q37
2727d82P27j66k77N79n02R7L64p49M25M89p51M23J39n74P65j20n73O43n10J4L30
2748B91n43L98k1o82O31M1m88N70j63l33N16m21N7K35l84K88J38m04L25R6l47
2769b00O61n17m13N89k77J69K87l22J87J8n64P69j50m24O84n24K8M13n48R2L65
$$ plain form
2790 323 -181 -96 19 -95 284 -85 -176 226 -67 -225 244 -416 -343 185 -368 66 85 -293 94 -122 -161 126
2812 126 -193 -184 323 -385 5 283 -354 -6 254 31 300 144 -189 222 -114 -119 410 -247 156 194 -354 15
2834 15 421 -141 117 86 -106 97 -245 157 109 -476 120 537 -414 61 79 -549 242 146 -156 89 -83 -99
2856 -99 146 -114 93 238 -324 108 -28 -579 145 152 -189 92 -93 66 129 -134 255 158 -320 242 205 -188
2878 -188 158 -84 -197 182 -128 168 67 -237 251 -25 -377 141 -206 -316 92 38 -170 267 -81 -250
2898 -250 152 -126 54 -165 -124 210 -108 -261 386 111 -189 250 -203 20 58 11 74 56 -25 330 -227 -108
2920 -108 372 -89 -140 308 -89 -91 -72 -207 -43 43 -3 221 -60 93 263 -273 -276 384 -263 -293 211 -140 -45
2943 -45 174 100 254 -65 195 375 20 14 171 -383 -151 85 -161 -2 -21 -179 -18 -122 -253 65 -249 364
$$ packed form
2790C23n04Q5J15j14L79l69r1M02k93j58M69o60P3N28n53M34J9l78L87k16l9K87
2812A26l19RN07p08L90K78o37L48K60k23K69j56l33M11l36nN29o57M03L8n48L69
2834A5M06n62K58l1j92K03l42M02m8n85N96M17r51M75J8o28P91r6l02K45j72j6
2856i9K45k60K07J45n62M32j36n51P24Pl41K81j85J59O3k63L89r7m78N62l7l93
2878a88L46k42j13L79l10K96j01l04M88k76l52N18l47j10M08n4k08M37l48j69
2898b50M02k78J80k19M1L34l18j53O47k75l00M39m53K23L8m7O3j8q1L55n57J19
2920a08M80m61n1M48l97kJ9j35J64Q6m6K24k81J53J70n36lO60o47l0N04l51R5
2943d5K19p4J54l19K60J80l55oJ57n54K32K36k46J59j9j58J61j04j31L18l14O13
$$ plain form
2965 364 223 -196 128 173 -186 -155 141 -126 37 -57 188 197 -173 11 83 -292 60 155 -118 -56 84 -178 66
2988 66 -2 -138 -108 -238 -154 28 -166 87 -48 -196 148 5 -186 200 -46 157 -31 -290 15 93 -448 5
3010 5 103 -67 437 39 -69 -86 -60 -52 -15 -144 13 54 -67 100 -205 -275 1 18 -130 158 -8 17 48 -88
3034 -88 -72 -160 -354 222 166 45 367 -288 -240 84 -222 -256 158 -154 237 85 -62 193 -32 60 59 -8 -46 151
3058 151 -279 101 239 -74 -8 -76 -104 182 66 -43 208 -158 -189 171 -144 24 252 -119 61 95 -282 51
3080 51 -183 22 43 -161 17 289 -303 -1 25 -275 -61 169 -309 100 202 -33 158 48 62 89 16 68
3102 68 169 -355 52 101 -96 111 -130 192 248 -13 -147 175 -154 -115 161 -205 -33 114 60 296 -163 176
3124 176 393 18 -26 533 -177 54 -62 -204 113 -13 -182 33 12 30 205 -141 -90 251 -112 82 27 -217
$$ packed form
2965C64j41m19L24M5l59L1K96k67J63r4K45Rl70J84P2l75L52R5k73O2J40k62K44
2988F6o8j36L0j30Q4J82j94K53j35j48L44j43j91L86k46K03j88k59L05P8n41M53
3010ER8j70N04l98j08j7K6QL7j29J57M1j21J67l05p0K76J7j48K88j66K5L1j36
3034h8J6q8j94N76n6j21L22o55M8L24l06l4M14l12L91j52j47K55k25R2jo7l8J97
3058A51m30L80J38l13O6o8k8K86j16j09K51l66l1L60l15J68K28l71J80L4l77L33
3080E1k34K05K1k04J78K72n92L02K6l00K14K30m78M09J02k35J91j10J4K7p3N2
3102F8J01n24M07M9j97K07k41L22N6k61j34L22l29L9K76l66J72J47n4K36m59L39
3124A76K17l75m4N59p10K31j16j42L17j26j69K15k1J8J75l46N1L41l63J94n5k44
$$ plain form
3146 -217 -8 100 -157 182 9 -126 275 -150 36 152 39 -87 -60 -150 110 -58 -153 103 102 -77 -19 -273
3168 -273 19 -33 -88 -216 -95 19 33 70 -82 -32 35 -232 77 -298 -107 -60 -124 47 133 45 50 -63 -162 461
3192 461 -99 -104 186 -71 143 16 63 165 53 -79 223 8 20 37 -105 -56 233 -85 137 294 267 116
3214 116 10 98 193 -103 -88 258 -52 -26 -92 146 -108 38 -295 304 190 -110 72 23 -126 140 107 -17
3236 -17 214 -30 126 74 47 92 -164 -95 -27 -65 -107 101 -45 58 173 -299 -52 -22 15 104 -87 -240 150 -5
3260 -5 -3 -19 -247 110 313 15 -146 139 61 111 -174 -315 55 -153 -10 143 58 -25 130 51 58 258 -222 -96
3284 -96 -21 108 234 156 -51 -87 -170 91 79 109 6 83 -157 62 -71 -52 213 -79 108 147 -55 30 200 -32
3308 -32 -8 116 124 183 107 -116 87 160 165 -125 36 -207 49 -83 46 6 -65 124 -70 8 50 39 34 98 -66 87
$$ packed form
3146b17K09J08k57L39j73j35M01m25J86J16j13j26K7r0K60j68r5K56jj79N8k54
3168b73K92n2n5j28J21J14J4L7j52N0O7k67L09l75J91M7o4J71Q6q8Nj13r9O23
3192D61n60nK90k57K14j27M7J02j12j32L02k15J2J7j42M9K89l18K22J57k7j51
3214A16j06Q8R5k96J5L46l10K6o6K38k54J46l33N99j14l00J82m9j49K66l3j24
3236a7K31k44J56n2k7M5k56O9O8l8m2K08j46J03J15m72K47L0L7Q9j91j53L90j55
3260eKj6k28L57K03k98j61K85p8N0k85j41L70k08J43J53q5q3J55p9PK00m80J26
3284i6P5J29J26p8k07l6q3K61j2L0j03P7k40K19j33J9K65k92J87L9k02Q5J70k32
3308c2K4J24QN9p6k23K03P3Nk90J61k43K56j32J29m0p1J89j94P8M2j1nO4j64J53
$$ plain form
3334 87 -83 -91 -49 119 19 231 -272 -54 201 -80 -68 34 -148 -190 177 -233 34 15 -10 99 -154 27 120
3357 120 28 6 294 142 83 165 156 -10 85 -31 124 -46 -212 154 -100 35 44 -135 -135 248 -250 97 97 -102
3381 -102 -197 -79 -105 -33 78 -71 224 7 -149 203 64 0 148 42 8 16 162 80 -25 -146 91 -92 31
3404 31 261 -22 180 71 -129 -67 77 -185 34 23 238 39 -98 1 73 -139 23 40 -257 100 -95 23
3426 23 91 -43 -59 69 75 70 108 -22 92 153 -69 -77 -62 -93 63 131 48 -157 65 56 17 -132 183 -16 -74 42
3452 42 -5 -1 174 148 -5 -90 28 120 -95 -46 57 131 -176 -19 86 -162 -59 -65 -75 63 -95 284 65 205
3476 205 188 115 -61 21 11 -32 -31 102 39 154 -203 -67 -133 255 -55 20 -120 44 -119 -19 10 9 102 101 97 70
3502 70 114 -63 -159 -129 -140 37 -111 13 47 -160 -83 97 3 -17 70 -152 138 -235 -79 4 -134 -116 263 30
$$ packed form
3334H7j70qM2J68j00K12n03K18K55k81J2J02j82m2L67m10K67j9k5J09k53J81R3
3357A20r2k2K88j52n9Q2rj66R5j16J55j70j66L66k54J35Rj79%L83m98L47%j99
3381a02r5J18k6P2J11j49K95k17j56L52j39o4J48j06l4QJ46q2j05j21K37j83J23
3404C1K30k83K02j09k00O2J44k62K19j1K15j99j37R9P2k12J62J7k97L57j95J18
3426B3O8j34j6J28OnL8j30J14O1k22qJ5l1J56O8q3k05K22rl9j49L15j99n8J16
3452D2m7MJ75k6j53q5J18R2k15M9J03P4l07J57J05k48J03oj0J38j58L79k19J40
3476B05j7p3j76Q2j0m3JJ33o3J15l57J36o6L88l10P5j40J64j63J00K9jR3jmk7
3502G0M4j77r6L0j1J77j48J24L4k07P7J80r4k0Q7k22K90l73J56Q3j38J8L79k33
$$ plain form
3526 30 48 25 -92 85 -56 -71 -140 -47 -123 57 85 96 147 -22 -133 124 67 -114 -107 57 20 53 259 -84 -36
3551 -36 8 84 -24 17 -7 21 85 95 -105 -181 162 -50 105 -18 105 -3 57 23 119 38 -73 148 -166 -24
3575 -24 131 -109 -118 171 -72 225 -51 67 77 34 57 -118 -310 64 116 5 35 -92 -226 7 165 -92 -11
3598 -11 -183 68 101 41 -138 13 125 244 28 -310 79 68 66 80 -50 54 76 -254 -207 -92 -137 39 44 -193
3622 -193 -228 36 103 94 -143 120 59 -37 76 72 129 -32 75 19 136 -12 -56 -128 -33 29 -172 -234 85 253 -16
3647 -16 -46 -10 -14 75 -15 252 -4 264 25 173 90 47 60 48 195 63 -30 -48 -138 -212 89 -120 -2 11 -93
3672 -93 58 85 -28 -9 30 -180 -3 -106 -124 -20 -121 218 126 -54 23 236 -123 -242 23 -9 -33 187 109
3695 109 -206 -99 141 -45 -65 39 23 -52 155 85 -22 -93 -103 75 -73 76 75 -18 -35 0 -140 -176 -112 -23 63
$$ packed form
3526C0J8k3j17J77j41j5o9R3p6J80K8J1N1j69j11K57n7j81PJ64l7L3K06l43M8
3551c6M4P6j08M1k4K8O4J0k00p6L43k12J55j23J23j08O0l4R6q1j11K21l14J42
3575b4J55k40rK89k43K97k76J18J0m3K3j75j92L74N2j11L0j27j34K33J58k57Q1
3598a1j72K51L3o0j79J51J12J19k16l38L89j1kJ4j30J04K2l30M7J15m5J76Nk37
3622a93l5K64O7rk37K63o1r6J13mN7j61J07n6J17j48m4p2R5O2k01o2L19J68k69
3647a6l0L6mQ9r0K67k56K68k39J48q3m3J3j2J47j32r3j8r0p4L01k09J18J3j04
3672i3J51K7j13J9L9k10J77j03j8J04j01L39r2j80P7K13l59j19K65l2k4K20p8
3695A09l15J07K40j86k0J04j6p5K07p0j07p1j0J78j48J49jr3j7L5j40l6O4Q9Q6
$$ plain form
3720 63 162 23 182 127 -221 189 128 -221 146 -82 -58 59 -80 43 -59 -40 -37 -55 -109 -67 30 11 -112 19
3744 19 -1 -26 -130 22 222 -106 106 179 -83 -63 337 12 46 253 -216 -144 209 137 -117 -4 108 152 -27
3767 -27 99 97 -186 -52 -49 122 93 -88 73 210 -21 113 18 -48 -7 65 -21 211 179 230 -87 78 74 131 -67
3792 -67 154 203 -243 9 -185 -210 79 -61 -121 -142 75 162 139 -86 56 -1 -232 326 -66 -238 -108 124 -6
3815 -6 111 48 101 121 -28 -42 48 -117 -3 163 -44 224 -148 122 -52 -68 -89 -57 76 -32 60 -151 181 65
3839 65 -55 -38 81 -94 -34 -88 81 -37 -216 54 111 123 75 -63 36 131 -407 38 90 -72 13 66 11 18 -119
3864 -119 -174 -5 5 -70 111 -85 -98 112 82 229 23 99 -119 255 -229 -176 -158 -176 101 -46 -7 47 -266 65
3888 65 73 -22 -94 53 -33 57 98 109 118 81 201 169 -135 51 114 -11 -145 -23 -12 -20 15 24 1 253 -150 51 -206
$$ packed form
3720F3R9j39J59n5l48M10o1l49L67k28K4J17j39J23j02J9Lj8n4M2R7j9j23J31
3744A9k0k5j04J52K00l28K12P3k62K0M00l25L4K07m69P2L53p2k54J13J12M4j79
3767b7J26kk83J34LJ71k9j81J61J37k31J34r5o6M1P2q6K32l2N1l17J65mN7j98
3792f7K21M9m46K52j94k5K89j40o0k1K17Q7k3k25J42n7k31N58l92j72J30K32j30
3815fJ17o3N3K0j49j4R0j65J14J66k07K68l72K70j74j6k1L2J33j08R2k11L32j16
3839F5j20J7J19j75O0n4J69j18j79K70N7J2m8j38R9R5n38M45N2j62Q5N3n5Pj37
3864a19n5J69J0p5J81j96j3K10l0J47k06P6k18L74m84N3J8j8K77j47L9N4l13L31
3888F5Qr5p2J47q6R0M1J1Rl7J20l2l04J86O3j25j34J22J1qL5Rk3K52m03K01k57
$$ plain form
3915 -206 -90 -7 -170 51 40 47 -194 1 24 -82 -78 42 30 -52 -8 145 -57 -83 -25 31 -84 -57 -133 23 -241
3940 -241 -13 63 -193 128 218 -180 -13 77 -33 195 -59 -168 41 -28 -120 -47 -282 220 -158 -15 22 -10 -161
3963 -161 6 -263 85 190 79 -80 300 -54 -67 -71 -86 42 -165 -160 -81 -133 123 129 -184 -141 -24 121 -14 39
3987 39 -75 168 -105 -197 100 -89 -19 185 -83 5 142 -37 87 169 -72 131 -163 -64 -82 -38 -77 248 -205
4010 -205 -109 -22 29 70 53 -124 -109 -192 -27 73 -11 -2 158 -74 -154 159 -11 47 96 -151 152 6 -47 -83 -165
4035 -165 -13 173 -97 -8 -147 -275 207 137 -191 -74 -102 31 48 -150 21 6 35 41 235 -255 121 201 4
4058 4 43 86 -44 153 -104 -28 113 -291 81 64 -215 24 197 36 -32 46 311 73 -243 292 -198 -1 11
4081 11 143 -203 -26 35 16 83 -213 113 -9 -185 162 147 -338 51 286 -25 66 17 3 194 109 -31 -181
$$ packed form
3915b06J16Q3j63K21j1Pk41J95K3j06MJ20j2q2M4J53k02k6N8N6j15K7p6J56k64
3940b41K28P6k56L21R0l98J67R0j10K28k54j09K09o9r2P3k35N02l78J43L7l2j51
3963a61J67k69L48J05j11j59L80l54j3mj5J28k07NP9n2K56Ol13M3J17J45j35N3
3987C9j14K43k73r2K97j89P0K04k68Q8J37j79J24Q2k41K03k94R9j8M4l9L25m53
4010b05R6Q7N1M1j7j77J5q3J65J00q4RJ60k32q0L13j70N8M9k47L03j46n3l6q2
4035a65J52J86k70Q9j39j28M82p0l28J17k8J33J7j98J71j5K9OJ94m90L76Q0j97
4058DL9M3j30J97k57P6J41m04L72j7k79K39J73j61o8P8K65k38l16N35m90J97J2
4081A1J32l46J77O1j9O7k96L26j22j76L47j5m85L89K35l11R1m9j4J91q5j40j50
$$ plain form
4104 -181 -139 -125 1 -150 -14 -87 -304 77 79 36 117 -84 -158 -30 -97 52 108 -157 63 -164 -285 32 75 -277
4128 -277 114 -72 12 125 -133 52 392 -390 -4 190 96 9 -4 73 -8 -84 177 54 -248 -83 45 -2 34
4151 34 17 -91 -84 -85 62 -46 5 249 12 -192 100 15 -61 47 44 -103 90 11 112 152 -43 72 144 125 96
4176 96 257 -428 20 88 -63 -51 163 -72 48 17 155 -241 -22 286 78 -194 -177 13 42 98 6 130 -11
4199 -11 -102 29 52 -251 26 86 58 -12 -48 -81 228 115 259 -29 -298 149 -9 -192 55 24 -111 114 -128
4222 -128 93 133 -61 22 -176 -49 148 107 -90 152 79 76 156 -43 101 -157 -236 125 28 -64 46 89 -36 51
4246 51 94 -200 23 -158 -6 66 -314 -43 40 -39 309 100 -48 16 -142 -28 109 -32 49 156 -16 -23 -45
4269 -45 -135 17 132 4 273 -118 -28 -104 -84 116 5 -161 47 17 -122 123 -61 -171 192 -135 -7 142
$$ packed form
4104a81M2J4J26j51J36p3k17L81Km3Q1k01p4J28o7J49N6k65K20k27j21L17M3l52
4128b77L91j86Q4J13k58J85L40p82L86J94r4q7j3P7q1p6K61j23l02J65J28m7L6
4151C4j7j08PjJ47j08N1K44k37k04K92q5p6J08lj47J93p9J01M0j95J15P2j9k9
4176I6J61o85M48O8j51J2K14k35J20l1J38l96K19L08k08k72J7J90K9N6r2J24j41
4199a1r1J31K3l03K77O0k8p0l6l3L09j13J44k88k69M47j58j83K47l1j35K25k42
4222a28K21M0j94Q3j98J27J97m1j97K42p3lQ0j99J44k58p9L61r7r2J10M3j25Q7
4246E1M3k94K23j81J52P2l80K71Q3p9L48k09j48O4j58J14J37j41Q1J07j72pk2
4269d5r0J52J15j28K69l91R0p6K0K00j11j66K08l0j39K45j84j10L63l27J28J49
$$ plain form
4291 142 9 123 42 -23 -56 155 -108 63 8 -86 183 60 107 14 -63 83 110 -203 17 135 5 146 105
4314 105 -171 -8 -46 26 8 -18 159 117 19 305 -222 -69 22 137 -255 -24 -208 3 -95 -49 -7 70 -196 128
4338 128 -79 -248 157 11 -92 181 -27 -122 192 -235 9 7 -107 245 4 -104 248 76 -112 -99 -106 -24
4360 -24 77 -118 149 81 -11 -7 130 -53 160 -40 -109 50 47 -165 47 -45 -21 185 128 -200 -107 85 -16 -143
4384 -143 -230 200 -45 -181 203 -19 180 186 92 174 -154 28 82 -142 41 18 -141 196 25 -78 48 103 16
4407 16 18 -5 -209 -43 -42 2 104 66 36 -5 -131 -153 197 -131 124 -162 -12 63 -100 -85 -9 -107 -147 -22 -51 18
4433 18 28 -143 -4 -8 -130 133 -251 223 17 -78 46 173 -242 -20 78 70 -49 40 -132 31 -51 -113 182 -71
4457 -71 61 223 -51 -10 22 -23 60 -123 -56 -144 -217 141 17 33 -118 -8 -178 200 42 -142 164 -126 -28
$$ packed form
4291A42j33J14q1o5l3K11k63J71n5r4K69j23M7r3p7J46K7l13K20J18j30J41m1
4314A05k76J63l8P2j8k6J77m2r8K86n27J53R1J15l92K31j84K11r8M6M2P7k66L24
4338A28k07j69M05j46j03K73k08r5L14m27K44kj14L52k41j08L52j72j88J3pQ2
4360b4J01j95K67o8r2MJ37j83K13k00o9J59lk12K12r2K4K06n7l28R3J92j01j27
4384a43q7M30k45j36L84k22J99Or4Q2l28J82N4k24J83k3j59L37j71j03J26N5q7
4407A6Kk3k04J66JM4J02l8l0m1j26k2L50l28K55k86J50P5j63J5P6r8m0J25k9O9
4433A8J0j71J39mj22K63l84M74k06r5J24J27m15K22R8qj19Q9j72J63q2o2K95k53
4457g1J32J62k74M1L2m5Q3j83O7q8p3L58j24J6j51J10j70L78j58j84L06k90R8
$$ plain form
4480 -28 161 -137 0 82 -52 155 -15 26 89 23 -154 201 0 -277 17 21 -45 -181 -5 158 -13 10 157
4503 157 157 -194 173 193 -33 -1 -127 18 -4 -59 -26 -84 -145 167 -1 -44 245 28 56 119 -101 39 -18 -144
4527 -144 246 28 60 135 -106 -162 -25 -180 -22 48 -4 105 72 -3 181 -10 63 115 33 -7 206 78 -88 14
4551 14 -145 89 -63 -207 58 236 -134 162 275 -176 131 222 109 -52 -300 33 -72 -19 299 -180 -213
4572 -213 134 50 -78 115 -101 -99 88 -33 -38 31 -252 3 -31 -308 256 -50 73 95 -113 -35 32 -112 394
4595 394 -62 -402 157 -124 -202 67 -65 -137 72 134 27 -2 -169 142 -120 -100 248 96 155 152 75 20 121
4618 121 19 148 -197 10 156 -83 -174 152 43 -196 202 -109 -21 -19 -111 -13 -163 42 151 -13 -322 189
4640 189 155 3 312 19 -71 -258 -49 146 -371 -253 252 -97 -96 259 97 -210 -40 123 131 98 19 172 -88
$$ packed form
4480b8J89k98J37Q2j34K07j70M1O3o6j77L55k01k77K94Mo6j36J76J63j71K3J47
4503A57%l51L67K0k26L2j26J45k2n5L3n8o1L12j68m3K89k17K8O3k20J40n7j26
4527a44L90k18L2P5k41n6J37j55J58P0n2J09l3p5J84j91P3N2q2m0K13j28j66J02
4551A4j59K34j52j44K65J78l70K96J13m51L07R1j13j61k48L33j05N3L18m79l3
4572b13L47q4j28J93k16KJ87j21nO9k83K55l4k77N64l06J23K2k08P8O7j44N06
4595C94m56l40N59k81p8K69j32p2K09O2j07k9j67L11k62K0L48j52N9lp7n5J01
4618A21j02J29l45K07J46k39r1L26j09k39L98l11Q8Kr2R8j50K05J09j64l09N11
4640A89l4j52L09k93r0j87K09J95n17J18N05l49JL55j62l07J70J63Ql3p9J53k60
$$ plain form
4663 -88 -151 122 -281 -276 8 -26 -171 82 -141 -128 23 -24 198 -209 -172 98 -20 -118 126 -55 131 51 -259
4686 -259 18 -17 -85 128 -95 -231 315 126 -183 81 -133 -91 -48 -160 155 -104 73 298 -188 -125 69 116
4708 116 -215 199 101 -28 28 218 99 -49 124 42 -24 -65 287 7 -121 268 -65 121 -259 -90 287 137
4730 137 -208 229 -214 -237 170 -83 -148 -36 -143 51 -67 92 233 -130 49 313 103 -137 114 -215 -184
4751 -184 140 224 -56 -1 -68 159 -33 -164 39 29 -46 111 12 -173 84 72 27 -216 101 91 -78 72 160
4774 160 -114 20 174 -32 -8 -24 -144 1 -29 13 144 139 67 277 -137 -123 197 22 -217 143 177 -88 -30
4797 -30 31 149 58 -53 242 -285 -205 113 -2 -121 223 -171 274 266 73 199 -102 102 166 -339 -53 171
4819 171 -1 48 104 -146 124 34 -120 112 34 15 47 46 -196 94 156 -150 -100 8 41 160 -72 311 -65 -115
$$ packed form
4663h8o3K73m03NK84l4j45K53k23J3J51m7K22m07L7K70j18r8K44j81J86q0l10
4686b59K77l5o8K13k23j36N46j89l09K64k14M2M3j12L15k59J77K25m86O3J94M7
4708A16l31M14r8j29N6J90j19j48J73q2o6m1L52k80j28L89l33J86l80J69L77j50
4730A37l45M37m43k3M07k53o5J12j07J94j18J59J41l63J79K64k10k40K51l29L1
4751a84L24Q4k80N5o7K27j92j31K03j0p5J57r9j85K57j2m5k43L17j0j69J50Q8
4774A60k74J34J54k06K4j6j20J45l0M2J31np2K10m14J4L20j75k39L60L4k65N8
4797c0O1J18r1j11K95n27Q0L18j15j19L44l94M45qj93J26l01K04O4n05K86K24
4819A71j72M9N6k50K70r0j54K32p8j9L2jk42K90O2l06N0J08L3J19k32L83l76n0
$$ plain form
4843 -115 281 -93 141 153 -197 51 1 -15 81 -119 -146 10 -88 -232 117 -156 56 218 -193 346 -62 -118
4865 -118 84 202 -20 286 -110 4 285 -49 51 44 80 72 -61 -76 320 -139 -15 95 -125 -86 228 -159
4887 -159 54 69 -51 36 -66 -226 200 36 -190 85 -14 -58 29 -113 56 6 -228 226 -107 -61 226 -29
4909 -29 91 143 -285 -82 102 -69 72 265 -118 195 7 -51 38 -294 -119 17 -11 -76 173 -109 51 -76
4931 -76 -22 63 68 -101 346 0 -102 26 -148 37 -24 -19 41 324 -216 46 83 -33 -97 -161 -125 187 -310 3
4955 3 102 -292 117 116 -31 3 -7 -190 2 -218 65 54 -123 -98 270 -275 213 96 -128 249 -134 109 262
4978 262 28 190 175 -45 -4 14 -246 -63 80 81 204 168 -142 69 -175 -152 267 -95 31 9 -1 318 -38
5001 -38 -53 60 -168 -16 188 -71 9 61 -145 -189 -36 -30 -101 63 181 219 -84 -110 294 90 -7 193 -7 23
$$ packed form
4843a15L96l74K34J2l50K48n0j6R6k00k7J56r8j44L49k73K12J62m11N39m08n6
4865a18K02J18k22L06l96J14K81l34J00pL6qj33j5L96m59J24J10k20L9L14l87
4887a59K13J5j20Q7j02j60M26j64k26K75r9m4Q7j42J69n0k34M54l33M6K87k55
4909b9J20N2m28K03J84j71J41J93l83L13j88n8Q9l32J75J36k8o5K49k82J60j27
4931g6N4Q5Nj69M47l46j02J28j74J85o1NO0K83n40K62L7j16o4o4L6L12m97L13
4955CR9l94M09jj47L4j0j83J92k20K83j1j77K5L68n45M88j17k24L77l83K43J53
4978B62k34J62j5k20M1J8k60J83J43JJ23l6l10K11k44K3M19l62J26k2j0L19l56
5001c8j5J13k28J52K04k59Q0N2k06m4J53Op1J64J18L8l03k6M04k04r7K00k00L0
$$ plain form
5025 23 311 224 24 -52 -266 123 -223 -45 328 -268 -12 211 95 -172 140 70 -21 -123 14 288 -276 -38
5047 -38 149 -101 -118 207 4 -64 -117 -9 223 -122 117 485 -283 222 236 -122 -176 333 -154 88 -16 208
5069 208 139 -163 -81 281 -221 3 146 -55 22 54 -11 13 83 -45 274 -174 349 80 -257 -128 330 10
5091 10 -35 59 108 29 95 45 274 -409 -67 370 -163 -108 108 -7 -148 95 -5 -67 -38 -97 140 28 -146 338
5115 338 -244 -157 229 -86 -37 -48 -193 69 78 144 344 -54 28 327 -307 -193 198 -51 -11 191 74 -90 -119
5138 -119 206 230 -18 -61 361 150 -203 99 -71 -130 86 170 361 -191 -21 216 -131 -316 77 -185 -147 316
5160 316 -153 -25 176 168 20 -258 -81 350 -253 -236 154 -77 -21 35 125 91 -238 89 78 -232 -9 369 -398
5183 -398 -177 246 -176 -110 88 15 -55 -31 -185 292 -257 81 372 -443 -54 522 -114 -99 132 -126 150 50
$$ packed form
5025B3K88q7k00p6k14L89l46J78L73n96K56K23j16k67L12p0r1j02J37K74n64K38
5047c8J87k50j7L25k03o8n3J08K32l45K39L68p68N05J4l58n4N09m87K42j04K24
5069B08o9l02Q2L62n02K24J43k01P7L2o5K4P0j28L19m48N23k69l37J29M58l20
5091A0m5R4M9p9O6n0K29o83L42M37n33N5K16j15j41K43j00o2K9n9K37j12j74M84
5115C38n82Q7L86l15M9j1j45K62RO6K00l98Q2K99o34J14L91k49M0K02j17j64k9
5138a19L25K4k48m3M22k11l53L02j70n9K16Q4J91n52J70K37l47j85L93k62L8M63
5160C16m69J28K01qj48k78J77M31o03J7L90k31N6N6R0l4l29L27j1l10K23L78p67
5183c98K21M23m22O6J98p3p0K4j54M77n49L38K91q15L89N76o36J5K31k58K76j00
$$ plain form
5205 50 -14 -56 -238 8 57 -282 -111 108 -280 -197 -82 97 -143 -15 -35 157 -140 51 364 -235 45 34
5227 34 58 -45 -11 -86 -38 -218 -111 -104 -244 1 264 4 -35 267 -95 48 -16 35 174 -184 -128 265 -350 -217
5251 -217 329 -187 -107 286 -87 45 -96 34 315 5 -25 52 -180 123 208 -187 -65 -116 16 -124 -141 95
5273 95 131 -35 -110 169 -10 -61 306 -36 -100 145 -59 210 -68 -85 149 -369 154 410 -226 -262 120 -107
5295 -107 99 37 -38 4 -352 -124 4 -67 257 136 -354 -209 175 -175 -48 281 -57 8 -26 -5 193 -328
5317 -328 138 128 -170 13 178 -131 -8 152 -16 -26 -52 66 -36 -167 208 240 -393 -78 317 -269 -50
5338 -50 -28 -2 171 -103 151 77 -198 -32 304 -339 -22 269 -178 -151 149 -53 -46 -77 20 158 -23 196 251
5361 251 -170 -5 -350 -374 199 84 -51 -113 -164 -32 -51 -291 -14 64 -248 -63 206 -35 -23 132 -128 79
$$ packed form
5205E0o4m2j82K46M9l39J71K19l88Q3J15J79k40J28k0J92k97J91L13n99K80j1
5227C4K4j03L4p5M8j80J07Pj40K45K63k60l9L02l62J43o4N1J39l58N6L93o15J33
5251b17N46n16Q0L93l73J32j41J30K81l10l0P7k32L03Q5l95J22n1J32j40j7K36
5273I5L6j66p5K79j79n1L67l42o4K45k04K69k78j7K34n18N23K56o36l6L82k27
5295a07K06o2p5M2l56K28J28p1L24j21m90J45L84l50J27L29l38O5l4K1J98n21
5317c28M66j0k98J83J65l09J23J60j68j0k6J18j02j31L75L2o33L15L95n86K19
5338e0K2K6J73k74K54p4k75J66L36o43L17K91m47K7L00k02Pl1R7J38j81K19N5
5361B51m21J65l45k4N73j15j35o2n1J32j9k40K77P8l12J85K69k41J2J55k60K07
$$ plain form
5383 79 16 35 208 -294 120 249 -185 63 101 -70 56 -87 -94 113 -250 9 378 -58 -40 169 49 294
5405 294 198 -182 -72 -41 -99 196 -309 2 20 -60 130 205 -193 -310 -101 -143 248 42 84 98 -329 36 -42
5428 -42 -349 -63 68 -54 64 -50 -76 153 -111 13 337 -173 75 -43 -304 -38 127 -181 107 29 -206
5449 -206 121 -392 188 259 -165 -118 -167 -98 132 280 -63 201 -73 -30 159 -26 -109 146 -145 72 271 -26
5471 -26 256 4 -19 212 -32 -152 -115 -247 -228 -103 -134 95 274 -211 93 58 -64 346 -97 34 -155 -346
5493 -346 109 209 -201 308 154 -47 -46 -24 -285 191 -166 -99 49 -102 -14 38 -51 35 90 -228 151 45 -245
5516 -245 337 50 -67 118 -174 40 201 -242 -27 99 -220 83 -46 -18 -176 -213 -194 168 -38 78 128
5537 128 15 9 382 -284 3 -86 65 147 -191 64 308 -368 240 390 -188 4 304 -327 -15 -38 95 44
$$ packed form
5383G9o3J9J73n02M14J29m34K48L8j71J26j43pK07l63K59L69m36J8K09j20K45
5405B94r6l80J10L1n8K95n05L11J8q0J90P5l98j17K09m2L91k06M2J4m27L65p8
5428d2l07K86J31j22J18j14k6K29k64J24L24n10K48j18k61K66J65l08K88p8k35
5449b06L27n13N80P1m24M7m9O9K30J48l43K64k74M3J89j85q3K55k91K17J99k97
5471b6K82k52k3K31k44j20L7j32J9J25l1K29J79m85L04l5j22M10m43J31j89j91
5493c46M55J00m10N09j54k01JK2k61M76l57O7J48j51Q8N2q9Q6N5l18L79j06k90
5516b45N82k87j17J85k92K14J61m43K15J26l19L03j29K8j58l7J9L62k06J16N0
5537A28j13oL73o66K87q9J51Q2l38K55K44o76O08J50n78J92L00o31L12k3J33n1
$$ plain form
5559 44 -75 -49 43 -210 183 7 -466 8 -249 -334 51 -237 -46 21 -412 245 199 -253 14 169 -220 -1
5581 -1 75 -200 37 7 -75 -31 13 200 181 -301 33 385 -245 90 131 -223 68 -100 105 121 -246 127 113 -396
5605 -396 359 -37 -490 20 12 -176 87 -69 -98 68 -235 45 66 -356 37 203 -492 43 80 -163 -31 -137
5627 -137 246 32 -374 248 -19 -57 350 154 -361 -81 176 -140 -118 -176 277 300 -200 339 118 -284 -124
5648 -124 245 -325 87 105 19 46 -80 187 42 -517 164 214 -268 178 -21 -153 -82 101 58 -15 -155 188
5670 188 192 -328 80 235 -294 132 162 -373 -140 -125 -48 83 -307 56 170 -232 155 74 -223 -44 157 -43
5692 -43 56 16 -57 188 -408 151 169 -357 138 267 -577 119 128 -232 67 9 170 -41 -311 267 331 -204 234
5715 234 273 -492 -106 -27 156 89 -3 168 55 -354 354 73 -244 84 273 -346 87 -2 -61 -139 27 398
$$ packed form
5559D4j19K6R2k53L93j76m73M74k57q5L85k88J91O7m33O57m6m52K67J55l89K19
5581aP6k75K37l0q2M4M4J87j9m82L34L52o30L35M1l54K91j68K05J6l67L73j4n09
5605c96P55l96m53N10qj88K63j56k9J66l03K80K1m22L93J66o95N35L7k43J32j06
5627a37L83k14m06O22k67l8M07j96n15K80K57l16K2n8M53K3n00N39k21m02J60
5648a24L69n70M12J8q6K7j26K67j45n59O81N0m82M46j99j32P1J83m3p3j40L43
5670A88Mn20M08J55n29M26L0n35K33J5P7J31l90L63J14m02L87q1k97J79K01k00
5692d3R9m0p3K45n96N59J8n26M95J29q44O96Rl60K99n8J61k11k70N78O4n35M38
5715B34L9p65L86P9J83o7r2J71j13m09P08k81l17L28J89o19M33q9n9p8J66L71
$$ plain form
5737 398 0 -338 103 35 -418 92 246 -41 227 2 -81 -33 -239 169 -96 -96 294 464 -437 237 170 -169
5759 -169 21 20 87 -182 -161 167 -299 -154 213 108 -150 335 -108 70 256 -31 126 -17 -210 96 1 -117
5781 -117 561 101 -91 -44 46 -14 -71 11 4 -23 -180 73 142 -366 32 21 -322 141 8 -38 -1 81 70 221 -284
5806 -284 125 45 -214 334 7 -230 -101 -123 136 -45 -50 174 -58 15 106 -33 -361 77 125 -105 104 98 15
5829 15 172 -172 73 91 -211 86 11 -289 -172 -98 -247 117 -18 244 -42 -197 257 65 -272 382 263
5850 263 -147 -38 74 -8 23 -172 3 -86 19 292 44 -244 97 -98 -474 239 -36 -7 126 65 100 185
5872 185 -21 98 46 -12 235 -99 -100 69 -160 -181 12 29 185 -54 -168 160 56 -382 453 26 -240 88
5894 88 233 122 240 90 -162 100 -394 -17 136 -123 214 -4 -168 452 15 17 -7 -127 52 177 -218
$$ packed form
5737C98l98l38M41o8m53N10J54k87K68k25q3M8k06M08k65%L90J70r01O74o7l39
5759a69J90jO7k69K1L28m66J45L67j05k58M85m43J78J86k87J57j43j93L06r5j18
5781a17O78m60j92M7R0o0n7Q2pk7j57K53O9n08L98j1l43M63j33m6L7Q2j1J51n05
5806b84M09q0k59N48l27k37J29k2K59j81nK24k32P3R1j39l28M38M8k30K09oq3
5829A5J57l44K45J8l02K97p5l00J17P4j49L64j35K62k86j55M54j92l37O54j19
5850B63m10J09J12q2L1j95J75q9J05K73k48k88L41j95l76P13k75K9J33o1L5Q5
5872A85k06J19n2n8K47l34jJ69k29k1J93J7J56k39j14L28j04m38Q35m27k66L28
5894H8J45j11J18j50k52K62m94L77J53k59L37k18j64O20m37Kk4j20J79J25l95
$$ plain form
5915 -218 380 34 -122 118 155 -320 135 -10 -201 260 -290 -118 116 -111 77 191 -31 -69 -75 -104 388 -228
5937 -228 -144 133 -16 202 180 -299 19 143 -175 305 -186 -30 127 74 -65 159 -61 122 4 -179 -2
5958 -2 -80 -107 271 -108 -116 240 266 78 270 71 156 183 -129 252 69 130 55 -2 -37 74 -24 -167 221 -226 144
5983 144 -198 35 289 166 -14 178 -7 91 148 -306 56 -21 -18 379 -3 -370 1 -54 -156 514 -55 -202
6005 -202 198 -180 -12 9 -456 142 59 -58 179 43 109 61 -160 -237 -87 95 70 28 -19 201 143 -103 152
6028 152 184 -296 228 104 -2 97 -95 -2 75 -51 168 -49 -345 277 27 43 92 108 17 -5 -325 147 63
6051 63 -46 296 130 15 247 122 -105 310 -89 21 -46 -19 121 -84 -199 230 -118 -410 192 199 197 240 -26
6074 -26 68 -71 -86 151 -109 -25 -49 140 -242 456 48 30 138 -110 11 3 -254 249 132 -238 215 146 -56
$$ packed form
5915b18N98l46j56K40L7m75M55j45j91M61n50J72K34k27J88J14k22l8ok9M92o16
5937b28Q4K77j49K18k2m79L18J24l18M80m91J56J57n3j39K24k20J83j18j83J77
5958bp8k7L78l79qL56K6j88J92j99Q5K7l12L81j83O1p5n7l5J11r8j43L88m47L70
5983A44l42K33K54j23j80J92j85R8N7m54L62p7LL97l82l67L71n5j02O70n69j47
6005b02M00l78J68K1m65N98q3j17K37j36O6m8k21p7J50J82k5m2m7K20n8k46K55
6028A52L2m80N24j24j06R9j92R3P7j26K19k17k96O22k50J6M9J6r1k2l20M72q4
6051F3j09L42j66j15K32j25k27M15l99J10o7K7J40k05j15M29l48k92O02PkM3k66
6074b6R4j39j5K37k60Q4k4J89l82O98m08j8J08k48J21qk57N03j17l70M53o9k02
$$ plain form
6097 -56 29 -155 -78 -86 -66 -31 -114 -133 307 46 -142 263 -23 -120 199 148 25 -115 240 177 -102 -266 81 -126
6121 -126 -357 237 6 -160 112 131 -140 -345 -64 89 12 -207 430 -102 -365 339 -199 -131 182 -29 6
6142 6 159 -188 154 -152 -162 274 -31 -64 547 -283 -441 -218 -105 102 41 9 -15 -114 -11 475 -95 -282 344
6165 344 122 -375 -82 78 -25 -205 -50 47 34 -230 266 -335 -115 386 104 -211 189 32 14 -139 5
6186 5 311 -160 -165 324 -317 -106 175 124 -142 188 -92 -5 -93 -108 395 18 -122 272 124 -304 287 -69 -51
6209 -51 252 -64 4 -154 -46 174 -296 -115 531 -110 -258 -35 -176 -143 111 127 189 -145 113 223 -114 -10
6231 -10 435 150 -184 241 12 -77 -39 -238 4 -6 -179 224 -105 -243 445 71 -153 80 56 151 -14 115
6253 115 116 -83 -340 322 -212 -203 259 -149 -54 186 -145 10 -22 72 139 -249 -66 328 -62 -145 473 -120 38
$$ packed form
6097e6Q5j84P7qK0L5q3j9M40k61j88M05k86r7L19n1j23j40L55o3k79j64L47k07
6121a26k31N94k31j66K72J9k71k05K81J53p7k19O37n32k63P04n38O8L13k11L5
6142FJ53l47L42l06j0M36l05l3O11q30j58K23J13K07o1l2k4r9J03M86n70j87O26
6165C44k22m97K93J60j03j80J55R7j3k64M96o01K20N01k82l15M00j57j8j53J44
6186EL06m71nM89o41K11K81n1k66L30k80Q7q8j5N03l77j40L94j48m28N91l56J8
6209e1L03l16O8j58J08K20m70J81O46o41j48K23j41L3K54J6O2l34K58J10l37J04
6231a0M45k85l34M25k29q9L8j99K42j0j73M03l29j38O88l74k24K33k4R5j65J29
6253A15Jj99k57O62n34RM62m08R5K40l31J55l2R4O7l88J83L94l90q3O18n93J58
$$ plain form
6276 38 240 39 105 -53 195 249 -129 -215 361 -38 -423 -44 -41 77 27 176 28 -1 -9 115 -196 -225 296 -162
6300 -162 -256 416 -125 -107 360 8 -175 -34 -98 -39 -132 -209 239 -187 -99 357 -105 -81 227 136 -22 28 7 22
6324 22 -199 -179 161 101 -194 364 -152 -18 -42 -147 44 -133 -44 339 -71 33 443 -92 243 217 -234 12
6346 12 142 -73 109 65 -47 109 -210 23 202 31 -7 198 -257 157 240 -68 84 22 -146 179 -60 -17
6368 -17 32 -232 -12 133 -88 73 -108 -123 88 -4 -141 198 -293 -100 92 -182 269 220 -175 -29 67 -213
6390 -213 210 82 -277 241 -25 -177 107 -82 65 153 -276 113 -30 -126 276 -36 -134 140 -39 -121 249
6411 249 111 54 292 5 126 63 -171 384 109 -57 295 -254 -11 155 -75 -129 41 -158 170 190 29
6432 29 210 19 -37 476 -75 -183 266 -317 41 105 -346 102 -232 -92 193 -131 -196 50 -131 -60 269 -112
$$ packed form
6276C8K02k01O6j58K48N4l78q6N76l99l85L79LJ18n0J49j48k9qJ24l11k9N21m58
6300a62r4O72n41J8M67l52j83J41o4N9r3p7M48m26Q8M56m62K4L08r1j58N0k1J5
6324B2k21K0L40o0k95N58n16J34k4j05J91j77Q9L83m10J04M10n35L35k6m51K46
6346A2J30k15J82m4j12J56l19K33J79j71l8K05m55M14Q3l08J52o2j68L25k39M3
6368a7M9k64K20J45k21J61j81j5K11r2j37L39m91J93J92k74M51m9l95J46R6k80
6390b13M23j28l59N18k66j52K84j89J47Q8m29L89j43r6M02l12r8K74j79q2L70
6411B49j38n7K38k87J21o3k34N55k75j66L52n49K43J66k30n4J70j99L28K0j61
6432B9J81j91n6N13n51j08M49n83L58O4m51M48l34J40K85l24o5K46j81P1L29l81
$$ plain form
6454 -112 142 40 -222 62 20 -255 179 -36 -139 335 -333 188 121 -157 66 72 -114 269 83 49 260 -155
6476 -155 109 187 -51 -4 114 -14 -18 51 -303 292 -133 -125 138 -60 -126 173 -307 -113 207 -29 101 -122 -156
6499 -156 263 -90 -124 157 64 113 334 -431 -21 -64 -195 304 -8 -149 308 99 49 162 -133 41 204 -89
6521 -89 262 90 -333 124 50 -187 36 -222 -140 205 -37 -35 323 -23 -54 29 -92 101 -165 -113 238 -142 -37
6544 -37 282 -160 -144 156 -105 -112 -95 -267 233 -188 5 15 -115 -50 348 -252 -14 246 -88 120 -39 -120 320
6567 320 -162 -146 373 -199 -19 367 -214 34 16 -219 -57 -95 -225 182 -172 171 353 -409 -184 521 -55
6588 -55 -249 276 -197 33 73 82 -26 -111 26 307 -302 11 228 -29 -203 91 -23 98 119 -321 48 -193
6610 -193 175 254 11 -113 313 -143 74 263 -122 32 33 -21 235 -242 19 319 -424 9 329 -184 -9
$$ packed form
6454a12K54j02k62K84m2k75M34k15j03M74o68N21o7k78K23Oj86L83j86l4K11m15
6476a55K64P8k38M7J18j28mO9l54N95m25QK63j98o6K99m80J94L20k36J30k23l4
6499a56M19l53l4K81r3M9K21p65M10m3j31M99l12j41M57k09n0J13k95J74J63k93
6521h9L51j72m23M57p4k37K23k58Q2L45k42KL58l46l1Q3j21J93k66N2L51l80J05
6544c7L19m42J6L00k61pJ7j72N00m21J93J0j30O5L98o00K38K60l34K08j59q1M40
6567C20m82J6N19n72J80L86n81K48j8k35J62l8j30M07l54L43J82p62K25P05n76
6588e5j94N25m73K30M0Rj08q5J37K81o09L13K17k57j74K94j14J21K1m40L69k41
6610a93L68P9k43j24M26m56K17J89l85J54Jn4K56m77K61L00p43M33L20n13J75
$$ plain form
6631 -9 77 -110 268 -89 61 248 -80 -60 270 -362 -138 179 -218 0 250 -55 108 -87 117 248 -293
6652 -293 -90 372 -239 -257 153 -258 203 221 20 -91 -267 2 275 -247 -121 491 -188 -98 286 -77 222
6673 222 -20 114 50 -148 25 323 -238 17 270 -107 41 112 -144 -49 151 -207 72 -216 38 55 -292
6694 -292 -88 324 -185 -59 267 -209 24 -95 -12 273 -135 76 214 -422 -225 170 -251 -126 69 -44
6714 -44 -131 -197 -145 260 -278 -52 292 -285 119 122 49 -104 208 -146 -128 -211 175 24 -313 151 372 -140 -96
6737 -96 255 -198 -58 239 -133 -38 179 230 282 -363 -14 166 -330 -147 324 -114 -16 156 87 93 57 -208 300
6760 300 -395 -78 243 -266 -147 516 -338 109 143 61 44 -182 -142 135 6 -254 65 -488 -128 85 -216
6781 -216 -47 26 162 255 11 51 252 -199 75 213 -157 60 240 -158 -5 -44 -113 7 24 -125 436 7
$$ packed form
6631iQ6j87L78l57J50J87l28K0L30o32K24L17l97K18K50l05J63j95K04J31n41
6652b93K03M62o11j8M10m11M61J8k01j11j76K69K73n22J26O12o79R0L84l63K99
6673B22k42J34o4j98J73K98n61K55K53l77J48P1k56R5K00l58K79k88K54J7l47
6694b92K04M12n09J26L26m76K33j19Q3K85m08K11J38o36J97L95m21J25J95j13
6714d4q7o6N2M05n38K26L44n77M04Lp3j53L12l54J8q3L86j51l37M64K21n12M4
6737i6L51m53J40K97l72R5K17N1N2o45L49J80m96J83M71m38R8J72o9Ol6k65N08
6760C00o95L17L21n09J19O63q54M47L4q2j7k26M0K77j29k60L19n53L60K13l01
6781b16J69P3J36R3k44M0K01m51K74J38l70K17J80l98J53l9o9J20J7j49N61m29
$$ plain form
6803 7 -168 100 -266 -84 43 -23 149 -97 113 275 -193 -41 52 34 -42 51 19 16 87 -75 -323 -60 15 377
6827 377 -166 29 -57 -227 70 263 -128 231 77 -216 -11 64 11 269 -387 -64 205 -195 -4 303 -43
6848 -43 131 -121 2 256 -57 13 204 -14 -157 31 -80 60 408 -179 -121 89 -10 187 -322 73 235
6869 235 -263 158 113 -94 64 -28 -16 -19 -132 -68 45 -67 -10 175 -197 239 246 -355 -151 213 149 164 35 -278
6893 -278 318 -173 -100 117 -96 -73 245 -380 93 69 96 156 -156 -48 137 28 -41 211 -14 -37 151 21
6915 21 11 62 67 168 -142 -91 157 115 16 -35 -434 164 156 -341 116 258 -115 72 -127 -195 126 -282 -54 133
6939 133 -429 -6 124 -160 -11 102 -233 232 -65 -85 297 -144 -131 200 -133 134 38 -240 8 -174 -100
6960 -100 153 -49 -70 64 -34 -26 457 -162 101 125 -55 80 103 54 69 -156 -43 200 -292 62 177 -333 6
$$ packed form
6803Gj75K68l66J82J27o6J72k46K10J62m68J52R3j8p6R3l2lP1j62k48K63P5L62
6827C77n43J95q6j70K97J93l91L59j54k93K05P5n3K58o56L23K69m00J91L07l46
6848d3J74k52J23K54l13P0J91k18j43J88j11J40L48n87N8K10r9J97n09L95J62
6869B35m98M21m5k07J58r2J2lj13O4J13j12N7J85l72M36Po01K04L64o4J5j29l13
6893b78N96m91P3K17k13K3L18o25M73k4K7O0l12J08J85j09o9K52k25k3J88j30
6915B1j0N1NJ01l10N1K48m2r9n1l99N98qm97M57J42l73J87j99o8L21m08K28J87
6939A33n62M23J30k84J49J13l35M65k97k0L82m41J3L31l33K67r6k78K48j82P4
6960a00K53k02k1J34r8QM83o19K63K4j80J35K3m9J5k25J13K43m92L54J15n10L39
$$ plain form
6983 6 199 -117 107 -20 50 259 -27 33 -58 -186 155 124 -92 34 -86 -68 8 -24 -26 173 -212 -36 64 -133
7007 -133 -74 75 -110 -276 202 -205 344 -98 -18 99 -237 -53 197 -250 85 239 -244 -38 147 -177 -39
7028 -39 -85 -175 67 -164 -106 205 -19 40 76 -201 112 -30 -138 78 -46 -125 37 -207 93 46 -153 84 -20
7051 -20 -249 107 -85 62 105 -104 34 288 -65 141 18 -262 152 198 -440 -102 -25 -193 59 -267 -48
7072 -48 -23 -93 165 56 -109 85 24 -62 62 -25 -96 21 -274 -133 273 -131 127 174 -325 91 98 -189 210
7095 210 43 -271 122 -172 93 295 -14 110 29 -153 172 118 -105 181 99 125 21 -473 -27 410 -178
7116 -178 -17 6 -120 69 111 -27 48 -38 42 108 -138 26 185 62 111 -6 -318 198 -35 -126 -37 -222 149
7139 149 216 -236 39 86 -326 -9 155 -67 -4 99 -128 -145 -222 208 28 -118 171 9 -342 -50 -6 -308
$$ packed form
6983FJ93l16K24j27P0K09k86O0r1j28L41l1k16J26j20J8P6l2kJ99l85J76J00j97
7007a33N9J49j85j66M78m07N49m42Q0J17l36J84K50m47L35J54m83K06J85l24J38
7028c9m6r0K42k31N8L11k24N9L6k77L13j42j08K16j24p9J62k44L00m7j99K37j04
7051b0k29L56j92J47M3k09J38K54l53K06j23k80M14M6o38L38P7j68K52l26K19
7072d8K5p0K58j09j65J94o1q6J24q7p1J17k95J41M06m04K58M7m99M16Pk87L99
7095B10j67l14L93k94K65K02l09J24q1j82L25n4k23K86q2K6j04m94M46M37n88
7116a78J61K3j26J89M2j38P5q6Q0O6k46J64J59j23M9j17l12N16k33r1Q9j85L71
7139A49O7m52K75M7m12L17J64k22O3J03k27j7p7M30j80j46K89j62l51K92M4l02
$$ plain form
7161 -308 -5 -19 30 -113 -123 116 113 -4 287 112 -81 121 167 -81 -34 -44 -17 103 -317 -38 112 -235 213
7184 213 123 -99 480 173 -169 83 -52 48 60 -293 40 335 -255 126 0 -285 45 19 -156 -14 -57
7205 -57 -17 -94 -134 -60 136 -132 51 63 -176 73 39 43 33 23 46 45 -415 47 228 -73 -160 300 -163 -8 -108
7230 -108 -223 254 -5 186 143 -197 112 -111 -319 236 180 -110 -21 106 -134 45 -166 137 178 -312 209
7251 209 145 -267 76 381 4 117 57 -15 95 -102 77 48 -241 138 -106 -344 43 10 -234 -70 18 -17
7273 -17 16 -177 -106 5 -299 -102 -5 -237 3 -39 -203 107 -143 65 11 -61 71 142 -16 126 180 -149 304
7296 304 15 8 -146 31 18 148 -188 -26 37 -75 93 244 -91 120 35 51 -154 -24 -34 18 -105 93 -40
7319 -40 -261 278 209 -75 110 175 -6 118 -251 58 14 -223 78 241 -188 274 -77 -139 154 155 -152 124
$$ packed form
7161c08L03j4M9j43j0K39lj17K91j75j93K02M6k48M7j0K7J20m20K79J50l47M48
7184B13r0k22N79l07l42K52j35J00J2l53L33K95n90L81j26k85L30k6j75J42m3
7205e7M0p7m0P4J96k68J83J2k39K49l4Mj0j0K3jm60M62J81l01q7M60m63J55j00
7230a08j15M77k59J91m3l40L09k23k08N55n6k90Q9J27k40J79k11L03M1m90N21
7251B09o4m12L43L05l77J13o0p2J10j97J79k9k89L79k44k38L87l3k44J64Q8l5
7273a7L3j93P1J11l04J97R7k32K40m2j64L10k50K08n4p2J32P1j58J42N4l29M53
7296C04k89pj54J77j3J30l36J62O3j12J68J51l35K11q5J6k05J30j0N2j23J98j33
7319d0k21N39o9k84J85O5j81J24l69L09m4k37L01J63m29M62l51o2K93Jl07K76
$$ plain form
7341 124 -368 83 -90 -96 277 -51 -95 22 57 -66 108 -16 -102 386 67 -125 220 -123 -33 219 -41 -26
7363 -26 72 -283 157 -63 -225 343 -114 -32 150 160 271 157 -69 126 125 -107 34 -136 -12 -62 -186 93
7385 93 23 -304 236 211 -98 162 -235 -203 127 -45 35 -30 127 -184 -64 -114 91 -24 -246 19 -59 -11 159
7408 159 -117 -204 26 -153 -48 -43 -180 20 145 -202 135 -174 -94 -9 -208 -167 -37 -190 -119 158 26 -58 -43
7431 -43 -185 -183 -112 -30 126 56 -59 230 65 257 149 -54 34 73 -85 -92 -144 -166 177 -164 3 112 -258 148
7455 148 36 -185 24 -31 71 119 -60 -211 115 -84 107 108 -118 301 7 -73 25 -45 -202 131 -195 -175 323
7478 323 -196 8 210 -92 158 -30 -44 24 4 -89 284 1 7 64 -200 -16 111 -60 137 117 74 100 -128
7501 -128 86 141 15 118 153 -170 284 129 -137 71 -6 -28 -71 -34 -158 -16 -121 -14 -8 -167 131 78 1
$$ packed form
7341A24m92M51j73oL73l28m4J17L5j23J74j24q6M88l19j92L45l43R0K52k60J5
7363b6R8l55M40k20j62N68m57Q2J82J0J11j14k26J95jk32J41j70J24n0j24K79
7385I3p0l27N40k5l09K60l97L2L30j72Q0o5J57l11J20n0K05j15k22K65p8M8J70
7408A59k76q7K30j79J05Nj37K00J25l47L37l09Q0Q5j99M1J30j53P1K77j32q4J5
7431d3j42KP1Q2J56p0j15K89j65J92j08k03Q8L9j58pn2k2L43l41J67J09l70M06
7455A48j12k21K09n5J02M8j79j51L26j99J91Jk26M19k94q0R8p0j57L33l26K0M98
7478C23n19K04K02l02K50j88j4O8k0r3L73k83ON7k64J84J27j71J97k0m3K6k28
7501a28K14N5j26J03L5l23M54j55k66K08p7k2m3L7j24J42j05J07Oj59K98n3p7
$$ plain form
7524 1 -132 72 -217 271 33 -157 -10 -137 129 206 -391 165 83 -134 32 -44 -32 201 -67 -340 67 96
7546 96 26 33 -99 216 32 36 199 38 -259 135 -46 36 -73 -201 34 113 -251 -16 36 -258 125 9 -65
7569 -65 80 16 62 358 -105 2 203 -77 116 145 -306 103 -73 27 150 82 -301 162 88 179 32 -10 109
7592 109 231 -70 311 60 -183 59 -75 46 157 103 -202 -92 -225 173 177 -286 211 -221 -212 176 -106 23
7614 23 100 -286 273 -84 91 260 -101 -163 -128 79 -130 8 -113 -107 54 -109 57 187 -87 244 -148 -175
7636 -175 99 114 7 177 -222 -115 113 -14 102 -22 20 326 17 -82 76 -184 105 61 -147 72 237
7657 237 -306 118 31 -327 165 -154 -110 176 -195 22 -101 -63 24 77 -51 24 -154 -332 -63 59 8 63 -86
7680 -86 35 -40 -121 127 -28 -26 166 -204 -67 301 -114 -72 -103 13 -77 44 -179 160 -221 -25 181 -232 -224
$$ packed form
7524Aj33K04k89M88k38j90J47j27K66P7n97N56q2k17J66p6J2K33k68k73M07K9
7546I6p0Pj32L15j84MJ63j61k97L94j81Q2j09j28K35P9l64K35N2k94L83j16p4
7569f5J45o4M6K96m63J07K01k80J93K9m51M09j76J00J23o8l83M63p4R1j47m2J19
7592A09J22l01L81k51k43K42j34J21J11n4l05J10j33L98Mm63M97m32RL88k82J29
7614B3P7l86N59l57J75J69l61o2L5K07k09J38j21OJ61j63J66J30k74L31l92k7
7636a75K74J5j07J70l99J07K28j27J16j24M2L06l09r9J58k60K89m4k08K19J65
7657B37n43M24q7l58M92l19M4K86l71K17j23L8Q7N3j28P5j78j78K69J22n1N5j49
7680h6J21p5q1K48j55KJ92l70J37L68m15M2l1J16r0J21k23L39l81J96K06m13Q
$$ plain form
7703 -224 128 25 -106 46 25 -3 231 -190 144 68 -238 92 -44 -202 -142 25 -170 43 -109 -6 128
7724 128 -41 13 60 -130 90 67 -183 -50 -94 21 125 55 21 -2 264 43 -72 82 14 34 -131 221 37
7747 37 -187 73 55 64 169 -66 115 6 86 96 -210 -367 87 -114 1 -85 -138 7 131 -54 -5 -203 31
7770 31 337 -71 -119 30 14 67 62 -243 241 -50 -192 226 -30 -175 329 82 -94 104 30 -17 126 -63 -114
7793 -114 -108 -58 248 39 63 10 -89 24 284 70 -28 16 53 125 71 16 95 67 -123 -118 94 -170 288 97 94 47
7819 47 -293 279 -16 -215 100 -127 -231 178 -272 23 74 25 -11 -40 -218 -42 -155 -22 178 -7 -122 318
7841 318 -166 -18 18 -108 131 206 -228 137 30 -138 63 -49 -6 19 38 67 106 -214 130 38 -68 238 -155
7864 -155 -169 296 112 38 128 -138 -89 95 -157 42 -65 -176 73 10 -176 222 67 -149 208 -148 130 126
$$ packed form
7703b24L52j03j31J52k1k8K34m21L34p6l06L30j36j58O0J67j95K13j52J03J34
7724A28j69N4M7j90K20k3k50J33m4J15J04p0l4k3K66k21j15J54o8K0j65L52j84
7747C7k24K60j8RJ05k35J81j09Q0J0l06j57M54k01J15q6n3J45J24j85M9j98K34
7770C1L06m08m8J49j6N3nl05M84k91j42M18k56j45N04k47j76J98p4m7J43j89n1
7793a14ON0L06k09K4n3r9J13K60k14r8M4L7P2n4n5P9k8j90NK12k64M58j91lm7
7819D7l40N72k95j99L15k27j04M09m50K95N1m9l6k9j78J76j13J33K00j85j15M40
7841C18m84J48L6j26K39P5m34L65j07j68K01j12M3K5J9K9L9l20L44r2j06L06l93
7864a55j4M65j84p4R0k66M9J84k52J99j07j11K49o3j86L98j55k16L57l56K78m
$$ plain form
7886 126 -71 -110 76 -164 12 -17 -54 -93 -36 39 266 -76 2 82 -167 -23 -29 -308 40 -28 186 116 -81 -72 146
7911 146 -104 -86 -67 -241 118 21 -179 250 -26 -72 139 -74 -57 8 -205 16 40 -121 180 -31 118 198 -20
7934 -20 28 80 -141 -95 -11 -27 -137 -54 -229 44 -78 -253 38 37 -48 156 -19 128 106 -289 135 194 -75 50
7958 50 -42 -325 4 70 -136 238 -200 94 -129 2 68 -21 -147 72 -82 35 36 -166 -6 -70 -42 195 380
7981 380 -48 -35 -59 -133 -69 -87 -115 198 -64 108 67 -117 -131 93 -104 209 -5 -134 14 -160 61 114 -170
8004 -170 -97 352 -80 121 326 119 185 -83 42 107 73 -183 150 -15 -26 168 -139 -127 -8 83 87 -67 -12
8027 -12 67 -54 -74 146 10 45 151 34 81 -244 -256 -42 -125 25 23 55 93 -16 -34 303 132 -77 151 18
8051 18 -108 167 35 -71 26 -224 68 127 49 108 -2 -108 84 81 -202 116 -75 -40 32 -233 -13 114 -164
$$ packed form
7886A26j97l9J86k40J76k9l7l9N7P5K27l42P8Q0k49J44ok79L48o8K14p0j97RK18
7911A46k50J8J9j74L59r7k00M29k76m6K11k13J7O5k13K21K4j61L01k11J49Q0k18
7934b0M8N2k21M6Q4j6j10Q3j75K73j22j75K91jq5K04j75J47k2l95M24N9k69J25
7958E0r2k83L29O6k06L74m38K94k23J31O6q9j26K19j54J17Jk02J60o4K8K37J85
7981C80m28J3k4p4O4j8k8L13k62J72m1j84j4K24j97L13k14j29J48j74K21N3k84
8004a70P3M49m32K01K05k07O6k68J25O5l4k56L33j65j1J94l07J2J19R1Mj54N5
8027a2P9j21k0K20j36L5J06j17M7l25j2K14q3J50kL2L8j09j8L37j71k09K28j33
8051A8j26K75j32j06R7k50K92N9p8N9j10j06J92lk83L18j91L5P2k65K20J27k78
$$ plain form
8074 -164 -7 187 -57 89 -70 -54 178 -141 -107 104 -86 27 109 -235 93 103 -296 46 -64 154 99 -156
8096 -156 -210 111 -38 -110 0 -116 -29 -109 -48 -29 -65 -108 216 -252 -69 165 -54 73 270 -32 -13 -66 -293
8119 -293 -91 22 -243 236 -52 -203 96 -14 -136 229 261 195 82 -14 75 4 -1 106 -103 -19 133 -137 -157
8142 -157 -106 60 -120 0 217 140 257 -234 166 -189 -23 369 206 71 -110 1 175 158 -19 139 108
8163 108 -212 6 -120 -229 -1 151 -257 122 -58 63 153 30 69 48 86 19 183 -26 -31 -124 234 26 167
8186 167 14 4 -16 -12 -181
$$ packed form
8074a64J57J94k44J46j59J6K32l19L4K11j90J13Q2l44L28J0l99L42j10K18n5k55
8096a56n4L21j49p2J10j16Q7q0O1J9l6m3L24m68J83K34k19J27J97l02J9n3k27
8119b93K02J13k65M79k88j51K99j10j22L65L2o6j13r6Q9p1nJ07k09Q4J52k70k0
8142a57N1J66j80J20K17p7J17m91M00l55J66L92j63j35j81J11J74j7j77J58l1
8163A08l20K18j26j09K28J52m08L79j80J21R0j23L9k1L8o7J64k09nr3L58k08J41
8186A67j53j0k0Mj69
8191a81
$$ Imaginary data points
##PAGE= N=2
##DATA TABLE= (X++(I..I)), XYDATA
$$ plain form
0 0 0 0 0 0 0 0 0 0 0 0 8 -8 8 -8 14 -16 17 -24 32 -33 41 -49 62 -72 81 -97 113 -130 153 -175 199 -228 259
33 259 -292 330 -373 418 -470 524 -586 652 -724 802 -891 984 -1088 1200 -1323 1457 -1608
50 -1608 1769 -1949 2149 -2372 2620 -2900 3216 -3581 4005 -4503 5098 -5826 6742 -7931 9541
65 9541 -11862 15508 -22120 37955 -160780 -51436 164290 -92254 -2948 68241 -47749
76 -47749 -113316 40449 90155 -56088 -28719 191737 -2264 -170834 82983 118220 -68478
87 -68478 56291 166600 75660 511 7027 -30323 -136235 -41333 165995 -7643 -166952
98 -166952 17106 5069 -118387 29564 104737 1472 -41583 1183 7808 -93884 -60470
109 -60470 91239 -24634 -90039 116556 89174 -70385 -13826 30414 8187 12948 26500
$$ packed form
0@%%%%%%%%%%Qj6J6j6K2l0L3m1N6o5P4r0J11j34J53j78K10k43K83l28L74m27M87
33B59n51O22p03P91q88R94j110J238j376J526j693J875k072K288k523K780l065
50a608L377l718M098m521M992n520O116o797P586q508R601j0924J2568j4673J7472
65I541k1403K7370l7628O0075j98735J09344K15726k56544Q9306P1189j15990
76d7749o5567J53765M9706j46243K7369K20456j94001j68570K53817L5237j86698
87f8478J24769J10309r0940p5149O516l7350j05912R4902K07328j73638j59309
98a66952J84058j2037j23456J47951P5173j03265m3055M2766O625j01692L3414
109f0470J51709j15873o5405K06595k7382j59559N6559M4240k2227M761J3552
$$ plain form
120 26500 29099 -73241 -98481 36298 9830 -29184 84512 35792 -55248 4114 29853 27384
132 27384 -5295 -50322 7500 2612 -27947 43112 -2360 -52834 42321 38590 -4444 18493
144 18493 1060 -4791 -39188 -57753 45198 27887 -59295 2792 2951 -26772 52757 41915
156 41915 -29095 -39171 -8468 54206 1814 -64714 33608 24820 -59282 27278 51952 -12827
168 -12827 11235 12528 -15817 -23736 -2308 51411 -26159 -97697 30764 49238 -41557 7536
180 7536 3665 -46763 14895 41968 6734 -25816 -16247 44933 -2634 -41341 68417 40774
192 40774 -51487 18895 22357 -29106 20240 24679 -24028 -46387 -12631 53866 -10975 -73076
204 -73076 18546 7492 -46228 30652 19390 -43171 -4009 19221 15488 2808 1944 45771 1493
$$ packed form
120B6500K599j02340k5240J34779k6468l9014J13696m8720r1040N9362K5739k469
132B7384l2679m5027N7822m888l0559P1059m5472n0474R5155l731m3034K2937
144A8493j7433n851l4397j8565J02951j7311q7182O2087J59k9723P9529j0842
156D1915p1010j0076L0703O2674n2392o6528R8322q788q4102Q6560K4674o4779
168a2827K4062J293k8345p919K1428N3719p7570p1538J28461J8474r0795M9093
180G536l871n0428O1658K7073l5234l2550R569O1180m7567l8707J09758k7643
192D0774r2261P0382L462n1463M9346M439m8707k2359L3756O6497o4841o2101
204g3076R1622j1054n3720P6880j1262o2561L9162K3230l733j2680q64M3827m4278
$$ plain form
217 1493 -41108 38302 24082 -28107 18091 -6925 -38024 13297 15557 -1113 -17485 -27739
229 -27739 19793 5972 -24329 19867 -14189 -39116 30935 14736 -14458 19168 8928 7597
241 7597 7235 -6020 28275 2730 -35310 8015 -10926 -28705 23014 -2335 -26024 711 -2127
254 -2127 20750 14981 -26463 4499 5357 -14402 23187 1446 -17237 22840 7140 6424 23404
267 23404 -4496 10502 9451 -28671 -2828 -3311 -22820 2632 -22858 -28024 18549 3333 -2187
280 -2187 7226 -17363 8779 17071 -13845 6371 -3111 -13991 26944 9126 -4531 25741 9411
293 9411 10505 15092 -13869 8576 7672 -27740 -5858 -10557 -20210 14047 -6066 -17881 6750
306 6750 -7423 5589 9747 -27889 -5823 5774 -14906 6847 -2169 -7486 27090 8806 3419
$$ packed form
217A493m2601P9410j4220n2189M6198k5016l1099N1321K260j6670j6372j0254
229b7739M7532j3821l0301M4196l4056k4927P0051j6199k9194L3626j0240j331
241G597l62j3255L4295k5545l8040M3325j8941j7779N1719k5349k3689K6735k838
254b127K2877n769m1444L0962Q58j9759L7589k1741j8683M0077j5700p16J6980
267B3404k7900J4998j051l8122K5843m83j9509K5452k5490n166M6573j5216n520
280b187R413k4589K6142Q292l0916K0216r482j0880M0935j7818j3657L0272j6330
293I411J094M587k8961K2445r04l5412K1882m699r653L4257k0113j1815K4631
306F750j4173J3012M158l7636K2066J1597k0680K1753r016n317L4576j8284n387
$$ plain form
319 3419 24502 1806 11519 17102 -16147 722 4862 -11066 9541 -9255 -17653 17509 -744
332 -744 -11450 949 -19003 -5201 95 -26228 -5909 -3947 -13343 17727 2861 -8076 24382
345 24382 12682 7720 14728 -7556 8811 14987 -9940 5500 443 -8921 19224 -1529 -15117
358 -15117 10134 -7873 -10296 21 -22908 -9449 1238 -12051 3241 -6616 -6197 29170 4610
371 4610 -10125 17071 1395 1806 13547 -9285 -2534 3541 -2298 14628 -5376 -12158 19793
384 19793 -3893 -17029 5826 -10391 -6384 4514 -15780 -3007 6774 2226 16525 -3462 -7562
397 -7562 22964 3106 -6157 6852 -14839 -4397 11990 -8271 -976 1117 -5049 10601 -6198
410 -6198 -10271 13732 -7785 -12800 3442 -10562 3509 12651 -6625 6307 5688 -212 21943
$$ packed form
319C419K1083k2696R713N583l3249J6869M140j5928K0607j8796q398L5162j8253
332g44j0706J2399j9952J3802N296k6323K0319J962r396L1070j4866j0937L2458
345B4382j1700m962P008k2284J6367O176k4927J5440n057r364K8145k0753j3588
358a5117K5251j8007k423J0317k2929J3459J0687j3289J5292r857M19L5367k4560
371D610j4735K7196j5676M11J1741k2832O751O075n839J6926k0004o782L1951
384A9793k3686j3136K2855j6217M007J0898k0294J2773R781m548J4299j9987m100
397g562L0526j9858r263J3009k1691J0442J6387k0261P295K093o166J5650j6799
410f198m073K4003k1517n015J6242j4004J4071R142j9276J2932o19n900K2155
$$ plain form
423 21943 1837 -14915 6169 -3955 -5924 2655 -10237 2364 1429 -10055 15930 4180 -16440
436 -16440 10226 -510 -15889 6952 1825 -5665 -3505 -5890 13057 6697 -1546 25533 -267
449 -267 -24337 13849 5949 -16189 4482 541 -9578 -1859 6152 10890 -14685 -9679 32513 -505
463 -505 -27006 13361 -4221 -31894 3575 12073 -4154 170 12775 6491 -27492 -6123 44591
476 44591 -157 -29225 18620 2271 -24330 11832 12184 -10112 4431 29427 17657 -29007
488 -29007 -13611 29020 -14781 -25821 29186 3792 -27376 3937 -2365 -21281 6479 35369
500 35369 13574 -35253 -13316 27231 -18750 -24561 27777 1917 -16396 20931 5217 -25713
512 -25713 -5886 23317 12195 -22274 1229 27561 -26762 -32380 20504 6431 -125 29973
$$ packed form
423B1943k0106j6752K1084j0124j969Q579j2892J2601r35j1484K5985j1750k0620
436a6440K6666j0736j5379K2841n127p490K160k385J8947o360q243K7079k5800
449b67k4070L8186p900k2138K0671l941j0119P719Q011M738k5575N006M2192l3018
463e05k6501M0367j7582k7673L5469Q498j6227M324J2605o284l3983K1369N0714
476D4591m4748k9068M7845j6349k6601L6162L52k2296J4543K4996j1770m6664
488b9007J5396M2631m3801j1040N5007k5394l1168L1313o302j8916K7760K8890
500C5369k1795m8827K1937M0547m5981n811N2338k5860j8313L7327j5714l0930
512b5713J9827K9203j1122l4469K3503K6332n4323n618N2884j4073o556L0098
$$ plain form
524 29973 5998 -21772 -3965 19136 13046 -15751 1403 25509 -15714 -20569 14124 -7490
536 -7490 -11760 16177 2932 -10286 -5433 -2728 -6605 -24798 -4060 28120 -2690 -14812 9436
549 9436 -4774 -3913 17936 12063 6600 -947 -1177 9394 -10600 -7956 20510 -3497 -15049 11729
563 11729 3965 -9798 -10043 -6264 5970 -4778 -5551 12551 -13927 -20113 17491 5210 -9457
576 -9457 15030 12937 -6174 -11336 4824 19799 -6609 -10084 18743 -5463 -13791 21890 54
589 54 -25470 6200 18048 -3725 -16648 1674 12953 -18774 -11622 26767 -3992 -17437 19883
602 19883 -2507 -26740 10262 22872 -6868 -21145 5814 20950 -14255 -9125 23663 -9916
614 -9916 -15094 28500 3476 -26110 5476 16477 -7585 -14944 12215 19742 -19105 -12263 19600
$$ packed form
524B9973k3975k7770J7807K3101o090k8797J7154K4106m1223m855L4693k1614
536g490m270K7937j3245j3218M853K705l877j8193K0738L2180l0810j2122K4248
549I436j4210Q61K1849n873n463p547k30J0571j9994K644K8466k4007j1552K6778
563A1729p764j3763k45L779J2234j0748p73J8102k6478o186L7604j2281j4667
576i457K4487k093j9111n162J6160J4975k6408l475K8827k4206q328L5681k1836
589E4k5524L1670J1848k1773j2923J8322J1279l1727P152L8389l0759j3445L7320
602A9883k2390k4233L7002J2610k9740j4277K6959J5136l5205N130L2788l3579
614i916n178M3594k5024k9586L1586J1001k4062p359K7159P527l8847O842L1863
$$ plain form
627 19600 -11543 -11700 26241 -4320 -29096 6768 17882 -5646 -13923 8768 16072 -13263 -1081
640 -1081 22247 -13997 -14646 22735 -1051 -18472 10017 12506 -8201 -14231 6079 14770 -10735
653 -10735 -4091 13687 -15954 -11847 20512 -798 -14932 5484 8722 1140 -3637 4172 8921
666 8921 -11867 -3841 14803 -10130 -10621 11497 -5670 -11610 4011 5133 2159 -5612 -1705 7228
680 7228 -7960 -2026 13909 -8563 -8531 13457 4313 40 4636 1574 4547 -1424 979 9752 -9206
695 -9206 -8880 8368 -7105 -8262 6861 -46 -2081 -1712 -2241 6015 -3010 -4380 6133 -8478 -5836
710 -5836 12520 -2117 -7181 4054 1452 3974 1966 -2097 4057 -5790 -5222 8116 -6572 -6145
724 -6145 10218 -2058 -4579 5660 3278 5157 699 -2829 5712 -2747 -1967 8596 -7754 -7439
$$ packed form
627A9600l1143j57L7941l0561k4776L5864J1114k3528q277K2691P304k9335J2182
640a081K3328l6244o49L7381k3786j7421K8489K489k0707o030K0310Q691k5505
653a0735O644J7778k9641M107L2359k1310j4134K0416L238p582m777P809M749
666H921k0788Q026J8644k4933m91K2118j7167n940J5621J122k974p771L907Q933
680G228j5188N934J5935k2472L2K1988r144m273M596l062K973n971K403Q773j8958
695i206L26J7248j5473j157J5123o907k035L69n29Q256r025j370J0513j4611K642
710e836J8356j4637n064J1235k602K522k008m063O154r847N68J3338j4688M27
724f145J6363j2276k521J0239k382J879m458l528Q541q459P80J0563j6350L15
$$ plain form
738 -7439 9666 546 -2594 1966 -2901 1651 -1285 -3870 3517 -6158 -5293 7236 -5375 -4460 9069
753 9069 261 -736 2458 -2143 4358 1142 -4041 2376 -5990 -3138 8653 -4146 -4459 5609 -1739
768 -1739 1546 3064 -3919 1969 -343 -3071 4600 -3456 -2256 8409 -2777 -2163 5826 -1222 2132
783 2132 1308 -6190 951 -907 -2971 3853 -5357 -4053 6909 -1508 -472 3781 -3562 2856 2852 -4645
799 -4645 2196 -403 -2617 4774 -3374 -2021 6328 -2393 -570 1974 -5663 2337 2418 -5799 977 -1377
815 -1377 -1722 6235 -2100 -1564 5513 -1519 2291 3114 -5186 2472 2255 -4463 2099 -1580 -2601 4867
831 4867 -3100 -2601 2845 -2940 1818 1151 -6561 2674 2707 -3246 3663 -973 -2066 6423 -428 -759
847 -759 2486 -3052 2634 1233 -6261 2246 480 -4257 3504 -2473 -3755 5148 -1715 -1912 1944 -3045
$$ packed form
738g439J7105r120l140M560m867M552k936k585P387r675Q65J2529j2611R15J3529
753I069q808r97L194m601O501l216n183O417q366K852J1791j2799l13J0068p348
768a739L285J518o983N888k312k728P671q056J200J0665j1186O14P989p048L354
783B132q24p498P141j858k064O824r210J304J0962q417J036M253p343O418mp497
799d645O841k599k214P391q148J353Q349q721J823K544p637Q000Q1q217O776k354
815a377l45P957q335N36P077p032L810Q23q300P658k17o718O562l679j021P468
831D867p967M99N446n785M758o67p712R235L3n953O909m636j093Q489o851l31
847g59L245n538N686j401p494Q507j766m737P761n977j282Q903o863j97L856m989
$$ plain form
863 -3045 2856 1974 -3729 3569 69 -1925 6446 -1939 -3506 5672 -1931 -2023 1941 -3488 378 316
879 316 -2912 2862 -2414 -2000 6510 -3378 -3173 5799 -2700 -1176 4219 -2452 -208 1295 -91 2932
895 2932 -3776 -1433 6317 -4736 -2959 5350 -5185 -1569 5882 -2751 -2097 1586 1620 2666 -3967
910 -3967 185 6581 -4796 -511 5771 -6630 -1139 7356 -3130 -3472 1282 1431 1022 -5769 -427
925 -427 4866 -5095 1070 5499 -7739 328 9018 -2691 -2636 2508 2569 1993 -4428 -341 3030 -4886
941 -4886 2102 4089 -8631 145 6919 -4626 -3172 1494 1378 2455 -3610 -828 3056 -3218 3596
956 3596 4581 -6544 2151 6149 -3956 -1588 -309 -203 3314 -3489 -2419 2113 -3862 1025 2633
971 2633 -4788 2893 4266 -3056 508 -1998 -539 6074 -1914 -1665 4922 -2279 -611 1994 -2500
$$ packed form
863c045N901q82n703P298l500j994Q371q385j567R178p603r2L964n429L866o2
879C16l228N774n276M14Q510r888K05Q972q499J524N395o671K244J503j386L023
895B932o708K343P750j1053J777Q309j0535L616P451q633O54L683L4J046o633
910c967M152O396j1377M285O282j2401N491Q495j0486l42M754J49m09o791N342
925d27N293r961O165M429j3238Q067Q690j1709N5N144O1n76o421M087L371p916
941d886O988J987j2720Q776O774j1545J454M666j16J077o065K782L884o274O814
956C596R85j1125Q695L998j0105K368J279J06L517o803J070M532n975M887J608
971B633p421P681J373p322L564k506J459O613p988K49O587p201J668K605m494
$$ plain form
986 -2500 1675 1003 -1502 1404 -5400 -2793 5445 -4892 -2590 8087 -1174 -3772 1527 -667 292
1001 292 -381 2593 4504 -5808 -934 6711 -7490 -2885 11255 -673 -5240 2773 858 -3638
1015 -3638 -3840 3467 4718 -5682 2328 7713 -10799 -4125 12631 -1332 -5381 6401 3140 -5749
1029 -5749 -5715 2996 2864 -6263 5517 8570 -12943 -3946 11566 -5357 -7422 8680 5749 -4019
1043 -4019 -4315 2755 -120 -7502 7862 9978 -11156 -1354 10973 -8600 -9354 6804 5082 -2493
1057 -2493 -2264 2781 -1955 -8690 6287 8145 -9331 2748 12952 -6900 -8248 4987 2424 -1236
1071 -1236 852 5035 -555 -8482 3201 3840 -11129 2011 11590 -5912 -6480 2645 -380 -2057
1085 -2057 -14 4558 2528 -4705 4783 4565 -9510 714 9308 -2913 -2192 3143 -407 -1870 -3377
$$ packed form
986b500M175o72k505K906o804K607Q238j0337K302J0677r261k598N299k194R59
1001B92o73K974J911j0312M874P645j4201M605J4140j1928m567Q013j915m496
1015c638k02P307J251j0400Q010N385j8512O674J6756j3963m049J1782l261q889
1029e749L4Q711j32r127J1780L053k1513Q997J5512j6923k065J6102k931r768
1043d019k96P070k875p382J5364K116k1134R802J2327j9573p54J6158j722p575
1057b493K29N045m736o735J4977J858j7476J2079J0204j9852j348J3235k563l660
1071a236K088M183n590p927J1683O39j4969J3140R579j7502n68R125l025j677
1085b057K043M572k030p233R488k18j4075J0224Q594j2221P21N335l550j463j507
$$ plain form
1100 -3377 938 2255 -5233 2172 4221 -8417 -1769 4978 -3102 -1351 2014 1477 1683 -2999 1228
1115 1228 3645 -5284 1538 6961 -3839 -924 4057 -2095 -1821 -547 1673 3048 -3573 1560 4656
1130 4656 -6860 -1123 6257 -3107 -1420 4330 -8 -1741 -2604 1018 1331 -5623 1878 6017 -7472
1145 -7472 -3438 5034 -4137 -3225 3255 1057 -751 -1917 2441 1992 -5998 3195 8412 -5280 -846
1160 -846 7147 -2595 -2518 3126 1061 -143 -1073 2891 1272 -7795 1753 6349 -6468 -1280 6161 -3031
1176 -3031 -2676 1906 175 -747 -1455 3181 2018 -6641 1584 6009 -6378 -1324 5270 -2851 -1535
1191 -1535 1802 -246 -648 -1817 2648 2522 -5861 1920 5802 -4802 -393 4341 -2539 -427 1593
1206 1593 -537 -91 -2358 1579 1711 -6091 519 4017 -4565 -285 3284 -2762 -29 1371 -68
$$ packed form
1100c377M315J317p488P405K049j2638O648O747q080J751L365n37K06m682M227
1115A228K417q929O822N423j0800K915M981o152K74J274K220J375o621N133L096
1130D656j1516N737P380r364J687N750m338j733q63L622L13o954P501M139j3489
1145g472M034Q472r171R12O480k198j808j166M358m49p990R193N217j3692M434
1160h46P993r742P7N644k065j204r30L964j619r067R548M596j2817N188P441r192
1176c031L55M582j731r22p08M636j163q659Q225M425j2387N054O594q121J316
1191a535L337k048m02j169M465j26q383P781L882j0604M409M734o880K112K020
1206A593k130M46k267L937J32p802O610L498q582M280L569o046K733J400j439
$$ plain form
1221 -68 842 -1612 2142 3547 -4269 845 4324 -3179 849 2576 -2612 453 52 -962 697 -2943
1237 -2943 687 3148 -4288 -78 2821 -3060 1019 1914 -2213 1086 174 -223 1622 -3122 344 2990
1253 2990 -3796 -127 1964 -3526 533 993 -2306 1062 -190 156 2304 -2270 597 4175 -1642
1268 -1642 1247 2977 -1795 1952 1372 -1579 1319 -1086 -408 2029 -3398 -1031 2071 -3441 -268
1283 -268 506 -3421 752 9 -1913 1331 -1274 -255 3163 -2127 346 3076 -1808 1195 1475 -2232
1299 -2232 1862 467 -1164 1838 -1734 -559 2825 -2822 -375 2015 -2561 823 1085 -2514 1602
1314 1602 92 -950 1909 -1847 -15 2696 -2458 245 2032 -2708 1126 1231 -2386 1376 269
1329 269 -727 1873 -1440 208 2328 -2037 908 1613 -3135 1410 1221 -2886 1004 -295 -1217 1285
$$ packed form
1221f8R10k454L754J405p816N114L479p503M028J727n188L065m01j014J659l640
1237b943L630K461p436M210K899n881M079Q95m127L299r12l97J845m744L466K646
1253B990o786L669K091n490M059M60l299L368j252L46K148m574K867L578n817
1268a642K889J730m772L747n80k951K898k405O78K437n427K367L102n512L173
1283b68P74l927M173p43j922L244k605J019L418n290K473K730m884L003K80l707
1299b232M094j395j631L002l572J175L384n647K447K390m576L384K62l599M116
1314A602j510j042K859l756J832K711n154K703J787m740L834J05l617L762j107
1329B69r96K600l313J648K120m365K945P05m748M545j89m107L890j299r22K502
$$ plain form
1345 1285 -1927 -551 1076 -2604 1195 973 -3319 2003 1443 -2395 2197 490 -582 2510 -510
1360 -510 262 1124 -1890 2186 614 -3607 2032 334 -2717 1661 -814 -2291 1652 -846 -607 222
1376 222 -1361 2221 555 -2410 2619 365 -2025 2961 -453 -1898 2474 -436 -1023 513 -1207
1391 -1207 1376 -318 -2349 2089 -631 -1749 2792 -1598 -1706 3012 -497 -444 1249 -574 1562 371
1407 371 -1270 1741 -1097 -1047 2696 -2817 -1573 2976 -2116 -1332 1482 -1667 397 643 -511 1379
1423 1379 -982 695 2717 -3002 351 4044 -2651 -376 2901 -2225 -621 1165 -796 -104 -1189
1438 -1189 954 786 -4204 651 3221 -3972 622 4004 -2561 -782 2003 -677 -244 262 2311 699
1454 699 -3708 1839 1857 -5146 936 4189 -3273 -554 2092 -2105 -1485 381 2325 279 -2494 3442
$$ packed form
1345A285l212J376J627l680L799k22m292N322n60l838M592j707j072L092l020
1360e10P72Q62l014M076j572m221N639j698l051M378k475j477L943k498K39Q29
1376B22j583L582j666k965N029k254k390M986l414j445M372k910n87J536j720
1391a207K583j694k031M438k720j118M541m390j08M718l509N3J693j823K136j191
1407C71j641L011k838N0L743n513J244M549n092P84K814l149K064K46j154J890
1423A379k361J677K022n719L353L693o695K275L277n126J604J786j961O92j085
1438a189K143j68m990M855K570p193M594L382o565J779K785k680M33N06K049j612
1454F99m407N547J8p003O082L253p462K719K646m197O20J866J944k046k773N936
$$ plain form
1470 3442 1236 -5780 1856 3904 -3219 1094 3106 -2167 -2151 17 863 -1273 -1682 4034 712 -5736
1486 -5736 1421 2404 -4084 1658 3467 -1609 -317 969 170 -1634 -1376 4491 1326 -3971 2399 1244
1502 1244 -4561 891 1813 -1649 1190 1038 -498 -1570 -1956 2765 1297 -2650 3114 1262 -3072 897
1518 897 165 -1625 1555 595 373 -225 -2385 1165 262 -3022 1779 1758 -1381 1070 -767 -1171 1476
1535 1476 -802 957 2035 -1724 1002 1415 -2956 -242 798 -628 725 -1034 -59 791 -3522 269
1551 269 1969 -2866 1395 3262 -2096 -703 1432 75 229 -275 2679 1842 -3278 1441 1977 -4327
1567 -4327 367 3723 -2611 -1213 1363 -766 -2548 -1845 2276 743 -3660 2214 2396 -5061 731
1582 731 3931 -2386 -159 3198 625 -1755 -1203 2636 -49 -3881 3445 2588 -5198 470 2715 -3565
$$ packed form
1470C442k206p016P636K048p123M313K012n273J6K168Q46k136m09N716l322o448
1486e736P157R83o488N742J809n076J292J286p99j804K58N867l165n297O370j155
1502A244n805N452R22l462K839j52j536j072l86M721j468l947N764j852m334L969
1518H97p32j790L180r60k22n98k160L550r03l284M801k1l139K451j837m04K647
1535A476k278J759J078l759K726M13m371K714J040j426J353j759R75Q50m313L791
1551B69J700m835M261J867n358J393K135j357J54n04K954q37n120M719N36o304
1567d327M694L356o334J398K576k129j782P03M121j533m403N874J82p457N792
1582G31L200o317K227L357k573k380N52L839k685l832P326q57p786N668K245o280
$$ plain form
1598 -3565 -687 2960 367 -2074 -818 2444 -1018 -3885 3440 2416 -4365 1753 2968 -3552 -808
1613 -808 2608 110 -1330 -457 2517 -646 -3734 2979 2100 -3578 2435 3293 -2960 -31 2114 -113
1629 -113 -1162 -778 2170 -400 -3684 2146 1031 -4116 981 1839 -3046 -499 650 -428 -1278 -1309
1645 -1309 1860 489 -2842 2486 2024 -2605 1946 2180 -1473 336 914 334 -134 -1107 1868 733
1661 733 -2685 1828 1573 -2414 1046 1497 -1417 -129 -115 230 -268 -1903 1618 872 -2729 1079 1070 -2534
1679 -2534 257 684 -1531 -362 -1012 -147 -137 -2456 1323 1556 -2382 1732 1920 -1847 843 1585 -124
1696 -124 470 -328 1145 649 -2058 1588 1303 -2290 1400 1294 -2069 162 221 -823 -13 -695 781
1713 781 335 -2330 1288 1184 -2040 1285 1182 -1981 -58 -151 -591 -72 -1302 1002 542 -2297 997
$$ packed form
1598c565K878L647k593k441J256L262l462k867P325j024o781O118J215o520K744
1613h08L416k498j440Q73K974l163l088O713q79n678O013Q58o253K929K145k227
1629a13j049L84K948k570l284N830j115n147N097Q58m885K547J149j078q50l1
1645a309L169j371l331N328m62m629M551K34l653J809N78n80m68r73K975j135
1661G33l418M513k55l987L460M51k914J288J4L45m98j635L521p46l601L808rl604
1679b534K791M27k215J169o50Q65J0k319L779K33l938M114J88l767K690P42j709
1696a24N94p98J473m96k707L646k85l593L690j06l363K231N9j044Q10o82J476
1713G81m46k665L618j04l224L325j03l163J923r3m40N19j230K304m60k839L294
$$ plain form
1730 997 865 -2411 1017 1348 -1273 755 -87 -235 236 -816 1406 1378 -1550 1528 1182 -2258 733
1747 733 449 -1287 518 -244 -554 163 -1513 609 937 -1615 1505 864 -1714 1020 524 -989 1123
1764 1123 73 192 518 -1109 659 541 -1725 1168 386 -2033 783 -227 -1366 724 -574 -213
1780 -213 667 -971 527 467 -1459 1289 580 -1243 1328 -87 -867 1066 -602 -103 863 -1042 162
1797 162 360 -1425 862 301 -863 1454 -395 -575 1484 -891 -30 1050 -818 449 379 -1100 403
1814 403 -102 -993 1119 -877 -501 1165 -1522 -511 1023 -1164 42 848 -803 999 295 -9 1450
1831 1450 -716 -279 1333 -1529 -6 865 -1648 -95 570 -1208 675 47 -522 762 -937 41
1847 41 1120 -1648 264 1392 -1357 781 1325 -1079 576 398 -239 378 -930 -43 476 -1826 407
$$ packed form
1730I97j32l276L428L31k621K028q42j48M71j052K222k8k928L078l46l440K991
1747G33k84j736J805p62l10P17j676K122L28k552L120o41k578K734m96j513K112
1764A123j050J19L26j627J768j18k266K893p82k419K816j010j139K090j298L61
1780b13Q80j638J498o0j926K748p09j823K571j415p80J933j668M99R66j905J204
1797A62J98j785K287n61j164K317j849j80K059k375Q61J080j868J267p0j479J503
1814D03n05q91K112j996L76J666k687J011J534k187J206Q06j651J802p04l04J459
1831A450k166M37J612k862J523Q71k513J553O65j778J883o28n69J284j699R78
1847D1J079k768J912J128k749K138N44k404J655j78o37O17j308Q87N19k302K233
$$ plain form
1864 407 752 -1864 744 1048 -1364 751 640 -566 484 -409 585 356 -1355 953 782 -1686 1484
1881 1484 765 -1743 1029 184 -1355 13 -582 -23 -1 -1152 1184 121 -1270 1840 470 -1733
1897 -1733 1415 623 -1118 639 -144 -289 19 -757 733 -338 -1193 1834 -271 -1553 1591 -160
1913 -160 -1630 745 162 -83 477 -259 1089 -103 -932 1980 -717 -1309 1807 -661 -1775 936 -491
1930 -491 -727 198 -340 608 -314 -503 1561 -915 -689 1903 -739 -784 1486 -581 -465 932 -381 443
1948 443 127 -273 517 -1038 -653 1404 -1595 -416 1481 -957 10 1112 -844 379 544 -194 688
1965 688 -609 136 627 -1236 285 1298 -1578 362 1012 -1684 6 506 -878 177 131 360 454
1982 454 -973 581 688 -1636 1157 1406 -1771 544 1141 -1270 134 375 -4 -241 -913 890 47
$$ packed form
1864D07L45k616K608L04k412K115j11j206J050q93R94k29j711K308j71k468L170
1881A484p19k508K772q45j539J368n95N59K2j151K336j063j391L110j370k203
1897a733L148p92j741J757p83j45L08p76J490j071q55L027k105j282L144j751
1913a60j470K375n83k45N60p36J348j192q29K912k697n92L116k468j114K711j427
1930d91k36R25n38R48r22j89K064k476K26K592k642m5K270k067J16J397j313Q24
1948D43l16m00P90j555L85K057k999J179J897k438R67J102j956J223J65p38Q82
1965F88j297P45M91j863J521J013k876J940O50k696J690N00j384J055m6K29R4
1982D54j427J554J07k324K793K49l177K315N97k411J404K41l79k37o72J803q43
$$ plain form
1999 47 -1946 1272 636 -2094 1357 1368 -1544 229 1098 129 -74 -186 1269 -324 -1778 1403 119
2016 119 -2678 1400 1040 -1751 534 872 -383 -275 -203 1184 -375 -1404 1836 -196 -2053 1910
2032 1910 966 -1757 824 966 -481 -557 -502 591 -690 -1313 1642 -710 -1997 1871 445 -1455 1246
2049 1246 987 -485 -3 -222 614 -228 -768 1834 -268 -1423 1627 231 -1512 873 334 -440 -258
2066 -258 -504 -182 -707 -1121 1494 13 -862 1725 -87 -1052 740 -117 -275 249 -461 269 -348 -1391
2084 -1391 1277 380 -644 1523 202 -448 483 -640 -79 410 -463 884 272 -1115 1094 255 -532
2101 -532 1513 230 -361 58 -1083 -115 -166 -1198 1152 341 -1354 889 263 -1014 718 346 88
2118 88 167 -921 265 -330 -1139 1473 818 -1064 1184 316 -1215 466 -34 -6 -45 -695 342 -577 -1300
$$ packed form
1999D7j993L218o36k730L451J1k912J773Q69r69k03j12J455j593j454L181j284
2016A19k797M078l60k791K285L38j255J08P2J387j559j029L240k032j857L963
2032A910r44k723K581J42j447p6N5J093j281o23K955k352j287L868j426j900K701
2049A246k59j472M82k19Q36q42n40K602k102j155L050j396j743K385n39p74J82
2066b58k46L22n25m14K615j481q75K587j812r65J792q57j58N24p10P30o17j043
2084a391K668q97j024K167j321o50R31j123N61M89q73J347o12j387K209q39p87
2101e32K045j283n91M19j141R68n1j032K350q11j695K243o26j277J732l72k58
2118H8P9j088J186n95q09K612o55j882K248q68j531J681n00K8l9o50J037r19p23
$$ plain form
2137 -1300 1651 836 -1275 1354 607 -759 206 41 -84 -10 -671 785 -292 -1451 1115 185 -1232
2154 -1232 1175 514 -1305 91 -433 -187 123 -289 1048 -185 -1253 1510 393 -1058 1521 455
2170 455 -1049 145 -582 -298 -92 -351 1113 -166 -1220 772 -100 -1083 1166 450 -646 499 -391
2187 -391 -119 -65 -480 1388 431 -922 1070 -362 -1482 797 188 -295 384 -426 -29 -323 -927 1076
2205 1076 308 -797 1209 18 -1067 691 9 -155 674 -310 21 -373 -1201 501 -120 -790 977
2222 977 -102 -954 638 -291 -228 770 -272 406 188 -915 585 234 -736 1189 26 -596 792 -203
2240 -203 -422 105 -777 252 -136 -1019 398 -113 -675 1074 303 -336 635 -190 52 354 -766 657
2258 657 274 -984 640 155 -491 455 2 -240 799 -326 -39 41 -993 545 265 -1021 666 -104
$$ packed form
2137a300K951q15k111K629p47j366R65j65j25P4o61J456j077j159K566r30j417
2154a232K407o61j819J396n24K46L10m12J337j233j068K763j117j451K579j066
2170D55j504J194p27K84K06k59J464j279j054J992q72r83K249p16j096J145q90
2187c91K72N4m15J868r57j353J992j432j120K279o09m83O79q10L97k94o04K003
2205A076p68j105K006j191j085J758o82j64Q29r84L31l94q28J702o21o70J767
2222I77j079q52J592r29O3R98j042O78k18j103J500l51r70J925j163o22J388r95
2240b03k19N27q82J029l88q83J417n11n62J749p71o39R71q25K42L02j120J423
2258F57l83j258J624m85o46R46m53k42J039j125K87Q0j034J538k80j286J687p70
$$ plain form
2276 -104 -561 802 163 -157 370 -508 -219 -141 -1198 174 165 -906 747 242 -529 885 256 -320 680
2295 680 -357 398 230 -688 890 196 -369 1121 191 -481 1062 -85 -272 315 -509 -108 -369 -902
2313 -902 455 -226 -566 1052 -45 -565 805 -231 -496 297 -424 -129 -93 -588 532 -133 -316 1030
2331 1030 -212 -278 750 -659 -461 416 -613 -37 334 -217 822 210 32 989 -362 -304 866 -769
2349 -769 -395 469 -833 -13 391 -344 137 39 32 662 -831 -265 686 -779 -364 619 -773 173 786 -344
2369 -344 281 110 173 392 -661 94 464 -975 3 264 -784 468 705 -290 411 38 -32 459 -365
2388 -365 111 234 -734 653 433 -740 470 508 -632 15 79 -232 -118 -297 94 161 -464 796 405
2407 405 -732 658 248 -605 416 -70 -502 167 61 -164 116 -232 426 -120 -704 668 34 -822 495
$$ packed form
2276a04m57J363o39l20N27q78K89P8j057J372rj071J653n05p71J414o29n76J000
2295F80j037P55j68r18J578o94n65J490r30o72J543j147j87N87q24M01k61n33
2313i02J357o81l40J618j097n20J370j036k65P93p21K95L6m95J120o65j83J346
2331A030j242o6J028j409J98Q77j029N76L71n51J039o12j78R57j351N8J170j635
2349g69L74Q64j302Q20M04p35M81r8pO30j493N66R51j465M15R83j392R46O13j130
2369c44O25j71O3K19j053P55L70j439R78K61j048J252K37r95P01l73p0M91q24
2388c65M76J23r68J387k20j173J210L8j140O47O4l11J14j79L91O7o25J260l91
2407D05j137J390m10q53J021m86m32O69j06k25K80l48O58n46n84J372o34q56J317
$$ plain form
2426 495 10 -773 419 63 50 113 -133 713 -95 -576 928 -266 -708 807 -341 -702 623 5 -67
2445 -67 114 -123 85 -375 -383 744 -516 -591 1024 -385 -454 487 -178 -187 427 -25 8 -334 -228 512 -641
2466 -641 -263 914 -780 -494 679 -324 -112 404 -269 -26 54 -129 321 -577 -190 890 -498 -63
2484 -63 763 -542 -104 404 -425 53 -231 25 257 -413 -54 369 -575 25 905 -593 48 279 -607 149
2504 149 83 43 433 -333 54 260 -561 38 301 -775 252 6 -715 178 -246 -206 374 -4 141 305
2524 305 -332 54 105 -443 540 78 -561 635 -149 -571 253 86 113 241 -494 146 -170 -525 571 153
2544 153 -284 773 -20 -737 566 142 -134 534 -219 239 -45 -593 342 -279 -289 906 -2 -636 259
2563 259 -327 -279 229 192 129 -8 -296 448 -263 -121 937 -262 -292 538 -449 -184 193 -204 59 68 -235
$$ packed form
2426D95m85p83J192l56j3O3k46Q46q08m81J504j194m42J515j148l61J325o18p2
2445f7J81k37K08m60qJ127j260p5J615j409o9R41o65rO14m52L3l42J06P40j153
2466f41L78J177j694K86J173j003K12N16o73K43Q0j83M50q98L87J080j388M35
2484f3Q26j305M38N08q29M78k84K56K32o70L59M23r44O00Q80j498O41K31q86P56
2504A49o6m0L90p66L87K06q21N99K63j076J027k46p21Q93m24M0N80l78J45J64
2524C05o37L86N1n48R83m62o39J196p84m22Q24j67K7J28p35O40l16l55J096m18
2544A53m37J057p93p17J303m24k76O68p53M58k84n48R35o21j0J195r08o34Q95
2563B59n86M8N08l7o3j37k88P44p11J42J058j199l0Q30r87K65L77l97K63Rl03
$$ plain form
2584 -235 419 -190 -68 753 -349 -230 776 -271 -21 283 21 192 24 -110 184 -416 -320 863 -458
2603 -458 -185 233 -714 -357 280 -175 174 -13 -189 618 -380 68 666 -210 26 657 -655 -296 -28 -288
2623 -288 289 181 -118 312 -500 -405 315 -458 -112 486 -270 76 125 -286 292 8 148 685 -265 -278 64
2644 64 -685 -35 261 -407 203 99 -430 200 -138 -131 478 -283 -185 401 -659 78 460 -259 505 402 -221
2665 -221 244 -391 -438 235 -252 -111 304 -412 -263 474 26 317 260 -155 280 -350 -172 482 -174 73 463
2686 463 -232 -72 287 -201 77 1 -348 402 -216 -534 333 -347 -53 648 -117 101 380 -241 392 -179
2706 -179 -124 509 -434 -85 222 -363 -318 155 -331 -43 3 -354 -186 -1 -354 490 -231 -90 566 -285 223
2727 223 525 -235 -9 332 -239 192 -80 -141 470 -138 -7 490 -253 -127 253 -357 95 189 -195 98 -197
$$ packed form
2584b35O54o09J22Q21j102J19J006j047K50L04k62J71j68j34K94o00R6J183j321
2603d58K73M18r47L57O37m55L49j87j76Q07r98M48N98q76K36O31j312L59K68k60
2623b88N77j08k99M30q12R5P20p73L46N98p56L46M9m11N78k84J40N37r50j3L42
2644F4p49O50K96o68O10j04n29O30l38PO09p61R8N86j060P37L82p19P64j03o23
2665b21M65o35m7O73m87J41M15p16J49P37m48K91n7m15M35o30J78O54o56K47L90
2686D63o95J60L59m88K78p6l49P50o18l18Q67o80K94P01p65K18K79o21O33n71
2706a79N5O33r43L49L07n85M5M73m86K88M6l57J68J85l53Q44p21J41O56q51N08
2727B23L02p60K26L41n71M31k72o1O11o08J31M97p43J26L80o10M52R4l84K93k95
$$ plain form
2748 -197 -356 292 -85 187 666 -450 -231 -21 -262 -337 237 -312 223 36 -184 143 -311 -11 525 -499
2768 -499 43 286 -296 175 284 -250 200 -108 -128 228 -209 -342 186 -94 158 2 -451 74 -90 -224
2788 -224 398 135 -234 500 -246 18 28 -250 221 38 -494 181 -37 -439 231 -32 -322 187 -86 -168 336
2809 336 -252 214 4 -137 441 -6 -246 463 -120 -105 229 -69 -124 165 -122 68 -158 -228 407 -175 -138
2830 -138 225 -404 -186 308 12 77 249 -144 118 -104 -271 387 -108 59 325 -284 -217 213 -249 -24 46
2851 46 -41 117 -133 -146 283 -234 -116 463 -170 -20 486 -120 45 318 -399 58 211 -138 55 -93 317
2872 317 250 -405 136 145 -88 -85 154 -232 46 217 -49 228 -85 230 -68 -251 308 222 -437 -127 336 -198
2894 -198 37 253 -152 66 -111 94 37 -248 144 175 -198 211 141 -373 199 33 -360 43 -185 183 -57
$$ packed form
2748a97j59O48l77K72M79j116K19K10k41p5N74n49N35j87k20L27m54L00N36j024
2768d99N42K43n82M71J09n34M50l08k0L56m37j33N28k80K52j56m53N25j64j34
2788b24O22k63l69P34p46K64J0k78M71j83n32O75k18m02O70k63k90N09k73q2N04
2809C36n88M66k10j41N78m47k40P09n83J5L34k98n5K89k87J90k26p0O35n82L7
2830a38L63o29K18M94k96O5J72l93K62k22j67O58m95J67K66o09O7M30m62K25P0
2851D6q7J58k50j3M29n17J18N79o33J50N06o06J65K73p17M57J53l49J93j48M10
2872C17o7o55N41Rk33LK39l86K78J71k66K77l13L15k98j83N59q6o59L10M63n34
2894a98K35K16m05K18j77K05n7k85L92L1l73M09p0n14N72j66l93M03k28L68k40
$$ plain form
2915 -57 -13 121 91 -377 207 11 -234 13 -25 -123 223 -182 18 5 118 76 -70 -117 150 46 -498 223 0
2938 0 -156 185 -196 -26 123 99 70 93 190 452 -64 -212 384 -83 -145 363 -61 -245 -62 -75 12 -52 -91 199
2962 199 -188 -110 214 -177 -207 301 -98 -53 282 -83 77 39 -153 215 -91 -80 50 -199 -136 349 -276 -91
2984 -91 249 -151 90 -275 -174 92 -115 35 37 -42 11 281 -74 18 161 -415 -63 -36 -438 364 -10 -110
3006 -110 85 -300 122 319 -261 63 222 -278 169 -11 32 211 -104 -187 -50 -283 238 69 -200 27 -18
3027 -18 -281 0 6 -154 31 -2 -123 -109 -217 107 162 -235 316 159 121 219 -42 -312 169 -161 -105 58 -134
3050 -134 164 -119 -49 186 -40 -215 105 -110 -56 151 -9 -44 62 -90 191 48 -116 121 -194 -161 75
3071 75 -208 -15 205 -58 -314 89 -26 -61 23 -113 141 -145 -182 51 -10 -186 215 -348 -70 338 -15 -158
$$ packed form
2915e7M4J34l0m68N84j96k45K47l8r8L46m05K00j3J13m2j46m7K67j04n44P21k23
2938@j56L41l81J70J49k4k9K3R7K62n16j48N96m67o2N08m24j84J83j3Q7o4l9K90
2962A99l87P8L24l91l0N08l99M5L35l65J60l8j92L68l06J1J30k49O3M85o25J85
2984i1L40m00K41l65J01K66k07J50Kp9N3K70l55R2J43n76L52K7m02Q02l74j00
3006a10J95l85M22J97n80L24J59n00M47j80M3J79l15q3J37k33N21j69k69K27m5
3027a8k63K81Oj60J85l3j21J4j08L24N5l97N51j57l8R8k61k70M81l30N6J63j92
3050a34K98k83P0K35k26j75L20k15N4K07j60l5J06j52K81j43j64K37l15L3K36
3071G5k83J93K20k63k56M03j15l5Q4j36K54k86l7K33o1j76M01n63K78M08l53j43
$$ plain form
3093 -158 4 -308 -27 149 53 251 -105 18 193 -251 -48 -14 106 -61 -103 -37 -129 -96 -177 21 -143 -225 40
3116 40 -53 -136 -80 -177 -39 126 -243 93 -84 -337 238 -239 -132 235 -151 96 60 -165 195 90 -321 121
3138 121 -79 -135 174 154 8 13 -135 -174 66 42 416 163 -182 68 28 -84 100 -42 -165 40 -113 35
3160 35 132 -92 43 56 -335 166 55 -157 -91 -138 110 104 105 -123 -168 8 102 -93 -127 270 -21 -208 12 -199
3184 -199 -43 0 -49 173 -46 -61 34 127 -77 25 178 34 326 178 33 83 -76 -50 -142 -1 -77 -189 -148
3207 -148 141 -71 -78 -41 45 122 -37 -127 55 165 -176 227 111 -138 78 -21 -50 49 105 -97 75 -215 -25
3230 -25 91 -162 81 170 -44 155 2 -23 -3 2 56 -26 0 -7 27 12 299 -234 17 134 106 -158 152 43 181
3255 181 -51 -154 59 8 7 152 71 -134 204 -24 -32 100 0 48 114 -28 51 46 61 268 36 81 -33 -141
$$ packed form
3093a58J62l12K81J76r6J98l56J23J75m44K03L4J20j67m2O6r2L3q1J98j64q2K65
3116D0r3q3N6r7J38J65l69L36j77k53N75m77J07L67l86K47l6k25L60j05m11M42
3138A21k00n6L09k0j46Nj48l9K40k4L74k53l45K50m0j12J84j42j23K05j53J48
3160C5R7k24J35J3l91N01j11k12O6m7K48oJk28m5J76R4j95l4L97k91j87K20k11
3184a99J56M3m9K22k19j5R5R3k04J02J53j44K92j48j45N0j59K6r2J41p6j12M1
3207a48K89k12pL7Q6P7j59r0J82J10l41M03j16k49K16r9k9R9N6k02J72k90J90
3230b5J16k53K43Q9k14J99j53k5K0NN4q2K6pL4j5K87n33K51J17k8k64L10j09J38
3255A81k32j03K13n1jJ45q1k05L38k28qJ32j00M8O6j42P9nJ5K07k32M5j14j08
$$ plain form
3279 -141 -261 120 -185 -40 147 -156 204 24 -393 90 158 -295 84 26 -17 21 -29 -198 -16 -128 111 -52
3301 -52 -102 76 151 132 7 207 189 191 92 2 147 -44 -30 -48 -206 -4 201 -117 -26 -82 19 41 -57 -42 -122 -173
3327 -173 203 15 -35 182 -33 -94 172 -18 -120 -110 -73 97 -8 -390 63 188 -92 -158 -48 -88 0 -24 -111
3350 -111 52 72 160 210 153 205 122 -210 -12 17 -93 101 -116 111 91 -158 92 88 86 243 -102 27 161 111
3374 111 0 43 -19 -23 163 140 -95 7 -223 48 1 -71 22 -107 13 -150 33 11 168 62 -86 134 -21
3397 -21 -189 105 -22 -41 12 64 128 -157 -90 17 1 157 159 -63 -160 62 -105 -13 100 -77 286 -149 -24 -60
3421 -60 34 -179 -69 15 84 -24 1 -8 -63 78 93 -99 135 199 141 -21 163 -212 -139 -94 -58 50 -214 -46 -30
3446 -30 31 201 -88 -76 -45 -59 22 23 25 -198 -15 76 133 176 -274 -74 20 -247 -87 88 -153 154 52 -69 -28
$$ packed form
3279a41j20L81l05J45J87l03L60j80m17M83O8m53L79n8m3L8n0j69J82j12K39j63
3301e2n0J78P5j9j25K00j8Kr9r0J45j91J4j8j58K02K05l18R1n6J01K2r8J5q0n1
3327a73L76j88n0K17k15o1K66j90j02J0L7J70j05l82M53J25k80o6J10m0Q8k4q7
3350a11J63K0Q8N0n7N2q3l32J98K9j10J94k17K27k0k49K50mkJ57l45J29J34n0
3374A11j11M3o2mJ86k3k35J02k30K71m7p2R3j29J20j63J83k2J57j06j48K20j55
3397b1j68K94j27j9N3N2O4k85O7J07j6J56Kk22r7K22j67R2J13j77L63m35J25l6
3421f0R4k13J10Q4O9j08K5rn5J41J5j92K34O4n8j62J84l75P3M5L6J08k64J68J6
3446c0O1J70k89J2L1j4Q1JKk23J83R1N7M3m50K00R4k67J60J75k41L07j02j21M1
$$ plain form
3471 -28 7 -68 98 -96 33 84 -306 67 71 -126 56 192 -207 71 -37 63 -32 -170 -100 -88 -42 93 -23
3494 -23 -94 -135 -61 -195 79 2 -13 -80 19 157 199 -34 71 334 -112 111 53 75 138 -15 54 -128 215 -171
3518 -171 76 6 -159 -30 -90 58 -39 129 41 320 127 167 189 -26 -13 57 56 34 -105 171 121 -178 44 -98
3542 -98 -110 -7 145 3 167 -1 79 45 -194 139 -150 -110 135 144 -145 -63 -188 189 21 197 -25 131 -120
3565 -120 -131 -25 -9 -25 -100 -212 11 4 185 89 -216 136 41 -74 -9 160 288 -31 99 -106 57 -116 128
3588 128 159 -17 -64 -176 126 54 45 -72 -219 60 -75 69 14 49 75 -177 -49 156 59 -183 -29 112 51
3611 51 -219 7 -109 -82 -100 118 -299 -6 176 -12 7 212 -108 42 2 43 129 -124 74 65 -185 -201 192
3634 192 71 -18 81 91 91 82 -90 82 2 36 154 18 -198 83 15 -156 284 106 -36 140 138 66 44 -81 312
$$ packed form
3471b8L5p5J66j94J29N1l90L73Mj97J82J36l99K78j08J00r5j38P0J2M6J35j16
3494b3p1m1P4j34K74p7j5o7R9J38M2k33J05K63m46K23n8K2O3j53O9j82L43l86
3518a71K47p0j65J29o0J48r7J68q8K79j93M0K2k15J3P0jk2j39K76n0k99K22j42
3542i8j2J03J52j42J64j68Q0l4k39L33k89M0K45Rk89Q2j25L77j68J76k22J56k51
3565a20j1J06J6j6p5j12K23pJ81r6l05L52r5j15O5J69J28l19J30k05J63j73K44
3588A28L1j76m7j12L02p2rj17j47K79j35J44n5L5K6k52J28K05r7k42J54J41o1
3611E1k70K26j16K7j8K18m17K93J82j88J9K05l20J50m0M1Q6k53J98rk50j6L93
3634A92j21q9R9J0%rj72J72q0L4J18j36k16K81o8j71M40j78j42J76kp2k2j25L93
$$ plain form
3659 312 -70 -76 378 -106 21 -146 -72 -39 84 76 217 -222 94 23 76 -72 160 8 -208 328 -39 121 13
3682 13 -128 272 -83 65 33 150 181 -5 56 -36 -31 -59 103 -17 -247 66 -26 -160 -10 -158 -6 181 -34
3705 -34 39 -139 -53 196 53 -84 229 -200 68 -15 -15 82 85 -24 99 38 8 44 -120 -128 367 -155 -284 -19 -63
3730 -63 -146 10 -27 48 7 112 -20 152 -74 -3 -151 144 17 -72 355 -49 -25 48 104 -207 257 -199 109
3753 109 198 38 38 75 -289 -85 -71 -56 -90 9 42 33 -89 -29 41 -116 -160 155 -129 -164 -57 -18 0 22 159 -26
3779 -26 218 96 151 -212 -106 37 -187 -99 92 -54 235 -107 -168 231 47 -243 31 -93 51 213 -73
3800 -73 123 164 -63 -119 -164 84 131 105 -35 118 -89 -115 -56 -188 0 -151 -25 52 -35 -52 -16 -50 -244 8
3824 8 -152 -43 253 -115 3 24 -123 68 -164 11 59 -175 2 103 21 54 -92 -91 94 -196 -110 236 11
$$ packed form
3659C12l82oM54m84J27j67P4L3J23qJ41m39L16p1N3j48K32j52k16N36l67J60j08
3682A3j41M00l55J48l2J17L1j86O1r2Nk8J62j20k30L13r2j34J50j48J52J87k15
3705c4P3j78Q6K49j43j37L13m29K68q3%R7Lj09J23o1l0L6j64qM95n22j29K65m4
3730f3q3J56l7P5m1J05j32J72k26P1j48K95j27q9M27m04K4P3N6l11M64m56L08
3753A09Q9j60%L7l64K04J4J5l4R9L3rj22O0P0j57m4L15k84l5J07L9J8K2J37j85
3779b6K44j22N5l63J06J43k24Q8J91j46K89l42o1L99j84k90K74j24J44J62k86
3800g3J96M1k27n6m5K48M7k6j40J53k07k6N9j32J88j51J26P7q7j7L6l4j94K52
3824Hj60J09K96l68J18K1j47J91k32J75M8k34J77J01q2L3j46JJ85k90Q6L46k25
$$ plain form
3847 11 -151 83 -23 41 90 -202 -30 -88 -131 170 22 -57 237 37 -256 -4 3 -64 -96 -90 -16 -94 31 104 -21
3872 -21 -93 -61 134 -13 84 151 165 -46 -45 38 -39 -53 138 -181 -239 4 -16 16 56 -222 -35 147 -96 -64 70
3897 70 70 268 -152 -147 374 4 -23 203 -27 -116 109 -185 -47 -54 -335 -60 -189 32 92 -176 17 249 -256
3920 -256 -184 268 41 4 152 -23 213 67 52 104 -137 -62 297 -116 128 103 -181 -153 -166 81 267 -46 -271
3943 -271 -91 -66 -197 -206 -231 -114 49 -41 25 -68 -229 -14 13 72 30 -195 24 18 -309 59 79 -136 197 -26
3967 -26 56 49 65 143 44 26 51 149 -262 -45 -44 -82 -34 -24 -174 198 -133 22 75 -154 -9 -160 -36 299 12
3992 12 9 301 -44 -33 -26 -168 46 18 17 -273 -141 -46 6 -147 -118 27 117 -22 5 -110 -57 140 -167 -16 19
4017 19 -94 71 -19 33 70 113 -74 144 -220 -348 244 -58 39 68 -105 35 -176 108 224 -93 -45 247 -271
$$ packed form
3847A1j62K34j06O4M9k92J72n8m3L01j48p9K94k00k93K52Po7l2OP4p8J25P3j25
3872b1p2L2J95j47R7O7J4k11JQ3p7j4J91l19n8K43k0L2M0k78J87J82k43L2J34
3897G0%J98m20NN21l70k7K26k30q9K25k94J38pk81K75j29K21O0k68J93K32n05
3920b56P2M52k27l7J48j75K36j46j5N2k41P5L59m13K44k5k84K8j3K47J86l13k25
3943b71J80K5j31rk5J17J63r0O6r3j61K15K7N9m2k25K19ol27L68K0k15L33k23
3967b6Q2pJ6P8r9j8K5R8m11K17Jl8M8J0j50L72l31J55N3k29J45j51J24L35k87
3992A2lK92l45J1Pj42K14k8jk90J32R5N2j53K9J45R0j39K7j15N3J97l07J51L5
4017A9j13J65r0N2L7M3j87K18l64j28N92l02R7K9j73J40k11K84J16l17M8K92n18
$$ plain form
4040 -271 -24 210 42 60 -32 62 126 -172 -191 106 -207 94 299 -22 -220 162 -147 -37 -104 -148 271 -27
4062 -27 279 122 -128 -31 253 -150 19 7 -71 25 -157 -12 114 -66 81 137 184 -166 216 29 -137 101
4084 101 -160 -111 118 -121 3 -69 -214 218 -176 -161 166 -157 63 23 19 4 54 -68 100 -115 -147 214 -222
4107 -222 -76 104 -161 -82 186 -98 100 83 33 146 -109 -52 18 -26 16 -40 -143 201 225 -242 -13 -13 15 6 -174
4132 -174 -66 155 -241 10 -26 -103 -1 -45 157 19 62 70 50 -226 -65 214 0 -199 87 -162 159 -123
4154 -123 -107 -161 58 33 18 -166 -177 229 -287 63 -59 -144 -50 -113 -17 117 5 123 272 -81 -61 104 19 -14
4178 -14 202 121 -95 11 12 -195 -92 96 163 -107 64 243 -204 32 125 -76 29 130 86 -82 -133 -174 74
4201 74 -21 0 -131 -66 -93 229 -155 -125 87 -9 234 -209 61 180 -29 86 209 -137 139 194 -259 33 113
$$ packed form
4040b71K47K34j68J8r2R4O4k98j9K97l13L01K05l21j98L82l09J10o7m4M19k98
4062b7L06j57k50R7K84m03J69j2p8R6j82J45J26j80J47N6M7l50L82j87j66K38
4084A01k61M9K29k39J24p2j45M32l94J5L27l23K20m0mj5N0j22J68k15l2L61m36
4107b22J46J80k65P9K68k84J98j7n0J13k55N7P0m4M2n6j03L44K4m67K29%K8rj80
4132a74J08K21l96K51l6p7J02m4K02j38M3Qk0k76J61K79k14j99K86k49L21k82
4154a23J6n4K19k5j5j84j1M06n16L50j22q5R4o3R6J34j12J18J49l53K0J65q5l3
4178a4K16q1k16J06Jk07J03J88O7k70J71J79m47K36R3k01J05J01m4j68n1m1K48
4201G4r5K1j31O5k7L22l84L0K12r6K43m43K70J19k09J15J23l46K76N5m53K92Q0
$$ plain form
4224 113 41 122 -251 237 165 -158 10 128 -93 129 47 -95 -228 185 55 12 -175 179 -22 -185 82 -55
4246 -55 118 -34 -67 -78 67 -30 -197 -154 131 122 69 -87 11 183 -28 28 -35 -27 110 24 -85 118 -89 -176 151
4271 151 -320 -60 -13 -271 14 -300 -169 100 -16 258 74 -159 88 5 -168 -24 50 -46 -15 -179 -108 203
4293 203 -44 -44 134 -36 6 300 -166 -29 157 -92 117 -81 58 177 -88 135 269 -134 172 202 -176
4314 -176 -3 70 32 -179 15 -35 218 -203 -136 7 -170 -10 18 11 -25 -19 -189 8 113 -71 -75 -254 51 79
4338 79 -108 136 339 -234 -68 -1 29 124 173 -69 229 -105 -151 235 -123 79 145 -184 99 -24 -110 202 180
4361 180 102 -92 -77 202 34 -403 106 198 -170 -153 95 -70 204 -4 -110 187 72 70 2 -187 52 -89
4383 -89 -139 123 1 -90 357 -25 48 121 -93 -8 -115 -92 11 -18 -20 243 -197 71 -24 191 -57 17 -18 -237
$$ packed form
4224A13p2Q1l73M88p2l23J68J18k21K22q2j42j33M13j30m3j87L54k01j63K67j37
4246e5J73j52l3j1J45r7j67M3K85rn3j56R8J72k11N6o3QJ37q6j09K03k07q7L27
4271A51m71K60M7k58K85l14J31K69j16K74j84k33K47q3j73J44P4r6L1j64P1L11
4293B03k47%J78j70M2K94m66J37J86k49K09j98J39J19k65K23J34m03L06L0l78
4314a76J73P3l8k11J94n0K53m21O7J43j77J60K8pl6Oj70J97J05j84mj79L05K8
4338G9j87K44K03n73J66O7L0R5M9k42K98l34m6L86l58K02O6l29K83j23q6L12k2
4361A80p8j94J5K79j68m37N09R2l68J7K48j65K74k08j06K97j15ko8j89K39j41
4383h9n0K62j22r1M47l82P3P3k14Q5j07K3J03k9kK63m40K68r5K15k48P4l5k19
$$ plain form
4407 -237 -45 -143 79 -216 -179 298 58 15 146 78 -96 -12 -87 63 156 -64 96 132 48 -74 -182 104 163
4430 163 -107 56 -37 -291 151 148 -49 334 155 196 257 203 -32 154 -241 80 221 -121 36 167 -271 40
4452 40 -55 -52 56 -43 -59 152 -73 46 337 -8 -27 -26 32 5 57 -30 -27 122 60 -114 -457 59 49 -177 47 -131
4478 -131 -253 158 77 -132 163 -191 68 255 -230 25 18 -212 71 97 -205 -51 -52 -331 74 -158 15 64
4500 64 -102 280 5 -276 79 -59 -44 161 235 -92 53 -137 122 58 -282 -123 -172 -350 -36 23 -212 75
4522 75 1 -164 266 31 -11 -101 -147 -21 -11 -114 141 109 -58 -91 -106 101 128 -193 48 146 -245 227 159 -241
4546 -241 30 -104 -84 -70 134 195 -107 -83 219 100 -140 31 44 -200 31 154 -11 -124 -171 -54 55 -138
4568 -138 226 54 -273 11 78 -72 -31 26 141 21 -178 29 -154 -290 31 -69 -5 246 20 18 -41 12 35
$$ packed form
4407b37J92r8K22k95L7M77k40m3J31o8j74Q4p5J50R3k20J60L6q4j22j08K86N9
4430A63k70J63r3k54M42lj97L83j79M1O1n4k35J86l95L21J41l42J57J31m38L11
4452D0r5LJ08r9j6K11k25J19K91l45j9JN8k7N2q7LJ49o2j74l43N16j0k26K24j78
4478a31j22M11q1k09K95l54K59J87m85K55pk30K83K6l02J54jk79M05k32J73M9
4500F4j66L82k75k81L55j38J5K05P4l27J45j90K59o4l40J59m9j78L14N9k35K87
4522G5p4j65M30k35m2r0m6J26J0j03K55l2j67l3j5K07K7l21K41R8l91M72o8m00
4546b41K71j34K0J4K04O1l02K4L02j19k40J71J3k44K31J23j65j13m7J17J09j93
4568a38L64j72l27K84O7j50M1N7J15j20j99K07j83j36L21j00O4K51k26kn9N3K3
$$ plain form
4591 35 93 -120 -44 164 -137 194 401 -73 292 163 -182 218 -127 42 176 27 -31 67 -300 -9 -77 -234
4613 -234 -106 216 -7 142 144 140 61 -225 196 105 166 32 90 -119 87 184 -152 -148 -138 139 99 -183 220 -190
4637 -190 -242 289 277 -294 343 41 13 43 -142 -118 -88 -79 -65 5 -275 79 97 -136 -41 46 -56 157 2 -15 -143
4662 -143 -283 247 188 -221 -57 168 -116 23 88 -52 158 -157 23 72 -119 83 -208 -219 78 277 183 -65
4684 -65 -85 44 71 71 62 86 -193 157 -52 -60 -1 -132 -35 53 19 -127 88 -156 305 -176 -208 216 66 -242 167
4709 167 -112 26 -297 159 -69 -211 -106 89 112 -253 170 -20 -338 28 120 -71 -111 23 184 -4 38
4730 38 125 41 -130 329 172 -252 50 272 -9 -158 79 -194 -89 -57 -58 -25 -283 152 23 -93 173 -48
4752 -48 72 81 -33 -41 88 -64 392 -85 -130 155 -88 -322 55 66 -231 208 30 312 -91 -108 197 -19 67
$$ packed form
4591C5N8k13P6K08l01L31K07m74L65j29l45M00l45J69J34j49n8R8l67K91o8j57
4613b34J28L22k23J49Kmp9k86M21r1O1j34N8k09K06R7l36MJ0K77m0k82M03m10
4637a90n2N31j2n71O37l02k8L0j85K4L0RJ4P0k80L54J8k33R5Q7j02K13j55j7j28
4662a43j40N30n9m09J64K25k84J39O5j40K10l15J80M9j91K02k91j1K97J99r4k48
4684f5k0J29K7%rK4k79L50k09qN9j31R7Q8l4j46K15k44M61m81l2M24j50l08M09
4709A67k79J38l23M56k28j42J05J95K3l65M23j90l18L66R2j91m0J34J61j88M2
4730C8Q7q4j71M59j57m24L02K22k81j49K37k73J05L2jL3k58M35j29j16K66k21
4752d8J20Rj14qJ29j52M56m77m5K85k43k34L77J1k97M39j78K82m03j7L05k16Q6
$$ plain form
4775 67 107 265 -210 145 10 -127 50 44 49 -37 -237 -6 6 -30 179 -39 -111 266 -235 18 109 -25 64 7
4799 7 -19 47 -15 -111 161 -24 -43 239 11 125 298 -206 -60 257 -243 79 67 -215 145 -3 48 205 -279
4822 -279 -110 142 76 70 -45 -289 129 -46 -281 126 5 83 53 -207 202 128 -206 53 162 4 289 180
4844 180 -235 177 -114 -65 104 -155 97 104 -306 153 -19 -65 210 -59 -46 189 -115 107 25 -74 66 53 -285
4867 -285 166 66 -37 150 170 -35 -1 32 9 158 75 228 39 -60 243 110 -246 236 154 73 80 -44 -53 52
4891 52 210 73 114 -146 18 184 -40 250 -113 -125 86 -284 -87 -77 -247 160 -143 -25 170 -12 74 210
4913 210 -92 -300 454 -106 10 0 -31 78 -96 -33 260 -79 -18 302 -189 -162 139 63 185 164 90 52 -4
4936 -4 -116 167 -65 17 275 -172 -119 94 -82 205 101 -27 128 -32 -130 102 176 -63 251 -39 -25 2 -13
$$ packed form
4775F7M0J58m75L55j35j37J77oNq6k00K31J2l6K09k18p2L77n01K53R1j34Q9n7
4799Gk6O6o2r6K72j85j9K82k28J14J73n04J46L17n00L22j2k82L60j48N1J57m84
4822b79J69K52o6oj15k44M18j75k35M07j21P8l0k60M09p4l34K59J09j58K85j09
4844A80m15M12k91M9J69k59K52Pm10M59j72m6K75k69J3K35l04K22q2r9J40j3l38
4867b85M51j00j03J87K0k05L4L3k3J49q3J53j89r9L03j33l56M82q2q1Pj24rJ05
4891E2J58j37M1k60J64J66k24K90l63j2K11l70J97J0j70M07l03J18J95j82Q6J36
4913B10l02k08P54n60J16j0l1J09j74O3K93l39O1L20m91K7L01p6J22k1p4l8n6
4936dj12K83k32Q2K58m47N3K13j76K87j04j28J55j60r8K32P4k39L14k90J4K7j5
$$ plain form
4959 -13 3 185 -181 77 -92 17 204 -163 -239 91 38 -46 92 -28 86 -147 -330 111 -103 -83 61 -37
4981 -37 78 258 -340 -47 111 -350 40 -113 -278 193 48 -13 169 34 -164 283 137 108 -9 -149 159
5002 159 60 -40 -22 -42 -148 327 143 -139 92 -31 -129 61 -304 272 -168 -212 101 -56 -68 370 -40 -123
5024 -123 36 -8 3 -139 -302 252 185 -321 8 -100 -137 196 -134 -327 -165 -100 137 38 -150 200 305 -148
5046 -148 170 -158 -126 180 18 -111 -1 1 200 -37 -143 466 69 -15 190 179 -278 89 80 -73 55 69 -89
5069 -89 -147 -46 144 -39 -237 626 -98 -289 119 15 -263 188 -69 185 -122 -236 446 -107 -18 169 45
5090 45 -47 186 197 145 -115 -258 227 -52 -22 267 155 -208 246 49 -350 -88 24 -9 -169 -45 356 -61
5112 -61 -267 94 -240 -97 398 -89 -126 -87 35 65 -26 -239 245 1 -325 82 -243 39 87 67 37 -53 -162
$$ packed form
4959a3J6J82l66K58j69J09J87l67p6L30n3q4J38j20J14k33j83M41k14K0J44r8
4981c7J15J80n98K93J58m61L90j53j65M71j45o1J82j35j98M47j46k9j17j40L08
5002A59r9j00J8k0j06M75j84k82K31j23r8J90l65N76m40m4L13j57j2M38m10q3
5024a23J59m4J1j42j63N54o7n06L29j08l7L33l30j93J62O5K37r9j88L50J05m53
5046a48L18l28L2L06j62j29J10KJ99k37j06O09l97q4K05j1m57L67rj53J28J4j58
5069h9n8J01J90j83j98Q63p24j91M08j04k78M51k57K54l07j14O82n53Q9J87j24
5090D5r2K33J1n2k60j43M85k79L0K89j12l63M54j97l99K62J12l3j60J24M01m17
5112f1k06L61l34J43M95m87l7L9J22L0r1k13M84k44l26M07l25K82M8k0l0r0j09
$$ plain form
5135 -162 72 -44 -11 119 61 -280 306 -90 -401 336 82 -161 97 80 187 45 -64 108 -187 -13 180
5156 180 54 -339 135 11 37 117 -5 91 -206 -21 41 -147 -172 367 -36 -65 -77 84 -202 -17 -71 77 -20
5179 -20 115 301 -144 -192 267 -15 -92 362 38 85 -79 58 104 -165 -83 550 -185 -380 332 101 -290 130
5201 130 159 9 159 -12 0 -167 63 119 -70 -201 412 -24 -28 -81 -54 -18 -48 -152 85 -245 -140 273 -109
5224 -109 -192 148 11 95 278 83 135 -176 -230 147 -266 -139 309 94 -87 224 8 -203 -4 149 -82
5245 -82 25 -60 136 -103 -88 86 -101 -213 296 -19 -51 138 -81 173 -25 -118 192 -19 -227 478 -46 -185
5267 -185 208 -17 47 96 -43 115 -180 -54 132 -214 -148 352 -108 -179 138 -28 -9 18 54 223 -3 -157
5289 -157 320 -236 15 322 48 -40 104 16 -52 -96 -167 145 -84 -235 359 -396 -177 414 -87 -110 285 -49
$$ packed form
5135a62K34j16L3J30n8l41N86l96l11P37k54k43K58j7J07j42j09J72k95J74J93
5156A80j26l93M74j24K6Q0j22R6k97J85O2j88k5N39m03k9j2J61k86J85n4J48r7
5179b0J35J86m45m8M59k82p7M54l24M7j64J37M6k69Q2O33p35j95P12k31l91M20
5201A30K9j50J50j71J2j67K30N6j89j31O13m36mn3K7L6l0j04K37l30J05M13l82
5224a09q3L40j37Q4J83j95N2l11n4L77m13J27M48k15j81L11k16k11J99J53k31
5245h2J07q5J96k39J5J74j87j12N09l15l2J89k19K54j98r3L10k11k08P05n24j39
5267a85L93k25O4M9j39J58k95J26J86l46O6N00m60p1L17j66J9K7L6J69k26j54
5289a57M77n56K51L07k74q8J44q8o8m4p1L12k29j51N94p55K19N91n01k3L95l34
$$ plain form
5311 -49 48 -19 71 398 -107 -190 206 -30 -374 224 -132 -149 19 -189 -239 -98 -162 -31 -340 -246 334 110 -148
5334 -148 150 -207 36 199 -75 107 337 -341 232 -308 -245 66 -178 -99 38 -21 -222 181 -292 -11 -198
5355 -198 2 229 -17 -181 156 -40 72 64 -112 33 -31 -343 -80 -71 -243 232 -55 -179 180 -174 -146 162
5377 162 -245 131 216 -163 135 109 -310 1 35 -163 85 -225 -5 94 -189 -86 -53 -256 23 -45 -191 82
5399 82 33 -50 21 -103 157 167 -54 -39 88 -215 214 -93 -128 113 -43 -100 -22 -172 -9 250 -204 -6 -138
5422 -138 -173 134 -89 -37 227 -103 -54 215 169 80 31 -215 141 -21 -153 190 -233 -122 247 -82 70 202
5444 202 -155 89 232 -234 185 127 -218 117 -211 -203 154 -180 -30 214 -74 -53 76 -142 -131 -63 110 175
$$ packed form
5311d9R7o7R0L27n05q3L96k36l44N98l56j7J68k08n0J41o4J31l09R4N80k24k58
5334a48K98l57K43J63k74J82K30o78N73n40O3L11k44P9J37n9k01M03m73K81j87
5355a98K00K27k46j64L37j96J12qj76J45o4l12K63Rj72M75k87j24L59l54K8L08
5377A62m07L76Q5l79K98k6m19L11L4j98K48l10K20R9k83J03L3k03K79o8j46K73
5399H2m9q3P1j24K60J0k21J5J27l03M29l07l5K41j56n7P8j50J63K59m54J98j32
5422a38l5L07k23N2K64l30M9K69m6q9m9k46L56j62j32L43m23J11L69l29J52J32
5444B02l57K44J43m66M19n8l45L35l28QL57l34J50K44k88K1J29k18J1O8J73O5
$$ [...]
8191a89
##END NTUPLES=NMR FID
##END=
