##TITLE=1H_92-2021
 CDCl3+DMSO,8 sc, 
 23.9.2021
##JCAMPDX= 6.0         $$ Bruker NMR JCAMP-DX V2.0
##DATA TYPE= NMR FID
##DATA CLASS= NTUPLES
##ORIGIN= UXNMR, Bruker Analytische Messtechnik GmbH
##OWNER= root
$$ XWIN-NMR		Version 3.5
$$ Thu Sep 23 10:19:38 2021 Russian Standard Time (UT+4h)  she@DPX200
##.OBSERVE FREQUENCY= 200.1314
##.OBSERVE NUCLEUS= ^1H
##.DELAY= (6, 6)
##.ACQUISITION MODE= SIMULTANEOUS
##.ACQUISITION SCHEME= undefined
##.AVERAGES= 8
##.DIGITISER RES= 18
##SPECTROMETER/DATA SYSTEM= spect
##.PULSE SEQUENCE= zg30
##.SOLVENT NAME= CDCl3
##.SHIFT REFERENCE= (INTERNAL, CDCl3, 0, 15.7039)
##AUDIT TRAIL= $$ (NUMBER, WHEN, WHO, WHERE, WHAT)
$$ ##TITLE= Audit trail, XWIN-NMR		Version 3.5
$$ ##JCAMPDX= 5.01
$$ ##ORIGIN= Bruker BioSpin GmbH
$$ ##OWNER= she
$$ F:/spectra/data/she/nmr/H-F/1/audita.txt
$$ ##AUDIT TRAIL=  $$ (NUMBER, WHEN, WHO, WHERE, WHAT)
(   1,<2021-09-23 10:17:59.98 +0400>,<she>,<DPX200>,
      <created by zg, POWCHK disabled, PULCHK disabled
       configuration hash MD5:
       00 E9 B6 7A A2 85 ED C7 34 08 36 98 17 FE 4E 26
       data hash MD5: 16K
       A2 7F F6 CC 82 0F 5B 89 A5 23 BA B4 7D 4A C1 C7>)
$$ ##END=
$$ 
$$ hash MD5
$$ 53 A7 8C 1B B9 01 0E F2 3A EF 59 30 46 19 E8 E0
##$RELAX= 
##$RELAX= 
##$RELAX= 
##$RELAX= 
##$RELAX= 
##$RELAX= 
$$ Bruker specific parameters
$$ --------------------------
##$DU= <F:/spectra>
##$EXPNO= 1
##$NAME= <H-F>
##$PROCNO= 1
##$TYPE= <nmr>
##$USER= <she>
##$AMP= (0..31)
100 100 100 100 100 100 100 100 100 100 100 100 100 100 100 100 100 100 
100 100 100 100 100 100 100 100 100 100 100 100 100 100 
##$AQSEQ= 0
##$AQ_mod= 1
##$AUNM= <au_zg>
##$AUTOPOS= <>
##$BF1= 200.13
##$BF2= 200.13
##$BF3= 200.13
##$BF4= 200.13
##$BF5= 200.13
##$BF6= 200.13
##$BF7= 200.13
##$BF8= 200.13
##$BYTORDA= 1
##$CFDGTYP= 0
##$CFRGTYP= 5
##$CHEMSTR= <none>
##$CNST= (0..31)
1 1 145 1 1 1 1 1 1 1 1 1 1 1 1 1 1 1 1 1 1 1 1 1 1 1 1 1 1 1 1 1 
##$CPDPRG= <>
##$CPDPRG1= <>
##$CPDPRG2= <>
##$CPDPRG3= <>
##$CPDPRG4= <mlev>
##$CPDPRG5= <mlev>
##$CPDPRG6= <mlev>
##$CPDPRG7= <mlev>
##$CPDPRG8= <mlev>
##$CPDPRGB= <>
##$CPDPRGT= <>
##$D= (0..31)
0 1.2 0 0 0 0 0 0 0 0.06 0 0.03 0 0 0 0 0.0002 0 0 0 0 0 0 0 0 0 0 0 0 
0 0 0 
##$DATE= 1632377879
##$DBL= (0..7)
120 120 120 120 120 120 120 120 
##$DBP= (0..7)
150 150 150 150 150 150 150 150 
##$DBP07= 0
##$DBPNAM0= <>
##$DBPNAM1= <>
##$DBPNAM2= <>
##$DBPNAM3= <>
##$DBPNAM4= <>
##$DBPNAM5= <>
##$DBPNAM6= <>
##$DBPNAM7= <>
##$DBPOAL= (0..7)
0.5 0.5 0.5 0.5 0.5 0.5 0.5 0.5 
##$DBPOFFS= (0..7)
0 0 0 0 0 0 0 0 
##$DE= 6
##$DECBNUC= <off>
##$DECIM= 32
##$DECNUC= <off>
##$DECSTAT= 4
##$DIGMOD= 1
##$DIGTYP= 9
##$DL= (0..7)
0 120 120 120 120 120 120 120 
##$DP= (0..7)
150 150 150 150 150 150 150 150 
##$DP07= 0
##$DPNAME0= <>
##$DPNAME1= <>
##$DPNAME2= <>
##$DPNAME3= <>
##$DPNAME4= <>
##$DPNAME5= <>
##$DPNAME6= <>
##$DPNAME7= <>
##$DPOAL= (0..7)
0.5 0.5 0.5 0.5 0.5 0.5 0.5 0.5 
##$DPOFFS= (0..7)
0 0 0 0 0 0 0 0 
##$DQDMODE= 0
##$DR= 18
##$DS= 0
##$DSLIST= <SSSSSSSSSSSSSSS>
$$ [...]
##$SUBNAM2= <"">
##$SUBNAM3= <"">
##$SUBNAM4= <"">
##$SUBNAM5= <"">
##$SUBNAM6= <"">
##$SUBNAM7= <"">
##$SUBNAM8= <"">
##$SUBNAM9= <"">
##$SW= 20.0188988654967
##$SWIBOX= (0..15)
0 0 2 0 0 0 0 0 0 0 0 0 0 0 0 0 
##$SW_h= 4006.41025641026
##$TD= 16384
##$TD0= 1
##$TE= 0
##$TE2= 300
##$TE3= 300
##$TEG= 300
##$TL= (0..7)
0 120 120 120 120 120 120 120 
##$TP= (0..7)
150 150 150 150 150 150 150 150 
##$TP07= 0
##$TPNAME0= <>
##$TPNAME1= <>
##$TPNAME2= <>
##$TPNAME3= <>
##$TPNAME4= <>
##$TPNAME5= <>
##$TPNAME6= <>
##$TPNAME7= <>
##$TPOAL= (0..7)
0.5 0.5 0.5 0.5 0.5 0.5 0.5 0.5 
##$TPOFFS= (0..7)
0 0 0 0 0 0 0 0 
##$TUNHIN= 0
##$TUNHOUT= 0
##$TUNXOUT= 0
##$USERA1= <user>
##$USERA2= <user>
##$USERA3= <user>
##$USERA4= <user>
##$USERA5= <user>
##$V9= 5
##$VALIST= <valist>
##$VCLIST= <CCCCCCCCCCCCCCC>
##$VD= 0
##$VDLIST= <DDDDDDDDDDDDDDD>
##$VPLIST= <PPPPPPPPPPPPPPP>
##$VTLIST= <TTTTTTTTTTTTTTT>
##$WBST= 1024
##$WBSW= 4
##$XGAIN= (0..3)
0 0 0 0 
##$XL= 0
##$YL= 0
##$YMAX_a= 360574
##$YMIN_a= -350085
##$ZGOPTNS= <>
##$ZL1= 120
##$ZL2= 120
##$ZL3= 120
##$ZL4= 120
##$ABSF1= 10
##$ABSF2= 0
##$ABSG= 5
##$ABSL= 3
##$ALPHA= 0
##$AQORDER= 0
##$ASSFAC= 0
##$ASSFACI= 0
##$ASSFACX= 0
##$ASSWID= 0
##$AUNMP= <proc_1d>
##$AZFE= 0.1
##$AZFW= 0.1
##$BCFW= 1
##$BC_mod= 2
##$BYTORDP= 1
##$COROFFS= 0
##$CY= 11.3945322036743
##$DATMOD= 1
##$DC= 2
##$DFILT= <>
##$DTYPP= 0
##$F1P= 2.36226072786647
##$F2P= -0.459571619588291
##$FCOR= 0.5
##$FTSIZE= 0
##$FT_mod= 4
##$GAMMA= 1
##$GB= 0.15
##$INTBC= 1
##$INTSCL= 1
##$ISEN= 128
##$LB= 0.24
##$LEV0= 0
##$LPBIN= 0
##$MAXI= 10000
##$MC2= 0
##$MEAN= 0
##$ME_mod= 0
##$MI= 1.114404
##$NCOEF= 0
##$NC_proc= 0
##$NLEV= 6
##$NOISF1= 3.799351
##$NOISF2= 2.8
##$NSP= 1
##$NTH_PI= 0
##$NZP= 0
##$OFFSET= 15.70392
##$PC= 1
##$PHC0= -14076.63
##$PHC1= 10.60088
##$PH_mod= 1
##$PKNL= yes
##$PPARMOD= 0
##$PSCAL= 0
##$PSIGN= 0
##$REVERSE= no
##$SF= 200.130013532006
##$SI= 16384
##$SIGF1= 3
##$SIGF2= 2
##$SINO= 400
##$SIOLD= 16384
##$SREGLST= <1H.CDCl3>
##$SSB= 0
##$STSI= 0
##$STSR= 0
##$SW_p= 3612.71676300578
##$SYMM= 0
##$S_DEV= 0
##$TDeff= 0
##$TDoff= 0
##$TI= <>
##$TILT= no
##$TM1= 0
##$TM2= 0
##$TOPLEV= 0
##$USERP1= <user>
##$USERP2= <user>
##$USERP3= <user>
##$USERP4= <user>
##$USERP5= <user>
##$WDW= 1
##$XDIM= 8192
##$YMAX_p= 0
##$YMIN_p= 0
$$ End of Bruker specific parameters
$$ ---------------------------------
##NTUPLES= NMR FID
##VAR_NAME=  TIME,          FID/REAL,        FID/IMAG
##SYMBOL=    X,             R,               I
##VAR_TYPE=  INDEPENDENT,   DEPENDENT,       DEPENDENT
##VAR_FORM=  AFFN,          ASDF,            ASDF
##VAR_DIM=   8192,          8192,            8192
##UNITS=     SECONDS,       ARBITRARY UNITS, ARBITRARY UNITS
##FACTOR=    0.0002496,     1,               1
##FIRST=     0,             0,               0
##LAST=      2.0444736,     0,               0
##MIN=       0,             -350085,         0
##MAX=       2.0444736,     360574,          0
$$ Real data points
##PAGE= N=1
##DATA TABLE= (X++(R..R)), XYDATA
$$ plain form
0 0 0 0 0 0 0 0 0 0 0 0 0 8 -8 8 -8 16 -16 24 -24 32 -40 48 -56 64 -74 88 -104 120 -137 159 -179 205 -232
33 -232 264 -297 337 -377 423 -471 526 -587 652 -722 799 -886 978 -1080 1190 -1312 1444
50 1444 -1593 1754 -1933 2133 -2358 2610 -2897 3228 -3611 4063 -4608 5274 -6115 7217 -8723
65 -8723 10925 -14466 21131 -38241 185466 360574 189457 90393 -61275 -52849 -38419 30440
77 30440 -13675 -117371 -189302 -218278 -171649 -55198 26934 83341 15001 -33106 -27854 -11412
89 -11412 61672 91408 50498 -11531 -135623 -177054 -157453 -130173 -93852 -114195 -141746 -167443
101 -167443 -175879 -84381 1953 65036 93142 70596 71003 55219 74757 138165 121866 81564
113 81564 17301 -53121 -77706 -101989 -80234 -63663 -104421 -123673 -139916 -120505 -71627 -33165
$$ packed form
0@%%%%%%%%%%%Qj6J6j6K4l2M0m8N6p2Q8j04J20j38J62j92K24k57K96l38L84m37
33b32M96n61O34p14Q00q94R97j113J239j374J521j685J864k058K270k502K756
50A444l037L347l687M066m491M968n507O125o839P674q671R882j1389J3332j5940
65h723J9648k5391L5597n9372K23707J75108j71117r9064j51668Q426J4430O8859
77C0440m4115j03696p1931k8976M6629J16451Q2132N6407o8340m8107N252J6442
89a1412P3084K9736m0910o2029j24092m1431J9601K7280L6321k0343k7551k5697
101a67443q436R1498Q6334O3083K8106k2546M07j5784J9538O3408j6299m0302
113H1564o4263p0422k4585k4283K1755J6571m0758j9252j6243J9411M8878L8462
$$ plain form
125 -33165 24699 29437 8440 15757 14508 45906 56966 44346 38229 -17516 -51253 -52011 -52540 -27678
139 -27678 -32894 -35463 -29051 -40198 -5934 33896 69446 99645 91869 102219 100801 92615 113445
152 113445 107055 96035 66024 21077 13387 -9656 -19938 -10771 -25542 -32818 -48432 -45714 -20535
165 -20535 -17010 6097 20246 12275 12452 3499 15906 19193 3342 6535 -14799 -35009 -39386 -48673
179 -48673 -35685 -38523 -41969 -31299 -36477 -22737 -7396 5832 28549 25356 29483 34571 29688
192 29688 38053 31078 31640 27380 736 -965 -6532 -15653 -12785 -18872 -13783 -20278 -26613 -9550 -8067
207 -8067 -3102 4401 4453 9885 -233 3868 11654 203 2124 -3799 -11644 -11926 -20896 -13724 -12265
222 -12265 -17663 -10735 -13764 -7845 -2798 -2150 10761 9487 9826 13122 9234 14917 9583 7617 11876
$$ packed form
125c3165N7864M738k0997P317j249L1398J1060j2620o117n5745l3737p58n29K4862
139b7678n216k569O412j1147L4264L9830L5550L0199p776J0350j418q186K0830
152A13445o390j1020l0011m4947p690k3043j0282R167j4771p276j5614K718K5179
165b0535L525K3107J4149p971J77q953J2407L287j5851L193k1334k0210m377r287
179d8673J2988k838l446J0670n178J3740J5341J3228K2717l193M127N088m883
192B9688Q365o975N62m260k6644j701n567r121K868o087N089o495o335J7063J483
207h067M965P503N2N432j0118M101P786j1451J921n923p845k82q970P172J459
222a2265n398O928l029N919N047O48J2911j274L39L296l888N683n334j966M259
$$ plain form
237 11876 479 -1431 -2456 -5492 -3097 -9973 -6229 -4816 -11750 -5087 -3540 -1575 462 -2375 4030
252 4030 376 -2319 3792 377 1681 -1254 -3526 137 -6218 -3906 -393 -3685 -700 -2902 21
267 21 3407 -453 5471 5695 4039 6327 3436 7845 6135 3109 7465 2746 2703 2367 -82 3905 -159
284 -159 -7 2669 -1420 847 -195 399 3179 -1736 1186 1885 -728 1428 -542 1711 205 -3117
300 -3117 1476 -1125 -2382 -498 -1704 -134 -2897 -2314 678 -2788 -837 -170 -1326 190 -2172 -265
316 -265 335 -2149 1298 -749 -136 540 -1721 1237 -159 -1012 485 -1311 999 -267 -979 2410 -702
333 -702 83 949 406 1777 -347 1434 2566 -800 1430 820 7 726 -726 1090 -189 -1786 447
350 447 -1374 -773 -527 -1591 285 -1669 -715 169 -1348 192 -906 -773 493 -2080 83 -541 -1189
$$ packed form
237A1876j1397j910j025l036K395o876L744J413o934O663J547J965K037k837O405
252D030l654k695O111l415J304k935k272L663o355K312L513l292K985k202K923
267B1L386l860N924K24j656K288k891M409j710l026M356m719m3l36k449L987m064
284a59J52K676m089K267j042N94K780m915K922O99k613K156j970K253j506l322
300c117M593k601j257J884j206J570k763N83K992l466J951O67j156J516k362J907
316b65O00k484L447k047O13O76k261K958j396q53J497j796K310j266p12L389l112
333g02P85Q66n43J371k124J781J132l366K230o10q13P19j452J816j279j597K233
350D47j821O01K46j064J876j954R54Q84j517J540j098J33J266k573K163o24o48
$$ plain form
367 -1189 -565 -2263 -521 -790 -2183 -143 -979 -490 -668 -1113 664 -790 -638 700 -697 -235 -428
384 -428 -697 323 -1415 -227 -381 -1730 -200 -1097 -174 253 -689 1173 563 321 1492 823 2128 1502
402 1502 1363 2456 741 1945 1636 791 1774 649 1015 1054 87 1289 643 814 1080 267 1416 953
420 953 650 933 -172 450 -270 -800 30 -1284 -1209 -693 -1428 -1000 -1820 -1107 -474 -1237 -303 -251 -265 518 -69
441 -69 922 506 171 1399 422 517 692 -246 719 72 168 402 -222 254 -416 -252 74 -251 -129 -52 -301
462 -301 111 -710 -263 -637 -1245 -561 -1006 -817 -952 -1538 -815 -1326 -1044 -710 -1237 -458 -546 -337 368 83 770
483 770 757 490 1040 666 778 1184 483 997 782 448 605 6 522 394 115 160 -68 225 35 -245 -117
504 -117 26 -279 -93 -272 -217 -364 -581 -146 -777 -408 -537 -676 -368 -618 -232 -345 -197 33 -159 342 245
$$ packed form
367a189O24j698J742k69j393K040q36M89j78m45J777j454J52J338j397M62j93
384d28k69J020j738J188j54j349J530q97R23M27r42J862o10k42J171o69J305o26
402A502j39J093j715J204l09q45R83j125L66L9r67J202o46J71K66q13J149m63
420I53l03K83j105O22p20n30Q30j314P5N16p35M28q20P13O33p63R34N2j4P83n87
441f9R91m16l35J228r77R5J75r38R65o47R6K34o24M76o70J64L26l25J22P7k49
462c01M12q21M47l74o08O84m45J89j35n86P23n11K82L34n27P79q8K09P05k85O87
483G70j3k67N50l74J12M06p01N14k15l34J57n99N16j28k79M5k28K93j90k80J28
504a17J43l05J86j79N5j47k17M35o31L69j29j39L08k50L86j13J48K30j92N01r7
$$ plain form
525 245 401 740 698 522 827 535 657 538 283 612 103 165 321 -72 173 -52 -33 31 -14 -219 -132 -309
547 -309 -42 96 24 -56 -221 -447 -461 -170 -154 -297 -367 -363 -177 -169 -442 -375 -367 -183 143 116 449 376 330 244 312 596
573 596 512 276 537 325 -77 194 380 16 357 -12 -270 -162 38 -298 -90 -74 54 -202 32 -90 -214
594 -214 -129 -177 -218 -130 -53 -170 -271 -194 -401 -297 -154 -493 -371 -119 -292 -95 -438 7 89 -274 90 114 -113
617 -113 8 279 47 383 -97 0 -112 -239 102 -277 -51 75 -214 -155 42 118 28 233 102 204 370 222
639 222 316 251 80 -71 372 291 180 17 222 182 -53 179 -64 148 -36 159 318 306 420 436 338 142 492
662 492 -3 266 138 121 124 -384 -92 -374 -105 -361 -310 22 -65 -94 31 -50 -53 -122 28 193 60 -180 49 -189
686 -189 -249 -43 -225 -315 -282 -280 -409 -226 -170 -242 -312 35 -51 278 -63 40 194 20 245 -155 -131 82 166 -302
$$ packed form
525B45J56L39m2j76L05k92J22j19k55L29n09O2J56l93K45k25J9O4m5k05Q7j77
547c09K67J38p2q0j65k26j4K91J6j43p0MJ86Qk73O7QJ84L26k7L33p3m6q6O8K84
573E96q4k36K61k12m02K71J86l64L41l69k58J08K00l36K08J6J28k56K34j22j24
594b14Q5m8m1Q8P7j17j01P7k07J04J43l39J22K52j73J97l43M45Q2l63L64K4k27
617a13J21K71k32L36m80R7j12j27L41l79K26J26k89N9J97P6r0K05j31J02J66j48
639B22R4o5j71j51M43q1j11j63K05m0k35K32k43K12j84J95J59j2J14J6r8j96L50
662D92m95K69j28j7Ln08K92k82K69k56N1L32q7k9J25q1lo9J50J65j33k40K29k38
686a89o0K06j82r0L3Kj29J83N6p2p0L47q6L29l41J03J54j74K25m00K4K13Q4m68
$$ plain form
710 -302 -176 -39 -94 -48 164 -164 -100 317 137 372 282 316 164 337 85 253 155 146 118 -181 -271 61 -201 187
734 187 -9 108 200 -57 -172 -119 -171 -2 34 191 -23 -3 16 -179 -128 45 138 -130 74 87 -165 -247 183 -222
758 -222 25 -68 25 87 257 111 -8 -12 111 23 33 123 -161 -161 134 -108 -168 -95 -154 -42 -9 157 -45 105 -71
783 -71 231 61 118 103 417 263 -78 172 42 314 -84 -230 81 70 -73 -175 -222 -130 78 84 -33 176 168 56
807 56 -111 138 158 97 -86 137 -161 220 9 -69 75 -34 -30 -76 58 -69 99 -45 100 198 284 245 -66 203
831 203 202 264 236 -91 80 50 27 -87 -58 -45 -62 9 -246 -125 -42 -218 -75 -139 -119 -86 156 -108 12 80 -43
856 -43 -352 16 164 -50 -285 -183 -198 -52 -351 -146 228 -234 207 282 -61 213 107 111 139 49 30 -78 -224
879 -224 -147 -245 -115 221 -4 -224 -252 11 131 -60 141 -26 -8 290 181 135 67 260 -115 116 -36 -78 -302
$$ packed form
710c02J26J37n5M6K12l28O4M17j80K35r0L4j52J73k52J68r8rk8k99r0L32k62L88
734A87j96J17R2k57j15N3n2J69L6J57k14K0J9j95N1J73R3k68K04J3k52q2M30m05
758b22K47r3R3O2J70j46j19mJ23q8J0R0k84%K95k42o0P3n9J12L3J66k02J50j76
783g1L02j70N7j5L14j54l41K50j30K72l98j46L11j1j43j02m7R2K08Oj17K09qj12
807E6j67K49K0o1j83K23k98L81k11p8J44j09Mm6J34j27J68j44J45R8Q6l9l11K69
831B03jO2k8l27J71l0k3j14K9J3j7P1k55J21Q3j76J43o4K0L3K42k64J20O8j23
856d3l09L68J48k14k35J02j5J46k99K05L74m62M41P5l43K74j06MK8r0j9j08j46
879b24P7r8J30L36k25k20k8K63J20j91K01j67J8K98j09m6o8J93l75K31j52m2k24
$$ plain form
902 -302 -131 -258 28 -120 -23 265 111 -54 382 -39 5 39 76 -85 165 -168 -274 -41 -14 -159 -118 -115 -239
925 -239 -113 -298 -114 156 -88 204 230 143 235 -271 48 -68 35 60 -81 36 -161 -339 19 -420 -372 167
947 167 -162 -68 135 10 94 123 87 -88 131 169 -127 71 205 171 -177 -61 -66 -87 -183 14 -111 228 140 184
971 184 -27 -63 -248 284 136 -30 96 -11 -64 79 -234 -17 -50 80 -48 -289 78 -231 3 135 217 -126
993 -126 214 -132 -316 -160 152 -23 -26 141 -141 -121 -3 -117 -231 -262 -156 -51 -126 -219 91 -205 0 162
1015 162 -98 -31 130 218 183 209 -171 -104 93 14 34 66 -249 -16 -242 -63 120 -181 217 170 22 99 -134
1038 -134 44 57 79 103 55 13 221 -23 164 -258 -52 -169 24 -177 170 -78 106 282 -115 186 88 112
1060 112 178 47 46 225 -142 -68 110 8 -77 -57 -157 66 -287 -363 -205 38 -63 35 -99 86 117 -169 -95
$$ packed form
902c02J71j27K86j48R7K88j54j65M36m21M4L4L7j61K50l33j06K33K7j45M1Lj24
925b39J26j85J84K70k44K92K6q7R2n06L19j16J03K5j41J17j97j78L58m39M8N39
947A67l29R4K03j25Q4K9l6j75K19L8k96J98J34l4l48J16nk1r6J97j25L39q8M4
971A84k11l6j85N32j48j66J26j07n3J43l13K17l3J30j28k41L67l09K34J32Q2l43
993a26L40l46j84J56L12j75lJ67k82K0J18j14j14l1J06J05p5r3L10k96K05J62
1015A62k60O7J61Q8l5K6l80O7J97p9K0L2l15K33k26J79J83l01L98m7j48P7k33
1038a34J78J3K2K4m8m2K08k44J87m22K06j17J93k01L47k48J84J76l97L01r8K4
1060A12O6j31jJ79l67P4J78j02q5K0j00K23l53p6J58K43j01R8j34J85L1k86P4
$$ plain form
1083 -95 74 147 -41 -285 -119 105 68 194 62 14 -180 -24 76 -247 59 -63 -148 53 33 11 87 -53 -72
1106 -72 235 51 -58 -94 -69 72 -17 9 -58 -75 -85 48 128 -337 121 162 22 166 -238 129 38 -30 60 193
1130 193 -89 -44 88 196 50 -135 -92 -72 -386 -82 -82 83 60 225 52 -65 -14 47 -155 -123 270 213 7
1153 7 377 80 52 -285 -62 -195 -195 122 -11 74 -116 -106 178 -78 263 144 78 -142 12 -101 9 -87 0
1176 0 193 -314 -150 -153 78 -132 -82 -80 -110 -76 -190 -99 20 56 -112 167 -25 32 -467 48 104 -146 -381 -251
1200 -251 -270 225 -26 176 -35 14 -30 70 95 -11 -187 207 65 45 65 190 -61 -181 103 44 -90 -69 -5
1223 -5 -165 230 5 -68 -218 -222 101 -72 -27 153 123 -50 39 67 194 -133 114 38 -9 -97 20 -384 -11 207
1247 207 -141 -77 -58 133 -146 -122 316 -15 37 -163 -189 -241 -190 105 -164 116 -145 -113 -28 -42 -54 -67 -349 171
$$ packed form
1083i5J69P3j88k44J66K24l7J26j32m8j94J56J00l23L06j22q5K01k0k2P6j40j9
1106g2L07j84j09l6K5J41q9K6o7j7j0J33Q0m65M58M1j40J44m04L67r1o8R0J33
1130A93k82M5J32J08j46j85M3K0l14L04%J65k3J65j73j17N1O1k02L2L93n7k06
1153GL70k97k8l37K23j33%L17j33Q5j90J0K84k56L41j19o6k20J54j13J10r6Q7
1176@J93n07J64lK31k10N0Kl0L4j14R1J19L6j68K79j92N7m99N15N6k50k35J30
1200b51j9M95k51K02k11M9m4J00K5j06j76L94j42k0K0J25k51j20K84n9j34K1O4
1223ej60L95k25p3j50mL23j73M5J80l0j73Q9K8J27l27K47p6m7q8J17m04L73K18
1247B07l48O4J9J91k79K4M38l31N2k00k6n2N1K95k69K80k61L2Q5j4j2j3k82N20
$$ plain form
1271 171 -80 -96 146 -48 -35 -110 -295 340 8 -148 93 206 55 -246 -136 -10 -116 -203 195 244 -35 12
1293 12 191 125 23 -172 -187 156 78 -1 -339 -16 319 -137 -89 -66 -63 -154 -119 36 55 -55 -164 -187 103 -101
1317 -101 -46 23 41 167 63 -193 -85 63 -236 -145 -93 74 -216 159 123 153 156 -294 53 99 198 143 4 158
1341 158 86 -56 -175 -71 -214 -88 6 -102 -7 468 -37 70 -341 184 144 -162 87 -48 9 126 -169 -72
1363 -72 -109 -101 175 -162 356 -142 37 491 -97 15 84 -55 -69 254 -278 63 -54 -210 12 1 1 -96 -274
1386 -274 -49 -160 -44 -18 117 95 -8 239 72 -237 65 7 -153 92 -6 36 214 -96 -53 -100 -138 5 91
1409 91 187 -87 352 -42 -144 -7 91 108 -307 102 166 163 52 -36 35 86 -158 26 -148 -522 121 22 125 -48
1433 -48 -154 -87 99 190 -14 -53 -71 141 -9 178 295 93 -3 20 -283 101 129 -143 -3 -169 -291 -169 -144
$$ packed form
1271A71k51j6K42j94J3p5j85O35l32j56K41J13j51l01J10J26j06q7L98M9k79M7
1293A2J79o6j02j95j5L43p8p9l38L23L35m56M8K3Lr1L5J55J9j10j09k3K90k04
1317a01N5O9J8J26j04k56J08J48k99R1N2J67k90L75l6L0Lm50L47M6R9n5j39J54
1341A58p2j42j19J04j43J26R4j08R5M75n05J07m11N25m0l06K49j35N7J17k95R7
1363g2l7QK76l37N18m98J79M54n88J12O9j39j4L23n32L41j17j56K22j1%r7j78
1386b74K25j11J16K6J35k2j03K47j67l09L02n8j60K45r8M2J78l10M3m7l8J43Q6
1409I1R6k74M39l94j02J37R8J7m15M09O4lj11q8P1N1k44J84j74l74O43r9J03j73
1433d8j06O7J86R1k04l9j8K12j50J87J17k02r6K3l03L84K8k72J40j66j22J22K5
$$ plain form
1456 -144 128 -62 -138 11 -45 -154 -22 94 30 39 103 -68 62 -178 -75 207 -41 -153 -27 51 -112 203
1478 203 66 -337 -54 349 -234 50 107 191 -139 -73 191 15 -350 -80 -98 -53 290 -103 -136 -176 -178 -256 -70
1501 -70 -223 352 191 -211 93 190 106 -22 16 -117 56 -45 -18 -54 165 109 -120 -140 -35 5 278 5 111
1524 111 1 164 207 -205 186 38 -8 -66 28 -145 -46 89 -79 -90 251 -21 -100 -185 215 -72 -7 4 -121
1547 -121 -215 -31 -170 -27 338 214 -99 4 81 206 90 191 -60 -136 8 -55 0 -209 16 -97 -161 5
1569 5 105 -102 -11 -224 115 127 86 -323 27 135 -125 81 -151 -2 80 83 10 -155 -87 63 -95 26 -102
1592 -102 64 195 -2 289 19 18 123 -215 -28 60 -20 23 -3 31 -73 -151 -14 -126 -52 -213 -198 -16 184
1615 184 -155 192 22 -204 271 -9 -98 332 11 -19 -71 220 85 -70 56 -274 -55 52 -110 134 108
$$ packed form
1456a44K72j90p6J49n6j09J32J16o4RO4j71J30k40J03K82k48j12J26P8j63L15
1478B03j37m03K83M03n83K84N7Q4l30O6K64j76l65K70j8M5L43l93l3m0kp8J86
1501g0j53N75j61m02L04R7q4j28L8j33J73j01K7l6K19n6k29k0J05M0K73k73J06
1524A11j10J63M3m12L91j48m6n8R4j73R9J35j68j1L41k72p9q5M00k87O5J1j25
1547a21r4J84j39J43L65j24l13J03P7J25j16J01k51p6J44o3N5k09K25j13o4J66
1569EJ00k07R1k13L39J2m1m09L50J08k60K06k32J49Q2Lp3j65O8J50j58J21j28
1592a02J66J31j97K91k70jJ05l38J87Q8q0M3k6L4j04p8J37j12P4j61J5J82K00
1615A84l39L47j70k26M75k80q9M30l21l0n2K91j35j55J26l30K19J07j62K44k6
$$ plain form
1636 108 40 -224 5 179 -102 18 52 203 -178 -78 14 10 -197 -15 -16 -20 74 -82 49 -25 31 -106 -7 260
1660 260 -30 310 158 -167 375 -62 -181 -107 -235 75 165 118 102 110 8 16 -47 17 37 254 175 -27 -148 -213
1684 -213 -34 314 198 54 -138 -13 -185 -6 36 -469 58 77 -159 298 156 109 37 85 73 87 115 -41 -119
1707 -119 93 -216 292 101 49 111 96 -70 -124 -77 104 157 149 -106 133 179 210 160 -171 25 -30 -118 10 318
1731 318 -152 -40 121 186 -247 -296 85 -235 -102 126 -99 -132 -161 99 206 30 218 -29 138 -47 159
1752 159 -18 -144 -187 -252 -20 241 -84 -173 210 128 196 -117 61 284 -44 -1 -73 -265 48 -179 423 218
1774 218 2 -86 -79 87 145 110 -170 -124 -114 -90 -39 334 -20 409 184 115 -121 -45 126 139 -206 247 -106 6
1798 6 44 -76 -32 203 -46 54 -74 -90 -8 -234 71 -140 -108 203 40 86 112 -61 113 -163 -40 92 -104
$$ packed form
1636A08o8k64K29J74k81J20L4J51l81J00R2mk07J82jmR4j56J31p4N6j37R9K67
1660B60k90L40j52l25N42m37j19P4j28L10R0m7j6Qj02Qo3O4K0K17p9k02j21o5
1684b13J79L48j16j44j92J25j72J79M2n05N27J9k36M57j42m7p2M8j2J4K8j56p8
1707a19K12l09N08j91n2O2j5j66n4M7J81N3qk55K39M6L1n0l31J96n5q8J28L08
1731C18m70J12J61O5m33m9L81l20J33K28k25l3k9K60J07j76J88k47J67j85K06
1752A59j77j26m3o5K32K61l25q9L83q2O8l13J78K23l28M3p2j92L13k27O02k05
1774B18k16q8PJ66N8l5k80M6J0K4N1L73l54M29k25o9k36P6J71J3l45M53l53J12
1798FL8j20M4K35k49J00j28j6Q2k26L05k11L2L11j63M6K6j73J74k76J23J32j96
$$ plain form
1821 -104 5 5 73 -65 148 374 19 100 -88 19 26 -84 10 123 -18 223 43 82 10 21 -18 291 -62 -128
1845 -128 -91 -2 157 -9 -19 9 271 65 -92 -262 -68 -90 -177 138 -362 -208 -33 131 188 69 35 143 -23
1868 -23 81 11 -169 -47 -45 -27 -126 86 -169 192 -60 -114 190 257 -123 -170 -199 -55 13 -7 -56 -87 -134 -138 -31 233
1894 233 -24 35 -117 11 111 44 74 -103 100 -343 293 67 103 95 -94 -22 -55 -132 85 20 -210 -56 173
1917 173 75 -115 -33 -150 -14 56 -11 23 -33 -272 -103 -33 -20 -74 65 137 26 154 -162 -143 51 33 -84 102
1941 102 45 -99 -118 32 109 -52 -195 77 -81 97 -8 -54 68 12 399 44 -65 70 158 -111 -128 242
1963 242 145 -31 213 -281 105 -229 109 80 -83 143 -156 -102 72 -42 -10 40 169 251 17 166 182 -195
1985 -195 120 26 127 -22 -192 -12 -200 115 -51 -27 -48 150 19 151 -90 160 47 43 27 86 191 -93
$$ packed form
1821a04J09%O8j38K13K26l55Q1j88J07Pj10R4J13j41K41j80L9p2J1l9L09l53o6
1845a28L7Q9J59j66j0K8K62k06j57j70J94k2q7L15n00J54J75J64N7j19l4J08j66
1868b3J04p0j80J22KJ8r9K12k55L61k52n4L04O7l80m7k9J44O8k0m9l1m7mJ07K64
1894B33k57N9j52J28J00o7L0j77K03m43O36k26L6qj89P2l3p7K17o5k30J54K29
1917A73r8j90Q2j17J36P0o7L4n6k39J69P0J3n4J39P2j11J28l16J9J94j8j17J86
1941A02n7j44j9J50P7j61j43K72j58J78j05m6J22n6L87l55j09J35Q8k69j7L70
1963B42r7j76K44m94L86l34L38k9j63K26k99N4J74j14L2N0J29Q2k34J49J6l77
1985a95L15r4J01j49j70J80j88L15j66K4k1J98j31J32k41K50j13mj6N9J05k84
$$ plain form
2007 -93 46 -120 27 -75 36 114 74 47 -20 -135 -136 13 -231 -20 -21 8 4 -407 -98 168 -68 -32 76 -92
2031 -92 -177 168 43 24 -150 -85 94 37 -38 217 33 -113 31 129 172 29 165 166 90 -42 -4 -138 -44 75
2055 75 195 -85 204 -132 -205 44 -13 65 143 62 162 -34 -213 -226 282 -102 -115 -202 -30 98 47 -46 148 -10
2079 -10 -236 3 -132 -24 85 -386 64 -193 -27 -19 -198 -52 19 -311 -72 10 -67 160 -105 115 -171 143
2101 143 -163 115 -40 71 135 254 -120 313 67 132 -129 -156 41 14 133 -89 -58 -393 -157 74 191 396
2123 396 -176 -101 -94 -113 149 137 -232 -53 -27 -23 439 -98 -151 75 310 -195 68 -40 163 -29 29 -300 212
2146 212 41 -72 187 -71 -375 32 -49 98 -37 -33 -79 -103 -101 -181 -95 -31 -10 170 -6 120 251 14 5 -242
2170 -242 -59 76 -249 179 13 -211 92 -64 215 84 -7 -283 0 203 -53 -257 -229 -125 216 184 -4
$$ packed form
2007i3J39j66J47j02J11P8m0k7o7j15jJ49k44K11jK9mm11L09K66k36L6J08j68
2031i2q5L45j25j9j74O5J79n7p5K55j84j46J44R8M3j43J36Jp6j32L8j34R4J19
2055G5J20k80K89l36p3K49n7P8P8q1J00j96j79j3N08l84j3q7J72J28n1r3J94j58
2079a0k26K39j35J08J09m71M50k57J66Qj79J46P1l30K39Q2p7K27k65K20k86L14
2101A43l06K78j55J11O4J19l74M33k46O5k61k7J97k7J19k22L1l35K36K31J17K05
2123C96n72P5Pj9K62j2l69J79K6MM62n37n3K26K35n05K63j08K03j92N8l29N12
2146B12j71j13K59k58l04M07q1J47j35Mm6k4Kq0Q6O4K1J80j76J26J31k37rk47
2170b42J83J35l25M28j66k24L03j56K79j31r1k76K83K03k56k04K8J04L41l2j88
$$ plain form
2191 -4 111 -125 -132 -8 -34 -202 63 67 13 -72 252 150 34 -121 188 -314 76 -32 -24 -126 72 102 -238 -170
2215 -170 68 181 -48 -40 -96 10 90 -159 -127 0 39 -85 -51 -116 219 208 -59 -74 20 -51 -141 -119 208 -121 -48
2240 -48 -148 -43 -63 -146 -265 -316 200 -331 70 76 -87 314 18 -144 -88 -166 37 -56 -22 -434 -103 112 94 174
2264 174 -255 4 121 17 323 88 77 129 37 173 162 21 61 -15 174 -291 -292 -68 10 -93 -62 16 -111 91
2288 91 59 -23 74 51 100 -110 67 199 -211 -242 -41 -23 -127 -139 377 85 -3 141 -278 -201 -147 115 20 34 -166
2313 -166 22 -142 -90 61 103 -39 -68 -63 -96 161 30 -62 193 142 -194 -327 -184 -198 -218 232 -143 -249 237
2336 237 185 -81 125 -71 106 250 50 23 57 -172 29 56 130 -14 -18 -13 123 -50 -138 119 124 -38 59 -91
2360 -91 -73 -70 -129 228 -205 21 16 65 92 91 217 29 76 264 -32 -340 -270 19 283 38 -91 -95 138 -148 -42
$$ packed form
2191dJ15k36pJ24k6j68K65Mn4q5L24j02j16j55L09n02L90j08Qj02J98L0l40O8
2215a70K38J13k29Qn6J06Q0k49L2J27L9j24L4o5L35j1k67j5R4p1r0K2L27l29P3
2240d8j00J05k0q3j19n1N16n31M01Oj63M01k96j62N6p8K03r3L4m12L31K15j8Q0
2264A74m29K59J17j04L06k35j1N2r2J36j1j41M0p6J89m65jK24P8j03L1P8j27K02
2288I1l2q2R7k3M9k10J77J32m10l1K01J8j04j2N16k92q8J44m19P7N4K62r5J4k00
2313a66J88j64N2J51M2j42k9Nl3K57j31r2K55n1l36j33J43j4k0M50l75j06M86
2336B37n2k66K06j96J77J44k00k7L4k29K01K7P4j44mNJ36j73q8K57Nj62R7j50
2360i1J8Ln9L57m33K26nM9K7jJ26j88M7J88k96l08P0K89K64k45j29mK33k86J06
$$ plain form
2385 -42 -286 139 68 -121 193 -37 -105 73 -21 -182 -53 319 200 108 -130 219 -97 -64 135 55 242 -412
2407 -412 -117 30 -298 -22 90 -92 39 86 -8 -1 -116 180 -226 -30 73 -400 46 -123 -97 199 -80 -178
2429 -178 -155 -63 75 -70 -43 -88 97 -81 -50 -56 -16 115 143 3 -78 117 116 -227 162 -64 -113 -1 197 -212
2453 -212 -193 150 115 78 -62 -124 -23 222 91 21 57 -141 323 -16 111 -27 101 124 -244 -28 -141 117
2475 117 -73 23 5 206 -263 -145 -171 45 193 295 7 -18 -179 -19 5 -39 -49 -185 -54 -77 107 -82 100
2498 100 -73 -242 114 -73 175 -18 -171 -303 -116 197 159 68 31 -58 6 122 -145 161 30 403 -181 -38
2520 -38 6 -103 -237 101 125 -104 -17 -96 -42 271 -48 146 173 -153 171 226 -39 -53 -311 -11 -33 -277 9
2543 9 -102 157 189 122 -138 -42 88 -99 -169 -132 -124 258 -105 -137 -48 36 8 73 42 106 -95 -76 171 69 144 -23
$$ packed form
2385d2k44M25p1j89L14k30o8J78r4j61J29L72j19r2k38L49l16L3J99q0J87o54
2407d12K95J47l28K76J12j82J31M7r4Pj15K96m06J96J03m73M46j69K6K96k79r8
2429a78K3R2J38j45K7m5J85j78L1oM0J31K8j40q1J95jl43L89k26m9J12J98m09
2453b12J9L43l5l7j40o2J01K45j31p0L6j98M64l39J27j38J28K3l68K16j13K58
2475A17j90R6j8K01m69J18k6K16J48J02k88k5j61J60K4m4j0j36J31k3J84j89J82
2498A00j73j69L56j87K48j93j53j32J87L13l8r1l7q9O4J16k67L06j31L73n84J43
2520c8M4j09j34L38K4k29Q7p9N4L13l19J94K7l26L24N5k65j4k58L00k2k44K86
2543Ij11K59L2o7k60R6J30j87p0L7QL82l63l2Q9Q4k8O5l1O4k01J9K47j02P5j67
$$ plain form
2569 -23 83 -120 -142 -66 378 41 28 272 215 -120 -42 -222 29 55 -138 -10 112 -112 -48 53 35 90 -171
2592 -171 86 -110 -44 136 106 -4 84 183 -50 -232 -222 -16 -51 285 71 -165 39 -80 -31 -334 -303 -59 -73
2615 -73 252 -35 79 -46 -115 189 -126 43 274 -136 -8 -48 -89 -21 -138 -288 -118 124 -116 299 166 251
2637 251 137 -222 14 38 106 62 -114 -137 -11 -130 -309 17 -25 3 123 87 -117 -70 233 -34 97 -35 -94
2660 -94 183 40 51 -84 210 -59 145 74 -139 -45 88 258 107 -266 45 -32 -62 4 47 56 -168 167 185 137
2684 137 58 -48 -55 29 190 -72 45 -27 -35 136 90 103 112 250 -166 -8 -150 115 153 44 -58 23 131 8
2708 8 10 162 35 -23 174 69 -11 -25 81 52 78 55 100 -6 95 115 42 -170 -26 11 -64 175 40 100 74 -118
2734 -118 -33 100 102 17 26 141 -109 -227 -99 -373 54 165 -196 -66 101 -134 -92 100 58 94 190 -32 -45 255
$$ packed form
2569b3J06k03k2P6M44l37j3K44n7l35P8j80K51K6j93J28J22k24O4J01j8N5k61
2592a71K57j96O6J80l0j10Q8R9k33j82J0K06l5L36k14k36K04j19M9l03L1K44j4
2615g3L25k87J14j25o9L04l15J69K31m10J28m0m1O8j17j50J70K42k40M15j33Q5
2637B51j14l59K36K4O8m4j76k3J26j19j79L26m2K8J20l6k04M7L03k67J31j32n9
2660i4K77j43J1j35K94k69K04p1k13R4J33J70j51l73L11p7l0O6M3Rk24L35J8m8
2684A37p9j06pQ4J61k62J17p2qJ71m6J3RJ38m16J58j42K65L8j09j02Q1J08j23
2708HKJ52j27n8J97j05q0j4J06k9K6k3M5j06J01K0p3k12J44L7p5K39j35O0k6j92
2734a18Q5J33Kq5RJ15k50j18J28k74M27J11l61J30J67k35M2J92m2L6R6k22j3L00
$$ plain form
2758 255 166 -65 -87 192 96 67 -226 -22 -49 -57 -87 75 145 86 28 322 61 81 -21 -20 317 45 34 51 248
2783 248 -129 -189 -113 43 -60 149 -64 17 -85 -92 134 123 162 198 -43 34 -91 205 211 2 -174 19 -142 -152
2807 -152 -218 200 146 118 49 -2 -79 -150 -27 -182 13 -42 -133 -159 -148 254 -188 -152 24 166 -3 -6 -71 -89 -81 -72 -47
2834 -47 173 196 -112 -105 357 -177 125 130 87 79 -114 -28 222 -33 -36 -27 -130 -161 342 94 -26 -36 -101 103 309 211
2860 211 -226 73 116 65 -142 102 10 -44 27 208 -197 -206 156 -91 50 -157 388 -263 141 -77 51 90 110
2883 110 251 -177 59 -216 -142 54 124 152 139 36 -49 112 -63 17 -14 0 425 -51 302 -27 14 122 -147
2906 -147 -134 53 145 119 286 145 -55 -147 -24 -255 -4 -82 152 -16 -97 -73 -98 -53 -147 8 272 48 -122
2929 -122 13 -125 104 61 21 -53 259 249 -219 83 16 218 58 144 -22 206 -43 -276 -18 84 127 -31
$$ packed form
2758B55q9k31k2K79r6k9k93K04k7ql0J62P0n9n8K94k61K0j02JL37k72j1J7J97
2783B48l77o0P6J56j03K09k13Q1j02pK26j1L9L6k41P7j25K96Ok09j76J93j61j0
2807a52o6M18n4k8o9n1p7p1J23j55J95n5r1k6J1M02m42L6J76J42j69lo5j8QRK5
2834d7K20K3l08PM62n34L02Nm3qj93Q6K50k55lRj03l1N03k48j20j0o5K04K06r8
2860B11m37K99M3n1k07K44r2n4P1J81m05rL62k47J41k07N45o51M04k18J28L9K0
2883A10J41m28K36k75P4J96P0K8j3j03q5J61j75Q0l1J4M25m76L53l29M1J08k69
2906a47J3J87R2k6J67j41k00r2J23k31K51p8K34j68q1K4k5M5r4J55K64k24j70
2929a22J35j38K29m3m0p4L12j0m68L02o7K02j60Q6j66K28k49k33K58J02M3j58
$$ plain form
2951 -31 -265 -64 40 -297 36 148 -229 160 -214 212 69 171 -22 4 229 -21 32 -33 236 11 -12 130
2973 130 27 -70 -4 48 51 60 193 126 -207 159 90 -19 180 14 404 -98 -266 -249 171 78 -38 -50 167 -209
2997 -209 227 -134 245 -73 -179 -30 -165 -135 -15 -7 112 66 -220 -206 290 18 22 -283 112 72 16 162 17
3020 17 -92 -21 127 227 259 -174 -21 -87 -33 -66 -69 -35 -172 308 249 -222 68 97 -218 -42 33 63 29 -84 -72
3045 -72 29 -9 85 -27 -55 87 226 248 -257 50 316 -4 28 40 -33 29 29 8 132 -94 -20 230 -38 199
3069 199 90 257 -157 460 25 -184 60 -187 46 -82 -163 -37 114 179 183 -198 254 159 -131 127 50 -68
3091 -68 310 48 228 -80 -77 -125 -150 -172 -234 -102 140 -147 28 -131 -134 48 2 194 71 420 187 19 -147
3114 -147 213 -53 82 258 67 59 -21 10 -134 -35 -115 -125 -45 35 -145 27 207 164 87 108 -53 -168 54 76
$$ packed form
2951c1k34K01J04l37L33J12l77L89l74M26j43J02j93K6K25k50N3o5K69k25k3J42
2973A30j03r7O6N2LRJ33o7l33L66o9j09J99j66L90n02j68J7M20r3j16j2K17l76
2997b09M36l61L79l18j06J49j35L0J20QJ19m6k86J4M96k72Ml05L95m0n6J46j45
3020A7j09P1J48J00L2m33J53o6N4l3lL4j37M80n9m71K90K9l15J76P5L0l4j13J2
3045g2J01l8R4j12k8J42J39K2n05L07K66l20L2J2p3O2%k1J24k26P4K50k68K37
3069A99j09J67m14O17m35k09K44k47K33j28q1J26J51O5Ml81M52r5k90K58p7j18
3091f8L78k62J80l08Lm8k5k2o2J32K42k87J75j59lJ82m6J92j23L49k33j68j66
3114a47L60k66J35J76j91qq0L1j44R9q0j0Q0Q0j80J72J80m3p7K1j61j15K22K2
$$ plain form
3138 76 71 45 -248 160 95 -135 -58 90 132 -133 -213 -208 110 -69 123 65 170 99 84 61 23 -21 -38 -123 -63 -151 80
3165 80 11 54 181 -130 56 357 -126 -145 148 -42 114 2 201 -160 -8 64 -1 162 114 132 126 -34 59 95
3189 95 5 129 303 5 -13 -98 132 -84 -155 -67 -100 -104 -143 -153 65 -7 -1 203 209 -185 15 -37 110 -108 416 -231
3215 -231 171 259 -85 45 65 89 -190 -17 -43 82 -15 -83 177 -190 -103 205 -3 110 93 228 37 -64 12
3238 12 -21 -64 95 -214 170 -258 -70 -46 23 -129 -103 -192 -160 -67 -29 -113 448 230 9 6 -10 186 -142 -188 -289
3263 -289 -148 23 -33 125 -109 119 76 77 222 -51 108 22 -111 140 92 -105 171 77 -32 -150 2 -160
3285 -160 43 -135 -32 -281 -94 -90 -22 128 18 -115 74 -19 -41 346 -104 50 -185 -85 32 124 -62 -67 24
3308 24 -4 -193 -92 -40 -13 103 -124 -149 63 -133 40 139 -199 265 214 -61 -116 -361 -54 -95 -291 54 401
$$ packed form
3138G6nk6k93M08o5k30P7J48M2k65q0NL18j79J92n8J05p1j5k3l8m4j7q5O0q8K31
3165H0o9M3J27l11J86L01m83j9K93j90J56j12J99l61J52P2o5J63m8J8oj60R3L6
3189I5r0J24J74k98j8q5K30k16p1Q8l3ml9j0K18p2OK04Ol94K00n2J47k18N24o47
3215b31M02Q8l44J30K0K4k79J73k6J25r7o8K60l67Q7L08k08J13j7J35j91j01P6
3238A2l3m3J59l09L84m28J88K4O9j52K6q9L2R3L8q4N61k18k21lj6J96l28m6j01
3263b89J41J71n6J58k34K28m3JJ45k73J59q6j33K51m8j97K76r4j09j18J52j62
3285a60K03j78J03k49J87MO8J50j10j33J89r3k2L87m50J54k35J00J17R2j86nR1
3308B4k8j89J01N2K7J16k27k5K12j96J73R9l38M64n1k75n5k45L07m1j96L45L47
$$ plain form
3331 401 -132 -45 -97 -34 0 -160 7 -150 -93 -78 45 -110 -80 -208 200 86 -51 104 82 -157 -181 67 142
3354 142 -216 180 64 -276 239 -99 -123 -63 156 -249 -119 24 113 45 -128 -345 101 80 -148 229 100 -113
3376 -113 -43 -259 -58 51 32 -49 37 -149 -32 -51 -8 -12 -6 77 86 138 44 -231 -154 180 338 -131 30 302 -5
3401 -5 -182 -240 -196 -61 221 -29 91 18 -68 55 135 31 -84 -155 -125 155 74 150 262 56 37 -105 82 -126
3425 -126 -317 -70 -126 -209 223 -18 -89 92 -59 94 11 108 -35 167 -276 259 -19 -142 -280 -49 234 197
3447 197 -107 -38 -28 97 9 75 85 -70 -66 -126 146 -35 -40 -129 -27 143 143 -60 179 32 161 -82 -75 41 -27
3472 -27 128 40 293 -157 155 -39 94 236 -41 39 52 -158 181 -122 65 -449 12 261 -57 236 -20
3493 -20 314 148 51 130 26 -72 -127 -224 202 73 -114 333 37 -40 36 75 -200 126 -66 35 122 58 -231 -68
$$ packed form
3331D01n33Q7n2O3L4j60J67j57N7J5J23j55L0j28M08j14j37J55k2k39k4K48P5
3354A42l58L96j16l40N15l38k4O0K19m05J30J43Q9o8j73k17M46k1k28L77j29k13
3376a13P0k16K01J09j9q1Q6j86J17j9M3mOQ3RN2r4k75P7L34J58m69J61K72l07
3401ej77n8M4J35K82k50J20p3q6J23Q0j04j15p1L0K80q1P6J12k06j9j42J87k08
3425a26j91K47n6q3M32k41p1J81j51J53q3R7j43K02m43N35k78j23j38K31K83l7
3447A97l04O9J0J25q8O6J0j55Mo0K72j81nq9J02J70%k03K39j47J29k43PJ16o8
3472b7J55q8K53m50L12j94J33J42k77Q0J3k10L39l03J87n14M61K49l18K93k56
3493b0L34j66r7P9j04r8n5r7M26j29j87M47k96p7P6L9k75L26j92J01Q7o4k89J63
$$ plain form
3517 -68 0 116 42 2 -159 75 298 204 97 -50 232 -65 -18 222 -70 28 286 -195 -171 -68 8 110 245
3540 245 -156 -136 19 162 15 59 -97 -96 242 -122 -108 -13 93 -41 272 245 129 -96 48 -237 -9 -152
3562 -152 24 -123 93 127 -99 153 -104 -4 -368 -9 24 -95 6 60 -65 200 -39 199 20 216 298
3583 298 82 61 -171 -80 101 -145 -75 226 -88 -36 -140 173 91 153 -88 120 -133 87 -137 62 219 20
3605 20 85 172 106 -6 146 70 -75 -120 -77 -58 11 0 84 -127 177 29 -39 -56 -100 -207 -49 -128 -76 -104 -209 65
3631 65 357 62 -39 -152 -2 140 -132 -113 -136 -219 93 -9 -83 21 143 -226 317 228 199 26 -12 -112 48
3654 48 -41 101 67 -47 -223 50 25 -45 63 -10 22 50 210 283 -77 -24 133 -170 362 -56 -5 39 -134 -123
3678 -123 20 -72 -235 -40 90 34 -134 77 27 -32 -9 106 184 -202 -121 80 123 -61 -101 287 65 17 -63 167
$$ packed form
3517f8O8J16p4m0j61K34K23r4j07j47K82k97M7K40k92R8K58m81K4J03P6J02J35
3540B45m01K0J55J43j47M4j56JL38l64J4R5J06j34L13k7j16k25J44k85K28j43
3562a52J76j47K16L4k26K52k57J00l64L59L3j19J01N4j25K65k39K38j79J96Q2
3583B98k16k1k32R1J81k46P0L01l14N2j04L13q2O2k41K08k53K20k24J99J57j99
3605B0O5Q7o6j12J52p6j45m5M3J9O9j1Q4k11L04j48o8j7m4j07J58p9N2k8j05K74
3631F5K92k95j01j13J50J42k72J9k3q3L12j02p4J04J22l69N43q9k9j73l8j00J60
3654D8q9J42l4j14j76K73k5p0J08p3L2K8J60P3l60N3J57l03N32m18N1M4j73J1
3678a23J43r2j63J95J30n6j68K11n0n9K3J15P8l86Q1K01M3j84m0L88k22m8q0K30
$$ plain form
3702 167 -223 51 -224 118 47 -98 66 124 305 -48 -87 -27 -163 -2 -47 -178 -252 101 -70 71 -175 -182 -191
3725 -191 -4 -256 -100 24 -339 68 21 -114 -27 38 162 66 -66 -137 -6 -106 -236 72 -245 190 -33 -164
3747 -164 43 32 -35 143 -45 397 -5 -185 -13 42 -284 210 -66 -31 151 71 -1 -32 -70 22 246 -201 -270
3770 -270 -159 -246 137 16 53 145 74 110 106 24 38 67 3 86 -298 88 -86 3 -139 -50 -172 99 -57 174 -89
3795 -89 271 -159 75 -260 -9 -43 -227 -141 -111 333 260 -168 -60 182 118 -67 190 -63 -184 -84 26 218
3817 218 -135 -36 -55 -95 -216 45 -208 -231 68 -5 49 -224 162 -71 -160 113 207 -161 15 -83 202 -119 -83
3840 -83 80 -277 -189 -99 10 -12 -307 -244 -123 -266 -8 -48 -72 281 23 -232 224 -101 -159 -90 220 -72 22
3863 22 34 69 50 -122 -273 23 196 -4 10 77 323 53 -231 -137 -50 137 186 -190 -72 349 108 11 -183
$$ packed form
3702A67l90K74k75L42p1j45J64N8J81l53l9O0j36J61m5j31p4L53j71J41k46pr
3725a91J87k52J56J24l63M07m7j35Q7O5J24r6j32p1J31j00j30L08l17M35k23j31
3747a64K07j1o7J78j88M42m02j80J72N5l26M94k76L5J82q0p2l1l8R2K24m47o9
3770b70J11q7L83j21L7R2p1L6mq2J4K9o4Q3l84L86j74Q9j42Q9j22K71j56K31k63
3795h9L60m30K34l35K51l4j84Q6L0M44p3m28J08K42o4j85K57k53j21J00J10J92
3817B18l53R9j9m0j21K61k53k3K99p3N4k73L86k33q9K73R4l68J76r8K85l21L6
3840h3J63l57Q8R0J09k2k95O3J21j43K58m0k4L53k58k55M56l25n8O9L10k92R4
3863B2J2L5j9j72j51K96J73k00J4O7K46k70k84R4Q7J87M9l76J18M21k41r7j94
$$ plain form
3886 -183 25 40 -25 323 -102 107 46 -47 132 101 -98 86 -72 -85 -40 118 -40 -271 117 135 -267 -138 60
3909 60 9 -115 -119 -110 20 -67 -79 -59 -206 -208 -109 -77 300 -12 128 -120 77 191 82 59 203 3 80 16 193
3934 193 -261 -23 50 -88 147 269 55 -155 -206 -53 47 140 63 -119 113 80 116 -234 54 -95 79 12
3956 12 106 -12 160 75 -16 298 -106 36 120 177 -71 25 -318 -144 338 101 -180 58 -36 34 -62 2 120 -314
3980 -314 -33 91 80 41 -167 -169 195 46 18 -89 159 -195 -119 186 -238 -152 182 -63 311 -93 -107 148 30
4003 30 137 49 120 93 -97 -36 -127 -67 -49 90 148 11 147 26 17 -80 -7 -106 107 185 -107 407 42 -366 -146
4028 -146 56 194 183 160 85 -23 -157 192 106 43 63 -156 104 -36 278 -40 -122 116 -133 -313 -58 28 25
4051 25 -110 -50 11 -242 -68 -173 -196 47 -170 457 -4 -87 96 -214 228 134 260 -51 167 174 75 24 -85
$$ packed form
3886a83K08J5o5L48m25K09o1r3J79l1j99J84j58j3M5J58j58k31L88J8m02J29J98
3909F0n1j24mRJ30q7j2K0j47kR9L2L77l12J40k48J97J14j09k3J44k00P7o4J77
3934A93m54K38P3j38K35J22k14k10n1J53J00R3p7j82K32l3L6l50K88j49J74o7
3956A2R4j18J72q5r1L14m04J42Q4N7k48R6l43J74M82k37k81K38r4P0r6O4J18m34
3980c14K81J24j1l9k08kL64j49k8j07K48l54P6L05m24Q6L34k45L74m04j4K55j18
4003C0J07q8P1k7j90O1r1O0J8J39N8j37J36j21rr7P3r9K13P8k92N14l65m08K20
4028a46K02J38j1k3p5j08j34L49q6o3K0k19K60j40L14l18q2K38k49j80K55Q6l
4051B5j35O0O1k53J74j05k3K43k17O27m61q3J83l10M42r4J26l11K18Pr9n1j09
$$ plain form
4074 -85 -57 282 124 -68 113 -109 -155 104 -3 -12 97 156 -19 -140 -145 100 -37 3 -249 -217 -82 76 74 1
4098 1 111 -131 -231 -193 66 20 19 -48 104 126 57 144 -50 98 144 144 -331 107 69 -27 218 75 -52 28 -56 211
4124 211 77 284 -184 -37 103 324 -165 59 -99 7 57 59 -37 155 -113 -28 16 32 46 -199 -138 150 19
4147 19 -58 85 -53 208 65 -49 159 -75 -104 90 -256 17 65 -4 -16 111 188 214 104 -40 33 107 -11
4170 -11 95 23 212 -1 -90 -119 270 236 338 8 25 -94 0 167 -161 151 219 192 -149 36 -68 137 48
4193 48 40 84 122 -156 175 -226 -67 76 38 -44 81 39 81 -108 230 76 -220 79 -4 23 -216 -5 63 17
4217 17 -179 272 51 -115 81 90 -75 -59 -71 -148 77 66 23 117 -130 149 -274 118 197 238 36 -193 -47 -184
4241 -184 42 -118 -145 6 87 -34 200 -142 207 116 9 202 -92 -197 12 -46 -57 106 -50 10 68 81 -71
$$ packed form
4074h5K8L39j58j92J81k22m6K59j07rJ09N9j75j21nK45j37M0k52L2J35J58kp3
4098AJ10k42j00L8K59m6jo7J52K2o9Q7j94J48M6%m75M38l8r6K45j43j27Q0q4K67
4124B11j34K07m68J47J40K21m89K24j58J06N0Kr6J92k68Q5M4J6J4k45O1K88j31
4147A9p7J43j38K61j43j14K08k34k9J94l46K73M8o9j2J27P7K6j10j44P3P4j18
4170a1J06p2J89k13q9k9L89l4J02l30J7j19R4J67l28L12O8k7l41J85j04K05q9
4193D8qM4L8k78L31m01J59J43l8q2J25m2M2j89L38j54k96K99q3K7k39K11O8m6
4217A7j96M51k21j66J96Rj65J6j2p7K25j1m3R4k47K79m23L92P9M1k02k29J46j37
4241a84K26j60k7J51Q1j21K34l42L49r1j07J93k94j05K09n8j1J63j56O0N8J3j52
$$ plain form
4264 -71 70 88 -104 -233 169 276 -262 -176 -68 -68 180 -132 -37 -214 -94 220 45 -7 2 -110 -231 -86 -245
4287 -245 222 -68 -47 -184 -51 -76 -166 -84 -28 -15 -41 -137 -4 -65 -39 208 172 -278 -130 -55 229 -51 168 -23
4311 -23 -125 102 -43 39 213 -121 68 41 -47 -91 -135 141 -143 46 -134 93 73 -97 5 67 10 -60 248
4334 248 64 -285 -112 -78 69 65 -77 92 83 71 -266 -58 -7 26 -6 146 -5 39 184 59 128 12 -135 -18
4358 -18 179 -261 110 91 111 85 -46 -31 -54 -66 -14 -175 -134 23 272 82 -45 -234 147 61 -158 57 422
4381 422 -71 -62 0 144 39 -210 106 -144 2 -5 103 99 -84 20 -235 -239 104 -168 -200 61 -224 -39 92
4404 92 -173 85 9 59 -241 -196 -23 20 -44 -13 -133 -186 90 34 -77 100 -190 -95 99 -50 128 24 -62 7
4428 7 -44 -127 -59 -140 -106 109 -137 105 3 -388 -75 48 -7 -35 -28 15 89 -51 -158 -183 108 123 -77 -73 -60 18
$$ packed form
4264g1J41J8j92j29M02J07n38Q6J08%K48l12R5j77J20L14j75n2Rj12j21J45j59
4287b45M67k90K1j37J33k5r0Q2N6J3k6r6J33o1K6K47l6m50J48P5K84k80K19j91
4311b3j02K27j45Q2J74l34J89k7q8m4m4K76k84J89j80K27k0j70J02O2n7p0L08
4334B48j84l49J73L4J47mj42J69rj2l37K08N1L3l2J52j51M4J45j25O9j16j47J17
4358a8J97m40L71j9K0k6j31J5k3j2N2j61M1J57K49j90j27j89L81q6k19K15L65
4381D22m93RO2J44j05k49L16k50J46pJ08mj83J04k55mL43k72l2K61k85J85J31
4404I2k65K58p6N0l00M5J73M3o4L1j20n3K76n6j11J77k90R5J94j49J78j04q6O9
4428Gn1q3O8q1L4K15k46K42j02l91L13J23n5k8PM3P4j40j07k5K91J5k00MJ3P8
$$ plain form
4454 18 -210 71 8 -243 164 221 -39 -65 -158 -157 99 -143 98 -4 144 -228 13 97 -32 -47 117 -135 -42
4477 -42 -95 26 40 -45 94 -323 -189 -258 -94 1 306 -66 -173 47 302 -176 -13 -59 83 141 -72 157 84
4500 84 -23 279 -57 264 86 82 2 -82 9 -16 102 -162 -105 -22 -248 210 44 134 -77 -38 17 145 87 49 -77
4525 -77 133 74 181 -159 -225 257 -42 -61 -74 -103 78 -51 -170 105 85 331 -26 -6 145 124 -31 66 -13 75
4549 75 -42 15 -35 -50 153 -12 222 -61 -183 129 -35 -285 -22 -185 -213 109 -14 -28 90 -73 -3 99
4571 99 -60 -42 69 125 -238 250 293 -135 72 182 164 -195 65 -113 194 -43 268 74 -191 -178 -151 -51
4593 -51 47 -58 -46 -218 -58 42 -75 -68 55 -37 47 -50 -2 75 -199 17 -35 126 18 74 149 124 -182 179 -193
4618 -193 -15 138 -44 167 63 44 306 83 138 163 -66 -207 89 -77 315 261 75 43 -240 135 98 179
$$ packed form
4454A8k28K81o3k51M07N7k60k6r3JK56k42K41j02J48l72K41Q4j29j5J64k52R3
4477d2n3J21J4q5J39m17J34o9J64R5L05l72j07K20K55m78J63m6J42N8k13K29p3
4500H4j07L02l36L21j78mq0q4R1k5J18k64N7Q3k26M58j66R0k11L9N5J28n8l8j26
4525g7K10n9J07l40o6M82k99j9j3k9J81j29j19K75k0K46l57K0J51k1j55R7p9Q8
4549G5j17N7n0j5K03j65K34k83j22L12j64k50K63j63k8L22j23j4J18j63P0J02
4571I9j59J8J11N6l63M88M3m28K07J10j8l59K60j78L07k37L11j94k65J3K7J00
4593e1R8j05J2j72J60J00j17PJ23r2Q4r7M8P7k74K16n2J61j08N6P5k5l06L61l72
4618a93J78J53j82K11j04j9K62k23N5K5k29j41K96j66L92n4j86l2k83L75l7Q1
$$ plain form
4640 179 32 87 70 -195 -303 37 -24 236 86 154 -15 50 181 -94 129 122 -159 199 -208 -308 -77 139
4662 139 -44 227 378 -178 345 -172 67 -87 -224 -76 34 -23 122 24 120 -337 72 7 5 24 -71 81 -270
4685 -270 217 11 -39 -130 -32 -118 28 18 -132 -115 -30 193 71 215 153 222 -249 -31 -12 -51 -180 62 -41 124
4709 124 18 271 21 45 29 201 -62 108 158 -100 87 112 -239 154 -47 110 32 -128 59 -89 98 4
4731 4 -41 -139 -31 -81 -160 145 -251 -45 361 120 18 235 84 -43 17 -144 60 -45 -63 66 144 -287 145
4754 145 59 69 131 -45 96 296 213 24 -134 -65 -170 -101 -3 185 22 181 53 -63 96 -82 -243 110
4776 110 -123 -17 -36 -205 22 19 -138 -336 -64 -173 -131 -174 99 72 -134 -16 9 -18 167 -232 -105 330 114
4799 114 33 -175 28 166 154 212 -5 16 76 15 47 236 -86 -157 66 -101 -275 -339 -82 -25 -26 -74 -55 -31 169
$$ packed form
4640A79j47N5j7k65j08L40o1K60j50O8j69O5J31k75K23pk81L58m07j00K31K16
4662A39j83K71J51n56N23n17K39j54j37J48J10n7J45r8R6m57M09o5kJ9r5J52l51
4685b70M87k06n0r1R8q6J46j0j50J7Q5K23j22J44o2O9m71K18J9l9j29K42j03J65
4709A24j06K53k50K4j6J72k63J70N0k58J87K5l51L93k01J57p8j60J87j48J87r4
4731Dm5r8J08n0p9L05l96K06M06k41j02K17j51j27O0j61K04j05j8J29P8m31M32
4754A45q6J0O2j76J41K00q3j89j58O9j05O9R8J88j63J59j28j16J59j78j61L53
4776A10k33J06j9j69K27lj57j98K72j09M2m3K73k7k06J18K5k7J85l99J27M35k16
4799A14q1k08K03J38j2N8k17K1O0o1L2J89l22p1K23j67j74o4K57N7jm8J9K4K00
$$ plain form
4824 169 212 -22 -15 78 -136 -34 38 14 347 -279 -274 4 21 181 -25 -30 113 12 -243 137 155 -42 146 218
4848 218 126 93 152 199 167 -179 67 353 -103 -131 144 46 83 146 -52 -152 7 -74 -238 160 -63 118 150 67
4872 67 0 -140 -181 121 -4 170 49 -80 -10 117 37 -167 -21 -72 91 77 -224 -194 -139 72 24 121 -59 -160
4896 -160 279 141 -85 84 -74 -172 233 38 -273 43 -190 -124 13 175 209 -56 -34 -277 311 341 61 59
4918 59 -215 -197 -18 -56 4 176 -71 -8 97 -22 72 -173 55 26 25 188 100 -55 109 -22 -116 -31 113 257
4942 257 126 88 -24 -209 -223 -51 -45 145 -75 -2 73 -24 225 -177 -175 -37 -68 67 -88 -136 -146 -292 -180 -209
4966 -209 4 -169 -15 -3 45 -12 13 50 -62 -210 -78 -191 36 -34 -53 -87 71 18 205 81 271 337 -141
4989 -141 -6 266 -18 -156 140 76 14 -216 387 175 11 103 307 -126 134 -31 66 44 -342 -115 110 -71
$$ packed form
4824A69M3k34PR3k14J02P2k4L33o26NK78J7J60k06nJ43j01k55L80J8j97J88P2
4848B18r2l3N9M7l2l46K46K86m56k8K75r8L7O3j98j00J59q1j64L98k23J81L2q3
4872F7o7j40m1L02j25J74j21j29P0J27q0k04J46n1J63j4l01L0N5K11m8R7j80j01
4896a60M39j38k26J69j58r8M05j95l11L16k33O6J37J62L4k65K2k43N88L0k80k
4918E9k74J8J79l8O0J72k47O3J05j19R4k45K28k9jJ63q8j55J64j31r4Q5J44J44
4942B57j31l8j12j85j4J72OJ90k20P3P5r7K49m02KJ38l1J35j55m8j0j46J12k9
4966b09K13j73J54J2M8n7K5L7j12j48J32j13K27p0j9l4J58n3J87j24J90O6m78
4989a41J35K72k84j38K96o4o2k30O03k12j64R2K04m33K60j65R7k2l86K27K25j81
$$ plain form
5011 -71 -19 154 -10 67 21 73 130 120 -46 41 -49 255 98 40 112 -65 -68 142 -21 53 72 -49 124 -91 -160
5036 -160 -255 -69 67 104 -166 -59 -3 116 -74 -12 182 -210 -302 -123 254 -101 16 104 -18 36 88 202 178
5059 178 -68 -37 81 239 180 -40 -11 93 96 -38 30 -16 118 -87 186 140 -52 45 478 -337 48 164 -163
5082 -163 -3 -72 -58 -93 -144 -189 106 -29 10 -54 168 -80 -37 14 188 41 165 46 110 -157 292 -75 192
5105 192 -92 114 21 -130 298 -118 198 175 226 110 17 -23 56 -221 184 -21 77 178 -101 -123 198 89 150
5128 150 85 -52 138 -69 -93 274 70 13 -68 -213 -36 -37 114 -86 -131 -83 -71 277 103 56 -7 145 -15 68
5152 68 -25 26 123 -6 36 -280 73 -106 148 -39 33 264 169 140 350 -99 31 67 -141 78 315 5 61
5175 61 -83 -373 130 172 265 41 118 -6 178 -66 226 124 88 -100 -13 155 6 -251 -16 155 9 184
$$ packed form
5011g1N2J73j64P7m6N2N7j0j66Q7r0L04j57n8P2j77lK10j63P4J9j21J73k15o9
5036a60r5J86J36L7k70J07N6J19j90O2J94l92r2J79L77l55J17Q8j22N4N2J14k4
5059A78k46L1J18J58n9k20K9J04Lj34O8m6J34k05K73m6j92R7M33q15L85J16l27
5082a63J60o9J4l5n1m5K95j35L9o4K22k48M3N1J74j47J24j19O4k67M49l67K67
5105A92k84K06r3j51M28m16L16k3N1j16r3m0P9k77M05k05R8J01k79k2L21j09O1
5128A50o5j37J90k07k4L67k04n7q1j45J77jJ51k00m5M8J2L48j74m7o3J52j60Q3
5152F8r3N1R7j29M2l16L53j79K54j87P2K31r5k9K10m49J30L6k08K19K37l10N6
5175F1j44k90N03M2R3k24P7j24J84k44K92j02l6j88Q7J68j49k57K35J71j46J75
$$ plain form
5197 184 85 -327 44 -248 -166 113 -80 31 30 10 111 -28 244 263 120 -232 140 91 109 251 -17 266 209
5220 209 -26 -18 10 126 -60 133 90 6 45 -298 52 120 35 -62 -5 125 163 42 160 220 102 18 209 15
5244 15 31 -43 79 -74 105 -26 29 -38 -41 65 290 -42 -22 -336 338 -108 175 -71 -143 -73 -283 45 -202
5267 -202 -9 -31 58 -165 -4 166 -331 79 154 -44 -99 13 64 -61 129 26 213 87 -297 120 -131 -55
5289 -55 26 -54 -143 -279 -66 -254 174 -159 -117 81 -111 166 -56 51 -123 123 19 13 21 -80 8 71 93 -39
5313 -39 81 61 -89 -300 -285 -338 -43 14 -43 -14 -99 -60 51 -152 -6 5 178 -198 14 65 -50 246 -168 -20
5337 -20 -81 119 157 222 74 -14 -63 72 41 153 152 -98 44 145 -205 -49 -311 -43 -9 -37 -49 -169 -248 -253 -35
5362 -35 -117 -133 -82 -75 -30 36 39 32 253 84 -11 -88 58 6 161 -99 141 206 -96 244 29 288 -16 169 -200
$$ packed form
5197A84r9m12L71k92Q2K79j93J11jk0J01j39K72J9j43l52L72m9J8J42k68K83n7
5220B09k35QK8J16j86J93m3q4L9l43L50O8q5r7N7J30L8j21J18O0j18q4J91j94
5244A5J6p4J22j53J79j31N5o7lJ06K25l32K0l14O74m46K83k46p2P0k10L28k47
5267b02J93k2Q9k23J61J70m97M10P5j98n5J12N1j25J90j03J87j26l84M17k51P6
5289e5Q1q0q9j36K13j88M28l33M2J98j92K77k22J07j74K46j04oQj01Q8O3K2j32
5313c9J20k0j50k11J5n3K95N7n7K9q5L9J11k03J46J1J73l76K12N1j15K96m14J48
5337b0o1K00L8O5j48q8m9J35l1J12jk50J42J01l50J56k62K68L4k8j2j20p9nK18
5362c5q2j6N1PM5O6LpK21j69r5p7J46n2J55k60K40O5l02L40k15K59l04J85l69
$$ plain form
5387 -200 -82 -18 140 141 -207 -45 -75 186 113 29 16 -62 69 -241 -42 142 -58 -212 -68 -114 29 27 21 276
5411 276 76 -29 157 -88 36 29 80 -105 -264 135 17 163 -10 55 57 272 152 196 -69 -147 -109 17 -245
5434 -245 -35 -40 -185 251 -19 90 -124 -260 -36 -113 56 114 -156 21 202 -169 89 277 0 17 -61 150
5456 150 -29 -25 84 86 -30 -89 21 -40 3 68 -38 177 35 58 68 37 88 -128 179 -108 199 -92 110 -63
5480 -63 101 127 183 -7 -107 -59 -99 53 51 -99 -165 120 -176 15 33 -146 -271 122 -23 -281 -43 3 -19 221
5504 221 20 213 -38 -262 -14 18 30 187 -89 -140 -60 49 -66 -121 447 -203 7 -90 140 -253 103 -185
5526 -185 -14 116 27 112 158 -15 -407 -122 110 85 -149 118 124 4 -281 62 405 -128 -170 -48 -172 -150 142
5549 142 119 -55 85 -85 -78 -56 -2 -106 -165 -220 14 224 -8 146 -221 53 82 100 -25 264 -97 -243 -121
$$ packed form
5387b00J18O4J58Jl48J62l0K61p3q4j3p8J31l10J99J84k00j54J44m6J43koK55
5411B76k00j05J86k45J24pN1j85j59L99j18J46j73O5KK15j20M4k65p8L8J26k62
5434b45K10nj45M36k70J09k14j36K24p7J69N8k70J77J81l71K58J88k77J7p8K11
5456A50j79MJ09Kj16n9J10o1M3O5j06K15j42K3J0l1N1k16L07k87L07k91K02j73
5480f3J64K6N6j90j00M8m0J52kj50o6K85k96J91J8j79j25L93j45k58K38M6k2K40
5504B21k01J93k51k24K48L2J2J57k76n1Q0J09j15n5N68o50K10r7K30l93L56k88
5526a85J71J30q9Q5M6j73l92K85K32k5k34K67Oj20k85L43L43n33m2J22j24K2K92
5549A42k3j74J40j70PK2N4j04n9n5K34K10k32J54l67K74K9J8j25K89l61j46J22
$$ plain form
5572 -121 236 352 266 -75 151 8 133 112 104 16 147 -57 151 -177 108 216 28 54 124 -6 -242 173
5594 173 14 71 67 -332 -10 -23 222 62 224 250 -14 41 -4 30 16 -167 6 189 -340 117 -26 64 27 60
5618 60 18 -129 255 -299 112 16 -151 76 89 -176 -24 25 -296 -3 -37 207 76 -64 393 -92 126 37
5640 37 -30 5 59 72 -107 -179 21 -175 27 18 -12 0 -12 -141 182 240 -49 68 -12 176 -512 50 29 -63 103
5665 103 97 -29 -29 -153 -57 -346 -167 68 125 55 160 -10 -8 -6 116 -136 125 19 -183 -162 -80 304 35 -22 114
5690 114 79 15 179 -71 2 -86 233 77 11 -166 7 -128 10 23 26 100 -75 103 169 88 31 91 110 156 2
5715 2 -128 -17 98 81 141 -195 89 24 161 87 267 -146 8 -162 121 -60 -5 -155 -89 21 388 174 160
5738 160 163 86 -70 90 119 -147 8 10 -125 19 -83 165 8 -58 -6 -44 267 -44 213 93 -42 -3 43 99
$$ packed form
5572a21L57J16q6l41K26j43J25k1qq8J31k04K08l28K85J08j88K6P0j30k36M15
5594A73j59N7ml99L22j3K45j60J62K6k64N5m5L4j4j83J73J83n29M57j43R0l7L3
5618F0m2j47L84n54M11r6j67K27J3k65J52M9l21K93l4K44j31j40M57m85K18q9
5640C7o7L5N4J3j79p2K00j96K02rl0J2j2j29L23N8k89J17q0J88o88N62k1r2J66
5665A03oj26%j24R6k89J79K35N7p0J05j70KKJ22k52K61j06k02K1Q2L84k69n7J36
5690A14l5o4J64k50P3q8L19j56o6j77J73j35J38J3LP4j75J78O6q1n7O0J9M6j54
5715Bj30J11J15j7O0l36K84o5J37p4J80m13J54j70K83j81N5j50O6J10L67k14j4
5738A60Lp7j56J60K9k66J55Kj35J44j02K48j57o6N2l8L11l11K57j20j35L9M6N6
$$ plain form
5762 99 -99 3 -71 -262 26 -233 121 -117 -244 95 -51 -168 45 181 115 -148 165 119 241 22 3 -207
5784 -207 402 -25 -45 173 -167 126 -20 -200 42 185 -52 -124 118 -43 -94 52 63 -105 -5 -136 104
5805 104 179 -90 -70 71 47 -79 49 53 131 -139 48 -103 112 -18 -118 -5 49 145 -477 -109 353 -240 35
5828 35 104 149 94 221 -13 -108 120 -156 126 -76 125 64 -29 51 206 85 3 0 -105 146 64 -24 -211 135
5852 135 16 268 -72 273 184 -24 69 2 -105 78 105 110 156 -46 -104 -30 177 98 -82 58 -14 -161 58 -118
5876 -118 -169 214 -120 269 124 -69 -25 -22 214 17 -167 -149 -133 101 20 178 0 -111 130 -65 133 144 307
5899 307 16 -39 71 84 76 200 65 -53 175 -37 141 -66 86 -38 195 -88 30 145 4 281 313 71
5921 71 13 180 -71 120 67 -33 -2 -85 -42 201 -80 -135 -303 -288 -13 171 267 -152 37 -101 -169 15 106 29
$$ packed form
5762I9j98J02p4j91K88k59L54k38j27L39j46j17K13J36o6k63L13m6J22k19j9k10
5784b07O09m27k0K18l40K93j46j80K42J43k37p2K42j61n1J46J1j68J00j31K40
5805A04P5k69K0J41k4j26J28MP8k70J87j51K15j30j00J13N4R6o22L68M62n93K75
5828C5O9M5n5J27k34r5K28k76K82k02K01o1r3Q0J55j21q2lj05K51q2q8j87L46
5852A35j19K52l40L45q9k08R3o7j07J83K7NM6k02n8P4K07p9j80J40p2j47K19j76
5876a18n1L83l34L89j45j93M4LK36j97j84J8J6K34q1J58j78j11K41j95J98J1J63
5899C07k91n5J10J3qJ24j35j18K28k12J78k07J52j24K33k83J18J15j41K77L2k42
5921G1n8J67k51J91n3j00L1q3M3K43k81n5j68J5K75J84R6m19J89j38o8J84R1p7
$$ plain form
5945 29 141 18 -243 33 0 16 292 13 -103 69 125 76 36 -194 -30 -14 219 -246 87 -109 -118 117 45
5968 45 10 -141 -212 -172 -100 25 -124 -84 235 -16 113 -104 19 -28 99 83 17 206 -175 -2 248 36 -100
5991 -100 109 94 96 28 -79 101 42 -66 -13 124 342 -64 102 -155 -138 -130 179 -39 142 67 2 159 202 -16
6015 -16 21 69 -187 54 -172 -74 -47 64 -52 -56 235 4 -195 253 -60 165 -15 16 -76 140 41 19 -216 -208
6039 -208 113 -108 -12 185 -58 200 131 -137 -18 77 59 -17 -212 19 -170 -152 150 -163 -100 -100 -19 105 170 102
6063 102 -120 -125 84 229 179 -68 53 -256 -20 147 -310 152 82 334 -77 -315 -43 -121 339 -30 130 34
6085 34 20 -10 -197 25 -83 3 -157 205 -326 17 272 60 124 -141 379 -18 38 -346 -178 -101 -124 -151 -103
6108 -103 27 -61 -56 -119 19 -44 -131 -36 161 -47 62 -22 -16 53 -131 -46 -210 39 117 210 -46 24 -25 -1 53 -102
$$ packed form
5945B9J12j23k61K76l3J6K76k79j16J72N6m9m0k30J64J6K33m65L33j96rK35p2
5968D5l5j51p1M0P2J25j49M0L19k51J29k17J23m7J27j6o6J89l81J73K50k12j36
5991a00K09j5Ko8j07J80n9j08N3J37K18m06J66k57J7QL09k18J81p5o5J57M3k18
6015a6L7M8k56K41k26R8K7J11j16mK91k31j99M48l13K25j80L1r2K16r9k2k35Q
6039b08L21k21R6J97k43K58o9k68J19R5j8p6j95K31j89J8L02l13O3%Q1J24O5o8
6063A02k22nK09J45n0k47J21l09K36J67m57M62p0K52m11k38K72p8M60l69J60r6
6085C4j4l0j87K22j08Q6j60L62n31L43K55k12O4k65N20l97N6l84J68P7k3k7M8
6108a03J30q8No3J38o3q7R5J97k08J09q4OO9j84Q5j64K49P8R3k56P0m9K4N4j55
$$ plain form
6134 -102 -45 -71 -137 144 -168 -161 70 50 -146 237 -20 98 -119 -36 160 -161 -153 70 188 -20 -20 204 79 -175
6158 -175 -1 -8 126 77 91 198 -113 65 88 -124 75 -57 -35 30 66 -173 114 50 -345 27 -166 225 -50
6181 -50 -178 -101 63 33 46 15 -96 -169 -251 14 30 12 -100 207 146 112 -217 36 31 -265 -96 -24 -42 202 23
6206 23 -146 -94 -49 104 -135 -127 120 175 48 144 -74 -127 -19 -79 -1 -145 148 87 -35 133 206 -9 51 -123
6230 -123 -14 -17 27 -91 87 14 -116 -57 -7 -115 88 -9 -186 41 -37 480 70 107 -15 -212 -35 -177 182
6253 182 168 -281 111 -203 3 211 83 -4 -36 -122 -2 60 -6 77 -155 -60 223 -271 -14 63 -178 41 67
6276 67 -103 -119 -98 26 -14 48 -109 -36 289 -182 -97 74 -33 229 106 66 181 -168 -176 -112 111 -185 -184 -38
6300 -38 -198 150 -98 -58 -80 -32 -103 -45 -153 155 -19 77 -127 -276 120 58 0 64 84 118 -390 -81 -384 70
$$ packed form
6134a02N7k6o6K81l12PK31k0j96L83k57J18k17Q3J96l21QK23J18k08%K24j25k54
6158a75J74pJ34m9J4J07l11J78K3k12J99j32K2O5L6k39K87o4l95L72j93L91k75
6181e0j28P7J64l0J3l1j11p3q2K65J6j8j12L07o1l4l29K53nk96J69P2j8K44j79
6206B3j69N2M5J53k39QK47N5j27R6k18n3J08o0P8j44K93o1j22J68P3k15O0j74
6230a23J09lM4j18J78p3j30N9N0j08K03r7j77K27p8N17m10L7j22j97J77j42L59
6253A82j4m49L92l14K06K08j28q7l2q6J20O2o6Q3k32R5K83m94K57P7k41K19K6
6276F7j70j6K1J24m0O2j57P3L25m71Q5J71j07K62j23m0J15l49qO4K23k96JJ46
6300c8j60L48k48M0k2M8p1N8j08L08j74R6k04j49L96o2n8O4K0L4n08L09l03M54
$$ plain form
6324 70 -135 11 158 -35 108 23 230 78 -95 -73 -66 61 -63 -47 143 -37 164 364 12 223 65 -194
6346 -194 163 -84 106 -133 182 -170 119 14 28 184 -89 75 -1 -24 -181 68 94 -107 -176 55 -66 -179
6368 -179 -184 -204 -69 170 18 -121 147 -307 -53 60 -4 -69 -147 133 -196 -98 -141 -120 -62 90 177 2 -27 -84
6392 -84 -92 -112 121 -28 348 28 -58 129 -161 -94 202 137 -186 105 -31 -180 -105 -192 116 -121 29 19 127
6415 127 4 43 153 72 -303 -230 -197 10 -43 -177 37 -320 -53 -100 94 -25 -25 49 51 -142 -118 202 -7 191
6439 191 60 62 2 -21 143 168 -164 -82 -162 -28 -94 1 -112 214 30 -149 57 47 369 34 228 153 143 54
6463 54 -130 -125 -56 48 293 -50 20 60 -68 -1 -49 -174 301 -68 -30 90 -42 18 -28 -146 -25 52 94 39 65
6488 65 -26 -5 -85 -14 -77 149 -402 304 73 217 453 202 -65 66 122 -32 -104 219 -156 -91 24 -39 -99 -159
$$ packed form
6324G0k05J46J47j93J43q5K07j52j73K2PJ27j24J6J90j80K01K00l52K11j58k59
6346a94L57k47J90k39L15l52K89j05J4J56k73J64p6k3j57K49K6k01o9K31j21j13
6368a79nk0J35K39j52j39K68m54K54J13o4o5p8K80l29R8m3K1N8J52Q7j75k9n7
6392h4qk0K33j49L76l20q6J87k90O7K96o5l23K91j36j49P5q7L08k37J50j0J08
6415A27j23L9J10q1l75P3L3K07n3j34K14l57K67m7J94j19%P4Kj93K4L20k09J98
6439A91j31Ko0k3J64K5l32Q2q0J34o6R5j13L26j84j79K06j0L22l35J94p5j0q9
6463E4j84NO9J04K45l43P0M0j28O7m8j25M75l69L8J20j32O0m6j18J21P7M2n5K6
6488F5r1K1q0P1o3K26n51P06k31J44K36k51k67J31N6j54p2L23l75O5J15o3o0o0
$$ plain form
6512 -159 -27 30 -84 -192 78 -96 2 35 -170 3 -26 140 211 -79 -25 -217 11 95 -44 -38 -1 31 50 37
6536 37 95 15 -38 4 35 5 135 -35 -167 -90 -403 161 116 -10 153 -160 64 -158 74 78 180 -25 263 -37
6560 -37 133 -6 -71 86 81 209 -24 -174 194 16 72 123 243 -492 -227 35 -411 73 -36 -2 -23 -19 -23 239
6584 239 96 -73 215 -116 -195 -68 -42 39 62 -98 -143 -193 218 -1 174 158 -92 -12 -104 -39 112 -145 99
6607 99 114 -69 -92 -124 137 -9 -97 173 -213 105 179 64 44 -200 -146 -303 182 215 155 -210 -83 -52 -281 176
6631 176 -183 224 17 -21 229 5 433 82 84 -70 197 -133 -80 120 25 -70 90 53 71 -106 -93 -26 -124 -26
6655 -26 160 61 -118 -89 -7 30 -30 93 -51 120 -176 -80 93 52 108 76 215 62 -215 95 -32 22 99 180
6679 180 -5 369 26 -104 200 19 96 214 1 -258 -74 -37 134 -21 80 6 -15 -20 -72 -110 85 -239 71
$$ packed form
6512a59J32N7j14j08K70j74R8L3k05J73k9J66P1k90N4j92K28Q4j39OL7L2J9j3
6536C7N8q0n3M2L1l0J30j70j32P7l13N64m5j26J63l13K24k22K32MJ02k05K88l00
6560c7J70j39o5J57nJ28k33j50L68j78N6N1J20p35K65K62m46M84j09L4k1MmK62
6584B39j43j69K88l31p9J27K6Q1K3j60m5n0M11k19J75j6k50Q0r2O5J51k57K44
6607I9J5j83k3l2K61j46q8K70l86L18P4j15k0k44N4j57M85L3o0l65J27L1k29M57
6631A76l59M07k07l8K50k24M28l51Kj54K67l30N3K00r5r5J60l7J8j77J3O7r8R8
6655b6J86r9j79K9Q2L7o0J23j44J71k96R6J73m1N6l2J39j53k77L10j27N4P7Q1
6679A80j85L74l43j30L04j81P7J18k13k59J84L7J71j55J01p4k1nn2l8J95l24L10
$$ plain form
6702 71 -158 -86 -35 84 -166 59 -35 -17 22 33 -98 17 89 -125 -252 -160 11 -19 76 -76 94 -103 52 -151
6726 -151 130 -1 -220 137 10 -81 144 116 -159 20 73 -19 16 233 -29 -83 16 87 139 -4 -172 47 258
6749 258 265 44 28 98 -229 20 19 6 -156 11 -38 -223 -7 3 -38 20 168 -164 89 1 141 150 -53 99 130
6774 130 274 -203 107 -104 -262 81 66 -215 159 146 -40 190 -112 -100 149 -54 -126 101 -120 18 -249
6795 -249 -56 -156 -58 71 58 68 50 185 72 65 -146 -162 -36 -69 132 11 -8 105 -125 170 28 200 40
6818 40 -142 102 -180 46 -15 -150 -92 130 274 -146 -268 -171 44 18 116 -139 -245 -427 -155 45 125 21
6840 21 226 -39 10 199 172 127 23 -173 -204 -67 -149 197 88 -109 -315 -17 -147 -132 66 9 105 -107 189
6863 189 93 -12 -135 -12 32 5 41 19 -98 -76 -181 190 -106 -77 -16 -35 321 -115 120 -168 122 186 -57
$$ packed form
6702G1k29P2N1J19k50K25r4J8L9J1j31J15P2k14j27R2J71l0R5j52J70j97J55k03
6726a51K81j31k19L57j27r1K25k8k75J79N3r2L5K17k62n4R9P1N2j43j68K19K11
6749B58Pk21j6P0l27K49jj3j62J67m9j85K16J0m1N8J48l32K53q8J40Rk03J52L1
6774A30J44m77L10k11j58L43j5k81L74j3j86K30l02J2K49k03p2K27k21J38k67
6795b49J93j00R8J29j3J0j8J35j13pk11j6J26l3K01j21j9J13k30K95j42J72j60
6818D0j82K44k82K26o1j35N8K22J44m20j22R7K15k6R8k55j06j82K72K00Q0j04
6840B1K05k65M9J89k7m5j04j96l1J37q2L46j09j97k06K98j30J5J98n7R6k12K96
6863A89r6j05j23J23M4k7L6k2j17K2j05L71k96K9O1j9L56m36K35k88K90O4k43
$$ plain form
6886 -57 56 233 -39 -132 107 343 -234 -177 147 -90 96 203 -6 181 -366 -132 171 213 -33 202 -20
6907 -20 -61 115 60 -96 90 156 -225 -38 -38 53 -158 42 199 -124 -70 188 -112 -47 236 81 40 58 -56 16
6931 16 -67 50 -3 -21 116 164 261 220 -205 -205 107 -31 -149 74 75 250 2 -186 132 -38 -107 -126 251 38
6955 38 51 161 74 25 106 -212 151 342 123 -227 -13 127 -142 -3 21 118 9 116 35 86 102 77 116 55
6979 55 11 -44 231 13 209 -234 -61 -186 -50 -45 -219 12 -47 238 -198 76 38 226 -8 53 129 -61 109
7002 109 -59 -13 -151 50 -138 -162 -93 48 -154 -241 -143 34 -121 -31 -21 -123 -31 -86 -151 -116 41 -1 100 90
7026 90 10 124 -1 3 292 -58 -109 -96 -30 249 13 60 -89 -14 -22 195 -12 -140 194 126 -104 -123 54 -243
7050 -243 -15 141 76 305 -29 -39 -218 -128 -22 117 -126 296 169 -1 106 -153 123 194 -124 48 70 96
$$ packed form
6886e7J13J77k72r3K39K36n77N7L24k37J86J07k09J87n47K34L03M2k46K35k22
6907b0m1J76n5j56J86O6l81J87%R1k11K00J57l23N4K58l00O5K83j55m1J8j14P2
6931A6q3J17n3j8J37M8R7m1m25%L12j38j18K23JJ75k48j88L18j70o9j9L77k13
6955C8J3J10q7m9Q1l18L63J91k19l50K14J40k69J39K4R7j09J07q1N1J6k5L9o1
6979E5m4n5K75k18J96m43J73j25J36Nj74K31n9K85m36K74l8J88k34O1P6j90J70
7002A09j68M6j38K01j88k4O9J41k02q7R8J77j55R0J0j02R2n5o5L5J57m2J01j0
7026I0q0J14j25MK89l50n1J3O6K79k36M7j49P5qK17k07j28L34o8k30j9J77k97
7050b43K28J56o5K29l34j0j79R0J06J39k43M22j27j70J07k59K76P1l18J72K2K6
$$ plain form
7072 96 -80 22 -196 62 43 -19 -142 -97 76 109 -229 120 119 -268 -16 62 127 179 -22 -53 -25 25 149 -72
7096 -72 -28 216 41 47 -24 -142 -54 26 -79 137 -10 -26 -337 69 151 -124 -123 101 83 -25 17 -120 -126 -8 99
7121 99 78 73 218 136 -142 153 5 83 -151 -55 -237 -67 -169 -11 -190 -13 143 -14 -185 -89 -71 69 -109
7144 -109 -96 -141 -165 -13 -175 -141 149 -91 20 18 -179 -222 212 -3 -141 6 -33 86 -29 -19 -226 91 -46
7167 -46 113 -79 -70 -346 -39 118 229 -292 -16 -46 161 80 83 -202 165 -305 -42 194 -10 53 -76 -282 31
7190 31 136 -346 128 -1 43 -236 99 -67 82 -191 120 280 58 -27 94 50 56 224 -172 -123 6 -136
7212 -136 -109 -9 147 102 211 118 69 104 -54 -190 -43 25 -11 -8 -120 -79 367 107 133 -69 41 -40 -90 -121 9
7237 9 176 -116 11 15 280 76 137 103 21 259 -25 456 20 -44 24 87 169 -126 87 -187 -153 -63 -208 -164 137
$$ packed form
7072I6j76J02k18K58j9o2j23M5J73L3l38L49jl87K52P8O5N2k01l1K8N0J24k21
7096g2M4K44j75Op1j18Q8Q0j05K16j47j6l11M06Q2k75JK24j8j08M2j37oJ18J07
7121I9k1nJ45q2k78K95j48P8k34R6j82J70j02J58j79J77J56j57j71R6J8J40j78
7144a09J3m5k4J52j62L4K90k40J11kj97m3M34k15j38J47l9J19j15J0k07L17j37
7167d6J59j92Rk76L07J57J11n21K76l0K07q1Lk85L67m70K63K36k04O3j29k06L13
7190C1J05m82M74j29M4k79L35j66J49k73L11J60k22q5J21m4OJ68l96M9J29j42
7212a36K7J00J56m5J09r3m9L5j58j36J47O8l6Lj12M1M46k60K6k02J10q1n0l1J30
7237IJ67k92J27MK65k04O1l4q2K38k84M81m36o4O8O3Q2k95K13k74L4R0j45M4L01
$$ plain form
7262 137 244 -47 -157 68 81 -30 -64 131 217 70 -298 -39 -146 184 161 61 98 -213 178 -174 141 -189
7284 -189 -196 -110 -132 -101 -206 124 251 -267 156 212 104 89 -103 78 92 217 -122 -32 -96 42 -214 83 -188
7307 -188 -86 236 100 75 -24 44 -54 16 58 67 187 -200 -50 -19 136 160 158 154 17 55 -121 23 104 -53 -95 -117
7333 -117 171 -84 -6 113 47 -135 -15 65 132 -22 -6 -159 -87 -20 -322 162 -25 -36 -6 -55 159 16 -114
7356 -114 -126 232 35 -137 153 155 -61 181 61 -85 56 -105 27 237 -210 2 237 141 -63 162 225 -3
7378 -3 -5 -31 -166 -392 -30 -166 -196 101 -82 289 -38 -76 -84 -130 -83 -231 16 112 223 17 221 -1 166 69
7402 69 -14 -23 -137 50 89 -277 -110 14 139 -94 95 -191 -167 138 4 0 28 36 65 -251 -137 91 61 -120
7426 -120 -245 -113 -42 175 72 178 80 -71 -37 -156 34 -98 -119 -75 5 76 64 44 320 127 48 146 113 -34
$$ packed form
7262A37J07k91j10K25J3j11l4J95Q6j47l68K59j07L30k3j00L7l11L91l52L15l30
7284a89pQ6k2L1j05L30J27n18M23N6j08j5j92J81J4J25l39R0o4J38k56K97k71
7307a88J02L22j36k5r9O8r8P0M2RJ20l87J50L1J55K4kmj37L8j76J44Q1j57m2k2
7333a17K88k55P8J19o6j82J20Q0O7j54J6j53P2O7l02M84j87j1L0m9K14j43j30
7356a14j2L58j97j72K90Kk16K42j20j46J41j61J32K10m47K12K35r6k04K25O3k28
7378ckk6j35k26L62j36l0K97j83L71l27l8qm6M7j48K47R6J11k06K04k22J67r7
7402F9q3rj14J87L9l66J67J24J25k33J89k86K4L05j34mK8QK9l16J14K28l0j81
7426a20j25J32P1K17j03J06r8j51L4j19J90j32k1M4Q0P1j2k0K76j93p9R8l3j47
$$ plain form
7450 -34 -193 -248 141 230 191 218 132 55 369 -4 -72 -236 -270 -32 41 -24 -158 -152 120 289 -62 52 125 -25 4
7475 4 21 36 -264 270 -210 339 32 191 -77 -186 -231 -180 117 -44 69 218 55 66 53 228 -81 11 -241
7498 -241 -41 92 -86 245 38 57 134 -97 120 -116 -34 -94 216 150 -196 107 161 -167 -102 205 -178 35
7520 35 69 -33 192 -156 -123 -110 -79 -140 -396 -120 80 15 -8 104 -23 -86 -218 92 -126 14 -243 10 -126
7543 -126 -72 -56 -138 -23 327 4 -48 97 34 -151 -99 193 204 39 -145 105 -254 -233 192 -45 175 -139 219
7566 219 -76 -149 -20 17 131 29 134 -166 150 407 -37 169 180 72 67 -89 7 148 -150 181 36 144
7588 144 -14 133 79 -220 310 169 -90 -23 -317 -48 -140 3 -66 -36 -41 -40 -79 113 -135 31 40 135 101 101 -69
7613 -69 253 92 295 44 -155 -94 32 39 -168 114 49 42 62 172 -91 -67 240 -170 -100 31 219 -190 109
$$ packed form
7450c4j59n5L89Q9l9K7q6p7L14l73o8j64l4K38P3o5j34OK72J69l51J14P3j50K9
7475DJ7J5l00N34m80N49l07J59k68j09m5N1K97j61J13J49j63J1j3J75l09R2k52
7498b41K00J33j78L31k07J9P7k31K17k36Q2o0L10o6l46L03N4l28O5L07l83K13
7520C5L4j02K25l48L3J3L1o1k56K76K00o5k3J12j27o3j32L10k18J40k57K53j36
7543a26N4J6q2J15L50l23n2J45o3j85N2K92J1j65j84K50l59K1M25k37K20l14L58
7566B19k95p3J29L7J14j02J05l00L16K57m44K06J1j08nj56R6J41k98L31j45J08
7588A44j58J47n4k99N30j41k59O7k94K69r2J43o9L0nJl9J92k48J66RR5l4%j70
7613f9L22j61K03k51j99O1J26Pk07K82o5pK0J10k63K4L07m10P0J31J88m09K99
$$ plain form
7636 109 -48 -210 -124 152 -175 37 273 -317 -15 -147 -50 128 40 -195 -9 -39 179 -167 -12 -42 -196 -165
7658 -165 89 -106 -141 173 97 211 19 41 242 -130 -316 17 90 -184 84 -9 212 -245 82 -3 142 125
7680 125 102 54 161 -164 85 -138 -226 128 55 67 -127 280 -269 -44 248 16 -94 -245 98 -293 -171 184
7702 184 -259 -146 6 154 164 365 43 -173 67 159 -84 -246 37 249 121 159 -46 218 -205 52 44 -295
7724 -295 -96 -86 -6 43 130 -127 170 -53 -215 -159 39 -284 -132 -4 18 -111 -209 187 124 123 112 -97 103 -190
7748 -190 -39 -294 -146 -197 -219 -100 -53 -149 -153 -99 229 27 -35 94 98 2 -11 20 134 -26 -42 9 12 218 -82 320
7774 320 -210 2 298 46 -41 -183 281 195 -8 28 32 -157 14 35 -22 122 300 -122 160 -181 175 -179
7796 -179 176 -21 -242 112 57 89 68 23 -52 81 77 69 128 -78 -50 -194 -125 -41 -23 -62 -44 12 -160 50 -133 -45
$$ packed form
7636A09j57j62Q6K76l27K12K36n90L02j32R7J78q8k35J86l0K18l46J55l0j54L1
7658a65K54j95l5L14p6J14j92K2K01l72j86L33P3k74K68r3K21m57L27q5J45j7
7680A25k3m8J07l25K49k23q8L54p3J2j94M07n49K25K92k32j10j51L43l91J22L55
7702A84m43J13J52J48J0K01l22k16K40R2k43j62K83K12j28L8k05K64m23K57ql39
7724b95J99J0Q0M9Q7k57K97k23j62N6J98l23J52J28K2j29r8L96o3jj1k09K00k93
7748a90J51k55J48n1k2J19M7r6mN4L28k02o2J29Mr6j3L1J14j60j6N1LK06l00M02
7774C20n30K12K96k52q7j42M64q6k03L6Mj89J71K1n7J44J78m22K82l41L56l54
7796a79L55j97k21L54n5L2k1m5p5J33mqN9k06K8j44O9Q4J8l9J8N6j72K10j83Q8
$$ plain form
7822 -45 143 203 -26 -281 250 24 95 135 283 95 -154 237 220 106 -120 -84 -116 56 169 -64 7 36 55
7845 55 69 86 174 123 -56 -159 96 89 81 -284 -180 59 128 -43 -191 -121 -136 111 -227 -62 2 34 -23 -67 -75 57
7871 57 169 137 -269 -195 143 -82 -49 -9 -80 70 149 -53 64 -321 108 179 -124 -85 -212 -43 -153 -23 236
7894 236 138 -28 -109 36 227 126 -6 -94 23 -42 -81 76 -153 178 -83 -168 144 66 -21 -121 125 9 -20
7917 -20 59 -59 52 -58 -63 52 -183 -12 228 335 171 -151 148 110 64 4 51 93 86 161 -202 85 -52 169
7941 169 66 94 -5 223 -52 -69 -23 -44 -231 7 54 -46 -199 -114 -102 -502 -280 -14 -37 24 -202 -19 107
7964 107 61 -76 149 183 -77 -2 -53 156 163 -210 -18 -142 -38 282 -311 24 -169 -69 197 114 1 353
7986 353 208 -84 -118 -21 177 -76 106 66 -39 34 30 295 -60 -51 38 -44 15 87 -121 99 -149 -45 22 88 -128
$$ packed form
7822d5J88O0k29k55N31k26P1M0J48j88k49L91j7j14k26L6l2J72J13k33P1K9J9
7845E5J4J7Q8n1j79j03K55pql65J04K39O9j71j48P0j5K47l38J65O4L2n7m4qJ32
7871E7J12l2m06P4L38k25L3M0p1J50P9k02J17l85M29P1l03L9j27J69j10J30K59
7894B36r8j66q1J45J91j01j32q8J17o5l9J57k29L31k61q5L12p8q7j00K46j16k9
7917b0P9j18J11j10nJ15k35J71K40J07j64l22K99l8m6o0M7M2pP5l63K87j37K21
7941A69j03K8r9K28k75j7M6k1j87K38M7j00j53Q5J2m00K22K66k3O1k26J83J26
7964A07m6j37K25L4k60P5n1K09Pl73J92j24J04L20n93L35j93J00K66q3j13L52
7986C53j45k92l4R7J98k53J82m0j05P3mK65l55RQ9q2N9P2k08K20k48J04O7O6k16
$$ plain form
8011 -128 154 -34 32 -216 13 35 -75 75 82 52 160 -309 57 190 160 -134 150 -60 166 57 -292 209
8033 209 -72 -139 -82 -367 -21 35 -60 -137 -47 -25 302 -286 -262 -41 178 152 -36 -157 -228 -4 71 0 -14 -42 -17
8058 -17 -238 -59 255 158 -161 -505 159 118 107 -2 89 -112 -36 106 25 1 118 -189 -12 20 37 -75 80
8081 80 143 -36 -22 -81 -27 -70 -55 138 142 -2 114 -1 -14 -28 193 66 222 -138 -220 -267 91 -7 -38 -246 270
8106 270 114 -218 159 -297 -101 -277 143 88 -154 -38 112 -169 -17 -27 23 77 -195 -130 95 -140 -70 -98
8128 -98 -184 -75 265 91 81 270 51 -209 2 -124 235 -92 -157 52 102 -215 -3 -19 217 -21 -327 -5
8150 -5 231 -42 -175 13 -130 74 -69 -16 220 84 -240 89 160 115 84 -240 -276 -88 103 60 39 -157 -282
8173 -282 -63 47 94 -270 -35 -151 -130 205 -235 16 -72 -276 -245 -194 -108 -54 -50 -55
$$ packed form
8011a28K82j88O6k48K29K2j10J50Pl0J08m69L66J33l0k94K84k10K26j09l49N01
8033B09k81o7N7k85L46N6r5p7R0K2L27n88K4K21K19k6j88j21p1K24P5p1j4k8K5
8058a7k21J79L14r7l19l44O64m1j1j09R1k01P6J42q1k4J17l07J77L2J7j12J55
8081H0O3j79J4n9N4m3J5J93Mj44J16j15j3j4K21j27J56l60q2m7L58r8l1k08N16
8106B70j56l32L77m56J96j76M20n5k42J16J50k81J52j0N0N4k72O5K25k35P0k8
8128i8q6J09L40j74j0J89k19k60K11j26L59l27o5K09N0l17K12j6K36k38l06L22
8150eK36k73j33J88j43K04j43N3K36j36l24L29P1m5l1l24l6J88J91m3k1j96j25
8173b82K19J10M7l64K35j16K1L35m40K51q8k04L1N1Q6N4Mn
8191e5
$$ Imaginary data points
##PAGE= N=2
##DATA TABLE= (X++(I..I)), XYDATA
$$ plain form
0 0 0 0 0 0 0 0 0 0 0 0 0 0 8 -8 8 -8 8 -14 16 -16 24 -24 32 -38 40 -48 56 -68 78 -88 102 -116 132 -149 166
35 166 -189 212 -237 266 -297 330 -365 404 -448 495 -549 606 -665 733 -807 890 -980 1082
53 1082 -1193 1319 -1462 1622 -1809 2025 -2281 2591 -2971 3452 -4083 4953 -6230 8292 -12192
68 -12192 22191 -105123 -193415 -81102 -170767 -255905 -350085 -340563 -246208 -136988 -20313 16178
80 16178 -47918 -76533 -80030 4770 73899 94363 85882 -26696 -124477 -144758 -137728 -62067 -48679
93 -48679 -77235 -98980 -145687 -118995 -37009 56117 134718 120692 107434 93811 79437 123629
105 123629 150205 153989 99792 -3638 -42401 -82457 -94637 -60061 -67235 -83724 -124428 -139910
117 -139910 -88066 -49675 13111 63944 63592 61348 43724 68577 104145 101076 108497 72096 23043
$$ packed form
0@%%%%%%%%%%%%Qj6J6j6J6k2L0l2M0m8N6p0P8q8J04j24J46j66J90k18K48k81L15
35A66l55M01m49N03n63O27o95P69q52R43j044J155j271J398j540J697j870K062
53A082k275K512k781L084l431L834m306M872n562O423p535R036j1183J4522k0484
68a2192L4383j27314q8292J12313q9665q5138r4180R522R4355J09220J16675L6491
80A6178o4096k8615l497Q4800O9129K0464q481j12578r7781k0281P030P5661J3388
93d8679k8556k1745m6707K6692Q1986R3126P8601j4026j3258j3623j4374M4192
105A23629K6576L784n4197j03430l8763m0056j2180L4576p174j6489m0704j5482
117a39910N1844L8391O2786N0833l52k244j7624K4853L5568l069P421l6401m9053
$$ plain form
130 23043 -4716 -28938 -1064 6803 -7919 -1774 -22448 -15278 11324 41976 93257 96347 92490
143 92490 92990 76463 86943 84092 81720 69982 14083 -14445 -39705 -59122 -54010 -68704 -64863
156 -64863 -75285 -97969 -76030 -59375 -36903 -12882 -7937 6610 -4780 -4951 17063 13354 14155
169 14155 1803 -14500 -23037 -45976 -36037 -25736 -34458 -25755 -31198 -25061 -10902 -4090 24872
182 24872 33601 34336 40287 31523 39351 36324 29888 33289 12613 47 -12453 -22693 -16323 -29211
196 -29211 -28745 -22727 -34503 -28371 -22115 -10637 908 -3525 9558 9465 1875 10793 10201 13168 6089
211 6089 -2690 1812 -11901 -13218 -6195 -10928 -5749 -9605 -7157 2099 -1202 9522 14564 14049 18915
226 18915 12090 16909 17290 10277 13479 5812 2635 -2070 -10164 -3064 -8466 -12123 -6691 -11130 -8133
$$ packed form
130B3043k7759k4222K7874P867j4722O145k0674P170K6602L0652N1281L090l857
143I2490N00j6527J0480k851k372j1738n5899k8528k5260j9417N112j4694L841
156f4863j0422k2684K1939J6655K2472K4021M945J4547j1390j71K2014l709Q01
169A4155j2352j6303q537k2939R939J0301q722Q703n443O137J4159O812K8962
182B4872Q729P35N951q764P828l027o436L401k0676j2566j2500j0240O370j2888
196b9211M66O018j1776O132O256J1478J1545m433J3083r3p590Q918n92K967p079
211F089q779M502j3713j317P023m733N179l856K448R256l301J0724N042n15M866
226A8915o825M819L81p013L202p667l177m705q094P100n402l657N432m439K997
$$ plain form
241 -8133 -8678 -5922 3364 -2638 1535 5177 1343 4453 1793 5662 5528 -2423 2338 102 -2609 332
257 332 -2589 2327 -438 -2765 4446 1619 4202 5765 5007 9091 3182 5208 8031 3294 5845 2906
273 2906 2022 2408 -3681 541 -437 -3409 -534 -3829 -1039 -1357 -3775 1532 -1360 -1270 -220 -2383 1432
290 1432 -2229 -1275 2071 -2766 -1534 -2136 -2370 -500 -4303 -542 -537 -4402 -1309 -2051 -1175 -1255 -2558 1238
308 1238 -1799 -1597 1325 -1560 575 -521 -694 1326 -1527 550 824 -1072 1561 -1612 4 681
324 681 -1449 1125 -134 558 1017 -1251 2050 629 -486 1973 372 1091 627 -95 2045 -1315 -399
341 -399 961 -1497 -332 -1257 -214 17 -2362 353 -162 -1330 662 -730 640 160 -673 1462 -887
358 -887 -218 545 -907 830 -965 -847 371 -1362 -277 -1107 -509 591 -1373 477 640 -279 976
$$ packed form
241h133n45K756R286o002M173L642l834L110k660L869j34p951M761k236k711K941
257C32k921M916k765k327P211k827K583J563p58M084n909K026K823m737K551k939
273B906q84L86o089M222r78k972K875l295K790l18k418N307k892R0J050k163L815
290A432l661R54L346m837J232o02k34J870l803L761Nl865L093p42Q76q0j303L796
308A238l037K02K922k885K135j096j73K020k853K077K74j896K633l173J616O77
324F81k130K574j259O92M59k268L301j421j115K459j601P19m64p22K140l360R16
341c99J360k458J165r25J043K31k379K715n15j168J992j392J370m80q33K135k349
358h87O69P63j452J737j795J18J218j733J085q30N98J100j964J850J63r19J255
$$ plain form
375 976 3 928 559 -850 1400 -371 -142 333 -806 649 -514 -68 1528 -111 1010 1501 1053
392 1053 2149 926 2179 2422 1205 2318 1669 1704 1568 502 1365 28 -419 891 -537 360 -138
409 -138 -291 635 -739 -317 153 -738 65 -735 -630 -668 -1524 -791 -1294 -1718 -1097 -2002 -1309 -1576 -2085 -762
429 -762 -1266 -560 -357 -522 472 -227 405 1149 156 515 223 144 432 -502 349 -320 -614 -93 -998 -412 -688
450 -688 -730 -165 -601 -456 -148 -586 -72 -278 -670 241 -664 -142 -275 -365 223 -800 27 31 -253 249 356
471 356 601 953 581 1361 1129 1261 1445 1487 1665 1334 973 1368 642 1058 784 562 338 134 -60 -91 -673
492 -673 -327 -467 -846 -516 -915 -307 -623 -769 -254 -725 -688 -683 -949 -181 -536 -437 -371 -768 -384 -411 -450 84 -135
515 -135 211 337 613 742 676 608 935 766 982 622 919 913 443 636 242 382 247 -257 -78 -17 -11 -317 -421
$$ packed form
375I76r73R25l69j409K250j771K29M75j139J455j163M46J596j639J121M91m48
392A053J096j223J253K43j217J113o49L5j36j066Q63j337m47J310j428Q97m98
409a38j53R26j374M22M70q91Q03q00J05l8q56P33n03m24O21r05O93k67n09J323
429g62n04P06K03j65R94o99O32P44r93L59k92p9K88r34Q51o69k94N21r05N86k76
450f88m2N65m36J45L08m38N14k06l92R11r05N22j33r0N88j023Q27Mk84N02J07
471C56K45L52l72P80k32J32J84M2J78l31l61L95p26M16k74k22k24k04j94l1n82
492f73L46j40l79L30l99O08l16j46N15m71L7Nk66P68l55R9O6l97L84k7l9N34k19
515a35L46J26K76J29o6o8L27j69K16l60K97om70J93l94J40j35n04J79O1Ol06j04
$$ plain form
538 -421 -152 17 -186 -222 -179 -161 199 -309 -155 -169 -451 -235 -166 -7 -240 -148 -96 -245 -261 -188 13 276 53
561 53 -13 210 173 276 201 263 65 138 277 261 -98 -70 13 -20 -123 -518 -294 -385 -169 0 -436 -125 -316 -132
585 -132 -420 -498 -23 -245 -272 -4 14 -385 76 177 -119 -50 -69 37 -25 97 -91 117 -98 165 202 49 406
608 406 353 288 84 100 330 -26 263 521 311 295 230 110 -219 -57 -153 -212 -94 -179 149 -22 70 -9 -71 215
632 215 452 49 280 152 225 327 -144 162 172 -46 -6 -123 -115 -92 98 -11 10 50 81 109 286 156 206 230
656 230 -35 -133 -123 270 -110 -151 -416 33 -411 -517 -374 -430 -204 -137 -149 -48 -172 -132 -299 -60 41 -16 129
679 129 -17 125 -261 -336 -363 -98 -248 -383 -60 -440 -552 -156 107 132 104 119 88 552 -225 -45 78 429
701 429 252 -113 -207 82 -70 17 -83 -282 170 16 3 424 394 131 356 271 342 -30 173 317 153 236 29
$$ packed form
538d21K69J69k03l6M3J8L60n08J54j4k82K16O9J59k33R2N2j49j6P3K01K63k23
561E3o6K23l7J03p5O2j98P3J39j6l59K8Q3l3j03l95K24r1K16J69m36L11j91J84
585a32k88p8M75k22k7K68J8l99M61J01k96O9j9J06o2J22j88K08k15K63L7j53L57
608D06n3o5k04J6K30l56K89K58k10j6o5j20l29J62r6n9J18q5L28j71R2p9o2K86
632B15K37m03K31j28P3J02m71L06J0k18M0j17QK3J90j09K1M0L1K8J77j30N0K4
656B30k65r8J0L93l80m1k65M49m44j06J43n6K26O7j2J01j24M0j67K39J01n7J45
679A29j46J42l86p5k7K65j50j35L23l80j12L96K63K5k8J5l1M64p77J80J23L51
701D29j77l65r4K89j52Q7j00j99M52j54j3M21l0k63K25q5P1l72K03J44j64Q3k07
$$ plain form
724 29 -44 -73 88 167 -200 -42 -78 -82 67 316 358 89 201 59 108 67 144 -90 321 -288 -141 -88 -258 -298 40
749 40 161 12 -215 -106 103 -81 -76 -39 262 80 51 57 -50 -19 372 -6 -150 -233 -241 -69 -193 44 121 79 -278
774 -278 -194 81 150 170 139 299 190 53 171 204 -90 -43 43 -173 -257 5 57 142 -16 21 93 150 145 -70 -105 -141
800 -141 -188 308 40 -84 5 -55 -97 -63 110 -93 -143 -137 -105 73 -150 -170 155 182 -17 124 90 -258 241 27
824 27 -15 -96 -53 -131 -159 105 2 -220 -74 -267 -167 88 -63 -162 128 -194 -2 -2 61 275 -223 -40 14 55
848 55 340 231 14 -203 -15 72 -82 78 147 -167 33 -194 63 31 19 5 228 198 75 -267 363 46 79
871 79 -43 -278 -68 -48 -85 -224 -22 -236 30 90 12 41 -260 95 -244 158 136 29 181 -4 50 -139 345
894 345 -202 -49 41 -142 -42 -227 3 68 153 86 76 -93 295 215 122 163 240 144 185 -214 -17 19 122 62 60
$$ packed form
724B9p3k9J61P9l67J58l6mJ49K49M2k69J12j42M9m1P7k34M11o09J47N3j70m0L38
749D0J21j49k27J09K09j84NL7L01j82k9Oj07L1L91l78j44q3qJ72j24K37P7m2l57
774b78Q4K75O9K0l1J60j09j37J18L3k94M7Q6k16q4K62N2Q5j58L7P2N7nk15l5l6
800a41m7M96k68j24Q9o0m2L4J73k03n0OL2J78k23k0L25K7j99J41l4l48M99k14
824B7m2q1M3p8k8K64j03k22J46j93J00K55j51r9K90l22J92%O3K14m98J83N4M1
848E5K85j09k17k17J88Q7j54J60O9l14K00k27K57l2j2j4K23l0j23l42O30l17L3
871G9j22k35K10K0l7j39K02k14K66O0p8K9l01L55l39M02k2j07J52j85N4j89M84
894C45n47J53R0j83J00j85K30O5Q5o7j0j69L88q0r3M1P7r6M1l99J97L6J03o0k
$$ plain form
919 60 -123 85 -276 -6 -69 201 28 -28 9 -64 23 93 39 124 -116 -254 -190 -67 -224 -188 -62 -38 -272 -158
943 -158 -42 -201 9 -179 96 8 -218 -229 -16 -57 99 -244 -162 -229 78 -207 218 -100 -101 73 149 50 -12 254
967 254 127 -3 245 163 327 277 94 156 55 -174 47 -46 132 -234 -159 49 -283 266 94 38 182 -59
989 -59 84 84 230 -201 -68 -87 -69 -207 65 -66 181 -133 244 -85 -129 43 177 -281 -360 61 240 -28 -84
1012 -84 -22 -62 -133 -78 297 -44 -96 -207 96 -297 -144 -106 -455 -99 -144 112 -119 52 131 -73 63 131 -269
1035 -269 43 222 -68 236 23 49 -231 -204 -124 110 55 74 266 93 -53 -188 108 -80 -149 218 1 122
1057 122 -95 114 448 -265 -170 -143 32 -99 144 -137 -406 -118 -233 -43 -274 100 -35 91 -22 149 -8
1078 -8 103 256 -166 -126 -128 118 19 -25 100 -52 -89 -47 -26 167 -2 137 15 -42 49 79 60 -40 -81 33 96
$$ packed form
919F0j83K08l61K70o3K70j73n6L7p3Q7P0n4Q5k40j38O4J23j57L6J26K4k34J14
943a58J16j59K10j88K75q8k26j1K13m1J56l43Q2o7L07k85M25l18jJ74P6r9o2K66
967B54j27j30K48q2J64n0j83O2j01k29K21r3J78l66P5K08l32N49j72n6J44k41
989e9J43%J46m31J33j9J8j38K72j31K47l14L77l29m4J72J34m58p9M21J79k68n6
1012h4O2m0p1N5L75l41n2j11L03l93J53L8l49L56m5K56k31J71P9k04J36O8m00
1035b69L12J79k90L04k13K6k80K7Q0K34n5J9J92j73j46j35K96j88o9L67k17J21
1057A22k17K09L34p13R5K7J75j31K43k81k69K88j15J90k31L74j35J26j13J71j57
1078hJ11J53m22M0kK46r9m4J25j52l7M2K1J93j69J39j22n7R1L0j9j00m1J14O3
$$ plain form
1103 96 62 226 -5 -93 -133 25 50 -33 57 -33 -141 33 -120 221 -200 -302 155 0 -33 80 29 41 96 -177
1127 -177 5 -92 -141 -140 -97 126 201 7 -86 -135 103 -89 -164 103 284 -196 65 3 236 201 80 133 60 57 -76
1152 -76 22 -225 -222 -39 -125 74 135 -266 -100 -101 249 -222 122 -80 -202 -271 -25 87 254 -61 -17 -58 34 -16
1176 -16 -64 152 -336 -371 320 -60 7 80 -38 181 178 41 -116 146 14 179 316 181 103 -80 -34 -101 -234
1199 -234 278 -3 38 141 128 28 12 110 -165 -1 116 236 112 181 210 -87 -243 74 -27 -75 -160 7 305
1222 305 135 317 5 -183 230 -52 5 -66 79 -122 -125 -59 -57 54 -18 8 -10 -143 -251 31 133 1 -22 150
1246 150 -203 -4 203 112 137 47 36 -116 -56 13 -195 63 -152 -92 148 37 -53 -120 -96 -33 -12 47 231 352
1270 352 217 -169 74 -221 -143 177 -100 -10 160 97 48 101 67 262 -94 50 25 84 161 174 48 144 170 -8
$$ packed form
1103I6l4J64k31q8m0J58K5q3R0r0j08J74j53L41m21j02M57j55l3J13n1J2N5k73
1127a77J82r7m9JM3K23P5j94r3m9K38j92p5K67J81m80K61o2K33l5j21N3p3lj33
1152g6R8k47LJ83q6J99O1m01J66jL50m71L44k02j22o9K46J12J67l15M4m1R2n0
1176a6m8K16m88l5O91l80O7P3j18K19lj37j57K62j32J65J37j35p8j83M6o7j33
1199b34N12k81M1J03j3j00j6R8k75J64J17J20j24O9K9k97j56L17j01m8q5J67K98
1222C05j70J82l12j88M13k82N7p1J45k01lO6KJ11p2K6j8j33j08K82J02j32k3J72
1246A50l53J99K07r1K5r0j1j52O0O9k08K58k15O0K40j11r0o7K4O3K1N9J84J21
1270C52j35l86K43k95P8L20k77R0J70o3m9N3l4J95l56J44k5N9P7J3j26R6K6j78
$$ plain form
1294 -8 167 -115 -100 -294 177 -225 28 234 -119 78 -69 33 -64 -158 17 -96 46 298 326 138 -157 368
1316 368 -30 -140 -75 -109 -112 78 40 -99 124 21 218 -269 -29 -48 -171 47 -50 62 378 -28 62 115 152
1339 152 102 1 -139 1 166 138 28 -67 34 174 -190 54 128 -196 -219 114 -27 -243 -139 1 82 293
1361 293 -27 40 -184 -146 -42 61 -24 22 -154 -431 31 172 217 58 -28 214 80 100 -34 -159 11 51 -224
1384 -224 -37 -290 293 41 -18 -212 28 87 31 107 -48 -38 101 -37 123 236 -120 -84 -353 172 -220 -107
1406 -107 212 106 48 -168 75 137 68 34 -89 26 124 -140 44 56 -121 271 166 -213 189 -214 84 123
1428 123 95 162 79 -248 -211 59 136 28 60 226 127 15 106 39 -184 178 237 -35 4 147 -45 -206 -48 79
1452 79 -354 23 -78 246 4 96 -148 103 102 -134 132 299 -139 151 122 -51 -68 -250 -115 72 -304 89
$$ packed form
1294hJ75k82J5j94M71m02K53K06l53J97j47J02r7r4J75j13J42K52K8j88k95N25
1316C68l98j10O5l4lJ90l8j39K23j03J97m87K40j9j23K18r7J12L16m06R0N3L7
1339A52n0j01j40J40J65k8j10r5J01J40l64K44P4l24k3L33j41k16J04J40Q1K11
1361B93l20O7k24L8J04J03q5M6j76k77M62J41M5j59q6K42j34K0j34j25J70M0k75
1384b24J87k53N83k52n9j94K40N9n6P6j55J0J39j38J60J13l56L6k69N25l92J13
1406a07L19j06n8k16K43O2o9l4j23J15R8k64J84J2j77L92j05l79M02m03K98L9
1428A23k8O7q3l27L7K70P7j08L2J66r9j12R1o7k23L62N9k72L9J43j92j61J58J27
1452G9m33L77j01L24k42R2k44K51jk36K66J67m38K90k9j73j7j82J35J87l76L93
$$ plain form
1474 89 -232 94 -60 -11 -203 12 136 -81 -68 -180 62 81 195 75 20 103 -107 -90 -176 37 -132 -324 72
1497 72 -40 -316 163 351 111 241 202 106 -20 138 -110 -35 26 161 -250 -119 -63 21 86 92 -21 -14 -293 -111
1521 -111 73 -109 -4 24 -47 84 -197 -219 -31 -7 -99 -53 -108 420 93 138 146 -141 128 204 165 -58 3 270
1545 270 139 -15 61 -22 -60 44 -99 -143 -27 -94 -211 -128 -32 -51 -33 130 -52 193 86 -149 -72 -133 -45 47
1569 47 -102 84 77 -63 -265 -116 63 -44 -163 -50 51 -20 47 53 228 -139 -211 88 -60 104 -155 -7 -47
1592 -47 158 17 -176 -153 -196 -131 -169 58 163 203 27 -11 -278 282 -21 87 -186 320 22 70 -30 -16 -39
1615 -39 -298 -320 60 251 -36 -222 -112 -142 -88 67 41 32 -133 145 -86 -11 244 -168 67 -155 -5 -105 -302
1638 -302 4 -131 164 -13 -123 -340 -136 -105 -107 283 6 61 25 52 90 -112 -126 -63 -156 -94 26 -49 -112 -208 57
$$ packed form
1474H9l21L26j54M9j92K15J24k17J3j12K42J9J14j20n5Q3k10J7q6K13j69j92L96
1497G2j12k76M79J88k40J30l9r6j26J58k48P5O1J35m11J31N6Q4O5Oj13Pk79J82
1521a11J84j82J05K8p1J31k81k2J88K4r2M6n5N28l27M5Qk87K69P6l9k23O1K67
1545B70j31j54P6q3l8J04j43m4J16o7j17Q3R6j9J8J63j82K45j07k35P7o1Q8R2
1569D7j49J86pj40k02J49J79j07j19J13J01p1O7OJ75l67p2K99j48J64k59J48m0
1592d7K05j41j93K3m3O5l8K27J05M0j76l8k67N60l03J08k73N06k98M8j00J4k3
1615c9k59k2L80J91k87j86J10l0N4J55k6rj65K78k31P5K55m12K35k22J50j00j97
1638c02L06j35K95j77j10k17K04L1kL90k77N5l6K7L8k02j4O3r3O2J20p5o3r6K65
$$ plain form
1663 57 -155 -75 -26 -75 71 107 152 -95 -94 214 389 22 -19 142 -96 2 50 -138 -4 89 161 394 7 90 110
1688 110 53 193 -327 -126 230 43 -54 108 196 26 86 -21 -288 50 37 363 -30 -9 -188 -78 36 119
1710 119 -64 -60 284 47 48 232 106 -14 -316 22 -30 -239 -223 -86 -50 -15 8 26 32 -58 -212 -306 -89 125 -45
1735 -45 43 146 -166 -80 -209 15 70 190 -77 21 -224 -27 242 30 3 45 -25 110 8 147 92 102 -52
1758 -52 -118 188 -45 184 365 -145 253 116 391 145 177 77 149 69 -154 -160 -27 9 239 -44 -59 109 387
1781 387 195 -181 232 -275 -105 272 -241 -36 -47 -31 148 -232 -49 37 99 35 31 -24 119 213 279 -62 -49 -145
1805 -145 93 123 -70 -79 -143 159 -111 -2 -239 259 285 337 -96 -127 -67 -69 -37 67 97 -5 -38 -73 85 -147 24
1830 24 127 -151 -150 188 42 64 190 126 -113 -100 34 -245 77 -33 -18 47 21 -119 -199 -24 116 144 -82 -155
$$ packed form
1663E7k12Q0M9m9J46L6M5k47JL08J75l67m1J61k38R8M8j88J34R3P2K33l87Q3K0
1688A10n7J40n20K01L56j87r7J62Q8j70O0j07k67L38j3L26l93K1j79J10J14Q3
1710A19j83ML44k37JJ84j26j20l02L38n2k09J6J37L6L5K3J8Or0j54r4K17K14j70
1735d5Q8J03l12Q6j29K24N5J20k67R8k45J97K69k12k7M2p0J35j02J39n5J0j54
1758e2o6L06k33K29J81n10L98j37K75k46L2j00P2q0k23oJ33L6K30k83j5J68K78
1781C87j92l76M13n07J70L77n13K05j1J6J79l80J83Q6O2o4mn5J43R4O6l41J3r6
1805a45K38L0j93ro4L02k70J09k37M98K6N2m33l1O0kL2J04L0j02l3l5J58k32J71
1830B4J03k78JL38j46K2J26o4k39J3J34k79L22j10J5O5k6j40q0J75J40K8k26p3
$$ plain form
1854 -155 -43 56 -39 4 241 35 -78 -47 135 -74 70 62 107 -95 -115 213 -18 233 -75 204 59 264 -191
1877 -191 -223 89 -169 6 -112 -200 20 51 -124 -159 21 -158 -91 -14 -98 -126 143 -66 -60 -24 48 154 -35 -175
1901 -175 55 -71 32 -47 -83 179 5 -75 25 124 -187 83 61 -22 -22 -58 -101 209 -79 50 256 -10 -56 -121
1925 -121 -86 -43 190 35 -51 -50 -33 2 -109 -31 -163 40 -66 -269 -281 20 -20 -137 216 16 -194 13 125
1948 125 22 -77 171 52 218 22 142 -157 76 -42 71 -287 201 -27 216 43 87 -65 17 19 73 -52
1970 -52 142 48 -45 172 20 -298 -315 2 -81 -105 -206 -188 27 -56 -15 -22 -88 -225 173 -97 11 23 -38 -10 -51
1995 -51 -51 -34 216 91 -117 -137 -248 120 -180 39 128 -59 -217 -114 87 -78 277 -32 299 -104 49 -198
2017 -198 188 149 43 112 19 -44 -330 251 -90 180 -141 227 118 -34 -84 15 -243 95 157 30 70 144 42
$$ packed form
1854a55J12R9r5M3K37k06j13L1J82k09J44qM5k02k0L28k31K51l08K79j45K05m55
1877a91l2L12k58J75j18q8K20L1j75l5J80j79O7P7q4k8K69k09OL6P2J06j89j40
1901a75K30j26J03p9l6K62j74q0J00R9l11K70k2q3%l6m3L10k88J29K06k66m6o5
1925a21L5M3K33j55q6JJ7L5j11P8j32K03j06k03j2L01m0j17L53k00k10K07J12
1948A25j03r9K48j19J66j96J20k99K33j18J13l58M88k28K43j73M4j52Q2KN4j25
1970e2J94r4r3K17j52l18j7L17q3k4j01J8K15q3M1po6j37L98k70J08J2o1K8m1
1995e1%J7K50j25k08k0j11L68l00K19Q9j87j58J03K01j65L55l09L31m03J53k47
2017a98L86l9j06O9r3o3k86N81l41K70l21L68j09j52n0R9k58L38O2j27M0P4j02
$$ plain form
2040 42 -262 -58 22 118 213 -4 203 -164 271 303 38 -76 99 22 -62 -135 -104 -139 -224 4 46 180 -258 -139
2064 -139 -76 -105 96 -76 -170 -153 102 -123 62 53 -57 -17 49 -11 -71 45 85 -41 76 13 79 -138 -147 53 21
2089 21 -186 -162 -97 -291 97 47 46 40 -104 9 41 -142 -63 -274 261 35 -29 2 130 213 -208 69 53 -68 226
2114 226 -68 -203 89 214 -312 215 -45 -233 99 -84 -67 -240 -98 286 93 -46 -59 -86 3 194 104 77
2136 77 170 -36 -25 -94 -179 -92 -180 121 -126 -103 68 -180 -11 42 310 182 21 119 75 115 -169 235 79 62
2160 62 -76 -254 -271 260 325 63 -7 52 -147 152 -233 -61 -44 30 47 242 -137 -61 6 -117 176 -189 -244 73
2184 73 -292 41 -247 40 139 3 -330 -101 357 -93 39 -94 260 104 -67 88 -86 -72 -94 -33 126 333
2206 333 220 21 -21 -2 -176 -199 -27 53 -92 -41 -33 203 170 -221 -81 -82 -106 121 118 -170 39 -29 -71 -10 46 -102
$$ packed form
2040D2l04K04Q0R6R5k17K07l67M35L2k65j14J75p7q4p3L1l5q5K28M2J34m38J19
2064a39O3k9K01j72r4J7K55k25J85rj10M0O6o0o0J16M0j26J17o3O6k17rK00l2
2089B1k07K4O5j94L88n0joj44J13L2j83P9k11N35k26o4L1J28Q3m21K77j6j21K94
2114B26k94j35K92J25n26N27k60j88L32j83J7j73J42L84j93j39j3k7Q9J91r0k7
2136G7R3k06J1o9q5Q7q8L01k47K3J71k48J69N3K68j28j61R8m4M0k84M04j56j7
2160F2j38j78j7N31O5k62p0N9j99K99l85J72J7P4J7J95l79P6O7j23K93l65n5L17
2184G3l65L33k88K87R9j36l33K29M58m50J32j33L54j56j71J55j74J4k2O1J59K07
2206C33j13j99m2J9j74k3J72Q0j45N1QK36l3l91J40jk4K27lk88K09o8m2O1N6j48
$$ plain form
2232 -102 109 -62 73 116 -79 44 -57 -47 212 24 85 346 19 59 69 -109 -104 191 -83 -11 -41 -190 -74
2255 -74 99 67 -76 146 -401 -184 -196 -291 -73 -81 -132 -100 -28 -32 131 58 36 71 126 68 83 119 19 -96 -127 -18
2281 -18 -137 46 -116 -10 82 -26 -9 -55 -163 183 -261 -315 201 -29 -297 -99 7 -47 134 -115 161 -219
2303 -219 130 178 -114 225 181 143 38 145 106 1 132 -85 30 -55 63 136 -108 91 189 34 -133 -208 -193
2326 -193 233 164 68 17 -132 -60 -143 185 -147 81 -12 14 -280 -360 -35 -34 207 121 298 35 71 121 -4 86 -154
2351 -154 -38 80 -29 128 221 -135 98 121 -30 95 -78 -31 -137 59 87 297 -25 -20 -33 180 -52 -164
2373 -164 -245 -26 227 -276 123 -144 340 -338 67 -8 -167 -287 -121 -51 -197 -124 35 6 26 -109 79 35
2395 35 -107 108 4 -210 -152 65 80 126 103 7 338 0 202 97 89 103 -12 314 -48 204 20 -105 8
$$ packed form
2232a02K11j71J35M3j95J23j01J0K59j88O1K61l27M0J0j78NK95k74P2l0j49J16
2255g4J73l2j43K22n47K17j2r5K18qn1L2P2mJ63p3k2L5N5n8J5L6j00j15l1J09
2281a8j19J83j62J06R2j08J7m6j08L46m44n4N16k30k68J98J06n4J81k49K76l80
2303b19L49M8k92L39m4l8j05J07l9j05J31k17J15q5J18P3k44J99R8j55j67p5J5
2326a93M26o9r6n1j49P2q3L28l32K28r3K6k94q0L25JK41q6J77k63L6N0j25R0k40
2351a54J16J18j09J57R3l56K33K3j51J25j73M7j06J96K8K10l22Nj3K13k32j12
2373a64q1K19K53n03L99k67M84o78M05p5j59j20J66P0j46P3J59k9K0j35J88m4
2395C5j42K15j04k14N8K17J5M6k3r6L31l38K02j05qJ4j15L26l62K52j84j25J13
$$ plain form
2418 8 64 16 48 66 50 290 56 34 -85 65 -249 176 192 30 88 247 146 -56 154 3 162 256 91 265
2442 265 146 199 20 130 141 -121 139 -30 0 -234 308 -71 -157 -31 -97 -154 -27 35 -78 -88 68 -109 29
2465 29 -230 195 83 43 -178 127 8 153 54 -157 47 -91 -191 131 -2 -25 82 -71 -51 113 50 41 -162
2488 -162 80 96 -194 194 -22 -115 27 -159 73 -112 -133 147 106 19 65 21 75 -154 24 10 67 -170 -381
2511 -381 66 -225 281 166 -311 1 -109 -222 63 125 -115 142 210 -6 190 -72 7 -200 -230 117 -151
2532 -151 -18 68 145 26 -155 112 -123 17 213 168 -109 160 -128 43 224 -15 11 3 214 -1 -62 14 196
2555 196 -25 132 -195 106 146 -46 24 -119 219 -125 311 155 5 -95 -108 85 34 10 -253 -87 -334 -202
2577 -202 -46 180 -39 25 -290 -28 -46 228 257 -63 183 -251 -34 30 112 326 -73 5 -56 6 -29 15 145
$$ packed form
2418HN6m8L2J8j6K40k34k2j19J50l14M25J6j62N8J59j01k02K10j51J59R4j65J74
2442B65j19N3j79J10J1k62K60j69L0k34N42l79q6J26o6n7J27O2j13j0J56j77J38
2465B9k59M25j12m0k21L05j19J45r9k11K04j38j00L22j33k3J07j53K0J64o3rk03
2488a62K42J6k90L88k16r3J42j86K32j85k1K80m1q7M6m4N4k29J78j4N7k37k11
2511c81M47k91N06j15m77L12j10j13K85O2k40K57O8k16J96k62P9k07l0L47k68
2532a51J33Q6P7j19j81K67k35J40J96m5k77K69k88J71J81k39K6qK11k15o1P6J82
2555A96k21J57l27L01M0j92P0j43L38l44M36j56j50j00j3J93n1k4k63J66k47J32
2577b02J56K26k19O4l15K62j8K74K9l20K46m34K17O4Q2K14l99P8o1O2l5M4J30
$$ plain form
2600 145 -245 128 -117 8 7 -182 9 -102 144 185 -29 102 -78 -150 146 254 72 47 -43 57 31 17 291
2623 291 19 10 -56 -41 -184 187 -137 -145 -123 88 -228 -55 -9 -19 -30 156 112 -43 -302 -37 -45 -21 -229 -159 -173
2648 -173 214 -223 -122 -171 -118 231 -114 -321 0 120 87 158 -11 123 -74 260 38 81 15 26 267 156
2670 156 -73 -10 -27 156 -296 154 29 -151 387 -197 159 49 -147 -29 60 2 97 -27 120 17 -117 164
2692 164 -93 -56 31 185 -111 25 -148 -43 -86 168 82 -33 70 159 99 154 -247 -35 -131 -34 161 123 46 -58
2716 -58 -15 17 171 25 -19 -69 -34 2 -75 -1 99 124 -43 -224 319 118 -112 45 -16 -20 -25 -69 99 4 84 184
2742 184 -196 -46 50 29 -42 -131 -30 306 29 202 140 -155 -8 111 -166 286 140 38 351 -39 53 -112
2764 -112 -50 26 -157 -41 -67 -188 -65 31 254 225 37 -103 153 130 -78 213 -33 30 58 -49 44 109 41 46
$$ packed form
2600A45l90L73k45J25jj89J91j11K46M1k14J31j80p2K96J08j82k5r0J00k6j4K74
2623B91k72ro6J5j43L71l24qK2K11l16J73M6j0j1J86m4j55k59K65qK4k08P0j4
2648a73L87m37J01m9N3L49l45k07L21J20l3P1j69J34j97L34k22M3o6J1K41j11
2670A56k29O3j7J83m52M50j25j80N38n84L56j10j96J18Q9n8R5j24J47j03j34K81
2692A64k57L7Q7J54k96J36j73J05m3K54q6j15J03Q9o0N5m01K12r6R7J95l8p7j04
2716e8M3L2J54j46m4n0L5L6p7P4J00K5j67j81N43k01k30J57o1mnm4J68r5Q0J00
2742A84l80J50R6k1p1q9J01L36k77J73o2k95J47J19k77M52j46j02L13l90R2j65
2764a12O2P6j83J16k6j21J23R6K23k9j88j40K56k3k08K91k46O3K8j07R3O5o8N
$$ plain form
2788 46 -309 -10 -44 -145 -83 226 -35 -67 7 -206 -123 -12 -78 -302 0 -100 6 -312 5 141 -7 254
2810 254 -52 -132 173 171 -92 -117 -82 -49 53 157 196 113 404 -2 -209 44 164 198 -52 131 109 -209 26
2833 26 32 -64 -66 -142 246 -22 39 187 230 23 -122 -228 28 117 -15 237 -171 5 -136 49 132 62 62 -32 -106
2858 -106 239 168 -295 -77 -50 -42 -126 174 54 -63 -59 -274 31 33 -25 -3 108 -33 -137 112 -260 100 34 -93
2882 -93 -7 -2 185 10 156 186 59 -65 -65 -131 -185 200 -6 79 -223 -12 125 -262 -67 -51 -35 146 111 -102
2906 -102 135 28 70 -200 -322 -15 33 0 -69 -78 94 -200 -212 -60 -117 -1 33 78 55 25 -203 122 -69 327
2930 327 -250 -285 136 52 -153 197 100 -3 175 -59 83 -82 54 -36 86 -36 215 -33 195 142 -137 -21
2952 -21 -153 130 -2 -233 31 -50 -117 -11 152 -11 -161 -160 -65 61 -20 -267 186 -82 -42 14 224 -29 -303
$$ packed form
2788D6l55K99l4j01O2L09k61l2P4k13Q3J11o6k24L02j00J06l18L17J36j48K61
2810B54l06q0L05kk63k5L5L3J02J04L9q3K91m06k07K53J20L4k50J83k2l18K35
2833B6Or6kp6L88k68O1J48M3k07j45j06K56Q9j32K52m08J76j41J85Q3p0%r4p4
2858a06L45p1m63K18K7Qq4L00j20j17Mk15L05Kn8K2J11j41j04K49l72L60o6j27
2882i3Q6NJ87j75J46L0j27j24%o6n4L85k06Q5l02K11J37l87J95J6J6J81l5k13
2906a02K37j07M2k70j22L07M8l3o9rJ72k94j2J52n7J16L4M5k3l0k28L25j91L96
2930C27n77l5M21q4k05L50r7j03J78k34J42j65J36r0J22j22K51k48K28n3k79J16
2952b1j32K83j32k31K64q1o7J06J63j63j50JR5J26q1k47M53k68M0N6K10k53k74
$$ plain form
2975 -303 -8 78 19 -294 129 212 30 8 135 16 34 117 -20 -148 49 -258 107 91 151 -8 -218 -20 -63
2998 -63 16 209 150 218 -131 91 45 -13 13 -328 119 -265 -95 347 -277 -170 -218 24 -40 -53 242 375 -260
3021 -260 -114 92 245 198 -202 -16 -90 21 -83 31 -111 -170 -238 187 -41 235 141 101 27 367 -268 12
3043 12 -74 42 -145 -79 33 -23 142 -138 94 -17 5 18 -166 16 -27 252 -102 -104 161 128 -287 -432 48
3066 48 -92 -229 127 58 -52 152 -118 -108 -36 34 -230 241 -20 28 -116 40 11 -164 123 4 71 -65 55
3089 55 69 14 62 -167 -4 173 204 288 -109 116 -100 -124 -64 252 2 72 -260 69 -130 -164 -98 229 22 226
3113 226 -37 20 111 161 85 85 70 72 -61 -120 -11 23 -104 -306 18 62 -50 -257 144 -177 -29 -44 -77 -124 37
3138 37 65 -156 171 -60 44 74 39 124 97 36 66 247 64 239 -32 84 -144 81 -22 113 3 -2 75 33
$$ packed form
2975c03K95Q6n9l13M23Q3j82k2J27j19J8Q3j37j28J97l07L65j6O0j59k10J98m3
2998f3P9J93n9O8l49K22m6n8K6l41M47l84J70M42o24J07m8K42o4j3K95J33o35
3021b60J46K06J53m7m00J86p4J11j04J14j42n9o8M25k28K76r4m0p4L40o35K80
3043A2q6J16j87O6J12n6J65k80K32j11K2J3j84J82m3K79l54kK65l3m15j45M80
3066D8j40j37L56o9j10K04k70J0P2P0k64M71k61M8j44J56k9j75K87j19O7j36J20
3089E5J4n5M8k29J63J77L1Q4l97K25k16k4O0L16k50P0l32L29j99l4O6L27k07K04
3113B26k63N7R1N0p6%j5Kj33n9J09L4j27k02L24M4j12k07M01l21J48j5l3m7J61
3138C7K8k21L27k31J04L0l5Q5k7o1L0J81j83J75k71J16k28K25j03J35j10nP7m2
$$ plain form
3162 33 137 67 -58 35 191 10 -41 58 -76 143 -157 38 -44 -456 28 142 -181 56 -23 53 -43 -119 77
3185 77 -180 483 -107 142 19 182 -103 -73 106 27 89 137 -14 5 56 -78 68 -97 -34 152 -14 6 -63
3208 -63 -70 12 20 269 23 96 40 -57 62 -71 107 -92 87 -209 -199 22 245 106 -105 63 117 142 123 -37
3232 -37 102 39 -84 -101 158 32 -95 61 -23 -51 -75 13 13 -69 63 -27 -144 -214 -59 221 151 48 154 -307
3256 -307 58 -11 -2 252 -32 143 -190 -38 45 190 -89 85 -108 168 -67 37 -46 4 26 -102 147 82 -124
3279 -124 -120 -15 213 -158 -18 26 -120 66 -37 224 -256 215 -137 163 161 -56 -52 133 74 -201 147 -17 -144
3302 -144 109 -162 -201 92 3 54 221 142 -40 -186 -33 -212 -146 158 -72 -114 -274 -76 47 43 36 90 91 26 183
3327 183 -37 -157 96 -131 113 210 120 -193 111 -105 -144 -41 29 -52 -29 -227 75 19 115 3 -203 -185 497
$$ packed form
3162C3J04p0j25R3J56j81n1R9j34K19l00J95q2m12M84J14l23K37p9P6r6p6J96
3185G7k57O63n90K49j23J63k85L0J79p9O2M8j51J9N1j34J46j65O3J86j66K0o9
3208f3pQ2QK49k46P3n6r7J19j33J78j99J79k96J0K21K23j39k11J68N4K5j9j60
3232c7J39o3j23j7K59j26j27J56q4k8k4Q8%q2J32r0j17p0J55K80p0j03J06m61
3256c07L65o9RK54k84J75l33J52Q3J45k79J74j93K76k35J04q3N0K2j28K49o5k06
3279a24MJ05K28l71J40M4j46J86j03K61m80M71l52L00kk17MJ85n9k75L48j64j27
3302a44K53k71l9K93q9N1J67p9j82j46J53j79O6L04k30m2j60J98J23mpN4Jo5J57
3327A83k20j20K53k27K44R7r0l13L04k16l9J03P0q1K3j98L02n6R6j12k06J8O82
$$ plain form
3350 497 51 -100 166 -112 19 101 184 65 -4 -80 138 142 54 -140 -74 -81 95 23 27 -97 54 152 -108 -167 14
3375 14 95 -32 45 160 -28 219 126 -249 -124 -126 -179 -106 78 319 -15 138 205 -14 -384 -210 -82 -75 90 -17
3399 -17 -63 52 81 83 -51 -5 -283 56 47 134 -42 -51 -2 24 253 37 138 129 54 114 -218 194 41 -232 -38 -244
3425 -244 -32 -82 -16 205 -166 128 -46 -203 164 -48 -278 159 0 99 114 -24 -81 -237 -102 -95 -154 39 26
3448 26 4 -41 18 -117 80 -240 -273 -102 -72 19 -56 51 87 -69 15 -60 -135 -49 11 -155 120 65 65 -83 -158 -115
3474 -115 -12 31 -315 -234 -242 -49 147 50 57 53 -134 196 95 1 173 -48 -186 10 127 17 78 -123 120 277
3498 277 -55 -46 95 -209 -39 -138 -118 -42 -147 223 -100 208 -60 -188 -140 440 -301 -59 40 6 162 -17 11
3521 11 13 246 101 32 -156 98 99 10 194 -112 153 -43 127 37 -204 37 -137 94 121 -39 -94 126 -200
$$ packed form
3350D97m46j51K66k78J31Q2Q3j19o9p6K18Mq8j94O6pJ76p2Mj24J51R8k60n9J81
3375A4Q1j27P7J15j88K47r3l75J25kn3P3J84K41l34J53O7k19l70J74J28PJ65j07
3399a7m6J15K9Kj34M6k78L39rQ7j76rM9K6K29k16J01rp5O0l32M12j53k73J94k06
3425b44K12n0O6K21l71K94j74j57L67k12k30M37j59R9J5j38n7j56J35Pn9J93j3
3448B6k2m5N9j35J97l20l3J71L0R1p5J07L6j56Q4p5p5Q6O0j66K75n5%j48p5M3
3474a15J03M3l46Q1qJ93J96r7Pmj87L30j01r4J72k21j38J96J17j10O1k01K43J57
3498B77l32RJ41l04J70r9K0P6j05L70l23L08k68j28M8N80p41K42R9l4J56j79K8
3521A1KK33j45o9j88K54Jq9J84l06K65j96J70r0k41K41j74K31K7j60n5K20l26
$$ plain form
3544 -200 -109 271 -213 -76 129 62 130 262 96 55 63 -166 40 -67 -11 -135 51 -201 -10 9 -124 -45 -17
3567 -17 -223 -129 3 -134 -117 -125 110 -59 -49 218 -207 -39 172 225 -207 -99 -67 -138 57 13 -196 -90 107
3590 107 -10 -89 278 109 -41 9 -41 -103 111 111 104 -192 -53 159 155 168 -70 13 70 -49 -203 52 270 -325
3614 -325 -71 71 179 276 74 -94 -229 -72 -355 -56 132 39 360 184 80 -78 -271 140 15 161 76
3635 76 24 219 -100 84 -96 394 238 41 137 20 252 15 309 305 -16 123 220 -217 -264 -50 0 -68 -17
3658 -17 -27 -159 -100 77 50 104 -198 36 259 12 -3 116 -138 -87 -40 -40 -105 -296 -55 223 222 -191 -23 -135
3682 -135 -25 253 266 -216 87 -129 92 -47 -267 -45 -4 -23 -1 -325 -181 203 46 -255 -108 -129 179 0
3704 0 -68 -264 -245 -23 -334 40 386 42 101 -221 -43 -33 -61 -44 -34 -62 85 124 -31 -84 366 67 15 59 16
$$ packed form
3544b00R1L80m84J37K05o7O8J32j66m1Qk29K06j07N6j24J86k52J91J9j33P9K8
3567a7k06R4J32j37J7qK35j69J0K67m25J68K11N3m32J08L2p1J95m4k09J06J97
3590A07j17p9L67j69j50N0n0o2K14%pk96J39K12mJ3k38Q3N7j19j54K55K18n95
3614c25K54J42J08R7k02j68j35J57k83K99J88r3L21j76j04j58j93M11j25J46q5
3635G6n2J95l19J84j80M90j56j97R6j17K32k37K94ml21J39R7m37m7K14N0o8N1
3658a7j0j32N9J77k7N4l02K34K23k47j5J19k54N1M7%o5j91K41K78jm13J68j12
3682a35J10K78J3m82L03k16K21j39k20K22M1j9K2l24J44L84j57l01J47k1L08j79
3704@o8j96J9K22l11L74L46l44N9l22J78J0k8J7J0k8J47L9j55n3M50k99n2M4m3
$$ plain form
3729 16 196 -126 -280 -273 -135 190 157 -149 273 64 -51 177 -75 -36 59 -44 28 -4 86 98 65 4 -74 -65 76
3754 76 -148 -52 52 -81 -39 -44 66 119 54 170 154 76 78 -52 -1 -320 -221 -5 -107 -179 -96 27 -20 19 196 95
3780 95 30 -263 -11 -155 42 -43 116 -15 77 -21 21 -73 -246 112 -59 73 -5 -92 10 -200 -149 17 -322
3803 -322 21 195 -201 96 216 235 186 109 205 -61 -135 26 79 -201 -12 -220 -256 -106 154 308 -106 -158 -72
3826 -72 41 -117 -182 -174 81 138 57 75 162 74 17 -167 -185 159 129 -69 15 -92 -9 181 -49 207 -15 227 -16
3851 -16 97 51 -40 43 11 6 46 42 -138 100 16 100 147 -4 14 -37 -2 53 221 51 -13 85 160 -31 84 313 -136
3878 -136 89 156 39 -183 -141 -85 102 360 45 -115 32 -277 -21 100 -142 -252 -13 56 115 19 90 -70
3900 -70 235 18 42 -49 -118 303 -13 34 3 -57 -160 295 36 -138 173 126 -95 189 -193 -99 64 113 -213
$$ packed form
3729A6J80l22j54PJ38L25l3l06M22k09j15K28k52L9R5j03P2l2R0J2l3o1p8RJ41
3754G6k24R6J04j33M2nJ10N3o5J16j6p8Kj30N1l19R9K16j02p2Q3J23m7L9J77j01
3780I5o5k93K52j44J97q5J59j31R2r8M2r4j73L58j71J32p8q7J02k10N1J66l39
3803c22L43J74l96K97J20J9m9p7R6k66p4J61N3k80J89k08l6J50K60J54m14n2Q6
3826g2J13j58o5QK55N7q1J8Q7q8n7j84j8L44l0j98Q4j07Q3J90k30K56k22K42k43
3851a6J13m6r1Q3l2nM0mj80K38q4Q4M7j51J8n1L5N5J68j70o4R8P5j91J15K29m49
3878a36K25O7j17k22M2N6J87K58l15j60J47l09K56J21k42j10K39O9N9r6P1j60
3900g0L05k17K4r1o9M21l16M7l1o0j03M55k59j74L11m7k21K84l82R4J63M9l26
$$ plain form
3923 -213 61 67 367 -122 45 63 -20 -166 139 -156 -363 5 0 -210 -63 -110 -38 149 -138 -11 -45 -10 44 297
3947 297 -118 -115 -15 -24 -105 65 122 203 159 -145 60 402 -84 110 -135 8 107 -172 242 98 -48 16 -109
3970 -109 118 265 161 46 312 -126 143 121 -161 -52 1 142 144 -92 41 92 109 86 220 -196 43 -25 6
3993 6 108 -94 186 -272 170 102 -193 105 -176 -45 5 103 -70 134 274 67 -122 -56 -182 -3 -116 -47
4015 -47 -141 -14 61 -18 108 217 -129 132 128 57 -49 45 -174 66 -63 -71 127 56 147 1 -32 199 -190 222
4039 222 -54 92 162 28 -36 -112 -83 -28 291 -84 244 160 -123 276 258 -91 -120 -172 106 -233 -186 145 61 64
4063 64 -99 232 -49 -32 -60 -139 83 -100 52 36 17 223 10 -129 203 -61 -15 9 93 180 39 -93 -221
4086 -221 262 1 143 7 124 -231 -133 -111 227 -153 106 146 -219 278 -207 -208 142 -108 229 44 16 257
$$ packed form
3923b13K74OL00m89J67J8q3j46L05k95k07L68nk10J47m7P2J87k87J27l4L5N4K53
3947B97m15LJ00rq1J70N7Q1m4l04K05L42m86J94k45J43R9k79M14j44j46O4j25
3970a09K27J47j04j15K66m38K69k2k82J09N3J41Kk36J33N1J7k3J34m16K39o8L1
3993FJ02k02K80m58M42o8k95K98k81J31N0R8j73K04J40k07j89O6j26J79j13O9
4015d7r4J27P5p9J26J09l46K61mp1j06R4k19K40j29qJ98p1R1j46l3K31l89M12
4039B22k76J46P0j34o4p6K9N5L19l75L28q4k83L99j8l49k9n2K78l39M7L31q4L
4063F4j63L31k81J7k8p9K22j83J52j6j9K06k13j39L32k64M6K4Q4Q7j41j32j28
4086b21M83k61J42j36J17l55R8K2L38l80K59M0l65M97m85jL50k50L37j85k8K41
$$ plain form
4108 257 155 -302 175 58 24 -16 10 194 -6 219 -240 -52 100 -23 -30 89 -115 66 47 225 -196 28
4130 28 222 -163 49 -132 -210 158 117 -40 -158 131 -34 -240 149 -135 11 -250 84 -21 -134 -112 5
4151 5 -9 -64 -8 85 -339 113 13 159 -226 -63 247 95 58 -130 26 -268 7 94 -27 -48 -149 236 25
4174 25 121 134 -162 -20 95 31 101 -155 122 58 -266 -19 38 -272 -96 185 65 24 -22 256 -200 -116 -111 -118 16
4199 16 -180 -86 250 -28 -12 -52 217 -45 34 -37 -85 -36 207 195 -57 207 -141 39 69 -77 50 -148 82
4222 82 113 -45 145 124 92 -149 13 110 -188 -41 -82 -129 -71 -120 98 -93 267 -123 -14 1 -15 107 137 -272
4246 -272 -206 -234 -147 49 115 -242 13 -265 -58 -115 65 -32 -273 -92 -101 -67 96 116 310 -200 124 50 -14 137
4270 137 -9 250 217 -41 -120 -160 -117 -58 -35 -285 -111 -12 87 -142 -217 -176 27 -234 -91 43 -59 53 -184
$$ packed form
4108B57j02m57M77j17l4m0K6J84k00K25m59J88J52j23pJ19k04J81j9J78m21K24
4130B8J94l85K12j81p8L68m1j57j18K89j65k06L89k84J46k61L34j05j13K2J17
4151Ej4n5N6R3m24M52j00J46l85J63L10j52l7j88J56k94K75Q7j21k1j01L85k11
4174B5R6J3k96J42J15o4P0k56K77o4l24K47N7l10J76K81j20m1m6K78m56Q4NpJ34
4199A6j96R4L36k78J6m0K69k62P9p1m8M9K43j2k52K64l48J80L0j46J27j98K30
4222H2L1j58J90k1l2k41J62R7k98J47m1m7N8m9K18j91L60l90J09J5j6J22L0m09
4246b72O6k8Q7J96O6l57K55k78K07n7J80r7k41J81rL4J63K0J94n10L24p4o4J51
4270A37j46K59l3k58p9m0M3N9K3k50J74R9R9k29p5M1K03k61J43J34j02J12k37
$$ plain form
4293 -184 -179 -446 -156 62 90 3 -242 -75 -28 235 -42 -134 -190 -1 35 -103 70 -20 211 -197 173 65 -20
4316 -20 301 -18 50 -12 -169 191 6 -217 19 -230 -64 255 117 195 232 -195 54 10 -236 39 40 -81 -43
4339 -43 126 -110 -131 85 -46 32 -143 25 -7 12 8 56 -10 36 -94 175 59 -241 -2 -166 128 128 41 -330
4363 -330 311 34 53 60 -283 -171 302 -326 -50 20 51 -20 -66 -27 -33 -202 115 39 84 -99 146 -203 -8 -61
4387 -61 -92 102 -93 141 70 10 -9 -35 78 -53 -32 168 72 71 116 -138 -188 -38 201 61 -102 65 -41 19
4411 19 -126 -7 -128 5 53 -33 -132 -48 -181 154 -67 86 -72 -94 117 129 -102 121 133 -13 362 97 -341
$$ packed form
4293a84Nk67K90K18K8q7k45J67M7K63k77r2n6J89L6j38J73r0K31m08L70j08q5
4316b0L21l19O8o2j57L60j85k23K36k49J66L19j38P8L7m27K49m4k46K75Jj21L8
4339d3J69k36k1K16j31P8j75J68l2J9mM8o6M6j30K69j16l00K39j64K94%q7l71
4363c30O41k77J9Pl43J12M73o28K76P0L1p1m6L9oj69L17p6M5j83K45l49J95n3
4387f1l1J94j95K34p1o0j9k6J13j31K1K00r6jM5k54n0J50K39j40j63J67j06O0
4411A9j45J19j21J33M8q6r9Q4j33L35k21J53j58k2K11J2k31K23J2j46L75k65m38
$$ [...]
8191B03
##END NTUPLES=NMR FID
##END=
