##TITLE=1H_91-2025
 200.13MHz, CDCl3,
 8 sc
 
 8.8.2025
##JCAMPDX= 6.0         $$ Bruker NMR JCAMP-DX V2.0
##DATA TYPE= NMR FID
##DATA CLASS= NTUPLES
##ORIGIN= UXNMR, Bruker Analytische Messtechnik GmbH
##OWNER= pz
$$ XWIN-NMR		Version 3.5
$$ Fri Aug  8 14:08:18 2025 Russian Standard Time (UT+4h)  she@DPX200
##.OBSERVE FREQUENCY= 200.1313
##.OBSERVE NUCLEUS= ^1H
##.DELAY= (6, 6)
##.ACQUISITION MODE= SIMULTANEOUS
##.ACQUISITION SCHEME= undefined
##.AVERAGES= 8
##.DIGITISER RES= 18
##SPECTROMETER/DATA SYSTEM= spect
##.PULSE SEQUENCE= zg30
##.SOLVENT NAME= CDCl3
##.SHIFT REFERENCE= (INTERNAL, CDCl3, 0, 14.3821)
##AUDIT TRAIL= $$ (NUMBER, WHEN, WHO, WHERE, WHAT)
$$ ##TITLE= Audit trail, XWIN-NMR		Version 3.5
$$ ##JCAMPDX= 5.01
$$ ##ORIGIN= Bruker BioSpin GmbH
$$ ##OWNER= she
$$ F:/spectra/data/she/nmr/H-C/1/audita.txt
$$ ##AUDIT TRAIL=  $$ (NUMBER, WHEN, WHO, WHERE, WHAT)
(   1,<2025-08-08 14:06:59.84 +0400>,<she>,<DPX200>,
      <created by zg, POWCHK disabled, PULCHK disabled
       configuration hash MD5:
       00 E9 B6 7A A2 85 ED C7 34 08 36 98 17 FE 4E 26
       data hash MD5: 16K
       31 82 6C E0 A8 8B 99 51 7D D6 76 8C 9E E9 35 78>)
$$ ##END=
$$ 
$$ hash MD5
$$ 1A 8F A7 0D 37 FB 41 F4 5C 88 4F AD 1D EB D1 AD
##$RELAX= 
##$RELAX= 
##$RELAX= 
##$RELAX= 
##$RELAX= 
##$RELAX= 
$$ Bruker specific parameters
$$ --------------------------
##$DU= <F:/spectra>
##$EXPNO= 1
##$NAME= <H-C>
##$PROCNO= 1
##$TYPE= <nmr>
##$USER= <she>
##$AMP= (0..31)
100 100 100 100 100 100 100 100 100 100 100 100 100 100 100 100 100 100 
100 100 100 100 100 100 100 100 100 100 100 100 100 100 
##$AQSEQ= 0
##$AQ_mod= 1
##$AUNM= <au_zg>
##$AUTOPOS= <>
##$BF1= 200.13
##$BF2= 200.13
##$BF3= 200.13
##$BF4= 200.13
##$BF5= 200.13
##$BF6= 200.13
##$BF7= 200.13
##$BF8= 200.13
##$BYTORDA= 1
##$CFDGTYP= 0
##$CFRGTYP= 5
##$CHEMSTR= <none>
##$CNST= (0..31)
1 1 145 1 1 1 1 1 1 1 1 1 1 1 1 1 1 1 1 1 1 1 1 1 1 1 1 1 1 1 1 1 
##$CPDPRG= <>
##$CPDPRG1= <>
##$CPDPRG2= <>
##$CPDPRG3= <>
##$CPDPRG4= <mlev>
##$CPDPRG5= <mlev>
##$CPDPRG6= <mlev>
##$CPDPRG7= <mlev>
##$CPDPRG8= <mlev>
##$CPDPRGB= <>
##$CPDPRGT= <>
##$D= (0..31)
0 0.7 0 0 0 0 0 0 0 0 0 0.03 0 0 0 0 0 0 0 0 0 0 0 0 0 0 0 0 0 0 0 0 
##$DATE= 1754647619
##$DBL= (0..7)
120 120 120 120 120 120 120 120 
##$DBP= (0..7)
150 150 150 150 150 150 150 150 
##$DBP07= 0
##$DBPNAM0= <>
##$DBPNAM1= <>
##$DBPNAM2= <>
##$DBPNAM3= <>
##$DBPNAM4= <>
##$DBPNAM5= <>
##$DBPNAM6= <>
##$DBPNAM7= <>
##$DBPOAL= (0..7)
0.5 0.5 0.5 0.5 0.5 0.5 0.5 0.5 
##$DBPOFFS= (0..7)
0 0 0 0 0 0 0 0 
##$DE= 6
##$DECBNUC= <off>
##$DECIM= 32
##$DECNUC= <off>
##$DECSTAT= 4
##$DIGMOD= 1
##$DIGTYP= 9
##$DL= (0..7)
0 120 120 120 120 120 120 120 
##$DP= (0..7)
150 150 150 150 150 150 150 150 
##$DP07= 0
##$DPNAME0= <>
##$DPNAME1= <>
##$DPNAME2= <>
##$DPNAME3= <>
##$DPNAME4= <>
##$DPNAME5= <>
##$DPNAME6= <>
##$DPNAME7= <>
##$DPOAL= (0..7)
0.5 0.5 0.5 0.5 0.5 0.5 0.5 0.5 
##$DPOFFS= (0..7)
0 0 0 0 0 0 0 0 
##$DQDMODE= 0
##$DR= 18
##$DS= 0
##$DSLIST= <SSSSSSSSSSSSSSS>
$$ [...]
##$SUBNAM0= <"">
##$SUBNAM1= <"">
##$SUBNAM2= <"">
##$SUBNAM3= <"">
##$SUBNAM4= <"">
##$SUBNAM5= <"">
##$SUBNAM6= <"">
##$SUBNAM7= <"">
##$SUBNAM8= <"">
##$SUBNAM9= <"">
##$SW= 18.0517328524113
##$SWIBOX= (0..15)
0 0 2 0 0 0 0 0 0 0 0 0 0 0 0 0 
##$SW_h= 3612.71676300578
##$TD= 16384
##$TD0= 1
##$TE= 0
##$TE2= 300
##$TE3= 300
##$TEG= 300
##$TL= (0..7)
0 120 120 120 120 120 120 120 
##$TP= (0..7)
150 150 150 150 150 150 150 150 
##$TP07= 0
##$TPNAME0= <>
##$TPNAME1= <>
##$TPNAME2= <>
##$TPNAME3= <>
##$TPNAME4= <>
##$TPNAME5= <>
##$TPNAME6= <>
##$TPNAME7= <>
##$TPOAL= (0..7)
0.5 0.5 0.5 0.5 0.5 0.5 0.5 0.5 
##$TPOFFS= (0..7)
0 0 0 0 0 0 0 0 
##$TUNHIN= 0
##$TUNHOUT= 0
##$TUNXOUT= 0
##$USERA1= <user>
##$USERA2= <user>
##$USERA3= <user>
##$USERA4= <user>
##$USERA5= <user>
##$V9= 5
##$VALIST= <valist>
##$VCLIST= <CCCCCCCCCCCCCCC>
##$VD= 0
##$VDLIST= <DDDDDDDDDDDDDDD>
##$VPLIST= <PPPPPPPPPPPPPPP>
##$VTLIST= <TTTTTTTTTTTTTTT>
##$WBST= 1024
##$WBSW= 4
##$XGAIN= (0..3)
0 0 0 0 
##$XL= 0
##$YL= 0
##$YMAX_a= 213814
##$YMIN_a= -358971
##$ZGOPTNS= <>
##$ZL1= 120
##$ZL2= 120
##$ZL3= 120
##$ZL4= 120
##$ABSF1= 10
##$ABSF2= 0
##$ABSG= 5
##$ABSL= 3
##$ALPHA= 0
##$AQORDER= 0
##$ASSFAC= 0
##$ASSFACI= 0
##$ASSFACX= 0
##$ASSWID= 0
##$AUNMP= <proc_1d>
##$AZFE= 0.1
##$AZFW= 0.1
##$BCFW= 1
##$BC_mod= 2
##$BYTORDP= 1
##$COROFFS= 0
##$CY= -3
##$DATMOD= 1
##$DC= 2
##$DFILT= <>
##$DTYPP= 0
##$F1P= 0
##$F2P= 0
##$FCOR= 0.5
##$FTSIZE= 0
##$FT_mod= 4
##$GAMMA= 1
##$GB= 0.15
##$INTBC= 1
##$INTSCL= 1
##$ISEN= 128
##$LB= 0.25
##$LEV0= 0
##$LPBIN= 0
##$MAXI= 10000
##$MC2= 0
##$MEAN= 0
##$ME_mod= 0
##$MI= 1.114404
##$NCOEF= 0
##$NC_proc= 0
##$NLEV= 6
##$NOISF1= 3.799351
##$NOISF2= 2.8
##$NSP= 1
##$NTH_PI= 0
##$NZP= 0
##$OFFSET= 14.38212
##$PC= 1
##$PHC0= -1556.488
##$PHC1= 7.9923
##$PH_mod= 1
##$PKNL= yes
##$PPARMOD= 0
##$PSCAL= 0
##$PSIGN= 0
##$REVERSE= no
##$SF= 200.129724274929
##$SI= 16384
##$SIGF1= 3
##$SIGF2= 2
##$SINO= 400
##$SIOLD= 16384
##$SREGLST= <1H.CDCl3>
##$SSB= 0
##$STSI= 0
##$STSR= 0
##$SW_p= 3205.1282051282
##$SYMM= 0
##$S_DEV= 0
##$TDeff= 0
##$TDoff= 0
##$TI= <>
##$TILT= no
##$TM1= 0
##$TM2= 0
##$TOPLEV= 0
##$USERP1= <user>
##$USERP2= <user>
##$USERP3= <user>
##$USERP4= <user>
##$USERP5= <user>
##$WDW= 1
##$XDIM= 8192
##$YMAX_p= 0
##$YMIN_p= 0
$$ End of Bruker specific parameters
$$ ---------------------------------
##NTUPLES= NMR FID
##VAR_NAME=  TIME,          FID/REAL,        FID/IMAG
##SYMBOL=    X,             R,               I
##VAR_TYPE=  INDEPENDENT,   DEPENDENT,       DEPENDENT
##VAR_FORM=  AFFN,          ASDF,            ASDF
##VAR_DIM=   8192,          8192,            8192
##UNITS=     SECONDS,       ARBITRARY UNITS, ARBITRARY UNITS
##FACTOR=    0.0002768,     1,               1
##FIRST=     0,             0,               0
##LAST=      2.2672688,     0,               0
##MIN=       0,             -358971,         0
##MAX=       2.2672688,     213814,          0
$$ Real data points
##PAGE= N=1
##DATA TABLE= (X++(R..R)), XYDATA
$$ [...]
1994c19L96m72R38q85l81K263j708j218L134j346k111K786l73j298P32M7k27p53
2012g95P5K095k364m79L604k460j662L257r77j650J632J07k39r05M70J667k369
2029i93J95L326l056j263L634j823j770K264K09j027p8J042O41k359K57L108l199
2046h92o89L276k081j236K104l07o81J49P88O88k402M35K739l274J8L158k084
2063b91j225K257p81k30L80N09O45k009M16J734k862L29K777j982m60J755j142
2080a80J44K9J62J083j709Q4J526k239k3K289j594K40J048q73L42m20k85J032
2098F56j056j85J848k415j18J831j470P86R32q82Q18p37q31J684j298k62J934
2115A235j407l98J318j350O41K28j46J038j468n12J536j615j85K288j151o89J394
$$ y = [-319, 77, -395, 543, -342, -723, 1540, -168, -1386, 1748, 402, -1709, 1077, 704, -594, 138, 185, -42, -795, -720, 1375, -989, -1468, 2136, -324, -1986, 1271, 294, -1356, 276, 383, 144, -761, -291, 1376, -993, -798, 2528, -528, -1791, 1843, 20, -1750, 514, 723, -304, -382, 660, 1301, -1058, -801, 2307, -892, -1581, 1695, -386, -1622, 482, 175, -506, -357, 431, 1119, -1283, -848, 1891, -1383, -1365, 1793, -291, -1516, 741, -40, -270, 110, 619, 1264, -745, -329, 1405, -1457, -1128, 1649, -333, -793, 962, -180, -36, -7, 155, 1238, -471, -387, 1139, -1100, -1123, 1166, -428, -188, 860, -13, 329, -91, -376, 656, -400, -585, 1263, -1152, -1270, 561, -909, -123, 809, -73, 745, 8, -823, 861, -437, -699, 1235, -172, -570, 748, -602, 39, 267, 121, 1159, -309, -821, 715, -900, -1085, 1203, 52, -637, 757]
2132G57j113L85j16k62J621j256r38J776j597o05K382j288l18J075n82K54l94
2149b19QJ441j417m52J973k001p06K224j024j76J123m04j48n99j25J617j423l78
2167f86J958j982o10K310j319O6J006p03K23n92l44J558j412K54J941k036o11
2184i79J824j422J28J145o01M76r24l45J348j372O8K382j991l21J625j658J31
2201d86P53m48R08n49m41R06j405q0J991j529J8J518j764J41M80n08R62p57q4
2220c74J242j530j31J814j451J30J247j284K57L73q70J008o02k42J396j288m01
2237g06J729j669K94J045j173P89O7j076J471p26m17J560j281k32R28j362M64
2254b95P38j068Q60K28j187J432q36m73J342j156k32J158j057M99L56r97J364
$$ y = [757, -356, 29, -87, -349, 1272, 16, -922, 854, -743, -1348, 1034, -254, -572, 503, -79, 175, -219, -211, 1230, -187, -639, 1334, -667, -1373, 851, -173, -349, 774, 370, 222, -377, -502, 1115, -308, -686, 1272, -710, -1320, 990, -329, -263, 743, 40, 263, -329, -673, 885, -527, -273, 1668, -368, -979, 845, -577, -449, 696, 95, 571, -353, -698, 650, -722, -654, 1728, -263, -584, 1041, -617, -486, 267, -181, 727, 178, -263, 643, -762, -842, 1149, -380, -362, 1156, -608, -467, 13, -495, 467, -290, -374, 868, -662, -793, 1021, -430, -300, 947, -337, -80, 293, -577, 431, -171, -413, 983, -305, -706, 1023, -646, -352, 693, -480, 309, 376, -700, 771, 45, -372, 1188, -93, -325, 603, -759, -295, 443, -625, 235, 463, -724, 708, -128, -601, 741, -415, -647, 511, -546, -47, 309, -688, 676]
2271F76k76r47J486p66p56J538j276k24R96j046O98K84p93J213m74p71J545j115
2289hq59J886j542p1J078q91K05M70o93R10m54n05J417j517m62J581r56k57J060
2308C92r00L11P75q08J042r04l66J471j167m44J719j712J86J173r41M07N18p20
2326C2O83r23j09J039j493K07J307j573M53J315j362N35O21r51N86n04n31J168
2344E00j598O56R65j701J005J028j598P96N20r18N63m43j06N25q95R00N09j613
2362i05J003J275j906P29P86j475P79k86l40L12o33O54N31j395J272O65j920J171
2380C17O27j639O39L77q34M48m09O40Q2j049J205Mj442J584j46j388J151J01j022
2399g54P97l41M72P7p22J068o6j164J648o69j471J572k58r19J105k61j16K37l18
$$ y = [676, 400, -547, 939, 173, -583, 955, -321, -545, 451, -595, 103, 387, -406, 807, 333, -438, 1107, -8, -867, 1019, -523, -594, 484, -407, -202, 268, -425, 485, 31, -474, 943, -574, -1036, 545, -411, -668, 392, -508, -197, 578, -230, 812, -92, -458, 1013, -154, -598, 1121, -591, -405, 768, -173, 234, 752, 32, 715, -208, -317, 722, -771, -564, 743, -830, -377, 938, -424, 111, 732, -219, 367, -137, -668, 500, -1098, -442, 523, -1178, -173, 855, -743, 53, 573, -345, 218, -225, -331, 194, -701, 199, 708, -905, 98, 1373, -533, 196, 982, -493, 286, 0, -340, -28, -661, -7, 524, -871, 401, 1066, -854, 317, 944, -695, -56, 321, -513, -65, -474, 166, 248, -801, 404, 408, -1034, 550, 404, -984, 167, 268, -754, 43, -298, 174, 251, -471, 597, 531, -633, 1015, 346, -1125, 447, 189, -730, 375, 114, -2, 235, -83]
2418h3O75n11q07J757j221q04J881o51r51J347n68m73O65l58L29n66k27J496j253
2437c23o03J837j118p55J854r62k90P77o10J64m80K40R52j195O5J576j640j47
2455f58J730j448l29J195p61N1m7K17N20r90M87J129j771M28J255j594J44Q87
2473D45o49o6K77k6J54o07N24P97j647N82J122j844L32J429j299M94K48j71K41
2492C36o45M94L85j345Q14P86j913P93P10j143P42N70n62P6k92J49L47j024Q60
2511A38N51j473J001L17j269Q27L16n89N88m35k61N64r71P61K81r21Q62J15j193
2530g91J216j60o91Q31l55j82N95r04K10M04o18J061l14o61R41o48o72J011l74
2549a01l19Q38o06j55L95n99J115m80m83J316j059n83J256j001j55J541q73n1
$$ y = [-83, 592, 81, -726, 1031, -190, -994, 887, 236, -715, 632, 64, -409, 256, -102, 227, -339, -566, 930, -323, -926, 911, -207, -962, 892, -70, -360, 417, -193, -29, -509, -269, 683, -512, -447, 1129, -511, -658, 1072, -376, -705, 490, -271, -220, -267, -50, 470, -520, -33, 1096, -675, -247, 1008, -586, -442, 445, -204, -270, 7, -19, 135, -472, 52, 849, -798, -216, 906, -938, -606, 823, -476, 18, 266, 95, 336, -309, 185, 570, -775, 39, 825, -1088, -295, 415, -728, 14, 584, 22, 98, -194, -45, 302, -722, 138, 689, -784, 217, 534, -735, 92, 408, -181, 407, -28, -289, 275, -696, 65, 346, -575, 287, 402, -791, 425, 265, -426, 405, 50, -132, 463, -441, -231, 173, -445, 616, 302, -359, 582, -66, -738, 273, -101, -420, 418, -188, -343, 52, -547, 568, 88, -395, 921, -138, -721, 535, -466, -621, 920, 47, -4]
2567dJ81l93M13k49l15R31q64m40J116p29k66J187p19K12J83k98J57j2J9N04j117
2588e03J72Q49j124K2J234p89J51L39o50J43P1j99R17r22k59J203r98N2J053q53
2608i1K44L07o19K32o0j86Q27p54r6R05j378L00J014q09K23L75q08L13m23RP35
2629B60m35J58Q25j136O1O60q83N15N20o97K83l06l50O81m71L09P66j071L61L61
2649D11r33M22O00m83K12l67m04O64l83L0R23j049M71K02o54K33Pj77O65l87j43
2670a40O95q95K74N79o91M55J27q63N40Mm15O51j93m09R50q94r5Q03r60M64L51
2691C38n16K87k53j51P05o07p0Q16r03L43K06o53M99P8l51L91j51m38Q88n44O2
2712b4N88o82J22L78q50N66K19m38P20m69k71O66o39P2M32q23J65M53o17L65Q7
$$ y = [-4, 177, -216, 197, -52, -367, 564, -300, -740, 376, -353, -619, 568, -151, 61, 244, -54, 103, 91, 110, 614, -503, -331, 518, -606, -584, 650, -139, 12, 351, -299, -156, -85, -284, 633, -289, -548, 655, -343, -291, 762, -91, 153, 460, -159, 73, 13, -173, 654, -100, -196, 709, -669, -369, 645, -164, 59, 434, -374, -61, -484, -475, 260, -175, -17, 808, -328, -267, 393, -490, 25, 545, -152, 131, -175, -525, 156, -315, -6, 760, -311, 50, 411, -522, -100, 500, 17, 229, -138, -542, 122, -261, -231, 692, -357, 114, 316, -338, -105, -98, -275, 390, 3, -140, 555, -340, -66, 513, -178, 277, 404, -459, 81, 85, -330, 321, 128, -281, 669, -225, -320, 483, -477, -13, 338, -178, 109, -144, -295, 410, -197, -267, 549, -354, -11, 195, -458, 41, 119, -232, 159, 8, -430, 458, -86, -24, 564, -118, 4, 382, -468, 98, 317, -121, 599, 130, -141, 525, -114, -42, 390, -433, -268, 185, -432, -67, 20]
2733B0k95O93m87k93P59o96j2P27r31L26L12n36K61L98m05M86n9k66M46m38L0
2754D0L91r09M04N01n74L18p7k66N89l29l56O72o63L95L50j107N39N38j076N78
2774d2J56l40L28l29J5M46o30L42M50q28O23K17p07O64j68l76M18k62O5L62o67
2795b63L43K77q69Q31N1q29O94o9l48M99k05k67M25k12k8J14n33O72n3p51P29
2816B08Kn94P61k22m79O39m74l1L28l79P15n01j28P36m25o29R31l70l27N14n43
2837b68J93l3j31N29m38k06J017q95k31J138q55L3P03n81j15K99k70J73r9j15
2857a52O26r34J84P89p88l8O75l80k93N57m99K80j7j01L76m47Q2P80j362N40O20
2878D98q04M54J31n90L23j03j9J84j74K65L86j100M24P81j038L71K00o63N73q9
$$ y = [20, -275, 418, -69, -362, 397, -299, -311, 416, -515, -189, 123, -413, -152, 246, -159, 327, 268, 2, 448, 10, 40, 431, -478, -74, 427, -147, 171, 94, -172, 417, 88, -268, 404, -259, 136, 486, -621, -82, 456, -620, -42, 114, -226, 102, -227, -212, 234, -396, -54, 396, -432, 191, 408, -299, 365, 197, -179, 239, -23, 42, 404, -263, 80, 357, -512, 319, 370, -459, 235, 166, -182, 317, 112, -155, 270, 58, 30, 144, -389, 283, 230, -521, 208, 210, -384, 377, 155, -324, 315, -159, -190, 138, -241, 474, -27, -155, 581, 156, -473, 458, 88, -239, 275, -268, -75, -108, -239, 290, -148, -354, 663, -232, -463, 675, -180, -147, 556, -25, -140, 159, -111, 62, -37, -152, 474, -460, -276, 513, -275, -313, 362, -18, -311, 246, -253, 27, 10, -91, 285, -162, -80, 700, -662, -122, 498, -306, 148, 279, -311, 12, -91, -110, 74, -100, 165, 551, -549, -125, 656, -382, -11, 189, -474, 99, 10]
2898A0O4N8l56M16J89o23K25N00r90O16K76r03N18K59m62L32k01QL32o19O46M2
2920C37p81O80K73r98N75J90n41L17K0O9k0l76L51j31k64O20j62q52Q86K4m05
2941a88N69l55M1J10l03J35J33o15Q14l08o54R74jp51N60n5k16Q3j84O22k05l91
2963a85L36l24j49P80n01j55O67m05k94M64m27L04j99q3O56m12n63R07l86n24
2983d93Q50n08l47P52m99N11j74j96K99l91K42M83q78PP21o04mN68m96R3K24m88
3005c28O02k87P3N51q34k7N89o84K15M68n33J16M81m74K12j48j24K63n20M82K96
3026C89o10O6L10m05K58J50m33N66k59j46K77k63N8K63m06L38K63q90M50J93m84
3047c15J94J94l38L50k59N9K63j76J26L30q55M36K02m34K32L08l44L61k92j27
$$ y = [10, 74, 132, -224, 192, 381, -242, -17, 483, -507, 109, 385, -518, 0, 259, -203, 129, -72, -64, 268, -351, 295, 337, -444, 236, 509, -489, 86, 276, -265, 52, 72, 141, 121, -255, 96, -35, -299, 321, 159, -693, 193, 217, -188, 381, 26, 67, 177, -126, 9, 142, -473, 341, 33, -621, 353, 352, -399, 161, 106, -110, -27, -211, 411, 206, -185, 151, -173, -322, 458, -43, -198, 469, 64, -230, 234, -193, 111, -88, -171, 485, 73, -490, 417, 31, -493, 357, -151, -498, 254, -245, 266, 92, -104, 195, -196, 46, 529, -349, -342, 379, -225, -229, 339, -157, -64, 160, -328, 274, -13, 60, 611, -223, -250, 339, -345, -130, 338, -195, -79, 402, -72, 140, -8, -132, 131, -389, 93, 389, -221, -155, 155, -250, 8, 158, -275, 291, 32, -114, 163, -100, -42, 221, -185, 153, 416, -474, -24, 169, -315, -121, 73, -265, 85, -174, -115, 148, -28, 98, 428, -427, 9, 211, -223, 9, 317, -27, 334, 42, -85]
3067h5J77n04M03M52n99L26q3m04N26k17l6J62k32J63P1m56M16Pl98L46N7j68
3089g6M69n09j15M64l26n4L01k42L89j88n06O23p5m97N71k67k65M68m59O3J72
3110e9j42M04j92l03O13j48k49L96l09m4M69n73PP8k52N66k87p3K11k05O8K93
3132B69l58P7K54j92j69l5J47M6j3j44M64l79k3K52j34j00K48l11j20M73m54L55
3154A53j99k5L47k19k07L81l20j96M43m27M05J91n41M52l17l52Q00l25j88L83
3174B39l68K0K8j76M15j83r0M84m02l22N61n46L31K71l39n0L62m68K05K22l32
3195a38L87Q3o56J90J72l04P74p19J63o6J74p8kj45L88Ol51L79l69k83N98l19
3217a16L54j28N2p8P7m80L61J9k91L30o1l06N60m87J46M78n34L67k10j98M07k18
$$ y = [-85, 92, -412, -9, 443, -156, 170, 87, -317, 209, -8, -44, 118, -114, 49, 120, -336, 80, 87, -311, 35, 92, -76, 393, -116, -231, 233, -93, -147, 154, -88, 301, 113, -393, 230, 155, -342, 229, -38, -303, 165, -294, -231, -59, -201, 203, 11, -292, 321, 173, -76, 320, 11, -33, 436, -137, -130, -52, -304, 262, -25, -98, 113, -92, -24, 269, -89, -12, 242, 50, -119, -154, -7, 39, 26, -118, 346, -33, -56, 196, 62, -38, 210, -101, -221, 252, -202, 153, -46, -71, 276, 57, -150, 231, -89, -285, 158, -269, 136, 327, -214, 238, -79, -431, 369, 44, -144, 239, -129, -109, -81, -257, 158, -25, -115, 369, -33, -355, 206, -340, -9, 262, -77, -127, 235, -233, -28, 194, -138, 249, 332, -324, -134, 38, -266, 508, -211, -48, -114, 60, -18, -20, -165, 223, 229, -122, 257, -112, -395, 203, -116, 238, 110, 162, 84, 161, -319, 42, 61, -230, 100, 39, -267, 293, -194, -48, 430, -104, 263, 53, -145, 262, 44]
3239D4j23M05n20N0J83M5P1P4k45J72j34j24M54l00l17O05l12j90K67k24K45m9
3261G7k68L45j95l16N56l92j74N71l01k12N01m71L80m2q5M20m63j43K88o0l9K12
3283A89l27J98M5k10n3K67l21J23M49n61M28k81k04M98l11J83J11m12M01Nn27
3304c10J50K19m6N7k85J17K61m33K74K35l76J13L63n85J80K57j27K70k98j41J41
3325C6l31M60J48n65M53k43m17O06j97k6Q2j14n0K94k13K72o7l60M08l4n60O38
3347B20j85l97N38l1k26J61k51J70j7l17K86J31l12M65p3l59K88k40K39r3j01
3368a04L67m16J07K06j66o8L67k1m55J97j11OJ66j56L3K32m21N14k48n12O85q1
3390A21k58K75n7l38K80j5q9L10k38L9m1j5K64n29K32L60p05K37M17l78J19J50
$$ y = [44, -79, 326, -194, -144, 39, 84, 155, 229, -16, 156, 22, -102, 352, 52, -265, 340, 28, -162, 105, -119, 126, 77, -191, 154, -41, -357, 199, -193, -367, 204, -97, -309, 192, -279, 101, 59, -26, 394, -69, -212, 76, 16, -23, 189, -138, 60, 105, -105, -158, 109, -212, -89, 360, -201, 227, -54, -258, 240, -71, 112, 223, -189, 212, 217, -310, -160, 59, 13, 70, -215, -98, 163, -270, 4, 239, -137, -24, 339, -246, -66, 191, 64, 334, 36, -105, 36, -295, 165, 313, -252, 201, -42, -459, 147, -50, -76, 6, -108, -158, 136, -77, 195, 128, -232, 176, 142, -418, 220, 35, -362, 176, 145, -81, 80, -171, -1, -18, -335, -49, 82, -230, 235, 162, -197, 91, -149, 90, -3, -104, 263, -153, -46, 160, -6, -74, 293, 272, -183, 14, -97, -91, 75, -81, -48, 184, -237, 277, 29, -483, 202, 121, -137, 138, 81, -257, 23, 8, -81, 229, -9, 30, -11, -26, 238, -291, -59, 301, -404, -167, 250, -128, -9, 141]
3412A41j23j89J34j99P37o25q3M41l42J00N07n91J10J43j49O1m2j34M58n21J05
3433f1J79j53J6K32k85P3L5j21K50j82J33Q3j16l42M91l22J29K0k95K55J49m34
3455b66R6J94j58L85n25K57M20o40L55lk27K15M5m81M84l00J23K41k32j51K33
3476F5j55J88J58n81M58k68j81M74k8k18K34k56J25m5n7J43K7j49K85j95j86J87
3498B5o8j60M46k80M4N6j42K48N4m33K47k5m30M97j11k0K32l45J48J75k89J74
3520D3J0k52L47o2k09L58j92k71L28j81R9Q2M9k29Mp1L17l30j28N30k42q1K73
3543A92m07lR8j71O37l48j08K73q2j60J24Oj14K41l41n6J93j86K86P5k98K89j51
3566a1j33M45k07k03L43k95LO1R5j03j32M5L09k52l15M39j13r3J00j21J93j47
$$ y = [141, 18, -171, -37, -236, 501, -124, -207, 234, -108, -8, 499, -92, 18, 161, 12, 73, 31, -103, 355, -166, -61, 118, -35, -19, 213, -72, 1, 36, -85, 165, -17, 116, 199, 83, -259, 232, -90, 39, 59, -236, 19, 168, -266, -170, 24, -134, 251, -274, -17, 403, -237, 118, 115, -112, 103, 148, -333, 151, -149, -26, 215, -17, -168, 65, -90, 98, 256, -325, 133, -135, -316, 158, 130, -88, 146, -110, 15, -30, -87, 56, 83, -66, 219, 24, -162, 25, -43, -203, 243, -37, 7, 63, -79, 169, 223, -210, 37, 12, -418, 79, -32, -52, 180, -165, -17, 158, -131, 43, 53, -199, 148, 86, -123, 235, 43, -228, 100, -81, 18, 100, 149, -80, -76, -147, 170, -160, -288, 242, 0, -81, 192, -215, -218, -120, -291, 346, -2, -110, 163, 81, -79, 45, 51, -63, 178, -163, -219, -26, -212, 74, 149, -149, 140, -11, -144, 301, 94, -109, 234, -61, -58, 3, 98, -5, -137, -92, 217, -35, -350, 89, -24, -117, -17, -138, 55, -92]
3588i2p4K8K30j08k8J9m7L38n34K52J92j51Jq8Q4O5j65j82L36j93p1K21j08J4
3612f1K50k01J34k05k4K69k92J25J73p7m14N06l29J28J0r4M21m37K2K46j38l50
3634c38M57j71o4J16k02K17j79J72R9k33j73N19j62l51M12j59q6J32j01J07oo3
3656e7J75k15J77J83k42n0J05k52J50J16j67K74k67L12k91j4J26J89k54j47K15
3677F6j77o9K78j05J69l03J21K6QJ40J1j14n0J48j93L7L73m41J44%j42L23m59
3700b09P8N20l22j90K44k00j41L30k26qj24L47L8j03k09L28j49n1J63p4Q4o9j23
3723f6K49j79k21L75K0j96L39m66j15M00k96K00oK56k90J46k62K39j51j10K28
3744I4l2k14K62j01J38k75P8J5k8k6K15j99%J63j83Q5O6q6o1J82k62K70J9j40
$$ y = [-92, -166, -138, 92, -16, -44, -25, -72, 266, -268, -16, 176, 25, 26, -62, 22, 87, -78, -260, 76, -117, -188, 33, -75, -61, 189, -12, 122, -83, -107, 162, -130, -5, 168, 91, -323, 183, -146, -18, -8, -102, 319, -118, -96, 150, 12, -338, 119, -52, -116, 0, -202, 15, -164, 8, 107, -126, -299, 220, 58, -293, 119, -40, -126, 6, -95, 12, 6, -57, 118, -97, 80, 263, 21, -29, 76, -176, -26, 90, -77, 197, -70, 242, -49, -63, 63, 252, -2, -149, 66, -111, -180, 98, -7, 162, -141, -20, 6, 14, 154, 165, 51, 1, 149, -44, -7, 366, -75, 69, 69, -73, 250, -209, -131, 389, 67, -123, 121, -79, -220, 110, -116, -124, -248, 99, 137, 34, -175, 153, 4, -47, 116, 42, 126, 57, -66, 183, 4, -217, 158, 178, -18, 321, -145, -260, 140, -156, 44, 38, 294, 4, 150, -112, 127, -24, -134, 94, 62, -152, 110, 9, 147, -128, -50, -35, -63, -89, 126, -73, -73, 90, -93, -8, 58, -28, -89, 93, -169, 101, 120, -20]
3768b0O1r0O9K45l74k3J4J70j21P9j99N04l95N1Q8j97J03K05k62J80j46K07M0
3791A89k67P8K68k86O1Q9n6n9M5k7J3m9j74J28j42K37J59m24J61M02m61j36M36
3814A85k32K08j80J02R6k12J24J03l11J58P2k10J00O1j32j80M01j78K48j25Q0
3835A78j0m13J02J98j81N2N8j23J36J0n3R5o2J19%J6j10J15j90J99Ll91L03N8
3859A09j36Rr9N5rN8j11J36l0J77r0j15Q4M1j41M4J63k16J87k69J34J38J1L8j22
3884D6j16J89j31J8J37k3j64J49j24k5J87K9k98J78m8L0j01m6J38m3k44M16k14
3907f0P7p6j07L60k95J56k1J59j89J23l64K10J81j42J34j1j68J00P3j96K87k84
3929e3J12J47l49q2K14K45k41j71J43%L8o1K7k5J35Qj22k6p8N9J16n0KL7o0N7
$$ y = [-20, 41, -49, 20, 265, -109, -132, -118, 52, -69, 10, -189, 315, -80, -29, 59, -138, -35, 170, -92, 88, -58, 149, 189, -78, 0, 268, -18, 43, 132, 76, 17, 62, 35, 48, -1, -175, -47, -189, 48, 207, -217, -56, 346, -115, -251, 185, -47, 161, -19, 83, 179, -33, 91, 194, -117, 41, 113, -97, 3, 64, -68, -248, 153, -25, 223, 98, 178, 168, -245, -143, 55, -126, -74, -16, -139, -3, 7, -46, 49, -13, 106, 106, 122, 12, 127, -63, 136, 139, -252, 51, 109, -27, -18, -117, -62, -71, -13, -124, 12, -18, 159, 69, -46, 38, 79, -62, -18, 145, -71, 116, -153, -19, 119, 130, 168, 46, -70, 119, -12, 6, 143, 120, -44, 105, -19, -44, 143, 172, -126, 52, 4, 34, -67, -113, 25, -18, -262, 154, -60, 17, -59, -166, 194, -101, 55, 34, 193, 4, 127, -237, -27, 154, 12, 146, 135, -33, 67, 140, -56, 231, -53, 59, 206, -143, -225, -11, 234, -7, -178, -35, -35, 3, -58, -31, -56, 79, 87, -35, -61, -139, -80, 36, -14, -12, 25, -35, 22]
3955B2p5Q3j30K27j5L7p7l37J69Rj01J08R7j90K27r2M7J83l05L05k17Q6q7J07
3979H1j19J63j2k16K8J09j2J40k92K64j34L9o6J76j60p3K86m31J88J6PR8j64M6
4003c8J75j92LK22j64j53J73J5J09n2j91K49j02q2j11P3r6J57j36K31k00k16M70
4026A44k86J20K82l51J01j4k5M4j6p8L00k11j56K59j91p5L30m82J73K94k05k7
4048g0J24P8m5k64J95J68k10j40K03j59rN8K48k96Q8K85k32j37J99j6k95J73K28
4071A74k76n2L36j84q8J35o1pJ24j80L57k65K0L6j24lK34N3k50Q3J14q5R7j00
4095H8r8k47J42K70k54l3J78N1j78L7j46J85m28N97L8l92N5L45l34Q7k1qL48m02
4119a20J10O4k46M00k07l71M96j42k5J66J00l34l2O8j3K85m04L07J68n76K17O5
$$ y = [22, -53, 30, -100, 127, 112, 149, 72, -265, -96, -87, -188, -80, 17, -173, 54, -38, 9, 192, -113, 192, -25, 61, -26, 81, -38, 125, 113, -103, -75, 34, 22, 162, -130, 134, 0, 39, -27, 149, -11, -84, 202, -229, -41, -25, -18, 80, -84, -38, 137, -55, -52, 170, 6, -147, 26, 41, 150, 98, -93, 156, 54, -28, -139, -66, -162, -5, -141, 90, -110, -326, 144, -142, -22, 260, -91, 10, -4, -29, 15, -1, -79, 221, 10, -146, 113, -78, -153, 177, -305, -132, 162, -43, -70, 54, 132, 87, -177, 18, 186, -24, -164, 39, -120, -129, -71, 177, -119, -31, 254, 22, -115, 84, 68, -227, -54, 174, -102, -154, 182, -2, -90, 45, -16, -23, 101, -79, 278, 13, 33, 69, -55, -58, 176, 229, -21, 62, 176, 91, 188, 88, -10, -257, -115, 155, -99, -132, 46, 97, -81, -44, -190, -5, -433, 164, 202, -190, -135, 210, -124, -37, -58, -66, 282, -120, -10, 54, -192, 208, 1, -370, 126, -16, -41, 125, 225, -109, -141, -73, -86, 199, -205, 102, 270, -306, -89, -24]
4141b4j2J17p7L6m1Q7K05j95p3k0J30l55L5M00j50j92j13M69j02m0k6j02k06L76
4165A27l6j71qJ19j47J42N6j88J59q6J10J36k29N2j48P4m7K54l98L16j0n0N8N
4189I0j10K57k82N1J66j03p5p3r3J22J16o1J00k37J37R3m31K01M55k27j63J38
4211G1j15j94M17l56J00qJ50K21l48J75J72k93j0J3K9R7o2j09K27k72N9K56l06
4234h6N4J53l37K52J62l06n0J56K42l5n92K63M32n30Q9K89m88N16O1k92P1J3j1
4257B6J03j10J45j20k37K19K66n09K42Ro3O8j71K45P2k67L26j70k34K01j82J90
4279D9l7r8n9K38k68Q0K88j0k61J61j06K05p9j38j01J54M3q9ON9n7J9p2J99k40
4304a14K15r1k32K94k45J79K01k26J55k6LQ8j74j40K23k18M9O8l14K60Q3k23M9
$$ y = [-24, -36, 81, 4, 40, -1, 86, 291, 96, 23, 3, 133, -222, -187, 213, 63, -129, -242, 227, 125, 85, 59, -43, -249, 127, 91, -80, -88, 31, -116, 26, 82, -106, 53, -33, 77, 213, -16, 36, -112, -38, -85, 169, -229, 87, 77, 27, 85, 90, -20, 237, -45, 6, 172, 69, -6, -79, -172, -50, 66, 5, 105, -132, 5, 98, -333, -132, 323, 96, -67, 71, -44, -238, 179, -177, -77, -85, 65, 286, -62, 113, 285, -8, -18, -5, 24, 121, 59, -50, 177, -95, -36, 220, -86, -32, 121, -216, 36, 198, -108, -158, -2, 240, 205, -387, -124, 308, -222, -133, 156, -332, 184, 245, -47, 24, 37, 26, 129, 19, 164, 44, -193, 26, 292, -217, 25, 34, -29, 39, -132, 113, 185, -82, 244, 74, -160, 41, -141, 49, 12, -86, -145, 93, -175, -95, 193, 183, -78, 83, -23, 182, 103, -35, -136, 18, 61, -28, -22, 37, -20, -1, -73, 126, -114, 101, 10, -222, 72, -173, 6, 207, -19, 136, 110, 113, 201, 27, -113, 110, -108, -59, 9, -305, -45, 38, -185, -136]
4327a36K91k42P7K05k52j34K55j33J8K2JJ56j29K5j0j21J64J56k61j37O9K74o2
4350I6k37K36L3k11K31O1n62L72R4q1j42K55k15L8N1k21M11m7k13J36k09J61r9
4373f2qJ09o3J22p8L6OK1k48N8K60k42J97j44j30K39k58j9L56j87J3j27p6L53
4397A28j29j53J90K00m23L95r1p2R9ok33Q5j98L87j37j84J82k4n7J67J15l10J58
4420H9p9J61k0k12j4Q1k6J8j88J49L28l59n7K99l09J98M3k44J80J5l17L33j92
4443a23L3K78q6l29N69l97mJ60l18K01R1k1j73O4Q7J89q4r2M4q6l5J3k49J44O6
4468e8K1L34l82L4K49k9j95K80l80J5L18n70L58R1Qk0j83J70J48l66J62m6k22
4491b63K71o1j94L71o8l47L43Jj2L4k13L31j55l08L05J07l41K43R5k51P1K39m8
$$ y = [-136, 155, -87, -10, 195, -57, -191, 64, -69, -51, -29, -28, 128, -1, 24, 14, -107, 57, 213, -48, -185, -116, 158, 96, -141, 95, 128, -83, 148, 209, -353, 19, 113, 32, -110, 145, -70, -32, 19, -202, 209, 162, -51, 85, -124, 37, -62, -70, 39, -24, 98, 20, 56, 62, 83, -165, -107, 153, -89, 108, -36, -166, 73, -185, -204, 152, -35, -22, -149, -225, 128, -1, -154, 36, 236, -187, 208, 117, 45, 144, 138, -95, -10, -208, 179, 42, -142, 40, 16, -41, 126, 241, -69, 89, 10, 171, 151, -61, -75, 6, -20, -2, -190, -41, 287, -72, -129, 170, -139, 59, 102, -142, 38, 53, -264, 69, -123, -90, 188, 102, -227, 342, -55, -59, 101, -217, -16, 75, 54, -119, -55, 32, 221, 137, 45, 89, 3, -32, -19, -268, -124, -58, -37, 297, -85, -51, 198, 169, -26, 254, -126, -111, 207, -363, -5, 86, 94, 74, -109, 61, 209, -157, 5, -41, -263, 8, -53, -247, 124, 56, -291, 52, 53, 41, 75, -138, 193, 38, -270, 35, 142, -199, 44, 139, -112, -41, 198, 150]
4514A50j04k18J88l3j35L23R3m05K34j26R0j42p6J33J50m79L96l5k12j4L22j73
4536g3L0P2P3M4k02P6R8j07m3K65m22K69l2l83L25K03l36K11j6j39K94m58K13
4559c8K33l69L49jk97P8R2m9pl8K42J55n10L17J61m85J69J47l5k01K23q6k2j97
4583a69J55Q8k39J55L41m71J31M33n10J34j42O5J62l16k5L76m25M77l9l64J51
4604c2J97j17q0o8L4J46j14k50M26m18J98K16l13K65J6m7n8n8l5M16l58R2M32
4627D90r63N41J12n29J92L11j66k3j14p1N19m49M0L35l23J68L5m45J12J63K69
4648B04k10n2J40M2k87K69n9k91M08K00k03k71J79P2M7k23Q7P5l50K51J85n82
4670c69K95L34j25k57J6q3J39k5J48J13l38J00K33m26K20J68k85%J32O5k8j5R1
$$ y = [150, 46, -172, 16, -17, -152, 171, 264, -141, 93, -33, 57, -85, -161, -28, 122, -357, 39, 4, -208, -222, 100, -73, -43, 29, 102, 146, -56, 20, 118, 11, -32, 233, -189, 80, 48, -335, -10, 193, -143, 68, 52, -87, 207, -251, -38, 195, -174, 175, 174, -123, -45, 47, -2, -9, -47, 195, 350, -160, 157, 318, -167, 2, 149, 114, -87, 136, 50, 28, -169, -14, 74, -165, -10, 331, -140, -9, 424, -86, 48, -94, -29, 133, -183, -208, 168, -257, 220, 181, -183, -32, 165, 48, -32, -100, -66, 80, -34, -284, 142, -276, -78, 138, -175, 90, 106, 59, 1, -57, -92, 324, -34, 58, 490, -473, 68, 180, -349, -157, 154, -12, -35, -149, -220, 299, -150, -110, 225, -98, 70, 105, -340, -228, -65, 204, -6, -58, 82, 124, -163, 106, 47, -244, 164, 364, 161, -110, 69, 141, 188, -35, 52, 127, -223, 28, 213, -369, -74, 260, 135, -122, -106, -189, -50, -75, 73, 186, -152, -52, 181, -245, -25, 143, -142, -142, -10, 55, 27, 12, 103]
4693A03j56m1O1J76l42J48K75k49J04j52N5k8j08J95j8k87M56rl54K07K28k53
4715A1m7LKK70l05J13K3j45M6J89l5j2q1o5n5j18J36O6j63J98l0l98M25J25l9
4740A14j89L66m11JJ32QN9l20L14K02l34o7L28l08K22k01J84k2k48K22K1l15L60
4763A18l3j83K17J07k36O7Q1j2jk43M3K09l03J01N30m95M4J51k48J14o9k7j16
4786a84P3PJ14j53M08r9l18J03K80j66k40K49j76K07j17J29J58m44n1L19l39L04
4808F4J07m12L38L3j65N4K5o0J27j06O5J16k96P2L21k30M2O3k24Q3J12j46p2m3
4832a32L08k12l10N03k56J0J47J13l37J77r7J29j5j66J99k8N6Np1j80M34l25N
4855d3K99j46j78O3PK31k87q6K06l85K20L51l22J02q5NJ94j59q3J60P2k38K23
$$ y = [103, -53, -94, -33, 143, -199, -51, 224, -25, 79, -73, -18, -46, -154, 41, 23, -264, 192, 183, -171, 36, 264, 11, -36, -33, -31, 239, -66, 47, 70, -75, -29, 160, 125, 113, 32, -33, -88, -206, -70, -4, -167, 31, 1, -397, 28, 153, 114, -75, 291, -120, -119, 13, 21, 80, -240, 74, 276, -58, -125, 203, -105, 117, -84, 100, 78, -170, 52, 73, -242, 118, 85, -98, 119, 226, -10, 57, 138, 126, 125, -118, -75, 134, -169, -68, 462, -33, 11, 162, -86, 28, -41, -68, -184, -111, -104, 10, -143, 265, 166, -152, -49, 231, 65, -175, 74, -102, 105, -12, 117, 275, -169, -220, 99, -240, 64, 171, -241, 97, 130, -35, 19, 44, -16, 111, 5, 70, 186, -110, -38, 283, 53, 95, 158, -66, 17, 129, -17, -89, -132, 176, -36, -346, 157, -99, -89, 58, 171, -166, 11, -86, 43, 28, -138, 61, 33, 89, 94, 23, -157, 277, -48, -43, 256, 110, -68, -5, 2, 233, -54, -140, 66, -319, -99, 252, -70, 32, -53, -48, 146, -13, -96, 64, 136, -102, 121]
4878A21r3j87L51j12j06K19k98J43P4j87J71r3j84M32k23o3J67p1P2k13k11M07
4900A16p5j01J02K41k48K16n4p5j91o1J58J36k15R1l4j93K34j86q0K64k24K07
4922B8L06o79L75k57Q4K82j89Q2J00j36j93J94j94K58L9k69K44O1l59K85M4j56
4944e0K82l30L5N0L1j48N4P2R8N2l05K61j14j16K70k21J5L33j50j17n9K14M5j67
4968C5j37K96l67J16%OQ8K88m01j00K65j77P5K36k12jQl6J30j72j19K04j63L9
4992i9J36j17L64r9l64L67j29j58R9k12QL88l48M00j30k72M27l48m1O1Q5j91L20
5015A47m04K20Mk26K94J09m85L21K85l92L39k06r4K07k33R2J68k99J03N4k26L70
5037A48j02J2N8L9k22J21j6l5O5k49K79P7l30K83l3l60L94k08k07L60n6k6k1j95
$$ y = [121, 28, -159, 192, 80, -26, 193, -105, 38, 112, -75, 96, 3, -181, 251, 28, -35, 132, 61, 133, -80, -291, 116, 41, -60, 42, 283, 35, 251, 197, 122, -69, -130, 28, 164, -51, 40, 6, -187, 47, -139, -219, 45, -179, 28, 334, -345, 30, -227, -143, 139, -50, 32, 132, -4, -197, -3, -197, 61, 100, -169, 75, 136, -223, 62, 106, -50, 232, -98, -63, -13, 18, -130, -76, -4, 94, 146, -159, 102, -12, -128, 142, -79, -64, 269, 119, 2, -57, 157, 202, 35, -102, 194, -173, -57, -57, -51, 37, 325, -76, -176, 89, -88, -13, 223, 11, 10, 18, -18, 112, -60, -179, 25, -138, -99, 37, -80, 284, 185, -179, 188, 59, -99, 0, -212, -204, 184, -164, 236, 106, -166, 261, -87, -128, -67, 18, -173, 147, -257, -37, -33, -259, 35, 144, -341, -20, 265, -127, 212, 6, -88, 119, -114, -22, 146, -153, -50, 4, -222, 148, 46, 58, 116, 155, -67, 54, 38, 3, 68, -181, 98, 175, -155, 128, 95, -265, 129, -79, -286, 74, 18, -8, -29, -224]
5061b24K73q9j81K78Mk72J90N0j78O3J05j05l7j14L41l3k02K24J89m70K53O5o8
5084F2M1j20J98k39j34M58k45m3Lj13O4Q1q9ML2j82L20k21j48N56j23m92K70L4
5108b6n9J84k90K69j48J16l1l0j28M30k79k91L91q0l29J64J40Q0M0o6Q3k34j62
5131b56M66k87k1K34n8m40K77p6K59m27L70P6k38Q6Q2R6l88M47j62k35L87j94
5153bR7l22J25L58j25k91L54j78j79K02L3j80J5K58J9k23k91M06j96M0J43O8n11
5176c80N26m5k55r8K34J59k48K27K65m49k83M80j44k04K85OK8j84r6K59q8n9L58
5199B94k36j69K11M3l55J69K08o9k33J65L19n02K8L67j53l44K79J40l71L21L1
5220A43j77rP7J28r8l0N3j18k33M01J66n12J82K08k52j67K30K55l40k5K29q1k59
$$ y = [-224, 49, -40, -221, 57, 61, -211, -21, 29, -149, -86, 19, -86, -123, -237, 104, 71, -131, 93, 282, -188, 65, 130, 62, 103, -17, 181, -58, -192, 266, 21, -22, -19, -132, -68, 13, -76, -72, -40, -222, 98, -123, -271, 285, 162, -330, -60, -26, -85, 99, -191, 78, -70, 46, 15, -15, -143, 287, 8, -283, 108, 28, -301, -137, 3, 83, 123, 57, 140, -94, -256, 210, -77, -98, 136, 78, -362, -85, -161, 98, -329, 41, 117, -121, -35, 47, 143, -245, 202, 40, -195, 192, -2, 95, -227, -102, 256, 131, -160, 194, 16, -163, 39, 72, -108, -93, 165, 184, -39, -330, 76, -120, -80, 63, 131, -380, 146, 101, -154, -252, -18, 141, -107, 120, 385, -64, -347, 133, -11, -215, 70, 76, 104, -80, -176, 83, -5, -64, 294, 58, -111, 100, 143, -212, -43, 165, 96, -137, 28, 347, -155, -127, 240, 87, -257, 22, 162, -209, 112, 143, -34, -43, 34, 162, 64, 34, 87, -31, -264, 137, 303, -209, -27, 181, -71, -238, -8, 247, -93, -118, 111, 30, -229]
5243b29L20P0j52JPm4j30J64QJ79k12M81m08k42L79q9k38L77l26j8MJ18q2m1j97
5268c00M39n7k38K16j44QJ75J0J89l91j03K84r9j20K51j66r4K09N8L5j29k68J40
5291i5Q8l0L86m16P4k0o4kR9q0r6K25j42K03j1pJ5k27Q7J18k56l0L50l58L6J27
5317b6j17K50j84J6K31N9n21M17o8k62M04j3l05J84q9L42l05k34J59K52k22J54
5339A22O1k12J40j19ml4J9L5J17k69M59k32l80L71m2N2j32J74k39Q7o5Q0p9k52
5363c42M96k76o2M18j73J7L84m40o8K88k05K86k32j05K47l96p7L09K6j43J59j47
5385c6N5J53k75O1J01j58K30k65PK71k05j83N11l54J07l2j56K85j5j63R6n0J05
5408I0O9j95j24J40mJ93N8k06l8J85NL0K7k57J85j74m9K20j43m1N9j48O5J56k81
$$ y = [-229, 91, 161, 9, 10, 17, -27, -157, 7, 15, 194, -18, 463, 55, -187, 192, 103, -135, 242, -84, -102, -98, 20, -62, -103, -300, 139, 82, -156, 60, -84, -76, 99, 109, 298, -93, -196, 88, -11, -131, 120, -46, -140, 69, 127, 162, 33, -235, -95, -7, -37, 349, -67, 7, -13, -77, -79, 20, -60, -156, 69, -73, 130, 119, 112, 127, -100, -13, 105, -151, -181, 169, -189, -153, -26, -143, 107, -77, -61, 170, 229, -292, 125, 57, -205, 199, 186, -119, 65, -24, 318, 13, -221, -62, 190, -32, 122, 183, -29, 111, -8, -12, -46, -27, 8, 125, -144, 315, 83, -297, 74, 32, 84, -48, 126, -113, -26, -91, -11, -90, -342, 154, -122, -184, 234, 61, 78, 462, 22, -46, 242, 37, 323, 91, -14, 233, -163, -240, 69, 95, -48, 111, -36, 19, 172, -103, -42, 59, -99, 131, -134, -127, 144, -61, -244, 267, -87, 20, -12, -168, 117, 102, -61, 35, -15, 90, 159, -36, -160, -20, -24, 169, 227, 21, -17, 168, 173, 203, 230, -27, 158, -16, -65, 155, 12, -29, 30, -118, -53, 103, -178]
5433a78K13j52j05M55k25J18j9k23K97l40R7J49M8j79L06k68J15N2j84M2p7L0
5455b8O3K31m29M79l33M2l6J53j74O4j33J17O9k28K78j23j14K42l75J94O3k04
5477a82J19j8n0L19j99k00M90j85l16K83j14J29Kj57p5K46l03L01k40J5L56k57
5499c6PJ29m3j44M27m48J46J18m3k37Q1m5K52l21K53R0k07m1K0j11K41L0j54J96
5523A60j91j36L07m4k96N06m12M6N8j97J73K02m10J11K02k43K94l7j08N5PMM2
5546I3r4Q3rl8J84n11L69k22L21j81K52k85k4K47l67K9L94l22J34q3l5J82m11
5569b94M26J46m18q4L73l02J18q9K43Q3j81j25M35l17j30K38j19p2R2j44J18O2
5591E9j74K94j30j30K32j94j26K87j89j15K11O9n3r1j7L67m86J6L55j33k39K58
$$ y = [-178, 35, -117, -222, 233, 8, 126, 107, -116, 181, -159, -62, 87, 135, -44, 262, -6, 109, 161, -23, 19, -58, -28, 35, 266, -163, 316, -17, 25, -11, 142, -32, 32, -101, 16, 85, -143, 135, 12, -102, 140, -235, -41, 22, -182, -63, -81, -131, 188, -11, -211, 279, 94, -222, 61, -53, 76, 78, -79, -154, 92, -211, 90, -150, -135, 221, -36, -29, 100, 57, -87, 340, -108, 38, 156, 113, -124, -43, -88, 164, -157, 96, 186, -21, -62, -42, -153, 88, 118, -36, 160, -31, -167, 140, 96, -200, 306, -106, -60, -2, -199, -26, 176, -234, -123, 79, -164, 130, 93, -15, 40, 47, 51, 93, -1, 82, 73, 35, 219, -292, 77, -145, 176, -5, 247, -38, -62, 185, -182, -153, 241, -81, 53, -30, -65, 117, -294, 132, 278, -140, -224, 149, -153, -35, -124, 119, 202, 21, -104, 331, 14, -116, 122, 3, -69, 23, -121, -3, 59, -115, 179, 49, -81, 151, -43, -169, 118, -71, -186, 25, 94, 41, -50, -67, 300, -186, -170, 185, 52, -187, 71]
5613G1j16j64K45p9M07m35j46M67j46j35L77m83J37J23j97M7m3Q4L13m15n4L96
5635B54k75j33K54j19j62J55J11J4q8r7J70R9m91N67l07j99L86M7k29J68j52J46
5657A19j69K34J3k50P4K57l06j43L28j7k18N1l4J34k61K16M9k27L4M47m40j20
5679b29N13m64J50J48n4M4k59R1M11m78lJ44q5j16M05k8l61K84j68j56L98j54
5701C3Q3j16j50J94j70j09L10L4J0J69k66J36m40L95K84n02K4J90j85%J78j47
5723d5O6o7J29K24k98j61K38k46KM40j08m17M43k02J14Kj59J75k11P5J97j53j07
5746f9L08m25J83K63j38l55K68j8L2K3j53J49j85k20M81q3k82J53K54k11J9K45
5768B39R2l27j37L16j2j35K08n24M2M27j93o5j5R6P3j16p0L57m37J19M6k83L14
$$ y = [71, -45, -209, 36, -43, 364, -71, -217, 250, 104, -31, 346, -137, 0, 123, -74, -27, -70, 14, 327, -88, -142, 254, -21, -154, 100, -19, -181, -26, 85, 99, 11, -86, 84, 183, -308, 259, -48, -247, 139, 186, -43, 125, -27, 119, -50, 184, 197, -53, 21, 278, -28, -171, 157, 140, -78, -27, -61, 73, -188, 28, 77, -150, -116, 331, -109, -229, 284, -180, -30, 118, 64, 108, -151, -60, 351, -127, -130, 14, -71, -187, 218, 190, -171, 113, -55, -211, 187, 33, 116, 0, -150, 44, -126, -235, 75, 109, 119, 288, 22, 158, -282, 113, 397, -105, -81, 109, -76, -76, 102, -45, 21, -46, 83, 307, 9, -152, 86, -160, -158, 282, 174, -243, 200, -2, 112, 114, -45, 130, -81, -6, 191, 38, -69, 239, -186, -3, 260, 122, -233, 35, 17, 49, 72, -81, 68, -117, -337, 144, 61, -221, -68, 186, -25, -6, 239, 331, 4, -133, 183, 171, 36, 244, -280, -238, 189, -4, -69, -84, 12, 85, -31, -101, 256, -181, -62, -16, -299, 15]
5791A5Q5j35J5J40k09K78r6j52K41r6m5J25j87O0j06j25K33J02j59K4q2K7J28
5814H1k94J28L02j98Q9k6j5j44J22k78L04k16jK58J2l58L51j61p8J27ko1K51k95
5838a02K04K4k69L26k75L3L04m59L77k11or4j72K41L4J90k52K18l59K65P3j8N5
5861A27k07P2J09k46O1k9J74p2k0J5J40j8k60J83j37QL13m3l83M09k66j73L14
5884G1l24L35L6k05Q6Nj77K10j9l06L11l1j42K42KJ21k6k31J1L4j59L18j69j38
5908a45K70k33J11j20j91J43J87l2K23m08J14K45j19k61K86r9j35M9J28q6J17
5929D4O5Rj8j57J53Mj00K01l45Q9K08j23KR4j81j88J56J82N8j91J16oj8rP8j83
5955f0J02Q6j91J04N2r0o8Q9K8m4p7N8P1Mj28oM3l0Q2M2K21k96o8K73k54l4M07
$$ y = [15, 100, -35, -20, 120, -89, 189, 93, -59, 182, 86, 41, 166, -21, 39, -67, -192, 41, 143, -16, 8, -74, -47, 81, -213, -85, 217, 19, 108, 82, 67, -77, 45, -233, 71, -145, -146, 112, 124, -234, 117, -44, -122, 5, 3, -58, 193, -102, 102, 126, -143, 183, -92, -59, 245, -214, 163, -48, -54, -148, -320, -79, -45, 145, -107, 111, -248, 17, 90, 72, 127, -80, -8, 101, -145, -84, -113, 61, -11, -31, -16, 124, 106, -154, 29, -108, -100, 213, 170, -213, 196, -70, -243, 71, -253, 82, 118, -87, -1, 4, -173, 37, 18, -288, 23, -8, -150, 92, 94, 215, 189, -42, -31, 3, -156, 162, -7, -145, 125, -108, 3, -117, -308, -165, 22, -10, 213, -195, -81, 164, 45, -216, 70, -29, -164, -115, 13, -73, 44, 109, 118, 100, -57, 96, 100, 0, 201, -144, -55, 153, 30, 32, 126, -55, -243, -87, 95, 153, -38, 78, 72, 54, 45, 123, -60, 42, 128, -63, 41, 93, 3, -65, 24, 52, 8, -69, -11, 60, 64, -64, -70, -27, -57, 25, 67, 288, -8, -76, 197, -57, -91, 316]
5982C16m55J89j00o2K09j57J58N4j74q3J88k38J98j17M7J57j11j30K52n5j76q
6004i8L7k0J33k90K60lj93L59l62nK64j91J63L6j52N4j26J99j41J84j73k7K44
6027A52k80K38n2l9J59k96K97Q4m05K57M0k49K58k99J34J77j93Nq6j09%L35k75
6050a47J7J41j11K11j85M7J43k90J29J8q6K49K5l52L08j59L6n9j32L60k53J66
6072G6j65K74j05k21K74l92K10j49J06K99l56P5K25r1R5J71k77P5k49J04R8j74
6094i7O7K3K8r3L15j99l23N52n05L00J15j69J5mql3J24k11J16j56J48J89k13q7
6118a06R3r7j1L34k86K21j10j27L08k38j04J26n2J19l13J07J72k54L21L24m39
6139a2M9o0j62J13K80j94j91J78p7J5k25K19J37r8K0K58k07j6J27L9k20R6l6j89
$$ y = [316, -139, 50, -50, -112, 97, -60, 98, 152, -22, -105, 83, -155, 43, -74, -27, 130, 19, -111, 141, 86, -90, -98, -61, -81, 52, -238, 22, 19, -174, 185, -177, -182, 82, -109, 54, 90, -62, -8, -134, 65, -76, 108, -65, -92, 152, -128, 110, 58, 19, 178, -118, 179, 263, -142, 115, 155, -94, 164, -135, -1, 176, -17, -12, -98, -207, -207, 128, -147, -130, 11, -100, 111, -74, -27, 116, -174, -45, -27, -113, 136, 161, -191, 117, -42, -6, -65, -197, 163, -90, 76, -89, 185, 80, -141, 133, -259, -49, -198, -92, 207, -149, -74, 151, 60, 155, 326, 49, 124, -125, -21, 77, -97, -30, -7, 21, -72, 243, 44, -279, 273, -232, 68, 183, 14, 29, 25, 17, -16, 108, -103, 13, -143, 5, 194, -19, -106, -13, -110, -121, 213, -73, 148, 38, -89, 219, -19, -123, 3, -49, 70, -243, -136, 36, -218, 103, 427, -12, 37, -23, -185, -72, 208, 14, -177, 1, -76, -61, -286, -67, 70, -28, -8, 250, 43, 27, 154, 193, -27, 69, 33, -156]
6163a56J65m8L91n52L34Q5m73K10J35k27J1J19R3r6j06K34j70o8P4M09n25PL28
6186A74l36n6L19j44J80j83J33K3k09P2J74k5j48J41j35p2l0PJ92k16R3K60l44
6209a30M6M8k15K85O0oj31N5k36J86J13j30J98j76j59K30j84m5K61j8P5k17j6
6232a06J98j4j95K10l14K65LQ0k62J12O2J14j54J29J90n28L89q0k86j2M81m30
6254a48K10k7r1l4o7J10J08j85J99j00q0K78n0n1J70q8l5j13k4J07N2j91j82K35
6278Cr9Q7K51k15k41O8Q1M0J05j68M36l69J18n1o9m6R5Pj59N1J0J10P7j12K95
6303C05k30k6k7j33Q8j69J70M9k50K61J05k13Q8J62p0j15P4j35J37n5N0m6n3Q3
6327E0P1k46K04Q4l44K00j03K11J8j9j64K25p7l31J30j87Q7L99l05J7J20p3J38
$$ y = [-156, 9, -39, 352, -200, 134, 219, -254, -44, 91, -136, -125, -6, 87, -9, -115, 119, -51, -119, -45, 364, -161, -154, 174, -162, -218, 101, -43, 137, -46, 87, 110, -99, -27, 147, 122, -26, 115, -20, -92, -122, -115, 77, -139, -46, 214, -130, -84, -36, -251, 34, 94, 88, -43, 12, -224, -38, 75, -55, 143, -33, -192, 38, -146, -191, 70, 52, 127, -90, -106, 92, 78, -117, 93, -221, 44, 47, 127, -135, -23, 39, 153, -1, 128, 318, -210, 179, 99, -187, -199, 282, -148, 62, 35, -56, -90, -157, -47, 61, -124, 75, -25, -105, 173, 123, 72, 242, 154, 119, 6, -18, 89, 141, -50, -232, 3, -96, -9, 242, 27, -214, -146, -65, -25, 80, -88, 348, -21, 97, 46, -23, -69, 26, 33, -126, -75, -65, 45, 122, 10, 305, 75, 49, 22, -111, -23, -192, -22, 27, -223, 38, 143, -70, 18, 180, 110, -5, 69, -66, 71, 16, 66, 20, -33, 50, 121, -125, 79, 163, -181, 19, -84, 127, 145, 126, -38, 187, 110, -221, -91, -278, -191, 208, -97, -80, 40, -33, 105]
6350A05j31j02J48O7L7n3r7O8Ro5J07po6N5j31k4K24j28M5k80K03j6J60j63j05
6375a40J86j95J39Lq6J67k42K22O8k01j55L41j06J34q4k44K67OJ5j6J2J5J38j78
6399F6P4j42k93L76r3j35k4L52l14J58J43k3m5j64K03j45k4K5n1j21P8m4K43J90
6423B90k61q9J35j82L45l98j03M61k20j74L76j43j49N2m8J43J1J1k23J83j06M1
6445d8K17r7J01k16k87M62m6k16J78j29J44Ok84K19j50J35j4p4N8J78%j93J53
6468I7j92P5K43j35k60K31k10L12k62lK05k45K46o5q6N9m1P6r4j1j2K53l82J76
6492b5J40r7P3k7k25j4L73j19j61K72j57R9o2o9O6j84J44K7l4J73r4l40J98O4
6516B1Q4o5j43Q0J92k33R2L3j78j15K85l0J07j39R5j61K04p0K84k85K43j96k31
$$ y = [105, -26, -128, 20, 87, 124, 71, -26, 42, 51, -14, 93, 86, 20, 75, -56, -80, 144, 16, 61, -219, -16, -32, 128, -35, -140, 46, -149, -10, -7, -93, 74, -168, 54, 122, -79, -234, 107, 1, 135, 51, -193, 74, 80, 95, 79, 91, 106, 244, 66, 140, -2, -295, 81, -12, -147, -171, 181, -133, 25, 168, 145, 100, -64, 139, -6, -30, -5, -56, -177, -99, -143, 100, 290, 29, -60, 75, -107, 238, -160, -263, 198, -22, -196, 180, 37, -112, -60, -108, 35, 46, 57, -166, 17, -89, -48, 169, 72, 173, -43, -330, 132, 86, -130, 48, -81, 63, 69, -215, 4, -146, -11, -25, -99, -41, 137, 137, -56, 97, -95, -20, 223, 88, -172, 59, -151, 161, -101, -104, 101, -144, 102, 37, -49, 10, -31, 45, -49, -60, -72, 181, -201, -25, 115, 18, 91, 64, -161, -175, 198, 79, -82, 190, 33, 132, 70, 1, 67, -117, 27, 54, 20, 193, 99, -241, -43, 21, 105, 40, -103, -23, 169, -64, 28, 61, -117, -232, 53, 23, 130, -9, 86, -75, 129, 59, 343, 58, 301, 105, -126]
6539a26L32q7j1K21l76p0K38l68K24K35l98K40p5j05J82R3j10N1j65q6K84k72
6561a49J68l4j40K36k96L51k19K35p2N6k55q8L86l00n1J00P7mM26m49R6j9l0r9
6585g4J8N4ML8j54K51j59R1J15k65K51j81L3p0j11J31J95k30J70N0l03J00m5L9
6609e2J89n1k19j13J30N6K07j71L1J69j69j99J1K41o8K03r1j26K3Q0L3r0J15l3
6633A06l10J42K38k50rO3O3j37j3J20L19n19Q3K78l13J81N4j30P5J3o3k2j91K29
6657Gm9L5j8L32k72k0J08k21L8m3K6N4J5J46k5k22J68p0m0J45j27J05m2k30K18
6682A8k4j84K66n2r6O9J0J47k71J61l1j99L2K83J5j91l4K32m51L81j56qPQ9J33
6707A46l6l9q4J99l34R1Rj11L54j77m9o4Q6k1K7q3K44j79j35J83qJ9j13J83r1
$$ y = [-126, 206, 119, 108, 329, -47, -117, 121, -247, -23, 212, -186, 54, -21, -126, 56, 149, 39, 90, -75, -161, 123, -149, 19, -15, -155, 81, -215, 136, -83, 152, 80, 136, -119, -207, 179, -121, -172, -72, 5, 1, 427, -22, 74, 55, 25, -74, -56, -2, 2, 40, -114, 137, -22, 69, 184, -81, 170, -11, 22, -48, -159, -28, 167, -63, 107, 157, -146, -46, -91, -52, 137, 86, -133, -246, -116, -60, 147, -24, 7, 176, 7, -192, -181, 60, -8, 195, 104, -22, 1, 81, 114, 24, 139, 106, -204, -62, 176, -74, -83, -20, 43, -94, -107, 13, 332, -187, -104, 174, -139, 42, 96, -34, 41, 54, -9, -31, -222, 7, -42, -7, -25, 307, 35, 15, 123, -98, -60, -103, -77, -23, -8, 138, 113, -109, 59, -11, -51, 94, -33, 72, 30, -200, 18, -6, -190, 76, 24, -72, -3, 7, 154, -117, 44, 13, -186, -154, 129, 144, -47, -81, 151, -300, 81, -75, -83, -76, 13, 146, 110, 71, -13, 186, -148, -57, -48, -159, 195, 18, -31, -95, -9, -30, -3, -86, 158, -21, -156, 27, 19, 38, -75, 108, 17]
6732A7PO9l8K9k39M8J50j48J52O8j91P7J73l04J13J39j46J03k88K49q3o0L5J43
6756G5J1j52L6l0q0L1J90qJ7L4j2m53M32rk29K60l03K73K6k05P6J4j74K09n9o
6782c6K68j61j61qK15l25M18m43K50J71k56L8K6j75P1M0q8K20j12J49J04k1k37
6805e3K4k0O5J9k81L91J96j63o5Q0l48K61k35P3J05k91K81M3k52K16O9r0J12J5
6829A52o8j89J08J19j02q5K15m1j94j22J90N1Rj17Q3Q6l9j31L01k92L8K58l24
6852i4J28k4j48J94P3r4J13L2k84J07j56J06J20r5N3J13k26J18P2j22M8J14k05
6875e7M2q8K33r6j02J30k8l4n3r9o8L08l4j37K54k92J03L36l27J72j5j60O9q0
6899b3j9J47k37M8K18l25L4J41j69k9L19k44m5M8J23o6L1Q4n4l9N9N8l93L61k05
$$ y = [17, 24, 93, 55, 84, -155, -107, 43, -105, 47, 115, -76, 1, 174, -130, -17, 122, -24, 79, -209, 40, -43, -103, -68, 75, 86, -66, -30, -60, -140, -109, 81, 73, 90, 124, 112, -341, 91, 82, -147, 113, -190, 83, 109, -96, -20, -6, -180, 29, -30, -36, 232, 71, -90, -98, 117, -208, 210, -233, 17, 188, -68, -30, -4, -179, -108, -68, -156, 64, -48, 101, 205, 184, -53, -29, -49, 16, 35, -246, 145, 341, 178, 113, 193, -155, 106, -129, -56, 49, -242, 39, 82, -170, 46, 115, 25, 137, 152, 84, -105, 3, 122, 20, -65, 150, 109, -85, -207, -17, 34, 43, -74, 9, 95, 56, -75, 226, -66, -28, 230, -94, 34, 10, -138, 56, 129, 35, 148, 180, -104, 3, -153, -47, 73, -22, 31, 144, -82, 36, 108, -14, 34, 148, -57, -15, -103, 130, 34, -68, 62, 34, 0, -53, -152, -220, 88, 54, -83, 171, -121, -18, 318, -9, 163, 148, -12, 57, -23, -42, 105, -132, -84, 134, -191, -157, -16, -185, -214, 105, -139, -184, -136, -13, -79, -48, 36, -18, -57, 2, 60, -333, 28, -177]
6924a77K56j03O3r6K50r2l2M7k78K35o9j36L18k20k6L54m06K18Q3j56R6Q3l13
6947a01J64J51k91pN7N0j05l8K70j25j34J01J07K9l9o0k5n5m2J4L5lm7J78j75
6972i1j9K12o2j13K24l18j2K18p6O4M1j83O5k4L35k11k04L95j96j16J76O0l77
6995b12Q5J84j69J92j57J22j13L7o4J47j60R0O8o5R3j97J77J18l84q1M52k26K12
7018A49p0k84K25k79L75k3l6j35J04k15L58m4k28Q8j81K79k04j06K66Nk16PJ88
7041B3j43J07n0j15J60O5j16J99j81K3P2p8K71k85o7Q6j28J20kr3K51n2j96K00
7065G1j32n9K20j80J56r8R3k67K04M3k21M41p7j70l8l68M11J0j46P8J51l27K97
7088I2J8l16K91j58j73K34j57J12J90l06R2J92j73J45k7j60J58j24lJ51k21J35
$$ y = [-177, 79, -24, 39, -57, 193, 101, 69, 116, -162, 73, 4, -132, 186, -34, -60, 294, -112, 106, 189, 33, 129, 212, -101, 63, 214, -77, -84, -27, 23, -82, -120, 150, 25, -109, -8, 99, 128, 89, 29, 4, -51, -93, -79, -44, -47, -94, 84, -91, -110, 102, 40, -73, 151, -167, -179, 39, -37, 27, 68, -115, -50, -74, 261, 50, -154, 241, 45, -71, 105, 165, -212, -127, 57, -112, 80, -77, 45, -68, -31, -95, 52, -108, -18, 50, -15, 78, -119, 58, 176, -208, -289, 163, -63, 149, 79, -205, 20, -259, 116, 93, 57, -78, 26, -189, 169, 125, -103, -15, -196, 83, -121, -227, 39, 44, -172, -165, 23, -120, -13, -63, -178, -18, 47, -69, 130, -51, -28, 44, -34, 237, -48, -115, -29, -157, -37, -39, -132, 119, 67, -129, 71, -61, -120, 100, -80, 76, -22, 71, -196, 8, 51, -170, 271, 194, 24, -14, -382, 29, 39, -107, -29, 122, -205, 92, 110, -206, 85, -73, -246, -12, -169, -57, 133, -173, -81, 111, -62, 83, 56, -104, 54, -70, -73, 78, -143, -8]
7110hJ92n22L41%j81K88k79J61Q6J3O7k21O4k0O1k5J41n0m4R8k84K89j0k26P8
7135IJ82q3j29k2k13L82l2k47J58k48J14K79l39nL15n2O4j23n4o4k3MM2L7K96
7160B48n4j56l1k2j45J94K75k69J30j23m7J00J3J48k65k9j66K48m15L95L7p2J84
7183A78q3l4J6p7J22j48j36L62j33l78L42n8Q2l4o3J52k65K13l7j5o3Q9J77l63
7207a54J17K06q6o8j30R5p3j25Q5K82k97J7J67j96mL00j96J47j46r8K60l01L76
7230A78j80j66J33O0j46J80%j84J58m8J04n0j48J33J57j45J46L5k87J5P7j7L8
7253D3k74Q7L10j27L3M5l69k2L62K0J06j35p8m4N5K25j79j90P6J52l89L92rk28
7277a38K12j03R3j22Q3J32j10kj92K91l79L26j66n7K89J4p2k11P4KK56l78N8R0
$$ y = [-8, 184, -338, 3, 3, -178, 110, -169, -8, 78, 91, 158, -63, 1, -19, 42, 17, 158, 108, 64, 162, -122, 167, 157, -69, 9, 191, 108, -21, -43, -256, 126, 94, -153, 5, -243, -129, 150, -189, -194, 121, 69, 133, 10, -44, -108, -131, -127, -85, -48, 248, 194, 38, 7, -15, -160, 34, 309, 40, 170, 47, 0, 100, 113, 261, -4, -33, -199, 49, -366, 29, 66, -6, 178, 95, 61, 77, 0, 122, -26, -162, 200, 67, -311, 31, -27, 55, 21, -42, 110, -155, 58, 21, 6, -57, 32, 209, -154, -37, 169, 83, 15, -115, -20, -93, -218, -133, 149, -148, -131, 36, -160, -164, 136, -60, 87, -59, -157, 103, -198, 178, -2, -168, -35, 25, -121, 59, 59, -125, 33, -15, 89, 39, -109, 24, 181, 36, 182, 217, -70, -55, 22, 5, 43, -231, -144, 166, 39, 72, 117, -252, -274, 88, 108, 214, 79, 1, -43, 12, 237, 58, -132, -56, 96, -293, 99, 90, -138, 74, -29, 64, -58, 25, 157, 47, 45, -147, 144, -235, 91, -75, -132, 157, 171, 99, -112, -38, -36, 220, -158, -100, -10]
7301a0k08M04k76P5J83j31Qo0k7L9J3j37K67j43J2P6o7j29l8J29N4J4k14K98j25
7326Gj91K03L0k14J39L2n8jJ30j52K7k68K90K75m63L75Qj96R0P0k89J39J29oo8
7351C8j99K07O7j35oJ46k08K7j1L67m24J55J9j13J55k2k3j10p8K67j35J9l8N8
7375B3j04L3J13q3J26J11k49j7m9J23j58J15K04m9j55j9l1M9j35K91j57m3oj05
7399a72j14KL62k83P1J70j65J81k50L43o6j98K08O0k00J07o0o2j43L4J25K8k47
7422b69L29p6K1P1j04J66J17k19K3j55J18L3m6L4p9K12l18L9K46k6n6k12J76k5
7446@p6r4J42j47J31J96k81K03j61J30N1j20J37L0k52K37j90j13J52J47j04m3
7468b5j26J03K71l47J73J3j20j26L11k03K24j62j21k0R5Q6J7M2k63K92k54m3K55
$$ y = [-10, -218, 186, -90, -15, 168, 37, 45, -15, -42, -3, 10, -127, 140, -3, 9, 85, 18, -111, -149, -20, 34, 48, -166, 132, 7, -184, 19, 49, -165, -26, 6, -52, -53, 77, -75, -48, -316, -26, 249, -214, 161, 169, -27, 63, 133, -156, -17, 112, 106, 38, -161, 46, 113, -22, -28, 118, -90, -63, -74, 293, -131, 24, 43, -70, 85, 63, 40, -70, -148, 119, -16, 3, -35, 23, -81, -48, 65, -18, 108, 219, -30, -47, -96, 27, -131, -16, 188, 139, -16, -35, -66, -17, -152, 139, -18, -61, -67, -172, -286, -284, 78, -205, -134, 36, -129, 52, -198, 145, 79, -119, 89, 149, -51, 56, -4, -66, -209, -175, -50, -22, -269, 60, -16, 5, 76, -28, 138, 255, 36, 59, -96, 22, 55, 9, 43, -36, 176, -142, -103, 143, 117, 61, -151, 25, 0, -76, -170, -28, -175, -44, 152, -129, 74, -87, 43, 94, -26, 111, 141, -111, 126, -64, -177, -25, 122, 18, -25, -151, -48, 223, -124, 49, 62, -58, -184, 127, -76, 148, -14, -135, -155, -60, 26, 43, 85, -178, 114, -140, -183, 72]
7491G2m8p6O5r9m6K11n6P8m31K05K50l04L15j40P7j03k2J91l25P4P8J53k32J56
7515D3N4j98K4L36m82L82k07q1K27j55P5K6j12j74L63k00J54j53Q8q9L1O8l1l9
7539e0K0J53j56jM2K2J26o0k57K98k9J0j60N0R5N2k84O8J77N7j47J33k84J54j56
7564a27m6K35l6p7K31p3k33l0J90O2nj92R4l0o3O6J79j55J08k62K69j24r6K61
7588A46k55N7K18k59O2L11m69J43K35l03J10K72k91J15O6j99Q4n6J16lk76M40
7610B64k02j47K55j43K2J17j66K6J03j82P2o7o9J58j08k1M2O3m2N3J5J3pq0jQ6
7636E4k61J76J81l03J79Lj04J38N2k38K04K7r2J98k63p4J27j47M7O0j37J44J8
7659a1k08J55J27n1K31l99K38pK3r9K35m58K85M0k25J18l6M5J97m29J73K58l70
$$ y = [72, 24, -52, 13, -86, -132, 79, 23, 101, -330, -125, 125, -179, 136, -4, 73, -30, -52, 139, -186, -112, -34, 119, -113, 43, 97, -101, -77, 259, -223, 159, -48, -129, 98, -57, 18, 44, -68, -242, 121, -79, 75, -78, 10, -79, -48, 20, -11, -50, -30, 123, -33, -34, 8, 30, 156, 96, -161, 137, 108, 118, -42, 8, 103, 155, -129, -61, 116, 173, 26, 159, -125, 29, -127, -173, 62, 26, -51, 180, 107, -126, -156, 34, 96, 91, -101, -7, -37, -100, -34, 145, -10, 98, -164, 105, -19, -115, 146, -109, -52, 166, -93, -31, 280, -189, -46, 189, -114, -4, 268, -23, 92, 158, -41, 43, -13, 103, 100, -176, 264, 62, -85, 170, 27, 49, 166, 0, 26, 129, -53, 19, -48, -117, 41, -67, -88, -46, 17, -25, 28, 43, 56, 49, -31, -32, 54, -207, -31, 150, -153, 26, 29, -75, 63, 115, -123, 81, 108, 16, 214, -49, -123, 4, -143, -96, -36, -173, -29, -11, -219, -64, 63, 12, 243, -156, 82, 75, 98, -1, 234, -224, 61, 101, -124, -6, -42, 3, 200, -229, -56, 202, -168]
7682a68p7L18J18j55j22QK77k57J81j45q0N9lm3J49r7j18J04L6J03K90m28L45
7705B95j78j34k28L67k27J31j3o3J52j57n8J44r4P3pJ9J02j21L4m8N9q8N6J27
7729A43j45O4k90J97kk39J77J70r9nj45K33j62K23k2R6j23j55L2L4J6N6j65J68
7753E7k26R0J74m8J31k20j41J81j0j17J81K6n1p4J88k39O6K00j61L1o7k8J03k67
7777b21J25J75j33M5j16K2J16K78l71J36p8K09j17k42L51k91K5J57n0o8J24q6
7799a0l6J41n4J12j95L2k25K57R5j03o6p5J56j57M8K37j64R8K7k48L40j28j68
7822h6J31L6J5j04qJ19j86J49l0J36m31M22k04K46k60m7Q3k00J82j32J77l2J07
7845H3j05r1J30k53L47p6j2o6K32j28j35L6qN9L2k30K88j85K98q2J35l85m7K06
$$ y = [-168, -245, 73, 191, 36, -86, -78, 199, -58, 123, -22, -102, -43, -46, -89, 60, -37, -155, -51, -15, 88, 378, -50, 295, 117, -17, -245, 122, -105, 26, 13, -50, 102, -55, -113, 31, -63, 10, 3, 22, 124, 3, 37, -11, 48, -40, 16, 143, -2, 62, -228, -31, -33, -272, -95, 75, -24, -29, -174, 59, -103, 120, 98, 194, 71, -84, -52, -18, -2, 54, -111, 57, -169, -79, 95, 47, 178, -42, -183, -2, -12, -129, 52, 78, 27, -47, 141, -98, -32, 168, 7, 38, -29, -57, 46, -221, -96, 79, -54, -9, -125, -103, 13, 291, -80, 56, -22, 187, 70, -172, 179, -112, -87, 70, 20, -48, 76, -10, -46, 95, 41, 153, -42, -10, -235, 22, 117, 14, -52, -127, 29, -128, -80, 157, -7, 91, 118, -130, 210, 82, -86, 45, 81, 96, -8, -16, 103, -83, 66, 36, 172, -259, 163, -41, 205, -55, -102, -19, -219, -37, -169, 8, -24, 83, -22, -113, 17, -236, 111, 35, 23, -43, 189, 61, -74, -38, -46, 13, 45, -185, 103, -82, 216, 134, 269, -116, -163, 43]
7869D3J14k29j65J96M3O2J10o4l6P5k27NJ46J08n2j13P3J9N0j52J03l9k61K46
7893E5n8j96K80q5PM4k52M40j78j14J0J86j85J17k38K91j41q1O3J19j80J28kj22
7917i2N9o2P5r7M6j5K0K06l01K59k59K11R1l49L82l58N1M8R8j31K04q1j87K18
7941C6r8J63k11J61Pl35J32J51o9o1K57k69J90k11R1Q9Mp8J58K5k23oK32p2L3
7966I6m34M94p8k62L25p5q4J55l64J95K25k85J62j47p1J8q8J49K38k06J08j63
7988i2J25P6J1k68J51j3j70j6J48o8L62k17j57Q7pR0L0j49K37j09q2K4j15K01
8012G9m6r0k08K86K43l69L7Q8L3O4j74m9R4k3J77j04Pj2k04%K11k01K81j63j2
8037e5J38k1j25j5Q1k75M54k90L09k17%oj89L13j15J56j34J44n9P9k98J35k00
$$ y = [43, 157, -72, -237, -41, 2, 64, 174, 110, 74, 149, -78, -73, 73, 181, 129, 16, 89, 108, 158, 6, 109, 70, -191, 55, -3, -199, 81, -4, 3, 47, -205, 235, 57, -57, -47, 139, -46, 71, -167, 124, -17, -98, -35, 84, -96, 32, 30, -92, -33, -95, -20, -117, -71, -86, -66, 140, -161, 98, -161, 50, 141, -208, 174, -184, -133, -85, 13, -118, 86, 5, -182, 36, -62, 101, -110, 51, 58, -277, -145, 6, -63, -124, 133, -136, 54, -157, -66, 23, 27, -51, 107, 132, -91, -97, 135, 63, 96, -338, 156, 78, -184, 141, 66, -18, 137, -227, -32, 193, -92, 70, -77, -148, -130, -218, -69, 169, -37, 71, -92, 33, 109, 120, -148, 3, -10, -180, -196, -48, -116, 246, 29, -128, -41, -48, 42, 72, -77, 160, 51, -31, -7, -122, 79, 33, -57, -265, 21, 264, -105, -68, 20, 53, 117, -57, -106, -12, -35, 142, 38, 45, 33, -171, -171, 40, -161, 120, -43, -55, 83, 62, -63, -78, 3, -272, 182, -108, 201, -16, -16, -22, -211, 102, -13, 143, 9, 153, 94, 173, -125, 10, -190]
8060a90L41j44L8M0Q4Q9k03j69J20j06R1K8j44R3K53j95k93K66k55R7P5J06l8
8083a6J56k83K51j40J20ol4j78o1K99j4q8j17lN3Q8K23l96L06j74Mj74K73p4K19
8108B34k76J04k08P8J73j81P5j58K17j7q2J63l61n1L23j51J82L4q5J43l41J27
8130e8J52k87K30k03J74r5o6L92j74j03J98l8j40J4L4l9J97k48k71L19J44j65
8152c3j3q3Q4J44o9J26J09l45L40l41Q7O7j81J99O7j70k8j65K34R7j24J30q9k9
8176A4K7K23k70j89K11n5p6K54p5k58K30l17M55k36r7
$$ y = [-190, 151, 7, 45, 85, 169, 258, 55, -114, 6, -100, -9, 19, -125, -32, 221, 26, -267, -1, -256, -159, -84, 22, -16, 140, -143, 108, -32, 88, 82, 48, -130, -191, 108, 94, 6, -111, -114, -61, 27, 250, -146, 160, -14, -10, -184, 89, 15, 234, -42, 62, -146, -68, 105, -76, -1, -159, 58, 41, -41, 122, -239, -290, 33, -118, 64, 98, 13, 156, -185, -58, 94, -193, 37, -166, 8, -87, -153, 239, 65, -38, 160, 122, -18, -4, 30, -9, 188, -60, -331, -12, 132, -33, -46, -129, -45, 99, 30, 156, 265, -80, 260, -81, 6, 73, -108, 91, 158, -12, -40, -205, 29, 126, 2, 132, 43, 14, 41, 264, -6, -195, 16, -39, -115, 139, 64, -194, 36, -281, 174, -62, -159]
8191a59
$$ Imaginary data points
##PAGE= N=2
##DATA TABLE= (X++(I..I)), XYDATA
0@%%%%%%%%%%Qj6J6j7K5l2M0n6O5p3Q9j13J36j58J83k15K55k95L41l92M48n10
32b71N80o58P43q40R46j061J186j324J478j642J822k021K237k475K732l012L322
49A742l662M034m443M896n399N960o590P304q117R057j0160J1467j3050J5013
63H052j7522K0865k5559L2678m4913P1650k35380J35886K53573l33090J10744
74b3016J16895j53569q0568K15074K6686j95626O3760K41669k40169j57519K98164
85A11781J9446k18569J48927J33455j04218p5781J6892o1720j18021J21293K13146
96A86631k00383j64079K04097j3269j42595J60561R1389j29147n6022O5924J32
107C239j16325N4180J50206j48340n0533K48279l7749j84788P6774N0148m7072
$$ y = [0, 0, 0, 0, 0, 0, 0, 0, 0, 0, 0, 8, -8, 8, -9, 16, -16, 24, -32, 33, -40, 49, -64, 72, -86, 97, -118, 137, -158, 183, -209, 239, -271, 309, -349, 394, -446, 500, -561, 625, -699, 779, -863, 959, -1062, 1175, -1300, 1432, -1580, 1742, -1920, 2114, -2329, 2567, -2832, 3128, -3462, 3842, -4275, 4782, -5378, 6089, -6961, 8052, -9470, 11395, -14164, 18514, -26399, 45251, -190129, -54243, 199330, -133760, -23016, 93879, -59690, -140258, 74816, 101502, -94124, -30364, 211305, -28864, -186383, 111781, 131227, -87342, 61585, 195040, 90822, 15041, 31933, -29787, -147808, -26515, 186631, -13752, -177831, 26266, 12997, -129598, 30963, 122352, -6795, -62817, 3107, 3239, -113086, -58906, 91300, -57040, -107573, 140706, 102957, -81831, -5057, 45091, -1981]
118a981K2035L0707l2981j06847M401J16426m6977q227J25030p6496r1485Q4418
130A8023K3091j1913j9434n5718L3915J6932j0367M9108n8192m1850R8608m560
142C7643m4451K2482j8900r674l1913k2665R8564l670q3742M6277n54j5098Q9293
155F3592j2131p7188j1817K8349O8678l5404q1096P4287J0264o9560O6569K3632
167D8175m9892J8750p788k2308k716J1895N5243o5533q8274J14512M1284q2394
179b9046L2723n879n1411O2230L8871l4740m3378M249O6554l8633m5754J04128
191E9914j8326r5752O5934J2462n3485M4482J0768m7645k6373K8353P2380m7919
203D793p0499P5314J095m5998P1533p882o4988K9995K1405K875o515j3315L4457
$$ y = [-1981, 20054, 50761, 17780, -89067, -84666, 31760, -15217, -23444, 101586, 25090, -66395, 18023, 41114, 29201, 9767, -45951, -12036, 4896, -5471, 43637, -14555, -56405, 42203, 37643, -6808, 15674, -3226, -12900, -44813, -67478, 31086, 27416, -56326, -10049, -10603, -25701, 63592, 51461, -25727, -37544, -9195, 59483, 24079, -57017, 17270, 27534, -42026, 24543, 48175, -1717, 17033, 9245, -13063, -15779, -3884, 51359, -14174, -102448, 12064, 53348, -29046, 3677, -2202, -53613, 8617, 47488, 12748, -30630, -26381, 40173, 1540, -44214, 59914, 41588, -54164, 11770, 24232, -29253, 15229, 25997, -21648, -48021, -19668, 52712, 4793, -65706, 9608, 10703, -35295, 36238, 28356, -36632, -6637, 14768, 17643, 11128, -2187, 32270]
216C2270l0579m1900O9858q269n1529M3829j8889l6516M8813R696j4590j6282
228a4088j5312M4231k790k8268M0767l2776l6439O9715j127l3337K1897j0905
240A568L592P583j8976K9334j3482m1087L7104q984k2516M4250j6018k3340J9223
253a749r658K6807R290m8388J7195R631j7231L6540j5019k9090L3869n863J3J7332
267B3679l0374J0595P409l6113K1568J799k4577K9676j5243k0516M1010m01m428
280D084N175k7524K4446J7246l0573J7989o449k3228M1613j747k2636J8164j1586
293D974M269Q237l3624J4896P590l3943J8186j833j7338L5595p506j7859K0349
306A993j1107J1691J3736l4536R991J1843j4936K7179q990k0268L6970m367j3379
$$ y = [32270, 1691, -40209, 29649, 21380, -30149, 13680, -5209, -41725, 7088, 16784, 2194, -14088, -29400, 14831, 12041, -16227, 24540, -8236, -44675, 25040, 23913, -9424, 12473, 1568, 5160, 12743, -6233, 23101, 9619, -31468, 5636, -3348, -25864, 18386, 2368, -20972, -1749, -11407, 15400, 24690, -23698, -6503, 3128, -14103, 22437, 7418, -21672, 12197, 6334, 6347, 23679, -6695, 3900, 11309, -24804, -3236, -1437, -26014, 3662, -11581, -32097, 8913, 8512, 4084, 9259, -18265, 6181, 23427, -7146, 10843, 4394, -18834, 22779, 21032, -1604, 16560, 4974, 9243, 17480, -16144, -1248, 6342, -27601, -9415, -11248, -28586, 7009, -497, -18356, 1993, -9114, 2577, 16313, -18223, -8232, 3611, -11325, 15854, 6864, -13404, 23566, 19199, 5820]
319E820J7502j8695K823R906k8440R670J025j8500K7579j1026k4111L2300l366
332B487j1876J1665k0256P821J5157k1599J3248J586j3045L3694n568k0777K6688
345A9225o808p001J3191k4447Q72J3612j5456J0228q425j3327L4009j0773k2010
358a7110K5456j1889q965J8953j7686j119J1386n596J6347j2105j0860L8446j1761
371A3497k2588K2982j3612n295K0621j9126n743P530k859J8540j3904j5182K8830
384A3691j4082j3971K3684j9152m670K3796j5675j468J1358j28J4922j5638j1086
397h419K7872j4585j0476J9469k5038m920K6427j0767j368J983q037J5876p862
410A55r217J9932j8092q208K1212j5386L691J7359j6586Q124N596j3017J7809
$$ y = [5820, 23322, 4627, 7450, 17356, -11084, -1414, -389, -18889, 8690, -2336, -26447, 5853, 2487, -9389, 2276, -17980, -10159, 4998, -16601, -3353, -1767, -14812, 18882, 13314, -7463, 19225, 12417, 5416, 18607, -5840, -4968, 8644, -6812, 3416, -5009, -18336, 15673, 4900, -17110, 8346, -3543, -12508, 6445, -11241, -12360, -974, -6570, 9777, -2328, -13188, 25258, 13497, -9091, 13891, 279, -5016, 15605, -3521, -9264, -1734, -4593, 13947, 43, -15139, 13691, -391, -14362, 9322, -9830, -14500, 9296, -6379, -7847, 3511, 3383, 18305, 2667, -8419, 19453, 4868, -5608, 13861, -11177, -16097, 10330, -437, -1805, 178, -7859, 8017, 155, -9062, 10870, -7222, -15430, 5782, -9604, -5913, 11446, -5140, 2984, 8580, -4437, 13372]
423A3372n006j7700J1186j1290j297J6876j4342L649O585j3747K4351L767k7796
436a1392J4690M85j2608J7920o810j1264Q600k093J1941j897j1728K9903r725
449A6022l6923K4493N409k1026J5717l073j6826P700J3739Q959k6838j1280M7866
462B3939p736l9601K6707l195l0442K7110J4379j8284L259J8796K046l6488j39
475a9649N6580j8209m1675L3267n739l0934L3749P487l2217Q225L5488K925m6278
488a6980n129M5840k6164k5502N0230r849l9228L0040L236l2156J6414M0566k247
501B9071m9794j671M4176k8988k2814M8275j2954k9669M0101J954l9642O756L1733
514A6534J893l0021J0510L2338m2738k3653M8257o613j7030L8125p708l8287P718
$$ y = [13372, 8366, -9334, 1852, -9438, -10735, 6141, -8201, -4552, 2033, -11714, 12637, 16404, -11392, 3298, 3783, -8825, 9095, 2285, -8979, -379, -2472, 9469, 7572, -4156, 25747, 16022, -20901, 3592, 9001, -12025, 3692, 619, -16207, -8507, 5232, 14191, -12647, -23927, 23939, 16203, -23398, 3309, 114, -30328, -3218, 11161, -7123, -3864, 14932, 16978, -19510, -19649, 36931, 18722, -22953, 10314, 4575, -26359, 7390, 14877, -17340, -9115, 26373, 29298, -16980, -22109, 23731, -2433, -27935, 22295, 12446, -26782, 3258, 6494, -25662, -9248, 31318, 29071, -20723, -22394, 21782, -7206, -30020, 18255, 5301, -24368, 15733, 17687, -21955, -15199, 16534, 18427, -11594, -1084, 31254, -11484, -35137, 13120, 6507, -10523, 27602, 19894, -18393, -10675]
527a0675K3876q16k4748Q285K7409l4085j6700L8279j3954j9161K9820N01j4424
540f393O591J670n909j6734J1578L6142k0081k1816K4277p435j0901J9856j72
553A0673k951r73q325M144j1282j997K7776j7118k1964K7522N156j5195l768l654
567a1956J3257L690o675J1476j6616j3401L4328m374k4769K3140J2286j8356j3601
580a1571N971K1433j0599j5436K0957j3461j5535L8055p604m0985J9695K8004
592A8924j1921j9990N603J8252j9197p561L5258j5960k3564L8506o108m0665K3973
605d450K9553j8639k3729J1855K1363k1527o181L1702k5197k1652M8477k791m4235
618b5451J7482K3622j7081j3438J9731J6128l0266n612L5311k2999j9276M5517
$$ y = [-10675, 13201, 12385, -12363, -4078, 23331, -10754, -27454, 10825, -3129, -22290, 7530, 8031, -6393, 198, 1868, -4041, -20775, -9197, 26945, 6864, -14952, 9325, 1890, -9011, 10845, 10673, 7722, 6749, -1576, 2568, -8714, -10711, 17065, -53, -22017, 5505, 10661, -4534, -8302, -11956, 1301, 4991, -1684, 9792, -6824, -20225, 14103, 9729, -15040, 8100, 20386, 2030, -11571, -5600, 15833, 5234, -10202, 10755, -2706, -18241, 19814, 12210, -28775, -9080, 18924, 7003, -12987, -7384, 10868, -8329, -15890, 19368, 3408, -20156, 18350, 12242, -28423, -4450, 25103, 6464, -17265, -5410, 15953, -5574, -11755, 19947, -5250, -26902, 21575, 18784, -25451, -7969, 15653, -1428, -14866, 4865, 20993, -9273, -14885, 20426, -2573, -21849, 23668]
630B3668p654m2352K0838K3227j6521j2818J4891J0764k4861K551L2669k7763
642c361k2553L9437m655k7885K1738J0948j9608p604J5808J1534k0870k96K5274
655A7907k3636j4608L4964o143k2695J7069N623j0669n16Q833N364k1279k502
668a2288K7158j4728j4426K2151q592j3427J7338L325o798l113K596R000j3451
681e255l807K1433j1990j2635J8611l979n595J1509n400m763l58K397J1721j2696
695h07j2077J7593m712p360J3666n047m453P597l414J975k892m318J2035r421
709a635j1065J7746j349j0108P978l915j9P208l977J938p136n999J6213m560j2035
724a0715J3562k214n794J0427l332l33K951n139N272m077p237J4919n406j2260
$$ y = [23668, 16014, -26338, -5500, 17727, 1206, -11612, 3279, 14043, -10818, -8267, 24402, -3361, -25914, 13523, 8868, -19017, 2721, 13669, -5939, -13543, 2265, 13799, -7071, -7367, 17907, -5729, -20337, 14627, 8484, -14211, 2858, 8481, -2188, -2704, 6129, 11493, -9786, -12288, 14870, 142, -14284, 7867, -725, -14152, 3186, 6511, -287, -3400, -804, 8196, -5255, -9062, 12371, 381, -12254, 6357, 2378, -3217, 8292, 2892, -1871, -2229, 168, 11889, -807, -12884, 4709, -3, -7363, 6303, 1256, -3197, 4400, 986, 2961, 69, -4249, 7786, -1635, -12700, 5046, 3697, -6411, 1567, -2348, -2367, 4841, 864, 2802, -4334, -10333, 5880, 1320, -10715, 2847, 633, -5161, 5266, 1934, 1601, 4552, -587, 4685, 608, -6629, 8290, 2884, -9376]
738i376J2763j088l436P929o612k079K657l059P719o260r985J3555k021p593J1528
753D642l799m550Q082n031M19J599n199P032m781q563J3422j109p301Q722m850
768a265j516R039n468j91o6n852R742j270r413R810j973m727R245n729j692O465
784E139o601J169O32o193R116j674q887R377j546k747Q421p455k520P072m960
799a657L065k49q052Q664L43o636Q292m148k434Q427p197r46N825o152L579Q34
815A558q008Q639Q23n499O131n150j145R008p278j337M577o694N464J831q137
830e217O349K2l921P067n546j282P477o931O08M353p207O173K320q344N722m9
846A594l064O199o145j661O548o047K687K851q917O613L292q049N926r58l549
$$ y = [-9376, 3387, 2299, -1137, 6792, 180, -1899, 758, -2301, 5418, -842, -10827, 2728, 707, -6886, 4642, 843, -3707, 4375, -656, -237, 1362, -3837, 3195, -1586, -10149, 3273, 2164, -5137, 3585, -1265, -2781, 6258, 790, 599, 533, -5319, 4423, 3153, -6260, 3550, 1577, -3150, 6095, 366, -1326, 5139, -1462, -293, 339, -5854, 3262, 1588, -7299, 2078, 532, -2215, 6206, -1249, -3769, 3303, -1657, 1408, 1159, -6893, 1771, 2114, -4522, 3770, -378, -2812, 5615, -1582, -2528, 3297, -2855, 724, 1558, -6450, 2189, 3012, -2487, 3644, -1506, -2651, 6357, -921, -2258, 2319, -4375, 1089, 2920, -5217, 1132, 1154, -2767, 4300, -1246, -2528, 4949, -1982, -1374, 2979, -4228, 1945, 4265, -4079, 1643, 1594, -1470, 4729, -1416, -3077, 3471, -2576, 111, 2962, -5955, 658, 3950, -4099, 1827, 869, -2680]
861b680O605m418j547M421m811M231J597q910P239J945p497O621k404n348P651
876B695k436k954K482l260N445L69q077P890K11o562R002m195o454R683j335m086
892a582J348j496N034j269o112P575k896n337J1181o089q240J1703l27o038J682
907h63o6M102k429l696P389o275k811J3140r041q642J3445q46p031L431M02J313
923A522k807o39O311p922p55J3469j0659p298J4499l006o693N134R3n61j995L64
939i43M530q537P88J2864j0906m807J3278n603n695P184o00j033j408L48L825
954C285p245J333R920j0104j569J1790q137m165P234k337p2m96j162M583n114
969b256m84O789p450K134Q956q872j538N028m059L242n05m135O575j968l624L530
$$ y = [-2680, 3925, -493, -2040, 2381, -2430, 1801, 3398, -5512, 1727, 3672, -3825, 2796, 392, -4956, 2695, 259, -2695, -213, -3473, 1972, 2341, -5736, 2154, 2365, -4197, 4805, 610, -5844, 3839, 2504, -1582, -234, -1730, 3304, 2035, -4077, 3498, 602, -4735, 6446, 357, -7883, 3820, 3493, -2545, -863, -929, 3173, 744, -2952, 4437, -1838, -4649, 8491, -550, -9192, 4253, 3407, -3624, -193, 209, 1522, -1285, -1924, 4387, -3535, -4290, 9179, -1480, -8778, 5721, 2715, -3978, 1156, 1249, 688, -1307, -943, 3587, -4950, -4162, 8702, -2204, -7011, 6267, 664, -5031, 2153, 1553, 520, -888, -540, 3285, -3960, -2627, 7293, -2811, -4380, 7410, -727, -4892, 2342, 5, -67, -563, -1725, 2858, -2256, -2740, 4049, -3401, -1267, 7689, -1183, -2721, 2307, -1752, 1490, 985, -3150, 3425, 1457, -2167, 1363]
985A363m454K668N362p327J814J568n151O437k614o887J0691J598p157J758j527
1000a858J533K231l347M383k684m129R472o500r871J4488L047r786K548J669j890
1015f94j200j35N439n372p71J3805j0990j3004J7361K910j2116O393M508o111
1029B3l514K857L364q656K846J6858j3990j2889J8740j313j4377J0108O681p207
1043d69k461M862J03j2078N841J7856j3425r681J9074n496j5782J1775O206p753
1057a428P2O962j315j3402M456J5876j3889n556K0000p491j5104J1195K825q208
1071e007J702Q471k92j1683L059J1372j3731k664J9815p566j1484J1289N47q475
1085d647J913O408J559p783K738Q514j3451k218J5425p351p831J0921p11o122
$$ y = [1363, -3091, -423, 4939, -2388, -574, 994, -4157, 2280, -334, -7221, 3470, 5068, -2089, -331, -1858, -325, 1906, -1441, 2942, 258, -3871, 5601, -899, -10770, 3718, 6765, -3021, -473, 1196, -694, -1894, -2029, 3410, -1962, -2733, 11072, 82, -12922, 4439, 7349, -4767, 1626, 6134, 23, -3491, -634, 2730, -5926, -3080, 13778, -212, -13101, 5639, 4326, -10051, 57, 6738, -469, -2930, 1932, 2035, -10043, -4202, 13654, 229, -9452, 9622, 4126, -11656, 119, 6325, -1428, -1356, 5606, 4291, -9111, -4655, 11221, -2668, -8224, 11776, 4285, -10819, 376, 3201, -5007, -3305, 5166, 4874, -6809, -3750, 7622, -6109, -8773, 11042, 3476, -8008, 3281, 3828, -4647, -2734, 3674, 5233, -2550, 188, 8702, -4749, -6967, 8458, 1107, -6724, 4197, 3486, -2636]
1099b636p92K383L145n136J305Q238r708k916J2018o511n900Q109P49j832j425
1114i09p71M932n097j721Q567n874l156J0005m970n793M874Q84J720k763j749
1129a821P077m699m516Q598m618m352R194j890m978J123J95L354m852k219R566
1144E162m591o212Q945m331o273Q949J019m179m69J648L856o192k715J1124n085
1159F56n618J0714l822p709P266J209l475p20J990M254o698k983J0479n634n342
1174e433J1556l523p823O720R05k749j052J291M536n880k354R402o706n025J1055
1189D920l432o460N964O51k234j312Q16M373n134j420Q637o366m234J0132l430
1204A471n292N115l03r23n74n28L734m254j797Q047n589m005Q925l186l776L757
$$ y = [-2636, -3428, -1045, 2100, -3036, -1731, 6507, -3201, -6117, 5901, -610, -6510, 1599, 2348, 516, -909, -1680, 3252, -1845, -3566, 5001, -873, -4029, 5976, 1006, -4787, 87, 971, 2691, -72, -1821, 5256, 557, -3959, 4639, 21, -4331, 4863, 2973, -2005, -882, -687, 2667, -2185, -4404, 5162, 571, -5641, 3304, -1027, -7300, 1649, 2668, -1511, -1980, -332, 3524, -2668, -5383, 5741, 656, -4962, 5752, 1930, -5779, 1487, 2696, -779, -1499, 491, 4745, -1953, -4936, 5543, -91, -5433, 6123, 2600, -5223, 1497, 2402, -347, -1399, -108, 4428, -1452, -3806, 5596, -1110, -6135, 4920, 1488, -4972, 992, 1643, -591, -1903, -1087, 3286, -1848, -3268, 5369, -997, -5231, 4901, 1471, -3821, 1294, 991, 68, -506, -1034, 2700, -1554, -3351, 4696, -893, -4898, 4027, 841, -2935, 822]
1220H22j104M86l69j554M472l469k337P422m966l398P217k279k348L099k713J736
1236G17k46k161M668l045k698P226m257l608O037k336j263K590k992J958j85k875
1252b470M496k758k303O095l370k852M876k670L73K484l936L027k97k795M689
1267B589k436l076O037k715k394L862l032J091J799l888K691j9l077N046k674
1282a96k810N433k237j162K851l244J744J822l932L111l71l292M742k017l307
1297b865M635k289q92K662l409J792J383l746L596n90l352N429j883k910M476
1312B037j979m07K724l246J784Q83l073L567j257l714N505j920l552M090k130
1327f88n65K579k903J023P37k313L666j898k925N911k600k545M568k826l87L283
$$ y = [822, -282, 204, -165, -1719, 2753, -716, -3053, 4369, -597, -3995, 3222, 943, -1405, 1694, -1019, 717, 471, -1690, 2978, -67, -2765, 4461, 204, -3404, 2633, 297, -966, 1624, -1368, 590, 405, -2470, 2026, -732, -3035, 3060, -310, -3162, 1714, -956, -583, 1901, -2035, 992, 695, -2100, 2589, 153, -2923, 3114, 399, -1995, 1867, -1165, -74, 1725, -2163, 528, 509, -2568, 2478, -196, -3006, 2427, 190, -972, 1879, -1365, 379, 2201, -1731, 1380, 1009, -2283, 2459, 442, -2865, 1770, -519, -1411, 1251, -2158, -366, 1017, -2729, 867, 277, -3075, 2354, 471, -2439, 2037, 58, -349, 2375, -871, 913, 1796, -1277, 2290, 1033, -2681, 2824, 904, -2648, 1442, -688, -1253, 1326, -1577, -554, 183, -2130, 1536, -362, -3287, 2624, 24, -2521, 2047, -779, -1166, 2117]
1343B117l259J050N68j835L558k588j963N258l105j784N058m020k63L699l254
1358g63K52J049j405K874k696j094M307l580q15M921m611J5M169l742O71J377
1374I29j609J972j720m00L530m244L51M727n370M68M498m708P95K403k926J528
1390B24q57k0K484l878J187L469n021J757L105n042K613K013l433J332J89m44
1406c22K057l203J472K237m325K411J817n416L591K031m353K087N66j471J887
1421A066j802P04J412k890L326n74n019N239J040n546L662P75l145K272m14q63
1437g57O97o64L452k854l931O586r45n517N915Q6m209L549j30k832M75J386K547
1454B854l739k358O673l358n069P047p03m312N112j51m367P24K347J784l897l16
$$ y = [2117, -1142, -92, 476, -1359, 2199, -389, -2352, 2906, -199, -1983, 3075, -945, -1208, 2491, -763, -511, 538, -867, 2007, -689, -1783, 2524, -1056, -1871, 3050, -1561, -1546, 2623, -1119, -448, 929, -680, 1292, -428, -828, 2702, -1542, -1191, 3536, -1834, -1366, 3132, -1576, -781, 1622, -1304, 224, -633, -653, 1831, -2047, -860, 2609, -2412, -655, 2450, -2592, 21, 2034, -1399, -67, 122, -322, 1735, -1468, 4, 2241, -2084, 327, 2144, -3272, 319, 2350, -2003, 84, 650, -821, 1066, -736, -32, 1380, -1510, 1816, 1242, -3777, 1462, 2502, -3044, 618, 1393, -1752, 520, 106, -757, -60, -724, 2728, -126, -4057, 2529, 1584, -3933, 1982, 2068, -2141, 1408, 1278, -1554, -1079, 307, 2854, -885, -3243, 3430, 72, -4997, 2050, 1347, -2965, 2147, 1996, -2371, -1647, 700, 2484, -1413, -1729]
1470a729O766n220m147P179k326m327O925j36n212R73K050k54l698J930O177n590
1486f39k692P047m312m054P466m34m401K340J845j994l540K289M864n062j169
1501b446P106n474l817O744j888l052L939R60j705k854J525L633m420J10O488
1516D849m391k532M838l063k115L347K11m00j172j70K782m038o59N250k897j142
1532a302L585l183n64K056j431J047n95j77K870k704j962L509j811K3K166k193
1548f66J135N66k763K189n32j900M423j192k976K638m06j049J60q66K750p13k533
1565a735L435j864l626N180k55l545K948J105j832j117J27K901j732j548N193
1580C635k728m526N892p73m924L985K038k398j404Q00J941l378q95O457l443m226
$$ y = [-1729, 5037, -183, -4330, 2849, 523, -3804, 3121, 2985, -2227, -1254, 796, 542, -3156, -1226, 4951, -639, -3331, 3716, -596, -4650, 2816, 2382, -2019, 321, 2166, 172, -3368, -1079, 3785, -1277, -2446, 4660, -814, -4631, 2113, 225, -2827, 1112, 2072, 367, -2487, -962, 2671, -1749, -1639, 4849, 458, -2074, 2764, -299, -2414, 933, 1144, 744, -428, -598, 2184, -1854, -2513, 2737, -160, -1302, 2283, -900, -1464, 592, -839, 208, -387, -564, 2306, -398, -2360, 1149, -662, -639, 1527, -666, 469, 1035, -1728, 461, -71, -1971, 2452, 1260, -1716, 922, 516, -533, -373, -1239, 1511, 798, -1735, 1700, -164, -3790, 1390, 1135, -2410, 538, 1643, -189, -1306, -1179, 1722, -10, -1558, 3635, 907, -3619, 2273, 1500, -3424, 561, 2599, 201, -1203, -403, 1538, -1840, -2735, 3722, 279, -3947]
1596c947O657j377n548M176K499k510q30J508J625m134p39O478m118l378O695
1611C057j533n179L950J354k460r85K314J854m479k79N878m219k991P248j611
1626A919m749L862Q36k701m6J533J806l768o16N438l842l014O034j743l609L596
1642I36L74k115m71J224J498k874p04M862l332k606N633j822k770L068l96j145
1658f40j34M58J980k531j135M691k722k081M771j646k233K262k81n36m34l91K366
1675A764k182j515M254k255k527L961j209j500J494o48K07p46q49L044j995j687
1691b389M422j912k110L488j052j261J077n35R63r67j024K908j633j769M145j530
1707H21j940K630j172p13R31n85J347j364j321L041j573j811L628j470j931K547
$$ y = [-3947, 2710, 1333, -4215, -39, 2460, -50, -880, 628, 2253, -1881, -2620, 3858, -260, -3638, 3057, 1524, -3655, 295, 1649, -811, -1796, 518, 2372, -2107, -2386, 3492, -727, -3718, 3530, 1919, -2830, 1032, 1868, -833, -879, 654, 2460, -1308, -1924, 3514, -328, -3342, 2692, 949, -2660, 936, 1310, -805, -1276, -52, 1446, -1428, -2132, 2730, -602, -3208, 2425, 603, -2167, 901, 505, -640, -774, -316, 1664, -867, -2002, 2689, -33, -2114, 2657, 1011, -1222, 1040, 759, 223, -211, -602, 1764, -418, -1933, 2321, 66, -2461, 1500, 291, -1209, 285, -363, -156, -902, -1751, 1293, -702, -2389, 2033, 121, -1989, 1499, 447, -814, 263, -272, 691, -276, -1300, 1608, -25, -1794, 2351, 821, -1119, 1511, 339, -374, 557, -28, 1319, -45, -1366, 1675, 102, -1709, 1919, 449, -1482, 1065]
1723A065j349l80O32j326J858r88j188L008j257k187L443j158j278K129q61l91
1739b28P4j045K123p32j512K822j180k029L161j220j285K155j169J61K97j275
1755h82J839p77j823L086r59j992K938j617q62J794p98M08k38j492J784n11j482
1772a584K868j308j302K790j567o68J864j216L59M98j497J987r27j580K681j406
1788hj114K456j672n54J633j637Q39N41j633J441n30j016K090j265p37K385j791
1805e72K91J983k082M79Q74j624R51Q6j299J781j344j60J989k104N07J811k797
1822a230R49J381k137J412o3j207J501r66J61J591k266J068J227k637J293P41
1838H18k297J338N73j244J337o09J90Q63j878J639P95l071J887Q17k840J910M83
$$ y = [1065, -284, -664, -32, -1358, 500, -488, -1676, 1332, 75, -2112, 1331, 173, -1105, 1024, 163, -228, -154, -1199, 924, 192, -1320, 1502, 322, -1707, 1454, 234, -1051, 1104, -65, 96, 393, -882, 957, 180, -1643, 1443, 484, -1508, 1430, -187, -1049, 745, -53, 355, 117, -1375, 409, -102, -1584, 1284, -24, -1326, 1464, -103, -771, 1093, -123, 236, 734, -763, 1224, 297, -1283, 1398, -8, -1122, 1334, -338, -892, 741, -896, -57, 484, -1149, 292, -238, -1254, 836, -429, -1166, 1219, -572, -281, 1702, -380, 99, 973, -651, 300, 386, -913, 868, -476, -636, 1353, -751, -244, 1567, -1230, -281, 1100, -1037, 375, 312, -895, 606, -360, -199, 1392, -874, 194, 1421, -1216, 77, 818, -1479, -141, 432, -812, 525, -84, 106, 969, -909, 730, 1525, -1546, 341, 1158, -1682, 228, 711]
1855G11j716J232k83J09M78j583J584K40k573K312L11k624K017M04j973J730M8
1872D24j33L76j135J218m00j973K609m36k592L117k96k433K260j75r23O37k67
1889a22P58n96j364K332r16j858L412j000k371L247o41j611R68j20R0p35n99K367
1907A241j847j060L361j926j446L455j238j922J834j26n11N2l62J693j901m83
1923a186L173k482j187L694j895j474K236p76p16L80N8Q32j176J06K456k744n69
1940a270L279k206j085K475j338o04R09n15P57r88M09J664k493J04K696k778j28
1957a112K402k028N67R81j111M42l7k38J455k102M92J668k729Q08J721k373J143
1974e1J176j776P28M41j020P74p25L78J036j963J422P49k598J870Q11k602J757
$$ y = [711, -1005, 227, -56, 53, 531, -1052, 532, 772, -1801, 511, 822, -1802, 215, 619, -1354, 376, 424, 291, 667, -468, 750, 350, -1623, 986, 550, -2042, 1075, 779, -1654, 606, 431, -492, 145, -122, 636, 40, -1324, 1008, 92, -1766, 1646, 646, -1725, 1522, 881, -730, 238, 118, 208, -527, -1126, 1241, -606, -1666, 1695, -231, -1677, 1778, 540, -1382, 452, 326, -185, -133, -495, 1198, -703, -1186, 1987, -495, -1682, 2012, 117, -1357, 879, 103, -613, -233, -175, 657, -519, -413, 2043, -701, -1270, 2009, -197, -1282, 1193, -145, -749, 160, -355, 402, -586, -177, 1487, -1006, -902, 1794, -984, -1112, 1290, -738, -171, 810, -301, 141, 104, -134, 1321, -781, -289, 1379, -1350, -542, 1179, -1194, -51, 1125, -651, 77, 518, -502, 272, -453, -75, 961, -1002, 420, 1169, -1429, 441, 1252, -1350, 407]
1991D07M22j555N95q0J76K81j327J961k36k330K544j5k742K590K96k113J263K42
2009C79k77m03k85J768r92j722L261j277k924L393R3k567J550P23q88k28P0J449
2027A123j394r83L208j667k767L713k61k925K530M45j627L85K63Q15j304p76L226
2044B004k326j772L602j221k318K597M01j392M50L44L77j493l03K782k063j497
2060a828L456j395j853K399J37j497Q69p8L19j184l66K132j592j153L385j088
2076F63j764K182q05q36R01l85P81j121p27J654j217q70K903r60j059J837q59
2093C18o95O02p64Q79j48j178K079j180j111K167o27m83J451j306N1k2j065J397
2111C65k91j253K301j098j119J891p46k52J248j225L86k19j361J752p15j179K415
$$ y = [407, 829, -726, -131, -211, -35, 246, -1081, 880, 644, -1686, 858, 843, -1899, 691, 987, -1126, 137, 379, 102, -301, -586, 1182, 190, -1532, 1729, 452, -2472, 921, 1014, -1553, -3, 720, -168, -396, -326, 1123, -271, -1254, 1954, 287, -2480, 1233, 972, -1953, 577, 1022, -605, -220, 43, 858, -446, -1222, 2004, -322, -2094, 1508, 287, -2031, 566, 967, -425, 25, 369, 746, -747, -1050, 1732, -331, -1828, 1628, 233, -1620, 779, 916, -581, 288, 210, 529, -655, -1021, 1111, -481, -1634, 1751, 663, -1101, 1081, 276, -560, 341, -44, 737, -384, -1111, 543, -674, -1544, 1359, 399, -660, 1177, 318, -377, 225, -539, 340, 192, -986, 1093, -87, -1198, 969, 342, -141, 1310, 4, 55, 33, -1032, 365, 74, -1179, 1122, 24, -1095, 796, 50, -202, 1046, -179, 207, -12, -1373, 379, -336, -1515, 900]
2128I00m66j534J703p71l47J000p30R79p19j518K122m10j632K633m67j485J735
2145I93p24m61L33m24P99m48j244K000o98j818K691k27j505J626n75r72N79m74
2163e49J390q04r26J885j124j361K550m55j357J528p22o92M99n22J324m19j105
2180h60K197r75j901K209o31m68J201l73n22m2p24J359m05r21K345j334j307J649
2198D97o12q20J571o18P3O0q04J002l90q70K154r69j026J700j410l49J208l57
2216D0K36M8r89J288q64q13J929q50p72J613j195m47J335p72M13J98p87R75n34
2235E2j053J607o38p57J810j170l32O19o44O49M29j262J045l50j040J499n66m85
2253e87J373q20j12P23j157J130j41j122R09j63r17J404r67j02J349r42K34O01
$$ y = [900, 434, -1100, 603, -168, -515, 485, -245, 734, 15, -1503, 619, 209, -1423, 1210, 743, -742, 993, 269, -192, 141, -283, 516, 68, -1176, 824, 126, -1692, 999, 772, -733, 893, 318, -654, -75, -549, 841, 37, -889, 996, -128, -1489, 1061, 606, -751, 777, 55, -637, -138, -660, 664, 245, -860, 1337, 362, -1539, 670, 39, -429, 772, 399, -123, -165, -889, 470, 65, -856, 1489, 155, -1152, 497, -115, -935, 636, 18, 91, 151, -653, 349, -41, -911, 1243, 274, -752, 948, -462, -811, 397, 40, 276, 324, -665, 623, -241, -1054, 875, 25, -747, 866, -329, -776, 559, -213, 200, 398, -389, 586, 52, -1001, 606, -32, -789, 1021, -149, -481, 138, -506, 143, 572, -690, 355, 5, -1035, 464, -102, -587, 786, -34, -146, 577, -580, 550, 409, -713, 196, 33, -884, 520, -447, -549, 800, -142, 92, 693]
2271F93j311R45K02j330J636p27r73J508q66k5Q11r08M92K89j333J365k36j606
2289a374J668l71p67J253m70n01J173j063R87j20j236J146m28j231J733k20j020
2306h41J582o11k76P78o55K67o8r86J218n58o17J633p47p00J509m70q87Q12o67
2325b84K98j6r72J508r35o85J813r61o92J867j026k72J052j138J72K91p21Q99
2343A98m95k64J816j606j68J715j491J09J164j323L5M55o20O49m58M9J224j108
2361a19N5J305j551j49J424j589J66O38o30P10m08j64J239j217N7J162j610J37
2379e44J340j724L66J047r37N57J81l00N36o65L78N04j543P19J023j838O29P43
2397D72j116P50J38l39M75o34M53K32j250R20O88j834J323N27j527J052K55j000
$$ y = [693, -618, 327, 529, -801, 835, 108, -865, 643, -223, -248, 563, -345, 147, 436, -897, 468, 232, -1374, 294, -77, -844, 409, -61, -562, 611, -452, 535, 415, -821, 325, -103, -1334, 399, 179, -841, 741, 130, -146, 632, -23, 244, 176, -810, 408, -150, -767, 866, 119, -581, 928, 458, -429, 383, -284, 14, -2, -974, 534, -401, -1086, 727, -234, -926, 941, -85, -357, 695, -443, -271, 20, -701, 198, -297, -561, 1255, -351, -519, 1196, -295, -186, 978, -345, -310, 145, -475, 174, -284, -235, 989, -119, -64, 1241, -310, -459, 965, -624, -458, 180, -450, 260, -148, -312, 927, -290, -233, 929, -681, -544, 796, -928, -562, 485, -452, 105, 286, -14, 522, -143, 235, 739, -804, -85, 938, -900, -271, 472, -644, 106, 244, -95, 380, -254, 199, 431, -819, 101, 789, -1045, 278, 805, -722, 330, 585, -415]
2415d15O22j83J6L39j470J520j74j508J650J70j509J335j58p13P55l05J29J06
2433B07p82J256o17r64J921p45j135J699m02j261J154l0k64j8k77P56n10q02J858
2452A044r63j144K139q94r40J367p80p0M00l94Q07n73n08J559j534p17K094j044
2470a51n66J534q62n07R17m23K09k68k02J113j346n3J464j301l06J850j153l16
2488c67R51o57K44m40k16J020q51j8J217j144l22J711j288l96J181q33K37m3l63
2507c77P41o62J06Q81j237K84J120j304K90J051q67M4j83l39M42n0o9Q98r62K94
2527A01N78j451O74O86j083Q37j66p91M49j1k39R75n22K55N43j527P19J87j142
2546i28J181L74j099Q56m00j81M48l16K94M10q30M35M1j282J226J06o88R02n93
$$ y = [-415, 207, 24, 40, 379, -1091, 429, 255, -1253, 397, 567, -942, 393, 235, -478, 277, -28, 101, 207, -575, 681, 64, -900, 1021, 276, -859, 840, 438, -823, 331, 301, 37, 19, -258, 498, -12, -814, 1044, 81, -1063, 1076, 182, -758, 609, -171, -241, 159, -235, 572, -1, -509, 1050, -484, -1201, 893, -151, -717, 817, -45, -552, 365, -58, 151, -117, -319, 794, -552, -605, 859, -442, -748, 1102, -51, -367, 584, -73, 171, -269, -485, 535, -316, -334, 883, -261, -583, 1128, -160, -556, 625, -208, 29, -14, -377, 364, -298, -192, 689, -548, -264, 856, -448, -158, 893, 26, 70, -113, -452, -10, -60, -129, 769, -193, 101, 679, -772, -98, 588, -495, 342, 176, -615, -166, -177, -416, 559, 37, 292, 835, -692, 27, 214, -928, 253, 627, -472, 384, -16, -197, 251, -65, 229, 639, -191, 244, 285, -997, 229, 335, -353, 549, -44]
2565d4k78N21l13L07O5o58N08j92p63J305k95o68J004m50l34O60m58Q2J39n22
2585c84Q95n92n14J372p23p36J360m85p36J180m89j44J5l66P91o35k30J037q65
2604b49k72J424q06m35O32n59N2K80k81Q43o14l92J079j039j81J205o12l41P20
2623D54p07J5J60m44R75k08l67P65p63m81J111o01j63P63n28K4l4m80Q12m20L36
2644B19O03p22n53P80q65K40P28n21J81j64m69O30%l25R24o31l27N26j024M67
2664c03P89p70N76o0m23M54n29l59J243n96m09P89q66K31P31p12N51N1n38M81
2684C31n13l98J025o60J98M74o98K60J40o33N18J98l86N45n12l09P99m84m9O45
2704D91p84O30J91r65P76p9o83J060n96o86Q87m92J92L86m43N40k24n81O24k63
$$ y = [-44, -322, 199, -114, 193, 258, -400, 108, -84, -847, 458, 163, -505, 499, 49, -285, 375, -83, -1, 138, -384, 511, -81, -595, 777, 54, -682, 678, 193, -543, 637, 148, 4, 19, -347, 444, -191, -421, 616, -249, -521, 903, 97, -338, 294, -265, -213, 67, -214, 629, 15, -377, 702, -337, -518, 687, 75, -266, 454, -253, -238, -78, -522, 453, 245, -122, 643, -120, -601, 510, -91, -254, 509, -19, 5, -29, -509, 303, -117, 219, 822, 100, -453, 327, -538, -298, 430, -91, 90, -74, -543, 87, 87, -238, 686, 55, -272, 254, -770, -303, 486, -284, 292, 232, -191, 263, -266, -625, 618, 22, -387, 402, -464, -233, 498, -214, 337, 388, -150, 331, -182, -580, 445, -215, -17, 457, -241, 19, 159, -474, 44, 242, -144, 401, -111, -420, 379, -105, -154, 491, -293, 337, 528, -437, 339, 260, -423, 637, 41, -645, 242, -250, -58, 328, -115, 425, 201, -380, 244, -19]
2724a9m42R39m69o24P66l25n4L18m53M87j51l15M28k91j74N48l23o6O11n20L74
2745B45K46n72L45P2k77L41n78k23R01n85m02Q86o90k2Q41q59L79p9k58N00l17
2766a06k60Q38n62p5O33o91K0N33o59K37L17n03N59m95K8N21p99M76N61j052M67
2787a2M73q31K69M02n91M87j21lK19l87J46M79r89K75N79q52L44J38m00J94L30
2808A49k90J64l88L90L30o87M70n8o04P75L7p86P89r3k78J02k74L84o2n83P12
2829A99o0r20J049K8q87J039k34l95M38l17K51r1m80M19J08o74Q76j31q48J099
2849D69l05m28M95m31N5J89l99P51k79l76O34k59n23R92n55o08J060r00L43R9
2869B4j23J11k37k5R76q99k41Q56m79m27R83m34j23K59j99K48j96j59N81o67k50
$$ y = [-19, -461, 478, 9, -615, 151, -174, -228, 90, -363, 124, -27, -342, 86, -205, -379, 169, -154, -220, 391, -129, 245, 491, -81, 264, 336, 59, 400, -178, -401, 500, -85, -487, 399, -291, -313, 528, -331, 48, -31, -289, 211, -106, -366, 472, -90, -165, 468, -223, -203, 330, -329, -92, 225, -278, 281, -214, -186, 335, -464, 12, 573, -479, -12, 461, -370, -101, 301, -290, 197, 76, 73, 292, -95, 51, 530, -459, -184, 395, -457, -113, 25, -375, -181, 149, -141, 23, -365, 25, 355, -332, 138, 80, -524, 251, 288, -498, 291, 198, -80, 22, -252, 132, 70, -513, 199, 139, -781, 268, 296, -591, 448, 214, -181, 257, -60, 191, 100, -380, 39, 147, -527, 349, 218, -630, 469, 164, -264, 231, -200, -145, 44, -355, 396, 117, -259, 375, 116, -407, 585, 30, -578, 482, -418, -75, 24, -99, 12, -225, -250, 726, -173, -414, 442, -37, -464, 519, 85, -38, 221, 22, 270, 74, -85, 496, -171, -421]
2890d21R74p04k94J017q14K93J45k13J86k88j60N19o04j31J002j091K37J058r45
2909b34J53L28j79k81K65K4L37q49L26N18q59L98N38p79M9P53q04M56J45l86J94
2930A13k80N9M80p91M37N40r31K96N66j201Q33K63p03M70k93p3N21n80M00M05
2950E31q00M69J32p00L70J65n45K64M0j15K54l01K74L58q42O25m9o69P11L1m83
2971b80O68k66k17J85j95L45rp21P30j13o29R01k29p71O00L2k21K09K4L22k73
2992I2l41N78m80n24Q39q6m03P73m03l18N17l79J14J36m20N82m41k15R86o65k09
3013b67P36m19k30L86l47J57j42j86L56r5m6M60m02m39J017n49l07P49n77J55
3033A0J87m54L90k00m13O91k83J04N78o11k11N14m77j7K66m16L94k21j42N94m32
$$ y = [-421, 553, -151, -445, 572, -242, 51, 196, -17, 169, -119, -279, 240, -364, -495, 507, -584, -347, 711, -234, -81, 247, 68, -213, 52, 76, 413, -436, -110, 408, -451, -53, 485, -294, -245, 508, -296, 160, 305, -81, 113, -167, -108, 372, -419, 18, 558, -373, -77, 489, -712, 121, 384, -319, 151, -142, -215, 306, -274, 126, 531, -269, 200, 332, -368, 2, 167, -378, -114, -74, -189, 65, -236, 38, 396, -446, 179, 130, -539, 172, 203, -280, 388, 122, -95, 90, -105, 240, 231, -490, 240, 127, -502, 399, 170, -601, -1, 31, -190, 19, 43, 365, 92, -249, 329, -151, -675, 164, 78, -325, 448, 45, -273, 244, -135, -21, 115, -305, 277, -164, -379, 607, -58, -267, 469, 50, -180, 206, -141, 16, -126, -312, 44, -51, -97, 363, -39, -478, 539, -10, -317, 432, -145, 10, 197, -257, 133, -67, -480, 211, -72, 32, 610, -1, -212, 302, -175, -192, 74, -342, 52, -169, -311, 283, -149]
3054a49O3L89m20OM99o97L19L55n92M43j60j77L06l58L39k0m06K79L21o61M62
3075A41m5n29O39j5m78K97j05k5J46o0kM51o88M1M51n78O73m44k8M82o15K62K23
3098A94m94N19J46n59J77J86l91N43k00l55N08l07J36K96q42O02p3l57M23m2n06
3119c96M23m7k33J18j08J47L30n04L59J27m74N09j36m63N11j93j07M17m36K78
3139A22J32m98K34P3m57M13j54J11L58k45j58J60m56L49J48l57O49j97p62M72
3159f3K00m07L03mj63J25l94K83K02n57O87P2p76P88j54m64L79k49K36K44m40
3180a52K11J18m87N08k26l05L20m3p4L74l88M1M33n53K73K03o15L45J99m76N04
3201B10l7l06j8j04l6M40l88J18M14o90K80J21l77N59j49k10N26n08J57J45o31
$$ y = [-149, -86, 303, -117, -111, 388, -309, 10, 365, -227, 216, 56, -121, 185, -173, 166, 146, -260, 19, 340, -321, 141, 96, -433, 206, 191, -287, 10, -95, -120, 26, -34, -36, 415, -273, -232, 219, -359, 314, -130, -158, 324, -291, -29, 194, -300, 219, 365, -194, -17, 169, -222, 321, 121, -234, 274, -33, 103, 399, -443, 159, 86, -271, 152, 110, -396, 27, -20, -253, -135, -243, -96, 234, -270, 89, 216, -258, 251, 115, -348, 163, -30, -137, 280, -156, 122, 254, -244, -10, 63, -394, 19, -135, -24, 334, 89, -69, 91, -365, -16, 132, -225, 424, 227, -535, -63, 137, -270, 33, 29, -134, -9, -403, -120, 82, -475, 212, 284, -492, 296, 142, -322, 57, -192, 44, 288, -152, 59, 177, -310, 198, -28, -333, -13, -56, -130, 244, -144, -103, 330, -223, 50, 253, -362, -17, 182, -294, 210, 173, -133, -151, -255, -291, 149, -239, -121, 293, -397, -117, 4, -373, 186, 37, -173, 353, -155, 2, 147, -484]
3222d84M34L54p37M62K37o07M71j16l16M64l69L58J61m76J98j01l75N89j35l81
3242c69O45j15l8J55m24J26J10m03N80o6o35M84J28l90L84j60J75j73j17J24M9
3263G0j76J77k23p3N27k63j59N80n05kK05k83N0K1k09K75k32P8L63k20j88L61
3285A74l79k7M36l75K58R8n16K11jj79M79m03OM71m58L2L53m49L56O4m01M36k02
3308a6j95L38j93l8L69l42oL32l84J14P4j94J41r3k3L84l32j0L25l89O8L49n94
3331c15M35K34n78L47j58j16K49j04p5K02l18K37J13l22K06J82n12M01J02m71
3351b61N93j82O9j5l64K01K74o68M14J94n24K95Pl36M65k34K50N4m84J89K23o64
3373e04O28J28m83L77j61j85K82J0J08j51l10N34r8m18K25J19l87N50j8m55L95
$$ y = [-484, -50, 304, -433, 29, 266, -341, 130, 14, -302, 162, -207, 151, 312, -164, 34, -67, -442, 147, 12, -369, 276, 161, 123, 278, -146, -20, 90, -313, 267, 201, -434, 50, 178, -212, 172, 12, 187, 14, -103, 21, 70, -106, 71, -152, -225, 302, 39, -120, 460, -45, -47, 158, -125, -75, -54, -263, 12, -220, -142, 221, 1, -187, 174, -205, -232, 204, -171, 87, 185, -331, -120, -121, -300, 179, -224, -218, 253, -205, -173, 180, -269, 87, 151, -250, 186, -16, -211, 127, -66, -104, 265, -77, -83, 249, -135, -21, 53, -141, 0, -93, -116, 268, -64, -74, 251, -138, -70, 279, -315, 120, 354, -224, 123, -35, -151, 98, -6, -81, 121, -197, 40, 153, -169, 37, 219, -293, 108, 210, -261, 332, 150, 219, 204, -160, 41, 315, -353, 61, 255, -269, 26, 33, -303, 162, -72, 178, 232, -252, -63, 160, -504, 124, 252, -231, 146, -15, -200, 82, 92, 200, 49, -261, 273, 175, -243, -18, 101, -286, 264, 246, -209, 186]
3394A86l03l5L45m36N73k62k30M25j86l25N49m58j54M05j04k05K77j00m9O9K4
3415FQ0k50j26M66k82l4K4N0q4J39j76K42l27J95K04l68L14J89l29j47M89l01
3437b6O9J75l77J96P5l45L74j96K3J45m01M18J34k81j38L43l67K14R7j90L3Q5
3459F0J0K26l42J08L81m56N1J81m40K81J17l13qO5N2L59n58K29J88n06L81N6j73
3482e1j0J10k20K04q7M4Q2k59K18K64m27K05J24m71L28O3j99J37J23p6Q8k03k66
3505b79L22l04L98M7m31L58J27k69K39l04jJ30k7N4q6k80L61j6j6J58k41q2M10
3528B68j69k45J65k70K90q4%J49J8J4l3m4k32J20L88k72j64p5K53L3k93L84k69
3551f8k13L58j10m7K2J61j22K68n44M10n8k01L83k21j18L45j22j67J24j13k57
$$ y = [186, -117, -152, 193, -243, 330, 68, -162, 263, 77, -248, 301, -157, -311, 94, -10, -215, 62, -38, -87, -18, 6, 86, -164, -290, 176, -106, -140, -116, -66, -150, -11, -187, 55, -272, -77, 127, -241, 73, 262, -67, -214, 275, -26, 43, 218, -159, 37, 112, -233, 141, -55, -32, 113, -288, 130, 264, -17, -155, 188, -179, 35, 132, -58, -25, 60, 70, 296, -46, 62, 443, -13, 38, 219, -221, 60, 177, -136, -144, -79, -27, 332, -226, 3, 191, -315, 66, 122, -51, -61, 49, -171, 33, -54, -10, 72, -187, 31, 295, -132, 73, 197, -274, 54, 117, -82, 55, 178, 102, 190, -13, -279, 43, -261, 137, 184, -247, 111, 238, -31, 208, -96, -97, 33, 6, 60, -26, -306, 55, 39, 23, 181, -60, -142, 268, 99, -146, 19, -251, 39, -45, -45, 104, 122, 136, 103, 59, -173, -53, 335, 63, -101, -176, 77, 110, -183, 201, -68, -281, 77, -33, -80, -58, 103, -19, 249, -295, 115, 57, -144, 239, 18, -100, 245, 123, -44, 80, -33, -290]
3572b90K80K1L08k86l06L73j27m1K81j09k78K47j70N2p3p9J85qo6K37j75j28K01
3595D9j18j32L80r4o1K6J57q8O2n40O67k55j78l4J76r5O8L8j18K00m48N35j39
3618E8k10M34j11k60l7K49j86Q3J19L3N0m16K40J1k21K14k41OK94Q3l88M38m37
3641a95L51r3m02N45j78j94P2O2j12O7r6K87J43m11J94j70J10J48l15p8L38Q8
3663A61n45N20l48J42j56K19J09PK8LP1l66K2K46j17J80k05J06k00J46P7J07l33
3686a26M54k36l39M22o5p6J8K6q3J95j31L6j05k77M51k5k38K93m05M6L11Mo8N5
3710A37q5m4k36L39j26J29k08K36j20j80NN4K8L40l68J06jj91J78j2Q8L3R5k48
3734e1J02j37k6J43l28M62J23m30K71j93n2M25m81j04J90R7J48k20QnJ77L2MM2
$$ y = [-290, -10, 11, 319, 33, -273, 100, -27, -68, 213, 104, -174, 73, -97, -45, -118, -197, -12, -20, -86, 151, -24, -152, 49, -69, -201, 179, 85, 24, 50, 207, 119, 181, -359, 308, 53, -125, -159, 17, -78, -10, 28, -90, 110, -338, 197, 58, -152, 282, 171, -89, -126, 123, -63, 20, 139, 172, 222, -194, 46, 57, -164, 50, -191, -185, 109, 192, -196, 242, -195, 156, 63, -339, 206, 28, -166, -94, -32, -144, -77, -173, 114, 257, -154, 40, -130, -20, 128, -187, -265, 73, 161, -384, 136, -212, -70, -226, -7, 102, 109, 137, 140, 211, -155, -133, 113, -4, 176, -29, 77, -123, 23, 100, 207, -126, 328, 92, -247, 175, 110, 34, 52, 78, -5, 190, 59, 95, -10, -287, 164, 139, -99, 194, -211, -165, 146, 150, 82, 137, 52, 8, -228, 111, -15, 114, -94, 142, 22, -158, -153, -99, -71, 269, -99, 7, 6, -185, -7, -19, 69, 102, 197, -51, 51, -86, -112, 31, -297, 165, 288, -142, 129, -64, -116, 309, -172, -276, -86, 11, 159, -61, -53, -58, 119, 151, 155, 197]
3758A97j01J9k58J25n1j1K33j13J16L4m6k20K79k19r5L17k41n6R6nN6J96m07L12
3782A57j42k48K36J26r3L5k26J61Q6J3M9j54K7L5N4l46K67P0l46K65P6j82R1j59
3806a48M00l25R3J15n9j54K47k18O1K02l71R5J90j7o8k0J73n6j16j25L50m17J59
3829ij59L15L2j47j12J86pj75K19l27K46n5Q2q9L73l47K2q7J31m0j59K72p0k10
3853a15J8R6KL5N8j85P9J67j89j6K3L9J5J6J3k27oK04J23j78q1K72k73J84Pn4
3879B7N9j61Q5N1Ol2J42k77O4L14n61K93j0M3o2J42j09n0k5J85k26j83L72M9k30
3904i4OJ27j4kj62lJ60q8K31k29j14M53m60P6J16l3j35L36n0o1j79L05m7j15j14
3929i0K17j58r9L02l16p3K80K5n5Q6j13J12j07k68J71J29M7j87m4o1J51l4j29
$$ y = [197, 96, 115, -143, -18, -69, -80, 153, 40, 156, 190, 144, -76, 203, -16, -111, 206, -35, -91, 5, 0, 56, 252, -155, 157, 15, -233, 3, 129, 36, 71, -155, 6, 92, 105, 154, 0, 27, 62, 116, -230, 37, 107, -239, 26, 102, -80, 11, -148, 252, -73, 20, 135, 76, -78, 169, -49, 12, 214, -157, -62, 128, 111, 43, 23, 196, 140, 24, -101, 249, -168, -9, -168, 147, 179, 32, -80, 106, 99, -76, 143, -184, 62, 7, 89, 0, 373, 26, 48, -39, 92, 52, -107, 165, 95, -115, -97, -1, 1, 36, 94, -91, -12, 155, -34, -50, -27, 12, 27, 43, 56, -171, -177, 27, 150, -28, -109, 163, -110, 74, 81, 27, 86, -75, 10, 61, 67, 35, 177, -100, -36, 278, -283, 10, 0, 43, -19, 123, 14, -36, -61, 124, -102, -285, 87, 136, -94, -88, 39, 25, 23, -139, -142, 18, -70, 161, -68, -182, 271, -189, -113, 3, -30, -165, 171, 121, 60, -119, 186, 139, 24, -90, 127, -31, -130, 172, -144, -217, 63, 88, 33, 119, 6, 118, 11, -257, -86, 43, 90, -97, -141, -202, -51, -85, -214]
3952b14J0J05L1jj16J27L2q2O2o1r5K75j12M1J2j47J45KJ59m7j44P2j04n4J47
3977D3j34R6Q8M5l71M13r6j62K68k71J55l1p4j88N79n46J53J04k42J91j00J37
3999E7o4j39K06p0n3J52j00j6J53m5j33L5n3L0K67k90r0P4k04L05K04l16J11K8
4023D9j44J43k11J14J81j66o5M68m98J82L07n35K08P1k38J62j13j56M07m02l3
4044b69K83l7k3O9k88J59K25j78J85m19J83K52j3k68L52k94o8J79J21mj41j41
4066a35J23j87n1M61m2j21J02n1k55K24k06K59r2jK34m14P0K83o3q5O0k58J11
4089c4l09L43lk50K65j38K45l11M86m67J09J48k89L81j74k37L90j74QJ32j90N
4111f4L97o16M7N00k60Jj74J48K74k63k39M15j44k71N18l33j90K59j8j96M2L42
$$ y = [-214, -204, -99, -68, -69, -185, -58, -26, -108, -46, -107, -202, 73, -39, 2, 14, -133, 12, 14, 173, 126, -18, 54, -50, -104, 43, -91, 5, 93, 138, -233, 180, 84, -78, 190, -81, 74, 43, -31, -219, 360, -186, -33, 71, -171, 20, -80, 57, -7, -146, 60, -10, -63, 89, -11, -27, 126, 81, -52, -17, -70, -40, 227, -63, -153, -79, -283, 22, 226, -90, 21, 49, -95, 48, -163, -49, 132, -34, -99, 369, -129, 53, 360, -175, 33, 104, -134, 28, -85, -241, 166, -236, -269, 14, -23, -46, 23, -265, -106, 119, -59, 126, -293, -110, 142, 129, -139, 213, -81, -149, 30, 151, 147, 6, -135, -12, -199, -250, 211, 169, 48, 150, 99, -156, 68, -138, 121, 29, 28, 262, -152, -82, 201, 138, 53, 113, -145, -34, -343, 0, -3, -253, 12, -126, 119, -192, 294, -173, -64, 84, -205, 176, 2, -235, 155, -19, -11, 121, -69, -64, 333, -283, -236, 264, 4, 5, -169, -21, 253, -10, -249, 166, 22, -249, 269, -64, -254, 5, -13, -209, -167, 175]
4133A75k72K34l30M48k60k08L62r8l70O8M24%k99J81o0q4q4L26j44L9m8n1J83
4156A32L4j51J1k1k52M14j59j1Q5j50n9L80k78jJ31n3n5J39j52Q9j60O9P1p1k8
4181d6JP8J8k04M2M2rJ05J61j14j40K79l43o2M13k86l09M98jL7m53L90K42o07
4205b68M53m2k33J1J50r8l0p3J68o6j59p8L83m7p0K54l10J77j28p7m7L29k80J04
4229B3m2M4o4m6MJ19q9L6K22l74L00j90P0o9k7L0J87k55j3K91j28j47K10L5p6
4254E1q9K9k00K26l3J37Q1j57P5k55J30J2m5R7j77J28J83l21K06K4j70M7R5k26
4278a52J54k4j73M62l28M2j2K2p0J53j07j85K73j22LJ30j05J10j34n5J20Kj3j69
4302a78L97l25L07k81L0j1o4K71j00j77K14j29N2J80k29Q1J86j16Pj80R5J85l23
$$ y = [175, -97, 137, -193, 255, -5, -213, 149, 51, -319, -251, 173, 173, -126, 55, -5, -89, -173, 153, 9, 48, 0, -51, 132, 166, 15, 26, 5, -247, 167, 8, -3, 82, -68, -127, 253, -25, -26, 105, 52, -3, 136, -16, 73, -87, -18, 53, -18, -46, -45, 33, 51, -153, -111, -69, -78, 27, 188, 74, -66, 213, -130, -192, 221, -65, -374, 124, 123, 160, -293, 97, 339, -268, 185, 143, -90, -79, 71, -27, -57, -130, 38, -28, -187, -265, 118, 71, 1, 255, -55, 122, -6, -83, -130, 199, -81, 23, -19, 25, -39, -85, -81, 38, -51, -15, 207, -167, 133, -57, 13, -56, -83, -53, 134, -121, -134, 157, 29, -118, 92, 127, 51, -38, -9, -209, 17, -16, 121, 202, 45, 120, -135, -5, 7, -38, 59, -118, 10, 193, -128, 78, 102, -68, -21, 74, -152, 2, -22, -195, 267, -61, -19, -31, -9, -79, 74, -33, -218, 55, -67, -64, 66, -39, 71, -63, -118, 2, 4, -9, -178, 219, -106, 201, -80, -50, -61, -125, 146, 46, -131, 83, -46, 6, 186, -43, 38, 224, 108, 115, -65, 30, 215, -108]
4325a08J45m2R0j48K11l03L6K37r2Pl06K02J52j80K4K24r7k37K10p3o1mM1J09
4349C7k14J61O5j4j58N2o5N2J40R1j06l3N2o9k2j18N9j98K75K26j23j47J66k47
4373a38P7J89k15Q7K7j47M00m46l5L58k29m3Q6Q9J34k04J44j65J09j92K93l12
4395a33J35R2j31M51k99j73J20J48k30J52K3k48K26k87J68J0j79q3J03j06J87
4416e4J96l31J54J12k00K6j4K20j9j38J70O4l19R9p0j7L10k20j81K03j41N6J24
4439C0k58K79J02k12J46O0j51L7rk39K55j17Q4J7k49Q7L86k98K97m66NK86j5k28
4463a71J17NJ2P9l80L04R7j41Q0j48L88l08K13j71N0k6Q4M4l13Q9K4K1pK08k42
4488i2J70j74J52Q9k06LJ88L3j91J81j66K47m74J65J61k06q3J72o3l7K99l36P8
$$ y = [-108, 37, -5, 85, -63, 148, -155, -119, 118, 26, 33, -273, -71, 81, -99, -75, 149, 52, -185, 25, -48, -109, -113, -72, 37, -177, -16, 49, 35, -123, -71, -136, -84, 56, 147, 41, 8, 60, -9, -31, -149, -90, -288, -13, 213, 90, -57, 109, -138, -61, 128, -87, 0, 27, -120, 280, -166, -201, 157, -72, -115, -29, 60, 194, -10, 134, -31, 78, -114, 179, -133, 2, 94, -37, 414, 115, -58, 62, 210, -20, 132, 155, -93, 133, -154, 14, 24, -155, -238, -135, -241, -54, 142, -189, -35, 77, -123, -97, -111, 109, 90, -48, 122, 186, -133, -34, -104, -121, 189, -31, -212, -9, -150, -94, 30, -228, 51, 153, -59, 87, 147, -4, 33, 24, -215, 40, -77, 7, 24, -225, -138, 248, -50, 247, -219, -214, 72, 57, -171, -54, -49, -37, 42, -338, -34, 63, -78, 2, -146, 242, -66, 147, -24, 26, 0, 84, 128, -185, -96, -72, -51, -58, 150, -92, 78, -96, 56, 145, -61, -58, 130, 163, -28, 153, -13, 234, -240, -75, 86, -120, -203, -31, -94, -131, 168, -168, -90]
4511i0J07j2l2J9N9J61m12Q9M46m21J91J09l13Q9M9j83J61j41j0N44n32R4J55
4534A27k56R5K27j52r5J1r8J37p6m1K53l52J63K99m42J74J45r6j3J37k57Q1j37
4557a66J52L17l13rQ2L0j66K72j48j20N6j39L26m09j9N70n77O8M98m95J47R3k13
4580a63J24j61J79m2o9K08J06l94K54P8K7m35M59l02M3o0j25M89l50L1M16m45
4602a32P6J05j57J03J88k36O4nQ7q3J28k8J10k31q8L19l83K49o0O9k85Q3R8K17
4626B08k02k9L15k88k37M56k39j76M2pL29k09O7J19l00J03L08k74o3K82k16j18
4648a29j70J99j52J00J26M50o39J79K32m61j03L86J01o3j01j4K38l78K97L5l82
4669b49J82K09q3j23K40n7l4J4j0J31m82J78K70l40kL73k91j54M12l40K92q0N
$$ y = [-90, 17, 5, -27, -8, 51, 212, -200, -111, 335, -86, 105, 214, -99, -10, 39, -144, 17, -124, -134, 410, -122, -28, 127, -129, -34, 193, 41, -54, -43, -141, -4, -80, -121, 132, -220, -57, 242, -200, -26, 119, 23, 10, 147, -110, -29, -166, -14, 303, -10, -19, 63, 93, -73, 199, 51, -69, -13, -152, 174, -235, -254, 316, -261, -193, 305, -190, -43, 50, -163, -39, -200, -21, -63, -132, 76, 182, -212, 42, 120, 147, -288, 171, -131, -88, -148, -273, 216, -134, -103, 313, -132, -56, 49, -108, -5, 183, -53, 11, 6, 93, 10, 138, 110, 220, -11, -99, 220, -163, 86, 26, 95, -190, -107, -9, 208, 6, -23, 292, 4, -233, 223, -16, -192, -150, -157, 172, -37, 30, 149, -151, -48, 260, -14, -77, 205, -11, -129, -299, -100, -252, -152, -26, 424, -215, -36, 196, -265, -368, 18, 119, 56, -45, -59, 179, -199, 98, 133, -249, -67, 142, 59, -64, 176, 119, 85, 99, 89, 220, -262, -84, 186, -154, -156, 217, -74, -228, 184, -156, 136, 56, 61]
4692F1Q4j60q3K44k47l6L72k62j15L33k12J51k89Q8K21j72Q4Pj86L8J73j29J10
4715G5J71q3j76p4J66k8q9q3K74k21P2N4j59K50l30K74J8k88K61O8j98K20N6n06
4739b76J58O1P5P7l27J6K00n1j06L65l05j40K82j64J4L29L1k25O4j52K16k22j42
4762b22M26k65j62J39j07j99O31l32K26k55m8J74j34p8M91l65L7K81n96K08J91
4783D1R2o8j61j3K32j37L08K0m90J11K46j60N9K02m10k34L25K1K62l01K67M8n14
4806b54K06K42l68J36J24j71M2J57j85K9k6J34o4m31L45K5j40J41J18p6K11m11
4828b16K55J55j63j05Q3j72Q4J23o0J75j08k78L45o0J3K0k45K81j1j73M44m21
4850c4n2J79j62p3M28n8o9J61m88K63lj34M7J07j76L04j06k34J92k01l2J47J36
$$ y = [61, 145, -15, -98, 146, -101, -137, 235, -27, -142, 191, -21, 130, -159, -71, 150, -22, 62, 69, -117, -79, 94, -35, 75, 246, 163, -13, -87, 79, 51, -38, -121, 153, -68, 4, 58, -101, 149, -181, 93, 111, -177, 84, 152, -46, 174, 230, -276, -118, -57, 18, 95, -232, -216, -16, -67, -173, 192, -113, -253, 29, -135, -121, 208, 239, 14, 78, -74, 142, -80, -222, 204, -61, -223, -84, -191, -390, 241, -91, 135, -120, -168, 6, -128, -206, 285, -80, -43, 238, -358, -150, 41, 133, 65, -96, -109, 123, -14, 294, 314, -176, -65, 181, 21, 80, 282, -128, -362, -37, -16, 246, -55, 212, 260, -254, -48, 194, -174, -38, 86, -85, -43, 114, -71, -42, -68, 66, 2, -429, -84, -59, -199, -58, 60, -16, 195, -216, 39, 194, 31, -74, 9, -163, -79, 44, -16, 159, 51, -227, 118, 58, 71, 91, -154, 127, 116, -57, 387, -34, -86, 93, -69, -142, 286, 228, 159, 320, -168, 95, 92, -42, 5, 112, -64, 240, 134, -100, 92, -109, -141, 6, 142]
4873A42k60K06j71N9R9j45K43k11R3j85L32l19L98k88j33J36j7Q0r3L71l41l0
4895c4lK93m75K49K23k55K2N0N4q5j84J57Q8j63Q3rKj5L5j86P3L01l57J34N2k32
4921a82L23k91rJ96j05K20L0k36J90q8o4j39J47N4O8j38k0K07k76P8K08l76K84
4944H1J10k26J49m3r0L2J21j74Q3o9q9L67m78K14R0j87K53j5j54L5k26P7N59m41
4968b1N4m5j38L83k3m11K28m0R8j9k9J5o3k29L60j0k78L19k26j85K24R5o0J92
4992A91k06l2Q1j31M6n8j5L75k02m1J87n1j34K26k84L8J7R5j14J05k43M18j97
5015G1k19J26J60j10O2k8k5o1J59q5J09j20j05QN0m5p4K32m8k26J35K33k94N6
5039c9N4j25J21l4J90J3k07M4J77k81R9j06k88M17J60l96L97p0j81j77K28K44
$$ y = [142, -118, 88, -83, -24, 75, -70, 173, -38, 55, -130, 202, -117, 281, -7, -140, -4, -21, 59, -34, 337, -4, -34, -37, 256, -219, 30, 253, -2, 20, 70, 124, 39, -145, 12, 100, -63, 20, 11, 13, -2, 33, -153, -80, 221, -136, -2, 50, -182, 141, -150, -159, 37, -68, 152, 182, -54, 136, 48, -16, -155, -8, 46, 114, -24, -44, 163, -113, -35, 173, -203, 81, 191, -35, 114, 71, -19, 13, 134, -40, 43, -26, -115, 252, -226, -12, 78, -109, 144, 129, -25, 10, -216, -139, 420, -21, 33, -12, -150, 233, 210, -201, 27, -13, 85, 66, 37, 52, -11, -240, 120, 110, -168, 151, -75, -260, -36, 59, -1, 191, -15, -47, 34, -97, -51, -109, -124, 251, 49, 8, 195, 144, 10, 236, -48, -10, 7, 102, -12, 93, -150, 268, 71, -148, -22, 138, 28, 90, 62, 37, -24, 135, 50, 159, 39, -66, -58, -8, -53, -127, 105, 57, -169, -34, 199, -95, -39, 15, -110, 11, -23, 167, 180, -27, 17, 194, -87, 12, -94, -382, 35, 195, -201, 196, 126, -55, -232, -4, 240]
5061B40j62l94K12J50j15J11k2j8n1q6MK56l20K73j61k17K22J24j56N4K89k70
5083c7j94K73K10q6k01J05M3l94L52Oj83R9K50n25K83J80j80N6l22K57J90m22
5105b40L52K44n29J04J47k06K3J61K3j8o3J78j13j26J34L5k92L19O8l59K26j67
5127i9K31j69j59J60n2q0J69K06k64J85l6n1k17J18J04k1k85M85j01n14M01K94
5149C05l62m1K32o2Q3l13K96P1m06L00q0K1q1J22j62J86r7J31m1m02M67j06j20
5172e9K57j55l35L92j2k78K82k20K67k13R5K0J65n02L72J06m02K52M35m53j00
5193h6J39N8m3j92K61j62j13K71N7n25M22pn3j96J24r0J85l66K17J98k07J8L64
5216B74m37J30K87m18j6j10M42p0k95M08k0k37K85N6m36K93qn0j14j0K66j66l9
$$ y = [240, 78, -316, -104, 46, -69, 42, 20, 2, -49, -135, -131, 125, -195, 78, -83, -300, -78, 46, -110, -56, 233, -37, -231, 42, 252, 166, -35, 70, 113, -281, 71, 77, -106, -7, 243, -282, 1, 181, 1, 57, -265, -8, 182, -240, 112, 356, -173, -69, 78, -128, -105, 56, 79, 61, -2, 176, 63, -63, 71, 106, -186, 133, 201, -158, 68, -99, 132, -37, -196, -36, -88, -168, 1, 207, -57, 128, 92, 41, -176, -58, 46, 25, -260, 225, 124, -390, 11, 305, -57, -98, 134, 72, 155, -158, 138, 209, -197, 103, 23, 44, -37, 85, -77, 109, 12, 143, 102, -300, 167, 61, -59, 198, 43, -292, 100, 88, -190, 92, -128, 139, -74, 21, 41, 206, -296, 76, 182, -220, 32, 467, 14, -86, 53, 111, 68, -124, 137, -25, -138, 133, 190, -335, 87, 80, 27, -169, -45, -135, 50, -316, -99, 99, -108, -90, 274, -163, -33, 254, -164, -180, -290, 152, 82, -213, 195, 175, -62, 223, 279, -157, 136, 128, 78, -36, -46, 220, 54, 15]
5239A5N9j56L3J04K62l95j40L56j87l7RN0J74l12M65j91j95M04l58q4K62N2k43
5262e3n4k4N0R1j10J56j50j20L67K5l60O4J74m4Q4l02J99J75l71L79J88n79L58
5285A43k33RJ57j72R4r3j96L17M1l16rN68k59P3p7j30L6n4J76jq7nK29l50L4K13
5311A08j47K41o8r5Qk19J96k18j6K38J96l35K31J36j9j46j78L75j56j55L6j14
5333a01j43N69j44k64OJ46l72L90j59J8K25k48J16k3q0M20l29Q4j8m0l57N16j58
5356E4N9j40q1P6J38k74J65q6m7K08J13m1j47K48j17J55m39L4K80k59K00j73K8
5379d6J13j15J7J26m2j77J80j05J80J05n79M46j33PN4n5p0L19l11K0J57j11m0
5402f0L15k44J39j10k87L63j99rM43n46J98q6j8R4o1j89N04j72j77P0M8r7M1k21
$$ y = [15, 74, -82, -49, 55, 317, -78, -218, 138, -49, -86, -77, -27, 147, -165, 300, 109, -86, 318, -40, -124, 138, 190, -53, -107, -131, -81, 10, -100, 56, -94, -214, 153, 178, -182, -118, 56, 12, 96, -206, -7, 168, -203, 176, 364, -215, 143, -90, -81, 76, -96, -2, -95, -291, 26, 67, -249, -258, 310, 51, 124, 47, -83, -47, -101, 75, 74, -13, -18, 211, -139, -105, 108, -39, 202, 134, 39, 47, -172, 24, -194, -210, 28, 224, -111, 120, 256, 237, 91, -87, 288, 132, -23, 13, -101, -244, 325, 181, -83, -77, 69, -303, 87, -72, -54, 171, -77, 39, 16, -64, 356, 27, 111, 93, 53, -304, 212, 54, 113, -27, -108, -32, 106, -168, -3, -89, -136, 72, 185, 144, -3, 245, 128, 283, -156, -122, 158, -101, 99, -74, -46, 67, -48, -31, 95, 53, -124, 56, -49, 131, 236, -343, 103, -30, -23, 31, -24, -94, 225, -86, -66, 91, -20, -60, 255, 11, 150, 40, -247, 116, -83, -92, 351, -195, 3, -83, -101, -7, -68, -257, 247, 75, -102, -32, 16, -81, -40, -261]
$$ [...]
8191b40
##END NTUPLES=NMR FID
##END=
