##TITLE=1H_91-2024
 CDCl3
 8 sc, 
 10.10.2024
##JCAMPDX= 6.0         $$ Bruker NMR JCAMP-DX V2.0
##DATA TYPE= NMR FID
##DATA CLASS= NTUPLES
##ORIGIN= UXNMR, Bruker Analytische Messtechnik GmbH
##OWNER= root
$$ XWIN-NMR		Version 3.5
$$ Thu Oct 10 14:26:52 2024 Russian Standard Time (UT+4h)  she@DPX200
##.OBSERVE FREQUENCY= 200.1318
##.OBSERVE NUCLEUS= ^1H
##.DELAY= (6, 6)
##.ACQUISITION MODE= SIMULTANEOUS
##.ACQUISITION SCHEME= undefined
##.AVERAGES= 8
##.DIGITISER RES= 18
##SPECTROMETER/DATA SYSTEM= spect
##.PULSE SEQUENCE= zg30
##.SOLVENT NAME= D2O
##.SHIFT REFERENCE= (INTERNAL, D2O, 0, 15.7039)
##AUDIT TRAIL= $$ (NUMBER, WHEN, WHO, WHERE, WHAT)
$$ ##TITLE= Audit trail, XWIN-NMR		Version 3.5
$$ ##JCAMPDX= 5.01
$$ ##ORIGIN= Bruker BioSpin GmbH
$$ ##OWNER= she
$$ F:/spectra/data/she/nmr/H-F/1/audita.txt
$$ ##AUDIT TRAIL=  $$ (NUMBER, WHEN, WHO, WHERE, WHAT)
(   1,<2024-10-10 14:25:40.60 +0400>,<she>,<DPX200>,
      <created by zg, POWCHK disabled, PULCHK disabled
       configuration hash MD5:
       00 E9 B6 7A A2 85 ED C7 34 08 36 98 17 FE 4E 26
       data hash MD5: 16K
       C6 53 61 5C 7B 27 36 DE 3A 3E 00 AB 49 32 27 BC>)
$$ ##END=
$$ 
$$ hash MD5
$$ 99 C6 E5 F0 06 6A CD DD E4 3E 12 B3 9F AB 4F 11
##$RELAX= 
##$RELAX= 
##$RELAX= 
##$RELAX= 
##$RELAX= 
##$RELAX= 
$$ Bruker specific parameters
$$ --------------------------
##$DU= <F:/spectra>
##$EXPNO= 1
##$NAME= <H-F>
##$PROCNO= 1
##$TYPE= <nmr>
##$USER= <she>
##$AMP= (0..31)
100 100 100 100 100 100 100 100 100 100 100 100 100 100 100 100 100 100 
100 100 100 100 100 100 100 100 100 100 100 100 100 100 
##$AQSEQ= 0
##$AQ_mod= 1
##$AUNM= <au_zg>
##$AUTOPOS= <>
##$BF1= 200.13
##$BF2= 200.13
##$BF3= 200.13
##$BF4= 200.13
##$BF5= 200.13
##$BF6= 200.13
##$BF7= 200.13
##$BF8= 200.13
##$BYTORDA= 1
##$CFDGTYP= 0
##$CFRGTYP= 5
##$CHEMSTR= <none>
##$CNST= (0..31)
1 1 145 1 1 1 1 1 1 1 1 1 1 1 1 1 1 1 1 1 1 1 1 1 1 1 1 1 1 1 1 1 
##$CPDPRG= <>
##$CPDPRG1= <>
##$CPDPRG2= <>
##$CPDPRG3= <>
##$CPDPRG4= <mlev>
##$CPDPRG5= <mlev>
##$CPDPRG6= <mlev>
##$CPDPRG7= <mlev>
##$CPDPRG8= <mlev>
##$CPDPRGB= <>
##$CPDPRGT= <>
##$D= (0..31)
0 1.2 0 0 0 0 0 0 0 0.06 0 0.03 0 0 0 0 0.0002 0 0 0 0 0 0 0 0 0 0 0 0 
0 0 0 
##$DATE= 1728555939
##$DBL= (0..7)
120 120 120 120 120 120 120 120 
##$DBP= (0..7)
150 150 150 150 150 150 150 150 
##$DBP07= 0
##$DBPNAM0= <>
##$DBPNAM1= <>
##$DBPNAM2= <>
##$DBPNAM3= <>
##$DBPNAM4= <>
##$DBPNAM5= <>
##$DBPNAM6= <>
##$DBPNAM7= <>
##$DBPOAL= (0..7)
0.5 0.5 0.5 0.5 0.5 0.5 0.5 0.5 
##$DBPOFFS= (0..7)
0 0 0 0 0 0 0 0 
##$DE= 6
##$DECBNUC= <off>
##$DECIM= 24
##$DECNUC= <off>
##$DECSTAT= 4
##$DIGMOD= 1
##$DIGTYP= 9
##$DL= (0..7)
0 120 120 120 120 120 120 120 
##$DP= (0..7)
150 150 150 150 150 150 150 150 
##$DP07= 0
##$DPNAME0= <>
##$DPNAME1= <>
##$DPNAME2= <>
##$DPNAME3= <>
##$DPNAME4= <>
##$DPNAME5= <>
##$DPNAME6= <>
##$DPNAME7= <>
##$DPOAL= (0..7)
0.5 0.5 0.5 0.5 0.5 0.5 0.5 0.5 
##$DPOFFS= (0..7)
0 0 0 0 0 0 0 0 
##$DQDMODE= 0
##$DR= 18
##$DS= 0
##$DSLIST= <SSSSSSSSSSSSSSS>
##$DSPFIRM= 0
$$ [...]
##$SUBNAM2= <"">
##$SUBNAM3= <"">
##$SUBNAM4= <"">
##$SUBNAM5= <"">
##$SUBNAM6= <"">
##$SUBNAM7= <"">
##$SUBNAM8= <"">
##$SUBNAM9= <"">
##$SW= 24.0689170037331
##$SWIBOX= (0..15)
0 0 2 0 0 0 0 0 0 0 0 0 0 0 0 0 
##$SW_h= 4816.95568400771
##$TD= 16384
##$TD0= 1
##$TE= 0
##$TE2= 300
##$TE3= 300
##$TEG= 300
##$TL= (0..7)
0 120 120 120 120 120 120 120 
##$TP= (0..7)
150 150 150 150 150 150 150 150 
##$TP07= 0
##$TPNAME0= <>
##$TPNAME1= <>
##$TPNAME2= <>
##$TPNAME3= <>
##$TPNAME4= <>
##$TPNAME5= <>
##$TPNAME6= <>
##$TPNAME7= <>
##$TPOAL= (0..7)
0.5 0.5 0.5 0.5 0.5 0.5 0.5 0.5 
##$TPOFFS= (0..7)
0 0 0 0 0 0 0 0 
##$TUNHIN= 0
##$TUNHOUT= 0
##$TUNXOUT= 0
##$USERA1= <user>
##$USERA2= <user>
##$USERA3= <user>
##$USERA4= <user>
##$USERA5= <user>
##$V9= 5
##$VALIST= <valist>
##$VCLIST= <CCCCCCCCCCCCCCC>
##$VD= 0
##$VDLIST= <DDDDDDDDDDDDDDD>
##$VPLIST= <PPPPPPPPPPPPPPP>
##$VTLIST= <TTTTTTTTTTTTTTT>
##$WBST= 1024
##$WBSW= 4
##$XGAIN= (0..3)
0 0 0 0 
##$XL= 0
##$YL= 0
##$YMAX_a= 227862
##$YMIN_a= -238528
##$ZGOPTNS= <>
##$ZL1= 120
##$ZL2= 120
##$ZL3= 120
##$ZL4= 120
##$ABSF1= 10
##$ABSF2= 0
##$ABSG= 5
##$ABSL= 3
##$ALPHA= 0
##$AQORDER= 0
##$ASSFAC= 0
##$ASSFACI= 0
##$ASSFACX= 0
##$ASSWID= 0
##$AUNMP= <proc_1d>
##$AZFE= 0.1
##$AZFW= 0.1
##$BCFW= 1
##$BC_mod= 2
##$BYTORDP= 1
##$COROFFS= 0
##$CY= 11.3945322036743
##$DATMOD= 1
##$DC= 2
##$DFILT= <>
##$DTYPP= 0
##$F1P= 15.6554695791079
##$F2P= 12.8336369535428
##$FCOR= 0.5
##$FTSIZE= 0
##$FT_mod= 4
##$GAMMA= 1
##$GB= 0.15
##$INTBC= 1
##$INTSCL= 1
##$ISEN= 128
##$LB= 0.24
##$LEV0= 0
##$LPBIN= 0
##$MAXI= 10000
##$MC2= 0
##$MEAN= 0
##$ME_mod= 0
##$MI= 1.114404
##$NCOEF= 0
##$NC_proc= 0
##$NLEV= 6
##$NOISF1= 3.799351
##$NOISF2= 2.8
##$NSP= 1
##$NTH_PI= 0
##$NZP= 0
##$OFFSET= 15.70392
##$PC= 1
##$PHC0= -26500.81
##$PHC1= 12.98743
##$PH_mod= 1
##$PKNL= yes
##$PPARMOD= 0
##$PSCAL= 0
##$PSIGN= 0
##$REVERSE= no
##$SF= 200.130013532006
##$SI= 16384
##$SIGF1= 3
##$SIGF2= 2
##$SINO= 400
##$SIOLD= 16384
##$SREGLST= <1H.CDCl3>
##$SSB= 0
##$STSI= 0
##$STSR= 0
##$SW_p= 3612.71676300578
##$SYMM= 0
##$S_DEV= 0
##$TDeff= 0
##$TDoff= 0
##$TI= <>
##$TILT= no
##$TM1= 0
##$TM2= 0
##$TOPLEV= 0
##$USERP1= <user>
##$USERP2= <user>
##$USERP3= <user>
##$USERP4= <user>
##$USERP5= <user>
##$WDW= 1
##$XDIM= 8192
##$YMAX_p= 0
##$YMIN_p= 0
$$ End of Bruker specific parameters
$$ ---------------------------------
##NTUPLES= NMR FID
##VAR_NAME=  TIME,          FID/REAL,        FID/IMAG
##SYMBOL=    X,             R,               I
##VAR_TYPE=  INDEPENDENT,   DEPENDENT,       DEPENDENT
##VAR_FORM=  AFFN,          ASDF,            ASDF
##VAR_DIM=   8192,          8192,            8192
##UNITS=     SECONDS,       ARBITRARY UNITS, ARBITRARY UNITS
##FACTOR=    0.0002076,     1,               1
##FIRST=     0,             0,               0
##LAST=      1.7004516,     0,               0
##MIN=       0,             -238528,         0
##MAX=       1.7004516,     227862,          0
$$ Real data points
##PAGE= N=1
##DATA TABLE= (X++(R..R)), XYDATA
$$ [...]
1172G0l13j261J111R61k066j252l29M74K247K388R41j860n43J075j647R21J607
1189B524l232m42m1k416J424J328O04K677j372j940K039K53l89J625J17l671k630
1206c542K137L57j316K461n8j574J070k20J679K266j770M40M07l527j010K233
1222C3J219j903j304J765j503j814M652J906k286R3M6o70o18K67J672q80k112
1239a437q19oJ414p3Q75L332k653l006L740Q04j775J197O85k287k896P72K098
1256c5j164M77J246j360k28L3J409L067j469j697J294j872j794J712J493r06k140
1273a934L05Q25r51J586K073L39o78k472J102J591k743J522J884m319j108J836
1289a142k95J157J078n0J89q49r24J469K381j779k136K045k351l404M532J230
$$ y = [70, -243, -1504, -393, 568, -1498, -2750, -3079, -2605, -358, 2030, 2971, 1111, 568, 1643, -4, 917, 2524, -708, -1150, -1191, -3607, -2183, -855, -251, 2426, 1054, -886, 1153, 1406, 1017, 2642, 2759, -912, -3542, -1405, -1048, -2364, 97, 39, -1535, -465, -685, 994, 3260, 1490, 1930, 2337, -1190, -2200, 33, 1252, -651, -1955, -190, -1693, -3507, 1145, 3051, 765, 858, 904, 234, -384, -117, 1555, 675, -1437, -2256, -2262, -848, -921, -46, 3286, 633, -2373, 1367, 2171, 396, 1593, 2278, -9, -2905, -2133, -35, -1199, -722, 524, -836, -1064, -1031, 378, 3445, 1976, 279, 1573, -299, -2093, -381, 1112, 206, -1934, -1629, -804, -1755, -169, 1904, 2243, 1565, -907, 195, 1786, -957, 565, 2449, -1870, -2978, -1142, -1437, -280, 798, 748, 937, 88, -836, 633, 3014, 1235, -901, 1144, -1207, -4611, -79, 1151]
1305A151k688J826l13j327J827L34J228J196k466j402M93m81p38R32J449k022
1321a001k039J793R09L04J420O07m77k100k83K235r48l43J016k285k81J36p83
1338b120L443O23k811K205j95l194K598K581k473j156O64k176p83K884m92l48
1354g50K115k701k44L878k362P24M152m377j946K556k603j14L333j657k327R79
1370a344P7l49K878J237k244N89L90k244J408Q56j494Q93j149j965P64M18J673
1387C94J130r96M55j527n46L793r05k234K006k035k977K539J043j976J588J629
1403A381k717L70K617k002K023L000n316o74K954m351J322M304m379j431K649
1418b50j293N37K673m44j95P44j537r99J809p54j180K542k174l445K769J125k07
$$ y = [1151, -1537, 289, -24, -1351, 476, 810, 2038, 3234, 768, -634, -141, -622, -1360, -428, 1021, -1001, -3040, -1247, -338, -34, 1386, 1993, 1516, -584, -867, 1368, 420, 77, 1093, -1192, -1473, -1337, -2120, 1323, 1946, -865, 1340, 1145, -2049, 549, 3130, 657, -499, 165, -2011, -2794, 90, -402, -750, 1365, -1336, -1580, 2298, -64, 660, 4812, 435, -1511, 1045, -1558, -1672, 1661, 4, -2323, -1344, -1267, -1616, 1262, 2499, 255, 844, 1234, -1010, 398, 1254, -240, 653, -496, -2461, -1697, -1279, 394, 1524, 528, 983, -544, -1090, 2703, 1798, -436, 1570, -465, -3442, -903, 140, -1836, -248, 1381, -1336, -966, 1651, -351, 1672, 4672, -644, -1318, 1636, -2715, -1393, 2911, -1468, -2899, -250, -1543, -1006, 1667, 1223, 1028, 1772, 235, -764, 1045, 291, -889, 1653, -521, -3966, -1197, -72, -279]
1435b79K272j030j326O72n10J700N93k332L3k33j358K23L06J241R82j013j74L41
1453A08k55P56K236j59l567l15J135j917J659J534l163J245Q12k359L011J290
1469B051k458K446L59l857L09J937p64q4O65j848j532J882Q54P24J364k197k59
1486d08J866j937O70J873k258J50N4k308J086Q19l7K062r20k292R57J546K44L36
1504A503J91j992j343J330k37j78J230j468K22J036k091J308K341p69P51p30k241
1521a137Q80L02M37R32k256j458J032M91K84J002N78q75M7O80j247P04J337j653
1539H0M56o95l361K211K044j225J237l42j937J600J054J95O73j177j299K72q4
1556b98j268L59J922j219p53J253j253O30K894l06m63q98k238J588J010j302K85
$$ y = [-279, 1993, 963, -363, 309, -201, 1499, 2092, -240, -207, -440, -1798, -1575, -1269, -28, 954, -59, -233, 108, -147, 609, 2845, 2686, -881, -1196, -61, -1978, -319, 1215, -1948, -703, 109, -2250, 761, 2051, -407, 2039, 2398, -1459, -1150, 787, 23, -61, 604, -1244, -2776, -894, -40, 684, 2048, -149, -408, 1458, -479, 191, 2064, -194, -44, 10, -2298, -1212, -393, -430, 1632, 712, -1580, -623, 923, 1167, 1503, 1694, -298, -1641, -311, -548, -726, 504, -964, -742, 294, -1797, -489, 1852, 1083, 1834, 1104, -1137, -257, 45, 482, 1414, -842, -2300, -1268, -777, -493, 509, 1087, 212, 259, 939, -308, 396, 1733, 80, 536, -159, -3520, -1309, 735, -490, 747, 405, -1532, 68, 1122, 1317, 1990, 813, -486, -214, -298, -1566, -1207, 715, -504, -1257, -4, -1257, -627, 2267, 1961, 1498, 600, -1638, -50, 960, -342, -57]
1573e7o65j186O55O39Q73K90J55R09m98j260j57P88J117j110j236m45j395J110
1591a473K105k22J07q41o08K462m92r32J741q16j724K16m66m84M93J374M40j545
1609f65o93Q86J562J080r62k52l55k338J287J533j929j22M09o97L71j80O81J977
1627A593l59k77k2j180j51R49J276j143k471K15M53O2J316O5l01J28n07J086K15
1646I47r39J265Rj561q39p81Q87J242j96K55q83p61J524J280M07m65r93m0o29
1665b71k63M46o93L92R3j234M86K17N04K236k40r82m93r00J093R05j109m36o92
1684i41p86M69Q19Q01k68K45J191j235n57J191j6L71m79j864l90m11O82J983n50
1703B55j092L26K92R75K87Q6K62j078m16j76j048M73O82K08kj225j4J199R27J310
$$ y = [-57, -722, -1908, -1253, -614, 259, 549, 704, 1613, 1115, -145, -302, 486, 1603, 493, -743, -1188, -2583, -1473, 632, 410, 517, -324, -932, 1530, 1038, 106, 1847, 1031, -693, -477, -943, -1427, -934, 440, 880, -665, -1358, -472, 1090, 2170, 1208, 956, 601, -1737, -450, 1083, -846, -968, -559, -1256, -885, -1065, -384, 1593, 1234, 957, 935, -245, -396, 553, 1829, 686, -1785, -1570, -1117, -1055, 261, 326, 25, 153, -354, 732, 947, 8, 1273, 1282, -279, -1118, -1899, -1012, 230, 34, 289, -594, -1355, 169, 1449, 1856, 1391, 398, 358, -271, -534, -88, -781, -389, -296, -1530, -1044, -827, -323, 1913, 1673, 691, 198, -702, 391, 1296, 187, -249, -941, -1727, -1258, -439, 362, 94, 339, 1530, 295, -262, 929, 913, 1284, 805, -1059, -1449, -1860, -1178, 805, 255, -837, -511, -219, 756, 1043, 1129, 1391, 313, -103, -279, -1327, -854, -172, 36, 34, -1191, -1205, -6, 921, 2231]
1723B231q58j536L60m99K50Q17j089n78M6m88O35r3L94J699k2q96l91M7M34J49
1743F12P65p09k561K90J150K0R09o10k72R02j082O32J647j351k55J278j394j725
1761a754K74J634K21p25K0m61l35J144J175Q85j465j576J891k73j732J600n9j277
1779h13M58m60j45L53J91J911R6k244j42J337K50l17M99o91k064O26J212p14O81
1798B4k5l20J125j151k50K270q71k89J075k386q47J561j10K72L33j634l03J519
1816gM61k48J317m53j756J303k61j679J723m8j321J150j500o68K814Mk69J217
1834A779j867n73J590j41k40n0j308m76P98n98k14J976l15j087J856j154j277
1851a301L273l30j898J262k124q64K657r01m56J550j757k44K109p25k42J657p66
$$ y = [2231, 1373, -163, 197, -302, -52, 765, -324, -902, -856, -1344, -709, -802, -408, 1291, 1269, 373, -18, 29, 463, 612, 1377, 668, -1893, -1603, -453, -433, 476, -134, -406, 496, -586, 46, 1693, 342, 87, 1365, -29, -1754, -1480, 154, 375, -350, -330, -791, -1126, 18, 1193, 2078, 613, -963, 928, 655, -1077, 523, 464, -813, -355, -815, -960, -607, -416, 1495, 1591, -653, -795, 542, 792, 475, 974, 283, -1781, -1155, 57, -657, 24, -1, -321, 804, -347, -597, 1673, 802, 513, 1588, -798, -1645, -84, -194, 78, 411, -1223, -1526, -7, 454, 206, 1523, 1070, -686, 617, 356, -1323, 400, 352, -969, 181, -1319, -1987, 827, 831, 562, 1779, -88, -661, 929, 788, 548, 498, -810, -1286, -488, -1086, -1300, 676, 361, -726, 1130, -24, -1301, 1972, 1642, -256, 1006, -1118, -1982, 675, -226, -682, 868, -889, -1133, 976, 251, 9, 1666, 900]
1868I00j427Q83r26r68K346m06j709J574j506p84L932j026j375K610k290j297
1884a469L370j532j497K298j171j873J620k14o66K096J88j714R21l52j031K803
1900A777k33k497J440q84j515K534n35p18J357j433Q1J634j906R24K402k321r65
1917h58J601j590n24K894r42k099J588q88p65L391j282j407K934k000j782L520
1933A791j552j530K888j570j960J746p04KK361j014j277J550p14p28K637o50k268
1950i92J600q30j576K352p71r61K423j935r61K988j388l76L031j948j796J600
1966D60r88k02J846j329j152J476j053m99K934p17j634K780j263k176K641p13
1982D11j187K289k240j365K387j418J66K949j817j347K243o74q25J913m88j563
$$ y = [900, -527, 356, -570, -1538, 808, 402, -1307, 267, -1239, -2023, 1909, 883, -492, 2118, -172, -1469, 1901, 369, -1128, 1170, -1, -1874, -254, -468, -1134, 962, 1150, -564, 357, 5, -1026, 1777, 1544, -953, 487, -397, -1912, 622, 87, -631, 726, -707, -626, 1008, -898, 26, 2428, 107, -858, 743, -847, -1371, 1523, 581, -1518, 70, -818, -1583, 1808, 526, -881, 2053, 53, -1729, 1791, 239, -1291, 1597, 27, -1933, -187, -891, -889, 1472, 458, -819, 731, 17, -711, 1926, 1276, -992, 608, -222, -1798, 554, -217, -1178, 1245, -690, -1651, 1337, -51, -427, 2604, 656, -1140, 460, -528, -730, 1116, -213, -1365, 111, -942, -1441, 1493, 776, -858, 1922, 659, -1517, 1124, 411, -776, 1513, -727, -2092, 295, -1123, -957, 1992, 175, -1172, 1071, 397, -428, 1485, 997, -566]
1998e66R97j115j179K255n23j108K580j395j867L000l17j051K158j386j493J421
2014D11j091k0J801j434q91J513q42o90K292J67j415J060m05j563J662k05q72
2031e22J605j804j364K433p35m26K228j049r41J273q04R2J254r20l68N20j451
2048i79m51J907l66q22J521r63j300K323k73p03J881j697j209J956j454l83K194
2065A182j355j004J289p21k43J769m4o38O73q08q99J403O7j299J076o27j743J562
2083c60J56l29J583q89n14J224j116J43J672j166p38L29r31k91J106J74k37M84
2101C00m77m10J392j93l15J353j300j530J429q27n43J742j036o70J181r10M09
2118d05J670n30l59N77q54q13Q92K37q08J91j78q87Q00M82r5J311o73p99J029
$$ y = [-566, 431, -684, -1863, 392, -131, -1239, 1341, -54, -1921, 1079, 762, -289, 1869, 483, -1010, 411, -680, -700, 1101, -333, -1224, 289, -553, -1243, 1049, 1216, -199, 861, 456, -1107, 555, 350, -522, 1083, -721, -2085, 348, -387, -813, 1415, 366, -575, 698, -106, -14, 1240, 320, -48, 472, -979, -1430, 477, 111, -711, 810, -153, -1453, 870, 597, -106, 1775, 78, -1131, 825, -629, -1012, 1182, -173, -1177, 112, -609, -852, 917, 873, 235, 908, 100, -799, 604, 671, -628, 448, -179, -1922, -360, -204, -533, 1050, 161, -353, 871, -245, -102, 1570, 404, -334, -5, -936, -1227, -121, 53, -184, 300, -177, -587, 805, 612, 297, 1650, 350, -1180, 249, -578, -1121, 621, -415, -1085, 96, -814, -405, 1265, 735, 376, 953, 99, -714, 178, 415, -393, -202, -380, -1267, -467, 15, -80, 1231, 558, -241, 788]
2137G88o65l08J207r65n02J79j090M99Q22j84M99J72p11m7R06K01l47M48q27j026
2157i51P18j67j94J254q61m91J059p94J48J392n83j53J46j039J8M09q5K19J1p06
2177f50k92P24M62j24P67k26q87M98p9k16N82n12k93J18j034M78R29l68N11Kq91
2198e01L98L98J35L74k88p23k85K18q4m4P76m54n04O41m33K01J205m41n5J01j318
2219f83K81P00l63K11k78p33J37L93L83L95Q4r6k75Q7k16j07N39j67q07J38n98
2240i75J33R96j1L46j46p97P38M44l38M09m69o49j04l05J87K35o8K64K4k32j05
2261d23O21R10m51l64J19q85l5P64l49N1k26n38P22q8L1R35j17l43Rm50j6j3K61
2284A25P4o99l22Q5L45P77q5J1R9n39L04L71k50J25l02l37j26n86L68P26p6o3
$$ y = [788, 123, -185, 1022, 57, -445, -266, -1356, -857, -35, -219, 280, 452, -259, -306, 600, 801, 454, 902, 75, -951, -233, -400, -594, 660, -201, -692, 367, -427, -279, 1113, 530, 377, 523, -516, -498, -89, -174, 45, 56, -650, -942, -218, 244, 120, 887, 661, -226, 272, 193, -23, 559, 47, -246, -128, -1162, -684, 245, -123, 388, 390, -501, -103, 295, 430, 804, 516, -207, -492, -274, -358, -402, 374, -80, -584, 57, -376, -175, 1030, 589, 534, 635, -683, -402, 298, -65, 146, -132, -865, -728, -335, 48, 443, 527, 431, 156, 243, 27, -80, 459, 292, -515, -377, -975, -842, 154, 143, 489, 343, -454, 284, 728, 390, 799, 330, -319, -423, -728, -541, -306, -374, -110, -86, -318, -423, 198, 1108, 657, 293, 412, -473, -508, 256, -93, -42, -268, -806, -84, -172, -141, 794, 677, 334, 343, -107, -123, -136, 125, 199, -500, -822, -737, -392, 385, 300, 311, 410, -129, 175, 546, 296, 421, 119, -218, -344, -930, -562, 164, 88, 25]
2306B5jm96L77M58L10J20q38k77P9p2K63r4J98j41m84O24q5j70R55j05l65j52
2328A29p12M25N82m08J26l40n79L79L90L86l5k21K24m16n3L64k13L38j07o73l
2349d17k11K5R33L0l74k04j40N92L11j38K78p24k53M19m95J34K56k07J54j87k84
2370e02J54M38O24j59n06p4m77M55O59o82j8j30n36O62J91j91N55r6k04Ol06J22
2392a5K37K3o9p07k50J81M08N86k32k38Q3k50M69M05m51J74k43m26K33l74L4O92
2414B70k56rj74m16O09M60k8J37o33l68K56K54Q4l97J40N3m65L00K47r6O35j73
2436D30k88j07o33N33P59o95j02j08n37N92L20P8N5l12J27jj05N5J73K53m98n24
2458e35L69k62O3R47l50n36J68k62N58M36m52J53j34n95M69N0j90J50M9o5l27
$$ y = [25, 24, -472, -95, 363, 673, 793, -45, -322, -243, -315, -52, -146, 52, -89, -573, 51, -34, -204, 751, 646, 281, 129, -583, -158, 424, 16, 142, -198, -777, -398, -8, 378, 343, 122, 346, -70, -123, 241, 28, 366, 259, -414, -417, -628, -603, 330, 360, -14, -218, -358, 234, 545, 407, 685, -39, -292, 127, -368, -234, 22, -185, -31, -218, -502, -348, 90, 714, 555, 49, -25, -502, -47, 612, -70, -88, -218, -754, -92, 99, -92, 463, 367, 163, 169, -137, -15, 222, 245, 176, -531, -781, -600, -192, 394, 162, -76, 7, -243, 226, 631, 180, 354, 111, -315, -82, -456, -422, 270, 14, 5, -169, -585, 24, 484, 456, 593, -40, -408, -152, 102, 186, -211, -71, -18, -483, -183, 64, -32, 603, 430, 142, 35, -598, -65, 694, -1, -103, -211, -748, -156, 164, 242, 297, -15, 112, 111, 6, 61, 234, 487, -11, -535, -166, -428, -365, 582, 232, -304, -136, -398, 160, 596, 144, 297, 163, -432, 37, 87, -103, 47, 96, 31, -296]
2479b96j78K69M83J88l51j36j0m99P44O21r37j09K13o70N86L90p04O62N8o83M95
2500A36j25k02O19J69n05n91J28j6L43N02o17j86L30l50M49P30q45J93K96p42
2520b84K74k2k96P23l71n54L27l14J19R79k0n71q9P2j12L53K41o85J04L4o12P64
2542F0J34p23J166j27j161Q68l3o04J201k23j111K82l9j28P49ro66K60M00o17
2562c21N37M40q22N41J94j184N11J92n55J032k86j135Q13n3j64J063m12q10N38
2581A19m1l88O15M5o64N00k0r81P73L32o90R72k5j465R35K61p03J198m70j146
2601h43J049j88o02J207m73n78P21k67o61Q84K60o81O31kj354Q93N37j078J036
2620D91p2j529J044L24q15J159k29q56Q88k72n46Q20j65m41M85m04p68P65N08
$$ y = [-296, -474, -205, 278, 466, 115, -21, -31, -530, 214, 835, -102, -211, 2, -668, -82, 308, -396, 266, 324, -359, 136, 11, -191, 428, 597, 92, -499, -371, -387, -44, 458, -159, -345, -15, -365, 84, 814, -31, 162, 458, -284, -10, -32, -328, 395, 24, -530, -203, -517, -398, 581, 561, -10, -99, -27, -139, 214, 455, -230, -126, -92, -704, 60, 194, -529, 637, 510, -651, 217, 184, -420, 781, 558, -553, -271, -310, -438, 311, 302, -364, -104, 296, -321, 216, 656, -166, 375, 569, -615, -104, 88, -467, 565, 279, -856, -43, -96, -260, 803, 391, -419, 119, 78, -310, 305, 350, -314, 186, 166, -815, -42, 290, -400, 572, 547, -918, 17, 278, -425, 773, 303, -843, 206, 18, -584, 623, 150, -428, 293, 26, -635, 249, 509, -172, 459, 457, -897, -4, 533, -545, 491, 419, -1110, -66, 258, -557, 602, 373, -483, 405, 133, -413, 407, 242, -199, 286, -118, -886, -121, 387]
2639C87o68O68j61j132J054L53r24J119l89j239J286l94q65J488l76p96J036m91
2657d4o34J114J62n81M78l64r02P83K17p21Q84l59j161J374R8r35J467l11j143
2676e78J288o66q62J440m40p96J049p33p55J354J78p16P47j47r48Q60K83j008
2694d50Q19o7j201R95j14j051J602j31r50J045n41n35J258k74n22O09p86l63Q64
2713B07j37n47Q40j97q80R72Q2r40J272r6j163R46m63p14J427l08r01R68o61m71
2733g64J229j46m98P02m37n12P09o9n11P56j58r42P29j44p61J278J2r67Q45n64
2753b13l57J331m82n50P96p87l53R07k90k87O49l52m83M97L4k51P52j69q28P07
2773B71l30n73J215m02p05P52n24l28J146m92j55P68o74l57P45l56k00O18k86
$$ y = [387, -281, 387, 226, -906, 148, 501, -423, 696, 307, -932, 354, -40, -905, 583, 207, -589, 447, -44, -678, 436, 598, 17, 495, 131, -771, 12, 229, -492, 392, 33, -1128, 246, 344, -591, 876, 565, -578, 710, 44, -818, 622, 182, -614, 435, -298, -1053, 301, 479, -237, 510, 363, -585, 275, 558, -450, 369, 302, -899, 96, -18, -1069, 533, 402, -548, 497, -44, -579, 679, 405, -117, 492, -294, -657, 207, 70, -477, 363, 166, -714, 258, 340, -600, 672, 576, -587, 359, -104, -818, 609, 301, -600, 368, -293, -764, 465, 319, -179, 523, 86, -426, 283, 214, -297, 459, 301, -641, 88, -56, -817, 461, 473, -494, 351, -213, -570, 761, 279, -271, 525, -262, -615, 292, 2, -285, 364, 12, -471, 26, 60, -191, 561, 392, -436, 271, -59, -632, 583, 181, -524, 228, -296, -624, 522, 30, -125, 643, -31, -388, 357, 1, -199, 419, 133]
2792A33o51L90N6k93P50m2o78N94j79m11R23l31n35O05n89l19O81l16O5M36m88
2813a99KL27j89J98L89l04m48K14j63j62O01j81n22O14m10j85R65m08j72O47p36
2834a22k53N57l32J33K97n26n6J68KQ7M15j04m02K87r1l61N60m1m43L83m18j99
2856d59N59j67L5N30o43QK75l10L65P2l22l7j50j6J45K36n2k19K00r7k48N95j23
2879A77k15M01n04k40N41k80J21L82o03P6J33k15L12J57j43j52r0J09k9J24J57
2900B19l18J96k29j66M13l1M4J16l50k9K35k39L32J39m71J64j52j19L24r0Jnk70
2923b86J27Q0R8J83k8M0k77j80L36j35R6K42n33P0J14j83M20O0k45J37k57q0L19
2946A18o0M2o6k22M8r0J33J75m1K72l40r0K67j02J7K66m25l3o6p6L32q0j4J34
$$ y = [133, -518, -128, -72, -365, 385, 343, -335, 259, 80, -331, 592, 261, -274, 331, -258, -577, 104, -212, -147, 289, -199, -197, 130, -59, 139, 528, 224, -224, -10, -173, -335, 266, 85, -437, 177, -233, -418, 547, 139, -33, 614, -122, -375, 182, -150, -17, 280, -246, -302, -134, -132, -45, 370, 266, -136, 151, 60, -301, 259, 218, -225, 158, -260, -459, 100, -67, -32, 498, -145, -137, 138, -172, 193, 265, -57, -94, -244, -260, -115, 121, 69, -150, 50, -47, -295, 300, 177, -38, 363, -141, -381, 160, -120, 1, 383, -220, -144, -11, -226, 86, 243, 100, -52, -142, -33, -62, 62, 219, -99, 97, -132, -298, 115, 84, 128, 244, -106, -135, 100, -139, 193, 332, -139, 25, -127, -246, 78, -12, -11, -16, -286, -159, -79, 19, 202, 174, 214, -63, -243, 93, -42, 54, 296, -237, -167, -53, -236, 184, 244, -1, 136, -121, -201, 118, 58, 100, 34, -188, -140, -230, -97, 78, 37, 309, -31, -121, 146, 44, 61, 327, -98, -131, -197, -273, 59, -21, -35, 99]
2970I9l16J29J57n9K38j82p4J3k54J32K18j25J77j60j68Q2L7K74J0j80J06l26
2992a72p1M18k54O1K19m51J55J18j98M51q4j00m6k26J13K09j00J01k06j58J26
3013i5j9J54J38j49J11k38k3J81j26K93l9l30K21k11j10N57k53Mml22J38J98j11
3036c5J16o0j30P7j11K30l7R1M6k79%O2j19M02q6l76K80k71Q8L23j85R1k6j89
3060i8M0pK5J98j42l6m4p5Q5L2J83Q9l74Q6J7j47L98j59k55K37k11M6K34k12K28
3085A38R6k50J6k8mJ35O2j05k42k6J32J9K50o9l09K47j32k0L65k95L7J31l38O4
3109a26J85j99K96Pk64J23j09M3K23m7o7k35Q6j3l7K86p9k10K54k22n2L44k33
3132d6J29K94m73p1J70j01K46j6k33J7j23J66O2k0J08j54K3n2j05K75Nj59K60
$$ y = [99, -217, -88, 69, 10, 248, 66, -8, 5, -249, -117, 101, -24, 153, -7, -175, -93, -56, 218, 228, 48, 154, -172, -243, 175, -79, -18, 201, -250, -95, 23, -175, 276, 192, 92, 46, -180, -67, 142, 42, 143, -63, -221, -95, -114, 40, 178, 29, 140, -98, -121, 60, -66, 227, 188, -142, 79, -132, -242, 315, 62, 66, 62, -260, -122, 76, -35, 81, 21, -109, -32, -143, 87, 50, 141, 187, -92, -92, -30, -149, 253, 167, -209, 71, -200, -112, 211, 26, 117, 91, -98, -58, -65, -40, 158, 16, -20, -64, -139, -54, -22, 161, 250, -124, -38, -21, -168, 230, 71, -184, 53, -158, -112, 122, -90, 138, 234, -16, 0, -28, -32, 103, 165, 60, -182, -208, -76, -57, 193, 124, -185, 62, -70, -90, 275, -20, 17, 148, -190, -126, 59, -140, 156, 163, -101, 22, -87, -44, 179, 132, 65, -170, -84, -97, -134, 152, 73, -137, 117, -105, -157, 187, -46, 83, 377, -96, -167, 3, -98, 148, 132, -101, -84, -207, -41, 21, 1, 109, -45, -22, -74, -179, 96, 101, -58, 202]
3155B02l27q1K92j04J94P5m70R8L1J6J87M5k25J36q6q7J46L7nq4J07k18j52M55
3179A82j25n1L49n69K6L68k36K34J4m01J49k1r8K37p4n1J01j05P9j12K09J31j56
3202H0l7j60j14K62n3M0Q0l76K88Q5k18K83Nk60K25j50j08J85o4l0J31j50n3r2
3226b01L68L0k06K32k91j18K96j23kJ37k89O2O3q1K46k6L1J19l98R5J32j06K33
3249B03r5l23N2K3Q3J35o6J18k44J03J68k51K45k1k00J42j44j75L14l2K4J5j54
3272h0l7J96l0J49j16o3j18K6J98k14J18Q9k19N8J59l36L01J47j50K8j23j75L21
3295A29m2L1m7k08O0Q4N8nj07J24p1k07K01n7O5J71k51J27j15k02L71R1k20L2
3319A2j22n8K49q4N4J3j44LM9j1K2J8J07k27m1J68j67J90K40l10J3K0j67K76K
$$ y = [202, -125, -206, 86, -18, 176, 251, -219, -121, -90, -74, 113, 158, -67, 69, -17, -104, 42, 79, 74, -10, 97, -121, -273, 182, 57, 6, 355, -214, -188, 180, -56, 178, 192, -209, -60, -81, -179, 58, -16, -67, 34, -71, 8, -104, 105, 236, 80, 43, -117, -231, 31, -22, 18, 98, -278, 10, 95, -123, 160, 165, -95, 130, -20, -128, 57, -7, -37, 94, -56, -109, -201, 167, 197, -9, 223, -68, -186, 110, -13, -15, 122, -167, -105, -42, -123, 123, 97, 128, 247, -151, -56, 76, -30, 203, 108, -215, -163, -140, -57, 78, 12, 130, -114, -11, 157, -94, 151, 130, -70, 72, -72, -247, 67, 35, 59, 74, -80, -117, 79, 49, 198, 82, 19, -99, -73, 125, -89, 29, 118, -101, -43, 116, -220, 81, 228, 78, 106, -17, -192, 129, 87, 118, 71, -137, -77, 7, 65, 60, -47, 77, 6, -201, 0, -57, 8, 179, -72, 55, -60, -262, 109, 200, -20, 12, -110, -168, 81, -3, 51, 64, -80, -77, -28, -39, -17, 1, 108, -119, -160, 8, -159, 31, 271, -39, -26, -6, -173, 103, 105]
3344A05j73J15j64JO3O4J8O5o7M9j86N1J65q2J21j75j07M6j13J99K24l59J47K4
3368C1j69L36j65K4O9j90k7O9j79J53M8K6n3j42J03Q0N0J52k46k0N8j98K13M3
3392F6k14K02q1j31K12n5J2J25r9Nq3j1J07pj7j53q1K01n5N2J41j67N6J33k52
3417i4J03J01k19J93q9j57P8m5J39J19q2q5NNJ30p3J52k55n0J80k69R2K61j62
3441b2N6Jk47J68J05o2K00k08j29J59Jn3J27l3j77l3J70L9j45K96k24r2K24k43
3465a22J18J25j24J15j11j95J11Q5n2J13r2k5j6P9P6k7l0K3q7k5oo6K62j57n3
3490h1J44l03J25L00j77J18r5k00K32o4JJ13j63l3k6M5P9r8J78J4j80J71j59p8
3514a37L22j02o5J1j91N8J56j06J16Lj13Q7j8L1OO0p9j23j9nN0M6L4j30R4n8o7
$$ y = [105, -68, 47, -117, -116, -53, 11, 29, 94, 27, 76, -110, -59, 106, 24, 145, -30, -137, -91, -204, -5, 219, -140, 7, 31, -138, 198, 33, 57, 126, -64, -91, -22, -201, -48, 0, 26, -27, -169, -66, 14, 64, 216, -30, -50, 8, -190, 23, 66, -148, 54, -27, -158, 54, -1, 11, 136, 37, 42, -41, -52, 55, 48, 31, -122, -203, -2, -57, -5, 136, -31, 25, 158, -94, 9, 110, -109, 84, -5, -162, -84, -129, 10, 129, 47, -38, -33, -28, 102, 29, 181, -74, -124, 56, -213, -121, 140, -22, 34, 35, -212, -44, 61, -1, 199, -9, -138, 21, 22, -31, 96, 63, -114, -147, 23, 62, -83, 213, -11, -103, 121, -122, -4, 121, -3, 112, 1, -194, -83, 2, -50, 63, -29, -54, -70, 9, 85, 58, 28, 51, -36, -61, -67, -133, 129, -28, -81, 63, -240, -115, 185, 8, 126, 31, -169, 63, -1, 0, 113, -50, -83, -109, -64, 15, -83, 95, 109, -71, 100, -59, -137, 185, 83, 18, 29, -162, -104, 52, -54, 62, 65, -48, 39, 21, 52, 58, 118, 39, -84, -103, -108, -58, -12, 22, -108, -14, -72, -139]
3541a39L71k10nJ11k54J49p2n7N8J21j49P6j13J09O6P1M7k03N0j17KK00j15j24
3565a27K16k11K3K88k10J10N5k21R8M4r6J00L4j02j1m0L8PR6M0k16J03qj91K69
3590H8q3j16J86k43Q6J49j25J34J9j77K4j3JQ7qk4j7jk0l8K29j02q3J19r9r2K36
3617A17j70K3J58k01k2J53j01J37nj49J25j52K6Q8kj2k2j3qp5K03K5j84J44j26
3642d3j10K34j64J08O1k60R4R5j50J94Po0j1n1J2N5O0j1r6m8J4j0J39q3j8J73
3668A31k39P3J95j69J9J34l00P9J00r9J43l6l9M5lll4Q5K6m5lo0q3J73r5j1J14
3695I8j52L1Q6j76K09l7j14O7k2p5J39l6j4M1o9m9J8M7O4J1m1j01K8J41j62M2
3721b6K46l35P2Q0j67J21J33j94J42j40k2J92r3j5N9n1q2kJ29J6q8J13j32K5Q6
$$ y = [-139, 232, 22, 17, 128, -126, 23, -49, -106, -48, 73, -76, 0, -113, -4, 62, 133, 180, -23, 27, -90, -88, 112, -3, -127, 89, -122, -99, 189, -21, 89, 144, -77, 21, 65, -31, 69, 103, 1, -10, -50, -12, -5, 91, 131, -85, 18, 10, -181, 88, 5, -111, 75, -168, -82, 67, -58, 76, 95, -82, -58, -71, -70, 17, 9, -15, -32, -33, -53, -91, 138, 36, -47, 72, -27, -119, 117, -53, -30, 128, -73, -95, 58, -43, 94, 89, -60, 65, -87, -61, 27, 25, 13, -9, -22, -30, -105, 98, 123, -61, 83, -43, -153, 81, -83, 25, 86, -174, -80, 15, -135, 59, 66, 6, -5, -56, -44, 11, 71, 60, -36, -84, -70, -80, 59, -24, -42, 131, -108, -35, 160, -9, 10, 144, -156, -77, 23, -76, 67, 31, -8, 37, 34, 31, -3, 82, 108, 63, 60, 0, -83, 90, -5, -16, 98, -54, -23, 63, -113, 96, 59, -55, 12, -10, -85, 54, 18, 4, 45, -24, -73, -55, -8, 56, 67, 26, -75, -47, 94, -68, -26, 220, -115, -43, 37, -130, -9, 124, -70, 72, -68, -90, 102, 9, -6, 53, 2, -80, -82, 47, 63, -25, 88, -44, -19, 67]
3746F7j25L1R2j70J20N6j50J70l4j32J06j02n2J05J8k5J7O6j05K2O8JJJ43k73
3771h5M9P5j29J41Rk32J60K8j53J59R0j11R4j5j33M6rnP8j4j25p8J70k6K2K20
3797B26j61q0J53k22J15O9j26Nm6q9J10J10m4N2j8r8jP6Kn3L0p8p4J74m5J6R9
3824A02k27J16M2j41J91J3j12J33j48j22J59J2k1OKl1k9J06o5L7J43k08p6J95
3848G7j14L0J42j84N9O0j81J14Q3j14N8n8k7J3O8K6Lp7L3q4R1pr8J64q4k3N1j00
3876g9P6J30r4Ql3j62K09m2o2P6n2o3Q8J7J5NnK6r1J59j57j0K01j89l5J01j63
3903a26J19P3j32Q9K5o9Q3j7L3k8k2k5n0k2Q4j25J47Lq0P7m3n0K02j02j13J45
3929G6k33J29K9q1J23M1j17l4Q5j8O2Jl5j2J2n7k3J37p7j21J57p1k8J87q1k5P5
$$ y = [67, -58, -27, 65, -105, 15, 71, -79, 91, 57, -75, 31, -71, -123, -18, 0, -25, -8, 58, -47, -25, 43, 44, 45, 188, -85, -36, 39, -90, 51, 60, -172, -12, 16, -137, 22, 112, 1, 95, 80, -53, -7, -16, -21, 57, 43, -82, -160, 10, -16, 6, 226, 65, -15, 138, -84, 31, 100, -26, -21, -67, -156, -46, 64, 20, 72, 54, -44, -45, 31, 33, -20, 10, -68, -142, 32, -13, 3, 102, -125, -9, 33, -108, 83, 96, -16, 117, -31, -153, 6, 18, -3, 3, 5, -26, -55, 51, -14, 23, 166, -42, -118, 77, -37, -7, 135, -49, 10, 70, -111, 3, 86, -28, 30, -28, -55, -42, 26, 52, 55, -22, 11, -73, 18, 11, -87, 77, -7, -30, 21, -79, -3, 127, 33, 41, 8, -154, 55, 13, -49, 27, -25, -88, 0, 17, 32, 37, 32, 58, -33, 126, -31, -41, 160, -29, -64, 37, -126, -7, 66, -66, 23, 48, -21, 62, 45, 78, 50, 28, 3, -47, -69, 15, -110, 37, 40, -40, 37, -6, -56, 146, 44, -69, 76, -157, -28, 1, -80, 43, 84, -33, -67, 18, 0, 62, 63, 28, 16, 28, -29, -52, 85, 8, -113, 44, -27, -55, 132, 51, 26, 101]
3956A01j47K3J45j42L8o5K5Oq6Q4L6LM1p3ML8k8N0o4k9Q2r0k1J27r6Q4O1j79O5
3985gN6J1L1n4j04J7J7MK4kPp9P7L3p1J31q4K4Lm7k5P0l3Q0m4p4J0K7k3Q7l0j1
4017B1j3l9R5j06J09rj11J11l2j31K15j46Q1np0J1K6m5J44o1j09J24n4m2R8k8
4043C4m7j1K0K8j22J59m4l6R7j6q2J08m9l6N6j63P2J3j5P8lm0oj6J32q4N5K8j82
4072g2M4M0o7J35k1j04R4r3PJ26k7J6J4j69Q6Mn7Q8l4m0L4k2NJ1j5J16j17M6k1
4101GkJ0m4mP9j41J7J28q4P7j8n9O1q3K4P4K8o6m6J2J00j01J13k4q9J08m2q5J60
4130A10p3j08K42k62N0R6j42J10j8l3M7l1N2O3q8L7m2p7N5o3J44k8r7O9m7o6J43
4157D3k7k0K1o0N9K7j21J84q0r6R4m1k9J02pRj49P5M5n0L1M4j07J19p7j0Q7j56
$$ y = [101, -46, -23, 122, -20, 18, -47, -22, -16, -102, -18, 18, 21, 62, -11, -7, 31, 3, 53, -11, -40, 42, -48, -69, 58, -38, 46, 107, -72, -7, 49, 60, 91, 37, -67, -50, -33, -29, -5, -7, 0, -79, -2, 31, -40, 91, 7, 31, 34, -13, -38, 32, -1, 79, 35, -39, -29, -2, -25, 62, 32, 21, 8, -31, 64, -42, 67, 58, -53, 58, 26, -105, 110, -36, 45, 40, -30, -19, 7, -38, 106, 45, -64, 60, 6, -36, 62, 34, -13, -24, -4, 24, -98, 61, 17, -19, 78, 62, -20, 88, 39, 3, 59, -104, -32, -19, -34, 44, 41, 1, -5, -21, 111, 27, 82, 110, -72, -28, 12, -55, 80, 59, -45, 49, -44, -37, 89, 62, 78, 92, -77, 9, 13, -44, 44, 10, -30, 4, -18, -13, -2, -17, 99, -18, 28, 7, 5, 15, -29, -33, 46, -95, -78, 50, -34, 43, 25, -34, 27, -56, -32, 42, 70, 4, -42, -30, 70, -31, 82, 58, -31, 77, 35, -50, 110, 37, -71, 171, -91, -41, 55, -87, 23, 5, -28, 19, -12, 40, 103, 15, 52, 10, -67, -12, -75, 69, 41, -56, 13, -34, -100, 43, 16, -4, 17, -43, 16, 43, -78, 106, 26, -70, 24, -17, -46, 56, 49, 58, -91, -16, 29, -21, 10, 54, -53, 66, -11, -21, 66, -90]
4185i0J09Q1j23K0L2j10J45j8m2R8j36J02l9k5K0m3QMm5L6P2q8J41j13j9O5q3
4212d1K0Q3j16O2o5P0O5o8J5O0j90O7Q3n5J9m3Q6q6j3P6k3m6J21j11J3K2m5Q4
4240D4k4n7O8j4jKL1kl0Kp0Q0p0N7j7R6q8pNn1jO5j5Ln5o8Q1L2j7P5q8L1L3k7
4274CJ1j4K6j2l6J9L7o5J06q4KQ4n2j3M1o3K4M7m2L9l1J2K5m3n2Q0j07Q1l5n8
4304g0P9m5N8Lk8P0Lo0J9j04L2P6r8J39Mj10R6J6p0M7p5J03j36J00M3j60Q2K3
4332C7p6L5N7k7Q3l7n9M3j28M4K7k1Q0o4l1M2p6L8O6k4J00j01M0Nk9Nmm7M3n8
4362c7L1O6q8M3M4j22N3M5n8N4k1o0jkP2o2Q1j7q5R3L7j29J09K9q7L2n4L0L1k5
4392BK6J7p4M3k2j3K9j5K4m3J1R9p3jN8j39K2M0NO1r2jP8p1O1rJ7J5r0J7O6o8
$$ y = [-90, 19, 100, -23, -3, 29, -81, 64, 46, 4, 102, -34, 68, 29, 4, 24, -19, -11, -7, -52, -16, 56, -32, 109, -4, -23, 42, -41, -21, 62, -54, 8, -57, 13, 78, 10, 25, 85, -105, -38, 45, -10, 9, -34, 52, -34, -47, 29, 6, -40, 81, -30, -17, 5, -40, 44, 20, -37, 31, 17, 16, 18, 49, 47, 17, 19, -51, 29, -41, 16, -1, 95, 7, 0, 5, -46, -47, 18, 3, 6, -49, -117, -36, -4, -21, 54, -34, -3, 30, 3, 14, 0, 26, 14, -22, -3, 34, -31, 75, -9, -7, 77, 25, 12, 53, -10, 14, 61, 19, 58, 27, 39, 64, 21, -31, 49, -58, 23, -12, -70, 9, -36, 22, 25, -3, 67, 70, 10, 29, -75, -43, 33, -65, 74, 78, -32, 64, 80, 10, 57, -18, 85, -51, 49, 92, -68, 14, 37, -39, -4, 53, 26, 109, 72, 13, 56, -72, -28, -1, -22, 58, -6, -37, 5, -71, -33, 33, 9, 109, 8, 48, 53, 24, 29, 25, -22, 21, -37, -6, 60, -28, 15, 59, -63, -10, 35, -23, 31, 10, -50, -51, -53, 19, -43, 38, 21, -64, 29, 66, -63, 46, 75, -12, 20, -34, -4, 27, 2, 28, 45, -29, 14, -8, -21, 8, -7, 17, -26, -15, 84, 11, 10, 68, -71, -49, -9, -4, 57, -35, -36, 42, -29, 32, 23, 40, 55, -35, -18, 48, -20]
4424b0OK4Om2j0nJ05r8O1jl0M7j3q3J56n8k0M6j03k9J12o3NK7l8J4m0Q6k8l0L1
4455A5k7J7L0j41J44k8n9Q2q4J4J43o9n0O6j11kN9j%RMK3k1QJ4n5P3n4l0O1r0
4486f0J15oq4Q8r7J0J27r9m6J28m8m8K5o8R9j7j01J14p3jL7L7K8j24J29j2j08
4513e5J40l7q8O8j02M5J21q6nL8n7J2OJ4o1M2j4%j2QN7l7Q4j46O3j7m0R6m3m1
4543d7J34j22m2J10j3oR0j14j9M6m8N0k7l4OM3J7p5O1m9K4Q7n2m1O2l9jM1m5l8
4573d1J41j29O2m1k8L5k0J5j5P6m3J2m3O8q0P2q4j6J06l7l7P9o3l7M9n4L5L4q3
4602f7P5j2j9k1M4M7k8O6n7n1k4L0j05J27L5r2M8N7j37J50q4j8R2n8J9k5j0J2
4630fJ3n5R1q2J2J1P1j7r0J04L2j06J52j51N4j4m9K6L5p1K5N7l1M1p6J0l4M8J0
$$ y = [-20, -14, 10, 16, -26, -36, -41, 64, -34, 27, 26, -4, 43, 30, -53, 103, 45, 25, 71, -32, -61, 51, -12, -7, 20, -18, -4, -44, 42, 14, -16, 15, -12, 5, 35, -106, 38, 10, -49, 33, -51, -37, 106, 37, -13, 53, -58, -60, -1, -2, -2, 7, 11, 34, 13, 21, 35, -20, 53, -1, -31, 30, -60, 55, 49, -35, 53, -44, -34, 93, -6, -52, 76, 28, -20, 5, -63, 36, 19, -82, 32, -41, -42, -5, 32, 60, -64, 65, 53, -55, 85, 48, -40, 28, -74, -29, 92, 6, 1, 39, -18, -6, 0, 14, -47, -5, -19, -19, -31, -23, 34, -3, 81, -65, -2, -19, -59, 37, -6, -47, 87, -35, -77, 33, 20, 14, 104, -10, -29, 17, -31, 19, -8, -42, -36, 7, 24, -51, 10, -39, -15, 72, 20, -21, 41, 2, 1, 42, -3, -41, 100, -29, 33, -8, -36, -1, -21, -6, -21, 55, 12, 24, -19, 49, -31, 41, -43, -59, 47, 10, -27, 52, -11, -48, 1, -53, -18, 16, -67, 8, -4, -23, -44, 0, 47, 19, 85, 28, -23, -47, -17, -122, 5, 40, -52, -4, 53, -84, 66, -18, -36, 56, -2, 17, -8, -18, -6, 7, -48, 43, -39, -27, -16, 55, 38, -52, 52, 84, -22, 130, -21, 33, 19, -30, -4, 31, -40, -15, 42, 11, 52, -24, -14, -48, 0, 10]
4659A0nn3K9j5PJ04p4J1m1k5O8m6l6Q7r9M0N3j2l2N5l4Rn1N7kl4j3J04l8j1l4
4690b1P5j7q4J20r5O1M0r3jN2l9l1N0j4J4J4m6N5K2m3j0L3l5j19J32j6m9O4j07
4719h8Q6J8%j07J01k5pnL4J2pl6L7Jj9l8L2J0j01P4J1Ml6J08n3K4m2o7R1J8n5
4750b5J22j11K8j2J3K9k9l3QN4j5n5R2q7M2k7%lL0ko7J07l8q2R0k3p7J12o8O5
4780C8J5j01J32l5j03P5l4n5P7J0lm6O6l7J5Q3m6m4J7j0M5%p5N6L0q6jP7j43J49
4810F6j13K1N0j2K2N7j14L0J1J2K4n0Ro5l0M6O1o9P4r7N3K3J5m9L5n6j1J48r7
4839fp9M9O6n8k2K6nP5m5o3P8j7J6mp8P5L1N4r9n6J26J0l1l7mO4Qp1o1P1j6M0
4871C7m3j5J5l0J5j5O3QL3r4J0lL1J2o4j1K3OoL6n0K1j1M3Jo3O7oPm5N5mRk7%
$$ y = [10, 5, -48, -19, -34, -27, 77, 3, 14, -27, -52, 16, -30, -66, 21, -78, -38, 15, 3, -29, 26, -8, 1, -50, 7, 5, -29, -42, 62, 24, 13, -21, 54, 37, -47, 73, -22, 39, 79, -14, -15, 37, -2, -33, 17, 3, 17, 31, -15, 40, 62, 19, 9, 42, 7, -112, 20, 4, -45, 19, -88, -2, 16, 16, -91, 10, -15, -22, -27, 7, 19, 12, -24, 13, 14, -5, -43, -11, -1, -102, -28, -17, -13, -49, 59, 6, 30, -12, -79, 12, 30, -25, 97, -14, 14, 2, 15, 44, 15, -18, -10, 44, 29, -26, 66, -21, 21, -6, -6, -9, 21, 19, -48, 59, 21, -61, 29, 6, -71, 41, -27, 38, 53, -48, 84, 49, -54, 21, -13, -68, 9, 19, 16, -30, 36, -1, 14, 97, 51, 7, 24, 14, 59, 59, -16, 40, 70, -16, -17, 60, -83, 66, -47, -26, 24, 12, 34, 91, -23, 7, 18, 30, 54, 4, 13, -52, -82, -36, 25, -44, 30, -67, -14, 9, 24, -25, 10, -46, -57, 91, -6, -85, -36, 30, -28, -50, -24, -29, 46, 1, -62, 16, -1, 15, 11, -67, 8, 39, 93, -6, -62, 64, 74, 43, 6, 2, 66, 74, 3, -58, 13, -3, 37, -6, -21, -6, -36, -21, -36, 27, 35, 68, -26, -16, -19, 12, 24, -40, -51, -28, -22, -28, 8, -42, -21, -32, 11, 12, -51, 16, 10, 17, -28, 27, 23, 32, 5, 5]
4906EK5p2M0K8LJ2o0O0o8L0J4k2J3L3m1L9l9%K9Qk4k0j8O7k5Ql6K7k7j6K5k4Q5
4939E9m5r4J1O4k1K9r3J41q3K1L8n8K0o5R0k1j1j0O2n4L2j9l4P1l2L0m5JM9o5
4969c2K0J8k2jO5J3p6L2m3Q3pl0l6m4J8N9j07L0J34l5j1l1j3L2l0K3Mo0O9k8N
5000aJj4O8l6o2Rl5L7P7p4J8J1p6J10o4O4o3N1l7L7m3O2k1j2PNK0J7o0l3K9m3
5032e1L6l0M3k4M6K4J5j33J19n4oL1m6pJ9O7j9n9kJ3J1J3J8K2n4Mn6K6l4oN6P
5064a1lp7N1J6M3k3N7J6j8k1l4K9p4PK4kM1j2KM8q1J06l3m1nO9p0L7Nl6MNm3O7
5098D3J3m7Kl3L2m8M8L3j05K0K6K0O6r2j5J6l0Q2J5pj0pq4l0Q6K2PL2p2Pj1j1
5130c2L1K7n0j7L9pP5Pq3K4j6L8n0Oj5O1rj7O1o7j9L0n6R1j3n3K0Ok2M9q0mJ8
$$ y = [5, 30, -42, -2, 26, 29, 41, -19, 41, -27, 3, 17, -5, 8, 41, 0, 39, 0, 0, 29, 37, 13, -7, -25, 42, 17, 25, -11, 16, -11, -27, -2, -26, 59, 14, -80, -69, -5, -26, 3, -90, 51, -32, -11, 27, -31, -11, -76, 14, -7, -18, -28, 34, -20, 12, -7, -41, 30, -2, 28, -17, -16, 33, -32, -12, 6, -16, -17, 48, 61, -15, 17, -26, 57, 50, 20, -16, -60, -42, 17, -90, -60, 74, 39, 28, -3, -16, 16, -14, 9, 13, -47, 22, -6, -1, 0, -14, 54, 18, -44, -35, -70, -33, 44, -30, -12, -1, -77, 33, -31, 33, -30, 21, -16, 21, -22, 40, 19, 7, 14, 19, 39, 56, -4, -37, -8, -51, -15, -45, -2, -26, 20, 44, 59, -74, 45, -9, -15, 16, -30, -37, -18, 49, 30, -29, -31, -18, -7, 6, 24, 46, -8, -4, -60, -34, -68, -74, -18, -11, -14, -91, -40, -24, 19, -4, 53, 69, 51, 30, -4, 25, -49, -42, -18, -20, 21, 9, 11, 59, -22, 84, 51, 10, 5, 74, 4, 41, 46, 10, 14, 19, -24, 43, 56, 9, 11, -22, 10, -38, 10, 43, -62, -42, -16, 4, 70, -22, -37, -21, -51, 31, 46, 39, 29, 22, -62, -92, -6, 16, 23, 55, -17, -10, -21, -32, -1, 26, -24, -41, -2, -9, 66, 73, -10, 14, -2, 36, -14, -8, -23, 38, 29, 12, 73, 6, -13, 17, -39, 52, 39, -14, 6, 12, -10, 39, -41, -45, -27]
5163b7QP6o7L9K3p6j4L6j4r5J04L1m9O1l3L8m6j0Jk9J8k9P9pm0Q5o0n6K7LMOk3
5196c6k5L3OK6k4j9k8J58k9k3Qp3j1L3Mj3L7j5O4q6L8k0oM6nl1k8Qk6J9O6j2m4
5229hN6p8J3l6M8kl6O5k3m9O9m5L9l7J2lK9M2n7J1l7lJ06r5kM1j9nkj4j4J20q4
5262Bj0M6j8j07P8K5pJ1Kj04P9Nk6N6rro4K0K1l7N3l7Q3Nq4J3roM0O4r5kk8K3
5296b6k0M2l1L3LJ4K5m2nN2l2m1QopN3o2k2Q0N3q2O1q4N6n4L3L0m6M7o5O8o4O3
5329C2m2K0n3P4O1r2K3l2M6n6K8n1K3K3k9J3p1Q2j6J2L7m8m6R4k3j4l9P3j04N7
5359a8j1mL5L0k9RJ0K7q5M9K9k2O7j27J18o5o4J29o2Lrp2NK8L9Rj5rN1j9n5JK6
5392aqj5k4N6K4m3J5PK7r8M7L7n6Q2q0Rm0R7j6m1J4L5m1k3P3j7n8k5O7L2K7q2
$$ y = [-27, -19, 57, -10, 29, 52, -24, -38, -2, -16, -111, -7, 24, -25, 36, 3, 41, -5, -15, -14, -43, -25, -54, 25, 18, -22, 63, 3, -53, -26, -23, -19, -13, -36, -61, -28, -22, 4, -20, -39, -67, 91, 62, 39, 47, -26, -37, -4, 0, -13, 24, 9, 73, -13, 25, 5, -1, 45, 40, 9, -19, -11, -37, -18, 48, 36, -8, 48, -30, -17, -53, -5, -7, -43, 22, -1, -50, 19, -26, 13, -24, -12, -15, 14, 56, -1, 10, -27, -30, 76, -19, -21, 20, 1, -4, -6, -20, -34, 86, 2, -8, 38, 20, -87, -9, 16, 9, 20, 22, -82, -3, 2, -24, 32, 23, 14, -50, -30, -9, -46, 7, -30, 53, 58, -26, -13, -22, -28, 12, 76, -19, -21, -49, -26, -46, -4, -35, -2, 1, 15, 40, -2, -7, 45, 13, -28, -20, -26, -33, 20, -42, -64, 16, 69, -13, 48, -36, 20, -34, -1, 29, -17, 30, -35, 33, -31, 32, -10, 10, -43, 31, 92, 0, 23, -9, 37, -19, 9, -42, -19, 4, -25, -12, -83, -1, -17, -5, 32, -16, -62, 32, 9, -5, -44, 29, -75, -18, -29, -33, 2, 32, 3, 12, 22, 49, -36, 13, 42, 20, 87, -40, 78, 13, -51, 78, 16, 19, 10, -62, -57, -29, 10, 19, 4, -5, 46, 27, -28, -27, -1, -9, -24, -48, 8, 32, -11, 4, 11, 38, -60, -13, 24, -32, 50, -30, -21, -61, 36, 20, -21, -7, 28, -13, -36, 37, 20, -38, -63, 4, 36, 63, -19]
5424a9Rl2N7l3M2k8lK1K4j5n8N5nk7kmN6m5M3p5PJM2jo2K0k5Q1l1N8p1N8m7P1
5458F2j21J22n1m2J5K2n3Q6n4J3M1q2L6P2r7P2r2j7J38o1m8P2L7m8l8M0k2k8K
5487b4K8j4L8k3m3R2k8L8k2J0n8n8N5KkMj6J3pL7Qr0L1L7L4p6J04n1n7K2p4Q3
5519gk8N2l6J6r5O3p9K25p0o1Q2k1j6j1j5L3L4o1l3K6m6Q0o2L6K3K3n2N7J0lj0
5550E4M2p1o6O6j2rK4l5K4J4r3J11m0oK5m8j6N4m0OK6l8k4M2j5K9k7QJ0l6P3K8
5582F0n3Pj3%Kn4O2J9j1k8O5j10K0M9j7M0m3ml3pQ1k8Pm3kQ6O1m2l5l8l6Q1r1
5615d8P8Kn8M0p8M3j1l5J32j02K4J7m3O1pk8rQ2m1pK3j2N0j5j0J8%k8o8N1O4j14
5647b9pJ6k9N4OL7mm6K5m1J5M1o5j0K7m1P3L4p4M5n9m8L9O7q9R1j6n4J9J1K1k5
$$ y = [-19, -10, -42, 15, -18, 24, -4, -7, 14, 38, 23, -35, 20, 15, -12, -14, -18, 38, -7, 36, -39, -32, -31, 11, 10, -52, -32, -57, 24, -7, 51, -20, 38, -9, 62, -59, 63, 12, -30, -15, 7, -46, 40, -14, -1, 40, -42, -6, 66, -31, 41, -51, -68, 70, 9, -39, 33, 70, 22, -16, 24, 2, -26, -24, 4, -10, 28, 5, -38, 54, 26, 64, 42, 52, -6, -64, -9, -7, -9, -5, -21, -8, -15, 22, 30, -60, -29, 8, 42, -34, 70, 19, -38, -16, -90, -7, -35, 17, -19, -3, -98, -35, -114, 111, 41, -20, 62, 41, 25, 14, -1, 32, 66, 5, -28, -2, -48, 32, -30, 6, 29, 52, 0, 57, 67, 64, 54, 96, 25, -41, 25, 13, 4, 28, -7, 17, 31, -62, 49, 9, 3, 28, -20, -36, 18, -22, -16, 10, -28, -52, -10, -25, 4, -23, -15, -5, -41, 32, 60, 7, 14, 1, 1, 3, -51, 11, 30, 19, -9, 56, -54, -34, 15, -2, 38, -5, -9, -42, -49, 32, 4, 11, -32, -34, 52, 113, 71, 36, -2, -38, 43, -48, 30, 32, -26, 14, -64, -21, -32, -67, 65, -37, -13, 4, -39, 22, 15, -13, -22, 60, 19, 12, 35, 23, 73, 58, 48, 66, 66, 38, -30, 21, 85, -29, -36, -20, -49, 5, 11, 48, 44, -2, 23, -18, -3, 38, -27, -37, -10, -51, 22, 56, -18, 27, -32, -80, -41, 26, -63, 28, 12, -42, -23, -12, 9, -16]
5679a6N2j7l2m3L6KQ5n4kk9J4J9M5j11O2l1n8P6j7L3k4N9Rj11L7M1l7J00j18N
5709b5Q1r6LO2l2l8J0m8P9J3j4kJ9p3J20k2n5j0j1Nk5L7O0n5K7J7n6M3m3k6O4
5740Im7K4J0Qk3L8n7J63j15kQ0j01LM5jK2l3l8J3m9J11l2L5p0J8j2K0k8J3k1n3
5771g0Q1j9K2j7Pm0O4m2l7M4K7q2L9K2l6PJ8Q2j07L8l0O8m0l4N0k2Mjj3OK8q7
5803g0Q0m2pM6o8P2on3J58j01j4N8o4L5J0lmJj5ll2K4L5o3j8N6nK2m5K7k6J2L8
5836C5j4n6J4L7J7n0m5J04J0j08M3J7j8M7k5m4M6m1K4L3l1ooK8K9K8J6o3k6N6
5866E1k6q0R1m0L7l5k5L9J9k8P5j06Q3n5l2N8Pl7O0j08L3oN7J2l7Pk5K7k4J5r
5897bK1pJ2j7k8K5k5j0MK2J6o4P5n7R1q1J1n0J4K2O8j11Q9o2N5K6p7L3L4L0m3
$$ y = [-16, 36, 19, -13, -56, -20, -18, 67, 13, 11, -18, -4, 15, 60, -51, 11, -20, -78, -2, -19, 14, -10, 49, 58, -53, -16, 25, -12, 88, -30, -25, 56, -40, -37, 25, -7, -45, -35, -83, -4, 9, -5, -7, 12, -61, 59, 37, -18, -28, -39, -34, -59, -22, 38, -17, 10, 27, -29, 14, -29, -55, 9, -38, -14, -4, 4, -19, 19, -38, 125, 10, 8, 88, -13, -10, 35, 34, 56, 23, -15, -2, -51, 60, 28, 63, -7, 11, -1, 19, -9, 4, -17, -70, 11, -8, 14, -3, 4, -36, 28, -14, -51, -7, 20, -62, -23, -1, -37, -30, -12, 70, -37, 1, -29, 39, -1, -35, 15, -7, -3, -4, -17, -11, 17, -70, 10, -32, -39, 7, -61, 11, 5, -48, 110, 9, -5, 53, -11, 24, 34, 31, 27, 28, 13, 10, -22, 2, 37, -26, -44, 12, 7, 29, -16, 11, -15, -3, 35, 21, -35, -21, 16, 33, -17, -62, 42, 52, -56, -13, 4, -14, 33, 8, -36, 10, -31, -7, 26, -5, -11, -17, 11, 40, 68, 84, 21, -5, 51, 25, -55, 36, -4, 33, -2, -27, 12, 31, 3, 78, -28, 55, 0, -32, 26, 33, -4, 56, -52, -19, -25, 32, 44, 7, 14, -11, 16, -8, 7, -2, 19, 12, 24, 7, -21, 4, -21, -31, -27, -5, 11, -53, 22, -35, 56, -25, -14, -64, -50, -28, 40, -71, 18, -44, 11, 37, -40, -7, 27, 57, 14]
5928A4k8L5M1m6J5J4Pm8kn6R9m8K6ql9O0l9O1K0j27L0O2o9K7N4r5M3l6N6q4M2
5959a9j5N0P5n3o5P4p0j9M8m5K6n1M0J4j5M7L7j34P7L9jk8k8M3J4l5o4J45o1m8
5989b2Q0q7J15k8o2N7j09J08r3P8j2m6L0j3j4J2J2L1O1l0j10Q5p8K9N9j14P5L7
6017E1n9l2%Q2m4J7k4J1m7N7m8P4j1p6J5M2NK2l9PrM4K2j0L5m0k8j12J09N5n2
6048A7Llk3J7m5O6jK7l6k8J6q4K1PL2mL1m5NL1LO4n5o0NM9o2P2n5M1lOk6%N0l
6084C0p4R7l8K5k9o1J6N5n6pK9m4Q1K6n6N8oqK5p6lJ6p6MQ8Pm1N9Kmr2R3J4n7
6118cj3J2J4j5m4M2l9mK9j6M8L1n6Q1l0k2Ol0N3p9L1rm8RR5L2k4j1o7N3m6kQ4
6151F2o3lNQN5m9j14J07rL2Rl6k4J0P2l2j04L1j0L8Q0o9KK6l5N6No6N3M3r9n4
$$ y = [14, -14, 21, 62, 16, 31, 45, 52, 4, 2, -54, 45, -3, 23, 15, -24, 36, -3, 58, 78, -49, -19, 43, -26, 1, 55, -40, 3, -33, 23, -61, -19, -34, 16, 91, 38, -27, 47, -23, -42, 6, -39, -13, -64, -24, -10, -25, 22, 59, -75, 2, 41, 40, 12, -16, 27, 41, 6, -58, 87, 26, -22, 58, -29, 86, 58, -4, 53, -56, 52, -41, 37, 25, -21, 9, -4, -18, -6, 6, 37, 98, 68, -42, 43, -35, -6, 53, -61, 14, 51, -8, -40, -40, 42, -2, 15, -9, 2, -45, 12, -36, 38, 27, -49, -34, 8, 13, 35, -4, 3, -6, 38, 60, 50, 85, 45, 17, -95, 14, 69, 17, 20, 17, -6, 11, -34, 32, 31, 58, 22, -6, 10, -74, -53, -46, -14, -18, 13, -32, -27, 4, 7, 71, 16, -44, -39, 10, -52, 20, -35, 6, 3, 9, -17, -17, 33, 30, -44, 53, 15, 40, 11, -50, -34, 21, -35, -42, -13, -57, 24, 50, -6, 52, 46, 38, 63, -13, -16, 0, -76, -72, 16, 23, -18, 41, 43, 39, -53, 40, 54, -3, -16, -4, 10, -5, -49, -7, -46, -50, -21, -37, 11, 42, -14, 67, 37, 15, 21, -9, 44, -35, -4, -13, -61, -52, 43, 75, 51, 40, -27, 26, -20, -22, 62, -1, -4, 1, 9, 64, 15, -99, 8, -1, 31, 40, 4, -20, -10, 62, 30, -74, -43, -53, -15, 65, -4, -2, 24, -11, 45, 50, -16, 37, 80, -19, -73]
6183g3R2q2J14r4J0O2j8QL1j04O2r3Q3k8l7N3J7m6P1lk8O5l2l8J7o8Q7m0l4J4
6213c2L1j8r0J19j1L0n6j9K5M4k4k7N7l1L3k1n5M5L8l2l7k4O1o2L8K9k1J8MJr0
6244g7L9P5r0J6O2J5o3MP5p8j5P7r3O4Mk9%J7Lk0mK4N9m2l2Q0j01%P4j2J5o7m
6277b4O4m7Q2j41P1n7L4L2L3j3O5j11L4o5R4l5NMM4o2m3k0Q3k6k5J9M7q6N7J2
6307B5o8N9L7r4L8k6k5J27k9k0N3r8n3J20k2k3K2k5on5J50j14J7M6j17R0rk1N3
6336C2N0j09K6o9J3N7N2q7Q8p8K2lN9j09K5K9j3l3L3J5j9M8p1R4rq2M9qm6O1k5
6367hl5Q8l0l0K7M8p2jN1r0J22o4p4R4k2m1P9k5n7O4jj6L2n8K1M1k1j5k9l9N3
6398hqO4m9j10J54o2Q3o5j8m1P2ql2J8k1J1L1nK2l9k0L0k9J9o0M5J5Nn4Q0j6J26
$$ y = [-73, 19, -63, 51, -43, -33, 29, 11, 19, 50, -54, 8, -85, -2, -30, -67, -14, 3, -43, 28, 25, -3, 62, 30, -8, 9, -59, 28, -12, -46, -32, -1, -19, -109, 10, -1, 29, -27, -46, -21, 23, -1, -28, 29, -2, 31, 10, -45, 0, 38, 6, -31, -55, 6, -56, -18, 11, -10, 8, 12, 13, -77, -38, 37, -53, -37, 25, 40, -23, -19, 56, -22, -37, 40, -53, 11, 15, -14, -14, 3, 6, -14, -18, 6, 65, 23, -9, 71, -30, -30, 44, 32, 47, -20, -24, 40, -7, 75, -66, 5, -52, -18, 14, 47, 34, 99, -12, 22, -43, 51, 16, 21, 25, 69, 7, -36, -56, 27, 1, -24, -5, 42, -44, 13, 25, -43, 16, 53, -41, -3, -29, -54, 73, 44, 24, 77, -21, -74, 46, 24, 1, 23, -2, -8, -63, 87, -27, -10, 36, -81, 9, 0, -21, 32, 82, -27, -1, -70, -57, 0, 52, -35, 53, -25, -3, -6, 53, -56, -31, -2, -15, -48, -15, 0, -19, 29, -42, 52, 43, -39, 10, 2, -44, 17, -8, -43, 45, 15, -15, 12, 60, -12, -13, 38, -52, 70, 6, -68, 26, 4, -37, 42, 17, -40, 24, 23, 7, 39, -19, 2, 43, 22, 7, -22, -61, -8, -16, 48, -1, -111, 43, -19, 64, -1, -19, -60, 12, 4, -28, -10, -31, -20, 11, 6, 28, -11, -31, -1, -30, -11, -71, -26, -11, -6, -60, 20, 4, 130]
6430A30o5q1O8r5L5Po6O4M0j01J42p1k8J08m5j9J3o4nOL2JK3p6O8m2L6M5q7P6
6460D9j05O0L5p6M2K2q5kL2J5J3k7M2J3l6L4j6l1lN9Rm1n8N0K0n6R6n7N5J6j09
6491d0M1K8m1O3l6k2Qom0O5Qm2j8J06q9j6J06j13K4J2o6N0Q1j05P3J1o8ok5O3
6521FJ4j03L2J0P7o5k1M2m8jJ05p1k9O0M0JJ9q9M7n6oP4l1q%N5q0R8r0P0n4J8
6553A6L8l0K1k7l2O4m1M3%l1p5O1j0j1Rm2L4j5rJ7j6OQ1o2K6k0moj3oO6l8l4L3
6587gl3J39j14O7j3p3M9J6m4L7m4j0qO7l7N1n1J10q9L4K1j20J46p3n3Q8r3M2j27
6616a22J17m2RJ3K2J2%J5J8j13jO5K9j5m9J6M4%j9k6Q8m2p4K3j9l7NQ4l8P0q6
6647e3Q8k9K8lp5K9j1n3J26k8j3j6j6K0m5O1L1q3M2P2p0K6nl7R3n7o3M3j9j7M9
$$ y = [130, 65, -16, 52, -43, -8, -1, -67, -3, 37, -64, 78, 7, -21, 87, 42, 23, 36, -28, -33, -27, 5, 6, 29, -47, 21, -21, 15, 60, -27, 49, -56, 4, 39, -37, 5, 27, -58, -60, -28, -13, 0, -27, 15, 28, -8, 26, 10, -21, -24, 35, 44, 3, -55, -5, 15, -41, 55, -2, 53, 69, -40, 1, 29, -12, 51, 15, -7, 1, -5, -45, 20, 28, -14, -32, 74, -15, -31, 75, -38, -14, -2, -68, -18, 63, -42, 31, 42, -26, -32, -57, 6, 20, -83, -51, -41, 36, -29, -50, -8, -56, -57, 48, -23, -52, 8, 48, 49, 68, -21, 26, -30, -36, 38, 7, -1, -1, 54, -26, 72, -18, 52, -2, 16, 54, 24, 45, 18, -14, 50, 9, 52, 52, 21, -54, 7, -3, -14, -5, -47, -13, -28, -37, -20, -36, -30, 51, -11, 15, -5, -9, -15, -28, -34, 32, -6, -40, -7, -40, 99, -15, 52, 39, -34, 15, 31, -13, 24, -20, -30, -38, 29, -8, 43, -8, 102, 13, 47, 68, -52, 94, 21, -32, 56, -37, 5, -122, -5, -47, -38, -25, -3, 9, 9, 24, 42, -71, -72, -7, 22, 7, -42, -26, 18, 18, -1, -27, 61, 19, -55, -32, -51, -88, -83, 1, -37, 33, -53, 35, 6, 34, 31, -44, -15, -26, -79, 47, 19, 6, -10, -26, -6, -51, 10, 41, -42, 0, 72, 2, 28, 23, -14, 79, 22, -41, 2, -17, -34, 15]
6678A5l0j7k1Q5pl4RN5q4P7n9l3oJ9P2K3j06M6LL7mj7m3O1q2j1N0m6N6j6p3L6
6710d5M8j8N2j8l7J0N2k4o3N7J4l1M6q4J9K9J5J5kl0j3J9k5O9p1k6O6nk5K5p8
6741e9M4nJ5j4K9L5k6q1L2O8r5L3m5O2K1p2J39q4k8K8L7k6mk7K4m5M2j4l0M6l1
6772c1M4j8o1M6lK0L0k6j6MJ4k4Lj8j2L9j9L7qk9P0n8N1Lj06R0m4j4J07r0j6K8
6804gOQ4n4k7R1j04q0J24m2p4J11j3l4mLN6j7J8j5JJ2l9L1jJ7j0L3j49L4Q0n3
6835b2J19r5j1L3n2J01k8km5l3L9l3K2%o8K7O2p7J04l2l5R0r2l5L7M1n2O8o9R
6865b9l6M4M8J8o0K2L0J7qn4j0K3j9OP3o0m0M8P1k8L6o6%L5ko2J4QPp9L0j9Q5
6898D3o2lJ5L1j1l8OP5j08M3M4n4L2n7l0M3JK8N4r5K0K9K6o2N2LK5m0o3j6J02
$$ y = [15, -15, -32, -53, 32, 25, -9, 0, 55, -29, 48, -11, -44, -50, -31, 41, 64, -42, 4, 7, 44, 40, 23, -20, 41, -41, -52, -2, -48, 8, -8, -81, -45, 3, -15, 37, 19, -18, -8, 44, 20, -43, 14, 28, -3, 43, -41, -22, 7, 22, 37, 35, 5, -8, 11, -14, 55, -16, -42, 24, 19, -6, 19, -59, -15, -20, -5, -19, 10, 45, 19, -62, -30, 38, -57, -24, -69, -7, 14, -58, 81, -3, -31, -3, 34, 8, 4, -23, 1, -44, -2, -16, -46, 0, -31, 13, -5, -66, -20, -23, -3, 27, 1, -15, -11, 3, -21, -18, -36, -48, -9, -28, 9, 1, -28, 42, -16, 35, 38, -68, 22, -22, -36, 71, -19, -35, -7, -1, 83, 29, 2, 93, -11, -91, 33, -9, -83, 28, 15, -19, -23, -20, 36, 19, 37, 22, 23, 35, -4, 27, 26, 43, 33, 66, -83, -49, 31, -22, 97, 2, -9, 24, -28, 73, 45, 43, -2, -35, 4, -29, -7, -7, -75, -48, 14, -63, 41, 9, -26, 64, -28, -63, -26, 15, -37, 31, -38, -29, -65, -21, 27, 45, -15, 7, 37, 54, 46, -8, -18, 5, -14, -8, 65, 5, -35, 13, 84, 56, 92, 26, 26, 61, 59, -3, 11, 19, 26, -53, -23, -42, 43, -19, -22, -7, 24, 13, -25, -19, 56, -52, -9, 35, -19, 13, -44, -74, -31, -30, -2, 52, -43, -23, 6, 32, -30, 22, 25, 50, 10, -53, -69, 33]
6929C3o9N9L8j7r7J24l2o3R2q9Kj6J7J5M0l5L1j04M2J6j5N7m0N4m3J2J8m0o4J12
6959C8l1o2J15q6J5M3k1ql1JOK1m5N1k4qoJL6lK7n5J2JJ0K2%mJOo4m2J11ll0N2
6995D6rMm2J9O0l3o8M3rrJ3Mqm7M4qm4R2n0J1N9q1J4pj2K0l7qQ8r9k3Q1l1J4O7
7030E4o4M4j1L9jj09N5Pn8l5Q0LK4j4j2k0k5O5K1n4O1r0K4L1J1J3m2L7j6m9O7
7061C6j9m4O6k6o1Q1J1q6KlP7m5L5n1J9J8mK1qq1L4K7Oq8K5mN2Rj7O5m3ok3J9
7095fM7rn1L2l8L0l0J5L0Kj4P5j6q3L9m9J3lJ6j9P9k5o8MJ8P6r1L7P0j33M3Lp4
7128h0R1j0k9K6mL7l9K7O4q7l1J25m4o3j6M6lQj9l8K5J6lk8N6n7N0o3P5j2J9j0
7160B9l3M5l8RLm7L1n4M0mJ6M5n9J07p4l4Q8j06M9j9k7M7J2N3n7N2j78J82k5r
$$ y = [33, -36, 23, 61, 44, -53, 71, 39, -24, 68, -21, -19, -35, -18, -3, 37, 2, 33, -71, -29, -13, -28, 29, -11, 43, 0, 12, 30, -10, -74, 38, 7, -55, 60, -26, -11, 32, 11, 3, -28, -27, -21, 0, -45, 6, -18, -26, -32, -31, 5, 2, 29, -26, -14, -13, -3, 19, 19, 15, 16, 22, -42, -84, 27, 24, -6, 46, 37, 41, -1, 18, 78, 45, -23, 20, 11, 2, 15, 19, 11, -36, 8, 0, -44, 48, -2, 9, 68, -13, 1, -6, -18, 2, -35, -43, 45, -54, -77, 4, -27, -13, 54, -10, 34, 23, 62, 61, -48, 7, 14, -44, -79, 1, 4, 28, 14, 2, -18, -43, 22, 43, -11, 50, -40, -16, 15, 26, 39, -3, 34, 18, -31, 36, 17, -27, 39, 13, -48, 33, 44, -42, -40, -43, 34, -11, 24, -27, -8, 10, 6, 27, 19, -62, -28, -1, 5, -83, -58, -62, -10, -1, -18, 47, 4, -2, -25, -6, 41, 32, -19, 13, -25, 5, -25, -10, 20, 22, 8, 83, 67, -16, 23, -26, -13, -16, 0, -19, 60, 35, -33, -29, -11, 65, -26, 11, 81, -52, -9, -6, -80, 11, 1, -28, -2, -6, 31, -8, 19, 83, -4, -35, 90, 46, -17, -33, 13, 10, 18, -1, -39, -14, 2, -1, -29, 27, -30, 20, -43, 32, 20, 39, 29, -4, 41, 3, 12, 15, -32, -1, -55, -15, -19, -3, 42, -17, 90, 16, -18, 70, -36, 13, -6, -33, 14, 26, 79, 22, 74, -104, 78, 53, 44]
7190D4l2Lm4K1k8J13j06NR0r8O2k7j4L4q2Q4k8p0N2M7J6l1o1K2L1j7M9l0K0qm
7221A3j8J9KJ1m1j2M5k4K4O2r5oM7l8L0O6q0M6L0r6nl4Q2j7qk4k4Q9r2L6N3o0
7253a9k4J29p8l8K4K2Ok7N5o5k6Q4l4j4k7M3n5J25q2j9j0J0M5k7k0J5jQO9m6j6
7284Gj8k8M9M6q1L6j1K4MJm8K1l3oJ5N7n2P6m5o9L8M7o6kN3j53R5KKN4J0p7Q5
7317C3pm3L2l7N3q8J6m5O5QO4p7Q4o4l8J16j01nO2q4J6l6L9K6Q5n4k7M7j6M7K0
7348I1o1p2O7j4p8M9m2NN1j7L3o0RN8M4j04L5l5k4N4J9j0M0l1j0l4O4j1L1M6o4
7379B9m2qlK6j6O5o4K2k2ML1k6J4K5n7Q9o6OJ0r0R5o6K0P4o4J1L0k9M9q1J1O0
7411C7l8L6K3j00J24j51M2M1k0j6k1P2k3k3J2Ok6k6j7j8J35j7m8kM0krPj6QL1
$$ y = [44, 12, 15, -29, -8, -36, 77, -29, -24, 66, -32, 30, 3, -11, 23, -59, 25, -3, -73, -21, 26, 42, 11, -50, -28, 3, -14, 35, 5, 25, 17, 13, -5, 14, 16, 27, -14, -26, 19, -5, 19, 81, -14, -20, 27, -11, 19, 85, 5, 51, 81, -15, -20, -54, 28, 11, 3, -21, -45, 44, -48, -12, 41, -19, -43, 86, 8, -30, -6, 16, 22, -5, 50, -15, -41, 43, 9, -5, -32, 11, -44, 81, -1, -20, -30, -20, 25, -2, -22, -7, -8, 0, 69, 23, 7, -11, -39, 10, 56, -25, 11, 0, 24, 28, 29, -19, 2, -31, -37, -22, 35, -17, 59, 14, -55, -17, 30, -36, -38, 15, -138, -43, -41, -39, 15, 25, -52, 33, 26, -17, 15, -22, 31, -57, -41, -86, -21, -13, 51, -26, 58, -6, -44, 72, -29, -34, 28, -56, -40, -76, -37, -11, 74, 20, -7, 40, 24, 71, 91, 30, -42, 25, 11, -67, -18, -60, -55, -4, -21, 12, -48, -39, 19, 63, -41, -6, -41, -65, -11, 8, -2, 38, 7, -3, -37, 27, 16, 47, 93, 29, -13, -21, -24, 2, -14, 51, -13, 9, -13, -9, 22, -4, 10, 35, -22, 67, 1, 7, 17, -73, 22, -44, -24, 50, -14, -3, 27, -2, 47, -34, -23, 37, -1, 35, 58, -42, 82, -69, -27, 14, -6, -22, -43, 29, 6, -17, -5, 1, -25, -51, -68, -86, 49, 32, -16, -18, 22, 20, 11, 18, 2, 10, 41]
7442D1N8j26Q2r0N0p6N1l5k5J0J03P9j67P4M5m0j1l3J4L2r3N2k0L3J3l6M0m9J9
7471eO3Rj12j8N7lmn7K3R2r5J0L4k7N8k8NJ9o7O4j7o2L7K8n7Q9r5O4K2l8M3r0
7503e8R0K5k6qL4p7L0K2l8jp8J42j12rN1N2k4Jj9k4K7l4K1J6m0JL6n6J2M9L1l6
7535@k0L7j2K1k5n5J10o3j04O7J4j9N7j5qM0m1Q7o5Ml2l6j1J62p2l6j7O9oj1P
7566B7m5J9K7p9R1k3N9n1n4K1M8n0NN5m8k0N0m5K3j3m0M8q5L4Q9j31R0mj4l1K8
7597a9mK3l5L5Mk2L7p7J6M2l4L9J3mJ4K2m4N7o5l1N7m8j2kL2k6O0n5N6n7N3o7
7629d2R0j2p1N6kql8M5l5K6j1J7n5L8Rm8j5Q2n4K1Q2j30J6L8p1J02Qj26M7JO6
7660B6J7l8O8j06M4K8Lm0Nk5N3m9p9J28k2N8q3k9N0j2PN5n1K5ok7m9M1NQK1l0
$$ y = [41, 99, -27, 55, -35, 15, -61, -10, -45, -70, -60, 43, 122, -45, 29, 74, 34, 23, -10, 4, 36, -57, -5, -25, 8, 21, -15, 25, -24, -5, 58, 67, -45, -63, -6, -9, -13, -70, -47, 45, -50, -40, -6, -33, 25, -3, 2, 21, -46, 18, 1, -61, -24, 4, -53, 36, -59, 5, 27, -11, 32, -58, 32, 57, 31, 23, 57, -20, 10, 32, -6, -7, -85, 57, -55, -64, -13, 39, 15, 16, -3, -27, 0, -34, -13, 3, -37, -36, 0, -56, -44, 5, 36, 0, -20, 17, 5, 26, 1, -54, 56, -7, -111, -44, -30, -49, 8, -7, -15, 25, -16, 71, 6, 10, -22, -58, -69, 93, 21, -15, -32, 37, 31, 20, 27, -18, 1, 28, -51, 40, 17, 76, 25, -29, -8, 40, -10, -5, 50, 2, -18, 32, -13, 10, -3, -43, 5, -80, -46, 43, -88, 2, -2, -16, -47, -19, -23, 0, -35, 0, 4, -18, 19, -58, -42, 0, -34, 5, 18, 14, 28, 50, 6, 63, -2, -33, 24, -24, -36, -38, -6, -32, 28, -27, 29, -28, 25, -42, 48, 36, -35, 21, 19, 11, -27, 18, -17, 9, -2, 15, -40, -2, 7, -41, -56, 26, -28, -7, 75, -55, -39, -1, -72, 30, 38, -88, -41, -40, 26, 43, 5, 73, -33, 11, 39, 42, 2, 7, -18, 35, -14, -93, 35, 13, 71, -12, -41, 9, -3, 4, 59, 8, 33, 27, 0, -49, -8, -3, 5, 26, -4]
7692dPJ9m9R1l6L4p4J6L1o6j9P1o1Q3o1lJ6j4L1L1o6rQ8n3L6K0q1M9k2M2l1k8
7724a2M8j3L1Jqk6K4o7L3k0krj2k4P4pj7j0Q3r6M7j6J6o4M2r8N1J0j0O2m9lO2
7757B1n4j0R4p2k4K9J0l3N5n8j2P2j8J8n4N3J8o6K7k9Q3Pl4okl7M8qk1N5p6M7
7789B3O5m4K1o4J3jm1l7R7o4O7o3l7O0j5lM9k1J2j4JpJ1J1Ll3K7o6L0K3m2M6Q7
7822I4p5L2m1K4K9n6J3j1n0NLN4J9p0N2l6K4K1PL4n2L7r8R2r6LJ3lK2L0k7N8o
7855D5j2L7j11O0j13L8L6m2J08m8m0L5L7K3k8j9J0Kk7J0J8m9K9oJ5l5K1K1k6k8
7885c9N5M8q9R8q0K3p6L6j8N8n7L5l8N8l6L2M3p1L5oJ8o0P4L0r2k4%O1k1N3j8
7916C2j3K3j00O5o3O9k5M9Jp9K6k4%J1J6NOl5N6j0k4J5m8OMKP4pjL8o8O2p9L2
$$ y = [-4, 3, 22, -27, 64, 28, 62, -12, 4, 35, -31, -50, 21, -40, 43, -18, -21, -5, -19, 12, 43, -23, -32, 56, 3, 39, 59, -22, 27, 5, 47, 16, -12, 36, 23, 54, 55, 47, 21, 45, -22, 11, -9, -11, -20, -32, -56, 18, 11, -6, -16, 67, -29, 18, 2, 18, -46, -4, -102, -51, -41, -51, 11, -38, -41, 21, -33, -43, 51, -21, -45, -16, -6, -39, 16, -42, -54, 18, 0, 18, -36, 17, 35, -31, -4, -33, 50, 57, 23, 17, 15, -22, 26, 18, -3, 52, -24, 23, 88, 44, 65, 1, 14, 13, -28, -65, 32, -32, 35, -28, -65, -5, -20, -23, 26, 5, 17, 3, 4, -3, 8, 19, 22, -11, 16, -50, -20, 3, -39, 7, 94, 19, 51, 10, 34, 63, 7, 20, 9, -41, -36, -33, 21, 40, -30, 22, -14, 10, 31, 38, 72, 20, 57, -41, 51, -45, -42, -29, -32, -10, 20, -7, 51, 45, 33, 70, -41, 19, -94, -56, -20, -62, 46, -2, -42, -7, 30, 53, 25, 6, 16, 18, -9, 1, 19, -30, -1, -7, 8, -27, -6, 15, -11, -39, 16, 64, -25, 73, -7, 16, -60, -24, -42, 16, -41, -6, -44, 14, -22, 10, 53, -18, 17, 11, 29, -31, 43, 73, -19, -43, -43, 18, -3, 50, 32, 19, 42, -58, 7, -56, 13, -12, 37, 38, -41, -15, -39, -39, -28, -12, -7, -1, -36, 20, 10, -14, 1, -47, -41, -37, -35, 39, 32, 31, 69, 1, 63, -16, 16]
7950A6O2o8%j7n8J7M4J5k9rj7J08q7Q1j7J0K1o6J4j6n0Q4k8j8K2k4mN6j0L5pr1
7982c1R3o3k7J02j21L5mKP5r4l5O2j5J8N0j3k3N5l4n2J8k9K4JQk3J5M3J1o6N6
8013C8o2L9K2m1L0q8J08m1m9R9q6P0K5r3K0L6M%K8p2K6j2m0L9J5m5L6K1J11j75
8043c7j8L7l5R1m9j0QJm9P3m7l8Q7j2K9L6m6M1p2l0M3j8J4M0j8L0r2J0L9m1N6
8074B3KM8k8n7j8J07q9J6m1m4N1pM5L9m2j9k3L5n1J35n8J9l1L2n9o6J34l0oL9
8104E6o9K3j7K1m8O7n3k6K4J1l5k0O7l1j5J56j07N7kr2O0n2J4N2k8J1K0j09M0
8133b5Nk4P1K5l0k9J3J8Mpj5j04P4N0j7N6p4J4J8j7J1J3nm2k0k1K8K0J6Q7j09
8164a6L8m6K1J5j1k1J3lN7jq9O9n3NQ7n0n8K5O2k4K7k5K2Kq8Q2o4
$$ y = [16, 78, 10, 10, -7, -65, -48, -4, 11, -18, -27, -44, 64, -23, 58, 41, 51, 72, 6, 20, 4, -46, 38, 10, -8, 14, -10, -14, 42, 32, 67, 60, -31, 62, -1, -28, 74, -47, -12, -16, -14, 61, -33, -68, -6, -21, -3, 47, 34, 11, 66, 32, -20, -2, -31, -7, -6, 2, -21, -6, 37, 48, -18, 38, -24, 15, 37, -4, 26, -62, 46, 5, -44, 55, -31, 39, 64, -29, -9, 27, 31, 31, 59, -13, 13, 1, -39, 0, 15, -30, 6, 27, 138, -37, -55, -18, -53, 38, -11, -21, -13, -12, -61, 12, -35, -73, 14, 2, 31, 67, 21, 62, -10, -40, 3, -15, -1, 39, 21, 51, -41, -31, 8, -33, 23, 25, 73, 45, -12, -30, 77, -12, 4, -37, -81, -30, -37, 8, 47, 5, -14, -37, -2, -53, 82, 24, 43, 12, 44, -15, -81, 53, 23, 17, 56, -13, 10, -7, 14, -34, 33, -20, -46, -22, -11, -46, -66, 1, -30, -45, 111, 4, 61, 59, -33, 27, -25, -11, 41, 13, 24, 44, -65, -25, -20, -44, 27, 52, 22, -7, 6, 24, 28, 21, 6, -98, -24, 26, 9, 65, -9, 5, 23, 6, 17, 30, 25, -17, -37, -58, -30, -10, 6, 93, -16, 22, -24, -3, 12, 1, -20, -7, -10, 47, 46, -43, 26, -27, -22, 65, 15, -43, -18, 44, 20, 47, 22, 44, 46, -42, 40, -24]
8191b4
$$ Imaginary data points
##PAGE= N=2
##DATA TABLE= (X++(I..I)), XYDATA
0@%%%%%%%Qj6J6k1K9l2M0m8N6o9P8q9J06j30J52j73J98k26K60k96L36l82M31m82
31b54N40o05O77p57Q41r33J036j149J273j410J559j724J910k116K346k610K912
48A536l258L662m141M722n439O346p542R193j1613J5497k2668L9852j44141j20534
62b38528M15110k45169j35946L50597j41611j71789L03388o8677j46858K12484
72A33001o6208j51801J80068p3372j67455J70836R667j44221J10701K3037r2138
83f7885P3282M9164j3543L607m9708K4366J7474q0337M1487K4765j00215M9648
95b7895L9135q5726O8029M8659p5429Q5178K6013j32649Q0317N9460j38207P1298
107A8183N1001j78357O8147R5241j47883Q4204Q8334j70353R5231J09022j85616
$$ y = [0, 0, 0, 0, 0, 0, 0, 0, 8, -8, 8, -13, 16, -16, 24, -24, 32, -37, 41, -48, 58, -72, 80, -93, 105, -121, 139, -157, 179, -203, 228, -254, 286, -319, 358, -399, 442, -491, 545, -604, 669, -741, 818, -906, 1004, -1112, 1234, -1376, 1536, -1722, 1940, -2201, 2521, -2918, 3428, -4114, 5079, -6534, 8963, -13705, 26147, -117994, -238528, 176582, -68587, -204533, 146064, 4453, -167336, 136052, 67375, -79483, 133001, 66793, -85008, 95060, 21688, -145767, 25069, 34736, -109485, 1216, 24253, -67885, 5397, 54561, 41018, 44625, -5083, 19283, 36757, -43580, -2093, 22672, -77543, -27895, 11240, -74486, -6457, 42202, -33227, 51951, 77964, -54685, 25632, 85092, -53115, 18183, 69184, -109173, -41026, 54215, -93668, -9464, 78870, -91483, 3748, 112770, -72846]
118g2846P7824J22232j87293M7081J15987j96720K2579J58970j43981q22J37590
129H0601j42280n678J73249j06508l8920J39071j00211n2934J21193p2853n0984
140e6254R1575m5464l2763N2188l8814L486N8642k2292j15J4729l6473J5653K4272
153B8370k7923Q485r396m1183L5866L671m4066N7886R399o0225O5177Q001p5819
166d1757P6398K1026q4786N6673j850r4865P0395K7978q0806N4036J4555p9608
178f2611O8121M0565p8774N2038L8498r1014L9223M3522r9040L3758O7103q8503
190c7114O376N1226o4736K8045O2622n1238P968K8874m7756K1894L6427n1372
202h784l038L1273l8806j3691L2020j2432n610K7704k178p051P37k078K6209L913
$$ y = [-72846, 4978, 127210, -60083, -13002, 102985, -93735, -71156, 87814, -56167, -56989, 80601, -61679, -67357, 105892, -616, -39536, 99535, -676, -53610, 67583, -5270, -56254, 35321, -10143, -42906, 9282, -29532, -26046, 32596, 10304, 10189, 24918, -11555, 4098, 28370, 447, 8932, -464, -41647, -5781, -2110, -46176, 11710, 21109, -39116, 26061, 34062, -41757, 34641, 55667, -29119, 27554, 25704, -69161, 1234, 29212, -51594, 2442, 16997, -62611, 5510, 46075, -32699, 19339, 57837, -33177, 6046, 49568, -49472, -15714, 51389, -37114, -30738, 20488, -44248, -16203, 46419, -4819, 3149, 32023, -15733, 6161, 42588, -8784, -11822, 19451, -19355, -33046, -1026, -13458, -19068, 8636, 6458, -593, 144, -1934, 24275, 28188]
216B8188k6649O735j0280k1436K1886k011j0070J5219j9967L713L5356k5069m95
229d880M6708k6755k6932L3564k0036l1329L8310q11l5544J9605o504j8241N0492
242A7647J520l3624M0291m500m0803M1466M630m5796K2406Q655l6236O659J0011
255g674j0554K0436J2839k0202M493J2652j2926J2629J7914k8520j4345J2587
267f71q776m691P659N82J712j864L317P610k839R873R855r793l964j0825j0538
282a3353J6266j278j6980R239j346j6550J7226K0771j1477K190J5812j5332n529
295c41J5475j5075l365J5776k3582r334J6767j4630N760K8575j2560r737J4537
308H266k733j277J3009m756j4397J102l461j1900P981N820q131R444M749j1352
$$ y = [28188, 1539, 8274, -2006, -23442, -1556, -3567, -13637, 1582, -18385, -14672, 20684, -4385, -4880, 41828, 15073, -11859, 21705, 1669, -29660, 8650, 7839, -27705, -8100, -14604, -32845, 17647, 19167, -14457, 25834, 21334, -19469, 21997, 26627, -19169, 3237, 11892, -24344, -17685, -7674, -18228, 2208, 15047, -5155, -662, 11990, -936, 11693, 29607, 1087, -13258, -671, -9447, -14138, -6479, -5897, -4185, -6049, -2732, 4878, 2039, 11912, 21767, 11974, 8010, -2815, -13353, 2913, 1635, -15345, -6106, -7452, -24002, -6776, 13995, 2518, 4708, 20520, 5188, -341, 15134, 59, -3306, 12470, -11112, -20446, -3679, -18309, -12549, 16026, 3466, -6271, 8266, 5533, 4256, 17265, 12509, -1888, -786, -4247, -16147, -8166, -2346, -10477, -1033, 3716, -7636]
322g636O657J1024K630L441o471r278n323j969N390k000m501O00o320M951J1861
337C056l504O397J2517q168p644L097k576l707M049j898j2929k771K092l26J5017
352B702M652j1231J0950K584j3581J3580O913j6019M1O53j1523k381M205L910
366d545M946N09n328K139R020j153L453R771j4381j2895Q469k833n602M904o61
381d187j805k124L55R261L652J788N133j947o058p042J424Q812o115q980J820
396f013l701l637P598R931J035m662M083K967n624K968L031k012j845j1722l428
411a1031P417o067K387J3650o289p868P632O206M60J690K294n380p684j922q53
426e358L223K03o696N310J614r569R774J2813m069j0J009m875l608j277M278k86
$$ y = [-7636, -979, 10045, 12675, 16116, 9645, 367, -4956, -6925, -1535, -3535, -8036, -7436, -13756, -8805, 3056, -448, 5949, 18466, 10298, 2654, 5751, 3175, -532, 3517, 1619, -11310, -14081, -11989, -12315, 2702, 7354, -3877, 7073, 9657, -3924, 9656, 16569, 550, 591, 1244, -10279, -12660, -8455, -4545, 401, 910, -4418, -2279, 6741, 5588, 9041, 18812, 4431, -8464, 5, -2828, -8430, -3526, -4187, -5992, -8116, -7761, 1500, 5152, 6940, 12073, 10126, 4068, -2974, -1550, 7262, 1147, -7833, -6013, -9714, -13351, -5753, 4178, 5213, 551, 4634, 7601, 1977, 4945, 7976, 5964, 4119, -7603, -11031, -3614, -9681, -7294, 6356, 67, -7801, -169, 6037, 6497, 8187, 10481, 5101, -2583, -4505, -5358, -2135, -1932, -8628, -3318, -1704, -11273, -1499, 11314, 7245, 7235, 8244, 3369, -239, -1516, 2762, 2476]
442B476q303l547j75J879K798L777Q751p71o978M415K820l230J186Q82m051r993
458h064m154O452j15P21O897j939j029K471J041P819J343o287J14n337p972K596
474e443L213j396j735L45k28l42P441M895R1L636n096o644L596k932j862L908
490A447n819m264P67n87O828O787N93P7j028k86j069N94L178n677o811k02l734
507i206j806M653N205K807k502M24L751r4M725K636m241k602q332l428Q010l602
523c602l670P889k875n157O353N570J137J050R39k677n901l293R48M772k463r016
539i996M207K212p091J0428J0541o276M02K079k310O08k870J077K535r520o281
554a0255M264o8j689O620O695n362m377O951L486n34L19k183k007o732l940P702
$$ y = [2476, -5827, -9374, -9549, -7670, -4872, -1095, 7656, 6885, -93, 4322, 7142, 3912, 5098, 5980, 1929, -8064, -12218, -5766, -5881, -5160, 1737, -202, -1231, 1240, 2281, 10100, 11443, 5156, 5270, -67, -8039, -5443, -2230, -3626, -5361, -5016, -5244, -5586, 1855, 6750, 6841, 10477, 5381, -1263, 2333, -599, -2461, 1447, -4372, -8636, -7869, -8456, -1628, 5159, 5752, 5829, 4801, 4515, 3446, 4040, 7218, 1541, -5270, -5472, -9206, -11012, -6359, -1154, 1653, -849, -425, 3326, 3232, 7957, 10593, 6352, 3750, -4582, -8010, 0, -3602, -7272, 617, -2258, -7415, -1062, 4508, 5645, 6695, 7634, 4957, -944, -4237, -3289, 1483, -980, -9996, -5789, -3577, -10668, -240, 10301, 4025, 4427, 6506, 4196, 4804, 1934, 3011, 5546, -3974, -10255, -5991, -6059, -7748, -1128, 5567, 205, -4172, 2779, 6265, 5731, 6050, 3867, 1860, -4872, -8812, -1110]
570a110j163m323O713n93k708L560O66P560M077r991j063K054r344J53R434n121
586a199r932M349L597k913O259M604q06M334n136m160Q576n703m996J0352p570
601c44j2748O040M069O70L226M61J365j382k178O736L968p989k494M799p917p632
617a1350Q585P08l668P593l461l864Q837j703L051J0070j2066p457Q485n141m280
632e661O898k394o364K240L008k51K583L773K383J209n245l450M045j938J32L491
648D459j0601l796O631l439O237O863j0566M051Q015j0008L978Q970j0694o11
662e11P618j2213o186J2303j498m660R600n254q149J2406K261l309O809p403n734
677c920O951o143j994P159o279j792N595m448M55P420J228J952J597p421j897
$$ y = [-1110, -2273, -6596, 117, -476, -3184, 376, 1042, 8602, 12679, 2688, 1625, 3679, -5665, -5512, 3922, -1199, -11131, -6782, -3185, -6098, 161, 4765, 3959, 8293, 3157, -1003, 7573, 1870, -3126, 7226, -344, -13092, -7052, -2983, -2313, 913, 1374, 2739, 1357, -821, 5915, 9883, 1894, -600, 4199, -3718, -11350, -2765, -2057, -5725, 1868, -1593, -5457, 3380, 1677, 4728, 14798, 2732, -4725, 3760, -1381, -5661, 1237, -1157, -7521, -5281, -2273, -2524, 59, 3832, 6215, 7424, 2179, -1271, 2774, 836, 968, 4459, -6142, -9938, -3307, -6746, -509, 6354, -4212, -161, 7854, -2154, 1824, 10794, 100, -511, 7107, -5106, -11292, 1011, -487, -5147, 4453, -801, -8950, 3456, 5717, 2408, 9217, 1814, -3920, 3031, -3112, -5106, 2053, -4226, -6018, -423, -4871, -4416, 3004, 4232, 6184, 7781, 360, -1537]
692a537O767l171k690M877r549o732J1016o97l037P890k191r10M590m986J824
707A464M648n275J162l08r834N58O281P56K257o68n223M663N879n210M230N496
723A0876j4595n30J1371j4065l770J5437o978m743Q175o133J453J1201l372j49
737D178L805j0663k766J1891l781r937O960R29r651N040O420k234J873J240J621
752D925p06q859M490Q393r181k531L213p522P21P353O06J275j818l411O560K875
768F383p478L130O938j0288m278Q248p715l651J2882k651n590L939m614M240J0418
783I913p112j924M923q546j383Q666m669n936N798q8n491L507J393m75Q035j027
799E584p167L722j560k546Q014k495p697O08j188J758L631k382J795K453l292
$$ y = [-1537, 5230, 2059, -631, 4246, -5303, -12035, -1019, -1716, -4753, 3137, 946, 36, 4626, -360, 1464, 6112, 837, 1999, 1691, -8143, -7585, -1304, -548, 1709, 1041, -4182, 481, 6360, 1150, 5380, 10876, -3719, -4249, 7122, -6943, -10713, 4724, -2254, -6997, 1178, -4955, -3502, 7699, 4327, 4178, 7983, -2680, -5446, 6445, 2664, -7273, -313, 616, -9035, -3995, 2425, 191, 2064, 3304, 4925, 4219, -4640, -150, 8243, -938, -3469, -256, -7778, -7057, 296, 902, 2177, 359, -3052, 3508, 6383, -1095, 2035, 8973, -1315, -5593, 2655, -5060, -8711, 4171, 1520, -4070, -131, -4745, -505, 9913, 2801, 877, 5800, -2746, -4129, 4537, -132, -6068, -270, -358, -5849, -2342, -949, -1424, 6611, 5584, -1583, 2139, 579, -1967, 6047, 3552, -4145, -3537, -4725, -2967, 664, -1718, 77, 2530, -762]
814g62J116L130k226N0L852k679n931k9n32J342O243m100m846N305j990M18R519
831G880l524n544M169j487k443J275j795O56J658l144k186J456J036K305N570
846E882j399o968J542L090k83K334l775m226K758k930l36N589l028l89O228k415
862A674l376K751K305R36J09l085m867n61K147M78K177j284m876L238L516r91
878B91K960oj056J742m233j809K842k485N32L093m493l802L295M709J508K00n07
895B781k729K21J817q12R78k149m735L228R7m907L784M149k10P01j889o84J846
912A487J143K494j026o164k692K502K241j676l80K128j865J52K868o74J702J387
928C627j397J011l802m849N065K848l208r76r04r26J023L943L056k700j960J526
$$ y = [-762, 354, 3484, 1258, 1308, 5160, 2481, -3450, -3479, -4011, -2669, 3574, -526, -5372, -67, -2057, -1639, 7880, 4356, -1188, 2981, 1494, -949, 326, -1469, -813, 845, -2299, -4485, -3029, -1993, 312, 5882, 4483, -2485, -943, 2147, 1864, 4198, 423, -3803, -1045, -3975, -4311, 1278, -1750, -2139, 4089, 1674, -1702, 1049, 3354, 4290, 4399, 1314, -3553, -4114, -1967, -1489, 688, -596, -5472, -2234, 1282, 291, 3251, 3245, 2189, 3931, -302, -2111, 731, -1754, -1222, 1871, -2622, -6424, -3129, 1580, 3088, 3288, 2781, 52, 273, 2090, 1278, 2256, 107, -4628, -1400, -1303, -6210, -2426, 1723, 1513, 2214, 325, -359, 1487, 2630, 5124, 4098, -2066, -4758, -2256, -15, -1691, -2071, 57, -1808, -1656, 1212, 538, 2240, 3627, 2230, 3241, -561, -5410, -345, 2503, -705, -1681, -2585, -3511, -2488, 1455, 4511, 1811, -149, 1377]
944A377L02q22j388J056J554l896j169J218k341K387M238k10j024k882j33N151
960C418M82j953l24k552k151P91K110o60j781K349Q84j903O35M16K697L374l572
977B260k442j45k903K440L341k950k861p21J468K517O59R02Q58k29m51j128L98
994A013n10r50K586j900n388P70K021K118K765j436j187J52mL055M27k168q71
1011D93j848o12j20j265J642J998L1l68q53R70J614J890J991l337l952J74o84
1028b236J811R10l589L53J017j217K607K098j79J276K94j182k332q46K266P35
1044A786j233k643k377J815J487J264L283k010k648K164Q27o3p34o74J269k649
1060a136k989J808M02M77K495L70j229k195J625M952n79k474k6j349k271j94K516
$$ y = [1377, 1679, 857, -531, 525, 2079, -1817, -2986, -1768, -4109, -1722, 2516, 2306, 1282, -1600, -1733, 3418, 3900, 1947, 1623, -929, -3080, -2289, -179, -839, -2620, -271, 613, -1290, -655, -239, 2458, 5832, 2260, -182, -327, -3230, -790, 2551, -399, -3260, -3981, -2513, 4, 663, 1565, 2423, 2194, 1743, 615, 1013, 503, -447, 2139, 239, -5149, -4379, -2358, -240, 2525, 1089, -98, 54, 50, 3105, 3532, 1364, 493, -1355, -1967, -2087, -3352, -1710, 288, 319, -49, -902, 68, 1682, 3572, 5563, 2226, -1726, -1552, -2236, -425, 485, -3104, -2751, -1734, -2951, -344, 1754, 1575, 2851, 3145, 1963, -369, -1215, 1051, 1786, 553, -2090, -4467, -2652, -1165, 99, 3382, 1372, -1276, 888, 1715, 1652, 918, 244, 1513, -1136, -4125, -2317, -1915, -1438, 1057, 1427, 198, -1997, -372, 4580, 4001, 1527, 1501, 152, -2119, -2313, 203]
1077B03J68l509J190K067k705R28K952J322J143k635j535J184j824J096L014k950
1093A09l715R3K316J013l66K039N82j955L73M77L42L32j079R45j827m243J288
1110c276K389R92Q30j689M8P54n72L812J511l807p25L22j754p14o0J296K21j249
1128a671m58K52J898J168J609K390m007l153L528p16j499J940k595k051Q40m66
1144b991K309J970j038J410R78j990j225K121J393k429q07p14l506J167L182K12
1160D2R55j012p78K292j8P69J463k150j236j117j872M24J78O82J481j565q65J446
1178h81J434K078J197p55k486j421J400q94n50J739k618j292K057j028J451K689
1194B120m70R92j073k867J748R12j380L52l29k987j514L184K187j536J739Q12
$$ y = [203, 371, -3138, -1948, 119, -2586, -1658, 1294, 2616, 3759, 1124, -411, 773, -1051, 45, 3059, 109, -3606, -3513, -1197, -184, -550, 1489, 2071, 116, 489, 966, 1308, 1640, 561, 1506, -321, -4564, -3276, -887, 105, 935, -754, -706, 48, -524, 3288, 4799, 992, 267, 589, -1165, -1879, -1939, -643, -422, -1671, -2129, -1877, 21, 1189, 2798, 5188, 1181, -1972, 1556, 840, -659, 1281, -1314, -3365, -2525, -2991, -682, 1288, 250, 1660, 2638, 648, -577, 1544, 2937, 508, -299, -1013, -4519, -3352, -170, 42, 997, -15, -793, 1499, 1481, 2250, 3713, 1563, 327, -790, -2662, -2238, -2060, -1378, 103, -1462, -2327, -881, 553, 2631, 3828, 3073, 587, -834, 566, -328, -878, 861, -1757, -3049, -992, -2020, -569, 2120, 1650, 2642, 1569, -1298, 450, 1362, -18, 334, 5, -2982, -4496, -1312, 875, -661, 1078, 1890]
1210A890k316J117P90J56J486k236j703Q59k596p12L177J157j677j522K043L68
1226B81j583L625K031l871j118P11p65j91L16J123o75k232K81J311J541O46k84
1243A147J860j824l680L318J938l192R8O92k175j817J605L116o14p54J498j102
1259A14n06J013P01J660j662l210J256l01j688K186J697j176j846O67J946m01
1275D50P38J709j086j697j735M58K327k115l87K615l395j464L791O28K53R24q03
1292A211n36n14p68J143J630j876k870J732K0k913M026K957l908O60J342k019
1308f83J669Q50p38L92k429j752J536M05k50Q38J199j354j867K311J835o90N81
1325A853l15j327j646l15K396k91j608J235j307o65K070j57J994J222l733P69
$$ y = [1890, -426, 691, 1481, 1637, 3123, 887, -816, 43, -2553, -3265, -88, 1069, -608, -2130, -87, 281, -1302, 2323, 4354, 483, -635, 76, -689, -880, -564, 559, -116, -2348, -2067, -756, 785, 1431, 1147, 3007, 1183, -2497, 821, 2759, -433, -335, 357, -1818, -3635, -2030, 1086, 472, -282, 1216, 114, -392, 621, 1322, 2982, 1320, -1890, -634, -935, -2623, -437, 1260, 84, -1762, -1095, 851, 450, 1188, 2897, 1811, 114, -1621, -1163, 1164, -951, -1338, 1277, -2118, -3582, 209, 837, 1090, 2014, 1211, 675, 161, -607, 536, 2166, 290, -2580, -848, -828, -3741, 285, 3242, -666, -6, 1336, -683, 986, 1836, 1098, 1490, -939, -2691, -1155, -750, -1000, -162, 1037, -317, -2184, 127, 1962, 1272, 1853, 1538, 211, -1435, -1750, 646, 355, -1253, -18, -1325, -1990, 80, -77, 1917, 3139, -594, 175]
1341A75J300l178J576K930l060k222J429n26n74L062N00j800J719j101j543L919
1357B606j080k051L477l268l624L852m95j364L534r86k851J639J344l85J586R74
1373B908l006p24J272j868M95J755j808R5K86j625J576J603P01P87j734n09j63
1390D1r72K845k97l686J248J9k628K707K318k064M69K073k285o46L158j292p06
1407C02K667m372k549M701j955q66M958l190k897M138L8q03K411p84j702K47j010
1424f66j168J773K71j814J671k84l279L239K878j630R60o53k268J046M5N09N04
1441A134k556m68J017p50Q07J088O64P01j180o49P02l9L18J024p88l250n32K663
1459i4p09L16K273k717j55K590k042J395K280l367M26J215l706N7L106o37r37
$$ y = [175, 1475, -1703, -127, 2803, -257, -2479, -1050, -1576, -2150, 912, 1412, -388, 1331, 230, -1313, 2606, 1526, -525, 2952, -316, -3940, -88, -583, -1947, 1587, 601, -2250, -611, 733, 348, 1934, 2908, -98, -822, 450, -1418, -923, 832, -976, -881, -595, -2220, -644, 959, 1660, 2447, 713, 204, 41, -931, 1914, 1617, -2069, -821, -802, -3430, -723, 1595, -469, 0, 2073, -212, -858, 2300, 1008, 302, 2969, -1403, -3952, 749, -1206, -2072, 2886, -304, -3201, 937, 975, 172, 2583, 1799, 97, 344, -666, -1834, -61, 210, -1604, 67, -217, -3496, -257, 2621, 991, 1951, 1298, -970, 76, 121, 630, 1134, -1422, -1890, -873, -1623, -816, 272, 936, 1637, 457, -192, 510, 471, 789, 1813, 1025, -2225, -2757, -94, -803, -487, 1786, -931, -1086, 1504, -538, 857, 3137, -230, 196, 1411, -2295, -2238, 868, 231, -706]
1476g06O41q51j036K418J571p34L80j737j255K342j105q04K166j932j088J364
1492c66j345Q65K146o89Q44m22k501J151J981l73p67m40j471r14J790P59p73J021
1510D96o32o28J757j217K88K664j528r36j74k066R91J372m05N17j637j256K071
1527c23J191j30M31M1r97n35P52p05k06J400j466o84O37j977J781L443j956j60
1545E37O29k080J323J494j080k93j068j359N88N59n62M87J755n80j333J543L6
1562E96l76K445p89k174m52j332J373J888j809j76K74q09J164J124K85j4m74J55
1580H99o43j431K40Q74O37r85j479M59K33J104K409p81r56j60q47J819N2k168
1598g24J072k44k249O67O28j00R10R57J21j336n59J530J027K23j450j165R0j248
$$ y = [-706, -65, -916, -1952, 466, 2037, 1303, 1683, -54, -1309, 1033, -72, -876, 1290, -642, -1730, -366, -1711, -846, 1300, 611, 1455, 1033, -1468, -317, 1664, 1291, 524, 84, -1387, -2301, -511, 248, -525, 496, -136, -764, 993, -224, 64, 2728, 1200, 264, 90, -1976, -985, 387, -18, 499, -1138, -2394, -323, 868, 738, 1169, 1210, 213, -322, 430, -275, -481, 919, -547, -1231, -594, -2571, -790, 2653, 697, 537, 1166, -914, 409, 1903, 823, 530, -538, -1897, -1309, -750, -1312, -825, 930, 350, -983, 560, 596, 220, 2665, 1876, -298, -750, -2082, -709, 1179, -630, -806, -532, -1341, -177, 947, 1232, 1218, 744, 899, 256, -1175, -935, -61, 576, -409, -1888, -1429, -1196, -92, 2317, 1536, 580, 420, -427, 1392, 1444, -724, 348, 104, -2145, -1478, -850, -950, -40, 917, 1038, -298, -857, 673, 1700, 1923, 473, -692, -602, -1850]
1616a850Q35K223j833o79J423m88M22M76J71J407q15j427l9o95k3J165M67j149
1634d09k011P95J817J27R17P2j072J88l04M16L20j319N06J64j816k33N24R78J571
1653A231n96l36k27n15J526J015q28j026j124L1J16l42P92j66q7P14r74M43J129
1672G76P5J168m75k114k36q3O50J058j262p60K23j04J022R66M72l66n25O60r29
1691B16j119J287Jo92k46j561J74J150P07J629n45j542P02N63M84J4p93k03q74
1710f48o12N06l77M98J204j83j64p24Q3J613M19Jj015k058N48M88k88Q73p34o98
1730a268Q01O9O31N23j12J076k96j625k97L09M55q5p6n29j812N98K309n0J48k44
1750E25p99R51m41k87J528j270j244J292q59j479J072J758K34j170j13J18j02
$$ y = [-1850, -1015, 1208, -625, -1304, 119, -369, 53, 529, 700, 2107, 1292, -135, -174, -869, -892, 273, 740, -409, -2420, -1625, 192, 319, 1236, 1308, 236, 424, 120, 536, 856, -463, 43, 207, -1609, -1842, -1318, -340, 1231, 635, 299, 72, -443, 1083, 2098, 1270, 244, -880, -849, -733, -1075, -283, -449, -536, 178, -796, -353, 776, 851, 2019, 1544, -570, -806, -889, -239, 819, -443, -1203, -980, -1084, -62, 904, 1376, 1010, 485, 1145, 216, -903, 384, 385, -307, -553, -2114, -1940, -790, -83, 1546, 1001, -541, 161, 724, 1208, 1222, 429, 226, -648, -1260, -754, -1131, -633, 571, 388, 224, -500, -417, 1196, 1615, 1616, 601, -1457, -909, -421, -709, 164, -570, -1268, -467, -398, 233, 756, 644, 1720, 1424, -201, -498, -189, 266, 181, 105, -424, -2236, -1638, 671, 621, 769, 525, -274, 677, 236, -51, 1477, 207, -1037, 255, -604, -2083, -1011, 747, 981, -189, -302, -184, -286]
1767b86J293P75l27j429j716J611P43k046J174P82j724L81N50j98Q13K85O58l0
1785A309k353j56J867R2p83q8l47j330O30K066m84k59O01o32O29l97q85J901n01
1804H80j758R49j242j169K324N20o27M80r88k02J726N97q46L06k83j789O66P96
1822C40j683J116R68j795P71Q8r17K651L64j812P29j147j037J847J35j131J12
1839d01p16k20J244J75k54J541L1j781J046N8j892K373L61l067P85j65j265K934
1857G87P8j674J660p67r54K314l14j261J205o43j816P84K40j034J937M54k452
1874a456J268M00j355L152L4l229K070o45k336L092j24k654K106pk192J762J018
1891I04j220J441M96k327L09Q48j248J705N06l285R24Q86j598K137O00j785J277
$$ y = [-286, 1007, 1782, 1455, 26, -1690, -79, 664, -1382, -208, 574, -1150, -769, -219, -417, 396, 681, 1339, 1309, -1044, -1200, 667, 759, -24, -112, -459, -1789, -1159, 907, 423, 164, 765, 133, 762, 365, -520, 1381, 880, -878, 71, -1171, -2340, -16, 504, -123, 357, -631, -833, 893, 1490, 644, 950, 667, -1122, -456, 340, -1343, -227, 741, -1054, -283, -195, -1112, 1539, 1903, 91, 820, -327, -1364, 483, 618, -513, -401, -1117, -1337, -93, 82, -172, 1369, 1400, -381, 665, 723, -1169, 1204, 1565, -1502, -717, -882, -2147, 787, 865, -809, 851, 84, -870, 1444, 1130, -131, 1074, 431, -1385, -601, -361, -1395, 542, 996, -1456, -188, 212, -1143, 2009, 2043, -1186, 884, 239, -2097, 995, 871, -1783, 323, 316, -1876, -114, 904, -316, 1125, 1621, -706, -397, 451, -797, 908, 1414, -1871, -947, -61, -1659, 478, 1078, -707, 570]
1908E70l73q54K006j110m72K271k022j971K057l10j121K512k83k764J493Q33j332
1925h70K564j45k991K388l10k813L170N8k942K555j87k652K123O70q39J859o42
1942I96k083J436K00j281J770n6k918J173Q05j743J991O48j956K012l62k069K844
1959A407j91j923K507j246k851K007K26r35J722o14j695J697K03j009K340L6k755
1976a074J879J10k988K227Q03k343J739n85k025K800K3j110K593j132k380K145
1992F82K09j668J375O1k059O64M68j245J905P51j975J790l7k571K600R17k537
2009f70J478n47k184J631J74p45J783q53j432J710J95j125J723N71k243M83L46
2026B95j625J239Q33j630J060m21j793K651M26j588J934n04j827J419k03n90J144
$$ y = [570, 197, -657, 1349, 239, -233, 2038, 16, -1955, 102, -208, -1329, 1183, 900, -1864, -371, 462, -870, 1694, 1549, -1442, 946, 636, -2177, 993, 1051, -1891, 664, 477, -2175, -52, 618, -221, 1638, 996, -1087, 349, 549, -732, 1038, 982, -1936, -763, 42, -1701, 290, 938, -1018, 994, 632, -1437, 1407, 1216, -707, 1800, 554, -2297, -290, -64, -999, 723, 109, -1586, 111, 314, -695, 1645, 1681, -1074, 805, 915, -2073, 154, 957, -1386, 353, -232, -2257, 543, 566, -544, 2049, 917, -1463, 682, 891, -777, 598, 659, -1400, -736, -268, -1513, 392, 1143, -832, 958, 921, -1650, 950, 1867, -670, 808, 261, -1923, -292, -118, -863, 920, 67, -1365, 345, 540, -585, 1138, 1709, -534, -51, 295, -1330, -91, 742, -888, 172, -249, -2042, 609, 1035, -553, 1381, 877, -950, 469, 266, -324, 820]
2043H20p49j021P81n66n65K105O9j490J085L9j714J977N95j793J056n67k017K154
2061A99k0j474K240m58j801J583K27o85J360Q2j398K53k44j025J089O31j605N83
2079d63M34j513J463J131j002J019k77j362J229m43o11J411q73j373P79k04k16
2096h71J323L39o30R9q5m51R99K17j239P67o16j804J549N12j171J622j32j303
2114h75J406m2m16J593o95j353M88m60p99Q95N65r31P1M21o23Q01R74m78M36k90
2134F88j407Q76j9q55J142o00r73P10l06K93J301k97j37J66o38j62Q82mo58j11
2154a09k84q81P93P00n07R24k46j038J171j11n68J239n55j040L85o44k6Q11K7
2173D1j21M2l91J1P51O98n21N7k1j106L39N22o21M73k18p13N29m24K24J237l98
$$ y = [820, 71, -950, -169, -735, -1300, 805, 874, -616, 469, 508, -1206, 771, 1366, -427, 629, 62, -1955, 199, 179, -1295, 945, 487, -1314, 269, 496, -189, 1171, 1253, -145, 108, -136, -1161, -72, 559, -1046, -463, -29, -1542, -79, 1052, 50, 1069, 792, -570, 659, 216, -395, 1016, 143, -1230, -451, -655, -871, 452, 791, 161, 260, 175, -276, 723, 940, -299, 468, -148, -1952, -403, 109, -1062, 560, 428, -875, 531, 489, 73, 1666, 971, -382, 106, -354, -1153, -258, 307, -624, -553, -132, -755, 46, 1020, 542, 978, 688, -719, 157, 138, -717, 425, -175, -1148, -438, -744, -451, 850, 553, 416, 582, -56, -218, 664, 660, 2, -109, -393, -1274, -481, 219, -288, 636, 390, -648, 523, 412, -156, 1083, 528, -512, -127, -771, -797, 14, 41, -80, -38, -429, -418, 333, 1031, 510, 567, 546, -560, -221, 301, -320, 153, -65, -778, -249, -673, -449, 788, 390]
2194C90k13K67r21K93P10j88j08l47n90o8N60K22l6M89j46o95O95P1l12R30m62
2215E41q51K61p94j8J123l71k03J35n41M54O10L34O5l05k52k77l1N0j41L32j37
2236a6q23L11J84J10J062j06k75q7p30M53N68o06l6l08o37J81J83K64N49q6J88
2257C43j44j97K36L11N51o95r17K41m86L9J068l65k72K64m39P02L10k88N36k24
2277E74q12j2j79L0K37R2M7n55q7O39M03M99j61n34J42m22j2N83n44j48L4n01
2299f87K39j5J48R96k56m01J32l64L01L98K0k10q18k15M49J41J67J6O3J46m59
2320b09M14K46m01N19J4r47qj66K60P47m69k98O4l57N03O06M4j64m01J17j20k14
2342b20L29r6%N3o52M5L52J2P81j7o69n8k3M76L32m71o6m64l34O10j14j09N40
$$ y = [390, 177, 444, -477, -184, 526, 338, 230, -117, -707, -775, -215, 7, -29, 460, 314, -381, 314, 385, 73, 1003, 541, -310, -49, -843, -861, 262, -109, -312, -177, -718, -264, 346, 680, 745, 440, 188, -89, -120, -70, -211, 121, -16, -839, -528, -344, -234, 828, 722, 447, 360, -370, 83, 651, 45, 9, -299, -936, -755, -572, -308, 241, 155, 343, 199, 2, 238, 549, 1100, 405, -512, -271, -757, -718, 350, -15, -287, -23, -462, 240, 550, 262, 798, 574, -238, -250, -429, -399, -162, -70, -23, -578, -665, -26, 377, 876, 715, 181, 323, -99, -111, 472, -72, -220, -186, -687, -448, -463, -315, 681, 425, 24, 156, -208, 93, 491, 511, 301, -517, -732, -283, -142, 25, 41, 104, 250, -209, 205, 451, 50, 569, 583, -364, -372, -538, -278, 469, 0, -298, -234, -591, -88, 518, 562, 398, -3, 114, -6, -220, 109, 13, 13, 66, -586, -541, -189, -177, 604, 587, -82, -140, -163, 313, 645, 174, 108, -356, -690, -80, -194, -303, 237]
2365B37k27j8pk74L67L82J78l17p52J03o0K56O29o68k53K86k75N60M74n08L52
2386D65Nn04o9j43J30K59j99j28m30j14N72M56K00r0n64K80q2J41M41m92k71L3
2408a04m35K40J15M4N92j83l80R5k83M96M65m04k00n02k67M70L23R8l66k6K58
2429D6k21K31M53k71J73j4p18J08j80K36P78o86n03L78k43M15N79k28j97k63o4
2450a91K71j30LK30m3k82m75M60K57k11P91k18r70M18L7K24N50o98k02P1n01N37
2472g2K71l44J46M9j08j34p7N00K44m5l40l83J36m2L16N97j044l53O79l54K58
2493a00P50p73K47K52p40M00K70m01L38P8o65l81M48K89J18L32m79m67O03J9J0
2514A48O88q87k40N69o94O5M16l10M20j23o23N33O3J6O79j90p11j72L63lN8J79
$$ y = [237, 10, -8, -15, -289, 78, 460, 638, 321, -431, -328, -388, -132, 497, -171, -424, -138, -413, 147, 621, 113, 465, 470, -34, -103, -246, -116, 143, -56, -184, -614, -728, -156, 300, 500, 410, -154, 126, 44, 185, 626, 134, -137, -104, -539, -299, -184, -140, 452, 269, -111, -16, -299, 197, 662, 258, 58, -444, -711, -241, 82, 180, -186, -212, 46, -175, 56, 509, 238, 411, 397, -321, -213, -393, -157, 621, -65, -568, -190, -433, -18, 561, 333, 136, -127, -191, 80, -50, -47, 183, 140, -142, -617, -157, 100, -111, 680, 462, -508, -90, -53, 171, 721, 23, -179, -108, -609, -72, 199, -145, 1, 50, -58, -192, -269, 231, 475, 430, 90, -293, -157, -199, 117, 714, -330, -683, -4, -358, -100, 650, -123, 124, 376, -364, 36, 306, -95, 243, 321, -344, -725, -277, 12, 130, 462, -17, -484, 119, 138, 148, 836, -51, -291, 278, -416, -351, 65, -245, 175, 52, -571, -38, 25, 41, 720, 530, -181, -353, 10, 7, 65, 244]
2536B44n85j24M44l73L72N65p76N15M46j362M85O37p93O12R0j245L66M69j82O32
2556D37k8p44J46N08l30o1O47p05j00N58r68J38Q79o33N30J60j280P32O29o38
2576a23O96j33j086O31J99n25M78J33o24J67L46p06L55R15q36K36M45j374N79
2595b27R74j079O26M8j303Q23N32q35P80Q2j036O67K49p56O36M89r00K71K42j107
2615h24N06J139j139L31N33j549P66J129j182N96L00j286O90L03q13O26K21o97
2633c50L23l5o65Q23P37q26J77J97j057P36Q47j336M93K33j335R69M93j250J229
2652D03J93j210Q30K14j029R73L47r34J00Q5p46N80P43q61L11L09j111J027O72
2671H96j384R35K94j656R66K31j275J261K65j324R01N0q96J239M75j153L03K31
$$ y = [244, -341, -465, -21, -394, -22, 543, -233, 282, 728, -634, -149, 488, -305, 307, 397, -848, -482, -13, -195, 437, 409, -335, -189, 319, -11, -72, 575, -130, -230, 328, -640, -502, 377, -256, 274, 434, -846, -114, 515, -123, 573, 440, -646, -15, 184, -341, 137, 270, -354, -187, 159, -547, -192, 723, -113, 123, 568, -806, -227, 747, -332, 294, 342, -961, -138, 394, -441, 339, 421, -615, 52, 301, -455, 181, 670, -230, 41, 283, -824, -318, 821, -318, 13, 546, -1003, -237, 892, -290, 306, 606, -680, 10, 313, -500, 126, 347, -350, -27, -62, -727, 96, 833, 7, 184, 381, -676, 60, 907, -429, 64, 297, -1038, -69, 424, -826, 403, 596, -614, 216, 430, -599, 374, 721, -213, -113, -28, -774, -194, 549, -312, -1, 308, -803, 224, 896, -488, 447, 741, -915, 51, 282, -993, 268, 533, -791, 110, 160, -736, 503, 978, -175, 128, 359]
2689C59r88N71O70j126L04N10j200P11O39j086J003M92j364O88J72r76J085J49
2707F13j024M43k35m99R05J82q59N94J83r29P49N85j156O50M48j423N43M99j055
2726g86J148K41j290P79J23q12J189O5r35N18m6o68N56K13o82M39K10r61M53N71
2746C25p86Q02L48j241N69K72q11J088j13j037O87j85o17R79oo50O12j23m83M27
2766E7L21m88M32R0j080N04L87p91Q71J53j132O75J84p17J060o3q24Q03m23o59
2786f40Q43l2n18N16j67n31L76M36l19L50J95q42L40K84o94P59l9r13O05p9n79
2807f49P97L1k81M88m21k26N77k18QK45l83m57L17J45k85N11J0o57N23R0n63Q24
2829D26j6p55O11k77o98Q34q8k37M70m26j84M36J3J10J46j83m24J36K12l85L32
$$ y = [359, -629, -58, 612, -514, -210, 300, -900, -189, 450, -636, 367, 859, -505, 183, 355, -621, 464, 613, -411, 32, -203, -702, 203, 385, -474, 120, 303, -626, 123, 708, -448, 202, 650, -773, -230, 269, -786, 362, 603, -687, 92, 215, -597, 592, 657, -278, 240, 194, -474, 82, 295, -387, 52, 262, -699, -246, 325, -461, 341, 689, -552, 17, 289, -522, 566, 453, -584, 103, -82, -699, 280, 274, -376, 236, 113, -370, 57, 378, -110, 322, 412, -668, -164, 223, -568, 303, 456, -676, -1, 183, -534, 526, 463, -361, 442, 19, -640, 203, 171, -347, 169, 2, -529, -153, 283, -36, 314, 509, -333, 7, 291, -403, 356, 317, -596, 9, -70, -649, 148, 179, -102, 386, -35, -261, 316, 98, 106, 351, -32, -489, -172, -27, -312, 199, 209, -448, 75, 165, -398, 426, 410, -345, 266, -11, -709, 125, 37, -200, 270, -156, -340, 96, 109, 219, 365, 182, -242, -106, 106, -279, 53]
2850E3K06o17K83n6k64O93m0k71L71m66k66O21l10R0K77o33O7J22k8K15J52o9
2872A30k16K6O9j83M28L1m41K37k41k93O58p7k36L86m94n2M19j53Q4K05l53j43
2894b09Q3KP6J06J61k93nR9k30L40J41k59J12k52r7M11k12Q8K06m79J8J12j64
2917b45L72Jj85L6j66J44J11R0J8q8r9r0j17L45J5j73K53l74j45M12j88K66J97
2940C90n54R7Qj91L47r2k3n5j12J40J0J22K33j60o1o2k17K66O1k01J80k73j51
2963b98K01p9L37J0k39J44j45q0L54o1n8m6k77J71j03M9L29j23j5p8j31J33J27
2986A22O0j1l58N5Jj08L94j17j01K16l66P6K62o4J14R4l30q4k6R5K58j42N1k10
3010a19j81L20n7J17J54l17Q4n2j22K22PJ6L6l28Q7J53j12L43j14l33J98r7M0
$$ y = [53, 259, -358, -75, -131, -395, 298, 258, -13, 358, -108, -374, 247, -63, 27, 304, -329, -262, -140, -168, 47, 199, 130, -86, -60, 9, -174, 254, 285, -156, 81, -160, -453, 205, 128, -108, 278, -216, -268, 151, -2, 82, 287, -66, -209, -126, -124, -48, 58, 219, -74, -79, 20, -210, 130, 271, 12, 124, -128, -225, 186, -26, 62, 268, -211, -193, -81, -245, 127, 128, -57, -21, -187, -43, 68, 158, 176, 88, -11, -101, -218, 127, 142, -31, 222, -152, -297, 115, -73, 193, 390, -164, -67, -59, -250, 97, 5, -18, -73, -185, -45, -35, 87, 320, 160, 99, 37, -180, 86, 147, -54, 126, -147, -298, -97, -176, 161, 171, -68, 76, -69, -149, 205, 144, 86, 40, -237, -66, -169, -120, 209, 86, 71, -7, -138, -5, 122, 182, 171, -187, -132, -131, -239, 155, 38, -63, 153, -213, -137, 125, 61, 175, 269, -61, -145, -171, -76, 182, 40, 91, -119, -300, 20, -37, 80, 234, -83, 1, -51, -173, 49, 56, 72, 108, -220, -133, 20, -92, 251, 137, -196, 2, -95, -55]
3033e5K17o7K5o2k12J13L6J34j2j12J25k68jK49j30J66M2m16J14R3j44M49j82
3056A02k52K12k38O2J04o3K12j36j58J02pJ69Q2k7K5l56K8J39m8K00J8m31K30
3079c1K8p3L04k10K6J31l12K9J20n7N2J12j75j41K2K53l3J07O2l83M0J84j57K82
3103A80j26k49L02k33j05L06p7L6K29m14N4J20o4K64r2j61j56M2Q2RJ83j1l51
3126b32L04o1j68M00j52o9J81l86j46M23j23R0R4k82o2J12J37J18j86L3j49N0
3148g4O7l9J71nk25K42k16j07K92m4l9K02m69J8K36r5K61L1l76R2N2j01K15n6
3172C3l4j07O8n2q2L91n5j73J67j79k48N20j67p6P9k79L4K12j35K10j8n9n4l9
3196d3J12p3N3K07k34j92O2n5K11Rj6Q9k97O2L44k48J25Rk86Q0j8j26K21R5j50
$$ y = [-55, 162, 95, 120, 58, -154, -41, -5, 129, 117, 5, 130, -138, -139, 110, -20, 146, 188, -228, -114, -21, -165, 284, 102, -150, 62, -176, -114, -10, -73, 139, 3, -155, -53, -60, 109, 191, 164, 189, -167, -139, 0, -48, 152, 170, -261, -31, -3, -76, 228, 18, 44, 175, -137, -108, 12, -45, 7, 119, -56, -197, -175, 78, 45, 152, 214, -169, -129, 55, -102, 180, 54, -195, 107, -126, -231, 75, -2, 34, 263, -151, -97, 23, -41, 223, 131, -30, -186, -144, -62, -53, 130, 119, -232, 72, 11, -157, 243, 91, 22, 203, -183, -329, 94, -29, 61, 155, -127, -189, -77, 60, 178, -8, 25, -124, -74, -7, -46, 125, 120, -105, 137, -79, -186, 106, 62, 23, 225, -244, -226, 10, -85, 176, 207, -169, -77, -25, -126, 89, 33, -1, -108, -40, -92, -174, 217, 162, -11, 156, -23, -271, 249, 82, 6, 85, -194, -160, 52, -83, 127, 109, 50, -4, -43, 69, -4, 49, 256, 22, -170, -108, -163, 48, 57, 41, 130, -167, -105, 239, -9, 116, 125, -161, -81, -99, -225, -4, 91, -59]
3221e9N2k3m0L9K79J0l40J22j21k28M40Ok74K25k30O9J54j88J76Q3j18Jj23j06
3245a94K51m6J6n8k17L7K14J51K2j50k0n2n0L05k48M2J61l69J33J00l28M11J10
3268B21k58O2q4n4K64Om7q1j94M5L7J31K3j36R3j49j9K81k36J39K96l89%o2m9
3293a60K67j8j38O3j43%K23q5J18j25k7mq3M5J07k7J56k14q9J42j91K45J51l52
3317a39J25j17l1L16Ok16J06j32L1Q9o9K0Q9nj22j46K08n7M8K92l75p2K66k30
3341a15K24R5l61J13k0j32K51m7L0M5j15R8j73O3P9l8O3k56m9J98k9J67J29k69
3365d9%J30j45K41m7k10Q6j04j03J07K3J23J18j35o5k0J02J35j23J02k15j38J32
3388e5j25J30J64k73J35O5k48K84M7r9J57j74j59J2R3J3L0j0q5o2K30j1nJ23j98
$$ y = [-59, -7, -30, -70, -31, 248, 258, -82, 40, -81, -309, 131, 137, -137, 88, -142, -73, 81, -107, 69, 152, 34, 35, -88, -194, 57, 11, 27, -31, -248, -211, 3, 154, 176, 26, 6, -46, -96, 209, -39, 3, 164, -205, -72, 28, -300, 111, 221, -37, 25, -59, -113, 151, 157, 110, 29, -165, -120, -83, 48, 71, -65, 28, -121, -140, 141, -95, 44, 340, -49, -49, -111, -160, 107, 89, -49, 14, -129, -129, 94, 9, 127, 2, -25, -29, -112, -67, 40, 13, 169, -45, -134, 8, -183, 62, 213, -139, -14, -131, -162, 154, 160, -56, 50, -82, -51, 38, -31, -11, 78, 73, -49, -195, 13, -44, 4, 296, -79, -151, 115, -115, 109, 204, -157, -44, -64, -196, 55, 8, 38, 83, -32, 66, -107, -44, 35, -3, 60, -196, -245, -47, -76, 91, 220, -49, -49, 81, -64, 177, 130, -80, 6, -98, -201, -94, -71, 52, 170, 35, -30, -50, 52, 187, 64, 166, -49, -187, -55, -180, -50, 114, -159, -24, 41, -207, 77, 124, 25, 182, 8, -151, -139, -46, -33, -3, -13, -98, -160, 70, 59, 54, 177, -21]
3413b1l8K11k67O3J12j66J45j5k29J68J04l8J34j31q6K0L6J07m5j8j15j86L08
3436E3r5o1K32j54j0J31k18J26R8j20N6Lk23J70M2%J52j88k1n5J35J10k55J89
3460I7m4k18K29j11p4K64j18j34J23j94J60J43q7k1jj43K05m6R0Oj15J4j68O3
3484h0M8l1J50q6j03J78j75L1L11j24j58N9q9J2J08o9K6L6p4n3J43j9k7P5lk35
3510a49R2M6p6J93r0k23J77j03O1L59k91M0R3k38J48N2p5kko4j34M0J72j16J15
3535B5J39k71Q2L6q1K36q9j92J20j11K6J73j06J7Q7j91J24o4J00J2On3j70J02
3559d3O1r6J87Nl31K15oo3K89j22j09J49k28%J24q7J02k1j92N9J6J88m8l6J03
3584A16k22L2Q3o6J21M1k30K36j30j29K83j68L4J24j55o2J16mN2q9nj19K6P5J30
$$ y = [-21, -59, 152, -115, -52, 60, -106, 39, 24, -205, -37, 67, 29, 163, 32, -54, -34, 2, 109, 64, 46, -69, -255, 53, -42, -103, 129, -25, -35, 96, -122, 4, 102, -18, 38, 41, -182, -12, 30, 30, 182, -6, -27, -82, 53, 163, -92, 97, 53, -165, 64, -47, -121, 143, 25, -109, 14, -180, -20, 123, 36, 15, 14, -129, 76, 30, 120, 126, 11, 25, -143, -80, -32, -63, 87, 1, -102, 76, -99, -68, 243, 119, -39, 20, -69, -57, 51, -18, 8, 44, -30, -83, 60, 41, 14, 89, 86, -149, -57, -11, -87, 106, 16, -207, -30, -133, -72, 287, -4, 36, 129, -109, 39, 91, 16, 14, 12, -52, -186, -146, 26, -90, 25, 164, -107, -25, 11, -70, 166, 77, -115, 5, -106, -80, 93, -13, 4, 91, -100, 24, -40, 60, 72, 78, 25, -145, -43, 18, -78, 109, 114, -217, -2, -8, -71, 218, 96, -13, 136, -92, -92, 32, -55, 47, 26, -166, -107, -91, 97, 49, 13, 116, -106, -74, 9, -57, 64, 105, -125, 111, -19, -148, 135, -33, 1, 125, -30, -92, 24, 20, 72, -17, -22, -141, -115, -40, 90]
3609I0n0R9k26M9J01j70J99N0k35K02j49j29K73j01P9O2k76J38p3L4J08l9n2m8
3633f4K1Q8k5K9J00k72J33r7n1J97n8n2J44k46mK80j58Q4R3j89k1P4k7L3l6Kk9
3660e1m0J16o3J03K4j03Q6n6j42K83j65kL9j34k5P4J2L2J25j15M2o0J3N9K0j5
3686E7j20mQ1j23R1P1j14J23j23k5J80p6l1J98k41j6J69k29K15K5k16Q4K3j1N
3711gRP5q8J8n4j00K67r4j11K77k72k4J63p9O3J22k45N3J09j30J15n6om7J0L4
3737Bn1J33m1r3N7j04j7K01m9q7J58j69lJ81j49Q9R4k27O5L0j60J37M3jl8pK3
3764A7p3J23j8j01J20j59m9K65j41p0K34k71J21J44k19J48P0j95O0K4j41L0J55
3787G4r2l3Q9p7RJ31%j45J87p6j83K12j00n6J87j95k7J50j38J24N7r8P4q5k9R0
$$ y = [90, 40, 139, -87, -38, 63, -107, 92, 142, -93, 109, -40, -169, 104, 3, 82, 144, -132, 6, -67, -33, 75, 36, -16, -64, -43, 45, 20, 49, 149, -123, 10, -87, -138, 59, 1, -51, 93, -153, -157, 123, -35, 49, 142, -47, -68, 6, -21, 12, -24, -22, -51, -91, 25, -38, 65, 89, -14, 72, 16, -126, 157, -8, -10, 29, -105, -130, -56, -44, -12, 113, -2, 40, -20, -7, 52, 72, 57, -63, -67, 14, -109, -18, 53, -61, 62, -61, -86, 94, 18, -13, 185, -56, -72, 97, -132, 83, 108, -108, -24, -1, -12, -7, 2, 77, -11, 7, -47, -147, 120, 26, -85, 192, -80, -104, 59, -20, 43, 165, -80, -27, 82, -48, 67, 11, 5, -42, -32, 2, -49, 84, 43, -50, 7, -97, -114, 87, 38, -49, 109, -60, -63, 118, -31, 58, 152, -75, -10, 20, -140, -3, 40, 39, 1, -6, 17, -56, 67, 49, -52, 68, -91, -140, 125, -16, -86, 148, -123, -2, 142, -77, 71, 141, -54, 6, 30, -111, -81, 74, -18, -51, 38, -39, -30, 101, 101, -44, 143, 67, -116, 96, -4, -60, 127, -68, -95, 55, -83, 41, 98, 0, 74, -11, -40, 50]
3813E0k9L8r7m4N5j12J54O1r8J75j94k8J84j46OJ59k44J01j9j23J54J7n7J40p5
3838B8l1j1N3N8j37J18m4j78J96j01o7K65j49l5M8n2Q3J25j76l8P1p3N5L3J6l1
3864B6j03Q1r2Q9P1j41R3k3q9P4n5K1J88j75rLl8P3R7j29j5j5K8N4J8l4M5O3p2
3893C4r7N1j4o6J53p8p7J35j51O9J76j22p5J53r2p2J42k4Mr6K3J4pP4o2J32n0
3920G7j50P1J29j78J12l3j14J00k8JJ02j04J3Q5j17P7M7%r7PJ6j01%P0n0M8O7
3947E0j44J64n0r0J85o0j02O1p9k1J60n7nk0o8R1j5K4L6k8rn1n0J94j06j5m3l2
3975h0Q3j8rN0k1p9J45j62P8Q1q2Nj3n8O7j17J47K2k0kn3J3P2r9J84j07j20J21
4003B8n9l4J42n7o9N1r0o8J88j7M6o2j2J1l4Q3l7k1P2j24qR4q7J05J0r3P8j33
$$ y = [50, 21, 59, -38, -82, -27, -139, 15, 76, -22, 153, -41, -69, 115, -31, -25, 134, -110, -9, -28, -151, 3, 20, -37, 103, 28, -3, -14, 39, 97, -40, 78, 34, -144, 52, -49, -116, 149, 0, -35, 13, -39, 44, 169, -7, -45, 26, -47, 8, 41, 57, 26, -77, 4, -88, 1, 72, -69, 24, 1, -88, -14, -69, -48, 140, -35, -44, -41, -79, -6, 91, -38, -53, -68, -40, 14, 32, -2, 43, 106, 34, -63, -12, -26, -92, 61, -17, -94, 41, -110, -41, 135, 13, -62, 91, -1, -73, 69, 45, 49, -47, -24, -10, -17, 57, -5, 127, 77, -73, -2, 127, -51, 61, 28, -86, 14, -14, -13, 89, -15, -2, 83, -34, 43, 90, 90, -7, 0, 16, -85, -85, -15, -65, -17, 50, -94, 70, 20, -70, 115, 55, -47, 14, -65, -86, 74, 17, 12, -8, -76, 15, 0, 24, 60, 32, 23, -28, -78, 116, 10, -5, -48, -80, 3, -15, -24, 26, 5, -74, 71, -91, -13, 68, -14, -9, -22, -80, -13, -130, 17, 39, 19, 17, -36, -23, 49, -50, 134, 27, -93, 28, -31, -65, 77, 20, -49, 2, -88, -156, 32, 15, 61, -1, -13, -2, -36, 47, 10, -11, 61, -63, -71, 23, -64, 41, 51, -42, 36, -97]
4031i7P2Q4j1NJ2j61J29o9L9O8j01N2n9J5J08m3mR0j53O4k7k5L8Lq9J01p4n7J33
4060D3K2l0J7n8j7%P8j5o4J35m0j39P7pK9O3j35J07r2l8J26r4n4J03o0j2M1j3
4088b7O8n6n5J10l9M4n4J6RJ1j33J01j00J08kq0Q3k7l6J97j63M8J17j38ql7J2
4115c1L7Rp2M6L6mn3N5M0j08Q3kq9J77l6j57J09m3o6K21j58L5%n8l3P9n2J00p4
4144ikj2n1N2K3m5J25j53pR4o8J06k4n0Q1r2j0Q8j27J12M3j23l5O1k9J05J8l4
4172C7q9R4k7k3P1Pq7Q2p0m7J19r5n3J09m0j9O1k5O5jj23R9j47Q8M0n2L1m5N3
4201A3L7q9M6J06k09J48m2r0J08%j3R8j92J6J00n6M7Po9M3p7J18j1Ok1Nn8J42
4229A13j48J5J37o0j3p6j6J03q1PP9l8o6O8o2J6M5l5M9l8M5r1J8J08r8L8l1o5
$$ y = [-97, -25, 59, 48, 53, 65, -96, 33, -36, 3, 71, -30, 22, -37, -22, 86, 43, 39, 129, -24, 40, 13, -12, 26, 29, -60, 41, -33, -90, 43, 65, 35, 52, -6, -23, -23, 55, 40, -24, 111, 71, -68, 9, 2, 31, 94, -41, 66, -26, -64, 62, -32, -86, 17, -43, -55, -14, -27, 41, -15, -70, 40, 1, 45, -9, 7, 16, 27, -106, -5, -105, 3, 1, -79, 4, -23, -59, 138, -25, 23, 140, 2, -6, -43, -31, 6, 15, -57, -11, 25, 21, -32, 23, 63, -45, 38, 36, -53, 124, 88, -69, 40, -3, -69, 152, -6, 29, 29, -29, -62, 17, -35, 65, -9, -11, -23, -74, -22, 1, -44, 81, -72, -79, 15, -53, 53, 29, -21, 60, -32, -42, 46, -81, 31, 74, -49, -84, -23, -52, 53, 71, 37, -52, 42, 15, -8, 63, 70, -17, 65, -5, -52, 67, -28, -81, 28, -12, -31, 30, 5, 70, 69, -54, 45, -102, -14, 26, -26, 5, -40, 13, 50, -39, 7, 113, -96, 52, 10, -80, 28, 28, 15, 113, -79, -63, 37, -19, 28, 35, -34, 9, -68, 50, 39, 45, 24, 29, -29, 113, -35, -20, 117, 57, 44, -32, -48, 55, -26, -19, 60, 22, -44, 24, -38, -22, 23, -12, 37, -1, 44, -47, -29, 79, -19, 19, -12, -77]
4257g7P2JOP0p4m8J4M5k6O3m3Ql4l5J43m7j5K5k4q6O3J2O3j17N9k2q8J26M6n1
4287B9j2Jl5j5j4J12m6n0L4MJ4P1k10J43kr7Q6p0O6J12j23J7n9k6R4n4oN5m6J5
4317a2L0l8J8K2qL4l9P4j09L4K5j9L1k9m8K9M9k8M2n7m2O7k9j3J08j20NL0l2N9
4347C4p2qQ2l6J2J1k7O6n8P3k6j08L2Nj2J39q2l1R1r8J1N5m4J4qJ0j8k8%K0%K4
4379B3l7j4K4N4j05J78j82J31nj60J37Kp8P6q2PK2j5J1k0L6j0%J7N4m7Jn8L0L3
4409B3n4J13p4l3kP2q8Q6n7QK5k9K7K4k8j3K1m9MP6m3K6p9Q7m4o5O6RQ6r6p1Q8
4441A6n8k0J02o1m8J26p9P4k2l2kK3J9p6J5J08r6L9P2j08O1K9j37J10jj28P8q6
4469h2R1K1m9j4J5J3k6N6OJ3n4lQKj7mpM9o4Q7J2j01R4j2l5J59j62J5J3o9L9q4
$$ y = [-77, -5, -4, 2, 72, -2, -50, -36, 9, -17, 46, 3, 11, -23, -58, 85, 38, 23, 48, 24, -62, 1, 13, 76, -41, 18, -4, -92, 34, 80, 29, 17, 18, -17, -32, -46, 66, 20, -30, 4, 8, 22, 93, -117, 26, 24, -73, 13, -57, 9, 121, -2, 15, -44, -70, 24, -30, -36, 19, -27, -12, 18, -20, -2, 20, 12, 46, 7, 81, -28, 6, 31, 12, 43, 14, -34, -5, 44, 16, 58, 1, -41, 26, -3, -16, 92, -28, -23, 7, -25, 34, -38, -46, 36, 0, 12, 23, -4, 62, 4, 77, 51, -57, -25, -20, -32, 107, 25, -6, 85, -13, -2, 53, 9, 23, 15, 25, 7, -21, -21, -1, -1, 23, -14, -28, -4, 50, -55, 123, -59, 72, 67, -93, 44, 46, -32, 44, -38, -31, -9, -24, -13, -33, 3, -7, -7, 10, 64, 17, 18, -40, -10, 23, -31, 82, 8, -25, -27, 45, -43, 43, -14, -6, 19, -10, 17, 41, 13, 0, 21, -28, -24, 52, 9, 35, -44, 43, -1, -66, 0, 9, 95, -1, -72, 16, -42, -62, 40, -21, -69, 57, -22, 52, 30, -2, -4, 19, 38, -38, -23, 85, -11, 28, 100, -8, 53, 82, -55, 55, 54, -74, 4, -82, 9, 30, -19, -33, -18, -5, -31, 25, 31, 44, -10, -13, -5, -3, -20, -24, -31, 18, -46, 41, 53, -48, 46, 34, -1, 158, -4, 11, 24, -45, -6, -90]
4501i0j7Q6M0m0K0Q9k6q0L9K5p4L3K0o7K8l7m3J12j1n3N9JK0n2kN6j5m9K6k1j1
4532c4J5K4N9j24P8J9n4L0O1j30J17j22M2L3n9k7L7QP2n0K8k5M0J6n9o9J09r3
4560e8L1P1r8O7j4j20J66j4p2O6k9n7O5K6m2P8j9j01Q6J9p8J5M2p1oP0k6KP2j19
4590d8R6o2lM2l4o5J19j05L0L6n3O1k7m8O7lJ3l5J7L5k4n6M1p1J52n2k6N9nj10
4620e9J02qj10J93j56lQ9n6n2P9L2o2jJ7j2M9j8q7N4N5n4P0n1j05J12P1q8M3l2
4649A2n5J18n6l8K1Kl2O2l5K8j05Q9k7J7J16j35J1N4o9N4l9QR2q1m0J00r0K5j9
4678a2j2mJ6k3N1l7L6n4O1J3l6k9J00j37O9l7k2L3O3o9O9o9L8M7n7L1L3j9r4L
4708d8n2M0J08l0n6J6nJ3L8o4m0Q8l8P7r5P0l2N4j1p7L9m2L6M4M8j08PN3k7p0
$$ y = [-90, -107, -21, 19, -21, -1, 88, 62, -18, 21, 46, -28, 5, 25, -42, -14, -51, -94, 18, 7, -46, 13, 14, 34, -18, -20, 36, 21, -28, -2, -23, -34, -19, 5, 64, -60, 18, 37, -17, 13, 74, -56, 61, -61, -19, 14, -45, -72, -35, -27, 45, -5, 23, -2, 38, 54, -5, -74, 35, -58, -27, 44, -54, 13, -1, -121, 45, 31, -41, 25, -4, -61, 4, 30, -12, 66, 47, -54, 32, 51, -27, -12, 30, -41, -47, 23, -3, -1, 71, -48, 48, -14, -17, 25, -9, -74, 45, -60, -30, 6, -47, 14, -13, -61, 6, 3, 16, -19, -2, 33, 9, -47, -6, -77, 75, 23, -3, 56, 51, -59, 43, 35, -75, 118, -38, -41, 48, -8, -60, 19, 51, -11, -12, 5, -7, 42, 24, -63, -9, 46, -8, 62, 11, -94, 18, 89, 1, 44, 12, -43, 75, 19, -19, 2, 4, -28, 34, -1, 27, -78, 11, -16, 1, 117, -18, -7, 47, -22, 32, -7, 1, 93, 12, -28, 72, -18, 7, -12, -24, -28, -12, -35, 16, -21, 15, -39, 22, 35, -1, -30, 70, -67, 2, -35, -57, -24, 39, -30, 39, -30, 8, 55, -2, 29, 62, 43, -51, -48, -100, -60, 48, 18, -38, -22, -27, -14, 24, -40, -80, 8, -30, 47, -48, 22, -10, 44, 33, -44, -5, -47, -11, 33, 81, -27, -20, 33, 6, -64]
4738f4M9l8J3J32j40O9%j0k4L0n2Q8n1%M9p1jM6j9Jk6L2k3JOL5o5O0k3k2J1N0
4770D3m7o9Q6lJ6l3J2K2r3R0KmL6j11N1pO2j1m7ll9%P8m7J0M2r0O3l7L1L7j2k2
4803FR8r5n1LL3M8n8N2j1q6J6K7L3l4J6pN3q7K9K5k7JM0j5K6K7j9Ol8ok4M1n5
4836c3L2m7nM0Kj4R9M4j47Q4j9q0P2k8o3P8o4l4J34o0J1M0j2k9ON2J2l0n4N4k1
4867B0m4K5NJ1M1j16j1Q4J1L7Nl6l5n7O1k7L8J2n0k1J5L6M2Jr2N2J0Kpj8O1p2
4899a7k4l0K6Q4n3J7M5m6o0L9J6N6o0m9jN3k4m7Q0j5J8p9J13o7oQ2k9m5N7j3l9
4930a8N2r6O2m6j2O3o4N3K9m4P6p1N8m2M4n2L5l0J9k1K5j5k8P9j22L7M4n6M5l0
4960b6lN3J0n0Q0n0k4M3o8J6K0J9Rk5k2P4q9P3Pm8N2j20O9j5M2l5J4J7l2l5j0
$$ y = [-64, -15, -53, -40, 92, -48, 21, 21, 11, -13, 17, -35, 53, 2, 2, 51, -20, -21, 25, 6, 7, -19, 13, -10, -9, -3, 32, -33, 27, 4, -18, -7, 43, -4, -73, 13, 10, 26, -7, 5, 27, -66, 24, 26, 22, 58, -53, -2, -9, 53, 42, -5, -8, -47, -47, 31, -16, -6, 36, -54, 9, -28, 3, 40, 28, 6, 104, 9, -42, -39, -6, 42, -16, 36, 25, -61, -45, -18, 15, -19, -3, -10, 43, -44, -15, 10, -17, -16, 24, 9, 35, 62, 43, 49, 11, 5, -19, 22, -33, -1, -48, -53, -13, -11, -25, 74, 118, -29, 55, 36, -44, 28, 0, -63, 15, -49, -83, 51, -9, 2, 42, 30, 1, 7, 59, 71, 41, -13, 41, 20, -24, 1, 6, 17, 58, -58, -69, 15, 26, 63, 68, 32, -3, -60, 1, -26, 12, 24, -26, -47, -32, 4, 46, 47, -45, 7, 17, 19, 12, -6, 55, -17, -41, -71, -45, 39, -14, 3, 48, 2, -58, -19, -3, 53, -7, -56, -57, -4, -28, -75, 5, -10, 8, -71, 42, -25, -31, 51, 22, -23, 34, 21, -18, 34, -62, 0, -46, -58, 5, -59, -6, 23, -21, 55, -16, 42, 0, 44, -8, 27, -3, 16, -5, 20, 5, -23, 56, -66, -29, 15, -41, 4, -26, -29, 24, 34, -16, 64, 14, -10, 33, -35, -19, 1, 20, 29, 4, -18, 56, -33, 40, 47, -1, 51, -69, 0, -15, 27, -8, 6, 23, -9, -44, -54]
4991e4N8K9k2J6o8N6m7P9J2r8O1mj6QQk5N3n6M1k4n3Q2K0m8J5Jl3K3J1JRm4kj5
5025b6NQ2n4n1KN1Nr6O4O3p5J1jl0K7J04r9%n5K1N7K3j3k2M6q1o1J24p1p3J18
5056ej1J5J4rk5mk8M3Jj7J9K6l2N5Pj36P6JpM8q0O1L3l4M7n7K3lm1Nn7R6k2rn
5091a2J9m8R0p5P5l6j6k9M4p0L5K4pJ9j9P2q2M0p0N4p5J33m4j3jRm9K4J5J8p5
5122e0KP8o7M6POJ6jJ2Pj15J22r3Q1q3M2l4rN4mk3J3J5J1oj5j14Q9j9M9M1p5q5
5155a02R9K8Nn7J3M9Pk2m2J6RM0o3n2J01r5J17pm3L4M0j7m8K4K1n9k8N5j6l0j6
5186c9K3pK9j6L5j6j3L5j5K0jo0P9k1n5k1L7K3l7K0j3J2j8L1j0l9P6m7K2RK2p4
5218b9NJP4j01O7j07P2N7p0m%l5Q0m7L1RLn8O8J1j6j0m%rj7LJ8N9j37J05o8M0
$$ y = [-54, 4, 33, 11, 27, -41, 15, -32, 47, 59, -39, 22, 18, 2, 10, 18, -7, 46, -10, 31, 7, -46, 36, 56, 8, 23, 24, -9, 14, 25, 26, 35, -9, -11, -26, -21, 61, 7, -44, -42, 9, 14, -82, -18, 45, -30, -19, -20, -50, -23, 81, -18, -18, -73, -52, 5, 28, 15, -7, 39, -42, -103, 21, -50, -123, -5, -16, -1, 13, 4, -21, -25, -53, -10, -9, -26, -7, 19, -13, 42, 49, -87, -11, -10, -17, 31, -49, 12, 45, 11, 58, 1, 24, 21, -20, -15, -72, 24, 2, -7, -12, 7, -41, 49, -26, 49, 13, -3, -32, 12, -58, -23, 1, -6, 13, -6, 66, -16, 24, -46, 8, -67, 66, 22, 9, 8, 17, -32, -8, 7, 25, -50, -48, 30, -37, 9, 16, 22, 38, 37, 49, 56, -59, 63, -30, 51, -32, 10, -24, -33, 21, 17, -6, 7, 22, 33, 27, 12, -102, -13, -32, 17, 58, -17, -102, -3, 25, 30, -27, -14, 35, 42, 20, -22, -6, 3, 43, -20, -72, 29, -66, 51, 44, 1, 35, 75, 58, 10, 34, 55, -4, -32, 23, 7, -23, -39, -16, -23, 6, -10, 25, 9, -4, 31, 16, 36, 35, -25, 54, 33, -22, -43, -6, 17, -20, 0, -13, -1, -19, 12, 2, -37, 39, -8, 14, 23, 45, -29, -24, -23, 51, -50, 17, -90, -18, 39, -31, -35, -35, -70, 10, -37, -6, 3, 6, -52, 16, 27, 11, 1, -3, -3, -12, -29, -26, -8, 51, -86, 19, -49, -9]
5251iO2J4j00P7r1K6N1l3L2K9%m8O2j11O3L6j33J16rp0L2N8lm3l1JM4%L2o7k5
5282c8N1m7J9o6J16j2l6P3r4RP0k3o1K7j3opJ23m0p1M1J9j1kj4m8Q2k7o6P1o2
5313d3j4O6o1k7Q1l0O0l1L3m1L9k6j5J7J0l9M4j3l4Q1j00M4O8o3l4Q5j02L9N1
5342D5r8N4j6J9J4J4L1p9L1j1J5r7J33q1K3Nl2Q6l2o5N1N8p1N3n4o5J11l0n8O4
5372A8o5P0nLj1P7o1n6j3J3K3M4o7NN3q5M8Q3p6Kp4P5l5R4J8j19P5om4j2L3Qj7
5405dl0L1j6m6O6K3Kl9j2%j7N3L3K1o2L1n3k4M8k8k7O8lj2K9n4K4N5j15M3P7j12
5437e0k2M7j4L8j8%M0o9O3M5o1L8N7k0n8k1K4on2O2K3rK2n2m2J9kN8j1l0n0N2
5469Am5P4Jk8P6p0k0J9RL4m4P3j46M3J6l4J08o3j1j3M7r9J35r7J5P3l3k0j7m4
$$ y = [-9, 53, 67, -33, 44, -47, -21, 30, -3, 29, 58, 58, 10, 72, -39, 24, 60, -73, 43, 34, -36, -4, 54, 51, 8, -23, -22, 22, 22, 54, -13, -38, 13, -34, -15, -81, 35, 23, -13, 60, -34, -25, 45, 22, -39, -12, -25, -31, -38, 85, 45, -26, 15, 34, 23, 21, 7, -41, 41, 14, -52, 19, -43, -57, 9, -52, -79, 2, -28, 32, 1, 34, -7, 32, 6, -9, 8, 18, -21, 23, 10, -24, 57, -43, 1, 69, 6, -28, 57, -45, -6, 45, -53, 1, -15, 4, 18, 32, 63, -16, 15, 4, 19, -78, 55, -26, -3, 2, -30, 56, 24, -41, 10, 68, -3, 50, -4, -69, 42, 12, -46, 18, -47, 23, 18, 21, 10, 87, 26, -30, -43, -30, -7, 37, -30, -25, 28, -57, -9, 74, -2, 0, -74, 1, -34, 60, 78, -41, 34, 28, -16, -28, 5, 13, -4, -34, -3, -19, -65, 1, 24, 26, -13, -25, -25, -42, 11, 44, 65, 3, 34, -19, -43, 5, -23, -50, 18, 15, 3, 32, -22, 2, 57, -58, -15, 62, -50, -72, -25, -39, -1, -19, -19, 21, -48, 15, 60, -1, 37, 94, 74, 16, -5, 19, 13, -39, 23, 46, 37, 59, 7, -35, -16, -18, 40, 29, -1, -51, 1, -44, 30, 31, 3, 79, 9, -11, 8, 17, 51, 7, 80, -66, -23, -7, -41, 67, 4, -7, -20, 27, -72, 63, -34, -19, 54, 21, 1, -16, -60]
5499f0Q1m5P4k7q1%N9LL2p1R1m5p5J05l8%kj2J1j6j0O4n5MK4p1O7n9L2M2J2m7
5531a3Nm2P2j6q1M0mnP0N0ll4k9j1J1j6k5P6Mo8k8L4O4m9N0m3Nk9L6l7L1Rp1Q2
5565C5r8Q2m4P7j10N7M6mm3k4QO1k7j7j4J0K6o4RPP3q9O8K7l8J4J4m5l5MP4j9
5597B1m6k0N0j6M0Ql6l5QK5j6l5QM5l4rm8P2M9r4O0n8P0J7l7N4Mm1j1OLo1P9l3
5631a1K9Jn3J8N7N0j58M0J03n0Mq4P3nqm8L7NK1Pn5M4Rj1n2P5oo9M1q0N6L3L8
5664E1m7oK3k7J4J6J3n0rN8n9M9j7K4n9m4J06q7P8p6J18p4P1n5m6J3K0L5q0J25
5694G8j10R4J9j56J15K2o4m0M0k6P0J8j01M2pL5K7l0n1L0K7n7j2J06p6J2m4LJ6
5723b0N3p1M7rJ9l9JqL3J9n8L7J7l1j7R2r4M5p0JQ4mM8L7r2j3J0No5K7L8J5n6
$$ y = [-60, 21, -24, 50, 23, -58, -58, 1, 4, 36, -35, 56, 11, -64, 41, 3, 3, 1, -11, 0, -16, -26, 38, -17, -13, 11, -60, 7, -52, -20, 22, 34, -13, -8, -50, 22, 6, -75, -35, -39, -44, 26, 76, 73, 39, 10, -1, 10, -6, -31, 45, 49, -19, -47, -13, 51, 2, 52, 9, 14, -15, 21, -16, 15, 24, -47, 35, -63, 19, -25, 52, -58, -1, 45, 41, -2, -26, -18, 43, 16, -1, -15, -5, 21, -43, -34, -27, 46, -43, 25, 52, 14, 28, 42, -3, -38, -34, 40, 21, -25, -45, 5, -11, 29, 37, 1, -34, -26, -1, -17, -52, -44, 1, -33, -42, -90, -18, 31, -63, -3, -61, 9, 26, -11, 43, 47, 6, -5, 1, 4, -57, 22, -11, 18, 19, -34, -16, 41, 91, -67, -27, 76, 26, 30, -54, 19, 14, 6, -42, -5, 0, 21, 28, -27, 17, 26, 15, -37, 38, 32, -37, 4, -76, -20, 13, 51, 4, -2, 21, -6, 8, 24, 37, -13, -22, 36, -23, 26, 9, 33, -26, -70, 36, -51, 27, -49, 69, -5, 66, 11, -35, -22, -2, 33, -47, 78, -32, 62, 81, -75, 40, 62, -2, -42, -2, -28, 42, 60, -41, 1, -6, 29, 56, 26, -25, 5, 32, -25, -37, 69, -7, 5, -39, -36, -20, 33, -38, 9, 0, 19, -20, -19, -27, 6, 25, -33, 4, 21, -10, -27, 65, -29, 16, -54, -53, 31, 27, 75, 112, 20, 7, 17, 22, -43, -16, 22, 37, -19]
5756a9k1K5jJ4N6p7P5l9K3Qj4K3m7p0K2J08l8M6k0q5L6K6r0P3%mKL7m5J1knl0
5789b2L1mj27J50n3PR5q9k2N6n3M2Lj9M6l8J4j9J1L3n3l8M6K1n4O5L9n3j4l1L9
5820IqoO0q5KN0k8RQj5J8n7P2o0M4On8L5j7m0R4J9r2K1L1M1ql5Lm6k1Pl3J09M7
5855G6j37R5l7nL6nK5k8lQl6j1M3%l1P3j09L1rL1R3j12M3ll4L8m1J2j1O0p4Q1
5887E9l0m2M6m6j7n8N6M7k7O0p6Q4j0m8J8rM5o1M1n6K4j5K9oK7j18L2K2L7KJ6
5918B6m6N8k3Pl7R0j27P2O1j35Q1L5q2L9j3n1O1M1r0J01n2p3J11k7k7J6M0m1m1
5947b6k0K0J1M4om6K0J6O2n3k4P9o8K6o0m0P3K6k3K0o0K1J1K5nkJ7o9L2ONk3J
5980a0j7K8k0K6m6J20j9l8l1Rk9L9P3p5j8k1O1m5M4j3Loj6M3k9J0l2L2l7K3l1
$$ y = [-19, -40, -15, -16, -2, 54, -23, 52, 13, 36, 44, 30, 53, 6, -64, -42, 66, 28, 74, 54, -31, 5, 31, -59, 14, 14, 10, 12, 49, 4, 15, 13, 8, -22, 9, 5, -122, 28, -25, -18, 77, -12, -34, 22, -31, 11, 14, -5, 41, 3, 17, -2, 9, 42, -11, -49, -3, 18, -36, 29, 68, 15, 1, -30, 9, 1, -5, 55, -30, -28, 22, -6, 3, 11, -4, 14, -43, 29, -31, 13, 19, -39, -4, -21, -61, 33, 52, -40, -19, 12, 53, 45, 10, 13, -33, -54, -47, -80, 29, 76, -61, 34, -3, -8, 28, 23, 48, 20, 17, 25, -11, -22, 21, 21, -10, 63, -46, -15, -24, 7, 100, -12, 31, 28, -6, 32, -9, 3, -8, 52, -22, 59, 29, -13, 33, -13, -30, -88, -32, 15, -12, 48, -28, 56, 46, -2, 16, 7, 52, -9, 32, -24, 0, -15, 14, 8, 35, -83, -51, -29, 8, 10, 26, -20, 38, 15, 22, -15, 75, -52, 20, 81, -54, 27, 62, -20, 19, 6, -45, 16, 57, -33, 68, 16, -57, 54, 27, 0, 16, 56, 15, -26, -46, -26, -15, 29, 23, -23, -3, 13, 75, 22, -2, 77, 9, 35, -25, -65, 8, 34, 11, 31, -29, -8, 3, 28, 23, 21, 38, -31, 1, 7, 12, -11, -10, -27, 1, -19, 7, -39, 81, 62, 24, -7, 2, -27, 12, 85, 10, -8, -29, 32, -13, 31, 18, 21, 15, -1, 42, 13, 23, -9, 23, -14, 9, -22]
6011b2PL6o3M6J6JM8l2j4L2k8l1mJ8l1O5l7J4q0j3P1k8N1O5j17R6m0k1Pl7lj8
6043d6l2Q4K3k0J3k8KL3K7l0nQL2mj10M1k4L0rl6pM9J5J9l9O8m6L5l1J8m8J0J00
6076I2o9m3k7Q4j4l2N2Jj10N5j0J11j30J4J5J7l5L8K1k3P2l5k2n7K8P6m2m4k8
$$ y = [-22, -15, 21, -42, 4, 20, 21, 69, 37, 23, 55, 27, -4, -8, 10, -21, 44, 7, 21, -59, -72, -1, -29, 22, 87, -30, 66, 26, 5, 12, -25, -28, -46, -78, 6, 29, 9, 22, -6, -4, 29, 56, 26, 21, 29, 61, 57, -53, -12, -36, -6, -15, -51, -58, -9, 6, 25, -14, 54, 8, 43, 12, 30, -18, -8, 92, 23, -20, -47, 37, 23, -9, 43, 44, -66, -11, -21, 90, -40, -26, -11, 6, -29, 9, 30, 7, 79, 44, 22, -35, -7, 69, 27, -17, -45]
$$ [...]
8191g0
##END NTUPLES=NMR FID
##END=
