##TITLE=1H_91-2021
 CDCl3,8 sc, 
 23.9.2021
##JCAMPDX= 6.0         $$ Bruker NMR JCAMP-DX V2.0
##DATA TYPE= NMR FID
##DATA CLASS= NTUPLES
##ORIGIN= UXNMR, Bruker Analytische Messtechnik GmbH
##OWNER= root
$$ XWIN-NMR		Version 3.5
$$ Thu Sep 23 09:57:32 2021 Russian Standard Time (UT+4h)  she@DPX200
##.OBSERVE FREQUENCY= 200.1314
##.OBSERVE NUCLEUS= ^1H
##.DELAY= (6, 6)
##.ACQUISITION MODE= SIMULTANEOUS
##.ACQUISITION SCHEME= undefined
##.AVERAGES= 8
##.DIGITISER RES= 18
##SPECTROMETER/DATA SYSTEM= spect
##.PULSE SEQUENCE= zg30
##.SOLVENT NAME= CDCl3
##.SHIFT REFERENCE= (INTERNAL, CDCl3, 0, 15.7039)
##AUDIT TRAIL= $$ (NUMBER, WHEN, WHO, WHERE, WHAT)
$$ ##TITLE= Audit trail, XWIN-NMR		Version 3.5
$$ ##JCAMPDX= 5.01
$$ ##ORIGIN= Bruker BioSpin GmbH
$$ ##OWNER= she
$$ F:/spectra/data/she/nmr/H-F/1/audita.txt
$$ ##AUDIT TRAIL=  $$ (NUMBER, WHEN, WHO, WHERE, WHAT)
(   1,<2021-09-23 09:55:25.65 +0400>,<she>,<DPX200>,
      <created by zg, POWCHK disabled, PULCHK disabled
       configuration hash MD5:
       00 E9 B6 7A A2 85 ED C7 34 08 36 98 17 FE 4E 26
       data hash MD5: 16K
       1D 6D 01 7A 44 9C 7A 4D DE 90 3A 1F 10 35 97 EA>)
$$ ##END=
$$ 
$$ hash MD5
$$ 52 AC D6 37 7F 1E A2 04 21 FC 87 7D 01 97 AD 11
##$RELAX= 
##$RELAX= 
##$RELAX= 
##$RELAX= 
##$RELAX= 
##$RELAX= 
$$ Bruker specific parameters
$$ --------------------------
##$DU= <F:/spectra>
##$EXPNO= 1
##$NAME= <H-F>
##$PROCNO= 1
##$TYPE= <nmr>
##$USER= <she>
##$AMP= (0..31)
100 100 100 100 100 100 100 100 100 100 100 100 100 100 100 100 100 100 
100 100 100 100 100 100 100 100 100 100 100 100 100 100 
##$AQSEQ= 0
##$AQ_mod= 1
##$AUNM= <au_zg>
##$AUTOPOS= <>
##$BF1= 200.13
##$BF2= 200.13
##$BF3= 200.13
##$BF4= 200.13
##$BF5= 200.13
##$BF6= 200.13
##$BF7= 200.13
##$BF8= 200.13
##$BYTORDA= 1
##$CFDGTYP= 0
##$CFRGTYP= 5
##$CHEMSTR= <none>
##$CNST= (0..31)
1 1 145 1 1 1 1 1 1 1 1 1 1 1 1 1 1 1 1 1 1 1 1 1 1 1 1 1 1 1 1 1 
##$CPDPRG= <>
##$CPDPRG1= <>
##$CPDPRG2= <>
##$CPDPRG3= <>
##$CPDPRG4= <mlev>
##$CPDPRG5= <mlev>
##$CPDPRG6= <mlev>
##$CPDPRG7= <mlev>
##$CPDPRG8= <mlev>
##$CPDPRGB= <>
##$CPDPRGT= <>
##$D= (0..31)
0 1.2 0 0 0 0 0 0 0 0.06 0 0.03 0 0 0 0 0.0002 0 0 0 0 0 0 0 0 0 0 0 0 
0 0 0 
##$DATE= 1632376525
##$DBL= (0..7)
120 120 120 120 120 120 120 120 
##$DBP= (0..7)
150 150 150 150 150 150 150 150 
##$DBP07= 0
##$DBPNAM0= <>
##$DBPNAM1= <>
##$DBPNAM2= <>
##$DBPNAM3= <>
##$DBPNAM4= <>
##$DBPNAM5= <>
##$DBPNAM6= <>
##$DBPNAM7= <>
##$DBPOAL= (0..7)
0.5 0.5 0.5 0.5 0.5 0.5 0.5 0.5 
##$DBPOFFS= (0..7)
0 0 0 0 0 0 0 0 
##$DE= 6
##$DECBNUC= <off>
##$DECIM= 32
##$DECNUC= <off>
##$DECSTAT= 4
##$DIGMOD= 1
##$DIGTYP= 9
##$DL= (0..7)
0 120 120 120 120 120 120 120 
##$DP= (0..7)
150 150 150 150 150 150 150 150 
##$DP07= 0
##$DPNAME0= <>
##$DPNAME1= <>
##$DPNAME2= <>
##$DPNAME3= <>
##$DPNAME4= <>
##$DPNAME5= <>
##$DPNAME6= <>
##$DPNAME7= <>
##$DPOAL= (0..7)
0.5 0.5 0.5 0.5 0.5 0.5 0.5 0.5 
##$DPOFFS= (0..7)
0 0 0 0 0 0 0 0 
##$DQDMODE= 0
##$DR= 18
##$DS= 0
##$DSLIST= <SSSSSSSSSSSSSSS>
$$ [...]
##$SUBNAM2= <"">
##$SUBNAM3= <"">
##$SUBNAM4= <"">
##$SUBNAM5= <"">
##$SUBNAM6= <"">
##$SUBNAM7= <"">
##$SUBNAM8= <"">
##$SUBNAM9= <"">
##$SW= 20.0188988654967
##$SWIBOX= (0..15)
0 0 2 0 0 0 0 0 0 0 0 0 0 0 0 0 
##$SW_h= 4006.41025641026
##$TD= 16384
##$TD0= 1
##$TE= 0
##$TE2= 300
##$TE3= 300
##$TEG= 300
##$TL= (0..7)
0 120 120 120 120 120 120 120 
##$TP= (0..7)
150 150 150 150 150 150 150 150 
##$TP07= 0
##$TPNAME0= <>
##$TPNAME1= <>
##$TPNAME2= <>
##$TPNAME3= <>
##$TPNAME4= <>
##$TPNAME5= <>
##$TPNAME6= <>
##$TPNAME7= <>
##$TPOAL= (0..7)
0.5 0.5 0.5 0.5 0.5 0.5 0.5 0.5 
##$TPOFFS= (0..7)
0 0 0 0 0 0 0 0 
##$TUNHIN= 0
##$TUNHOUT= 0
##$TUNXOUT= 0
##$USERA1= <user>
##$USERA2= <user>
##$USERA3= <user>
##$USERA4= <user>
##$USERA5= <user>
##$V9= 5
##$VALIST= <valist>
##$VCLIST= <CCCCCCCCCCCCCCC>
##$VD= 0
##$VDLIST= <DDDDDDDDDDDDDDD>
##$VPLIST= <PPPPPPPPPPPPPPP>
##$VTLIST= <TTTTTTTTTTTTTTT>
##$WBST= 1024
##$WBSW= 4
##$XGAIN= (0..3)
0 0 0 0 
##$XL= 0
##$YL= 0
##$YMAX_a= 191716
##$YMIN_a= -149377
##$ZGOPTNS= <>
##$ZL1= 120
##$ZL2= 120
##$ZL3= 120
##$ZL4= 120
##$ABSF1= 10
##$ABSF2= 0
##$ABSG= 5
##$ABSL= 3
##$ALPHA= 0
##$AQORDER= 0
##$ASSFAC= 0
##$ASSFACI= 0
##$ASSFACX= 0
##$ASSWID= 0
##$AUNMP= <proc_1d>
##$AZFE= 0.1
##$AZFW= 0.1
##$BCFW= 1
##$BC_mod= 2
##$BYTORDP= 1
##$COROFFS= 0
##$CY= 11.3945322036743
##$DATMOD= 1
##$DC= 2
##$DFILT= <>
##$DTYPP= 0
##$F1P= 2.36226072786647
##$F2P= -0.459571619588291
##$FCOR= 0.5
##$FTSIZE= 0
##$FT_mod= 4
##$GAMMA= 1
##$GB= 0.15
##$INTBC= 1
##$INTSCL= 1
##$ISEN= 128
##$LB= 0.24
##$LEV0= 0
##$LPBIN= 0
##$MAXI= 10000
##$MC2= 0
##$MEAN= 0
##$ME_mod= 0
##$MI= 1.114404
##$NCOEF= 0
##$NC_proc= 0
##$NLEV= 6
##$NOISF1= 3.799351
##$NOISF2= 2.8
##$NSP= 1
##$NTH_PI= 0
##$NZP= 0
##$OFFSET= 15.70392
##$PC= 1
##$PHC0= -14075.71
##$PHC1= 10.80088
##$PH_mod= 1
##$PKNL= yes
##$PPARMOD= 0
##$PSCAL= 0
##$PSIGN= 0
##$REVERSE= no
##$SF= 200.130013532006
##$SI= 16384
##$SIGF1= 3
##$SIGF2= 2
##$SINO= 400
##$SIOLD= 16384
##$SREGLST= <1H.CDCl3>
##$SSB= 0
##$STSI= 0
##$STSR= 0
##$SW_p= 3612.71676300578
##$SYMM= 0
##$S_DEV= 0
##$TDeff= 0
##$TDoff= 0
##$TI= <>
##$TILT= no
##$TM1= 0
##$TM2= 0
##$TOPLEV= 0
##$USERP1= <user>
##$USERP2= <user>
##$USERP3= <user>
##$USERP4= <user>
##$USERP5= <user>
##$WDW= 1
##$XDIM= 8192
##$YMAX_p= 0
##$YMIN_p= 0
$$ End of Bruker specific parameters
$$ ---------------------------------
##NTUPLES= NMR FID
##VAR_NAME=  TIME,          FID/REAL,        FID/IMAG
##SYMBOL=    X,             R,               I
##VAR_TYPE=  INDEPENDENT,   DEPENDENT,       DEPENDENT
##VAR_FORM=  AFFN,          ASDF,            ASDF
##VAR_DIM=   8192,          8192,            8192
##UNITS=     SECONDS,       ARBITRARY UNITS, ARBITRARY UNITS
##FACTOR=    0.0002496,     1,               1
##FIRST=     0,             0,               0
##LAST=      2.0444736,     0,               0
##MIN=       0,             -149377,         0
##MAX=       2.0444736,     191716,          0
$$ Real data points
##PAGE= N=1
##DATA TABLE= (X++(R..R)), XYDATA
$$ [...]
$$ plain form
2332 531 376 -2355 185 1139 -2409 -235 2518 -1436 -1490 488 -1072 -824 -449 259 869 -1709 -1768 1093
2350 1093 -1113 -2028 2292 508 -2096 -103 -346 -1017 110 -128 1118 220 -2090 632 643 -1831 1231
2367 1231 2304 -1471 -760 511 -772 -129 -198 738 1147 -2027 -1217 1033 -1566 -996 2185 -480 -2061
2384 -2061 -425 -1054 -901 -322 -350 841 -1068 -2554 364 -420 -2228 1259 1164 -2223 -586 45 -671
2401 -671 126 -90 1139 840 -1976 176 1199 -1193 228 2319 -383 -864 573 -301 317 77 406
2418 406 1366 -1165 -1684 1519 -583 -1124 1651 423 -1629 -287 -599 -267 56 -372 932 103 -2433
2435 -2433 53 539 -1451 759 1382 -1189 -623 -95 -452 590 -10 672 1259 -1073 -993 1501 -733
2452 -733 -251 1888 -469 -972 367 -500 209 466 -133 1184 33 -1731 922 499 -1600 1260 492
$$ packed form
2332E31j55k731K540R54l548K174K753l954n4J978j560K48L75P08O10k578n9K861
2350A093k206r15M320j784k604J993k43o71J127k38J246q98k310K722J1k474L062
2367A231J073l775P11J271j283O43o9R36M09l174Q10K250k599N70L181k665j581
2384b061J636o29J53N79k8J191j909j486K918p84j808L487r5l387J637O31p16
2401f71P97k16J229k99k816K152J023k392J421K091k702m81J437q74O18k40L29
2418D06R60k531n19L203k102n41K775j228k052J342l12L32L23m28J304q29k536
2435b433K486M86j990K210O23k571N66N28l57J042o00O82N87k332Q0K494k234
2452g33M82K139k357n03J339q67P09K57n99J317j151j764K653m23k099K860p68
$$ plain form
2469 492 -1077 168 42 -286 736 -638 401 925 -1570 -104 1323 -355 265 1596 -575 -431
2485 -431 844 -313 596 290 29 1377 -281 -889 1564 138 -404 1683 390 -463 706 77 233
2502 233 1219 -289 665 623 -1511 168 1023 -1099 483 697 -907 320 160 -599 784 -10 -597 949
2520 949 -973 -549 878 -727 -650 1169 -585 -352 503 -652 528 534 -834 863 489 -1159 986
2537 986 766 -541 1259 306 -321 985 42 146 1275 188 452 1433 -389 287 1383 -274 463
2554 463 1167 -403 601 683 -406 874 196 -715 914 22 -824 1236 -79 -575 941 -403 -385 682
2572 682 -613 -256 787 -419 112 942 -511 572 926 -421 575 970 -358 1017 493 -444 969
2589 969 353 -114 1158 -101 -173 1595 91 166 1256 -12 336 740 -246 356 671 -562 533 692
$$ packed form
2469D92j569J245j26l28J022j374J039N24k495J466J427j678O20J331k171J44
2485d31J275j157R09l06k61J348j658o08K453j426n42K087j293q53J169o29J56
2502B33R86j508R54m2k134J679Q55k122J582K14j604J227j60p59J383p94n87J546
2520I49j922M24J427j605P7J819j754K33Q55j155J180Oj368J697l74j648K145
2537I86k20j307J800r53o27J306r43J04J129j087K64R81j822O76J096j657P37
2554D63P04j570J004Q2j089J280o78r11J629q92q46K060j315m96J516j344J8J067
2572F82j295L57J043j206N31Q30j453J083L54j347R96L95j328J375n24r37J413
2589I69o16m67J272j259p2J768j504P5J090j268L48M04r86O02L15j233J095J59
$$ plain form
2607 692 -738 402 486 -616 707 59 -323 978 138 -249 1234 -184 125 1314 -57 545 1174
2624 1174 -71 600 1114 74 963 942 -1 881 779 -414 1334 731 -342 1300 245 -386 1192
2641 1192 185 45 1107 -235 98 995 -545 99 823 -645 376 503 -505 396 386 -443 783
2658 783 88 -396 989 -218 -324 1151 116 118 1379 -361 318 1153 -196 405 1197 -344 1068 1078
2676 1078 -388 1066 1038 -251 1383 667 -401 1118 664 -146 1201 243 205 1072 -32 123 1213
2693 1213 -314 252 1146 -652 216 851 -404 794 438 -318 726 87 -250 1317 214 -316 876
2710 876 197 -356 847 97 206 819 -123 416 773 -593 718 1494 -400 618 1063 -179 645 930
2728 930 -89 945 655 330 1356 340 90 1500 -235 109 1591 41 64 1217 202 321 731
$$ packed form
2607F92j430J140Q4j102J323o48l82J301q40l87J483j418L09J189j371O02O29
2624A174j245O71N14j040Q89k1r43Q82j02j193J748o03j073J642j055o31J578
2641A192j007j40J062j342L33Q97j540O44P24j468J021J27j008R01j0q29J226
2658G83o95m84J385j207j06J475j035KJ261j740O79Q35j349O01P92j541J412J0
2676A078j466J454k8j289J634p16j068J519m54q10J347r58l8Q67j104J55J090
2693A213j527N66Q94j798Q68O35j255J198l56p56J044o39l37J567j103n30J192
2710H76o79n53J203p50J09O13r42N39L57j366J311P76j894J018M45j242Q24K85
2728I30j019J034k90l25J026j016k50J410j735L44J482j550K3J153j015J19M10
$$ plain form
2745 731 -113 760 615 -432 867 891 -726 943 985 -566 867 180 76 1059 -12 421 878 -246
2763 -246 270 1136 -429 161 1231 -109 287 836 -3 393 331 -35 1188 -20 -360 1212 360 -534
2781 -534 1175 736 35 970 115 264 561 -417 702 930 -897 253 815 -1075 -3 883 -348 136
2799 136 449 -208 677 -428 8 1145 -435 -392 1398 -188 -372 1300 760 377 712 442 265 376
2817 376 23 1407 641 -889 949 755 -1024 824 910 -328 181 -29 -364 140 -603 301 1019 -833
2835 -833 -525 834 -1187 -541 1013 -40 -293 -57 -631 14 -625 -424 1098 -9 -1046 831 -114
2852 -114 -1013 875 827 -57 192 51 152 181 -219 899 943 -1039 291 626 -1041 169 1044 21 21
2871 21 -241 -547 192 -655 92 1357 -708 -1008 751 -604 -878 959 180 -397 -52 -509 -85 12 -270
$$ packed form
2745G31q44Q73j45j047J299K4j617J669M2j551J433o87j04R83j071M33M57j124
2763b46N16Q66j565N90J070j340L96N49q39L96o2l66J223j208l40J572q52q94
2781e34J709m39p01R35q55J49K97r78J119K28j827J150N62j890J072Q86j231M84
2799A36L13o57Q85j105M36J137j580M3J790j586j84J672n40l83L35k70j77J11
2817C76l53J384p66j530J838j94j779J848Q6j238N09k10l35N04p43R04P18j852
2835h33L08J359k021O46J554j053k53K36n74O45o39K01J522j107j037J877r45
2852a14q99J888m8q84K49j41J01K9m00J118M4j982J330L35j667J210Q75j023%
2871B1k62l06P39q47P47J265k065l00J759j355k74J837p79n77L45m57M24R7k82
$$ plain form
2890 -270 1418 191 -1326 162 93 -1242 574 1032 -317 -304 -355 -232 64 -556 411 1287 -1120 -823
2908 -823 656 -1082 -756 976 28 -704 -603 -514 -16 -513 -176 1114 -359 -1419 149 -462 -1301 571
2926 571 804 -100 -222 -624 -189 20 -543 552 821 -1131 -247 535 -832 117 1011 -217 -307 -242 -546
2945 -546 141 -542 105 1164 -797 -1055 557 -604 -722 730 273 -303 -522 -948 -235 -26 -659 753
2963 753 163 -1387 -115 -40 -970 237 518 -353 -111 -769 -558 153 -543 -150 746 -1097 -949 293 -546
2982 -546 -418 619 -84 -239 -707 -1068 145 -383 -368 963 -335 -1537 24 -15 -632 464 280 -100
3000 -100 -160 -379 79 39 -330 287 518 -994 -393 671 -411 -131 595 -251 -102 -416 -533 138 -307 -404
3020 -404 850 -48 -1406 304 -278 -598 29 -188 -178 -641 -757 37 -91 -990 116 306 -1251 88
$$ packed form
2890b70J688j227j517J488o9j335J816M58j349J3n1J23K96o20R67Q76k407K97
2908h23J479j738L26J732r48p32J01Q9M98m97L37J290j473j060J568o11q39J872
2926E71K33r04j22m02M35K09n63J095K69j952Q84P82j367R49Q94j228r0O5l04
2945e46O87o83O47J059j961k58J612j161j18J452m57n76k19m26P13K09o33J412
2963G53n90j550J272P5r30J207K81q71K42o58K11P11o96L93Q96j843J48J242q39
2982e46J28J037p03j55m68l61J213n28J5J331j298j202J561l9o17J096j84l80
3000a00o0k19M58m0l69O17K31j512O01J064j082K80P26q46J49l14j17O71m45r7
3020d04J254q98j358J710n82l20O27k17J0m63j16P94j28q99J106J90j557J339
$$ plain form
3038 88 117 -809 317 130 -567 -320 -785 -216 395 -395 -85 606 -292 -513 655 -80 -110 160 -432 -188
3058 -188 170 -836 875 90 -482 760 -280 -1024 535 325 -263 419 -95 -226 98 -568 -108 601
3076 601 -526 -184 549 -845 -132 370 -636 408 281 -376 478 -49 -351 626 -202 -487 668 -182
3094 -182 -512 614 -24 -287 241 -153 -117 342 -560 129 108 -622 223 167 -641 234 -118 -388 316 -76 -549
3115 -549 278 -272 -161 549 -580 -128 561 -454 -162 192 -520 244 468 -554 -270 92 -465 381 126
3134 126 -191 530 -11 -553 555 149 5 610 -20 24 510 -246 -47 479 -186 -119 404 -504 320 424
3154 424 -792 338 253 -639 299 179 -315 408 -278 -445 331 -478 -335 64 -233 -342 551 -534 -362
3173 -362 248 -617 -65 397 -282 145 286 -554 288 393 -83 583 94 -191 567 82 -231 809 -27 61
$$ packed form
3038H8K9r26J126j87o97K47m65N69O11p90L10O91q98k21J168p35l0K70n92K44
3058a88L58j006J711p85n72J242j040p44J559k10n88O82n14j31L24o66M60P09
3076F01j127L42P33j394P13N02j006J044j27o57Q54n27l02R77q28k85J155q50
3094a82l30J126o38k63N28l94L6M59r02O89k1p30Q45n6q08Q75l52k70P04l92m73
3115e49Q27n50J11P10j129M52O89j015K92L54p12P64K24j022K84L62n57Q46k55
3134A26l17P21n41n42J108m06j44O05o30M4M86p56J99N26o65O7N23r08Q24J04
3154D24j216J130q5q92R38j20m94P23o86j67P76q09J43L99k97j09Q93j085J72
3173c62O10q65N52M62o79M27J41q40Q42J05m76O66m89k85P58m85l13J040q36Q8
$$ plain form
3193 61 776 -279 153 412 -431 142 517 -286 131 170 -488 359 -29 -419 321 -118 -408 347 -230 -450
3213 -450 632 -171 -24 290 -395 184 306 -528 436 200 -398 351 96 -246 377 93 -30 686 63 223
3233 223 476 -203 -350 685 -59 -151 702 78 46 285 -297 -239 607 -308 -62 44 -789 159 442 -479 272
3254 272 -145 -488 299 -200 -16 360 -314 -201 666 -138 46 671 -201 92 476 -30 231 444 52 365
3274 365 411 -214 543 283 -327 357 324 -458 521 214 -285 125 -571 -86 478 -678 -184 602 -649 109
3294 109 187 -871 -132 184 -529 -57 -83 -371 189 -133 -114 528 82 -622 447 99 -753 405 31 218
3314 218 274 -45 335 530 -325 307 708 -533 319 385 -428 206 275 -8 387 -57 -89 386 -366 -329 752
3335 752 -312 -213 504 -773 213 465 -171 53 288 -316 280 -2 -625 589 303 -299 375 172 -631
$$ packed form
3193F1P15j055M32K59q43N73L75q03M17L9o58Q47l88l90P40m39k90P55n77k20
3213d50J082q03J47L14o85N79J22q34R64k36n98P49k55l42O23k84j23P16o23J60
3233B23K53o79j47J035p44r2Q53o24l2K39n82N8Q46r15K46J06q33R48K83r21P51
3254B72m17l43P87m99J84L76o74J13Q67q04J84O25q72K93L84n06K61K13l92L13
3274C65M6o25P57k60o10O84l3p82R79l07m99M10o96M85N64j156M94P86j251P58
3294A09P8j058P39L16p13M72k6k88N60l22J9O42m46p04J069l48q52J158l74J87
3314B18N6l19L80J95q55O32M01j241Q52O6q13O34O9k83L95m44l2M75p52L7J081
3335G52j064R9P17j277R86K52o36K24K35o04N96k82o23J214k86o02O74k03q03
$$ plain form
3354 -631 -50 213 -180 195 -258 -93 0 -637 158 663 -353 -395 107 -967 -325 278 -209 70 -271 -760
3374 -760 91 -470 -332 806 -116 -561 36 -155 -553 112 16 -38 288 -485 95 132 -860 229 884 -259
3394 -259 138 242 -658 -132 370 118 225 -197 -331 64 -751 -230 1058 -435 -555 118 -775 -779 87 -167
3414 -167 -14 -166 -640 222 -407 -919 493 204 -931 84 -53 -698 -170 181 247 196 -693 -251 66 -954
3434 -954 154 1221 -475 -530 239 -839 -154 389 74 364 -212 -798 198 -549 -845 853 191 -752 61
3453 61 -394 -1033 17 173 272 1 -788 -152 -94 -819 295 601 -911 -140 -5 -763 53 101 178 297 -143
3474 -143 -640 272 -474 -472 730 -185 -649 -113 -795 -540 -103 -280 244 -200 -744 -61 -251 -1013 265 -42
3494 -42 -781 -441 -349 -1006 -336 -178 -192 373 -917 -595 25 -620 -123 820 -655 -343 300 -544 47 299
$$ packed form
3354f31N81K63l93L75m53J65R3o37P95N05j016m2N02j074O42O03m87K79l41m89
3374g60Q51n61J38J138r22m45N97j91l98O65r6n4L26p73N80L7r92J089O55j143
3394b59L97J04r00N26N02k52J07m22j34L95q15N21J288j493j20O73q93mQ66k54
3414a67J53j52m74Q62o29n12J412k89j135J015j37o45N28L51O6n1q89M42L17j020
3434i54J108J067j696n5P69j078O85N43l15K90n76n86R96p47k96J698o62r43Q13
3453F1m55o39J050J56R9k71p89O36N8p25J114L06j512P71J35p58Q16M8P7J19m40
3474a43m97R12p46KJ202r15m64N36o82K55M37j77N24m44n44O83j90p62J278l07
3494d2p39L40R2o57O70J58j4N65j290L22O20o45M97R43j475L12O43q44N91K52
$$ plain form
3514 299 -214 254 -324 -662 171 38 -325 578 127 -610 -48 -405 -448 -41 -215 -81 -23 -947 -527 -30 -627
3535 -627 269 309 -603 -247 -474 -741 -303 -55 -259 75 -581 -559 231 -556 -546 574 -460 -668 -40 -494
3555 -494 -67 441 -95 142 29 -554 101 -199 -464 543 225 -666 -15 -178 -174 77 -157 -72 105 -759 -462
3576 -462 305 -650 -263 272 -453 -492 29 -397 -62 56 -249 102 -356 -529 466 -296 -369 213 -63 -649 192
3597 192 -98 0 722 -83 84 512 -519 -209 338 -506 -142 396 -615 -153 60 -277 241 -261 -694 211
3617 211 -507 -728 472 -261 -696 313 -146 -571 24 -609 -218 -155 -614 -13 6 -554 -138 131 -688 418
3637 418 97 -421 224 36 -98 214 72 62 465 -260 0 659 -331 -37 657 -387 215 507 -391 -171
3657 -171 -59 -410 334 57 -318 362 -43 -279 348 -147 -454 147 -392 -139 -77 -395 -56 -24 -697 -251 100
$$ packed form
3514B99n13M68n78l38Q33j33l63R03m51p37N62l57m3M07j74J34N8r24M20M97n97
3535f27Q96M0r12L56k27k67M38K48k04L34o56K2P90p87J0J120j034k08O28m54
3555d94M27N08n36K37j13n83O55l00k65J007l18q91O51j63MK51k34Q5J77q64K97
3576d62P67r55L87N35p25l9N21m26L35J18l05L51m58j73R95p62p3N82k76n86Q41
3597A92k90R8P22q05J67M28j031L10N47q44L64N38j011M62K13l37N18n02m33R05
3617B11p18k21J200p33m35J009m59m25N95o33L91O3m59O01J9n60M16K69q19J106
3637D18l21n18O45j88j34L12j42j0M03p25K60O59r90K94O94j044O02K92q98K20
3657a71J12l51P44k77l75O80m05k36O27m95l07O01n39K53O2l18L39L2o73M46L51
$$ plain form
3678 100 -765 43 197 -559 43 -148 -323 123 -84 -515 373 8 -202 309 -115 -264 478 -434 -73 212
3698 212 -121 67 468 -626 19 449 -611 180 150 -406 129 298 -394 225 -126 -553 217 -141 -313 192
3718 192 -395 -9 854 -405 -64 609 -416 240 337 -119 6 171 -335 56 -19 -255 237 15 -253 373
3738 373 -159 -151 245 -40 -243 38 -416 96 327 -377 -62 176 -329 81 258 -593 179 -136 -260 92 97
3759 97 -251 567 -258 -367 215 128 -222 287 -178 -356 303 -152 186 188 -283 236 343 -304 97 267 -151
3780 -151 458 223 -208 250 91 -342 451 -39 -290 648 -439 -82 377 6 -302 243 -173 129 157 -543
3800 -543 27 84 -408 302 64 -493 92 -147 -323 601 -262 -386 462 -276 -110 220 -392 46 363 -511
3820 -511 169 442 -25 23 660 -343 171 80 -339 320 110 -220 281 -23 -423 335 19 -84 544 124
$$ packed form
3678A00q65Q08J54p56O02j91j75M46k07m31Q88l65k10N11m24j49P42r12L61K85
3698B12l33J88M01j094O45M30j060P91l0n56N35J69o92O19l51m27P70l58j72N05
3718A92n87L86Q63j259L41O73j025O56R7m56J25J65n06L91p5k36M92k22k68O26
3738C73n32QL96k85k03K81m54N12K31p04L15K38n05M10J77q51P72l15j24L52N
3759I7l48Q18q25j09N82q7l50N09m65j78O59m55L38Km71N19J07o47M01J70m18
3780a51O09k35m31M58j59m33P93m90k51R38j087L57M59l71l08N45m16L02K8p00
3800e43N70N7m92P10k38n57N85k39j76R24q63j24Q48p38J66L30o12M38L17q74
3820e11O80K73m67M8O37j003N14r1m19O59k10l30N01l04m00P58l16j03O28m20
$$ plain form
3840 124 166 452 -333 246 354 -354 233 231 -499 200 278 -445 148 263 -290 494 286 42 489 40 -146
3861 -146 560 -65 -1 541 -46 119 536 106 -68 492 -338 325 218 -401 349 117 -360 195 519 -303
3881 -303 568 315 -33 227 -108 -47 397 -307 -13 262 -238 43 330 -393 105 345 -90 -14 -39 -230 573
3902 573 230 100 725 -185 -427 521 473 -42 338 -71 -210 146 -46 930 339 -200 167 336 -638 259
3922 259 523 -105 300 124 -283 240 -33 -34 634 -277 231 358 -140 -236 594 -86 84 500 -282 120 149
3943 149 53 409 357 -254 306 88 -481 579 258 -58 272 -70 -173 219 -111 111 626 -137 -163 264 -447
3964 -447 287 703 89 117 64 -297 243 250 -15 761 225 -236 396 -13 -334 625 196 -330 320 -166 -146 292
3986 292 -431 374 631 -568 217 210 -389 142 498 -100 69 -211 -626 36 -142 -3 639 -39 -554 223
$$ packed form
3840A24M2K86p85N79J08p08N87kp30O99P8p23N93J15n53P84k08k44M47m49j86
3861a46P06o25O4N42n87J65M17m30j74N60q30O63j07o19P50k32m77N55L24q22
3881c03Q71k53l48K60l35O1M44p04K94K75n00K81K87p23M98K40m35P6k5j91Q03
3902E73l43j30O25r10k42R48m8n15L80m09j39L56j92R76n91n39L67J69r74Q97
3922B59K64o28M05j76m07N23k73jO68r11N08J27m98r6Q30o80J70M16p82M02K9
3943A49r6L56n2o11N60k18n69J060l21l16L30l42j03L92l30K22N15p63k6M27p11
3964d47P34M16o14K8n3l61N40Pk65P76n36m61O32m09l21R59m29n26O50m86K0M38
3986B92p23Q05K57j199P85pn99N31L56n98J69k80m15O62j78J39O42o78n15P77
$$ plain form
4006 223 -303 -187 494 -49 -245 -6 -390 69 92 51 603 283 -507 199 277 -474 435 286 -224 64 -233
4027 -233 -22 101 -143 54 337 -422 1 111 -440 -25 471 -116 -75 319 -538 -37 -177 -112 382 -213 -568
4048 -568 174 -333 -300 462 95 -392 70 -232 -241 22 -90 244 624 -637 -34 228 -721 440 509 -245 346
4069 346 136 -648 -171 -198 -252 467 -155 -475 226 -472 -453 448 -131 -147 -49 -541 -418 -205 -708 118 40 -744
4091 -744 -49 84 -605 70 95 31 -9 -242 -388 227 -184 -12 656 -309 139 410 -425 187 218 50 -3 237
4113 237 -105 215 -84 -234 598 -255 -622 198 -212 -556 166 -66 -293 -21 -311 -130 -119 -654 -134 19
4133 19 -483 -82 120 -543 -65 158 -385 -84 -225 -384 379 -329 6 472 -158 -244 247 -79 54 664 108
4154 108 -26 171 -355 275 -36 -235 162 129 -291 237 -51 -563 66 0 -476 216 -462 -270 161 -378 -140
$$ packed form
4006B23n26J16O81n43j96K39l84M59K3m1N52l20p90P06P8p51R09j49n10K88k97
4027b33K11J23k44J97K83p59M23J10n51M15M96n87M1L94q57N01j40O5M94n95l55
4048e68P42n07L3P62l67m87M62l02rK63j12L34L80j261O03K62r49J161O9p54N91
4069C46k10p84M77k7n4P19o22l20P01o98J9R01n79j6R8m92J23K13n03Q26p8p84
4091g44O95J33o89O75K5o4m0k33j46O15m11J72O68r65M48K71q35O12L1j68n3K40
4113B37l42L20k99j50Q32q53l67Q20m10l44P22k32k27K72k90J81J1n35N20J53
4133A9n02M01K02o63M78K23n43L01j41j59P63p08L35M66o30q6M91l26J33O10n56
4154A08j34J97n26O30l11j99L97l3m20N28k88n12O29o6m76O92o78J92M31n39K38
$$ plain form
4175 -140 390 -431 -73 494 -330 278 278 -344 -183 -59 -271 527 123 -335 255 -83 -263 628 59 -120 325
4196 325 -229 150 328 -185 -70 192 -422 -115 479 -239 78 208 -291 55 -60 -543 246 74 -211 87
4216 87 -241 -411 495 -72 -221 307 -381 -130 232 -190 -43 414 -211 25 356 -125 292 441 -144 123
4236 123 268 54 305 317 -46 129 -96 -184 581 -269 -118 271 -122 -134 365 -388 4 254 -291 26 80
4257 80 -105 102 -44 -251 190 -115 -481 185 -119 -211 368 -188 -134 408 -493 108 164 -435 265 338 -371 107
4279 107 162 -276 246 211 -301 472 250 -215 394 176 -28 416 -181 271 259 -214 -122 293 26 203 471
4300 471 -106 83 142 -272 439 151 -256 337 -84 -384 352 75 -303 423 -225 -303 354 -203 114 117 -166
4321 -166 -24 478 -290 -81 267 -315 68 195 -462 386 180 -393 285 97 -113 322 29 -328 471 -45
$$ packed form
4175a40N30q21L58N67q24O08%o22J61J24k12P98m04m58N90l38j80Q91n69j79M45
4196C25n54L79J78n13J15K62o14L07N94p18L17J30m99L46j15m83P89j72k85K98
4216H7l28j70R06n67j49N28o88K51L62m22J47M57o25K36L31m81M17J49n85K67
4236A23J45k14K51J2l63J75k25q8P65q50J51L89l93j2M99p53L92K50n45L17N4
4257H0j85K07j46k07M41l05l66O66l04r2N79n56N4N42r01O01N6n99P00P3p09M78
4279A07N5m38N22l5n12P73k22m65O09k18k04M44n97M52j2m73R2M15k67J77K68
4300D71n77J89N9m14P11k88m07N93m21l00P36k77l78P26o48p8O57n57L17Lk83
4321a66J42N02p68K09L48n82L83J27o57Q48k06n73O78j88k10M35k93l57P99n16
$$ plain form
4341 -45 30 553 -148 -216 259 -258 82 466 -35 214 191 -285 59 164 -538 65 -150 -155 367 12 -142 639
4363 639 -233 42 301 -364 -45 457 -131 117 439 -431 79 706 -141 471 345 28 463 114 -303 102
4383 102 20 32 565 120 -89 277 -146 -83 165 -204 -299 213 -374 -145 209 -574 138 -120 -540 130 -206
4404 -206 -197 213 -65 -326 176 -35 -162 145 87 -335 200 78 -81 597 -235 147 505 -100 217 450 -194
4425 -194 294 233 9 420 -30 -23 706 -129 -366 495 -10 -341 246 -163 154 45 36 -113 -149 -668 6 230
4447 230 -349 211 244 -518 -9 -76 -434 420 235 -155 226 147 -10 473 121 -127 371 -273 -169 197 -273
4468 -273 136 247 -83 221 -86 -399 330 53 -297 296 -332 -334 308 -11 22 321 -47 25 7 -202 213 469
4490 469 -59 145 181 -371 -93 238 94 366 279 -439 395 113 -105 532 3 164 253 -111 -304 191 -26
$$ packed form
4341d5P5N23p01o8M75n17L40L84n01K49k3m76L44J05p02O03k15nN22l55j54P81
4363F39q72K75K59o65L19N02n88K48L22q70N10O27q47O12j26l17M35l49m17M05
4383A02q2J2N33m45k09L66m23O3K48l69r5N12n87K29L54p83P12k58m20O70l36
4404b06RM10k78k61N02k11j27L07n8m22N35j22j59O78q32L82L58o05L17K33o44
4425a94M88o1k24M11m50PP29q35k37Q61n05l31N87m09L17j09rj49l6n19O74K24
4447B30n79N60L3p62N09o7l58Q54j85l90L81p9j57M83l52k48M98o44J04L66m70
4468b73M09J11l30L04l07l13P29k77l50N93o28kO42l19L3K99l68P2j8k09M15K56
4490D69n28K04L6n52K78L31j44K72q7p18Q34k82k18O37n29J61Q9l64j93M95k17
$$ plain form
4511 -26 37 421 -206 162 -83 -251 103 166 -132 155 236 -372 58 196 103 253 -239 -136 287 -239 3 883
4533 883 24 -47 525 -248 -276 486 -254 414 275 -259 237 184 -304 414 302 -593 306 70 -321 376 381 -171
4555 -171 224 -45 -48 -116 -525 151 523 -40 -255 333 -139 40 419 68 101 -106 -395 288 128 -205 261
4576 261 93 -287 468 78 -269 92 -7 -15 -39 -98 44 178 -458 138 95 -287 78 246 -566 -1 307 -63
4598 -63 -25 -96 -343 197 -143 -359 264 -93 -145 235 -219 -154 175 133 310 293 -53 53 186 -421 481 285
4620 285 -219 424 -73 -299 321 75 242 392 -181 -101 538 -282 231 565 -137 -96 581 -260 98 55 -292
4641 -292 434 70 -235 268 148 -269 513 98 -268 274 -386 -467 61 -263 345 362 -577 -125 249 -405 190
4662 190 370 -406 225 -89 -272 464 24 -269 255 -50 -155 356 -154 -84 701 322 -96 468 -134 -23
$$ packed form
4511b6O3L84o27L68k45j68L54O3k98K87Q1o08M30J38r3J50m92J03M23n26K42Q80
4533H83q59p1N72p73k8P62p40O68j39n34M96n3m88P18j12q95Q99k36l91O97Nn52
4555a71L95k69lo8m09O76L72n63k15N88m72J79L79l51L3k07k89O83j60l33M66
4576B61j68l80P55l90l47L61r9qk4n9J42J34o36N96m3l82L65J68q12N65L08l70
4598f3L8p1k47N40l40k16O23l57n2L80m54O5L29m2J77j7l46J06J33o07R02j96
4620B85n04O43m97k26O20k46J67J50n73Q0O39q20N13L34p02M1O77q41L58m3l47
4641b92P26l64l05N03j20m17P82m15l66N42o60q1N28l24O08J7r39M52L74o54N95
4662A90J80p76O31l14j83P36m40k93N24l05j05N11n10P0P85l79m18N64o02J11
$$ plain form
4682 -23 235 -288 336 289 -363 126 28 -397 36 92 -569 283 80 -160 212 -107 -133 195 -138 -4 221 -307
4704 -307 94 238 -70 350 490 -227 128 304 -539 196 131 -327 739 26 -440 106 -76 -209 208 163
4724 163 -104 237 -499 -153 -30 -434 -66 395 -621 174 -103 -343 -107 223 -389 -202 -196 -545 399 163
4744 163 -117 526 20 -116 574 -155 189 689 -100 203 531 -134 169 362 -189 150 323 24 513 163
4764 163 -278 400 146 -474 223 -69 -378 41 -344 -340 264 -134 -21 169 -437 -124 94 -323 -274 35 -39
4785 -39 312 -134 -103 169 -44 -105 394 -236 -153 689 238 97 597 -311 60 605 -261 -132 274 -439 -2
4806 -2 -70 -492 89 3 -349 -77 -457 -349 130 -87 -284 96 -234 -324 175 -14 -90 190 130 -147 135 -415
4828 -415 69 547 -239 342 296 -167 397 238 47 584 244 -224 528 71 -145 558 -364 -184 -40 -176
$$ packed form
4682b3K58n23O24m7o52M89r8m25M33N6o61Q52k03k40L72l19k6L28l33J34K25n28
4704c07M01J44l08M20J40p17L55J76q43P35o5m58J066p13m66N46j82j33M17m5
4724A63k67L41p36L46J23m04L68M61j016P95k77k40K36L30o12J87Ol49R44k36
4744A63k80O43n06j36O90p29L44N00p89L03L28o65L03J93n51L39J73k99M89l50
4764A63m41O78k54o20O97k92l09M19l85MO04l98J13J90o06L13K18m17M9L09p4
4785c9L51m46L1K72k13o1M99o30Q3Q42m51j41N00r08L71N45q66J29M06p13M37
4806bo8m22N81q6l52K72l80J08M79k17j97L80l30r0M99j89p6K80o0k77K82n50
4828d15M84M78p86N81m6m63N64j59j91N37l40m68P52m57k16P03r22J80J44j36
$$ plain form
4848 -176 -90 -75 -335 -66 26 -548 -222 -171 -459 -278 22 -532 50 -59 -439 -25 -67 -342 279 -186 -143 647
4870 647 -174 91 528 -154 -5 465 -357 239 306 -135 105 380 -499 184 46 -74 84 -328 -205 180
4890 180 -569 -280 -37 -423 -105 117 -521 -35 -31 -441 -97 110 -458 -29 69 -458 -74 -33 -563 456 -115
4911 -115 -208 279 -324 -116 351 -191 -104 382 -213 -128 395 -284 -176 198 -444 284 -278 -234 234 73 -536
4932 -536 69 -66 -305 235 -430 -463 117 -94 -421 351 -590 -26 294 -239 23 481 -326 315 457 -224
4952 -224 486 122 39 377 146 -276 302 9 -258 270 -298 -460 170 -422 31 159 -637 120 54 -594 -267
4973 -267 -17 -520 10 20 -203 75 -99 -329 72 115 -281 430 -265 -155 288 -40 -129 244 -126 207 591
4994 591 -167 17 442 -168 201 259 -318 229 -112 -229 162 80 -325 401 -320 -104 289 -377 -366 290 -228
$$ packed form
4848a76Q6J5k60K69R2n74L26N1k88J81L00n54N82j09l80M14m2k75O21m65M3P90
4870F47q21K65M37o82J49M70q22N96O7m41K40K75q79O83j38j20J58m12J23L85
4890A80p49K89K43l86L18K22o38M86Mm10L44K07n68M29R8n27L84M1n30J019n71
4911a15r3M87o03K08M67n42Q7M86n95Q5N23o79J08L74o42P28n62M4M68j61o09
4932e36O05j35k39N40o65l3N80k11l27P72r41N64L20n33K62M58q07O41J42o81
4952b24P10l64q3L38k31m22N78k93k67N28n68j62O30n92M53J28p96P57o6o48L27
4973b67K50n03N30J0k23K78j74k30M01M3l96P11o95J10M43l28q9L73l70L33L84
4994E91p58J84M25o10L69N8n77N47l41j17L91q2m05P26p21K16L93o66J1O56n18
$$ plain form
5015 -228 88 -176 -374 -4 264 -381 -36 26 -282 241 -62 -34 35 11 -393 642 64 -252 416 33 -52
5036 -52 485 -31 -171 238 -585 -103 336 -354 198 121 -443 338 162 -249 71 -197 -593 -145 -505 -394 129
5057 129 -283 -314 19 -432 -130 -160 -336 -169 -38 -477 323 -173 -340 384 98 2 188 -13 -366 393 400 -150
5079 -150 401 -108 -103 503 85 95 361 -194 -62 -30 -514 164 181 -362 210 -94 -335 -92 -372 -216 363 -271
5101 -271 -297 297 -189 -67 183 -13 -390 234 -387 -289 169 -228 -322 182 -91 305 83 -616 89 211 -180
5122 -180 46 -264 -383 273 -132 -319 216 -195 -14 145 -312 -168 148 -122 -61 269 -308 125 -230 -448
5142 -448 14 119 -325 137 88 -310 212 32 87 -30 19 -79 318 -372 10 588 -453 -120 78 -315 109
5163 109 293 -253 11 53 -302 117 -167 -372 442 -409 -169 159 -73 -88 69 -457 -154 131 -227 -88 -112
$$ packed form
5015b28L16k64j98L70K68o45L45O2l08N23l03K8O9k4m04J035n78l16O68l83q5
5036e2N37n16j40M09q23M82M39o90N52p7n64P81j76m11L20k68l96M48l60J11N23
5057A29m12l1L33m51L02l0j76J67J31m39Q00m96j67P24k86r6J86k01l53P59Pn50
5079a50N51n09NO06m18J0K66n55J32L2m84O78J7n43N72l04k41K43k80J56N79o34
5101b71k6N94m86J22K50j96l77O24o21R8M58l97r4N04k73L96k22o99P05J22l91
5122a80K26l10j19O56m05j87N35m11J81J59m57J44L16k70O1L30n77M33l55k18
5142d48M62J05m44M62m9l98N22j80N5j17M9r8L97o90L82N78j041L33J98l93M24
5163A09J84n46K64M2l55M19k84k05Q14q51K40L28k32j5J57n26L03K85l58J39k4
$$ plain form
5184 -112 -460 -87 170 -511 122 138 -271 76 -59 -497 174 262 -272 -10 -100 -412 174 -160 -270 111 -325
5205 -325 5 317 -350 -85 168 -9 19 197 -360 -31 7 -170 -18 83 -350 346 270 -282 129 -76 -14
5226 -14 74 -11 -235 -52 -400 319 388 -394 41 38 -611 -237 204 -171 327 69 -508 233 65 -194 37 -370
5248 -370 -351 161 -41 -219 116 -215 -33 162 -376 55 -151 -490 160 99 -345 -12 46 -127 334 -4 104
5269 104 374 -274 35 163 -21 -263 270 -78 -171 452 -197 -29 314 -192 71 -75 -152 9 -71 39 83
5290 83 297 -309 278 -239 -249 206 -144 -430 201 -381 -94 194 -381 142 122 -408 27 342 -170 103 217
5311 217 -373 86 -291 -233 227 1 -287 430 -191 -167 329 -75 -240 61 -124 248 434 -267 140 -105 -475
5332 -475 291 27 -367 140 -66 -330 327 20 71 396 108 -138 179 -25 -187 517 -86 97 303 -224
$$ packed form
5184a12l48L73K57o81O33J6m09L47j35m38O71Q8n34K62r0l12N86l34j10L81m36
5205c25L30L12o67K65K53j77K8J78n57L29L8j77J52J01m33O96p6n52M11k05O2
5226a4Q8q5k24J83l48P19O9p82M35lo49L74M41l75M98k58n77P41j68k59K31m07
5248c70J9N12k02j78L35l31J82J95n38M31k06l39O50o1m44L33N8j73M61l38J08
5269A04K70o48L09J28j84k42N33l48r3O23o49J68L43n06K63j46p7J61q0J10M4
5290H3K14o06N87n17j0M55l50k86O31n82K87K88n75N23k0n30M35L15n12K73J14
5311B17n90M59l77N8M60k26k88P17o21K4M96m04j65L01j85L72J86p01M07k45l70
5332d75P66k64l94N07k06k64O57l07N1L25k88k46L17k04j62P04o03J83K06n27
$$ plain form
5352 -224 -59 425 -107 110 -161 -260 451 67 45 522 -52 -52 297 -102 -283 20 -53 -273 170 -286 -479 -65
5374 -65 -186 46 -17 -234 -87 118 -297 157 116 -316 196 59 -246 330 -63 -29 52 -26 -67 196 -68 175
5396 175 359 -9 234 409 -148 344 325 -220 211 -31 -96 -79 99 -350 413 49 24 407 -161 -102 463 -266
5418 -266 -458 378 -263 -206 468 -181 -35 529 -259 124 212 -467 365 83 -83 139 60 -310 220 0 54
5439 54 80 -164 -39 347 -87 39 -70 -74 154 244 -23 91 276 -225 258 243 -254 435 132 -249 57 -202
5461 -202 -130 399 -89 61 532 100 58 182 -124 182 -95 -146 45 278 -277 297 90 -327 137 -191 55
5482 55 366 181 35 350 -186 -143 128 -217 -173 118 -141 -22 66 -229 -124 235 -26 -48 -115 -287 383 -58
5504 -58 -375 79 -122 36 -85 -162 -282 354 1 -269 94 -161 -129 438 -31 126 26 -426 -89 201 -358
$$ packed form
5352b24J65M84n32K17k71r9P11l84k2M77n74%L49l99j81L03p3k20M43m56j93M14
5374f5j21K32o3k17J47K05m15M54m1m32N12j37l05N76l93L4Q1p8m1K63k64K43
5396A75J84l68K43J75n57M92j9n45M31k42o5J7J78m49P63l64k5L83n68N9N65p29
5418b66j92Q36o41N7O74o49J46N64p88L83Q8o79Q32k82j66K22p9l70N30k20N4
5439E4K6k44J25L86m34J26j09mK28R0k67J14J85n01M83j5m97O89l03l81L06k59
5461b02P2N29m88J50M71m32m2J24l06L06k77n1J91K33n55N74k07m17M64l28K46
5482E5L11j85j46L15n36M3K71l45M4K91k59J19Q8k95J05L59k61k2o7j72O70m41
5504e8l17M54k01J58j21p7j20O36l53k70L63k55L2N67m69J57j00m52L37K90n59
$$ plain form
5525 -358 34 -70 -230 40 76 -171 202 -87 -110 160 58 130 216 58 69 164 -175 212 368 -79 182 89
5547 89 -351 283 -152 -146 307 -55 -326 286 100 -25 170 -39 -236 263 -156 -183 234 -227 -186 417 -223 21
5569 21 -14 -338 15 170 -294 146 -208 -211 194 290 29 481 283 75 197 -88 -318 378 -151 -175 376 -345
5591 -345 11 354 -312 3 187 -551 7 73 -73 231 196 -182 317 -1 -248 161 85 -292 132 -222 30
5612 30 34 -50 -42 335 -367 98 323 -418 -193 -48 -326 203 183 -466 165 44 -432 144 -107 -137 455 -368 -189
5635 -189 -3 -211 -75 165 -217 168 102 -150 204 126 -41 67 24 -143 222 -36 -74 323 -102 -8 49 -48
5657 -48 -256 320 -52 185 403 -195 169 -16 -40 108 207 -365 171 219 -398 526 -104 49 253 -199 -243 172
5679 172 -162 -131 275 -97 271 419 -125 69 44 -419 162 26 -100 403 -54 -125 -3 176 -356 98 84
$$ packed form
5525c58L92j04j60K70L6k47L73k89k3K70j02P2Q6j58J1R5l39L87J56m47K61r3
5547H9m40O34m35OM53l62k71O12j86j25J95k09j97M99m19k7M17m61M1O03o40K44
5569B1l5l24L53J55m64M40l54lM05R6k61M52j98k08J22k85k30O96n29k4N51p21
5591c45L56L43o66L15J84p38N58O6j46L04l5l78M99l18k47M09p6l77M24l54K52
5612C0Mq4QL77p02M65K25p41K25J45k78N29k0o49O31j21m76N76k51l0N92q23J79
5635a89J86k08J36K40l82L85o6k52L54p8j67J08m3j67L65k58l8L97m25R4N7r7
5657d8k08N76l72K37K18n98L64j85k4J48R9n72N36M8o17R24o30J53K04m52m4M15
5679A72l34L1M06l72L68J48n44J94k5m63N81j36j26N03m57p1J22J79n32M54j4
$$ plain form
5700 84 -124 -103 -122 -286 265 -365 122 232 -297 -162 26 -129 -121 251 -456 90 -64 22 85 14 -56 302 -88
5723 -88 -57 108 -119 -55 428 269 -3 169 16 5 195 -175 1 245 -354 81 339 -171 252 69 -259
5744 -259 161 -76 -41 97 -384 -77 224 -432 -184 -96 -92 -36 67 -92 -127 -30 -513 -256 339 -87 68 60 -346
5767 -346 119 438 -135 370 41 -209 187 -106 -196 509 107 -177 30 -533 -238 196 -214 167 38 -168
5787 -168 56 -56 -155 387 -211 -119 52 -188 -278 189 -71 -161 362 -268 1 314 -374 -121 478 65 174
5808 174 -65 -394 -109 240 -335 533 162 123 305 -96 -145 368 -218 -272 163 -437 -33 144 -223 -33 166
5829 166 -303 -87 -1 -344 126 127 -366 152 -245 -288 -23 -202 -131 394 -59 -14 59 -152 82 93 -159 21 148
5852 148 -313 -95 555 196 2 169 -261 173 0 -93 427 16 -330 133 97 -447 279 53 180 206 -290
$$ packed form
5700H4k08K1j9j64N51o30M87J10n29J35J88j55QL72p07N46j54Q6O3p1p0L58l90
5723h8L1J65k27O4M83j59k72J72j53j1J90l70J76K44n99M35K58n10M23j83l28
5744b59M20k37L5J38m81L07L01o56K48Q8MN6J03j59l5R7m83K57N95m26J55qm06
5767c46M65L19n73N05l29k50L96k93r0P05m02k84K07n63K95M34m10L81j29k06
5787a68K24j12r9N42n98R2J71k40r0M67k60r0N23o30K69L13o88K53N99m13J09
5808A74k39l29K85L49n75Q68l71l9J82m01m9N13n86n4M35o00M04J77l67J90J99
5829A66m69K16Q6l43M70Jm93N18l97m3K65j79P1N25m53M5P3k11K34J1k52J80J27
5852A48m61K18O50l59j94J67m30M34j73r3N20m11l46M63l6n44P26k26J27K6m96
$$ plain form
5873 -290 -212 78 56 122 22 -454 -57 -146 -465 116 214 -356 90 141 -387 -34 -67 -286 561 -154 -7 348
5895 348 -307 58 508 16 -104 81 -402 -40 -7 -243 -123 107 29 422 12 -217 66 91 -143 199 -238
5916 -238 -119 208 -191 -127 287 -242 -9 399 -323 68 238 95 68 109 -224 52 19 -283 381 67 -150
5937 -150 115 22 74 60 8 87 259 -140 123 217 -304 111 108 -328 -15 170 -401 69 15 -245 98 92 -255 67
5961 67 111 -84 309 -158 19 478 -126 145 1 -159 -134 474 -333 164 150 -299 274 380 -100 -303 105
5982 105 61 203 -42 -167 177 -226 -122 286 2 81 168 6 137 210 -32 78 213 -152 184 292 -139
6003 -139 288 263 -119 579 52 -96 581 148 -123 222 -46 -139 220 -23 150 148 -91 333 109 -401 71
6024 71 216 -208 -82 3 -86 344 133 -26 90 -14 -330 207 -89 75 304 -55 -246 75 -55 28 312
$$ packed form
5873b90P8K90k2O6j00m76L97q9l19N81R8n70M46N1n28L53l3k19Q47p15J47L55
5895C48o55L65M50m92j20J85m83L62L3k36J20K30p8L93m10k29K83K5k34L42m37
5916b38J19L27l99O4M14n29K33M08p22L91J70j43k7M1l33K76l3l02O64l14k17
5937a50K65r3N2j4n2P9J72l99K63R4n21M15lm36L13J85n71M70n4k60L43ol47L22
5961F7M4j95L93m67J77M59o04K71j44j60K5O08q07M97j4m49N73J06m80k03M08
5982A05m4J42k45j25L44m03J04M08k84P9Q7j62J31P3k42J10J35l65L36J08m31
6003a39M27k5l82O98n27j48O77m33k71L45k68r3L59k43J73kk39M24k24n10M72
6024G1J45m24J26Q5q9M30k11j59J16j04l16N37k96J64K29l59j91L21j30Q3K84
$$ plain form
6045 312 -50 534 243 -205 340 176 72 558 149 -66 392 237 -133 352 70 -141 175 75 24 330
6065 330 0 111 438 -306 -86 270 -156 231 355 -166 -69 80 -202 179 -182 -310 39 -148 -128 -11 -27
6086 -27 -94 401 -87 11 137 -65 301 283 -96 -68 273 -112 221 24 -180 274 142 -301 19 -245 -58 286
6108 286 -202 -6 228 -237 -228 -45 -243 263 173 22 53 348 -423 252 171 -206 320 -74 -111 367 121 -37
6130 -37 156 -131 43 386 77 -327 144 -238 5 304 116 158 29 -63 106 76 -197 433 72 -243 373
6151 373 -18 -210 157 69 -234 135 12 -162 195 -298 -33 29 -128 287 212 -201 -117 -16 -74 183 274 -225
6173 -225 222 -290 -83 59 41 -90 295 -248 77 416 -167 80 326 -278 47 114 -383 248 341 -66 182
6194 182 112 -225 341 10 -215 182 -67 -158 198 -407 114 326 -66 138 296 -420 86 140 -550 184 21
$$ packed form
6045C12l62N84k91m48N45j64j04M86m09k15M58j55l70M85k82k11L16j00n1L06
6065C30l30J11L27p44K20L56m26L87J24n21R7J49k82L81l61j28L49j87K0J17j6
6086b7o7M95m88R8J26k02L66j8l79K8L41l85L33j97k04M54j32m43L20k64J87L44
6108B86m88J96K34m65RJ83j98N06r0j51L1K95p71O75q1l77N26l94l7M78k46j58
6130c7J93k87J74L43l09m04M71l82K43K99j88M2j29r2J69l0k73O30l61l15O16
6151C73l91j92L67q8l03L69j23j74L57m93K65O2j57M15p5m13Q4J01n8K57R1m99
6173b25M47n12K07J42j8j31L85n43L25L39n83K47K46o04L25O7m97O31R3m07K48
6194A82p0l37N66l31k25L97k49r1L56o05N21K12l92K04J58p16N06N4o90P34j63
$$ plain form
6215 21 -178 246 275 -153 18 -71 -290 105 -90 -340 27 132 -178 57 -39 45 106 -185 149 412 -404 124
6237 124 275 -334 -160 37 -578 -38 144 -93 254 -144 -563 193 -25 142 328 -26 -170 4 -109 -188
6257 -188 282 -245 83 33 -192 30 334 49 444 237 -174 19 -5 -311 96 -53 -273 259 -327 -85 -55
6278 -55 -90 40 386 -270 -37 262 -44 230 -140 -354 243 -311 -333 380 181 -51 277 -56 -350 -32 -318
6299 -318 -13 85 -90 -209 13 -294 -245 -25 -203 345 47 -190 219 60 -102 52 167 -219 -78 22 -118
6320 -118 61 -9 -112 162 -93 -376 307 52 -5 151 -170 156 199 -399 185 235 -226 381 -92 -291 68
6341 68 -146 -94 264 -4 5 39 -184 -52 290 -302 -99 206 -557 -129 160 -172 -49 -10 -337 18 142 -251
6363 -251 213 244 -53 56 8 -223 41 -75 -73 416 31 -117 343 -96 -88 178 -48 140 300 -195 143 89
$$ packed form
6215B1j99M24K9m28J71q9k19L95j95k50L67J05l10K35r6Q4O1k91L34K63q16N28
6237A24J51o09J74J97o15N40J82k37L47l98m19P56k18J67J86l54j44J74j13p9
6257a88M70n27L28n0k25K22L04k85L95k07m11J93k4l06M07j49k20N32n86K42L0
6278e5l5J30L46o56K33K99l06K74l70k14N97n54k2P13j99k32L28l33k94L18k86
6299c18L05R8j75j19K22l07M9K20j78N48k98k37M09j59j62J54J15l86J41J00j40
6320a18J79p0j03K74k55k83O83k55n7J56l21L26M3n98N84N0m61O07m73j99L59
6341F8k14N2L58k68RL4k23J32L42n92K03L05p63M28K89l32J23L9l27L55J24l93
6363b51M64L1k97J09m8k31K64j16KM89l85j48M60m39QK66k26J88J60m95L38n4
$$ plain form
6385 89 -203 182 -50 -32 272 -3 -104 21 -12 -211 252 -87 238 168 -170 -62 179 -690 -131 319 -119
6406 -119 214 146 -128 90 285 -409 -77 64 136 315 -154 -78 296 -165 -141 78 29 -27 420 -356 71 406
6428 406 -188 54 273 -34 175 129 -249 359 -245 75 139 -190 -262 74 -313 -77 406 -53 128 41 -429
6449 -429 47 277 -76 174 400 -3 132 65 -18 262 -42 48 14 -74 60 131 -511 75 -69 -110 3 175
6471 175 -136 205 367 -248 210 11 -88 -29 53 -367 125 123 -164 71 -16 -107 288 -10 -76 162 24 -130 106
6494 106 -29 -3 43 -116 131 139 -233 65 290 -149 67 -87 -321 184 344 86 255 209 300 238 40 170
6516 170 84 -279 -48 93 -138 126 -21 -180 -37 81 -33 214 360 -149 170 -84 -140 226 71 -18 429
6537 429 98 34 96 -194 -121 -102 -317 -59 209 86 -65 113 -101 -63 181 -135 353 -51 -13 172 364 -276
$$ packed form
6385H9k92L85k32J8L04k75j01J25l3j99M63l39L25p0l38J08K41q69N59M50m38
6406a19L33o8k74K18J95o94L32J41P2J79m69P6L74m61K4K19m9n6M47p76M27L35
6428D06n94K42K19l07K09m6l78O08o04L20O4l29p2L36l87K36M83m59J81q7m70
6449d29M76K30l53K50K26m03J35o7q3K80l04R0l4q8J34P1o42N86j44m1J13J72
6471A75l11L41J62o15M58j99r9N9Q2m20M92kk87K35q7r1L95k98o6K38j38j54K36
6494A06j35K6M6j59K47Ql72K98K25m39K16j54k34N05J60k58J69m6R1o2j98J30
6516A70q6l63K31J41k31K64j47j59J43J18j14K47J46n09L19k54n6L66j55q9M47
6537D29l31o4O2k90P3J9k15K58K68j23j51J78k14L8K44l16M88m04L8J85J92o40
$$ plain form
6559 -276 69 478 112 346 1 127 89 -287 49 213 -72 98 63 -138 372 177 -118 366 -57 -139 257
6580 257 37 -257 239 -125 61 272 -126 -97 322 -28 45 95 -377 95 157 -10 154 347 -98 317 33
6601 33 79 480 31 43 286 -68 -10 295 43 89 51 -270 31 162 -48 460 109 -92 13 -99 26 -17
6623 -17 36 -10 328 -114 -167 31 269 21 30 -19 -54 325 85 64 178 -131 -54 66 -2 4 447 -60 310 66
6647 66 -163 287 -35 85 376 55 -62 114 -86 -292 263 54 -3 144 -118 -129 54 -12 -80 171 113 -48
6669 -48 104 -165 289 114 -402 329 146 232 217 -271 -91 338 -148 -42 284 -168 -147 211 24 388 100
6690 100 -158 51 33 -246 126 197 -133 380 -134 -231 43 258 -82 83 -142 38 343 90 53 115 31 212
6712 212 297 -227 222 392 -73 256 71 11 213 26 98 26 7 -23 126 -119 -99 63 112 -91 -80 -292 42
$$ packed form
6559b76L45M09l66K34l45J26l8l76L36J64k85J70l5k01N10j95k95M84m23q2L96
6580B57k20k94M96l64J86K11l98K9M19l50P3N0m72M72O2j67J64J93m45M15k84
6601C3M6M01m49J2K43l54N8L05k52M6l8l21L01J31k10N08l51k01J05j12J25m3
6623a7N3m6L38m42n3J98K38k48Rm9l5L79k40k1J14l09P7J20o8OM43n07L70k44
6647F6k29M50l22J20K91l21j17J76k00k06N55k09n7J47k62j1J83o6o8K51n8j61
6669d8J52k69M54j75n16P31j83Q6j5m88J80M29m86J06L26m52K1L58j87L64k88
6690A00k58K09j8k79L72P1l30N13n14r7K74K15l40J65k25J80L05k53l7O2q4J81
6712B12Q5n24M49J70m65L29j85o0K02j87P2p2j9l0J49k45K0J62M9k03J1k12L34
$$ plain form
6735 42 333 -228 96 241 -121 -88 -57 -76 110 -190 -67 19 185 -279 377 50 -320 314 108 -137 -144 -270
6757 -270 -174 215 -231 -22 -2 -326 122 -95 -286 297 159 -274 -215 -94 -271 393 -43 -130 241 -232 -258 128
6779 128 -119 -76 220 -199 223 248 -211 -77 48 -125 305 93 -42 168 207 174 -80 -183 -92 93 -11 -116
6801 -116 16 -87 -184 111 -352 -195 -1 -198 -101 85 -223 -126 190 -246 -26 -176 -150 182 -374 -183 428
6822 428 7 -44 276 72 -261 104 28 41 85 -79 -24 40 -154 109 130 -41 248 277 -180 -47 159 -327 120
6845 120 -181 5 340 14 -239 123 -302 -10 -20 -286 37 -35 -210 142 28 -30 52 -245 -151 64 -239 -230
6867 -230 115 -34 71 20 -103 -105 119 -195 -86 -171 -257 -224 -118 -232 7 22 -11 114 -35 -70 127 92 9 8
6891 8 -7 -11 59 18 -394 111 -99 -56 112 -109 205 285 21 261 114 -443 -41 37 -222 217 129 -64 59 -36
$$ packed form
6735D2K91n61L24J45l62L3L1j9J86l00J23Q6J66m64O56l27l70O34k06k45pj26
6757b70R6L89m46K09K0l24M48k17j91N83j38m33N9J21j77O64m36q7L71m73k6L86
6779A28k47M3K96m19M22K5m59J34J25j73M30k12j35K10L9l3k54j03R1J85j04j05
6801a16J32j03r7K95m63J57J94j97R7J86l08R7L16m36K20j50K6L32n56J91O11
6822D28m21n1L20k04l33L65p6J3M4j64N5O4j94K63K1j71K89K9m57J33K06m86M47
6845A20l01J86L35l26k53L62m25K92j0k66L23p2j75L52j14n8Q2k97R4K15l03R
6867b30L45j49J05n1j23kK24l14J09q5q6L3J06j14K39J5l3J25j49l5J97l5q3j
6891Hj5mP0m1m12N05k10M3J68k21L14Q0k64K40j47n57M02P8k59M39q8j93J23r5
$$ plain form
6915 -36 -495 262 133 -177 172 -53 33 316 -60 -12 116 -196 -9 37 -144 88 42 -214 246 9 -254 119
6937 119 -61 -174 242 -218 -123 20 -303 -6 246 -137 65 53 -146 -183 227 -97 -47 -85 -216 -124 131 -191
6959 -191 92 207 274 113 159 -144 413 -120 -7 170 -90 -50 82 1 11 56 -241 248 140 97 49 237 -274
6982 -274 339 121 182 50 43 318 205 -104 199 440 -128 -3 186 -169 -96 166 -148 -323 188 98 251 29
7004 29 22 86 92 -38 -92 204 -200 219 -251 -84 154 163 43 251 -175 17 105 -60 -136 123 47 247 254 -11 27
7029 27 -52 -102 97 278 -202 179 30 130 229 60 -20 -162 -24 -332 104 -52 151 67 -151 156 165 -140 -145
7052 -145 93 -83 61 246 9 -9 14 9 44 55 224 158 166 12 95 -43 164 172 244 -7 34 -37 174 4 169
7077 169 224 91 71 -12 -152 -228 47 217 116 -5 -249 248 -92 -103 5 -83 -225 172 299 75 245 -136
$$ packed form
6915c6m59P57j29l10L49k25Q6K83l76M8J28l12J87M6j81K32m6k56M60k37k63L73
6937A19j80j13M16m60R5J43l23K97K52l83K02j2j99l7M10l24N0l8j31R2K55l22
6959a91K83J15O7j61M6l03N57n33J13J77k60M0J32q1J0M5k97M89j08m3m8J88n11
6982b74O13k18O1j32pK75j13l09L03K41n68J25J89l55P3K62l14j75N11r0J53k22
7004B9pO4Oj30n4K96m04M19m70J67K38Rj20K08m26J92Q8j65p6K59p6K00Pk65L8
7029B7p9n0J99J81m80L81j49J00R9j69q0j42J38l08M36j56K03q4k18L07Rl05n
7052a45K38j76J44J85k37j8K3nL5J1J69o6Qj54Q3j38K07QP2k51M1p1K11j70J65
7077A69N5j33k0q3j40p6K75J70j01j21k44M97l40j1J08q8j42L97J27k24J70l81
$$ plain form
7099 -136 -135 142 190 30 3 57 130 308 43 -165 315 -34 74 114 -351 101 323 -29 -120 51 -149 -19 145
7122 145 116 -17 103 -73 77 66 -115 -27 -226 -164 122 60 -251 -108 -52 -70 350 -134 -42 74 -391 -97 32
7145 32 -93 209 194 -71 147 -111 -39 60 105 107 364 158 144 278 191 26 77 -85 -120 372 -74 153 322 47
7169 47 314 -139 -102 222 99 -77 254 28 -99 103 20 -357 -8 -102 -136 236 -100 76 139 -196 50 284
7191 284 -143 -8 266 -43 111 -97 -287 170 9 -328 -36 -124 115 35 42 -107 145 -178 90 257 -191
7212 -191 265 253 -50 -69 -102 130 258 140 -357 264 27 -99 5 -65 -225 128 -392 -257 139 -217 -6
7233 -6 251 -42 -236 239 63 -20 99 46 -34 119 -346 -5 122 2 31 -10 130 156 103 99 49 -315 -134 -22
7257 -22 -131 -207 95 -412 63 78 -400 69 103 -240 131 254 -17 344 101 -1 -69 -98 -106 42 -71 -21 209
$$ packed form
7099a36JK77M8j60k7N4P3J78k65k08M80l49J08M0m65M52K22l52r1J71k00J30J64
7122A45k9j33J20j76J50j1j81Q8j99O2K86o2l11J43N6j8M20m84R2J16m65K94J29
7145C2j25L02j5k65K18k58P2R9M5KK57k06j4J34q7j65N1j62l5M92m46K27J69k75
7169D7K67m53L7L24j23j76L31k26j27K02q3l77L49r4l4L72l36J76O3l35K46K34
7191B84m27J35K74l09J54k08j90M57j61l37K92q8K39q0Pj49K52l23K68J67m48
7212a91M56j2l03j9l3K32J28j18m97O21k37j26J04p0j60L53n20J35L96l56K11
7233fK57k93j94M75j76q3J19n3q0J53m65L41J27j20K9m1J40K6n3mn0l64J81J12
7257b2j09p6L02n07M75J5m78M69L4l43L71J23k71L61k43j02o8k9qJ48j13N0K30
$$ plain form
7280 209 29 -63 79 -97 39 59 -9 -24 -70 -13 -19 215 -184 184 181 106 469 -8 -81 87 -337 -151 -161 -270
7304 -270 -469 73 -29 30 0 50 71 -80 -124 11 -111 -123 -128 208 -243 175 -106 -483 203 258 195 -172 63
7327 63 -95 -166 99 -28 -75 63 -114 -6 -35 -49 -195 -153 -88 91 -183 107 -99 -227 -79 -107 10 -81 50
7350 50 -222 34 -64 65 292 -140 30 -113 130 -138 234 -119 186 -127 -427 -82 -27 -422 -147 -81 -167 162
7372 162 -95 26 104 -202 -215 84 -123 -304 92 -267 108 -160 108 59 -294 -235 301 -40 -116 220 -71 130
7394 130 30 -109 -207 263 165 -244 138 -160 9 18 -124 268 23 -207 136 28 -217 55 70 119 30 -288
7416 -288 -28 221 77 96 113 -13 -41 249 -90 358 88 13 93 -140 -203 -19 11 -93 277 32 -308 128
7438 128 76 -243 159 213 -4 45 6 -46 359 -279 47 -141 -266 -133 137 -260 -254 -223 -541 259 -40 -404 -266
$$ packed form
7280B09j80r2J42j76J36K0o8j5m6N7oK34l99L68lp5L63m77p3J68m24J86j0j09
7304b70j99N42j02N9l0N0K1j51m4J35j22j2nL36m51M18k81l77O86N5o3l67K35
7327F3j58p1K65j27m7J38j77J08k9j4j46M2O5J79k74K90k06j28J48k8J17r1J31
7350E0k72K56r8J29K27m32J70j43K43k68L72l53L05l13l00L45N5l95K75O6q6L29
7372A62k57J21P8l06j3K99k07j81L96l59L75k68K68m9l53N9N36l41p6L36k91K01
7394A30j00j39r8M70r8m09L82k98J69Rj42L92k45k30L43j08k45K72J5M9q9l18
7416b88K60K49j44J9J7j26k8K90l39M48k70p5Q0k33o3J84L0j04L70k45l40M36
7438A28n2l19M02N4k17M9l9n2M05o38L26j88j25J33K70l97OL1l18Q00k99l64J38
$$ plain form
7461 -266 -127 -552 2 -19 69 -13 226 134 301 -76 122 123 59 -81 91 4 -182 127 -340 -2 51 -211 -326
7484 -326 116 -117 60 -159 -100 26 -334 -205 264 296 -15 134 -121 -96 -103 -93 -196 -50 -272 47 -43 -235
7506 -235 8 115 73 34 152 -443 -96 -107 -25 25 -331 134 -2 -114 130 227 -232 33 -89 -34 8 36 204
7529 204 198 10 -316 128 -89 -114 233 -127 -190 -93 -48 -111 -90 -263 13 -58 -126 34 -78 -78 83 56 -182 62
7553 62 -119 -297 332 -184 -151 175 -15 -47 406 -367 -59 98 70 -2 58 -139 -56 -9 -211 72 -44 -228 10
7576 10 -207 -64 6 82 -141 -97 -12 87 244 -81 81 186 -311 -153 -18 -203 -64 97 -92 -300 -145 224
7598 224 -25 -2 65 76 -36 -200 -65 -22 -163 134 113 -138 76 -4 83 7 -138 133 371 59 212 71 -117
7621 -117 -24 -54 57 101 6 96 74 34 -231 -11 -218 66 124 56 -2 326 -42 7 -65 57 125 -17 68 -48 -77
$$ packed form
7461b66J39m25N54k1Q8q2K39r2J67l77J98Jo4j40J72q7j86L09m67L38N3k62j15
7484c26M42k33J77k19N9J26l60J29M69L2l11J49k55K5pJ0j03J46k22L19r0j92
7506b35K43J07m2l9J18n95L47j1Q2N0l56M65j36j12K44R7m59K65j22N5M2K8J68
7529B04oj88l26M44k17k5L47l60o3R7M5o3K1j73K76p1o8J60j12%J61k7k38K44
7553F2j81j78O29n16L3L26j90l2M53p73L08J57k8p2O0j97Q3M7k02K83j16j84K38
7576A0k17J43P0P6k23M4Q5R9J57l25J62J05m97J58J35j85J39J61j89k08J55L69
7598B24k49K3O7J1j12j64J35M3j41K97k1k51K14q0Q7p6j45K71K38l12J53j41j88
7621a17R3l0J11M4r5R0k2m0k65K20k07K84N8o8n8L28l68M9p2J22O8j42Q5j16k9
$$ plain form
7646 -77 -132 53 -64 -88 -203 -239 -276 -15 -217 -168 304 -18 -126 257 109 -206 -45 -40 142 64 81 -60 167
7669 167 197 -88 106 11 420 99 -267 78 -154 22 -131 203 -4 166 -347 -51 41 173 -241 37 -66
7690 -66 60 21 -212 -87 212 -24 147 -146 8 226 80 -17 -95 153 -213 53 344 -59 -33 -35 -87 20 -302
7713 -302 130 225 -248 -54 -58 -93 -72 127 -205 -78 -97 -123 -23 -77 -10 -125 87 252 58 107 -36 116 -97
7736 -97 86 362 59 139 13 -139 237 269 -47 -81 240 -165 -22 -33 -130 112 -237 45 -129 -144 -67 -54 -37
7759 -37 194 197 -70 245 211 -89 55 7 -228 204 115 -158 215 -128 5 134 53 -56 113 84 35 -34 -224
7782 -224 -63 335 20 197 310 -247 151 224 -135 120 105 -184 74 -14 -205 194 98 -71 168 -63 -121 -135
7804 -135 -191 -251 201 -35 -368 155 -59 -117 133 -51 154 -40 -158 -4 81 -19 58 -223 -40 -29 160 -296
$$ packed form
7646g7n5J85j17k4j15l6l7K61k02M9M72l22j08L83j48l15J61NJ82p8J7j41K27
7669A67L0k85J94r5M09l21l66L45k32J76j53L34k07J70n13K96R2J32m14K78j03
7690f6J26l9k33J25K99k36J71k93J54K18j46r7p8K48l66K66K91m03K6kn2J07l22
7713c02M32R5m73J94ml5K1J99l32J27j9k6J00n4O7j15K12J65j94M9j43J52k13
7736i7J83K76l03Q0j26j52L76L2l16l4L21m05J43j1r7K42l49K82j74j5P7J3J7
7759c7K31Lk67L15l4l00J44m8k35M32q9k73L73l43J33J29q1j09J69k9m9o9j90
7782b24J61L98l15J77J13n57L98P3l59K55j5k89K58q8j91L99r6j69K39k31n8j4
7804a35n6o0M52k36l33N23k14n8K50j84K05j94j18J54Q5j00P7k81J83J1J89m56
$$ plain form
7826 -296 182 -134 68 -34 -229 23 -84 -72 -141 -121 43 230 131 -75 188 106 135 60 -82 88 -13 -174
7848 -174 -171 -117 -46 80 -81 -76 181 154 -239 -41 171 24 150 184 63 139 44 -75 326 -317 61 173 -126
7871 -126 31 64 -157 61 255 -221 23 142 90 37 243 -99 -143 72 -273 -215 32 -145 228 176 -207 98
7893 98 30 52 50 21 -32 38 193 23 -164 157 232 211 -362 -181 177 -101 84 190 106 -49 174 -148 281 -8
7917 -8 -370 -128 -258 -295 -83 223 -285 -6 -73 -55 57 41 164 -71 46 -297 0 -79 226 -14 -213 94
7939 94 -95 -21 -46 -111 -86 87 -71 -168 410 115 184 390 -81 -92 -128 145 -61 326 38 76 -97 -140 231 -114
7963 -114 -218 -68 -33 -120 -193 -33 -236 -177 -8 -80 80 -12 162 161 -192 -14 117 -103 1 -48 -190 -90 -90 -140
7987 -140 128 -161 -44 38 77 -283 142 -29 -201 120 -111 125 52 -85 -122 107 -14 -38 149 -204 15 144
$$ packed form
7826b96M78l16K02j02j95K52j07J2o9K0J64J87r9k06K63q2K9p5j42J70j01j61
7848a74LN4P1J26j61NK57k7l93J98K12j47J26L4j21P6r5j19M01o43L78J12k99
7871a26J57L3k21K18J94m76K44J19n2n3K06l42m4K15l45N8K47j77L73n2l83L05
7893I8o8K2kk9n3P0J55j70j87L21P5k1n73J81L58k78J85J06q4j55K23l22M29k89
7917hl62K42j30l7K12L06n08K79o7J8J12j6J23k35J17l43K97p9L05k40j99L07
7939I4j89P4k5o5K5J73j58r7N78k95O9K06m71j1l6K73k06L87k88L8j73m3L71l45
7963a14j04J50L5q7p3J60k03N9J69p2J60r2J74jl53J78J31k20J04m9j42J00%n0
7987a40K68k89J17Q2L9l60M25j71j72L21k31K36p3j37l7K29j21k4J87l53K19J29
$$ plain form
8009 144 -258 71 167 -55 -40 -328 198 -19 -407 -228 5 56 -42 117 -50 -40 52 182 -2 157 -74 37
8031 37 -183 -431 -212 -20 175 146 212 94 101 -216 34 -43 -192 -309 -35 3 176 -22 -172 56 45 -96 34
8054 34 165 44 -13 15 -23 85 -67 -150 391 -137 -285 -2 175 -87 224 -71 -80 76 168 282 -78 -35 171
8077 171 -5 -86 -7 -10 -108 363 -152 -146 159 -32 1 -193 -31 120 279 148 169 -142 -138 -110 -179 -146 -42 209 -78
8102 -78 86 231 -155 90 -70 127 -34 176 54 -161 -363 -5 -121 -256 219 -38 -105 -32 21 98 -82 -107
8124 -107 74 -13 -73 115 102 -65 51 25 54 -218 126 -18 -164 238 5 256 -16 -178 68 66 -33 -46 -47 74
8148 74 -12 -29 -206 -3 2 -17 64 67 -6 117 8 -45 -33 -242 63 50 122 -148 63 -86 176 161 -245 -113 -231
8173 -231 -90 45 230 44 -58 26 111 264 94 -289 -46 -251 -236 -53 -32 34 177 29
$$ packed form
8009A44m02L29R6k22J5k88N26k17l88J79K33N1r8J59j67J0R2J30j84J59k31J11
8031C7k20k48K19J92J95k9O6j18Pl17K50p7j49j17K74L8J73j98j50K28j1j41J30
8054C4J31j21n7K8l8J08j52q3N41n28j48K83J77k62L11k95rJ56R2J14l60M3K06
8077A71j76q1P9lr8M71n15OL05j91L3j94J62J51J59j31K1l11MK8o9L3J04K51k87
8102g8J64J45l86K45j60J97j61K10j22k15k02L58j16j35M75k57o7P3N3P7j80k5
8124a07J81q7o0J88j3j67J16k6K9k72L44j44j46M02k33K51k72j62K46kr9j3jJ21
8148G4q6j7j77K03Nj9Q1Lp3J23j09n3J2k09L05j3P2k70K11j49K62j5m06J32j18
8173b31J41J35J85j86j02Q4Q5J53j70l83K43k05J5J83K1O6J43j48
8191B9
$$ Imaginary data points
##PAGE= N=2
##DATA TABLE= (X++(I..I)), XYDATA
$$ plain form
0 0 0 0 0 0 0 0 0 0 0 0 0 0 0 0 8 -8 8 -8 8 -16 16 -16 21 -24 29 -32 40 -42 50 -58 66 -74 86 -98 109 -122
36 -122 138 -154 170 -192 215 -236 263 -290 321 -354 393 -433 475 -523 577 -635 700 -773 855
55 855 -949 1055 -1175 1320 -1489 1693 -1946 2271 -2697 3291 -4177 5628 -8419 15719 -75343
70 -75343 -149377 24644 -1888 -49341 8704 27052 -15997 -33345 -961 75757 28302 -3257
82 -3257 98414 56056 -61460 27780 69578 -7865 17947 56262 9944 -43439 -65312 -8377
94 -8377 -2730 -76890 -22200 8700 -128507 -128615 -34830 -80061 -98434 -44066 -57121 -101109 -131930
107 -131930 -93822 -29660 -76459 -74980 13121 -57679 -123875 -21446 1571 -39560 6294 27475
119 27475 -1640 -33385 -30790 39808 36869 -16336 50596 52070 -57944 -20758 43726 -5819
$$ packed form
0@%%%%%%%%%%%%%%Qj6J6j6J6k4L2l2L7m5N3o1P2q2R2j08J24j40J60j84K07k31
36a22K60k92L24l62M07m51M99n53O11o75P47q26R08r98J100j212J335j473J628
55H55j804K004k230K495k809L182l639M217m968N988p468R805j4047K4138r1062
70g5343p4034J74021k6532m7453N8045J8348m3049j7348L2384P6718m7455l1559
82c257J01671m2358j17516Q9240M1798p7443K5812L8315m6318n3383k1873N6935
94h377N647p4160N4690L0900j37207j08R3785m5231j8373N4368j3055m3988l0821
107a31930L8108O4162m6799J479Q8101p0800o6196J02429K3017m1131M5854K1181
119B7475k9115l1745K595P0598k939n3205O6932J474j10014L7186O4484m9545
$$ plain form
131 -5819 -7046 19753 -3754 -38126 -69005 -31917 4934 -58957 -50027 4528 -79725 -112482 -31351
144 -31351 -42771 -71632 -39883 -39817 -56238 -80803 -73129 -9057 -28601 -63688 5765 -8896 -78798
157 -78798 -20661 17009 -17457 -677 14720 5381 -7657 -27290 16215 39012 -17514 8544
169 8544 43659 -30800 -31805 24561 -1700 -15495 176 -9809 -17751 -44936 -38619 7091 -30604
182 -30604 -54097 1322 -32593 -77234 -23831 -18133 -44246 -27192 -27186 -27605 -35833 -52095 -7890 -1078
196 -1078 -47350 -7771 10710 -45510 -21638 13829 -12305 -6252 2115 -3350 3385 -19382 -7469
209 -7469 28643 -11417 -15830 28435 -10226 -27720 14350 245 -11624 1480 -9644 -2697 -10898
222 -10898 -27720 8892 314 -34877 3715 2709 -36924 -7657 2141 -19451 -5924 -10161 -11850
$$ packed form
131e819j227K6799k3507l4372l0879L7088L6851o3891Q930N4555q4253l2757Q1131
144c1351j1420k8861L1749O6j6421k4565P674O4072j9544l5087O9453j4661o9902
157g8798N8137L7670l4466J6780J5397r339j3038j9633M3505K2797n6526K6058
169H544L5115p4459j005N6366k6261j3795J5671r985p942k7185O317M5710l7695
182c0604k3493N5419l3915m4641N3403N698k6113J7054Om19q228j6262M4205O812
196a078m6272L9579J8481n6220K3872L5467k6134O053Q367n465O735k2767J1913
209g469L6112m0060m413M4265l8661j7494M2070j4105j1869J3104j1124O947q201
222a0898j6822L6612q578l5191L8592j006l9633K9267R798k1592J3527m237j689
$$ plain form
235 -11850 -1121 -24441 -9698 13610 -23590 -13903 15614 -20675 -17196 9582 -11307 -7229 26
248 26 -12749 2551 -7493 -19688 12805 -3355 -23852 12016 -816 -22107 6813 -890 -11405
261 -11405 5107 -8511 -3032 7409 -16420 1277 13792 -18131 708 14304 -15933 291
273 291 10216 -10179 4776 2109 -9124 10714 -4252 -10695 15895 -5385 -12866 15014 -5528
286 -5528 -10206 11263 -7093 -4155 8266 -10998 1443 6965 -14943 5281 7379 -15995 6728
299 6728 6599 -13682 7551 3282 -9727 9946 -1847 -6933 12733 -5929 -5413 14467 -7721
312 -7721 -3817 13727 -8930 -732 10847 -10265 2957 7673 -11416 6537 4672 -12472 9278
325 9278 1937 -11998 10611 -512 -9847 11227 -3598 -6887 11510 -6934 -3660 12009 -9414
$$ packed form
235a1850J0729k3320J4743K3308l7200R687K9517l6289L479K6778k0889M078P255
248B6j2775J5300j0044j2195L2493j6160k0497L5868j2832k1291K8920p703j0515
261a1405J6512j3618N479J0441k3829J7697J2515l1923J8839J3596l0237J6224
273B91R925k0395J4955k667j1233J9838j4966o443K6590k1280p481K7880k0542
286e528m678K1469j8356K938J2421j9264J2441N522k1908K0224K098k3374K2723
299F728j29k0281K1233m269j3009J9673j1793n086J9666j8662N16J9880k2188
312g721L904J7544k2657Q198J1579k1112J3222M716j9089J7953j865j7144K1750
325I278p341j3935K2609j1123r335K1074j4825l289J8397j8444L274J5669k1423
$$ plain form
338 -9414 -979 11121 -10826 2075 8903 -11357 4862 6547 -11537 7538 3416 -10764 9786
351 9786 -8 -9522 11579 -2467 -6872 12812 -4549 -4046 12782 -5861 -262 12401 -6659
364 -6659 3914 11983 -7263 7689 10730 -7327 10628 8146 -6950 12003 5241 -6580 12173
377 12173 553 -5791 11343 -4860 -5968 9808 -9363 -6420 7057 -13284 -6083 3552 -15417
390 -15417 -4055 6 -16932 -1013 -2449 -16970 2858 -2669 -14969 6219 -1833 -10578 9453
403 9453 -1061 -2877 12709 -1524 3617 16211 -2169 8521 19486 -1195 10208 19075 -388
416 -388 11231 14622 49 13121 7184 -2590 12745 267 -7237 12234 -3743 -11746 6926
429 6926 -8462 -13068 878 -11103 -8938 -3637 -17769 -5613 -3205 -21154 -1258 2062 -18858
$$ packed form
338i414Q435J2100k1947J2901O828k0260J6219J685j8084J9075m122j4180K0550
351I786r794r514K1101j4046m405J9684j7361N03J6828j8643N599J2663j9060
364f659J0573Q069j9246J4952L041j8057J7955k482j5096J8953o762j1821J8753
377A2173j1620o344J7134j6203j108J5776j9171K943J3477k0341P201R635j8969
390a5417J1362M061j6938J5919j436j4521J9828n527j2300K1188q052q745K0031
403I453j0514j816J5586j4233N141J2594j8380J0690J0965k0681J1403Q867j9463
416c88J1619L391j4573J3072n937r774J5335j2478p504J9471j5977q003J8672
429F926j5388m606J3946j1981K165N301j4132J2156K408j7949J9896L320k0920
$$ plain form
442 -18858 -1325 2936 -12438 1779 3541 -1562 9615 -571 1713 16422 -1333 4695 24964
455 24964 2760 2522 20222 3988 3897 14944 6113 10915 5925 -4212 11479 1477 -11952 13086
469 13086 4048 -17105 1960 -2205 -15924 -3143 -4568 -5305 -3172 -17217 -5983 1381 -19442
482 -19442 -1449 13741 -13398 -6672 9336 -6263 -1133 9333 7798 12354 595 967 19785
495 19785 2509 1089 30343 12270 -4535 16402 9864 -51 11215 11894 13087 3938 -9320
508 -9320 8967 4366 -15732 10974 14245 -18093 -7976 2193 -13514 -8242 -705 1198 -1493
521 -1493 -19659 -9313 5517 -17506 -6607 21286 -5661 -15573 6559 -854 -4657 7890 12324
534 12324 15025 -1336 -6339 18477 6890 -5051 29344 22961 -8619 6922 13930 1592 8387
$$ packed form
442a8858J7533M261j5374J4217J762n103J1177j0186K284J4709j7755O028K0269
455B4964k2204k38J7700j6234r1J1047q831M802m990j0137J5691j0002j3429K5038
469A3086r038k1153J9065m165j3719J2781j425p37K133j4045J1234P364k0823
482a9442J7993J5190k7139O726J6008j5599N130J0466j535M556j1759L72J8818
495A9785j7276j420K9254j8073j6805K0937o538r915J1266O79J193r149j3258
508i320J8287m601k0098K6706L271l2338J0117J0169j5707N272P537J903k691
521a493j8166J0346J4830k3023J0899K7893k6947r912K2132p413l803J2547M434
534A2324K701j6361n003K4816j1587j1941L4395o383l1580J5541P008j2338O795
$$ plain form
547 8387 15239 19081 7761 -12624 6199 13587 -12213 8493 27261 -8383 -13830 5282 -4023
560 -4023 -6292 3360 9422 6536 -18206 -13985 10898 -9361 -11832 23365 5436 -21716 -2161
573 -2161 2732 -5921 1663 10685 15519 -3239 -17270 10104 9878 -11379 18028 27541 -9766 -6855
587 -6855 10526 2931 3243 11607 19696 10780 -15121 -1382 19421 -5608 1395 31045 3528 -16747
601 -16747 2677 4016 -1377 3890 11562 13508 -11809 -18707 11813 1962 -14229 18873 15372 -19610
615 -19610 -9871 4146 -2144 -428 6354 15175 837 -21674 2001 15469 -10083 6279 28375
628 28375 -3693 -13677 6497 6560 3359 7041 16074 15252 -11866 -8468 20360 2598 -5618 25046
642 25046 11574 -16244 -2872 6297 1585 953 5272 13101 -5687 -22561 4717 8516 -15413
$$ packed form
547H387O852L842j1320k0385J8823P388k5800K0706J8768l5644n447J9112r305
560d023k269R652O062k886k4742M221K4883k0259k471L5197j7929k7152J9555
573b161M893q653P584R022M834j8758j4031K7374k26k1257K9407R513l7307K911
587f855J7381p595L12Q364Q089q916k5901J3739K0803k5029P003K9650k7517k0275
601a6747J9424J339n393N267P672J946k5317o898L0520r851j6191L3102l501l4982
615a9610R739J4017o290J716O782Q821j4338k2511K3675J3468k5552J6362K2096
628B8375l2068r984K0174O3l201L682R033q22k7118L398K8828j7762q216L0664
642B5046j3472k7818J3372R169m712o32M319P829j8788j6874K7278L799k3929
$$ plain form
655 -15413 5658 16119 -14714 -15771 274 -595 -2135 -1006 8023 5527 -19638 -7328 17015
668 17015 -4451 -3692 22462 3761 -12819 2776 8486 7060 5291 9349 18000 -1922 -11555 17748
682 17748 12535 -6644 16194 17079 -8953 -3843 6922 5047 2235 -614 9507 2968 -19713 -1793
696 -1793 12950 -12113 -5186 12922 -7787 -16037 -2690 -486 -1375 -5939 -782 7079 -13109 -13910
710 -13910 12785 560 -11364 11589 6798 -10365 -760 5804 5829 2736 521 12938 4938 -11847
724 -11847 9413 15176 -6710 4825 15710 -3193 -3643 4602 4585 3783 -2991 3262 8987 -11108
738 -11108 -6366 13593 -4726 -9508 9363 -601 -10087 -1249 263 1083 -3448 -4928 7638 -2285
752 -2285 -13080 8586 5746 -10991 4705 8071 -5850 -101 3461 3260 3587 -3202 5581 8655
$$ packed form
655a5413K1071J0461l0833j057J6045q69j540J129R029k496k5165J2310K4343
668A7015k1466P59K6154j8701j6580J5595N710j426j769M058Q651j9922r633K9303
682A7748n213j9179K2838Q85k6032N110J0765j875k812k849J0121o539k2681J7920
696a793J4743k5063O927J8108k0709q250J3347K204q89m564N157P861k0188q01
710a3910K6695j2225j1924K2953m791j7163R605O564K5l093k215J2417q000j6785
724a1847K1260N763k1886J1535J0885j8903m50Q245j7q02o774O253N725k0095
738a1108M742J9959j8319m782J8871r964r486Q838J512Q20m531j480J2566r923
752b285j0795K1666k840j6737J5696L366j3921N749L562k01L27o789Q783L074
$$ plain form
766 8655 -8575 1215 13096 -5395 -2282 10489 -1234 -3110 2476 571 2864 -2892 -3459 7812
780 7812 -3993 -8998 8525 -535 -10261 4209 564 -6195 222 -1919 -274 270 -6802 3463
794 3463 3793 -9628 2966 7106 -7493 939 6621 -3148 1048 2782 219 4868 -1748 74 9744
809 9744 -2776 -2279 10467 -1123 -3091 7778 202 -1032 4105 -1435 2709 1340 -5072 5243
823 5243 1959 -7598 4804 2394 -7706 2294 1432 -5195 1601 -2100 -2587 2766 -5663 -1989 5055
838 5055 -6844 -2226 5092 -6040 -2097 3974 -4320 178 1974 -3815 3171 270 -4480 5735
852 5735 -4 -5023 6175 399 -4356 5529 -360 -1808 4806 -2487 87 4759 -4173 1328 4892
867 4892 -5199 1698 4275 -5266 2192 2831 -4300 3092 796 -3778 4604 -1148 -3471 5637 -1965
$$ packed form
766H655j7230R790J1881j8491L113J2771j1723j876N586j905K293n756n67J1271
780G812j1805n005J7523r060r726J4470l645o759O417k141J645N44p072J0265
794C463L30j3421J2594M140j4599Q432N682r769M196J734k563M649o616J822R670
809I744j2520M97J2746j1590j968J0869p576j234N137n540M144j369o412J0315
823E243l284r557J2402k410j0100J0000q62o627O796l701m87N353q429L674P044
838E055j1899M618P318j1132L943O071q294M498J796n789O986k901m750J0215
852E735n739n019J1198n776m755R885n889j448O614p293K574M672q932N501L564
867D892j0091O897K577r541P458O39p131P392k296m574Q382n752k323R108p602
$$ plain form
882 -1965 -3170 5636 -3127 -1852 4687 -3698 -161 3934 -4558 938 2949 -5310 2209 1964 -5620
897 -5620 2873 889 -5576 3324 -944 -4978 3108 -2706 -4036 3657 -3932 -3251 3547 -4971 -1816
912 -1816 3191 -5561 -406 2642 -5354 1093 2161 -4849 2701 1443 -4155 4348 658 -3200 5164
927 5164 -118 -2372 5791 -1080 -843 5595 -2032 375 5130 -3152 1177 4252 -3996 1677 3046
942 3046 -4824 2411 1551 -5099 2887 -389 -5106 3197 -2095 -4497 3843 -3336 -3808 3937 -3793 -2511
958 -2511 3400 -4187 -672 3058 -4218 1667 3043 -4322 3481 2929 -4315 4413 2711 -2905 4775
973 4775 1528 -2082 4856 -613 -780 5303 -2957 -705 5223 -4192 -1107 4662 -4007 -894 2146
988 2146 -4278 280 2 -4218 3029 -650 -5337 3911 -849 -5095 4838 997 -2977 4278 72
$$ packed form
882a965j205Q806q763J275O539q385L537M095q492N496K011q259P519k45p584
897e620Q493j984o465Q900m268m034Q086n814j330P693p589O81O798q518L155
912a816N007q752N155L048p996O447J068p010P550j258n598Q503l690l858Q364
927E164n282k254Q163o871K37O438p627K407M755q282M329L075q248N673J369
942C046p870P235q60o650P986l276m717Q303n292k402Q340p179m72P745p730J282
958b511N911p587L515L730p276N885J376p365P803n52p244Q728j702n616P680
973D775l247l610O938n469j67O083q260K252N928r415L085N769q669L113L040
988B146o424M558k78m220P247l679m687R248m760m246R933l841l974P255m206
$$ plain form
1003 72 -367 4390 -684 3637 6231 -2815 4256 6975 -3385 4271 8549 -786 3903 4483 -502 4325
1019 4325 1369 968 7474 -1259 -2618 6786 -2853 -4035 6301 -806 -3340 1670 -3119 -1627 -439
1034 -439 -3886 3368 559 -7865 2618 1433 -7630 3102 4728 -3136 1472 1287 -693 3232 449
1049 449 4734 8621 -2435 1834 9279 -1544 2039 11910 3351 1889 5116 1842 4168 2636 2820
1064 2820 10173 1306 -4426 7312 1350 -5011 7171 5421 -2828 822 -573 -479 733 -2165 5900
1079 5900 4599 -7865 1005 5273 -6584 1270 8954 -137 -739 1245 504 3228 42 4672 11219
1094 11219 -2077 -2758 9399 471 -1670 11487 6770 -229 2302 1519 3468 2090 1151 10605 3379
1109 3379 -7726 4585 4591 -5880 4558 9064 -1378 -1757 -1091 502 1489 -2371 5507 7992 -7562
$$ packed form
1003G2m39M757n074M321K594r046P071K719j0360P656M278r335M689N80m985M827
1019D325k956m01O506q733j359R404r639j182J0336p107k534N010m789J492J188
1034d39l447P254k809q424J0483j185r063J0732J626p864M608j85j980L925k783
1049D49M285L887j1056M269P445j0823L583R871q559j462L227l274K326j532J84
1064B820P353q867n732J1738n962o361J2182j750q249L650j395R4J212k898Q065
1079E900j301j2464Q870M268j1857P854P684r091o02J984p41K724l186M630O547
1094A1219j3296o81J2157q928k141J3157m717o999K531p83J949j378r39R454p226
1109C379j1105J2311Oj0471J0438M506j0442l79O66J593R87l860P878K485j5554
$$ plain form
1124 -7562 -2870 7657 -3711 -1311 10721 3792 -1656 339 1538 4551 776 3469 13319 1026
1138 1026 -6073 8788 4588 -3002 9390 10245 368 274 1138 4988 3394 -450 10111 7190 -8399
1153 -8399 555 7515 -4292 867 9589 729 -3430 -2563 450 2927 -3389 2086 9462 -5859 -7721
1168 -7721 7010 -749 -4998 7249 5249 -2293 -2336 -393 4782 712 -942 10559 4022 -8533
1182 -8533 4505 7794 -3630 4357 10065 1928 -964 116 4796 4992 -1782 6015 10303 -6295
1196 -6295 -2704 9332 -413 -1904 7902 3547 -2109 -2382 1077 5174 -2305 -1474 9598 -1218 -9402
1211 -9402 5400 3531 -5715 2913 5418 -1141 -2765 -1841 4144 2043 -4656 6197 6784 -8498 -140
1226 -140 8225 -2876 -870 6710 2124 -1528 -1644 2224 5345 -3234 191 9586 -3132 -5941 7525
$$ packed form
1124g562M692J0527j1368K400J2032o929n448J995J199L013l775K693R850j2293
1138A026p099J4861m200p590J2392Q55r877r4Q64L850j594l844J0561k921j5589
1153h399Q954O960j1807N159Q722q860m159Q67L013K477o316N475P376j5321j862
1168g721J4731p759m249J2247k000p542m3J943N175m070j654J1501o537j2555
1182h533J3038L289j1424P987N708q137k892J080M680J96o774P797M288j6598
1196f295L591J2036r745j491R806m355n656k73L459M097p479Q31J1072j0816q184
1211i402J4802j869r246Q628K505o559j624R24N985k101o699J0853N87j5282Q358
1226a40Q365j1101K006P580m586l652j16L868L121q579L425R395j2718k809J3466
$$ plain form
1241 7525 2004 -4643 3833 3591 -745 -2235 -812 4828 -284 -5301 6626 2923 -8807 2469
1255 2469 5872 -4358 -307 4235 515 -1031 -1621 3413 4090 -4789 1831 7982 -4956 -2573 8385
1270 8385 -233 -3304 4088 2593 314 -1208 420 5875 -1643 -3770 7701 1194 -6584 5186
1284 5186 3684 -4805 894 2404 74 -795 -2317 3010 1457 -6584 1923 4800 -6616 -786 5538
1299 5538 -3691 -2672 1809 -191 -63 -1923 196 3857 -4443 -3225 6429 -1628 -4543 5374 620
1314 620 -3746 1539 1252 720 63 -1190 4218 610 -5018 4452 3870 -4580 2727 4593 -3180 -20
1330 -20 1989 877 1868 -1386 1373 3568 -4602 -777 5963 -3168 -1963 4639 -1854 -2363 1320 -1038
1346 -1038 964 -631 -2377 2935 -1629 -5047 3862 638 -4720 2500 340 -3844 307 -598 -391
$$ packed form
1241G525n521o647Q476k42m336j490J423N640n112n017J1927l703j1730J1276
1255B469L403j0230M051M542l720j546n90N034O77q879O620O151j2938K383J0958
1270H385q618l071P392j495k279j522J628N455p518k127J1471o507p778J1770
1284E186j502q489N699J510k330q69j522N327j553q041Q507K877j1416N830O324
1299E538r229J019M481k000J28j860K119L661q300J218R654q057k915R917m754
1314F20m366N285k87n32o57j253N408l608n628R470n82q450P307J866p773L160
1330b0K009j112R91l254K759K195q170L825O740r131J205O602o493n09L683k358
1346a038K002j595j746N312m564l418Q909l224n358P220k160m184M151r05K07
$$ plain form
1361 -391 1319 -2841 591 2102 -4984 569 3816 -3743 113 3190 -2695 -398 1227 -1194 2282
1376 2282 -499 -1477 3677 -1846 -2899 4640 -765 -2698 3382 -543 -1627 2017 -1409 726 1632
1391 1632 -2584 1903 1208 -4175 1910 2246 -3692 1308 1355 -2822 1086 -372 -1472 1939 -1796 -1270
1407 -1270 2745 -2974 -1607 3196 -2626 -1358 2262 -2288 -640 1140 -2803 1109 290 -3372 1385
1422 1385 -82 -3806 1891 -153 -3196 2000 -1076 -2230 1664 -1983 -1252 1699 -2873 -828 1796
1437 1796 -3489 -548 1681 -3421 -7 1121 -3361 348 256 -2972 1660 -820 -2632 1935 -1281
1452 -1281 -2468 2140 -1686 -2120 2037 -2141 -1159 1897 -2702 -556 1735 -3100 700 1283 -2858 906
1468 906 800 -2973 1594 95 -2749 1906 -839 -2365 1791 -1506 -2172 1753 -2636 -1979 1642 -3212
$$ packed form
1361c91J710m160L432J511p086N553L247p559L856L077n885K297J625k421L476
1376B282k781r78N154n523j053P539n405j933O080l925j084L644l426K135R06
1391A632m216M487o95n383O085L36n938N000M7m177L908j458j100L411l735N26
1407a270M015n719J367M803n822J268L620m550J648J780l943L912q19l662M757
1422A385j467l724N697k044l043N196l076j154L894l647P31K951m572K045K624
1437A796n285K941K229n102L414J128m482L709r2l228M632k480j812M567l216
1452a281j187M608l826m34M157m178R82L056m599K146K291m835L800N83m141L764
1468I06j06l773M567j499k844M655k745j526M156l297o66L925m389O57L621m854
$$ plain form
1484 -3212 -1465 1058 -3642 -604 503 -4271 -428 -447 -4174 133 -1154 -3951 428 -1593 -3615
1499 -3615 821 -2279 -3243 1175 -2776 -2165 1749 -2798 -1433 1766 -3010 -423 1061 -2962 573
1514 573 952 -2855 1298 638 -2461 1816 -177 -2244 2186 -1051 -2084 1966 -1436 -2002 1800 -2112
1530 -2112 -1287 1016 -2934 -1116 510 -3786 -207 513 -4411 -258 -533 -4229 -256 -1108 -3826 0
1546 0 -2060 -3044 800 -2807 -2156 1692 -2912 -2234 1511 -3022 -1433 1227 -2287 -294 616 -2534 590
1563 590 -352 -2924 1885 24 -3455 1714 -495 -3217 1288 -999 -1835 570 -2259 -1332 643 -3512
1579 -3512 -581 1333 -4413 -1165 1030 -3721 -960 390 -2263 -101 -1448 -2714 959 -2079 -2135
1594 -2135 2904 -1416 -3039 2239 -1149 -2482 1518 -164 -179 292 -2030 633 233 -3075 2068 1978
$$ packed form
1484c212J747K523m700L038J107m774L843j9l727M307j287k797M379k021k022
1499c615M436l100r64M418l951O11L914m547J365L199m776K587J484m023L535
1514E73L79l807M153o60l099M277j993k067M430l237j033M050l402n66L802l912
1530b112Q25K303l950J818J626m296L579P20m924M153k75l696L973q52k718L826
1546@k060r84L844l607O51L848m604O78L745m533J589K660l514J993R10l150L124
1563E90r42k572M809j861l479N169k209k722M505k287q36K405k829R27J975m155
1579c512K931J914n746L248K195m751K761J350k653K162j347j266L673l038n6
1594b135N039m320j623N278l388j333M000j682j5M71k322K663m00l308N143r0
$$ plain form
1610 1978 -4017 487 1074 -3302 -310 560 -1104 113 -2481 -1766 877 -3915 -1474 2823 -3480 -3236
1626 -3236 1190 -2951 -2899 539 -1077 -601 -1684 -2797 888 -1786 -3500 3376 609 -4517 1287 632
1642 632 -2498 967 1413 883 708 -2014 926 2038 -3025 2076 4686 -2831 -817 3168 -1452 -652
1658 -652 1812 772 469 -2106 -1498 2117 -2355 -2019 4425 -1138 -4537 1078 -673 -2906 -70 293
1674 293 -59 -1750 -3674 1103 -216 -4226 1994 2328 -4636 -1036 1604 -2390 -774 1335 1183 249
1690 249 -3000 228 3059 -2754 -93 5314 -1414 -2782 2952 71 -1711 1188 1752 1434 -1757 -1978
1706 -1978 3169 -585 -3075 3936 1459 -4631 540 1644 -2203 -729 1052 1044 -601 -3688 1019 2225
1722 2225 -4030 796 4613 -3314 -1935 2939 -432 -1065 814 1515 1641 -2346 -355 4167 -1562 -2147
$$ packed form
1610A978n995M504N87m376K992Q70j664J217k594P15K643m792K441M297o303K44
1626c236M426m141N2L438j616M76j083j113L685k674j714O876k767n126N804o55
1642F32l130L465M46n30j75k722K940J112n063N101K610p517K014L985m620Q00
1658f52K464j040l03k575O08L615m472L36O444n563l399N615j751k233K836L63
1674B93l52j691j924M777j319m010O220L34o964L600K640l994J616K109j52r34
1690B49l249L228K831n813K661N407o728j368N734k881j782K899N64l18l191k21
1706a978N147l754k490P011k477o090N171J104l847J474J781qj645l087M707J206
1722B225o255M826L817p927J379M874l371o33J879P01J26l987J991M522n729n85
$$ plain form
1738 -2147 5142 509 -3768 2289 1853 -1705 190 1035 1948 -1082 -2576 2721 810 -4537 1753 3342
1754 3342 -4209 -862 2414 -1226 -2052 -506 977 -49 -3307 468 3436 -3790 -2073 4426 -1632
1769 -1632 -3012 2763 879 -1308 -169 954 2183 -1034 -1183 4402 207 -3530 3692 3032 -2823
1784 -2823 1543 3239 -306 -240 700 2392 953 -2269 2851 3029 -3851 -172 3851 -2097 -1494 2619
1800 2619 27 -1557 -1072 258 1419 -2375 -849 3597 -2325 -4001 2754 99 -3248 1600 1383
1815 1383 -1258 -1686 -545 1807 -147 -2479 3224 1355 -4569 840 3191 -2235 199 2786 55
1830 55 -657 -629 1384 1963 -1516 1061 3987 -2555 -1727 3960 -172 -1249 2605 1021 -902 -999 -299
1847 -299 2291 -190 -1404 3209 74 -4449 1543 1793 -2158 676 1235 -736 -1211 -1340 1251 1616
$$ packed form
1738b147P289m633m277O057m36l558J895Q45R13l030j494N297j911n347O290J589
1754C342p551L347L276l640q26J546J483j026l258L775K968p226J717O499o058
1769a632j380N775j884k187J139J123J229l217j49N585m195l737P222o60n855
1784b823M366J696l545O6R40J692j439l222N120J78o880L679M023n948O03M113
1800B619k592j584M85J330J161l794J526M446n922j676O755k655l347M848k17
1815A383k641m28J141K352j954k332N703j869n924N409K351n426K434K587k731
1830E5p12K8K013N79l479K577K926o542Q28N687m132j077L854j584j923r7P00
1847b99K590k481j214M613l135m523N992K50l951K834N59j971m75j29K591L65
$$ plain form
1863 1616 -2100 1356 2327 -3612 -920 3022 -1006 -374 2139 -153 -434 -1039 148 2467 -638 -731
1879 -731 3267 -1053 -2811 2587 823 -1606 1455 264 -831 -631 -1649 1189 834 -2120 1138 688
1895 688 -3894 -242 2038 -1594 109 699 -770 -293 -1399 -80 1996 -1381 -524 2645 -1858 -1282
1911 -1282 2686 107 -251 1609 149 442 80 -478 2537 1178 -1225 2562 901 -2299 1462 1635
1927 1635 -618 1462 642 -469 120 -1209 230 1377 -2004 -412 1515 -2456 -968 1399 -1600
1942 -1600 -732 291 -1659 -300 -971 -1606 1217 -575 -1838 1643 -942 -2375 1555 162 -896 1437
1958 1437 -462 95 572 -1108 1226 1541 -1302 1119 1468 -1937 882 1359 -1083 925 373 -960
1974 -960 1163 -627 -501 1562 -1109 -706 1712 -1438 -1054 1032 -1247 -409 724 -1495 7 288
$$ packed form
1863A616l716L456R71n939K692L942m028O32K513k292k81o05J187K319l105r3
1879g31L998m320j758N398j764k429L061j191j095K00j018K838l55k954L258m50
1895F88m582L652K280l632J703N90j469M77j106J319K076l377Q57L169m503N76
1911a282L968k579l58J860j460K93l62n58L015j359k403L787j661l200L761J73
1927A635k253K080q20j111N89j329J439J147l381J592J927l971J488K367k999
1942a600Q68J023j950J359o71o35K823j792j263L481k585j433L930j393j058K333
1958A437j899N57M77j680K334L15k843K421L49l405K819M77k442K008n52j333
1974i60K123j790J26K063k671M03K418l150L84K086k279Q38J133k219J502K81
$$ plain form
1990 288 -1746 760 387 -1802 987 -72 -1843 1246 -72 -1420 1050 -644 -745 995 -924 -346
2006 -346 1149 -1252 -100 1104 -1865 -178 793 -1823 -193 360 -1766 150 -108 -1894 953 -585
2022 -585 -1630 969 -819 -1547 903 -1239 -1063 933 -1281 -413 531 -1533 263 1175 -1590 318
2038 318 746 -1333 623 258 -1301 883 252 -1337 1086 -664 -997 1330 -752 -791 1669 -1079 -757
2055 -757 767 -1187 -127 1144 -1499 -25 341 -1690 467 -340 -1651 601 -259 -1623 723 -607
2071 -607 -1699 787 -820 -1304 831 -1076 -783 717 -1733 -648 742 -1733 -303 263 -2037 31
2087 31 -196 -1718 623 -356 -1641 516 -856 -1603 1036 -840 -1175 803 -1234 -852 992 -1248 37
2104 37 1025 -1296 639 918 -1595 587 759 -1635 806 354 -1172 1049 -214 -914 1184 -1013 -1431
$$ packed form
1990B88k034K506l73k189K789j059j771L089j318j348K470j694j01J740j919N78
2006c46J495k401J152J204k969J687R71k616J630N53k126J916k58j786K847j538
2022e85j045K599j788p28K450k142J76J996k214Q68R44k064J796R12k765J908
2038C18M28k079J956l65j559K184o31j589K423j750l33K327k082l9K460k748L22
2055g57J524j954J060J271k643J474L66k031K157q07j311K252q60j364K346j330
2071f07j092K486j607m84K135j907K93J500k450J085J390k475J430N66k300K068
2087C1k27j522K341r79j285K157j372p47K639j876l35J978k037L82J844k240J285
2104C7R88k321J935K79k513K182J72k394K441m52j526K221j263p00K098k197m18
$$ plain form
2121 -1431 1165 -1650 -1251 855 -1685 -1069 374 -1650 -727 -489 -1692 -380 -411 -2290 255 -559 -2463
2138 -2463 726 -520 -1828 564 -618 -1009 335 -757 -119 1268 -1650 -344 1212 -1568 -79
2153 -79 1548 -1145 -448 657 -1563 -129 -107 -867 827 -520 -1726 1030 -1083 -2289 1083 -674
2169 -674 -1613 123 -1175 -1318 -158 -1232 186 270 -2406 263 527 -2173 439 863 -1244 57 292
2186 292 -680 261 -320 -204 1386 -992 -770 1675 -1133 -1220 1788 -771 -1278 129 -534 -700 -619 -1296
2204 -1296 414 -830 -2463 697 -436 -3024 189 384 -2511 -631 -522 -1117 -452 -1127 -189 784 -2154
2221 -2154 -378 1505 -2044 -830 1582 -976 -441 672 -308 469 -408 -193 1598 -826 -1297 2220
2237 2220 -524 -2012 1638 566 -1379 516 41 -371 -78 -1251 994 157 -2145 507 1054 -2772
$$ packed form
2121a431K596k815L99K106k540O16J443k024R23K38j203J312l1j879K545q14j904
2138b463L189j246j308K392j182l91J344j092O38J387k918J306J556k780J489
2153g9J627k693O97J105k220J434K2p60J694j347j206K756k113j206L372j757
2169f74r39J736j298j43J160j074J418Q4k676K669K64k700K612M24k107J301K35
2186B92r72R41n81J16J590k378K22K445k808q7L008k559n07J407o63j66Q1o77
2204a296J710j244j633L160j133k588L213J95k895J880J09n95O65o75R38R73k938
2221b154J776J883l549J214K412k558N35J113r80P77q77K15J791k424m71L517
2237B220k744j488L650j072j945J895m75m12K93j173K245q37k302K652N47l826
$$ plain form
2253 -2772 -440 1377 -1503 -882 90 -49 -120 -1416 -411 1149 -1988 -1083 2159 -1401 -1611 1751 -328
2270 -328 -1146 251 49 -21 -832 -1240 1102 -389 -2082 1619 586 -2541 484 845 -1510 -211 613
2287 613 104 -229 -1748 207 1315 -2159 91 2302 -1872 -1264 1641 -367 -713 788 435 443 -830
2304 -830 -674 1770 -748 -1093 2763 153 -2167 908 165 -1344 506 681 430 -427 -1604 677 670
2321 670 -2029 1061 1741 -2372 -652 1377 -569 -211 776 456 333 -1530 -354 1897 -1225 -492 2773
2338 2773 -837 -2023 1037 349 -473 807 468 689 -938 -1685 1434 86 -1658 1930 1248 -2697
2354 -2697 -585 794 -869 141 301 596 -100 -1867 435 1492 -1412 614 2510 -1523 -1263 1324
2370 1324 258 -88 1194 910 1010 -1227 -941 2318 40 -718 3004 431 -1861 485 713 -169 833
$$ packed form
2253b772K332J817k880O21R72j39p1j296J005J560l137R05L242l560k10L362k079
2270c28q18J397k02p0q11m08K342j491j693L701j033l127L025L61k355J299Q24
2287F13n09l33j519J955J108l474K250K211m174O08K905k008l46J501l53Qj273
2304h30J56K444k518l45L856k610k320L075p43j509J850J75k51q57j177K281p
2321F70k699L090O80m113J720K029j946L58R87l20j23j863J176K251l122P33L265
2338B773l610j186L060o88q22J280l39K21j627p47L119j348j744L588o82l945
2354b697K112J379j663J010J60K95o96j767K302J057k904K026J896m033K60K587
2370A324j066l46J282k84J00k237K86L259k278p58L722k573k292K346K28q82J002
$$ plain form
2387 833 575 603 -458 -2236 617 1217 -1505 751 1278 -2068 -1076 389 -584 85 160 110 392 -1894
2405 -1894 -957 1660 -302 -805 2078 -352 -1618 909 496 457 1175 421 790 40 -1520 1844 1283
2422 1283 -887 1904 1361 -1780 93 751 8 1109 123 428 473 -1588 53 1945 -973 -19 1724
2439 1724 -1040 -929 711 -6 674 375 -241 472 -1028 -1197 1685 835 -898 1612 239 -1549 523
2456 523 281 407 1178 58 528 401 -1431 877 1554 -1006 790 1358 -837 -74 493 119 890 46
2474 46 -330 867 -1222 -558 1734 -176 -620 1387 -622 -1141 872 -384 192 654 -623 562 176
2491 176 -1461 1129 985 -1083 1212 424 -852 600 398 199 1181 -79 147 1453 -801 169 1719
2508 1719 -367 100 1560 -541 90 784 -255 754 420 -491 643 205 -681 1055 103 -925 1085
$$ packed form
2387H33k58K8j061j778K853O00k722K256N27l346R92J465r73O69P5n0K82k286
2405a894R37K617j962n03K883k430j266K527m13l9P18p54L69p50j560L364n61
2422A283k170K791n43l141J873O58p43J101r86L05M5k061J641J892k918R54J743
2439A724k764J11J640p17O80k99o16P13j500j69K882q50j733K510j373j788K072
2456E23k42J26P71j120M70j27j832K308O77k560J796N68k195P63N67l74P71q44
2474D6l76J197k089O64K292j910m44K007k009n19K013j256N76M62j277J185l86
2491A76j637K590j44k068K295p88j276J452k02j99R82j260K26J306k254R70J550
2508A719k086M67J460k101O31O94j039J009l34r11J134m38q86J736r52j028K010
$$ plain form
2525 1085 -37 -816 904 -505 -192 747 -637 -251 465 -1265 356 752 -1169 161 520 -1191 266
2542 266 565 -513 510 -278 -534 976 -51 -396 1202 56 -300 1187 217 -135 1217 -277 547
2559 547 1052 -341 857 699 -511 1130 1054 -522 1068 486 -584 902 209 -605 1102 -305 -404
2576 -404 636 -675 -322 720 -931 -384 547 -684 177 237 -754 470 292 -804 709 46 -535 998
2594 998 139 -243 1231 -57 -544 919 -79 6 1188 -575 142 936 -388 155 768 -919 489 510
2612 510 -814 434 186 -839 487 -83 -818 677 -340 -690 604 -406 -321 682 -356 42 971
2629 971 -385 103 609 -457 88 754 -392 716 398 -336 887 416 -469 1108 222 -148 787 -25
2647 -25 -134 917 -304 111 809 -585 -19 815 -850 -5 341 -1002 421 67 -939 406 -188 -1216
$$ packed form
2525A085j122p79J720j409L13R39j384L86P16j730J621L96j921J330L59j711J457
2542B66K99j078J023p88k56J510j027l45J598j146l56J487r70l52J352j494Q24
2559E47N05j393J198j58j210J641p6j576J590n82j070J486o93q14J707j407r9
2576d04J040j311L53J042j651N47R31j231Q61O0r91J224j78j096J513o63n81J533
2594I98q59l82J474j288m87J463r98Q5J182j763P17P94j324N43O13j687J408K1
2612E10j324J248k48j025J326n70p35J495j017l50J294j010Q5J003j038L98R29
2629I71j356M88N06j066N45O66j146J108l18p34J223m71q85J577q86l70R35q12
2647b5j09J051j221M15O98j394N66Q34j665Q45L46j343J423l54j006J345n94j028
$$ plain form
2665 -1216 371 -50 -731 494 -497 -559 753 -481 -313 556 -673 -80 835 -974 94 489 -565
2682 -565 449 897 -462 766 249 -550 897 196 -421 970 -147 -306 1154 -339 -284 718 -315
2699 -315 -106 584 -580 438 670 -779 660 433 -884 523 183 -833 313 4 -620 314 -128
2716 -128 -349 314 -587 -337 850 -999 -394 813 -454 -587 781 -921 -141 212 -665 245 140 -657
2734 -657 469 -30 -1067 551 29 -780 419 -421 -328 674 -571 -157 209 -832 242 702 -893
2751 -893 48 616 -687 -222 458 -737 -112 58 -233 465 -611 -929 735 -762 -916 911 -427 -853
2769 -853 275 -475 -91 -25 -420 461 -43 -949 606 445 -1093 574 638 -947 76 151 -429 108 -197
2788 -197 -408 477 -994 -337 816 -1053 -548 715 -705 -768 62 -702 -556 -291 -317 678 -423 -1335 348
$$ packed form
2665a216J587m21o81J225r91o2J312j234J68Q69j229N93R15j809J068L95j054
2682e65J014M48j359J228n17p99J447p01o17J391j117j59J460j493N5J002j033
2699c15K09O90j164J018K32j449J439k27j317J407l40j016J146l09o24R34m42
2716a28k21O63r01K50J187j849O05J207j267j33J368j702P80L53q77R10j05p97
2734f57J126m99j037J618n22q09J199q40R3J002j245M14L66j041J074M60j595
2751h93R41N68j303M65O80j195O25J70k91O98j076l18J664j497j54J827j338m26
2769h53J128p50L84O6l95Q81n04r06J555j61j538J667O4j585J023P5n80N37l05
2788a97k11Q85j471O57J153j869N05J263j420o3Q30p64J46K65k6R95j101r12J683
$$ plain form
2807 348 -325 -1503 520 255 -1141 -124 -182 -452 160 -302 94 288 -1163 -110 595 -1014 167 1037
2825 1037 -287 -241 385 -73 216 -47 -100 902 -589 -630 840 -457 -734 814 62 -935 -219 -550 -490
2844 -490 -72 -763 250 -325 -1684 -116 -6 -1620 343 468 -1162 -526 -412 -626 -29 -355 -128 591
2862 591 -1065 -880 668 -590 -80 1142 -61 -595 -117 -387 383 354 -125 739 -168 -1100 490 230
2880 230 -925 947 609 -979 -508 -188 -188 -162 -26 444 318 -1684 -267 666 -969 -5 1206 -447
2898 -447 -522 -164 -240 460 130 321 978 -1024 -1257 1012 62 -442 883 438 -396 -498 -527 55 365 -92
2918 -92 939 118 -1724 45 505 -828 532 547 -740 -628 -554 -46 385 -34 432 638 -1246 -751 874
2937 874 -330 -340 1111 -18 -558 -284 -528 496 194 163 832 -402 -1069 617 520 -493 949 641
$$ packed form
2807C48o73j178K023k65j396J017n8k70O12m62L96J94j451J053P05j609J181Q70
2825A037j324M6O26m58K89k63n3J002j491m1J470j297k77J548p52r97P16l31O0
2844d90M18o91J013n75j359J568J10j614J963J25j630O36J14k14N97l26K27P19
2862E91j656J85J548j258N10J222j203n34M78k70P70k9m79Q64r07r32J590k60
2880B30j155J872l38j588M71L20%K6J36M70j26k002J417R33j635R64J211j653
2898d47p5L58p6P00l30J91O57k002k33K269r50n04J325m45q34j02k9N82L10m57
2918i2J031q21j842J769M60j333J360J5j287J12P4N08M31m19M66K06j884M95J625
2937H74j204j0J451j129n40K74k44J024l02l1O69j234o67J686r7j013J442l08
$$ plain form
2955 641 -709 -260 6 544 445 -242 779 621 -1381 -99 944 -323 506 949 58 -520 -110 21
2973 21 857 154 194 980 -647 -1113 567 106 -271 1080 -17 -474 -319 -58 442 846 -360 558 132
2992 132 -978 260 744 -105 452 564 -540 -123 5 -31 685 -68 84 961 -997 -174 1175 -200
3010 -200 -40 1030 -23 7 389 163 834 432 4 982 317 -725 800 688 103 1084 292 -173 391
3029 391 31 444 702 5 520 549 -578 -46 952 -285 -19 503 -505 117 121 -333 599 -101 -144 758
3049 758 -291 -337 761 208 -99 376 -187 6 436 -291 684 355 -127 460 666 -597 438 559 4
3068 4 559 384 -405 351 10 -140 663 16 -99 643 -225 -109 842 38 248 749 -113 226 364 -139 513
3089 513 315 -422 751 398 -617 294 504 -306 580 101 -175 376 96 140 698 -71 186 857 -437
$$ packed form
2955F41j350M49K66N38r9o87J021j58k002J282J043j267Q29M43q91n78M10J31
2973B1Q36p03M0P86j627m66J680m61l77J351j097m57J55K61N00M04j206R18m26
2992A32j110J238M84q49N57J12j104M17J28l6P16p53J52Q77j958Q23J349j375
3010b00J60J070j053L0L82k26O71m02m28R78o65j042J525j12n85R81p92m65N64
3029C91l60M13K58o97N15K9j127N32R98j237K66N22j008O22Mm54R32p00m3R02
3049G58j049m6J098n53l07M75n63J93M30p27R75l29m82N87K06j263J035J21n55
3068DN55j75p89P56l41j50Q03o47j15P42q68J16R51q04K10N01q62L39J38n03O52
3089E13j98p37J173l53j015R11K10q10Q86m79k76N51k80M4N58p69K57O71j294
$$ plain form
3108 -437 193 664 -199 205 302 -251 272 5 -155 663 117 -479 620 -14 -234 490 -108 -398 419 -148
3128 -148 189 436 -277 160 409 -512 347 233 -529 191 165 -314 245 346 -367 474 48 -139 655 -133
3148 -133 -283 673 -47 -137 827 -173 133 319 -271 365 469 -85 438 482 -448 500 326 -249 386 -53
3168 -53 -328 605 -52 -414 513 -451 -53 219 -622 -206 303 -514 -39 157 -505 260 179 -447 222 258 -492
3189 -492 277 79 -356 429 -238 -421 737 -33 -99 689 6 235 671 -435 160 616 -416 208 262 -136
3209 -136 224 259 -301 472 61 -637 517 44 -260 535 -233 -329 339 -174 -1 538 -203 28 538 -450
3229 -450 131 175 -549 381 449 -321 386 230 -177 447 257 -31 777 -32 -157 565 -270 -6 518 -266 -214
3250 -214 371 -332 -94 289 -449 -81 -18 -459 -8 -261 -633 307 -74 -717 197 -179 -522 288 -135 -147 155
$$ packed form
3108d37O30M71q63M04R7n53N23k67j60Q18n46n96J099o34k20P24n98k90Q17n67
3128a48L37K47p13M37K49r21Q59j14p62P20k6m79N59J01p13Q41m26j87P94p88
3148a33j50R56p20r0R64j000L06J86n90O36J04n54N23M4r30R48j74n75O35m39
3168e3k75R33o57l62R27r64L98K72q41M16N09q17M75J96o62P65q1o26O69L6p50
3189d92P69j98m35P85o67j83J158p70o6P88o83K29M36j106N95M56j032O24N4l98
3209a36L60L5n60P73m11o98J154m73l04P95p68r6O68n13J73N39p41K31N10r88
3229d50N81M4p24R30O8p70P07j56m07O24j90k88Q08q09j25P22q35K64N24p84N2
3250b14N85p03K38L83p38L68O3m41M51k53l72R40l81o43R14l76l43Q10m23j2L02
$$ plain form
3271 155 -182 -113 -96 -268 122 453 -311 527 275 -451 90 327 -104 322 195 -422 638 -154 155 511
3291 511 -388 -394 378 -249 -349 420 -135 82 49 -599 -54 -42 -785 319 -264 -597 77 -107 -776 214 -225
3312 -225 -214 82 -231 -80 271 -607 210 371 -602 -161 412 -434 121 446 -190 -105 35 -396 309 -328 -370
3333 -370 645 -138 -708 160 -3 -667 385 -88 -276 107 -438 -113 491 -558 237 271 -707 110 309
3352 309 -558 113 455 -302 201 -151 -172 148 -355 -461 438 -277 -263 231 -402 -277 288 -235 -40 -87 -493
3373 -493 89 -38 -862 169 -140 -967 -21 -180 -972 -281 166 -248 -284 -647 -552 192 -872 -64 664 -759
3393 -759 -399 292 -526 -125 498 -144 -89 -219 -428 487 32 -42 909 46 -715 278 -42 -485 552 116
3413 116 -160 -260 -467 -161 163 -544 140 476 -979 -182 -116 -469 44 253 -98 -352 -433 -533 275 -407
$$ packed form
3271A55l37O9J7j72L90L31p64Q38k52p26N41K37m31M26j27o17J060p92L09L56
3291E11q99oP72o27j00P69n55K17l3o48N45J2p43J104n83l33O74j84o69R90m39
3312b25J1K96l13J51L51q78Q17J61r73M41N73q46N55L25o36Q5J40m31P05o37m2
3333c70J015p83n70Q68j63o64J052m73j88L83n45L25O04j049P95L4r78Q17J99
3352C09q67O71L42p57N03l52k1L20n03j06Q99p15J4M94o33J25N65n23J95m7m06
3373d93N82j27q24J031l09q27R46j59p92O91M47m14l6l63R5P44j064Q08P28j423
3393g59L60O91q18M01O23o42N5j30k09R15m55p4R51q63p61R93l20m43J037m36
3413A16k76j00k07L06L24p07O84L36j455P97O6l53N13K09l51k54q1j00Q08o82
$$ plain form
3433 -407 -226 965 -509 -655 426 -177 -255 338 27 50 -389 -736 118 -100 -209 542 446 -1183 -302 -168
3453 -168 -665 280 344 -8 -157 -856 -452 246 -816 -43 350 -959 -736 224 -355 -182 357 -263 69 -412
3473 -412 -308 211 153 -262 889 -53 -800 302 2 -234 513 379 317 -98 -746 98 462 -237 429 525
3493 525 -625 -355 177 -615 445 393 -134 -94 -930 -650 453 -241 -375 596 -536 -959 48 -137 -159
3512 -159 268 -30 -116 -120 -816 430 318 -564 680 293 -492 -61 167 -489 299 194 319 122 -804 -145
3532 -145 462 -177 55 692 -656 -424 305 -373 227 153 -406 -139 -329 -669 407 158 -391 232 13 -918
3552 -918 255 -238 -678 284 -37 -43 -65 -416 339 733 -496 28 568 -526 -158 204 -48 249 146 -179
3572 -179 380 -222 -350 567 198 -101 605 -442 -411 416 -217 -287 418 -360 -208 70 -675 26 172 -521
$$ packed form
3433d07J81J191j474j46J081o03p8N93l11K3m39l47Q54k18j09P51r6j629Q81J34
3453a68m97R45O4l52j49o99M04O98j062P73L93j309K23R60n79J73N39o20L32m81
3473d12J04N19n8m15J151r42p47J102l00k36P47j34o2m15o48Q44L64o99O66R6
3493E25j150K70N32p92J060n2n27M0q36K80J103o94j34R71j132m23J007j85k2
3512a59M27k98q6mo96J246j12q82J244l87p85M31K28o56P88j05J25j97r26O59
3532a45O07o39K32O37j348K32P29o78O00p4n59K67j90l40J076k49n49O23k19r31
3552i18J173m93m40R62l21ok2l51P55L94j229N24N40j094L68L62k52K97j03l25
3572a79N59o02j28R17l69k99P06j047L1Q27o33p0P05p78J52K78p45P01J46o93
$$ plain form
3592 -521 75 314 -682 81 252 -437 231 17 -138 397 -427 -306 538 -272 -78 502 -311 -238 316 -217
3612 -217 49 290 -82 445 136 -203 408 -44 -512 485 -169 -320 235 -49 -292 220 -422 -294 284 -546
3632 -546 -232 62 -660 -10 115 -544 -220 168 -435 -218 95 -369 544 -204 -230 136 -101 -220 565 -10
3652 -10 -194 504 49 211 385 -436 48 198 -44 436 349 -403 271 314 -9 247 100 -380 455 232 -95
3673 -95 425 -274 60 461 -266 -163 456 -484 60 208 -544 27 176 -526 537 265 -352 539 254 -105
3693 -105 327 -113 -612 338 360 -33 360 -210 -110 512 -96 -3 424 -238 426 527 -424 278 430 -304 181
3714 181 338 -378 432 200 -286 490 -93 -79 571 -197 -43 557 -19 -95 297 -449 -65 562 -437 277 358
3735 358 -417 411 325 -168 312 373 -44 531 216 -189 689 -49 -61 601 -26 322 551 -65 103 508 -155
$$ packed form
3592e21N96K39r96P63J71o89O68k14j55N35q24J21Q44q10J94N80q13P3N54n33
3612b17K66K41l72N27l09l39O11m52m68R97o54j51N55k84k43N12o42J28N78q30
3632e46L14K94p22O50J25o59L24L88o03K17L13m64R13p48k6L66k37j19P85n75
3652a0j84O98m55J62J74q21M84J50k42M80q7p52O74M3l23K56j47m80Q35k23l27
3673i5N20o99L34M01p27J03O19r40N44J48p52N71J49p02J063k72o17Q91k85l59
3693a05M32m40m99R50K2l93L93n70J00O22o08R3M27o62O64J01r51P02J52p34M85
3714A81J57p16Q10k32m86P76n83J4O50p68J54O00n76p6L92p46L84O27r99P14Q1
3735C58p75Q28q6m93M80O1m17N75l15m05Q78p38j2O62o27L48K29o16J68M05o63
$$ plain form
3756 -155 276 318 -169 500 375 -274 430 -68 -515 359 -163 -227 337 -108 -87 395 -58 8 400 -356 -175
3777 -175 490 -328 161 405 -276 165 457 -73 309 271 -222 492 -38 72 645 75 2 531 272 102 688
3798 688 148 563 663 106 39 493 -143 418 549 -339 354 468 -358 390 403 -364 287 -107 51 310 72
3819 72 8 506 -443 322 576 -264 148 304 -100 85 139 -465 620 280 -267 249 96 50 445 62 -106
3840 -106 208 -113 78 671 150 -26 506 -166 330 416 -543 283 525 -16 321 199 -157 585 202 -197
3860 -197 324 281 -249 427 280 -186 511 229 -101 663 105 204 629 -67 200 493 7 288 456 -195 173
3881 173 621 -287 236 141 128 659 -247 9 651 -158 -5 529 -231 -359 287 -122 179 227 -74 326 115
3902 115 -339 174 420 -385 714 401 -424 153 46 -305 498 -145 166 477 -232 -151 562 131 -11 800
$$ packed form
3756a55M31M2m87O69j25o49P04m98m47Q74n22o4N64m45K1M82m53O6L92p56J81
3777a75O65q18M89K44o81M41K92n30L82l8m93P14n30J10N73n70p3N29k59j70N86
3798F88n40M15J00n57o7M54o36N61J31q88O93J14q26P48J3p67O51l94J58K59k38
3819G2o4M98r49P65K54q40M12J56m04J85N4o04J085l40n47N16j53m6L95l83j68
3840a06L14l21J91N93n21j76N32o72M96Q6r59Q26K42n41L37j22l56P42l83l99
3860a97N21m3n30O76j47m66O97k82l30P64n58R9M25o96K67K93m86K81J68o51L68
3881A73M48r08N23r5j3N31r06K56O42q09J53N34p60j28O46m09L01M8l01M00k11
3902A15m54N13K46q05J099l13q25N77j07l51Q03o43L11L11p09Q1P13m31j42Q11
$$ plain form
3922 800 -241 343 60 -344 -38 192 -53 273 81 -443 230 -24 -249 614 345 -92 239 -189 -279 432
3942 432 20 148 281 13 -62 323 -392 142 586 -362 92 78 -506 135 78 -14 263 -533 -438 200 -233 -249
3964 -249 700 -176 -230 92 -587 -341 294 -235 195 115 -627 -67 214 -534 589 500 -339 -30 33 -326 347
3985 347 -204 134 263 -483 -330 252 -272 155 595 -113 -309 -118 -391 428 229 -364 485 -193 -725 187
4005 187 -144 -405 283 -79 -387 -150 -446 -311 122 57 70 116 -647 -306 -88 -683 90 363 -446 -340 57
4026 57 -546 -25 -137 30 512 -424 -615 204 -185 -168 465 153 27 -46 -284 -83 265 -45 285 -5 -561
4047 -561 244 90 -372 451 13 -624 -345 -449 -542 289 -156 -155 296 -614 -330 208 -525 -235 731 -47 -200
4068 -200 -48 -18 217 216 -216 484 404 -525 529 -11 -243 641 19 -159 139 -171 -18 1 -226 -45 228
$$ packed form
3922H00j041N84k83m04L06K30k45L26j92n24O73k54k25Q63k69m37L31m28r0P11
3942D32m12J28J33k68p5L85p15N34M44r48M54j4n84O41n7r2K77p96R5O38m33j6
3964b49R49q76n4L22o79K46O35n29M30q0p42N60K81p48J123q9q39L09O3l59O73
3985C47n51L38J29p46J53N82n24M27M40p08j96J91k73Q19j99n93Q49o78n32R12
4005A87l31k61O88l62l08K37k96J35M33o5J3M6p63L41K18n95P73K73q09J06L97
4026E7o03N21j12J67M82r36j91Q19l89J7O33l12j26p3k38K01L48l10L30k90n56
4047e61Q05j54m62Q23m38o37K79j04r3Q31m45JM51r10K84N38p33K90R66p78j53
4068b00J52L0K35jm32P00q0r29J054n40k32Q84o22j78K98l10J53J9k27J81K73
$$ plain form
4089 228 -713 -320 48 -422 48 441 -551 -337 -137 -475 -99 -92 -146 24 -336 -546 297 -215 -389 508 -18
4110 -18 -88 140 -324 322 247 -47 426 169 -404 431 358 -301 483 253 149 130 -115 233 501 -133 -131 448
4132 448 -413 176 308 -485 -304 316 -262 -349 -20 -405 -65 -107 -641 -47 13 -790 94 -336 -612 230 -191
4153 -191 -498 34 -148 8 189 -448 134 263 -421 168 391 -139 144 506 -412 197 155 -276 457 34
4173 34 -57 530 -39 -330 277 -36 -446 272 -127 -51 172 -606 -99 313 -236 -84 104 -257 138 180 -433
4194 -433 384 42 -325 275 125 177 303 -117 144 520 -52 -224 513 -419 -90 321 -169 294 209 -345 81
4215 81 42 -306 143 20 -342 43 -324 -649 166 -272 -470 223 -374 -49 315 -166 112 211 -544 -122 381
4236 381 -383 1 385 -454 112 629 -143 314 181 -3 679 119 42 345 229 -144 289 -122 -99 437 -330
$$ packed form
4089B28r41L93L68m70M70L93r92K14K00l38L76Pn4J70l60k10Q43n12j74Q97n26
4110a8p0K28m64O46p5k94M73k57n73Q35p3o59P84k30j04j9k45L48K68o34KN79
4132D48q61N89J32p93J81O20n78q7L29l85L40m2n34N94O0q03Q84m30k76Q42m21
4153a91l07N32j82J56J81o37N82J29o84N89K23n30K83L62r18O09m2m31P33m23
4173C4r1N87n69k91O07l13m10P18l99P6K23p78N07M12n49J52J88l61L95M2o13
4194d33Q17l42l67O00j50N2J26m20K61L76n72j72P37r32L29M11m90M63q5n54M26
4215H1l9l48M49j23l62L85l67l25Q15m38j98O93n97L25L64m81K78R9p55M22N03
4236C81p64L84L84q39N66N17p72M57j33j84O82n60p7L03j16l73M33m11K3N36p67
$$ plain form
4257 -330 -129 468 -452 -51 64 -453 180 183 -372 47 -25 -569 279 -214 -264 285 -462 -369 325 -433 7 115
4279 115 -478 -152 175 -156 192 -60 -470 185 33 -116 166 239 -364 18 -195 -531 39 -263 -161 459
4299 459 90 12 421 -164 61 533 -101 134 298 -606 -39 355 -293 310 366 -243 321 -246 -31 312 50
4320 50 -352 146 -85 -410 297 -230 -252 133 -243 -65 99 -313 62 264 -213 135 358 -405 271 151 -75
4341 -75 204 249 27 381 -145 137 292 88 10 513 -424 93 304 -326 221 175 -430 180 216 -213 8 69
4363 69 -190 259 19 -258 181 -211 -292 399 -394 -181 249 -105 95 630 -303 -49 302 -36 249 322 16
4384 16 589 191 -444 585 203 196 586 228 -194 575 -100 193 428 -294 140 250 -410 95 268 -430 -118
4405 -118 75 -475 155 154 -332 274 -111 -604 134 -301 -359 -9 -280 -202 130 -209 -142 147 64 48 362 -179
$$ packed form
4257c30K01N97r20M01J15n17O33Ln55M19p2n44Q48m93n0N49p47R3O94p58M40J08
4279A15n93L26L27l31L48k52m10O55j52j49K82P3o03L82k13l36N70l02J02O20
4299D59l69p8M09n85K25M72o34K35J64r04N67L94o48O03N6o09N64n67K15L43k62
4320E0m02M98k31l25P07n27k2L85l76J78J64m12L75K02m77L48K23p63O76j20k26
4341g5K79M5k22L54n26K82J55k04p8N03r37N17K11o30N47m6o05O10L6m29K21O1
4363F9k59M49k40k77M39l92q1O91p93K13M30l54K00N35r33K54L51l38K85P3l06
4384A6N73l98o35J029l82pL90l58m22P69o75K93K35p22M34J10o60N05J73o98L12
4405a18J93n50O30jm86O06l85m93P38m35n8L50k71P8L32l39O7K89q3j6L14n41
$$ plain form
4427 -179 152 379 -219 227 375 -95 640 44 -270 539 6 -9 422 104 -328 475 -165 -40 559 -192
4447 -192 -315 316 -321 5 383 -496 264 279 31 177 90 -312 358 192 -481 290 52 -195 582 197 41
4468 41 329 -123 41 350 -282 281 416 -306 63 200 -311 51 594 -248 415 -205 -365 77 -203 -62
4488 -62 457 -261 -336 195 -193 67 485 -19 -31 158 -242 338 280 -107 501 210 -237 322 456 -39 331
4509 331 302 8 438 144 -157 280 -219 204 520 -303 19 449 -310 2 442 -271 27 -61 -194 -101 -61
4530 -61 -209 448 96 -552 290 -17 -448 264 150 -173 17 -247 16 371 -176 254 426 -575 -59 -246
4550 -246 -345 60 379 -26 173 138 -322 328 -352 -103 422 -120 -212 375 9 -51 586 -87 216 85 -243
4571 -243 -174 50 -275 424 351 -41 284 221 -55 89 27 267 285 -345 -247 410 -60 48 498 -139 -153 248
$$ packed form
4427a79L31K27n98M46J48m70P35n96l14Q09n33j5M31l18m32Q03o40J25N99p51
4447a92j23O31o37L26L78q79P60J5k48J46q7m02O70j66o73P71k38k47P77l85j56
4468D1K88m52J64L09o32N63J35p22L69J37n11L62N43q42O63o20j60M42k80J41
4488f2N19p18p5N31l88K60M18n04j2J89m00N80n8l87O08k91m47N59J34m95L70
4509C31k9k94M30k94l01M37m99M23L16q23L22M30p59L12M40p13K98q8j33R3M0
4530f1j48O57l52o48Q42l07m31P12j14l23J90k64K63L55n47M30J72j001N16j87
4550b46r9M05L19m05J99l5m60O50o80K49N25n42r2N87l66o0O37o73L03j31l28
4571b43O9K24l25O99p3l92L25o3k76J44o2K40J8o30R8O57m70J08M50o37j4M01
$$ plain form
4593 248 -54 55 284 -154 29 275 -387 157 99 -408 298 73 -381 150 -156 -284 261 34 -118 35
4613 35 -511 -38 278 -473 253 520 -404 24 119 -175 -65 279 -401 116 -39 -69 314 88 -173 560 -188
4634 -188 -336 375 -194 -46 204 31 -50 28 -257 172 67 -145 190 236 -330 203 124 -185 193 3 -234
4655 -234 285 -49 -217 181 -375 -300 262 -168 136 131 -419 -184 -119 -208 201 -191 -347 294 -147 -499 348 88
4677 88 -301 136 38 -305 338 -175 -153 446 73 -7 313 -72 237 261 -645 31 44 -382 118 69 -248 -29
4699 -29 -303 -319 199 -77 -402 324 -79 -295 445 -200 -7 126 -249 291 298 -353 136 452 -418 283 284 -278
4721 -278 247 108 -61 311 38 -326 421 -248 -120 102 23 -233 390 -128 -7 234 -382 -59 -13 -410 -172
4742 -172 88 -208 32 -117 -488 504 -270 -398 96 53 -281 236 -2 141 722 12 255 684 -80 104
$$ packed form
4593B48l02J09K29m38J83K46o62N44n8n07P06k25m54N31l06j28N45k27j52J53
4613C5n46M73L16p51P26K67r24M28R5k94J10L44o80N17j55l0L83k26k61P33p48
4634a88j48P11n69J48K50j73q1P8k85M29j05k12L35M6n66N33p9l09L78j90k37
4655b34N19l34j68L98n56P5N62m30L04nn50K35O5q9M09l92j56O41m41l52Q47k60
4677H8l89M37r8l43O43n13K2N99l73q0L20l85L09K4r06O76J3m26N00m9l17K19
4699b9k74j6N18k76l25P26m03k16P40o45J93J33l75N40Po51M89L16q70P01Jn62
4721b78N25j39j69L72k73l64P47o69J28K22p9k56O23n18J21K41o16L23M6l97K38
4742a72K60k96K40j49l71R92p74j28M94m3l34N17k38J43N81p10K43M29p64J84
$$ plain form
4762 104 523 -225 410 168 -51 292 290 -23 439 315 -151 402 -155 -215 176 -57 -42 319 -188 -555 92
4783 92 -639 -35 -213 -448 -26 57 -566 -81 106 -519 67 83 -226 343 13 -216 522 -204 25 239 -259
4804 -259 104 363 -144 152 187 -21 260 212 -103 73 224 -216 77 89 -253 336 -119 -303 329 -210 -317
4825 -317 11 -62 -209 337 -376 -233 376 -350 -195 32 -344 253 378 -247 648 224 63 449 207 -96
4845 -96 613 513 -102 394 87 47 463 -282 -110 452 -422 -96 314 -377 -74 171 -391 -5 148 -403 224
4866 224 -27 -486 149 -138 -110 203 -294 -292 305 -243 -88 420 -278 141 541 -256 76 575 -263 428 377
4887 377 -225 142 520 -58 375 175 -376 516 -251 123 372 -169 -104 363 -261 123 77 -41 -5 114 -477
4908 -477 -55 165 -56 278 210 -101 314 50 -86 395 53 153 282 -336 186 610 40 37 281 177 184 221
$$ packed form
4762A04M19p48O35k42k19L43kl13M62j24m66N53n57o0L91k33J5L61n07l67O47
4783I2p31O04j78k35M22Q3o23M85J87o25N86J6l09N69l30k29P38p26K29K14m98
4804b59L63K59n07K96L5k08K81m8l15J76J51m40K93J2l42N89m55j84O32n39j07
4825c17L28p3j47N46p13J43O09p26J55K27l76N97J25o25Q95m24j61L86k42l03
4845i6P09j00o15M96l07m0M16p45J72N62q74L26M10o91L03K45n62L86J53n51O27
4866B24k51m59O35k87K8L13m97KN97n48J55N08o98M19M00p97L32M99q38O91n1
4887C77o02L67L78n78M33k00n51Q92p67L74K49n41O5M67o24L84m6j18L6J19n91
4908d77M22K20k21L34o8l11M15k64j36M81l42J00J29o18N22M24n70lK44j04PL7
$$ plain form
4930 221 18 149 244 -109 428 -12 -200 333 -191 -419 340 -21 -333 351 -192 11 301 -263 -74 249
4950 249 -338 143 269 -317 206 415 -78 104 451 -198 295 164 57 443 316 -68 326 -177 6 496
4970 496 -17 151 302 -264 173 570 -204 285 516 -465 197 271 -178 140 -169 -296 397 38 45 395 -114
4991 -114 -169 208 151 -199 330 -91 99 442 -123 28 273 -17 234 317 -296 534 453 -428 429 485 268 294
5013 294 50 -367 434 89 -89 361 -407 104 430 -297 193 64 -294 119 148 -72 265 124 -400 466
5033 466 327 -53 337 -114 -169 304 31 274 374 -274 223 173 -75 295 661 -297 378 346 -285 210 210 -62
5055 -62 324 207 -158 208 -151 -90 338 167 -321 514 -237 -134 28 -330 -243 86 -65 -216 71 -271 -7
5076 -7 189 -380 318 186 -264 370 95 16 119 153 -412 341 -99 -18 522 -127 24 343 99 57 155 -68
$$ packed form
4930B21k03J31R5l53N37m40j88N33n24k28P59l61l12O84n43K03K90n64J89L23
4950B49n87M81J26n86N23K09m93J82L47o49M93j31j07L86j27l84L94n03J83M90
4970D96n13J68J51n66M37L97p74M89K31r81O62P4m49L18l09j27O93l59PL50n09
4991a14n5L77n7l50N29m21J90L43n65J51K45k90K51Q3o13Q30q1q81Q57N6k17K6
5013B94k44m17Q01l45j78M50p68N11L26p27M90j29l58M13K9k20L37j41n24Q66
5033D66j39l80L90m51n5M73k73K43J00o48M97n0k48L70L66r58O75l2o31M95%k72
5055f2L86j17l65L66l59O1M28j71m88Q35p51J03J62l58Q7L29j51j51K87l42K64
5076gJ96n69O98j32m50O34k75p9J03L4n65P53m40Q1N40o49J51L19k44m2R8k23
$$ plain form
5098 -68 147 350 140 297 175 -1 375 64 -96 182 -16 -226 340 -335 75 80 -143 -59 116 -420 37
5119 37 408 -367 34 -86 -241 241 356 -217 242 -136 -258 365 -207 -239 62 -20 -123 368 -155 -53 304
$$ packed form
5098f8K15K03k10J57j22j76L76l11j60K78j98k10N66o75M10Nk23Q4J75n36M57
5119C7L71p75M01j20j55M82J15n73M59l78j22O23n72l2L01q2j03M91n23J02L57
$$ [...]
8191I4
##END NTUPLES=NMR FID
##END=
