##TITLE=1H_90-2025
 200.13MHz, CDCl3,
 8 sc
 
 7.8.2025
##JCAMPDX= 6.0         $$ Bruker NMR JCAMP-DX V2.0
##DATA TYPE= NMR FID
##DATA CLASS= NTUPLES
##ORIGIN= UXNMR, Bruker Analytische Messtechnik GmbH
##OWNER= pz
$$ XWIN-NMR		Version 3.5
$$ Thu Aug  7 15:00:50 2025 Russian Standard Time (UT+4h)  she@DPX200
##.OBSERVE FREQUENCY= 200.1313
##.OBSERVE NUCLEUS= ^1H
##.DELAY= (6, 6)
##.ACQUISITION MODE= SIMULTANEOUS
##.ACQUISITION SCHEME= undefined
##.AVERAGES= 8
##.DIGITISER RES= 18
##SPECTROMETER/DATA SYSTEM= spect
##.PULSE SEQUENCE= zg30
##.SOLVENT NAME= CDCl3
##.SHIFT REFERENCE= (INTERNAL, CDCl3, 0, 14.3821)
##AUDIT TRAIL= $$ (NUMBER, WHEN, WHO, WHERE, WHAT)
$$ ##TITLE= Audit trail, XWIN-NMR		Version 3.5
$$ ##JCAMPDX= 5.01
$$ ##ORIGIN= Bruker BioSpin GmbH
$$ ##OWNER= she
$$ F:/spectra/data/she/nmr/H-C/1/audita.txt
$$ ##AUDIT TRAIL=  $$ (NUMBER, WHEN, WHO, WHERE, WHAT)
(   1,<2025-08-07 14:58:44.65 +0400>,<she>,<DPX200>,
      <created by zg, POWCHK disabled, PULCHK disabled
       configuration hash MD5:
       00 E9 B6 7A A2 85 ED C7 34 08 36 98 17 FE 4E 26
       data hash MD5: 16K
       00 7E CC 15 06 CA B3 61 42 36 03 6E BE 18 77 3B>)
$$ ##END=
$$ 
$$ hash MD5
$$ 6B 84 03 03 23 79 5C 8F D4 63 32 1D 12 6E 4F 8D
##$RELAX= 
##$RELAX= 
##$RELAX= 
##$RELAX= 
##$RELAX= 
##$RELAX= 
$$ Bruker specific parameters
$$ --------------------------
##$DU= <F:/spectra>
##$EXPNO= 1
##$NAME= <H-C>
##$PROCNO= 1
##$TYPE= <nmr>
##$USER= <she>
##$AMP= (0..31)
100 100 100 100 100 100 100 100 100 100 100 100 100 100 100 100 100 100 
100 100 100 100 100 100 100 100 100 100 100 100 100 100 
##$AQSEQ= 0
##$AQ_mod= 1
##$AUNM= <au_zg>
##$AUTOPOS= <>
##$BF1= 200.13
##$BF2= 200.13
##$BF3= 200.13
##$BF4= 200.13
##$BF5= 200.13
##$BF6= 200.13
##$BF7= 200.13
##$BF8= 200.13
##$BYTORDA= 1
##$CFDGTYP= 0
##$CFRGTYP= 5
##$CHEMSTR= <none>
##$CNST= (0..31)
1 1 145 1 1 1 1 1 1 1 1 1 1 1 1 1 1 1 1 1 1 1 1 1 1 1 1 1 1 1 1 1 
##$CPDPRG= <>
##$CPDPRG1= <>
##$CPDPRG2= <>
##$CPDPRG3= <>
##$CPDPRG4= <mlev>
##$CPDPRG5= <mlev>
##$CPDPRG6= <mlev>
##$CPDPRG7= <mlev>
##$CPDPRG8= <mlev>
##$CPDPRGB= <>
##$CPDPRGT= <>
##$D= (0..31)
0 0.7 0 0 0 0 0 0 0 0 0 0.03 0 0 0 0 0 0 0 0 0 0 0 0 0 0 0 0 0 0 0 0 
##$DATE= 1754564323
##$DBL= (0..7)
120 120 120 120 120 120 120 120 
##$DBP= (0..7)
150 150 150 150 150 150 150 150 
##$DBP07= 0
##$DBPNAM0= <>
##$DBPNAM1= <>
##$DBPNAM2= <>
##$DBPNAM3= <>
##$DBPNAM4= <>
##$DBPNAM5= <>
##$DBPNAM6= <>
##$DBPNAM7= <>
##$DBPOAL= (0..7)
0.5 0.5 0.5 0.5 0.5 0.5 0.5 0.5 
##$DBPOFFS= (0..7)
0 0 0 0 0 0 0 0 
##$DE= 6
##$DECBNUC= <off>
##$DECIM= 32
##$DECNUC= <off>
##$DECSTAT= 4
##$DIGMOD= 1
##$DIGTYP= 9
##$DL= (0..7)
0 120 120 120 120 120 120 120 
##$DP= (0..7)
150 150 150 150 150 150 150 150 
##$DP07= 0
##$DPNAME0= <>
##$DPNAME1= <>
##$DPNAME2= <>
##$DPNAME3= <>
##$DPNAME4= <>
##$DPNAME5= <>
##$DPNAME6= <>
##$DPNAME7= <>
##$DPOAL= (0..7)
0.5 0.5 0.5 0.5 0.5 0.5 0.5 0.5 
##$DPOFFS= (0..7)
0 0 0 0 0 0 0 0 
##$DQDMODE= 0
##$DR= 18
##$DS= 0
##$DSLIST= <SSSSSSSSSSSSSSS>
$$ [...]
##$SUBNAM0= <"">
##$SUBNAM1= <"">
##$SUBNAM2= <"">
##$SUBNAM3= <"">
##$SUBNAM4= <"">
##$SUBNAM5= <"">
##$SUBNAM6= <"">
##$SUBNAM7= <"">
##$SUBNAM8= <"">
##$SUBNAM9= <"">
##$SW= 18.0517328524113
##$SWIBOX= (0..15)
0 0 2 0 0 0 0 0 0 0 0 0 0 0 0 0 
##$SW_h= 3612.71676300578
##$TD= 16384
##$TD0= 1
##$TE= 0
##$TE2= 300
##$TE3= 300
##$TEG= 300
##$TL= (0..7)
0 120 120 120 120 120 120 120 
##$TP= (0..7)
150 150 150 150 150 150 150 150 
##$TP07= 0
##$TPNAME0= <>
##$TPNAME1= <>
##$TPNAME2= <>
##$TPNAME3= <>
##$TPNAME4= <>
##$TPNAME5= <>
##$TPNAME6= <>
##$TPNAME7= <>
##$TPOAL= (0..7)
0.5 0.5 0.5 0.5 0.5 0.5 0.5 0.5 
##$TPOFFS= (0..7)
0 0 0 0 0 0 0 0 
##$TUNHIN= 0
##$TUNHOUT= 0
##$TUNXOUT= 0
##$USERA1= <user>
##$USERA2= <user>
##$USERA3= <user>
##$USERA4= <user>
##$USERA5= <user>
##$V9= 5
##$VALIST= <valist>
##$VCLIST= <CCCCCCCCCCCCCCC>
##$VD= 0
##$VDLIST= <DDDDDDDDDDDDDDD>
##$VPLIST= <PPPPPPPPPPPPPPP>
##$VTLIST= <TTTTTTTTTTTTTTT>
##$WBST= 1024
##$WBSW= 4
##$XGAIN= (0..3)
0 0 0 0 
##$XL= 0
##$YL= 0
##$YMAX_a= 742368
##$YMIN_a= -745162
##$ZGOPTNS= <>
##$ZL1= 120
##$ZL2= 120
##$ZL3= 120
##$ZL4= 120
##$ABSF1= 10
##$ABSF2= 0
##$ABSG= 5
##$ABSL= 3
##$ALPHA= 0
##$AQORDER= 0
##$ASSFAC= 0
##$ASSFACI= 0
##$ASSFACX= 0
##$ASSWID= 0
##$AUNMP= <proc_1d>
##$AZFE= 0.1
##$AZFW= 0.1
##$BCFW= 1
##$BC_mod= 2
##$BYTORDP= 1
##$COROFFS= 0
##$CY= -3
##$DATMOD= 1
##$DC= 2
##$DFILT= <>
##$DTYPP= 0
##$F1P= 0
##$F2P= 0
##$FCOR= 0.5
##$FTSIZE= 0
##$FT_mod= 4
##$GAMMA= 1
##$GB= 0.15
##$INTBC= 1
##$INTSCL= 1
##$ISEN= 128
##$LB= 0.25
##$LEV0= 0
##$LPBIN= 0
##$MAXI= 10000
##$MC2= 0
##$MEAN= 0
##$ME_mod= 0
##$MI= 1.114404
##$NCOEF= 0
##$NC_proc= 0
##$NLEV= 6
##$NOISF1= 3.799351
##$NOISF2= 2.8
##$NSP= 1
##$NTH_PI= 0
##$NZP= 0
##$OFFSET= 14.38212
##$PC= 1
##$PHC0= -1355.11
##$PHC1= 8.792299
##$PH_mod= 1
##$PKNL= yes
##$PPARMOD= 0
##$PSCAL= 0
##$PSIGN= 0
##$REVERSE= no
##$SF= 200.129724274929
##$SI= 16384
##$SIGF1= 3
##$SIGF2= 2
##$SINO= 400
##$SIOLD= 16384
##$SREGLST= <1H.CDCl3>
##$SSB= 0
##$STSI= 0
##$STSR= 0
##$SW_p= 3205.1282051282
##$SYMM= 0
##$S_DEV= 0
##$TDeff= 0
##$TDoff= 0
##$TI= <>
##$TILT= no
##$TM1= 0
##$TM2= 0
##$TOPLEV= 0
##$USERP1= <user>
##$USERP2= <user>
##$USERP3= <user>
##$USERP4= <user>
##$USERP5= <user>
##$WDW= 1
##$XDIM= 8192
##$YMAX_p= 0
##$YMIN_p= 0
$$ End of Bruker specific parameters
$$ ---------------------------------
##NTUPLES= NMR FID
##VAR_NAME=  TIME,          FID/REAL,        FID/IMAG
##SYMBOL=    X,             R,               I
##VAR_TYPE=  INDEPENDENT,   DEPENDENT,       DEPENDENT
##VAR_FORM=  AFFN,          ASDF,            ASDF
##VAR_DIM=   8192,          8192,            8192
##UNITS=     SECONDS,       ARBITRARY UNITS, ARBITRARY UNITS
##FACTOR=    0.0002768,     1,               1
##FIRST=     0,             0,               0
##LAST=      2.2672688,     0,               0
##MIN=       0,             -745162,         0
##MAX=       2.2672688,     742368,          0
$$ Real data points
##PAGE= N=1
##DATA TABLE= (X++(R..R)), XYDATA
0 0 0 0 0 0 0 0 0 0 0 0 0 0 0 0 0 0 0 0 0 0 0 0 0 -2 4 -4 5 -6 10 -12 13 -17 21 -24 28 -34 39 -45 50 -59 69 -78 87 -98
44 -98 110 -123 138 -151 168 -186 207 -225 247 -268 292 -315 336 -355 374 -381 381 -355 289 -148 -142 741
66 741 -2094 5612 -17864 128968 742368 -272748 -598322 561724 251236 -628334 69373
77 69373 499337 -336787 -283026 410510 30139 -370575 143865 221541 -217922 -75007 193889
88 193889 -19430 -112464 64301 81810 -42641 -62286 53679 78186 -95951 -73102 151343
99 151343 20003 -191090 75681 181586 -184129 -111136 259271 -26381 -271301 183818
109 183818 194092 -295166 -29637 319633 -150119 -236680 271518 75189 -299834 94577
119 94577 239728 -208096 -113394 248590 -27519 -219020 127433 122406 -176256 -17456 154792
130 154792 -63479 -100160 85064 36016 -81097 -11330 63622 10370 -55522 -2519 70354
141 70354 -12840 -79380 46983 75486 -84640 -38723 130761 -8257 -135272 87941 105795
152 105795 -154574 -30405 176402 -67583 -138922 145273 53197 -177449 36995 143858
162 143858 -121012 -84052 157197 2479 -147232 77430 100424 -124703 -29620 124647
172 124647 -41380 -91052 80883 44298 -84747 -4027 72231 -21320 -61271 31720 45498
183 45498 -44014 -28894 55882 12528 -61565 6106 61520 -32505 -58550 63727 43280 -85718
195 -85718 3490 100116 -51154 -74149 94503 25989 -105863 33428 92045 -75265 -51838
206 -51838 98130 -1327 -103271 45083 71397 -86210 -28356 93973 -23684 -78140 54404
217 54404 38775 -70540 -7889 65370 -15215 -49916 38553 38856 -48690 -16181 55349 -6394
229 -6394 -50074 27314 40969 -38355 -25706 49080 7452 -58991 15372 56126 -44085 -35250
241 -35250 68519 4609 -69782 30541 52380 -57942 -28010 67240 -3990 -65611 35261
252 35261 49439 -61180 -20678 68951 -16927 -58540 45739 35032 -55276 -5437 54520 -17268
264 -17268 -46524 32893 29815 -47066 -8790 51685 -14805 -42858 33717 24399 -43477 -5859
276 -5859 44138 -9389 -37767 27927 30682 -41498 -12885 48215 -12570 -44076 33414 27157 -43999
289 -43999 -5386 45471 -13675 -39883 29844 27550 -43104 -7342 49150 -15710 -41136 34134
301 34134 20502 -45339 -2610 40857 -15689 -33458 29625 23195 -38535 -4907 43536 -14585
313 -14585 -34609 33864 19891 -39112 710 37115 -17054 -31016 26749 17449 -37301 -2239
325 -2239 39635 -16634 -30857 32826 14138 -38377 3896 33632 -18379 -25117 27097 13178
337 13178 -34558 -652 33981 -17042 -27169 30595 13503 -33391 5226 32060 -15696 -22767
349 -22767 25333 13674 -31284 -419 33607 -15276 -26879 29134 11892 -35025 4739 30807
361 30807 -18453 -21747 26725 9965 -32274 2530 30237 -19303 -23220 29908 7166 -32430
373 -32430 9620 26901 -19655 -15901 25449 5910 -27014 4907 25298 -17096 -18838 25564
385 25564 5189 -28832 7718 23656 -17178 -14692 23276 7082 -24610 4266 25511 -15266
397 -15266 -18152 26440 6231 -28632 9535 24669 -19329 -13971 25334 3673 -26353 7184
409 7184 22592 -19791 -16024 25498 -322 -28807 11227 18618 -21967 -9659 22964 -469 -21335
422 -21335 9511 18983 -15802 -10383 23127 1116 -22329 10704 17307 -17042 -8454 19853 1159
435 1159 -19244 6790 18201 -14439 -12064 22267 2270 -23537 10115 18408 -18733 -9313 21282
448 21282 -952 -20712 9800 16968 -17903 -8806 23725 -2775 -23016 14077 14602 -21116 -4268
461 -4268 20111 -6219 -17085 11462 9955 -17734 -4304 18933 -5547 -17678 13093 10690 -17018
474 -17018 -2405 16123 -3808 -12235 9429 10670 -11634 -3807 17756 -1333 -16340 11181 13098
487 13098 -15478 -4461 17230 -2579 -14976 8448 10526 -15135 -5673 17994 -4520 -18343
499 -18343 12920 10741 -19484 -2448 17039 -7639 -13528 12023 6911 -14932 338 16344 -7148
512 -7148 -12593 14319 6268 -15621 2707 13221 -7799 -7842 9568 2653 -11080 66 10725
525 10725 -4676 -9340 9775 6252 -11152 379 11277 -4009 -7838 8155 6604 -9638 -2386
538 -2386 13115 -2829 -13579 8990 8315 -14638 -1457 14017 -6733 -11289 10709 4835 -15083
551 -15083 -679 14322 -7199 -12288 12880 5294 -14794 3596 11847 -9510 -5168 12331 730
564 730 -9913 4549 9646 -6200 -6239 8644 2185 -8655 2583 6472 -5004 -2953 5627 783
578 783 -6527 -536 7335 -1900 -8415 5920 6561 -9547 -1772 9787 -4411 -8119 8290 4213
592 4213 -10904 542 12086 -6352 -10551 11495 3898 -14540 4065 11587 -10390 -4849 12421
605 12421 -2063 -10925 6155 7209 -8789 -2917 10272 -1047 -8256 6009 5027 -7353 -399
618 -399 6680 -1291 -3874 2478 4122 -2193 -4294 3978 3104 -6976 -290 7593 -3899 -6465 6432
633 6432 3074 -9410 -763 9224 -4664 -8544 9689 3853 -12278 3897 10711 -10179 -4578 12890
647 12890 -1602 -10267 7373 6887 -9410 -2033 9678 -3576 -8346 7583 3722 -9187 1554
660 1554 7360 -4739 -4177 4631 1442 -3819 -738 3916 477 -4379 1438 4312 -3971 -3122 5387
675 5387 1200 -5766 1338 6654 -3731 -5980 7195 2428 -10156 2969 8955 -8478 -3966 11082
689 11082 -2101 -9450 6853 5815 -9154 -881 10103 -3372 -7715 7895 3328 -9901 1869
702 1869 7390 -6155 -3451 6628 -278 -5136 1647 3255 -2508 -2877 2830 1905 -3626 -461 3713
717 3713 -1027 -3551 1389 2875 -2773 -2921 4932 1735 -6527 2386 6489 -6394 -3006 8603 -1427
732 -1427 -7044 5965 4666 -7356 -507 7999 -3185 -6551 6998 3154 -8625 2022 7240 -6280
746 -6280 -3602 6757 -1192 -5760 2936 3184 -3754 -1692 3859 48 -4123 1309 2989 -2698 -1547
761 -1547 2757 766 -2249 -586 2646 80 -3862 1791 4044 -4195 -1602 6064 -1510 -5124 4340
776 4340 2771 -5549 -154 5863 -2212 -4829 5169 2729 -6862 1193 6188 -4826 -3100 6337 -503
791 -503 -5218 2770 3000 -4017 -1677 3977 -111 -4065 2000 3080 -3428 -1202 3485 -783 -2637 1310
807 1310 1907 -1265 -1776 2020 1770 -3377 -280 4085 -1860 -2868 3893 1396 -3818 774 3797 -2008
823 -2008 -3052 3638 1759 -4880 915 4720 -3839 -2829 4799 -658 -4691 2207 2577 -3471 -1475
838 -1475 3438 -253 -3826 1588 2942 -3430 -1034 4111 -697 -2633 2288 1654 -2024 -758 2386
853 2386 444 -2597 820 2855 -2270 -1740 3296 -114 -3033 1382 2176 -1858 -1305 2626 758 -3236
869 -3236 769 3240 -2762 -1877 3979 -330 -3469 1978 1975 -2828 -1016 2620 -337 -3122 1281 2460
885 2460 -3258 -1381 3580 -1081 -3002 2183 1388 -2385 -59 2388 -296 -2008 1436 2187 -2241 -719
901 -719 3277 -481 -2269 2019 1336 -1848 -280 1812 -87 -1908 814 2037 -2105 -1301 2808 -545
917 -545 -2738 1529 1355 -2140 -574 1882 -230 -2238 904 2005 -2361 -1138 3127 -681 -2655 2149
933 2149 1302 -2462 -43 2188 -633 -1918 1428 1605 -2278 -699 2754 -961 -2095 2108 751 -2032
949 -2032 491 1786 -641 -1275 1125 1471 -1552 -646 2279 -332 -1829 1459 826 -1835 -157 1460
965 1460 -480 -1803 653 1614 -1933 -1484 2365 -363 -2542 1518 1245 -2243 145 2180 -772 -1690
981 -1690 1631 1667 -2216 -540 2863 -730 -2071 2230 673 -2277 803 1583 -1460 -1069 1522 733
997 733 -1838 -284 2052 -788 -1621 1638 582 -1676 560 1352 -780 -938 1013 1054 -1509 -769 2160
1014 2160 -409 -2167 1465 1001 -2245 51 1820 -1067 -1522 1447 1077 -2070 -339 2577 -937 -2006
1030 -2006 2363 702 -2506 945 1911 -1605 -908 1733 313 -1623 284 1716 -1115 -1159 1927 39
1046 39 -1878 933 1160 -1299 -613 1038 407 -1081 -302 1286 -548 -1391 1474 435 -1932 531 1646
1063 1646 -1184 -1129 1420 715 -1632 -47 1868 -890 -1417 2157 257 -2412 1264 1654 -1974 -612
1079 -612 1891 -179 -1621 590 1240 -1269 -688 1704 -425 -1562 1352 808 -1619 21 1156 -286
1095 -286 -691 267 757 -496 -745 1067 153 -1336 585 1056 -1077 -473 1061 232 -1038 88 1304
1112 1304 -672 -1146 1560 282 -1901 935 1321 -1667 -276 1577 -512 -1264 883 799 -1272 -422
1128 -422 1560 -501 -1483 1335 554 -1497 409 1028 -827 -374 727 183 -596 -150 818 -71 -909 593
1146 593 645 -818 -123 726 -121 -481 146 684 -302 -669 1094 269 -1410 663 1124 -1236 -324 1202
1164 1202 -402 -1004 665 551 -1067 -375 1145 -381 -1292 1048 526 -1458 297 1067 -737 -368 802
1181 802 84 -500 193 680 -228 -583 667 327 -807 126 599 -380 -246 251 228 -256 -371 507 141 -915
1201 -915 415 795 -888 -229 943 -324 -668 561 439 -665 -338 884 -141 -1046 723 542 -1307
1218 -1307 58 936 -797 -469 818 42 -620 149 631 -240 -553 730 339 -773 337 674 -535
1235 -535 -66 584 -9 -205 -7 348 46 -458 269 455 -735 -57 667 -396 -465 481 230 -528 -227 497
1255 497 -123 -795 475 487 -958 18 906 -664 -398 747 21 -563 278 582 -284 -405 611 279 -725
1274 -725 287 637 -634 -105 611 -153 -304 225 185 -121 -247 301 265 -524 43 553 -296 -231 482 27
1294 27 -301 50 335 -94 -487 238 367 -794 -124 705 -567 -525 634 -103 -609 149 421 -288 -338 563
1314 563 211 -690 315 705 -568 -77 720 -167 -379 388 235 -246 -104 275 88 -458 122 404 -377
1333 -377 -207 416 -175 -287 170 178 -92 -173 250 275 -507 3 572 -339 -279 551 -80 -483 177 283 -297 -346
1355 -346 313 164 -584 57 546 -512 -317 702 -161 -439 375 209 -296 -48 397 68 -400 212 429
1374 429 -431 -64 474 -201 -260 354 87 -263 -100 131 47 -304 29 364 -362 -232 373 -147 -398 238 204
1395 204 -281 -132 285 139 -375 127 511 -416 -188 568 -87 -456 379 206 -391 -25 358 -40 -379 226
1415 226 360 -439 -89 521 -252 -323 434 90 -366 107 284 -92 -250 159 373 -334 -90 441 -171 -285
1435 -285 336 48 -308 77 151 -103 -235 106 217 -326 -102 509 -150 -309 431 114 -314 74 241 -51
1455 -51 -192 222 217 -255 -40 466 -228 -319 416 11 -350 113 222 -171 -144 165 161 -325 17 307 -261 -224 331
1478 331 -33 -366 135 151 -133 -48 103 32 -183 -73 258 -165 -159 266 -9 -275 134 261 -95 -94 92 157 -181
1501 -181 -82 281 -134 -272 325 57 -276 166 235 -115 -37 198 32 -103 49 227 -126 -130 313 -6 -219 143
1523 143 79 -147 13 71 -64 -124 -48 143 -89 -131 155 -17 -162 162 78 -44 -17 11 33 -36 -85 170 6 -226
1547 -226 184 125 -201 27 184 -63 -45 115 31 -86 -32 239 -92 -203 224 108 -204 118 123 -121 32 67
1569 67 -99 -92 -25 116 -46 -186 158 18 -182 29 56 -95 54 29 22 38 -121 71 28 -215 86 78 -189 -17
1593 -17 86 -55 -105 71 70 -60 -19 138 46 -165 156 164 -191 52 197 -62 -18 103 43 -120 -44 62 -84 -122
1617 -122 114 14 -209 88 111 -127 -44 54 -74 -52 -31 73 61 -90 35 64 -152 -40 95 -86 -65 39 -10
1640 -10 -39 -58 148 52 -167 88 169 -190 -52 252 -133 -61 187 38 -75 -10 126 22 -133 144 44 -178
1662 -178 34 73 -181 -37 171 -86 -1 65 12 -62 -39 -31 32 -123 51 132 -102 -48 94 16 -28 -15 40 18 -108
1687 -108 9 103 -94 -38 196 -81 -114 106 17 -118 77 109 -24 -143 96 54 -191 52 158 -184 -115 150
1709 150 -29 -107 54 22 -41 10 63 40 -124 12 45 -107 -1 89 -73 -13 63 8 18 -46 -8 108 -13 -52 190
1734 190 11 -17 151 73 -81 -21 56 -41 -122 19 58 -214 -99 132 -168 -119 191 -16 -163 46 43 -49 -7 99
1758 99 14 -65 -10 122 -59 -35 100 -13 -26 43 2 8 -34 15 42 -59 -49 53 -35 -88 126 60 -51 44 84 5 -20
1785 -20 29 149 -53 -53 132 -14 -114 166 27 -161 19 61 -87 -46 100 16 -62 42 104 -112 -48 184 -24
1808 -24 -104 107 -9 -11 -15 5 -27 0 -24 18 -2 -50 93 -57 -50 48 74 26 -63 -15 102 -34 -34 68 26 -110 62 86
1836 86 -108 45 94 -145 -41 93 -22 -124 17 145 -73 -7 77 -12 -170 65 55 -126 12 78 -76 -76 -23
1859 -23 -1 11 -25 43 -3 -62 55 43 21 -9 -3 43 24 -59 95 33 -49 14 24 -104 9 64 -123 2 71 -20 6 6
1887 6 35 21 -26 80 46 -104 100 4 -99 18 44 -22 -8 -23 -13 -12 -43 9 -11 -69 -10 60 -88 -2 -1 -25 -18 -18 7 36
1917 36 -77 4 -8 -45 42 50 -19 -13 22 -15 -8 -4 13 80 -5 57 28 -114 -17 69 16 23 83 -24 -15 9 70 34 -37 -20 -7 -82
1949 -82 -66 33 -77 -101 92 -14 38 6 30 -22 -44 7 27 -66 -15 74 -58 -90 48 -5 -10 -22 8 55 -70 5 104 -43
1977 -43 -14 129 -22 -39 74 5 -13 -11 3 -15 -84 46 90 -135 -18 129 -14 -60 91 -30 -64 -6 -30 14 -19 44
2003 44 63 -69 -11 149 -8 -87 89 40 -79 36 -13 -10 7 22 31 -111 -60 75 -86 -91 72 -34 -72 29 37 3
2029 3 -59 61 23 -81 24 123 -132 -128 92 -22 -58 73 18 -49 -36 68 51 -150 25 114 -68 -51 121 -39 -87
2054 -87 58 11 -35 -17 5 -7 3 -42 105 -73 -77 76 -28 -28 94 50 -16 -16 29 20 -102 -46 127 -51 -60 63 -38
2081 -38 -90 50 4 -114 -32 12 38 -70 -11 107 -132 -8 103 -39 -91 145 28 -84 116 -12 -59 -36 -52 33
2105 33 3 -14 69 -17 25 120 -104 -75 36 -53 45 61 34 87 -80 -75 101 -13 -48 112 3 -77 -11 32 -41 -54 42
2132 42 35 -79 -23 119 46 -80 78 17 -57 58 33 74 2 62 21 -1 -42 78 -53 -61 68 -10 -63 23 1 -45 27
2159 27 -37 44 10 -24 64 31 -61 38 52 -89 12 5 -101 78 25 24 -56 -116 121 18 -44 54 43 -64 30 123 38 -72
2187 -72 -31 13 -58 -24 120 45 -51 123 18 -124 73 -5 -33 32 16 33 -41 -90 36 -7 -114 81 63 -16 40 -2
2213 -2 -15 74 4 4 27 -33 47 37 -69 106 -7 -161 55 49 -8 15 48 19 -37 -56 48 18 -66 127 3 -103 75
2240 75 0 -83 21 73 -17 -15 -40 44 -16 -88 41 60 -119 29 -29 -76 35 1 1 -92 -38 8 48 -49 7 37 -52 45 31
2269 31 -29 24 3 10 5 15 40 -3 -82 9 66 -110 47 87 -65 25 33 -15 44 32 57 61 -26 83 79 -66 40 0 -45 21
2299 21 31 -66 32 -50 24 -26 -40 64 80 -55 -13 31 -93 41 95 -19 28 -12 4 -34 -95 3 38 -96 -16 117 -4
2326 -4 -6 50 -40 -23 7 23 1 -92 49 24 -70 -29 89 -103 0 115 -51 -35 43 45 -47 -90 41 22 -68 56 91 -106
2354 -106 -1 120 -31 33 18 12 76 -21 8 69 -92 -19 113 -105 -38 72 -17 21 -26 52 -6 -35 62 31 -100 24
2380 24 119 -45 -51 88 -46 -69 79 -12 -15 -85 19 5 -99 -13 78 -149 23 69 -58 -12 6 -77 -5 -2 16 20 -62 -8
2408 -8 82 -110 -67 105 -39 -42 34 29 1 -74 64 58 -131 50 127 -72 11 134 -7 -64 121 19 -81 -5 -14 38 -44
2435 -44 30 74 -69 -10 122 -67 -46 77 -50 -36 34 -57 1 -62 -45 37 -59 -24 106 -61 -80 72 -23 -26 31 -35 13
2462 13 -57 62 129 -124 0 132 -47 -48 144 1 -62 17 17 -1 -32 32 50 -123 39 84 -142 -44 137 -19 -41
2487 -41 66 -2 -43 -36 -2 36 -70 11 171 -108 -23 138 -123 -8 30 -19 32 -60 11 52 -48 4 124 -51 -19 116
2513 116 -108 -43 105 44 -71 23 -16 68 -136 -8 120 -142 0 113 -64 -7 84 -62 -12 8 8 77 1 2 80
2538 80 -23 -31 6 -62 -31 113 -33 -24 29 -67 34 6 -67 54 -54 -64 98 -44 -85 98 -43 -27 64 38 56 -27
2564 -27 9 86 -55 -57 96 -120 -57 103 20 1 53 -51 -9 36 -12 103 -39 1 52 -12 -9 87 -59 29 23 -83 13
2591 13 36 -42 90 41 -132 101 21 -80 12 -29 -4 45 -35 79 16 -67 71 -9 -56 57 -37 -128 58 2 -91 32
2617 32 -25 31 23 -10 -18 -24 -75 49 -2 -22 62 21 -3 136 -6 40 55 -39 61 -23 -142 68 33 -71 70 -78 -100
2644 -100 55 -79 22 22 1 48 35 -105 57 1 -92 141 -17 -106 84 15 -52 -11 -7 -11 2 -25 85 31 -72 164
2670 164 -30 -101 33 -38 -63 84 3 74 91 -31 62 8 -98 104 42 -73 117 -94 -20 10 -51 54 42 -66
2694 -66 105 59 -110 80 -2 -101 84 -7 -74 34 0 13 24 -31 73 5 -127 114 -20 -84 73 -3 -86 25 -50
2719 -50 -7 12 -10 77 18 -77 105 64 -132 49 43 -17 35 38 1 48 -110 8 0 -101 136 54 -119 69 11 -29 47
2746 47 -12 -75 -34 -34 90 -20 -94 102 8 -120 65 -1 -105 5 -14 -8 45 21 68 3 -95 66 39 -113 122 64
2772 64 -50 48 -17 -24 -6 -37 64 29 -73 111 -24 -79 43 99 -42 49 48 -13 -12 16 31 -31 -107 54 7 -158 96
2799 96 77 -70 43 11 -94 31 64 38 49 -39 96 -29 -123 98 26 -109 134 30 -81 53 -17 10 27 -56
2823 -56 67 15 -94 98 77 -122 13 86 -113 34 33 36 36 -31 5 76 -139 65 -3 -113 112 60 -33 78 69 -45
2849 -45 6 -23 46 18 -44 80 71 -106 71 29 -111 67 -8 -35 47 14 -1 -28 -105 39 -8 -132 76 7 -60 103
2875 103 -13 -151 71 -26 -13 34 -114 30 43 -90 88 -42 -78 50 62 -66 94 -6 15 44 -40 31 38 -37
2899 -37 107 8 -107 53 56 -99 54 47 -43 24 -68 14 47 -22 146 -26 -99 116 21 -61 64 9 -131 63 -2 -10
2925 -10 46 -34 81 34 -100 94 26 -57 83 -5 -35 140 -12 -30 50 -57 18 59 -85 5 28 -83 -51 -48 -4 46
2951 46 -28 6 36 -79 72 28 -61 108 43 -100 -5 -34 -105 50 20 34 86 -17 -1 45 -56 -22 8 -103 67 -49
2977 -49 -66 55 -9 -21 66 -91 -5 109 -59 16 59 -40 60 -15 -32 46 -72 -4 46 -62 6 103 -6 39 21 -34
3003 -34 37 58 -21 78 5 -33 116 -96 -36 58 -7 23 71 -26 26 -42 -71 96 -30 -18 98 -59 -1 131 -57 -58 87
3030 87 -18 16 8 8 25 -44 -69 91 -62 -8 65 -97 -31 98 -28 16 28 -58 20 -10 -24 41 -20 30 103 -115 -10
3057 -10 2 -95 2 32 -63 21 -11 -46 19 -26 -86 106 -37 -17 143 8 -48 28 -53 -26 -28 24 61 -42 -47 86 -64 -7
3085 -7 134 -94 30 100 -94 -24 52 6 57 -6 27 92 -88 18 57 -84 -32 26 -90 41 55 -73 27 23 -23 44
3111 44 -58 -12 75 -66 -5 16 12 -15 32 -107 43 -20 -64 92 -48 -70 101 -19 -32 153 -32 11 7 -52 66 -12
3137 -12 13 105 -37 63 65 -92 13 114 -49 -10 89 -85 -22 45 -36 -6 -63 1 47 -79 9 7 -60 12 21 -100 95
3164 95 4 -53 130 -43 -33 95 -90 -34 92 -105 -43 60 -22 21 29 -34 31 -1 -22 98 -16 -19 85 -106 -31 40
3190 40 -121 -15 27 -64 23 31 -81 78 -43 -12 55 -68 22 -10 -57 42 -4 -93 26 13 -26 3 -27 -56 118 -56
3216 -56 -3 129 -61 28 9 -18 36 -13 -59 55 -72 17 83 -82 -23 113 -63 -21 88 -92 -30 61 -48 -16 45
3241 45 -25 12 -74 -96 35 -17 -57 -10 -82 60 34 -51 19 -19 -52 83 -8 -74 40 -8 -21 87 -59 -17 5 -65 20
3268 20 -1 -33 74 22 7 26 -55 3 59 -44 25 11 -3 84 55 -60 55 -35 -57 48 -52 13 58 -43 32 46 -30
3295 -30 26 64 -35 62 4 -34 41 -4 -40 55 -38 -35 31 -36 8 12 -56 71 15 -55 -3 -16 -43 91 -52 -12 21 -49 8 70
3325 70 -68 48 25 -90 17 -79 -82 139 -1 20 44 -101 47 24 -95 56 89 -66 49 11 -43 -1 -3 -17 13
3350 13 -24 49 9 -47 23 22 -76 79 -6 -51 22 -41 -74 55 -43 39 38 -86 10 29 -31 -1 43 -86 16 -49 -22 36 -17
3379 -17 16 23 -65 17 54 -90 59 91 30 113 3 -27 5 -9 -9 11 -96 34 0 -58 33 12 -95 20 -8 -12 55 -36
3407 -36 3 44 -34 27 89 -9 28 15 -23 70 -5 -96 44 13 -21 43 -83 33 18 -89 54 61 -97 38 61 -65 47
3434 47 -34 -23 -26 -3 -15 -20 -100 75 -24 -150 59 7 -107 101 30 -22 61 -53 15 75 -5 83 42 -52 63 14 -43 0
3462 0 38 -60 51 -3 -15 44 -37 90 81 -72 51 29 -86 69 13 2 4 57 -60 44 -22 66 -2 -110 47 -4 -106
3489 -106 22 5 -17 55 -12 -18 29 -19 -1 42 -71 83 46 0 31 35 -56 24 -19 -1 36 -4 -34 -13 -16 24 -89 -17 37
3518 37 -35 -35 58 -1 -42 33 -31 20 66 -48 -4 -32 -101 50 60 -86 41 -27 6 21 37 10 13 -26 45 34 26 17 5 -44
3548 -44 68 18 -61 35 10 -9 21 -27 30 88 1 46 -3 -68 31 48 -63 50 -6 40 98 -61 14 24 -58 17 20 -82
3576 -82 5 46 -37 56 -6 -51 61 3 20 12 -32 42 39 -41 47 -2 -21 70 24 -20 62 45 25 87 -61 -17 43 -65 20 54
3606 54 -39 9 -22 -74 58 -15 -21 100 3 -62 11 -95 37 -15 -79 46 -11 12 0 -30 -28 26 -58 -8 48 -70 -18 57
3634 57 -43 -20 10 -97 60 -13 -25 74 42 30 37 -74 -3 37 -101 58 4 -16 104 13 24 29 3 15 67 -57 14
3661 14 -8 -119 77 29 -45 71 -26 -18 58 -6 -30 98 -47 -6 84 -70 41 55 -81 71 43 -1 8 -28 -60 7 22
3688 22 -26 41 7 7 28 -47 46 -23 -15 20 -34 -37 11 -54 30 49 -25 33 11 -49 19 37 24 53 27 -8 58 -4 19 59 8 49
3720 49 47 -14 -25 29 13 -14 -85 -33 19 -45 19 30 -52 -10 15 -26 -5 -9 -46 2 30 -25 33 -14 -57 44 3 6 27 -62 79
3751 79 29 11 35 17 -6 43 29 -53 -1 0 32 0 -17 33 34 31 24 18 -49 55 -65 -65 13 -13 -45 51 -11 -10 -1 -16 -2 -52 -3
3784 -3 49 -52 -22 83 -9 -10 99 -34 -3 78 32 54 19 -16 -12 -36 -8 57 26 13 65 -23 35 36 -29 -38 13 12 -31 -18 -67
3815 -67 44 -46 14 58 -76 -13 4 -89 -24 2 -10 10 50 -37 53 14 -49 110 56 3 9 11 2 66 16 39 27 -47 20 7
3845 7 -32 69 -29 24 67 -56 -6 22 -15 -20 0 -17 3 2 -24 5 20 -27 9 -16 -32 43 -54 -12 70 -30 28 26 -45 -15 -17
3876 -17 37 50 -57 -7 45 45 34 9 -29 13 9 -44 24 -11 -40 51 -21 -27 43 -3 -38 23 -9 31 17 3 17 -36 -17 1 -1 16
3908 16 84 -31 -23 72 -25 -44 64 1 -7 21 -36 72 -12 4 3 -15 -9 9 -57 -13 31 -2 6 35 -37 29 -45 -26 26 -85 13
3939 13 67 -23 44 21 -16 5 -32 -36 33 -35 -19 9 -12 -15 48 -10 -37 39 13 -17 42 -39 19 0 -21 61 -15 -8 2 4 -13 28
3971 28 -67 -12 19 17 -6 -8 -44 0 -19 22 49 4 4 37 -10 8 6 -34 74 34 -38 19 -42 -37 -27 52 -5 -5 24 -10 -34 -16 55
4004 55 -6 -36 44 47 -24 2 -57 -13 -1 -32 -5 59 -9 -10 45 -61 -35 41 -31 4 -52 -20 8 -54 -31 21 -33 5 16 21 -14
4035 -14 -39 -34 3 -65 -42 39 9 -42 23 -55 -6 93 17 -3 -29 -31 48 26 41 13 -28 15 -25 4 -23 33 -12 -31 -87 -1 1 33
4067 33 -28 -5 -12 48 5 -19 16 23 -42 -22 5 -54 5 38 -25 66 4 9 36 10 27 11 -63 -17 72 -26 73 21 8 53 -8 11
4099 11 -44 3 -11 53 71 -42 17 -65 77 -3 -41 12 36 -78 -21 -62 53 -49 -17 -10 50 -22 25 14 -27 43 20 -27
4127 -27 35 1 -30 60 1 31 10 -54 17 77 -66 -37 -19 37 -17 25 -44 -46 -19 53 78 23 0 42 -4 -45 27 6 -56 1
4157 1 -25 58 -35 -32 37 6 19 7 -73 -34 1 -17 -5 -61 -21 17 -2 50 40 21 21 26 -21 -9 30 0 26 -68 -84 -17 35 13
4189 13 14 16 30 70 -5 38 14 -40 -25 -48 -51 15 19 4 9 -1 16 78 5 69 41 2 10 56 -38 1 11 13 43 -49 7 53 -33 24
4223 24 18 -17 15 -24 -13 -35 -26 -23 20 -3 -21 13 -33 5 36 -3 23 -34 -63 21 32 -76 17 -29 79 3 -3 11 49 37 37 -17
4255 -17 -3 23 69 -19 17 49 -3 25 -2 -5 -23 -10 -69 -18 0 12 -2 -15 57 -11 -40 -28 -7 38 -18 -29 -19 53 -37 -8 -76
4286 -76 -74 40 -9 -89 3 8 -18 37 30 0 -8 -12 7 68 33 -43 11 -27 28 -38 -32 12 -63 24 42 -41 -20 5 10 17 -28 13 -5 2
4320 2 2 3 -67 -18 -31 -2 19 -11 -6 -14 -14 22 -12 -6 28 -36 -12 -14 -1 -1 23 28 -6 -23 3 -60 27 34 7 22 3 48 58 -13 5 -21
4356 -21 -42 -31 -4 4 -43 34 -22 3 3 36 14 -30 1 31 52 -30 6 32 67 15 23 14 0 7 -6 -8 -15 22 13 15 13 11 26 7 -29 34
4392 34 83 14 25 -44 33 2 -62 7 -13 -22 -43 -6 -16 42 -9 8 29 -10 9 81 -3 28 -1 -19 21 -4 -23 20 31 -28 -11
4423 -11 3 36 1 -26 44 50 -11 70 53 -8 41 -28 -41 7 -77 -63 -13 -31 11 27 -51 -30 7 -50 26 10 -9 1 -31 -50 -71
4454 -71 45 -26 6 -17 -11 38 19 12 -15 40 35 -10 -13 31 -20 -44 24 1 -34 45 12 11 29 33 -29 12 -29 18 -38 -3 -5 34 2
4487 2 -26 -50 8 -39 -35 16 -11 -31 24 16 15 44 2 15 43 -73 -28 43 -10 22 -35 -23 -9 -4 -2 37 4 -61 19 3 22 9 -24
4520 -24 49 -11 13 -3 -9 -75 -29 -9 -20 -13 2 72 -38 -18 -22 30 -59 16 21 46 0 0 21 28 13 70 59 -37 -16 54 14 -12 -31
4553 -31 -6 -52 47 21 5 -13 1 -33 -6 -9 14 -44 21 14 -62 -17 7 -44 19 41 4 26 9 -25 -18 -49 26 -36 -33 6 48 23
4585 23 17 31 14 14 46 -13 -31 -12 13 35 7 0 65 19 9 -41 -54 -7 -34 35 16 13 -23 43 -31 24 44 -38 8 -34 -19 -25 40
4618 40 -28 -19 2 -22 58 0 18 43 9 24 19 14 17 14 -1 30 -36 -41 -19 1 32 29 -2 65 4 -74 62 -40 -13 -2 19 -12 24
4651 24 -8 0 -34 19 -19 -35 -2 9 -56 47 -13 1 3 39 -34 20 -1 -19 28 -33 -18 72 -8 -29 40 1 22 -3 62 34 -7
4682 -7 -26 0 90 -13 38 13 7 -9 -53 -26 -18 55 37 -5 -52 17 23 6 35 21 -45 -20 1 32 -14 12 48 16 44 51 40 -12
4714 -12 -27 26 16 -27 22 -16 -54 -46 33 1 -34 -31 21 -3 11 -15 -3 -65 -41 -17 -49 17 -14 -8 -15 -21 65 12 4 -2 42 22 -21 19
4748 19 -33 -17 37 -1 20 -32 -12 -10 -14 1 -48 28 25 11 -19 -27 1 9 30 2 23 -4 92 11 -11 13 4 39 -30 -34 -30 23 -78 -23
4782 -23 -73 13 -11 15 24 43 27 -13 -46 15 -16 28 20 -59 -14 -4 29 -7 11 -22 51 -20 51 -34 17 -12 24 -15 -47 10 -29
4813 -29 22 -27 -7 -7 11 17 1 -3 -16 -25 -24 10 52 -52 -36 -65 10 37 55 47 71 8 -21 -21 -3 -56 24 -9 0 14 -29 3 7 -3
4847 -3 25 -1 5 43 0 -35 -2 51 -16 30 -28 11 3 -38 -23 -19 -11 2 -30 -13 46 13 15 -25 42 -38 -15 28 -36 31 72 43 12
4880 12 -1 31 6 11 5 -25 -11 30 -32 12 1 3 -30 34 0 -2 12 30 -64 12 -42 -24 -46 -42 80 -3 -9 -3 22 -7 -27 34 -34
4913 -34 -11 9 -3 37 26 -9 -25 6 -65 12 -2 72 -26 -26 -22 -25 -17 -69 -20 -23 -7 -20 12 25 -33 1 26 -56 -24 3 24 25 -7
4946 -7 -20 22 18 9 16 -50 -7 -3 12 5 49 33 -48 -3 -28 -13 0 -20 11 9 22 78 11 -7 38 -20 38 15 5 0 41 25 -28 -48
4980 -48 -72 0 -1 -8 41 6 -23 72 41 -27 -17 4 -9 -24 18 -59 5 -5 31 -14 -18 35 65 29 -31 73 -3 36 -33 3 22
5011 22 -31 -12 -5 -38 18 33 1 17 -53 32 2 -15 15 62 -44 -14 45 13 -8 9 8 22 -8 5 -22 -23 -4 -29 -71 -26 4
5042 4 40 32 -24 13 -45 -7 53 13 -10 59 -16 -46 -12 -1 -20 8 23 28 0 4 38 -12 29 -17 -19 -36 38 36 -27 -21 -11 -20 27 -23
5076 -23 29 -62 -5 29 -23 -7 12 15 23 -25 47 3 56 2 -14 15 -8 27 -5 -3 -38 7 20 -1 -57 33 43 -13 -25 9 16 -64
5108 -64 -13 62 -57 4 -43 -43 2 8 -65 -13 11 -3 35 -9 -8 28 -35 -11 54 -3 38 -13 33 -11 16 -8 48 -30 -28 -16 35 8
5140 8 23 -25 15 8 -40 -11 -24 26 1 -38 -8 39 -64 -8 27 36 -26 -39 19 1 20 6 12 -26 -17 34 24 42 23 19 24 11 35
5173 35 -19 -32 42 -14 12 -11 -11 56 27 -2 57 -43 -3 -29 -11 27 7 -51 27 -14 -11 -56 -15 -37 6 -5 26 -21 23 12 -3
5204 -3 -27 -13 12 53 23 -66 73 -17 25 31 -15 13 -43 15 68 8 -18 -5 -40 -12 -8 -29 27 37 0 -40 30 -26 -18 13 21 -34
5236 -34 -54 -20 -15 -28 15 -10 12 34 48 18 -2 2 -32 34 -11 -8 -26 -2 43 42 -21 23 29 -18 44 -33 22 -4 -1 -13 65 14 21 36
5270 36 -22 58 22 -27 1 30 -37 -5 -7 -5 -1 -60 -28 55 -12 -39 -5 28 -9 1 -22 3 35 21 -25 4 13 -16 12 24 -1 -18
5302 -18 -48 53 3 -11 -26 -24 14 23 13 39 -29 20 -14 -13 -7 2 7 9 -23 -22 -4 -53 -2 -35 -4 28 -31 -26 53 -31 6 27 33 10 62
5337 62 32 15 54 -13 -51 -2 -31 53 45 -31 35 -47 67 20 -25 8 55 -22 -49 -24 -12 -10 16 -24 40 -13 38 10 -50 13 39
5368 39 -11 18 1 -29 8 -21 -14 31 12 -19 50 44 2 37 43 -25 13 -4 -6 -21 8 8 56 -62 2 6 -32 38 -36 -11 -18 23 -43
5401 -43 -21 -4 43 11 7 -6 13 -29 30 30 -38 23 5 79 -29 -12 -3 -15 1 -24 -23 16 43 -3 1 6 1 -8 19 7 5 -50 -59 12 -22
5436 -22 -37 -21 -4 -3 9 16 -36 17 -10 -51 27 -49 -6 4 -88 36 -11 -44 18 7 12 23 -26 -11 4 -15 33 38 -72 7 -40
5467 -40 -22 54 -5 -50 -26 -9 -15 -72 -40 19 34 -23 -24 28 5 -11 -56 -22 -13 -30 16 -18 -11 2 49 2 28 -14 3 24 34 1
5499 1 87 -32 -14 34 3 -3 7 -9 -32 -9 -28 47 48 -8 24 13 -26 2 -39 -35 12 -50 -21 10 4 -31 -20 -41 16 17 5 -10 -2
5532 -2 7 7 10 -33 17 -67 34 15 -6 -18 41 -47 11 21 25 -15 16 21 36 -6 -1 -17 -66 42 -65 -2 -5 -68 -18 39 1 -31 -27
5565 -27 -34 14 43 -70 -3 21 -27 21 -29 -70 49 8 -15 -37 -2 48 28 31 36 -30 -34 26 -11 -3 28 16 21 30 -8 36 -1 -25 54
5598 54 -4 -39 -7 -54 18 -44 -62 38 15 -15 -10 14 -69 -19 64 -60 -15 -33 -23 56 19 41 -3 -21 52 -29 14 -11 31 -44
5628 -44 17 -2 -15 52 -27 47 -5 6 -19 46 5 -22 -21 -2 -32 -49 36 2 26 -21 53 14 -58 -58 -10 -93 42 -15 35 -3 17
5659 17 54 15 -46 -26 -8 44 -18 -34 31 -7 -2 65 -41 3 32 -1 -59 61 16 19 7 -36 4 -11 -43 -25 -12 -13 -86 -4 9
5690 9 -60 18 9 57 9 9 -8 -30 10 -14 3 -3 -22 33 18 -12 -9 -7 -9 8 -13 6 -7 -3 0 24 38 31 29 -26 18 17 41 -44 -33 -5
5726 -5 35 21 -73 -12 5 1 -75 0 80 18 -21 90 -9 28 0 -17 6 41 21 21 1 4 -1 21 -19 2 17 -28 6 -20 22 12
5758 12 -4 24 16 -19 -24 2 -57 46 41 16 32 -30 24 4 -6 13 -16 -20 -40 -1 -43 -37 6 15 4 52 7 -3 28 31 8 40 -36
5791 -36 47 -4 11 63 -4 -13 26 -41 -9 -18 -40 -20 -52 -14 0 27 13 -15 1 18 54 -7 -14 13 24 -16 14 11 30 24 -11 74 2
5824 2 -10 24 -55 39 -21 -15 38 -2 -27 86 -35 21 6 -13 18 -5 23 18 72 -17 51 39 23 45 62 -18 -2 -32 -17 -7 -3
5855 -3 -38 0 -26 16 -11 6 -28 -38 -14 -25 -17 89 19 -9 79 22 -59 12 44 0 35 -8 54 35 11 -43 55 -20 -2 -33 -15
5886 -15 62 1 -4 26 -17 -6 30 -6 39 -15 16 -43 -64 -41 21 -19 -43 31 47 13 18 0 -32 6 -76 37 -22 -35 -15 3 -37
5917 -37 -1 5 26 50 -8 15 29 -42 30 -26 -38 35 23 -23 63 -63 10 38 6 -39 -31 4 -13 19 -56 17 -35 23 0 19 17
5948 17 5 -47 11 -2 60 22 18 -31 12 31 -10 45 33 -13 -21 -5 23 15 15 75 -9 -43 23 -44 -43 -3 -45 -19 18 -8 -61 11 -27
5981 -27 8 -5 -27 -11 -1 -51 1 15 -61 14 55 -23 11 -6 17 1 -45 50 -50 -19 -12 -1 32 -4 -25 6 40 -32 17 46
6011 46 32 23 27 -32 10 -5 -60 30 43 -22 64 -19 -9 -16 -49 -29 -16 -48 40 -2 2 7 -2 1 -15 -6 -36 -12 3 21 54 -6 13 46
6045 46 -19 -4 0 51 -19 32 -3 28 15 30 45 -36 24 36 -19 4 -34 2 3 -68 -37 -5 -44 -17 -3 -19 -13 11 -37 52 27 -34
6077 -34 90 -16 18 35 6 39 40 82 26 29 22 -22 24 -11 -35 -8 -4 1 51 -13 -6 20 -25 14 41 19 22 18 -14 1 4 -14 -11 -15 -23
6112 -23 22 29 59 -36 41 -31 26 20 30 -55 -18 -16 -7 45 -6 13 65 -25 -1 8 -14 30 -15 17 26 21 0 1 -16 3 -18 -6 8 11 -15
6147 -15 -27 15 -48 -2 -26 -35 43 23 20 51 6 56 -24 -10 14 35 -16 4 -24 15 42 -39 -13 -36 -2 39 -10 -20 33 69 -58
6178 -58 21 14 -21 47 -10 -17 18 -61 -62 44 3 94 36 -9 18 -33 32 18 21 -6 43 9 5 -2 -23 -48 5 -13 -43 11 7 -12 -29
6211 -29 -41 12 -45 -1 -22 -69 1 -36 -25 -35 -46 -84 12 -17 -47 27 -16 -20 -28 12 -21 22 -49 -49 13 -33 12 -13 -66 15 22 3
6243 3 8 -2 -49 46 33 -18 14 -55 -11 -8 19 23 10 24 33 -27 -22 -13 12 -22 5 -13 42 20 -13 18 -9 -80 -16 -69 2 -5 18 -4
6277 -4 -17 -20 -41 29 -29 -27 17 18 14 25 59 -4 -30 37 -1 32 31 3 -19 14 8 15 46 -44 73 32 -27 44 13 -20 0 36 -3 -40
6311 -40 -20 -2 -23 -26 62 50 -6 7 46 0 -45 -26 -38 -2 26 -25 -22 -3 -24 16 -8 24 1 67 52 33 23 34 13 22 -12 4
6343 4 -25 -21 -48 4 40 -39 26 16 -21 11 -21 10 5 -37 -6 -10 -22 11 28 -41 15 4 -38 20 44 -6 27 -42 28 -2 10 66
6375 66 3 82 -18 40 -16 20 38 5 2 17 -25 12 -45 -23 -1 -54 -47 36 -34 -15 15 -12 21 -13 -30 65 -6 6 13 -78 69
6406 69 -19 -15 -22 -12 48 37 36 49 15 17 -36 46 -20 11 -14 3 -21 -33 -33 -40 4 -18 14 49 -10 37 -43 -41 25 -39 -37 3 -13 -1
6440 -1 -42 -7 -30 -13 52 8 12 -31 -4 -5 -43 21 -26 45 19 -37 37 -39 22 60 37 -85 -15 24 20 -35 7 -14 6 25 76 -48
6472 -48 20 40 0 7 35 -90 -11 22 -18 31 -9 -26 53 -2 -10 65 -30 -22 -5 2 -50 -7 -24 55 8 -30 -6 -53 -1 0 10 -11
6504 -11 -5 28 -4 20 -42 24 -82 23 14 23 48 13 -49 -64 -15 -24 -5 -12 -39 -22 16 -31 -19 -6 -7 -22 -20 44 17 15 6 39 -12 13
6538 13 24 -16 24 -9 -2 51 64 -9 -10 6 -3 22 -29 24 28 22 -29 -13 -7 -13 9 -41 3 -20 0 10 -21 7 4 1 16 -67 57 23
6572 23 29 -23 37 6 28 2 17 66 18 -12 -30 -2 -10 -25 -9 29 -31 -7 35 56 51 15 -21 -8 26 25 -4 -4 -6 -24 42 60 26
6605 26 6 -32 -10 24 19 40 49 12 -40 -34 17 -46 63 -29 28 18 10 58 -86 -13 3 18 -32 7 -13 36 15 47 25 -67 -3
6636 -3 -7 -3 -36 10 36 -10 -1 29 22 41 -27 0 6 -42 22 -31 -72 -52 9 -23 -23 7 -44 59 9 35 -48 15 5 12 16 21 16 -2 -19
6671 -19 -22 45 39 42 61 21 9 -4 -26 4 10 -8 -26 36 30 19 4 -8 28 -36 -32 10 77 -17 -24 28 -1 32 31 19 9 54 9 35
6705 35 34 35 2 56 16 -32 -32 6 -12 39 12 -31 43 -27 -27 57 46 10 26 -15 13 -19 -15 25 43 -82 21 10 -11 -7 -12 -8 2
6738 2 28 24 -15 50 43 15 8 -26 44 46 5 38 19 3 35 -23 -40 32 30 7 39 8 67 -34 17 -4 -2 -11 -1 36 46 -9 39 -29
6772 -29 -2 -25 -9 -46 -15 -12 -57 50 -2 11 -48 -12 36 21 -41 23 25 9 20 24 24 1 2 32 22 29 15 -52 -2 8 26 -38 -15
6805 -15 15 21 0 13 -20 -8 18 8 19 -6 -7 -9 -14 -44 -44 26 -55 16 15 49 9 68 -3 -24 41 -29 -18 -4 35 -29 23 35 30 -45
6839 -45 -1 44 25 -12 7 12 -27 -50 19 38 -7 1 20 12 7 -40 63 -21 -32 -32 16 25 -9 -61 -23 11 -11 22 14 -6 15 85 48
6872 48 63 8 15 -24 10 28 -7 15 17 26 26 20 -7 66 -2 44 41 42 51 -7 -48 9 33 -19 -42 24 8 -64 7 -9 -26 31 -23 63
6906 63 32 -28 39 24 -33 -33 -15 23 40 3 24 24 -17 29 -18 -62 19 -9 -17 17 24 40 -17 34 -12 -25 -9 -52 -16 -15 -57 -13 -25
6939 -25 28 -2 21 -17 -50 11 -51 8 19 20 22 -11 12 18 24 12 20 36 30 -28 -21 21 15 -1 38 4 26 19 27 1 -58 -17 -27 -22 20 -31
6975 -31 -26 -15 -13 -10 -3 2 16 6 24 52 -6 42 -20 -44 -53 -20 11 37 82 13 63 57 4 -28 10 16 -13 -73 2 5 -37 -2 -4 -33 35
7010 35 -8 -29 -15 2 -40 -24 -27 26 31 39 -39 -37 40 -35 25 -16 31 43 2 53 36 -34 -66 15 -9 18 36 5 -16 27 -3 28
7042 28 33 25 -44 -3 42 -12 -39 28 -22 22 -21 -15 -49 31 8 -54 15 18 -17 -66 -24 46 -47 41 30 -8 -20 -8 1 -40 13 33 39
7075 39 20 23 -34 -1 -35 9 -8 16 -16 -3 30 9 53 -7 -17 20 17 -33 -3 -15 61 -10 12 4 -25 -22 -29 36 20 -48 -28 40 -15
7108 -15 -20 -17 -2 41 -26 -40 31 28 81 9 -36 21 9 -13 25 -19 39 24 14 -56 -8 -41 -25 24 -30 -30 -40 38 16 3 28 29 70
7141 70 -39 -20 42 -44 28 36 -17 17 24 -62 54 3 12 -63 -25 -13 -19 -4 50 52 28 -54 57 -41 40 -2 28 39 -36 -37 2 55
7173 55 -7 -14 -86 -46 0 21 -44 -5 -33 -32 23 9 37 -14 2 -72 -38 2 4 -16 29 -63 -22 -60 -32 49 15 6 -30 13 37 12
7205 12 44 23 1 1 -44 0 29 37 -2 -13 -28 22 -4 0 30 -38 -21 -34 -46 -30 -32 -18 58 9 13 -1 29 -45 -5 -10 -12 -36 -23 6
7239 6 24 23 -5 12 28 -19 30 83 22 57 34 -25 21 -10 -23 14 34 29 1 -47 -10 10 23 -48 12 -33 -10 -44 -42 22 -34 -19
7271 -19 -13 -39 -8 16 18 39 26 -41 -36 -1 82 57 5 -41 28 2 13 38 -5 -36 -27 -55 22 27 -9 -39 -4 -45 -7 -16 -8 -65 0 -14
7305 -14 -9 24 -5 -1 -9 -48 -2 -7 -21 19 -43 -16 6 48 27 13 37 -22 32 -11 3 80 37 22 19 21 -10 -27 55 13 -47 -11 -14 -23
7339 -23 13 -49 11 11 5 -20 15 -25 18 80 -24 30 -4 1 18 -2 -3 15 42 16 8 -16 10 2 28 10 3 -6 21 3 -11 -16 -9 -1 14
7374 14 -77 25 -25 -6 -2 15 45 5 77 22 -11 7 -8 -28 9 28 -55 25 -14 -13 8 -1 21 -37 -60 6 63 -2 0 -31 -18 33
7406 33 -42 9 -15 -5 46 -6 -36 21 7 -27 -44 -56 31 -25 -44 28 -3 -4 3 44 31 9 3 -14 -19 8 29 -35 -38 48 -30 -50 3
7439 3 -21 42 26 -41 -58 9 18 -5 11 20 14 41 41 9 2 -1 16 -17 -2 -52 -16 -1 10 -2 46 -6 -3 72 29 -54 -43 -13 -28 -24 -18
7474 -18 -16 24 -6 -41 -14 13 -33 -10 31 -25 -23 20 -7 13 -17 -3 45 17 30 -36 10 61 -2 5 -10 -7 35 2 -3 16 15 -26 -32 16
7508 16 -8 -25 -7 -20 10 26 82 47 24 -37 -35 -38 -23 -37 -13 36 -18 20 -9 -31 -29 13 -38 -37 -38 38 23 25 -1 16 -9 63 29
7541 29 23 51 13 25 47 18 -22 -14 24 -20 -61 -9 -15 -21 -30 -36 14 -14 -28 -4 -2 11 -12 -6 -28 4 -10 -7 25 38 -42 -16 6 -8 7
7576 7 36 17 -31 -21 37 3 -12 1 -18 12 5 -24 -37 -11 -41 51 -19 -13 -26 8 49 -30 14 6 2 -37 -39 -26 56 -5 -28 3 10 51
7610 51 48 -70 -40 7 20 0 35 22 32 51 -18 -18 40 -29 49 -16 1 35 -33 -38 26 12 8 -9 44 32 6 -36 -52 0 -19 1
7642 1 -44 26 2 16 -10 25 -19 -9 19 4 29 39 -1 15 -1 -13 20 36 68 49 -3 -42 72 4 50 -18 -32 46 -11 -18 -27
7673 -27 34 -9 42 34 14 -5 9 -28 18 -63 -1 -26 -8 -5 -3 15 -4 -4 35 -33 13 -30 -4 24 -26 -5 22 59 30 -7 49 -8
7705 -8 -61 25 21 6 9 10 -41 -40 -31 9 9 -26 10 -3 50 1 0 -7 -12 20 -29 15 -26 0 24 -7 -9 -10 6 -30 -33 -2 -3 25 -34 -26 -29 -18
7743 -18 73 41 -61 54 49 15 35 -42 13 21 7 -28 -7 9 -18 -17 7 -38 30 60 7 19 27 -1 20 -62 -17 2 20 -33 -20
7774 -20 -13 19 46 23 9 -13 34 -48 3 -26 -22 37 33 63 -7 29 59 11 -1 -74 -18 -4 -16 -3 1 -53 -30 -10 -44 17 31 -34
7806 -34 25 -1 -28 49 30 45 -24 34 -16 17 14 -11 35 36 63 20 20 -37 -4 27 21 9 29 10 12 11 -44 -3 41 14 -23 -38 13
7839 13 25 7 25 27 14 -9 14 -10 -19 28 45 -2 11 -9 -11 39 -4 8 33 -6 -20 -10 -22 -28 -34 14 -3 22 -9 44 5 -9 0
7872 0 -19 17 -4 -9 36 -28 42 29 1 44 39 -22 12 -4 4 -6 45 1 12 -29 -21 48 -2 12 42 1 49 -6 -13 2 10 -4 14 32
7906 32 -13 62 47 -40 43 29 -6 -29 -14 19 26 45 39 26 -21 -4 -12 -8 5 -29 -15 43 -41 39 -30 7 -12 -15 17 -22 -17 9 24
7939 24 -45 28 33 -35 47 -8 1 53 7 24 24 16 -36 13 34 6 -7 -3 72 -2 7 10 -34 -15 -1 6 19 12 -32 -2 -3 -2 37 -49 -20 26
7975 26 1 -26 -27 51 8 15 -4 13 13 33 24 24 0 -9 37 51 -60 12 -65 43 6 16 20 -51 -4 29 -13 -4 4 -21 47 -7 13 -58
8009 -58 44 -14 49 -17 -10 37 22 -14 95 -33 -52 -13 -36 28 4 -58 21 8 -15 28 6 -14 -56 -24 16 21 8 -29 -38 15
8039 15 17 3 23 -6 33 -16 17 -19 10 -43 -12 -2 63 -3 19 -9 -12 15 -49 22 -5 -49 -15 18 13 15 33 -38 -59 4 -13 30
8071 30 37 3 0 -38 19 -5 36 39 -18 49 36 -1 -28 27 -42 -17 31 30 -14 -24 29 17 -1 -26 -36 65 -14 1 -68 48 -4
8102 -4 29 -24 6 -20 -1 4 42 33 25 55 -25 12 42 18 -66 37 24 9 -28 -16 25 -14 -6 1 -27 8 18 40 -9 9 -14 -63 5
8135 5 -8 -48 26 -5 8 -39 -14 -7 14 54 -33 -25 -26 11 -33 11 23 -88 8 8 -16 28 -12 28 29 40 -21 48 49 7 38 -32 -46
8168 -46 16 -21 43 -37 18 -32 -31 74 -29 17 49 -33 63 26 -20 17 -1 15 13 1 -19 16 7
8191G
$$ Imaginary data points
##PAGE= N=2
##DATA TABLE= (X++(I..I)), XYDATA
0 0 0 0 0 0 0 0 0 8 -8 8 -8 16 -24 24 -32 40 -48 56 -72 88 -104 125 -144 173 -200 237 -274 318 -366 421
30 421 -480 548 -621 702 -796 894 -1005 1125 -1258 1403 -1561 1735 -1925 2130 -2358 2604
46 2604 -2872 3166 -3490 3846 -4235 4665 -5142 5676 -6272 6942 -7708 8584 -9604 10809
60 10809 -12253 14021 -16247 19151 -23102 28820 -37844 54227 -93190 372313 -3049 -745162
72 -745162 492028 412845 -591723 -101537 600321 -235967 -389707 378092 156590 -421686
82 -421686 68663 287195 -196573 -157551 214577 9149 -154338 41081 90970 -62725
92 -62725 -69002 37786 70088 -73868 -77987 123469 56464 -174966 27070 194024 -128899
103 -128899 -155122 229267 48407 -274417 106106 245272 -249156 -119188 320188 -62646
113 -62646 -289842 223790 164588 -293978 17430 284490 -156034 -177725 241363 44510
123 44510 -239770 86552 178086 -158580 -68216 172170 -30587 -132626 77252 62059 -89321
134 -89321 -22867 68022 5335 -61660 -12502 57176 -7286 -79596 26030 79204 -65219 -59470
146 -59470 110722 19665 -136264 48534 128618 -122119 -69786 176111 -14997 -161933 113655
157 113655 101586 -167396 -6554 167707 -81973 -116416 145364 44119 -158594 38136
167 38136 126062 -108471 -68481 128903 -8958 -111298 66000 68058 -85967 -21936 79699
178 79699 -10168 -66000 27782 54226 -37434 -37756 49347 19112 -61730 -6194 59408 -20639
190 -20639 -62771 46454 52646 -76538 -22938 95977 -27133 -90550 77209 54674 -101201
201 -101201 7586 105693 -53655 -71480 91587 27729 -102357 25413 91709 -67523 -51461
212 -51461 93227 -128 -91380 39244 56809 -67358 -24188 67961 -5963 -59473 25927
223 25927 43411 -45800 -29294 52596 4779 -53524 18302 46813 -32675 -32961 44444 18027
235 18027 -53723 4156 60705 -28437 -46924 58624 21024 -72157 12985 62404 -46263 -41061
247 -41061 64541 12641 -67762 20009 59452 -49632 -36545 67656 2074 -65777 33482
258 33482 47924 -52817 -20430 55325 -7565 -51836 25234 38934 -40433 -19704 51230 -2856
270 -2856 -48717 25382 34397 -39731 -14644 44880 -1780 -41500 18127 34316 -36098 -23946
282 -23946 45483 94 -47970 24234 37189 -39629 -15719 46353 -3935 -42721 22786 35282
294 35282 -36499 -17867 47636 -4424 -47496 25198 30745 -41999 -11803 43775 -7210 -37700
306 -37700 22924 28796 -34672 -14870 42180 -4622 -40418 25345 28151 -37806 -9354 39032
318 39032 -9464 -34289 22758 25456 -31600 -9454 40531 -6404 -36245 25861 23115 -37217
330 -37217 -5174 36472 -12431 -30325 22462 18697 -31948 -8037 34687 -8324 -31823 24546
342 24546 20923 -33395 -4183 33135 -11646 -28181 20528 18482 -28545 -7185 33853 -6617
354 -6617 -30721 23816 21087 -32410 -2499 34737 -11582 -26191 23319 16020 -30239 -4538 31591
367 31591 -11403 -28181 25118 15497 -32687 1351 30353 -15646 -21803 22904 10815 -26561
379 -26561 -625 26828 -10856 -22857 22055 12568 -28316 1451 26807 -13447 -19809 19992
391 19992 10078 -25093 -2475 24834 -10252 -23085 21378 13109 -28008 2685 28641 -13878
403 -13878 -18203 24365 10191 -24965 2795 26005 -12884 -19717 23524 8238 -28469 5727
415 5727 23858 -18197 -14970 22335 3535 -23375 4053 19418 -13804 -16241 19032 5345 -24185
428 -24185 4699 20274 -14381 -12596 19410 5209 -19075 3425 19656 -10022 -15336 19084
440 19084 7911 -23703 3993 21620 -15099 -14157 20601 4219 -21162 5761 19636 -13609
452 -13609 -13038 21772 3763 -23971 9155 19922 -18060 -9172 21579 -1161 -18835 9116 13525
465 13525 -14976 -7694 18334 -996 -19633 8865 13796 -16734 -7510 16065 -1858 -15001 6116
478 6116 10909 -10868 -7812 14680 1505 -17495 6731 15938 -13079 -7970 18038 1934 -15126
491 -15126 6797 14005 -10762 -7485 17710 1414 -18736 8911 14869 -17505 -7446 18112 -3782
504 -3782 -16281 9494 9640 -14302 -3872 15610 -4012 -15258 11101 9848 -15552 -1403 15103
517 15103 -5674 -10560 8981 5014 -10458 -1321 10986 -2307 -10395 7143 7835 -11204 -3346
530 -3346 11230 -2630 -9673 6262 7429 -8498 -4269 12065 696 -13085 6817 12473 -11355
543 -11355 -4230 15668 -2424 -12690 9031 7963 -13538 -3345 14425 -3942 -14606 9467
555 9467 8379 -15455 -1609 13214 -7681 -9042 11162 2586 -11402 2108 9929 -5327 -7975
568 -7975 7834 4813 -8579 783 8296 -3652 -4311 5755 1853 -5817 -501 7021 -216 -7871
582 -7871 3879 7954 -8038 -4491 10023 -1471 -9269 6656 6365 -9733 -1956 11726 -3401
595 -3401 -11870 8988 7674 -13534 54 13678 -7756 -8624 11812 859 -12357 4090 8835
608 8835 -7897 -5327 9419 662 -10030 3307 6644 -7220 -2650 7401 -581 -4946 2352 4132
622 4132 -1743 -3821 3447 4621 -4982 -1272 8159 -1408 -6928 5475 4852 -8122 -2200 9349 -1971
637 -1971 -9550 6919 6227 -11952 -646 11691 -7837 -8340 11953 1263 -12102 4739 8705
650 8705 -8703 -4560 9773 -677 -9135 6049 6508 -8631 -962 8672 -3646 -5941 4957 2444
664 2444 -4336 -939 3703 762 -4129 481 4634 -2527 -3465 5259 2669 -5222 325 6545 -2209
679 -2209 -6561 5395 4570 -9023 26 9992 -6075 -7003 10042 583 -10922 4553 7628 -8428
693 -8428 -3469 9748 -1429 -9447 5539 5584 -9490 -792 9040 -4379 -5477 6854 1384 -5958
707 -5958 1209 4121 -2095 -2875 2806 2631 -3144 -1050 3910 -229 -3536 1415 3387 -1755 -2832 3916
723 3916 2686 -5818 75 6770 -4595 -5264 7759 667 -8254 3874 5883 -6994 -2757 7759
737 7759 -1370 -7542 5254 5257 -8114 -610 8381 -4582 -5686 6834 896 -6488 2268 4405 -3545
752 -3545 -2466 3707 672 -4160 527 3674 -2055 -2238 2855 1044 -2402 -492 2414 617 -3110
767 -3110 890 4371 -2909 -2961 5363 23 -5898 2985 4004 -5102 -1457 5874 -962 -5495 3670 4033
783 4033 -6182 -791 7003 -3123 -4768 5927 1228 -5998 1824 4085 -3556 -2246 4008 812
797 812 -3978 1066 3694 -2840 -2266 3571 34 -3179 1130 2185 -1289 -1869 1382 1708 -2817 -1309
813 -1309 3743 -841 -3781 2907 2059 -4068 -348 3808 -1341 -3385 2916 2729 -4146 -371 5266 -2210
829 -2210 -3822 4770 1358 -4799 1691 3808 -2918 -2060 3311 446 -3872 706 3398 -2803 -2242 3847
845 3847 -4 -3593 1620 2082 -2254 -1058 2235 667 -2339 143 2978 -1504 -2432 2886 775 -3298
861 -3298 826 2490 -1829 -1897 2045 969 -2989 -190 3369 -1773 -2657 3664 997 -3684 1454 3020
877 3020 -2281 -1242 2921 561 -2726 863 3006 -2318 -2098 3419 -5 -3552 1620 2003 -2610 -786
893 -786 2148 -352 -2317 665 2013 -1896 -1568 2916 128 -2871 1446 1897 -1902 -641 2003 235
909 235 -1579 555 2280 -1384 -1646 2735 504 -2795 1220 2135 -1859 -904 1986 153 -2106 446
925 446 2122 -1656 -1790 2818 219 -3107 1474 1944 -2444 -657 2302 -426 -2023 991 1810 -1896
941 -1896 -1293 2547 -254 -2663 1567 1351 -2302 -143 1816 -715 -1432 823 1388 -1225 -1119 2111
957 2111 359 -2031 1176 1638 -1508 -204 1805 -39 -1434 630 1866 -1196 -1701 2156 523 -2831
973 -2831 881 1762 -2218 -669 2015 -703 -2140 1026 1549 -1889 -1228 2656 -67 -2526 1606 1518
989 1518 -2333 265 2093 -1084 -1206 1533 956 -1650 -578 1994 -209 -1897 1251 1113 -1749 67
1005 67 1596 -699 -1015 908 1108 -1096 -859 1939 340 -2233 1034 1704 -2029 -470 2104 -671
1021 -671 -1768 1174 1232 -1878 -864 2253 -327 -2506 1665 1322 -2603 152 2297 -1353 -1280 1760
1037 1760 649 -1680 32 1788 -617 -1385 1580 733 -1900 598 1652 -1154 -777 1269 561 -920
1053 -920 -322 1288 -12 -1455 992 973 -1841 -7 1799 -1018 -1420 1298 894 -1562 -486 1818
1069 1818 -446 -1714 1575 951 -2369 616 2177 -1691 -1116 2036 210 -1720 467 1396 -980 -1029
1085 -1029 1537 154 -1760 919 1259 -1567 -342 1385 -249 -808 286 711 -261 -781 770 584
1101 584 -1304 203 1222 -894 -792 1078 276 -1172 -110 1198 -401 -1369 1114 787 -1829 357
1117 357 1763 -1415 -806 1758 -132 -1446 822 1121 -1040 -651 1480 -36 -1617 970 1070 -1462
1133 -1462 -79 1346 -714 -692 749 223 -582 -186 703 90 -798 327 790 -821 -341 803 -71 -612
1151 -612 156 461 -219 -669 704 621 -1340 172 1389 -918 -661 1400 19 -1010 590 817 -792
1168 -792 -439 1141 47 -1254 674 960 -1396 -202 1231 -674 -783 784 119 -680 2 544 -167
1185 -167 -627 504 495 -750 -48 754 -310 -380 388 202 -268 -282 341 318 -809 -5 861 -678 -524 976
1205 976 -65 -826 479 566 -501 -297 810 170 -951 427 879 -971 -212 1178 -533 -791 827
1222 827 199 -835 -1 499 -314 -640 465 373 -832 -1 732 -562 -396 605 25 -314 74 316 103
1241 103 -435 159 640 -480 -221 871 -90 -520 482 304 -395 -126 545 122 -670 294 658 -791 -246
1260 -246 927 -433 -767 718 197 -764 47 503 -285 -499 493 393 -698 54 809 -481 -386 743
1278 743 -46 -469 200 239 -141 -218 160 268 -385 -61 581 -222 -358 517 182 -336 24 376 71 -316 226
1299 226 547 -396 -239 807 -261 -673 576 144 -701 27 406 -326 -519 258 237 -691 -73 694 -465
1318 -465 -422 650 11 -453 429 320 -266 -48 373 245 -303 1 541 -187 -272 525 37 -425 185 133 -140
1339 -140 -153 136 290 -285 -114 553 -136 -495 498 122 -492 144 362 -186 -337 246 241 -484 -111 551 -430
1360 -430 -536 538 -23 -589 309 324 -431 -115 298 86 -383 84 507 -286 -240 555 43 -363 370 229
1380 229 -232 22 281 100 -287 -99 439 -184 -335 398 24 -487 159 201 -387 -210 245 133 -395 -131
1400 -131 404 -258 -386 436 63 -494 271 316 -385 -3 409 24 -305 143 424 -305 -312 472 -41 -415 369
1421 369 161 -450 63 333 -134 -219 154 294 -210 -233 422 -16 -346 284 135 -316 26 233 -43 -212 19
1442 19 194 -255 -257 354 -86 -449 198 201 -401 11 312 -87 -222 124 206 -215 -119 430 5 -366 363 137
1464 137 -448 50 327 -172 -176 117 95 -236 -96 279 -115 -362 351 129 -372 157 235 -156 -126 65 125 -114
1486 -114 -99 223 -3 -280 316 145 -363 70 228 -64 -94 71 131 -62 -84 314 -17 -202 266 219 -318 91
1508 91 266 -142 -135 163 101 -131 -23 180 -54 -231 192 32 -300 69 187 -198 -4 121 -51 -97 8 50
1530 50 -51 -144 164 92 -200 14 164 -121 -67 58 38 -22 -91 164 79 -172 205 206 -221 46 206 -73 -72 146
1554 146 18 -125 -68 166 -28 -213 155 141 -277 -8 222 -138 -69 129 -39 -38 -16 74 -33 -120 115 67 -124
1577 -124 6 164 -97 9 86 15 43 -22 71 103 -121 56 175 -97 -63 183 -58 -74 46 22 -58 -66 118 17
1601 17 -187 132 203 -258 -60 251 -75 -73 158 15 -64 -14 69 84 -132 63 121 -241 -13 162 -138 -85 65
1624 65 -72 -37 14 47 53 -62 51 130 -143 9 140 -115 -57 30 28 -76 -46 72 36 -203 -18 146 -209 -108
1648 -108 141 -99 -174 127 37 -203 -2 135 -7 -128 108 139 -145 8 202 -79 -81 196 -39 -75 70 51
1670 51 -53 -29 45 31 -65 -1 144 -56 -127 90 -41 -81 33 37 2 -88 -5 128 -132 -98 188 -78 -160 145 54
1695 54 -136 -54 93 -23 -154 105 153 -125 -50 200 -81 -119 193 67 -126 105 78 -40 6 94 98 -12 -38 83
1719 83 -48 -54 138 1 -42 6 25 20 -56 -5 28 -44 -107 128 -6 -145 77 78 -88 20 111 -9 -70 35 135 -28
1745 -28 -37 188 -24 -167 217 46 -126 40 109 -91 -70 56 72 -153 26 124 -60 -89 114 40 -52 73 59 -7
1769 -7 27 -8 -18 -9 -57 3 -54 -108 5 65 -131 -18 44 9 -78 -35 119 -42 -91 128 10 -149 122 142 -163 77
1795 77 161 -53 -38 119 67 -61 -8 120 -50 -107 134 -9 -131 140 28 -124 20 34 -81 -63 -33 9 -46 -70
1819 -70 30 31 -81 -18 49 -34 -75 3 21 58 -63 89 54 -111 46 86 -78 4 136 -51 -22 143 -13 -28 33
1844 33 77 -41 -98 92 5 -143 64 62 -70 12 62 -48 -14 6 28 -49 -33 24 23 -84 34 52 -122 -22 83 -11
1870 -11 9 14 6 61 -78 27 128 -91 37 76 -42 -44 85 4 -36 -6 86 70 -127 47 29 -145 -68 60 -94 -12
1896 -12 149 -75 48 49 13 -58 -125 50 15 -99 45 37 -109 -35 26 -38 17 12 -20 57 -64 24 118 -44 13 87 -10
1923 -10 -17 47 7 -7 19 67 8 -25 6 82 -66 2 108 -27 -99 19 -69 -56 31 -31 17 -61 26 98 -76 -17 103 -54
1951 -54 -78 84 -88 -5 10 -5 92 -64 17 127 22 -47 80 -26 -18 20 13 -24 24 30 83 -63 1 123 -40 -81 39
1978 39 -8 -67 55 61 -76 -27 34 -7 -31 -18 119 -111 -51 125 7 -93 6 53 -62 38 -12 4 -17 1 52 -31
2004 -31 -65 122 45 -75 85 79 -90 52 1 5 -41 -8 -1 -14 -32 88 7 -92 53 0 -104 17 4 -30 -35 -7 72 -90
2032 -90 -25 61 -43 -101 148 46 -88 23 93 -52 -9 6 29 -44 -100 70 30 -70 142 9 -154 113 21 -76
2056 -76 -10 -2 49 -19 -73 70 -71 -102 56 26 -41 21 24 -62 -5 47 103 -32 -86 97 1 -88 92 32 -166 18 8
2083 8 -48 -26 47 22 7 -41 13 -44 -129 72 -2 -104 99 105 -78 82 79 -11 27 3 70 -38 -30 90 -7 -46 8 11 -49
2112 -49 2 57 -44 8 -23 -5 6 -67 57 86 -64 88 80 -119 -5 73 -28 -98 -69 43 -52 -98 139 8 -118
2137 -118 46 11 -118 -14 65 -55 -16 -12 19 17 -67 35 11 -77 77 67 -40 32 11 -19 2 -76 76 39 -14 125
2163 125 61 -102 75 64 -80 58 26 -3 26 11 77 29 -81 69 36 -84 61 40 -80 23 70 -93 -56 -22
2187 -22 -28 -16 -10 -12 51 -69 53 39 -91 55 132 -40 84 35 -66 35 -51 48 20 -80 68 108 -39 28 75 -16
2213 -16 -41 76 -14 16 -37 -35 5 -133 -10 82 -136 -10 83 -61 -3 55 10 -43 -19 -14 -2 -87 44 76 -119 24 118
2240 118 -87 -75 74 -61 -22 9 22 38 -33 18 -20 -83 78 79 -26 43 70 21 16 48 -49 42 -87 19 69 -50 8
2267 8 18 -54 6 62 -38 46 -33 47 47 -91 -33 36 -127 13 41 -53 9 118 -22 2 53 20 -23 -30 49 71 -97 35
2295 35 113 -76 -56 43 -24 73 58 41 42 6 5 70 -72 -86 45 -72 -25 27 -14 9 56 -82 3 -80 -18 80 -72 19
2323 19 123 -47 -131 92 -24 -27 20 -1 14 -56 8 71 -79 -9 230 -15 6 68 5 -13 56 -65 -1 -28 -21 65 -77
2350 -77 -43 109 -27 -90 76 -82 -59 4 18 37 -49 -32 104 -10 -70 100 -90 -107 122 -47 -22 -1 -52 -8 -37
2375 -37 51 82 -67 -30 132 -130 -67 107 -50 -99 90 -52 -26 -23 35 46 -34 -52 52 -79 -50 158 -43 -38 64
2400 64 -36 4 31 -66 52 -56 -51 156 -27 -30 98 -24 -108 81 16 -46 18 8 79 -53 3 116 -78 -25 134
2425 134 -23 -147 116 -15 -53 38 45 16 -58 42 65 -42 -104 104 -86 -73 65 -21 -65 10 42 43 29 -56 125 -56
2451 -56 -39 107 4 -99 69 -12 -53 -2 -6 -15 -43 -31 131 -38 -46 234 33 -92 140 6 -86 69 17 -47 -33 24
2477 24 52 -53 -41 194 -40 -88 133 -64 -165 28 -48 -60 15 -14 18 -57 5 76 45 -45 145 -23 -38 57 38 -20
2503 -20 31 -74 44 2 11 93 20 -81 132 35 -117 133 24 -60 -9 -3 -28 -21 -45 117 -74 -105 112 -54 -57 124
2529 124 -5 -131 72 -28 -31 43 -78 13 -43 -17 94 -22 -55 136 -31 11 72 -13 13 51 -14 62 -46 -36 100
2554 100 -33 -110 120 43 -51 88 33 4 -11 -65 0 -62 -92 68 -20 -100 131 52 -137 110 -15 23 16 -14 54 -16
2580 -16 -28 107 73 -93 84 18 -46 80 24 11 65 -60 60 67 -95 70 63 -81 82 28 -102 32 -15 -79 7
2605 7 -15 21 86 -115 43 33 -67 37 15 -108 61 2 -3 73 13 13 1 -77 12 71 -76 58 40 2 97 14 -29 108
2633 108 -26 21 78 -56 80 22 -151 24 28 -110 35 -2 -10 -6 -30 -27 95 -117 75 20 -112 73 87 -76 40
2658 40 40 -85 11 -10 40 51 -99 123 63 -95 93 -1 -74 74 85 -66 74 -16 -63 42 -73 33 34 -101 76
2683 76 65 -75 -4 37 -72 0 -2 13 2 -43 28 54 -70 40 109 -113 35 33 -47 74 37 8 55 -53 22 18 -136
2710 -136 70 41 -55 110 72 -136 51 32 -62 95 2 27 58 -85 49 60 -126 -43 22 -58 3 -34 9 5 -51 25
2736 25 54 -75 39 133 -114 -5 122 -110 -16 44 8 -5 -28 63 106 -92 13 60 -123 37 74 -103 -9 85 -46
2761 -46 85 2 51 83 33 126 118 -91 70 58 -100 -11 19 -43 -21 -74 48 111 -77 -9 50 -133 -4 111 -160 -4
2787 -4 41 -12 22 23 7 20 -67 33 62 -42 47 78 -156 -78 80 -112 6 33 -7 83 -1 31 40 -67 43 86 -88
2814 -88 21 143 -81 32 1 -76 -44 -33 -11 75 -118 -9 117 -142 -2 37 -67 -10 95 -34 21 -14 -13 57 -88
2839 -88 -41 88 -88 -50 119 -42 49 46 -102 -8 -4 -5 50 -20 23 88 -83 -8 130 -110 6 111 -43 -17 48 15
2865 15 61 -68 -46 39 -36 59 125 -70 -26 79 -96 15 66 -3 20 -26 -6 50 -54 9 93 -89 -5 67 -86 84
2891 84 27 -2 47 -57 -5 78 -134 15 85 -143 -14 79 -113 16 39 -89 41 13 -22 91 -54 -24 79 -58
2915 -58 0 127 -68 112 103 -17 73 -3 3 20 -14 -13 40 -26 49 71 -132 -1 1 -117 65 16 -79 47 -40 42 84 -73
2943 -73 -54 44 -15 102 -35 -102 13 -17 3 18 -19 -58 65 -60 38 59 -28 47 66 -82 57 96 -35 93 4 -48
2969 -48 52 -5 12 88 -15 -6 24 -44 41 -45 -75 78 -31 -12 46 14 -23 14 -23 -8 21 -62 26 28 -84 85 -56 -65
2997 -65 147 7 -46 107 -44 49 54 -58 4 -51 -38 28 -2 -34 60 -22 -22 69 -30 -28 53 -70 -32 34 -99 16 -40 -70
3025 -70 54 -28 -10 61 14 -55 69 25 13 -39 -51 89 -3 -49 108 -55 -32 133 -43 -6 85 -60 -47 24 -32 44
3051 44 8 -6 84 -2 -34 106 -82 -57 74 -93 -40 64 -101 47 44 -100 45 5 -62 94 -34 -82 64 -32 1
3076 1 -16 -36 61 -25 -8 90 -33 -25 52 -15 -37 105 -20 4 52 -1 28 32 -44 31 -16 -45 103 -70 -29 59 -38 -27 54
3105 54 -63 -1 34 -94 35 -12 -73 40 -18 -51 122 9 -79 47 12 -11 34 -15 115 18 -123 129 1 -85 92
3130 92 -58 -25 112 -21 42 44 -61 9 -58 -26 78 19 -29 81 -23 -58 95 -99 -2 56 -23 -26 9 -40 -5 30 -92
3157 -92 56 0 -76 18 -79 6 43 -53 77 58 -71 66 19 -45 104 -33 -49 94 4 -17 51 -56 -9 1 -44 7
3183 7 -46 -36 101 -13 -36 27 -51 -57 88 -9 -31 28 -18 -12 6 -36 62 -29 -34 73 12 -88 48 -9 48 68 -50 99
3211 99 53 -29 108 -39 -60 123 64 6 61 9 -79 100 -9 33 10 -56 40 -37 -80 98 -32 -24 114 -89 -27 58
3237 58 -40 7 14 -72 59 -56 -36 79 22 -42 61 -63 -10 109 -2 16 33 -86 25 66 -113 90 -9 -33 75
3262 75 13 -47 66 -71 -22 18 -48 28 -43 -107 9 -57 -29 28 -7 -13 57 -72 -46 33 -78 45 46 -13 38 9 -27 137
3290 137 21 5 96 -12 -30 73 -54 71 57 -63 57 56 -27 24 11 -10 68 -76 18 68 18 3 -9 -116 61
3315 61 -14 -65 56 -23 -41 63 -30 -78 19 -37 32 99 -42 8 13 39 25 -4 3 64 -76 -29 82 -19 20 102 -18 35
3343 35 52 -54 67 45 -7 54 -10 -33 53 -84 17 42 -111 22 32 -131 -6 31 -52 41 -29 -30 72 -109 43
3368 43 68 -28 41 20 -52 -7 61 26 14 -5 -28 93 -38 -20 75 -23 10 102 -91 11 75 -55 -9 55 -46 32 -32
3395 -32 -13 62 -100 -34 54 -80 33 -15 -68 -8 -9 -9 15 -37 -8 97 -42 49 97 -45 7 59 -25 40 45 -36 -9 4 -5
3424 -5 118 -34 -23 76 -68 -31 91 -98 -6 -20 -19 -23 31 -23 13 -58 40 19 -64 -49 61 -133 3 4 -45 5 -39 35
3452 35 41 -23 52 100 -97 28 116 -17 30 12 -63 57 32 -24 8 25 -8 87 -79 -24 58 -98 21 -9 -54 4 10 -32
3480 -32 -6 -29 -58 83 -92 39 15 -119 28 26 -155 9 31 -81 -43 -49 -37 5 1 4 71 -85 42 63 -28 21 3
3507 3 -65 72 -41 -8 38 -9 18 52 28 1 39 -122 32 23 -27 -1 -21 -68 48 -63 -15 36 -129 -9 16 -78 10
3534 10 23 -48 -43 0 -55 43 -17 10 7 -16 -11 29 -56 67 20 -100 67 0 27 55 18 -41 63 -9 -38 57 -120 -28 -5
3563 -5 -95 -8 -5 -68 18 -24 -4 -29 -36 -12 8 -5 -35 28 -32 33 33 -45 -7 31 -25 39 31 11 42 -32 15 44 -24 -4 12 -15 39
3596 39 38 13 28 -22 -76 43 -43 -8 91 -76 -10 -45 -109 -33 -94 -107 21 -25 -77 -31 -60 6 11 -5 12 53 -57 -14 17
3625 17 -66 77 20 -27 53 -35 34 57 -40 56 76 -50 113 72 -59 44 4 36 49 -6 -34 21 -27 -12 4 -22 -18 16
3653 16 -102 10 -21 -3 7 -24 3 40 -6 -14 31 -37 9 -13 -74 38 19 12 13 53 -18 7 11 -1 51 -6 -8 16 -17 -5 38
3684 38 -23 35 -4 -72 67 -30 -39 54 -65 -21 18 -34 61 -26 -73 37 -50 -16 -11 -43 -66 37 -36 -19 94 -53 13 30
3712 30 -30 63 2 7 73 33 46 42 -6 -7 30 -41 -61 46 -17 43 14 -77 6 17 -98 5 -16 -61 28 -33 -16 22 -5 -27
3742 -27 0 -68 71 69 -58 10 15 -59 61 6 -6 49 8 24 -4 -56 76 31 -54 37 -12 -39 36 10 7 -32 -14 87 -91
3771 -91 -39 -15 -7 -46 -12 -31 -69 -4 -34 54 22 -70 -3 70 -37 18 -13 -42 29 63 -21 38 16 -61 38 -30 63 35 -4 -41
3801 -41 32 27 8 2 -21 37 -20 -28 6 17 -51 11 -59 -30 -48 -20 0 -36 -47 36 -6 -16 35 -4 16 16 26 -9 32 -31 9 37
3833 37 2 71 -5 -11 22 -56 11 -26 45 30 -37 -34 41 -60 -19 25 -20 -74 97 -40 -59 14 -69 30 31 -59 -23 -16 0 9 -63
3864 -63 -32 5 -49 -7 -31 -20 -4 32 -6 31 12 1 70 10 -10 41 26 -53 80 3 -32 38 3 75 45 -11 35 38 -56 3
3894 3 3 -32 -16 -45 -3 56 -25 27 -19 -1 13 17 -38 -41 17 -26 14 -9 6 1 -16 50 -8 -30 35 10 -53 16 16 -2 14 60 9
3927 9 30 -39 -10 37 -1 48 -29 1 -38 -1 -31 39 -59 -23 32 -13 -22 19 -10 -20 23 -61 17 -10 -34 -15 -6 2 12 -89 -39 31
3959 31 31 25 -9 -15 12 -37 -35 95 -24 3 38 0 -10 15 47 12 -32 -2 -4 -1 -16 19 1 -67 51 -77 -106 -15 -32 2 -29
3990 -29 -11 4 6 -11 95 7 -38 60 -23 48 -37 -46 -15 25 -6 -11 31 10 68 -28 -31 68 18 -20 19 -36 -32 55 -6 -41 20 -4
4022 -4 -22 -68 -19 23 13 -70 28 -37 -49 5 3 44 -10 -32 36 -25 39 3 -15 19 -7 -18 -9 42 51 -3 42 25 -11 -2 -21 34 44
4055 44 29 16 -15 -47 2 -1 8 55 -5 -10 -26 35 37 -19 -15 25 -19 -23 -2 8 13 51 5 -8 38 -52 12 -37 5 33 38 18 -1 5 4
4090 4 40 -10 48 -38 26 57 31 -52 18 23 -43 37 -30 22 -23 -45 -42 23 -7 -11 -8 -43 49 -10 -40 45 -73 -4 53 -7 3 -66
4122 -66 -60 -2 32 -7 -25 -12 -58 -27 34 -7 30 30 68 9 16 58 30 -55 17 31 -36 31 -2 -81 -6 30 60 -5 -18 15 32 -59
4154 -59 31 24 -50 -22 3 21 36 -14 -60 93 11 10 22 -16 33 31 -42 17 -19 12 35 13 22 4 -5 26 78 -25 4 86 2 13
4186 13 4 8 29 -16 -64 12 10 29 27 -17 11 43 -30 44 -10 -81 5 36 6 44 11 -15 19 -24 13 50 -4 21 73 -33 76
4217 76 -4 -45 16 -7 -21 -18 -33 -23 -13 19 -9 13 -39 -25 22 8 38 -18 -8 74 -55 14 49 -62 4 83 8 7 -6 -9 -4
4248 -4 59 -26 -5 -5 33 -1 -9 7 26 11 41 -1 1 31 -27 34 13 0 -22 -22 -11 16 98 -35 -47 -16 -23 -18 2 -34 -41 28 5 -8
4282 -8 -7 -30 -31 14 -5 -21 -35 -2 -55 29 79 10 -24 76 -44 -46 31 -4 -3 -9 -19 6 0 -46 -21 1 -26 8 9 26 -6 -54 6
4315 6 -67 -33 -2 -7 -108 -2 -63 -7 -39 -75 4 56 7 -22 -3 -2 21 -30 0 73 14 -31 35 81 -4 -5 3 -6 28 23 107 -1
4347 -1 2 20 -9 2 10 -20 -15 -13 -20 -64 -1 -30 1 31 -72 -4 -16 -43 -13 -24 7 -8 15 -30 12 7 -8 51 -8 34 0 -16 40
4380 40 -4 26 72 24 17 -22 -22 -5 20 -46 20 20 19 8 96 -61 16 -24 -11 10 -39 34 20 -24 12 -3 6 -3 -14 -19 32 -9 25
4413 25 -13 48 9 67 -21 11 36 -71 55 29 53 49 -30 -24 15 -13 -52 35 3 -30 -29 -32 25 -40 -55 36 -13 -52 -7 -23 -29 -32
4445 -32 4 -18 -43 -7 13 37 -25 -32 27 -14 -1 -12 -47 -11 -20 -11 36 -28 5 9 -23 -78 42 -8 53 15 3 62 0 -20 35 -5
4477 -5 -11 3 -16 8 -17 -25 -31 6 5 -13 -27 3 34 -26 16 38 -26 -25 -21 5 -9 -7 -7 31 45 52 32 14 -18 33 0 33 23 -32 44
4512 44 14 20 20 -69 17 6 -26 -39 -46 -27 8 61 7 11 -15 15 -6 -65 19 17 4 3 8 -21 13 40 -18 29 -1 2 27 -26 -38 47
4546 47 19 -13 29 25 40 50 8 18 40 17 34 24 15 49 9 -87 6 -3 -39 26 -37 61 3 -2 -64 -6 -53 14 -29 30 9 1 33
4579 33 28 -23 38 82 22 -38 16 25 7 -2 -1 52 -14 20 53 -44 24 -23 -20 35 21 -23 20 32 -70 14 -65 6 24 -70 -22 -39
4611 -39 -52 -67 -14 -48 22 13 -10 11 -6 28 -24 28 28 8 -31 56 19 -46 -10 -23 -8 -17 -2 -5 -4 34 39 15 -22 2 23 -25 -53
4644 -53 20 -38 23 6 -69 -27 -22 -4 -22 -40 -9 -27 -17 -24 -20 -21 31 -35 -29 18 34 25 41 -8 22 36 -35 -1 -1 34 37 11 12 22 11
4679 11 25 2 -5 8 -22 0 22 2 23 -22 -48 -25 54 6 -61 -9 -8 52 -14 -5 -66 38 -21 17 84 31 39 26 17 60 -28 7
4711 7 -14 26 18 7 -16 2 31 40 39 -7 -44 -29 -35 -12 0 2 -6 -19 -7 -30 -40 -35 40 -49 -22 -47 -12 -10 39 6 0 60 -39 -31 40 0
4747 0 44 54 4 28 26 22 -32 16 59 -27 -6 19 35 20 28 9 -17 26 43 50 -11 -12 20 -42 -25 -13 -12 6 -8 0 -34 6 -28 -44
4781 -44 -13 29 -27 22 -44 25 -21 -22 4 2 13 -56 48 67 66 31 15 8 2 5 -39 7 29 -1 23 86 2 -16 51 -12 7 16 12 -13
4815 -13 -17 29 -42 -27 20 -13 33 -9 36 -48 -8 -43 49 -6 -22 -18 59 36 1 66 -44 20 2 36 23 25 -17 -10 38 -20 22 -4
4847 -4 -52 55 -14 8 -31 -64 -31 25 -34 -35 -60 -28 -31 -25 13 -21 -8 15 8 -13 -40 53 -2 -6 114 -73 -56 21 -10 40 -3 -41
4879 -41 2 25 66 -12 14 31 52 50 -21 17 29 52 47 4 -20 -36 17 21 -17 -12 -73 -9 -33 -27 29 20 -43 -41 -15 19 -25 7 11 17 -44
4914 -44 27 -54 77 -27 37 23 5 32 -41 -30 -11 -7 2 -22 21 72 -33 8 -30 14 -23 -15 6 -35 -39 22 13 -15 44 -15 11
4945 11 9 -34 -25 7 33 -50 -11 -26 -21 -1 -14 -7 34 63 21 -16 47 14 1 72 8 15 65 8 48 -22 -6 4 -10 50 60 -14 19
4978 19 -11 21 -31 0 39 -14 20 18 19 -19 -48 -31 -37 -12 -31 38 -1 -16 64 96 -43 17 11 -20 0 -20 7 27 39 6 56 71
5010 71 -8 -25 -9 -7 98 -72 -19 22 23 -26 -8 16 -31 10 -46 -5 7 -6 -9 -15 5 37 23 25 35 25 -15 34 -77 -10 33
5041 33 -42 9 4 48 41 36 -5 -19 25 -7 -7 46 5 -27 5 12 -47 0 19 -19 -21 -74 24 -13 15 1 -66 47 -22 4 -110 49
5073 49 -7 -26 -19 -1 7 -15 43 -13 -3 4 -11 49 28 -23 10 20 -13 23 50 -11 29 52 22 28 -27 46 -34 49 -56 -13 22 -10
5105 -10 -42 41 -11 -23 -17 -17 -7 7 -69 7 -18 25 8 32 2 35 35 16 20 -14 6 -4 7 30 -25 17 36 1 -16 -9 -10 19 37
5138 37 -9 14 -15 -36 -9 5 -9 14 -47 19 14 -42 -27 18 -10 24 -12 -30 -5 -62 -18 -27 40 29 4 -40 -38 -3 8 6 6 48 88
5171 88 58 -13 0 18 -3 -5 -6 -5 -46 1 -25 -43 13 29 17 38 -23 -24 4 3 -1 -22 5 -37 15 -59 -19 26 -11 -25 -86 -49 -14
5204 -14 -60 -12 -34 -30 -6 33 -14 17 3 -4 31 29 15 -17 29 -11 7 70 4 1 17 -52 -14 -11 -9 -29 1 7 9 -27 13 2 -30 -15
5238 -15 35 -31 -6 40 -44 34 3 -15 -22 -6 50 25 0 27 -24 12 5 -11 73 20 -50 11 -47 -7 -72 27 -37 -40 -16 -5 71 -47
5270 -47 0 -56 -23 34 -26 10 23 -21 -1 14 -89 29 -38 21 -54 -27 14 15 21 -66 5 35 -19 6 -14 18 17 5 2 54 8
5301 8 -4 34 -4 -22 42 -1 5 3 -56 -8 1 13 -12 1 -56 14 -9 -65 8 -36 33 6 -15 -4 -43 -22 4 -59 17 58 -68 11
5333 11 13 -24 65 26 -40 49 72 52 44 0 9 41 -30 39 48 -15 1 9 -43 -17 6 -50 -37 -3 -63 -12 -43 -74 21 -40 9 -27 -50
5366 -50 -14 -26 3 5 -2 -66 25 -37 3 40 -14 13 27 -7 32 9 -37 50 29 49 -13 14 32 40 0 9 21 -21 11 -31 9 10 -2
5399 -2 -34 -9 -6 17 -46 -12 -36 -83 -35 -33 0 -3 22 2 -43 -69 1 2 15 -48 51 31 45 -11 -25 -9 -36 47 -13 22 -13 2 -24
5432 -24 -23 5 11 35 15 20 14 -21 -13 5 -25 -32 -5 -3 -8 -22 8 -21 -30 -55 -103 -21 -39 -6 15 7 17 15 19 49 40 -12 -14 17 -1 4 11 44
5470 44 -13 -48 10 -16 -37 -7 11 -52 -50 10 -31 37 -32 31 -37 -18 -11 22 -4 -15 29 -49 47 -13 -11 -20 45 -9 23 14 56 19 21
5503 21 -1 41 15 -23 38 2 31 60 64 66 -72 5 -21 -50 9 32 -27 16 18 -63 -19 -39 -23 34 -16 -34 16 28 30 0 9 -48
5535 -48 2 -23 -45 -20 3 76 -19 65 -20 -7 47 17 -1 9 28 -21 25 55 -76 14 -7 -9 28 -41 8 -6 29 24 -46 -32 -47
5566 -47 34 -47 -8 54 1 -23 -20 -11 29 -21 10 22 -27 -8 23 -11 39 14 1 53 9 27 35 32 39 35 32 -15 13 11 16 30 -12 -15 -70
5601 -70 -35 -16 -18 -11 21 -20 -3 9 -27 7 -26 26 11 19 6 20 -39 13 -13 -9 20 -17 2 39 38 -60 62 44 38 -57 21 14 21 8
5635 8 8 28 2 11 11 -26 61 -30 -53 -1 -5 -15 23 -40 -30 -19 -64 -1 44 -1 -17 -53 20 -46 22 41 23 52 -9 46 34 45 31
5668 31 30 -13 23 63 35 -30 -40 22 8 5 -65 48 18 -10 -14 0 19 -7 2 -21 -45 23 0 19 17 -39 23 9 -57 -20 -6 -35
5700 -35 13 6 -6 -3 -41 3 7 18 -2 16 -38 37 41 20 -15 -58 -15 34 -48 -28 -8 -32 -2 4 -57 -37 11 -20 -7 9 -31 -4 -29
5733 -29 -66 3 -43 -51 18 -43 9 -3 -11 11 23 12 31 26 39 25 37 35 -43 -27 -3 47 14 19 28 -18 -22 -2 -37 -21 -33 3 61 -21
5767 -21 -12 -21 14 -11 -45 -51 -63 -85 2 31 -50 -42 -35 8 -46 -11 26 61 -20 -38 -11 33 24 -10 -35 35 23 42 42 -9 2 -8 61 71
5801 71 17 -13 -25 -55 -40 15 22 19 -41 2 18 -18 41 -9 1 -10 -43 -1 -38 23 29 -92 -20 47 -11 2 7 15 19 -30 -26 68 68 -24
5835 -24 24 40 -49 -4 34 15 4 24 7 -18 -30 20 28 -23 32 -8 41 1 3 48 7 13 20 -28 -25 -15 29 20 39 -37 -48 8 24
5868 24 10 -9 -48 26 45 29 -24 30 -8 13 -37 52 25 10 44 29 -33 33 14 -28 35 28 -22 -6 -27 -17 -2 -52 10 28 -4
5899 -4 -41 2 20 -25 -58 -38 5 11 18 -17 -22 34 3 21 20 -8 -15 29 56 -27 -34 -33 64 8 -10 -45 -3 -27 0 -1 38 -16 1 12 10
5934 10 -27 -37 -14 2 -63 -40 -25 -37 -20 -71 -1 -25 -6 14 -53 -13 38 -7 7 -34 -84 -42 -25 34 25 67 -34 82 -33
5963 -33 10 34 0 -55 -32 43 6 40 11 34 -15 -15 -4 -19 -20 14 -63 -11 33 -31 21 44 28 12 -5 -14 13 -61 -16 -38 -46 -35
5995 -35 9 -3 -27 36 -24 -22 47 13 -17 -51 -15 35 -2 40 45 -21 40 12 -47 -36 -22 21 13 -84 -11 3 47 -12 23 -11 -31 -52
6027 -52 -36 -54 -42 -39 -31 -19 -2 -19 -30 15 45 -5 -28 28 25 19 40 -6 -1 44 -47 -8 -2 -39 62 -36 -30 13 -24 37 11 42 16
6060 16 28 -5 29 30 -41 -23 -82 -34 15 -14 -4 36 -4 -25 38 15 28 -9 16 6 36 40 -4 -1 -6 -4 1 -7 43 -31 26 51 7 -13
6094 -13 -4 40 22 8 -74 -62 -12 -9 20 -72 28 19 -47 26 16 9 39 -26 -26 21 10 68 -25 17 27 24 13 9 13 26 -52 -9 -88 85
6128 85 -3 -3 46 -15 29 18 -5 50 -6 -84 -1 -1 25 31 -36 6 -48 -36 15 12 -41 -17 -35 -61 -4 -37 -25 -12 -20 9 37 25 20
6161 20 27 -19 52 18 -40 12 8 7 23 -26 9 19 29 -11 57 -21 -19 -43 -34 29 -30 -30 9 -3 -26 2 -40 -44 -42 -56 -2 43 11 8 -15
6196 -15 8 -69 -54 -17 -15 -39 35 2 17 -4 97 -79 1 71 -28 -7 29 21 -2 -28 35 14 -38 -14 37 52 29 5 -34 32
6226 32 3 -26 -15 8 -10 6 -27 -32 24 -10 4 7 -38 -6 -32 -4 -23 -58 -25 -12 6 7 26 18 -8 6 -18 -8 -15 -14 58 13 10 63
6260 63 1 1 42 1 -86 6 -30 -37 -31 -1 -1 -87 -42 -13 27 22 -33 -6 -13 -13 -52 -16 -35 -11 66 5 3 50 -21 -3 21 33 26 2 10
6295 10 49 6 21 -22 -7 9 10 65 51 7 -63 2 34 -24 5 -9 -34 16 -10 -10 2 21 13 43 -47 -14 28 -22 -1 4 -52 -1
6327 -1 -1 -31 42 -15 19 40 -19 104 34 -57 28 25 0 21 -14 -17 45 -27 18 -15 18 -18 -14 -9 -22 23 -42 -20 -21 -6 -20 -39 -21
6360 -21 32 14 0 -42 -45 8 -19 -39 -33 -25 -23 42 -3 9 11 49 -1 -1 24 -12 -9 -49 41 4 25 24 34 -21 -44 14 -32 4 -34 12
6394 12 -3 -72 -19 -62 -91 -35 26 -28 -33 -14 -1 6 -27 -15 -12 -49 9 30 17 10 -8 33 12 85 -15 -3 -8 26 -13 55 -33 44
6426 44 -55 24 38 -24 6 34 21 -22 -30 -57 -1 -3 -34 11 -31 29 61 -7 8 -17 -7 27 -59 -12 17 -27 -22 9 -56 28 -10 -21
6458 -21 3 15 15 1 77 -10 19 18 21 27 30 13 16 -4 1 -47 -21 48 -42 -7 -8 -41 -36 8 -5 12 -55 -43 -43 -16 -43 -70 22 -4 -42
6493 -42 48 -12 44 8 0 29 40 47 -2 8 -16 14 -13 57 26 29 39 -14 12 38 38 5 -22 4 29 26 -15 5 -73 -38 19 10 -1
6526 -1 -14 2 -46 31 -73 36 -26 -30 -50 10 17 17 -13 23 54 -32 13 39 -21 31 27 0 27 -30 15 -4 24 11 -67 -27 -24 -47
6558 -47 15 19 53 -9 12 -47 -27 2 -17 6 1 41 3 -44 19 41 -44 2 0 6 -31 15 16 9 36 14 17 -31 16 46 -1 -16 48 -1
6592 -1 -32 -10 38 38 35 45 50 70 15 49 -33 -21 16 -14 -60 -13 -14 -5 -30 -55 62 -16 -10 7 6 -34 -31 67 11 33 -27 46 16 -85
6626 -85 68 -26 -16 -1 52 7 1 11 49 17 -34 -41 32 45 -39 4 32 -30 15 20 -26 19 -55 22 -29 -36 -38 -44 -20 -16 -3 10 49
6659 49 -76 -19 31 20 25 36 -27 -35 -4 -15 -27 28 29 44 -9 -3 30 -53 82 16 19 26 1 -5 -7 -33 6 36 -20 -33 17 -64 -27
6692 -27 5 -24 -4 -18 14 15 -32 -85 46 7 -25 28 -28 41 18 42 -30 21 -16 -6 -31 6 10 49 -10 12 -14 47 29 -39 30
6723 30 5 4 6 -16 -40 7 -23 -25 7 -46 -68 53 -18 56 7 -14 7 -37 27 -19 -27 3 27 -24 15 -2 -16 18 -4 -37 63
6754 63 35 27 45 12 39 52 35 33 52 -50 54 -8 -21 14 -37 4 -5 5 31 -8 -11 -8 -23 5 51 8 -10 28 -43 5 -7 -34
6786 -34 39 2 40 -15 19 4 15 23 12 65 49 96 -5 -11 20 15 1 22 -11 -33 26 5 -18 21 -15 13 1 -33 -2 -17 -21 -37
6818 -37 7 16 20 14 4 -20 -47 17 21 -4 28 33 -51 -6 -6 16 -25 48 32 20 -1 -6 -7 45 24 15 -14 -14 17 -43 -73 -11 -28 -37 -4 3
6854 3 -5 -11 -24 -63 13 24 20 -68 -7 -3 -23 6 -18 9 81 -34 66 -6 12 -7 11 -49 12 3 -11 28 -6 -3 24 -18 30 -18 -9
6887 -9 7 -11 -8 -30 -19 -34 -38 -27 -23 -5 50 -3 -9 21 -18 46 -5 6 -44 0 -60 28 -20 36 18 12 -2 19 -30 3 -7 -32 37
6920 37 17 14 33 -21 -3 21 22 17 -6 20 30 6 -10 -48 38 -5 -23 -25 -46 -12 -25 -33 -30 -24 37 11 -71 -79 18 27 23 48 -14 -44 -49 -3
6956 -3 17 -32 -16 5 -5 24 -42 51 30 19 -8 0 16 22 -25 -8 54 35 -34 38 -20 9 -7 -48 -4 -59 8 11 -28 -59 -15 4
6988 4 41 -51 26 60 45 -26 2 1 88 -5 9 56 -37 52 -6 -61 -20 -3 -4 17 -37 63 43 25 -5 -23 -12 -39 23 -7 -9 -15
7020 -15 -1 -26 -31 25 -10 0 22 -3 -20 19 -1 12 8 35 -43 -2 25 25 6 11 -15 27 34 9 -6 -11 -10 -19 30 26 -9 -5 19 -43 49
7055 49 -7 2 -64 -20 -30 -24 -20 -65 -13 17 18 -16 -30 18 -48 -56 -32 -34 -17 -2 -41 0 19 29 -7 44 -11 -7 13 -8 14 8 -39 13
7089 13 -49 -21 -26 15 34 7 42 48 27 7 7 -52 18 12 14 -19 13 -30 5 -29 -45 -13 18 8 -8 38 23 17 22 -56 4 55 -2 0
7123 0 -30 4 -2 13 13 13 11 4 57 2 22 35 16 0 -36 4 53 17 5 -28 -3 -45 -26 -15 -21 37 13 29 12 -28 33 -5 -17 -70
7157 -70 -9 70 -55 22 21 -35 65 7 -19 59 5 13 5 40 -19 -47 -16 36 34 -18 19 16 17 27 -21 -12 10 -14 9 -22 15 -38 -31
7190 -31 11 -24 -35 -11 7 -40 2 6 -30 15 1 41 -6 36 18 9 -29 33 1 1 9 54 -2 -17 -26 3 -53 -47 27 59 30 12 16 -86
7224 -86 2 -31 -5 -33 -14 -10 4 -58 -48 -53 -1 3 -19 -20 28 10 -58 -56 34 -45 6 9 -24 0 18 11 44 -7 37 37 -30 37 -29 -4
7258 -4 -32 17 24 26 -13 -45 -13 30 -47 -6 -10 22 -41 2 -30 -69 -23 7 -4 -26 -40 -62 -5 -16 -43 -42 25 12 -16 44 26 -11 -12
7291 -12 5 17 -24 51 -57 15 52 4 2 37 52 9 -17 -45 -18 -34 -5 -55 -14 36 57 -18 -2 25 -33 -18 -83 16 10 -21 44
7322 44 46 15 -43 -28 -15 2 -33 5 -6 45 -46 4 31 -20 -6 6 -12 -7 7 23 -45 -29 -41 -4 20 -68 24 -7 -1 -27 -33 -12
7354 -12 -20 -15 14 17 -18 27 49 -48 9 12 6 -25 27 11 10 27 0 5 -13 0 -15 18 -43 12 -2 -21 20 14 -29 -15 -3 -3 -34 -72 16
7389 16 9 16 -61 -26 18 -49 2 5 11 -70 42 35 -11 -32 -32 -9 -36 12 23 -1 9 -15 23 0 45 16 26 -8 15 5 -49 18 11
7422 11 -3 25 1 21 16 24 -11 -3 65 -49 4 0 47 -9 5 41 -31 -38 -11 -17 23 24 2 -9 -10 0 -78 -2 45 40 -6 -51 -38 7
7456 7 -13 40 20 38 18 34 33 16 -1 26 -12 -8 -21 8 -22 8 -35 -10 -29 15 46 21 8 18 -46 -9 -39 26 34 -61 60 34
7488 34 -19 2 -22 -92 10 5 -53 -24 -10 23 -12 -36 40 -10 26 28 19 27 -18 10 -11 46 13 -20 -14 0 -2 -8 7 -33 40 25 -37
7521 -37 -1 31 -50 20 -37 74 -50 -3 19 28 -26 8 1 0 51 30 33 20 12 -31 18 -26 1 44 49 22 8 -54 -8 38 40 -5 26
7554 26 29 -56 -47 -8 17 8 48 -8 -22 -35 -20 20 27 -37 -42 -58 -10 11 -73 61 -6 14 6 -18 84 58 29 -16 0 22 45 -31
7586 -31 17 -43 52 -6 11 -39 36 14 54 0 -23 12 24 -24 -23 -30 10 22 -47 -37 -23 -22 -58 -46 31 10 -31 39 -1 -10 42 39 -17
7619 -17 -60 -51 42 -30 -4 32 -4 22 -9 20 -5 -11 48 -32 -1 -22 40 52 31 -13 -16 -1 47 51 -15 7 -28 -3 15 -14 -44 -49 -13
7652 -13 -53 -34 -2 -57 19 -18 -39 16 8 9 45 39 68 9 -35 36 28 -2 46 81 41 28 -18 38 21 -11 8 59 3 -25 -51 -20
7684 -20 3 -41 15 -12 18 -32 -30 29 -32 -24 6 -46 31 27 58 -1 -67 49 69 -15 -7 0 20 49 36 16 26 -9 -38 -2 23 -50
7716 -50 15 -33 50 -25 4 -13 -13 54 18 12 -43 18 -1 33 -41 -33 0 -56 -48 -4 -38 -44 -39 4 -39 -16 17 17 -23 68 -33 4 -9
7749 -9 0 17 36 66 -14 1 -21 10 0 -32 7 32 -1 -14 -48 23 -3 -39 3 -44 21 26 -55 33 -37 -11 -47 -18 25 15 -6 -19
7781 -19 -59 21 16 0 -2 50 3 -8 8 -16 -41 20 58 2 -15 55 -24 1 -17 17 3 -25 8 8 3 -26 50 38 6 -10 14 19 -11
7814 -11 17 11 4 30 13 12 -22 70 24 -34 -13 28 35 -23 3 -21 10 14 -9 80 -27 10 -5 2 33 -5 12 -36 73 9 -3 17
7846 17 -14 -76 25 -24 40 -28 -53 9 -50 2 -18 -39 -84 0 -10 31 46 5 -4 -3 7 19 -25 -16 -8 16 20 -18 56 7 -9 -14 -52
7879 -52 45 5 64 22 17 -55 -41 -24 -15 12 16 22 40 -10 -61 -26 -57 -9 26 -55 13 11 3 -2 -37 11 10 -23 3 -5 -22 -25 -27 20 6 56
7915 56 -42 40 36 -12 14 92 27 -27 96 3 -10 -12 22 34 -7 -2 6 -34 -27 -18 33 22 17 -52 -24 -44 -15 -38 8 -10 52 24 -15
7948 -15 29 3 -4 9 5 -6 36 12 -11 7 -8 38 4 -4 14 5 23 44 -11 29 17 15 -7 1 -10 -9 -3 -31 31 -59 3 -19 9 -14
7982 -14 29 -6 0 -22 -20 22 -35 20 -26 4 17 13 10 -15 -25 61 -7 -8 39 45 24 62 59 31 23 2 -18 23 -15 -19 15 -12 -34 -25 1
8017 1 -24 -77 -35 14 49 -11 -9 -2 -4 -22 -65 -41 -60 13 -73 -2 -3 -11 -4 53 36 -5 15 -44 -16 59 -34 -12 -2 32 -6 35 -5 -8
8051 -8 15 -14 -13 39 -2 -8 2 -44 -68 -61 -1 -11 -50 -9 -8 -8 9 1 -26 20 32 10 -25 -17 -8 5 64 -64 -19 52 -36 41 25 -43
8085 -43 -27 -25 58 33 -6 7 44 -6 -6 -33 -27 -6 31 -38 13 -35 -8 -2 -53 -2 -44 -28 -17 -2 -57 -2 0 -13 25 -5 38 0 -12
8118 -12 54 48 9 55 38 16 -47 1 16 5 -19 0 42 59 38 -50 -13 6 -22 3 80 -8 -3 -10 -36 -31 -8 -15 -19 23 24 19 16 5 18
8153 18 1 -15 -1 -18 -22 -22 18 -3 -21 23 -13 -23 -12 -32 31 66 6 -6 18 40 4 35 -28 -22 56 -42 -26 -44 -2 29 -10 -10
8185 -10 4 0 4 22 -5 -29
8191b9
##END NTUPLES=NMR FID
##END=
