##TITLE=1H_90-2024
 CDCl3
 8 sc, 
 10.10.2024
##JCAMPDX= 6.0         $$ Bruker NMR JCAMP-DX V2.0
##DATA TYPE= NMR FID
##DATA CLASS= NTUPLES
##ORIGIN= UXNMR, Bruker Analytische Messtechnik GmbH
##OWNER= root
$$ XWIN-NMR		Version 3.5
$$ Thu Oct 10 14:20:06 2024 Russian Standard Time (UT+4h)  she@DPX200
##.OBSERVE FREQUENCY= 200.1318
##.OBSERVE NUCLEUS= ^1H
##.DELAY= (6, 6)
##.ACQUISITION MODE= SIMULTANEOUS
##.ACQUISITION SCHEME= undefined
##.AVERAGES= 8
##.DIGITISER RES= 18
##SPECTROMETER/DATA SYSTEM= spect
##.PULSE SEQUENCE= zg30
##.SOLVENT NAME= D2O
##.SHIFT REFERENCE= (INTERNAL, D2O, 0, 15.7039)
##AUDIT TRAIL= $$ (NUMBER, WHEN, WHO, WHERE, WHAT)
$$ ##TITLE= Audit trail, XWIN-NMR		Version 3.5
$$ ##JCAMPDX= 5.01
$$ ##ORIGIN= Bruker BioSpin GmbH
$$ ##OWNER= she
$$ F:/spectra/data/she/nmr/H-F/1/audita.txt
$$ ##AUDIT TRAIL=  $$ (NUMBER, WHEN, WHO, WHERE, WHAT)
(   1,<2024-10-10 14:18:31.07 +0400>,<she>,<DPX200>,
      <created by zg, POWCHK disabled, PULCHK disabled
       configuration hash MD5:
       00 E9 B6 7A A2 85 ED C7 34 08 36 98 17 FE 4E 26
       data hash MD5: 16K
       05 5E 63 85 AB 9B F7 FA 8C 58 D2 EF D2 DE A2 B6>)
$$ ##END=
$$ 
$$ hash MD5
$$ BE A1 1D 62 85 7E BD 44 4C 1F C5 10 D2 21 C4 5D
##$RELAX= 
##$RELAX= 
##$RELAX= 
##$RELAX= 
##$RELAX= 
##$RELAX= 
$$ Bruker specific parameters
$$ --------------------------
##$DU= <F:/spectra>
##$EXPNO= 1
##$NAME= <H-F>
##$PROCNO= 1
##$TYPE= <nmr>
##$USER= <she>
##$AMP= (0..31)
100 100 100 100 100 100 100 100 100 100 100 100 100 100 100 100 100 100 
100 100 100 100 100 100 100 100 100 100 100 100 100 100 
##$AQSEQ= 0
##$AQ_mod= 1
##$AUNM= <au_zg>
##$AUTOPOS= <>
##$BF1= 200.13
##$BF2= 200.13
##$BF3= 200.13
##$BF4= 200.13
##$BF5= 200.13
##$BF6= 200.13
##$BF7= 200.13
##$BF8= 200.13
##$BYTORDA= 1
##$CFDGTYP= 0
##$CFRGTYP= 5
##$CHEMSTR= <none>
##$CNST= (0..31)
1 1 145 1 1 1 1 1 1 1 1 1 1 1 1 1 1 1 1 1 1 1 1 1 1 1 1 1 1 1 1 1 
##$CPDPRG= <>
##$CPDPRG1= <>
##$CPDPRG2= <>
##$CPDPRG3= <>
##$CPDPRG4= <mlev>
##$CPDPRG5= <mlev>
##$CPDPRG6= <mlev>
##$CPDPRG7= <mlev>
##$CPDPRG8= <mlev>
##$CPDPRGB= <>
##$CPDPRGT= <>
##$D= (0..31)
0 1.2 0 0 0 0 0 0 0 0.06 0 0.03 0 0 0 0 0.0002 0 0 0 0 0 0 0 0 0 0 0 0 
0 0 0 
##$DATE= 1728555510
##$DBL= (0..7)
120 120 120 120 120 120 120 120 
##$DBP= (0..7)
150 150 150 150 150 150 150 150 
##$DBP07= 0
##$DBPNAM0= <>
##$DBPNAM1= <>
##$DBPNAM2= <>
##$DBPNAM3= <>
##$DBPNAM4= <>
##$DBPNAM5= <>
##$DBPNAM6= <>
##$DBPNAM7= <>
##$DBPOAL= (0..7)
0.5 0.5 0.5 0.5 0.5 0.5 0.5 0.5 
##$DBPOFFS= (0..7)
0 0 0 0 0 0 0 0 
##$DE= 6
##$DECBNUC= <off>
##$DECIM= 24
##$DECNUC= <off>
##$DECSTAT= 4
##$DIGMOD= 1
##$DIGTYP= 9
##$DL= (0..7)
0 120 120 120 120 120 120 120 
##$DP= (0..7)
150 150 150 150 150 150 150 150 
##$DP07= 0
##$DPNAME0= <>
##$DPNAME1= <>
##$DPNAME2= <>
##$DPNAME3= <>
##$DPNAME4= <>
##$DPNAME5= <>
##$DPNAME6= <>
##$DPNAME7= <>
##$DPOAL= (0..7)
0.5 0.5 0.5 0.5 0.5 0.5 0.5 0.5 
##$DPOFFS= (0..7)
0 0 0 0 0 0 0 0 
##$DQDMODE= 0
##$DR= 18
##$DS= 0
##$DSLIST= <SSSSSSSSSSSSSSS>
##$DSPFIRM= 0
$$ [...]
##$SUBNAM2= <"">
##$SUBNAM3= <"">
##$SUBNAM4= <"">
##$SUBNAM5= <"">
##$SUBNAM6= <"">
##$SUBNAM7= <"">
##$SUBNAM8= <"">
##$SUBNAM9= <"">
##$SW= 24.0689170037331
##$SWIBOX= (0..15)
0 0 2 0 0 0 0 0 0 0 0 0 0 0 0 0 
##$SW_h= 4816.95568400771
##$TD= 16384
##$TD0= 1
##$TE= 0
##$TE2= 300
##$TE3= 300
##$TEG= 300
##$TL= (0..7)
0 120 120 120 120 120 120 120 
##$TP= (0..7)
150 150 150 150 150 150 150 150 
##$TP07= 0
##$TPNAME0= <>
##$TPNAME1= <>
##$TPNAME2= <>
##$TPNAME3= <>
##$TPNAME4= <>
##$TPNAME5= <>
##$TPNAME6= <>
##$TPNAME7= <>
##$TPOAL= (0..7)
0.5 0.5 0.5 0.5 0.5 0.5 0.5 0.5 
##$TPOFFS= (0..7)
0 0 0 0 0 0 0 0 
##$TUNHIN= 0
##$TUNHOUT= 0
##$TUNXOUT= 0
##$USERA1= <user>
##$USERA2= <user>
##$USERA3= <user>
##$USERA4= <user>
##$USERA5= <user>
##$V9= 5
##$VALIST= <valist>
##$VCLIST= <CCCCCCCCCCCCCCC>
##$VD= 0
##$VDLIST= <DDDDDDDDDDDDDDD>
##$VPLIST= <PPPPPPPPPPPPPPP>
##$VTLIST= <TTTTTTTTTTTTTTT>
##$WBST= 1024
##$WBSW= 4
##$XGAIN= (0..3)
0 0 0 0 
##$XL= 0
##$YL= 0
##$YMAX_a= 326458
##$YMIN_a= -260046
##$ZGOPTNS= <>
##$ZL1= 120
##$ZL2= 120
##$ZL3= 120
##$ZL4= 120
##$ABSF1= 10
##$ABSF2= 0
##$ABSG= 5
##$ABSL= 3
##$ALPHA= 0
##$AQORDER= 0
##$ASSFAC= 0
##$ASSFACI= 0
##$ASSFACX= 0
##$ASSWID= 0
##$AUNMP= <proc_1d>
##$AZFE= 0.1
##$AZFW= 0.1
##$BCFW= 1
##$BC_mod= 2
##$BYTORDP= 1
##$COROFFS= 0
##$CY= 11.3945322036743
##$DATMOD= 1
##$DC= 2
##$DFILT= <>
##$DTYPP= 0
##$F1P= 15.6554695791079
##$F2P= 12.8336369535428
##$FCOR= 0.5
##$FTSIZE= 0
##$FT_mod= 4
##$GAMMA= 1
##$GB= 0.15
##$INTBC= 1
##$INTSCL= 1
##$ISEN= 128
##$LB= 0.24
##$LEV0= 0
##$LPBIN= 0
##$MAXI= 10000
##$MC2= 0
##$MEAN= 0
##$ME_mod= 0
##$MI= 1.114404
##$NCOEF= 0
##$NC_proc= 0
##$NLEV= 6
##$NOISF1= 3.799351
##$NOISF2= 2.8
##$NSP= 1
##$NTH_PI= 0
##$NZP= 0
##$OFFSET= 15.70392
##$PC= 1
##$PHC0= -26499.74
##$PHC1= 11.78743
##$PH_mod= 1
##$PKNL= yes
##$PPARMOD= 0
##$PSCAL= 0
##$PSIGN= 0
##$REVERSE= no
##$SF= 200.130013532006
##$SI= 16384
##$SIGF1= 3
##$SIGF2= 2
##$SINO= 400
##$SIOLD= 16384
##$SREGLST= <1H.CDCl3>
##$SSB= 0
##$STSI= 0
##$STSR= 0
##$SW_p= 3612.71676300578
##$SYMM= 0
##$S_DEV= 0
##$TDeff= 0
##$TDoff= 0
##$TI= <>
##$TILT= no
##$TM1= 0
##$TM2= 0
##$TOPLEV= 0
##$USERP1= <user>
##$USERP2= <user>
##$USERP3= <user>
##$USERP4= <user>
##$USERP5= <user>
##$WDW= 1
##$XDIM= 8192
##$YMAX_p= 0
##$YMIN_p= 0
$$ End of Bruker specific parameters
$$ ---------------------------------
##NTUPLES= NMR FID
##VAR_NAME=  TIME,          FID/REAL,        FID/IMAG
##SYMBOL=    X,             R,               I
##VAR_TYPE=  INDEPENDENT,   DEPENDENT,       DEPENDENT
##VAR_FORM=  AFFN,          ASDF,            ASDF
##VAR_DIM=   8192,          8192,            8192
##UNITS=     SECONDS,       ARBITRARY UNITS, ARBITRARY UNITS
##FACTOR=    0.0002076,     1,               1
##FIRST=     0,             0,               0
##LAST=      1.7004516,     0,               0
##MIN=       0,             -260046,         0
##MAX=       1.7004516,     326458,          0
$$ Real data points
##PAGE= N=1
##DATA TABLE= (X++(R..R)), XYDATA
$$ [...]
$$ plain form
1471 -3768 -4473 5544 2714 -5062 -881 1459 1248 1818 -3694 -2370 5518 1494 -4643 -900 2708
1486 2708 2023 -1287 -3787 550 4619 -829 -4674 952 3486 38 -1431 -2255 1079 4830 -2310
1501 -2310 -5101 3102 3139 -1899 -2168 -942 2819 2423 -3806 -2010 3497 1938 -1773 -2705 276 3795
1517 3795 108 -4779 -383 4532 -17 -3301 -231 1348 2245 160 -4705 876 5356 -2461 -3686
1532 -3686 1625 1283 1177 -1261 -3672 2847 3948 -3375 -2629 2511 1917 -492 -2051 -1466 2662 2460
1548 2460 -3866 -2287 3925 1265 -2053 -945 -267 2954 1273 -4752 -133 4115 -762 -2146 -764
1563 -764 648 2754 -847 -3598 1619 3425 -1031 -2583 118 2124 983 -2109 -2306 2256 2569 -2610
1579 -2610 -1686 1680 1215 854 -2077 -2033 4023 1256 -4247 -11 1999 174 -55 -2129 -316 3649
$$ packed form
1471c768p05J0017k830p776M181K340k11N70n512J324P888m024o137L743L608
1486B708o85l310k500M337M069n448l845N626K534l448j469q24L334L751p140
1501b310k791Q203L7n038k69J226L761l96o229J796N507j559l711r32K981L519
1517C795l687m887M396M915m549l284L070J579Q97k085m865N581M480p817j225
1532c686N311l42j06k438k411O519J101p323P46N140n94k409j559N85M128k02
1548B460o326J579O212k660l318J108O78L221j681o025M619M248m877j384J382
1563g64J412K106l601k751N217J806m456j552K701K006j141l092j97M562L13n179
1579b610R24L366m65l61k931M4O056k767n503M236K010j825k29k074J813L965
$$ plain form
1595 3649 -292 -3361 866 2478 -162 -1310 -1183 461 2638 -1055 -3771 2110 2751 -2261 -625
1610 -625 463 114 2314 -1459 -3029 2757 1733 -2573 -1067 861 1269 294 -2029 -367 2315 581
1626 581 -1826 -573 1176 891 -318 -2028 -227 2919 -619 -2975 1491 1415 -570 181 -1282 346
1642 346 2615 -1606 -2016 1536 868 -401 -1022 -787 1734 1058 -2022 -545 1922 264 -1053 -144 -301
1659 -301 650 1227 -2347 -995 3095 -467 -1930 1239 167 361 764 -2047 254 2150 -1189 -1207 597
1676 597 338 477 -342 -1155 780 1650 -1077 -1272 1444 367 -906 208 -788 211 1505 -1589 -888
1693 -888 1800 -55 -345 -31 -400 1251 28 -1620 641 616 -647 64 -382 -133 1084 -44 -1277
1710 -1277 617 1382 -1004 -527 863 -523 158 337 -1472 755 1238 -1486 196 754 -541 829
$$ packed form
1595C649l941l069M227J612k640j148J27J644K177l693k716N881O41n012J636
1610f25J088l49K200l773j570N786j024m306J506J928M08r75k323J662K682j734
1626E81k407J253J749k85j209j710J801L146l538k356M466p6j985P51j463J628
1642C46K269m221m10L552o68j269o21K35K521o76l080J477K467j658j317R09j57
1659c01R51N77l574J352M090l562j463L169j072J94M03k811K301J896l339j8J804
1676E97k59J39q19q13J935Q70k727j95K716j077j273J114r96R99J294l094P01
1693h88K688j855k90L14l69J651j223j648K261k5j263P11m46K49J217j128j233
1710a277J894P65k386M77J390j386O81J79j809K227M83k724J682N58j295J370
$$ plain form
1726 829 -354 -995 1319 54 -1379 533 394 -500 306 68 -646 740 680 -1352 284 1223 -1089
1743 -1089 -101 651 -1042 587 374 -1397 739 605 -854 488 170 -272 619 -366 -547 503 -39
1760 -39 -401 30 106 -68 265 65 -360 599 291 -779 491 81 -730 742 -509 -658 1151 -446 -580
1779 -580 1193 -481 -273 939 -590 -200 738 -539 -443 623 -188 -535 543 39 -551 780 52 -825
1797 -825 967 -26 -938 1046 -414 -790 1052 -578 -482 1091 -466 -266 868 -235 -166 409 -233 -365
1815 -365 297 0 -503 238 190 -503 452 156 -375 640 -45 -386 634 -495 -132 446 -769 272 417
1834 417 -815 572 339 -662 637 231 -618 481 187 -711 113 445 -590 -105 664 -619 44 963
1852 963 -897 32 1224 -1008 -116 834 -1068 178 566 -1030 353 675 -681 98 497 -131 18
$$ packed form
1726H29j183o41K314j265j433J912j39q94Q06k38p14J386o0k032J636R39k312
1743a089R88P52j693J629k13j771K136j34j459J342l18m42Q91r85j81J050n42
1760c9l62M31P6j74L33k00m25R59l08j070J270m10q11J472j251j49J809j597j34
1779e80J773j674K08J212j529L90R38j277R6J066q11l47J078n04n90J331p28q77
1797h25J792r93r12J984j460l76J842j630R6J573j557K00J134j103O9N75o42j32
1815c65O62k97n03P41m8o93R55k96n31J015o85l41J020j129L63N78j215J041J45
1834D17j232J387k33j001J299m06q49J099k94q98Q24L32j035M85P69j283O63R19
1852I63j860R29J192k232Q92R50j902J246L88j596J383L22j356P79L99o28J49
$$ plain form
1869 18 176 -272 -133 465 -511 -461 634 -174 -207 448 -444 379 596 -917 248 578 -686 250 -93 -577
1889 -577 772 -157 -687 511 232 -105 83 -155 187 325 -329 -612 413 353 -699 32 228 -323 818
1908 818 -276 -983 1494 209 -1358 737 40 -655 715 -727 -700 1340 43 -1084 505 737 -211
1925 -211 -215 3 -258 641 57 -1328 374 968 -796 -92 -23 -82 1007 -554 -1015 1209 275 -725 -85
1944 -85 -214 567 338 -1038 -229 1017 241 -634 -215 527 538 -79 -1015 -75 1214 -355 -1325 616 385
1963 385 63 268 -1220 433 1769 -1319 -1047 1160 221 -168 -456 -812 950 941 -1228 -653 1231 586
1981 586 -667 -447 -112 814 667 -1760 -625 2056 -301 -1344 425 -7 816 488 -1876 212 2000
1998 2000 -549 -1345 87 944 451 -982 -896 875 1142 -515 -1132 521 1108 94 -1119 -890 1494
$$ packed form
1869A8J58m48J39N98r76N0J095q08l3O55q92Q23K17j513J165L30j264R36l43m84
1889e77J349r29n30J198k79l37J88k38L42J38o54k83J025o0j052P31J96n51J141
1908H18j094p07K477j285j567K095o97o95J370j442K7K040j297j127J589K32r48
1925b11mK18k61Q99n84j385J702N94j764P04O9n9J089j561m61K224r34j000O40
1944h5j29P81k29j376Q09J246p76q75M19P42J1o17r36R40J289j569r70J941k31
1963C85l22K05j488J653J336l088K72K207r39l89k88l56J762rk169N75J884o45
1981E86j253K20L35R26j47k427J135K681k357j043J769m32Q23l28k364K088J788
1998B000k549p96J432Q57m93j433Q6J771K67j657o17J653N87j014j213K29K384
$$ plain form
2015 1494 1005 -2175 -504 1480 28 -134 -744 -575 2086 303 -2329 217 1545 -5 -949 -987 641
2032 641 1458 -757 -1778 842 1725 -687 -1064 123 631 1111 -945 -2151 1718 1789 -2093 -893 1030
2049 1030 664 571 -1323 -966 2092 743 -1892 -757 1092 1052 -667 -1645 271 2064 -67 -2142 248
2066 248 1880 18 -903 -922 285 2030 -818 -2600 1173 1750 -649 -1223 -432 1594 1237 -1935 -984
2083 -984 1753 854 -882 -1332 -87 1809 503 -2378 -594 2708 464 -2242 -24 1132 630 151
2099 151 -2070 -261 2821 -557 -2495 592 1509 573 -1009 -1606 1488 1973 -1579 -1707 996 1459 -267
2116 -267 -1480 -729 1598 1548 -1987 -1618 2370 1265 -1629 -876 130 1533 609 -2528 -518 2473 221
2133 221 -1567 -728 922 1963 -715 -2280 967 2136 -676 -1830 -156 1297 868 -1261 -1749 1435
$$ packed form
2015A494m89l180J671J984j452j62o10J69K661j783k632K546J328j550r44l8J628
2032F41Q17k215j021K620Q83k412l77J187N08M80k056j206L869P1l882J200J923
2049A030l66r3j894L57L058j349k635J135J849m0j719r78J916J793k131k075K390
2066B48J632j862r21j9J207J745k848j782L773N77k399n74P91K026l57l172R51
2083i84K737q99j736m50J245J896j306k881J784L302k244k706K218J156n02m79
2099A51k221J809L082l378j938L087R17r36j582n97L094M85l552j28K703M63j726
2116b67j213P51K327n0l535L69L988j105k894P53J006J403r24l137K010K991k252
2133B21j788Q39J650J041k678j565L247J169k812j154J674J453m29k129m88L184
$$ plain form
2149 1435 2215 -1697 -1652 1361 1219 37 -1430 -1304 2231 1223 -2719 -720 1793 708 -435 -1446
2165 -1446 -32 2498 117 -2678 -24 2295 111 -1642 -670 764 1616 -434 -2430 884 2647
2180 2647 -933 -1586 187 1022 1098 -1484 -1903 1878 1500 -1572 -1217 545 1609 399 -2011 -566 2237
2197 2237 709 -2094 -833 1400 857 -635 -1506 -110 2362 132 -2607 377 1940 37 -942 -1227
2213 -1227 736 2040 -1340 -1993 1235 1343 -229 -1128 -649 1569 1359 -1948 -1369 1952 1025 -1580 -780
2230 -780 457 828 829 -1694 -1143 2619 694 -2233 -169 1180 664 -399 -1795 258 2028 -487 -1615
2247 -1615 155 1231 724 -976 -1199 1086 1611 -1071 -1789 1012 1308 -614 -923 -476 1105 1285 -1547
2264 -1547 -1124 1733 693 -699 -885 -224 1695 164 -2216 155 1691 -172 -854 -345 416 1166 -69
$$ packed form
2149A435P80l912M5L013j42j182j467J26L535j008l942J999K513j085j143j011
2165a446J414K530k381k795K654K319k184j753R72J434Q52k050j996L314J763
2180B647l580o53J773Q35P6k582m19L781l78l072L55J762J064j210k410J445K803
2197B237j528k803J261K233n43j492q71J396K472k230k739K984J563j903r79k85
2213a227J963J304l380o53L228J08j572q99M79K218k10l307N79L321r27k605Q00
2230g80J237L71Jk523N51L762j925k927K064J349n16j063j396K053J770k515j128
2247a615J770J076n07j700k23K285N25k682p18K801K96j922l09M47J581J80k832
2264a547M23K857j040j392j86O61J919j531k380K371J536j863o82N09P61P50j235
$$ plain form
2281 -69 -1799 197 2016 -639 -1781 525 843 219 -493 -1178 918 1591 -1209 -820 755 524 314
2298 314 -1076 -1018 1582 609 -1842 -306 1263 279 -499 -410 -77 958 626 -1509 -427 1666 48
2315 48 -1153 -252 414 940 -407 -1245 784 928 -508 -316 -397 389 1058 -1164 -1100 1286 728 -1014 -487
2334 -487 572 434 139 -554 -708 1019 678 -1350 -320 865 9 -37 -744 -216 1478 -228 -1253 662
2352 662 566 -223 -24 -553 21 956 -418 -1054 521 878 -415 -465 246 292 477 -391 -789 776 417 -776
2372 -776 -96 72 281 610 -892 -368 1327 -143 -641 261 68 168 31 -620 -70 646 -106 -720 157
2391 157 515 -3 -137 -281 118 754 -572 -588 691 -58 -202 266 -630 338 843 -903 -183 914 -194
2410 -194 -312 38 -206 79 178 -493 -310 704 60 -571 293 129 -93 323 -547 -77 765 -516 -399 366
$$ packed form
2281f9j730J996J819k655j142K306L18o24p12o85K096O73k800L89J575k31k10
2298C14j390N8K600r73k451J536J569r84p78Q9L33J035l32k135J082K093j618
2315D8j201R01O66N26j347q38K029J44j436J92q1P86O69k222O4K386n58j742N27
2334d87J059j38k95o93j54J727l41k028J030J185q56m6p07N28J694j706j025J915
2352F62r6p89J99n29N74R35j374o36J575L57j293n0P11M6J85q68l98J565l59j193
2372g76O80J68K09L29j502N24J695j470m98R02j93J00j37o51N50P16p52o14Q77
2391A57L58n18j34j44L99O36j326j6J279p49j44M68q96R68N05j746P20J097j108
2410a94j18L50k44K85R9o71J83J014o44o31Q64j64k22M16q70M70Q42j281J17P65
$$ plain form
2430 366 -300 186 141 -611 441 480 -399 -21 262 -73 -30 -63 -178 111 260 -395 -133 510 -78 -194 310
2451 310 -335 189 417 -692 104 380 -514 139 167 -341 492 48 -404 379 139 -263 118 -21 -144 91
2471 91 23 -334 185 252 -383 122 424 -399 300 380 -631 405 306 -675 273 142 -451 318 36 -261 365
2492 365 75 -125 100 44 -95 -4 104 -177 69 130 -302 195 235 -282 364 85 -423 453 -26 -405 425
2513 425 -242 -376 460 -155 -187 392 -87 -114 212 44 -102 76 23 -258 74 -24 -426 242 25 -290 406
2534 406 43 -270 489 -291 -193 462 -358 -253 375 -317 -64 279 -283 -8 319 -183 -161 344 35 -302 197
2555 197 -43 -303 343 -105 -421 532 49 -358 468 -126 -86 331 -374 -32 307 -287 49 69 -131 200 -27
2576 -27 -227 131 262 -164 -121 205 -47 -159 193 -364 -87 575 -424 -151 596 -230 -1 248 -412 293 226
$$ packed form
2430C66o66M86m5p52J052L9q79L78K83l35M3l3j15K89J49o55K62O43n88j16N04
2451C10o45N24K28j109P96K76q94O53K8n08Q33m44m52P83k40m02L81j39j23K35
2471I1o8l57N19O7o35N05L02q23O99Q0j011J036r9r81R48j31n93P69k82k97O26
2492C65k90k00K25n6j39R1J08k81K46O1m32M97M0n17O46k79n08Q76m79l79Q30
2513D25o67j34Q36o15l2N79m79k7L26j68j46J78n3k81L32r8m02O68k17l15O96
2534D06l63l13P59p80R8O55q20J05O28o92K53L43n62K75L27n02K2N05l09l37M99
2555A97k40k60O46m48l16R53m83m07Q26n94M0M17p05L42L39n94L36K0k00L31k27
2576b7k00L58J31m26M3L26k52j12L52n57K77O62r99K73P47q26K29K49o60P05o7
$$ plain form
2597 226 -599 163 160 -237 22 -118 22 378 30 -245 65 406 -179 -285 257 -205 71 169 -632 282 663
2618 663 -529 46 397 -206 350 -154 -454 443 138 -461 -81 241 160 -91 -228 30 324 187 -483 -121
2638 -121 492 -146 -189 -148 -200 489 -34 -766 425 419 -274 68 -177 161 597 -603 -527 542 118 -332 -235
2659 -235 95 283 216 -276 -431 661 455 -813 -181 447 -29 89 -379 -329 966 -78 -758 310 322
2678 322 186 -68 -623 275 667 -518 -571 328 487 -125 -387 -41 356 587 -374 -774 755 475 -667
2697 -667 -261 48 296 354 -822 -281 872 93 -448 -182 176 684 -209 -948 290 742 -177 -682 -13
2716 -13 513 295 -266 -562 383 995 -452 -919 554 392 -118 -403 -594 753 704 -986 -298 762 363
2735 363 -167 -477 -49 869 132 -1045 -284 933 268 -804 -258 475 563 40 -965 41 1186 -304
$$ packed form
2597B26q25P62ll97K59j40J40L56l48k75L10L41n85j06N42m62K76R8q01R14L81
2618F63j192N75L51o03N56n04l00Q97l05n99L80L22q1k51j37K58K94j37o70L62
2638a21O13o38m3M1n2O89n23p32J191oo93L42k45L38M36j200P6J069m24m50R7
2659b35L30J88o7m92j55J092k06j268O32O28m76J18m68N0J295j044o80J068J2
2678C22j36k54n55Q98L92j185n3Q99J59o12k62L46L97K31r61m00J529k80j142
2697f67M06L09K48N8j176N41J153p79n41K66L58N08q93p39J238M52r19n05O69
2716a3N26k18n61k96R45O12j447m67J473j62n10k85j91J347m9j690O88J060l99
2735C63n30l10M28R18p37j177P61J217o65j072N46P33Q8n23j005J006J145j490
$$ plain form
2753 -304 -861 20 418 652 -593 -966 889 791 -657 -482 268 664 216 -876 -424 871 438 -993
2771 -993 -676 774 481 -441 -634 25 1066 198 -1283 -27 944 13 -403 -706 231 1283 -595 -1152
2789 -1152 613 863 -182 -674 -228 612 615 -690 -913 702 984 -847 -842 577 580 138 -707 -608 1185 567
2809 567 -1093 -362 625 585 -201 -1066 177 1332 -148 -1018 29 869 403 -664 -723 534 906 -486
2827 -486 -1229 441 1101 -269 -735 -199 701 879 -982 -917 1080 566 -591 -665 -164 1023 265 -1310
2845 -1310 -173 1237 270 -847 -449 587 704 -271 -1032 13 1236 -99 -1303 137 890 277 -392
2862 -392 -839 659 1223 -902 -886 589 549 119 -752 -573 1065 731 -996 -671 980 804 -589 -774
2880 -774 238 740 154 -1112 -407 1125 295 -832 -492 433 933 -277 -1348 591 1051 -532 -609 -153
$$ packed form
2753c04n57Q81L98K34j245l73J855r8j448J75P50L96m48j092M52J295m33j431
2771i93L17J450k93r22j93O59J041q68j481J256R71r31m16l03R37J052j878n57
2789a152J765K50j045m92M46Q40Lj305k23J615K82j831NJ419Lm42q45R9J793o18
2809E67j660P31R87m0p86q65J243J155j480q70J047Q40m66j067n9J257L72j392
2827d86p43J670O60j370m66N36R00J78j861O5J997n14j157p4N01J187p58j575
2845a310J137J410r67j117L98J036J17r75p61J045J223j335j204J440P53o13o69
2862c92m47J498N64k125J6J475m0m30q71J79J638l34j727L25J651j76j393j85
2880g74J012N02n86j266P05J532q30j127L40R25N00j210j071J939M60j583p7M56
$$ plain form
2898 -153 409 762 -706 -946 829 1021 -608 -872 547 767 -149 -722 -456 778 656 -1059 -592 825
2916 825 449 -191 -765 -147 1327 41 -1288 191 807 10 -567 -637 357 839 -227 -1023 216 1021
2934 1021 -120 -961 2 638 300 -643 -837 752 749 -726 -450 134 561 452 -925 -430 1214 219 -901
2953 -901 -268 425 493 -291 -789 155 848 58 -806 -11 787 191 -481 -606 271 963 -523 -1029 688 549
2973 549 -332 -170 -320 402 823 -755 -646 814 465 -527 -563 189 581 -14 -594 -263 590 333 -648 -266
2993 -266 289 349 -37 -854 69 1009 -308 -799 349 304 259 -128 -658 406 681 -359 -527 223 442 -69
3013 -69 -559 -70 564 315 -444 -340 623 323 -328 -221 -195 527 329 -967 -119 854 -149 -321 -76 75
3033 75 595 -113 -659 229 512 -199 -381 -96 310 137 -279 -423 260 639 -495 -485 496 92 -88 -110 -488
$$ packed form
2898a53N62L53j468k40J775J92j629k64J419K20r16n73K66J234j22j715M67J417
2916H25l76o40n74O18J474j286j329J479O16p97n77p0R94M82j066p96J239Q05
2934A021j141q41R63O36l38r43j94J589lj475K76N84M27j09j377M95J644r95j120
2953i01O33O93O8p84m98R44O93p90q64P95P98n96o72j25Q77O92j486n06J717j39
2973E49q81J62j50P22M21j578J09J460l49r92l6P52L92n95n80L31Q53k57r81L82
2993b66N55O0l86q17R23R40j317m91J148m5m5l87n30J064K75j040j68P50K19n11
3013f9m90M89O34k49p59J04R63l00o51J07K6P22j98j296Q48R73j003j72K45J51
3033G5N20p08n46Q88K83p11j82K85M06j73m16j44O83L79j134J0R81m04j80k2l78
$$ plain form
3054 -488 413 411 -659 -69 397 168 17 -345 14 490 -172 -462 43 234 -16 -254 -244 152 391 -35 -521
3075 -521 250 544 -356 -133 117 -130 352 -170 -513 472 201 -336 13 56 143 191 -343 -43 334 44 -305
3096 -305 -58 144 67 -36 -99 -84 447 75 -526 324 258 -260 96 -177 -89 442 -176 -371 338 76 -29 30
3118 30 -61 164 179 -206 -176 133 190 -285 -74 100 -83 117 -118 -178 326 0 -251 247 -100 -15 218 -389
3140 -389 -31 332 -282 -32 109 -30 135 63 -162 71 130 -139 -196 121 17 -144 159 -114 -99 366 -212
3161 -212 -75 287 -177 -107 127 -295 56 128 -367 53 188 -97 74 -3 -59 74 53 -128 -109 162 -189 -143
3183 -143 263 -117 -98 284 -190 12 289 -292 -11 270 -171 95 46 -252 119 -64 -92 143 20 -9 104
3204 104 26 -41 2 74 -184 14 119 -283 83 155 -248 237 128 -333 257 100 -348 193 -1 -290 193 -70
$$ packed form
3054d88R01kj070N90M66k29j51l62L59M76o62k90N05J91k50k38J0L96K39m26m86
3075e21P71K94r00K23K50k47M82n22l43R85k71n37L49M3Q7M8n34L00L77k90l49
3096c05K47K02p7j03o3J5N31l72o01Q50o6n18L56k73Q8N31o18j95P09k62j05N9
3118C0r1K25J5l85L0L09N7m75K11J74j83K00k35o0N04l26k51M98l47Q5K33o07
3140c89L58L63o14K50J41j39J65p2k25K33N9k69n7L17j04j61L03k73J5M65n78
3161b12J37L62m64P0K34m22L51P2m95M20J35k85J71p7n6J33k1j81J9K71l51M6
3183a43M06l80J9L82m74K02K77n81K81K81m41K66m9k98L71j83k8K35j23k9J13
3204A04p8o7M3P2k58J98J05m02L66P2m03M85j09m61N90j57m48N41j94k89M83k63
$$ plain form
3226 -70 -191 62 72 -12 43 60 -56 52 120 -139 -9 73 -275 38 88 -218 217 55 -247 251 -1 -219 265
3249 265 -109 -69 157 -125 -142 144 -54 -45 59 101 -41 -36 34 -112 53 30 -158 143 -25 -126 152 -61 -179
3272 -179 269 -206 -76 289 -187 -94 160 -163 -6 77 -209 32 198 -17 -99 135 94 -98 136 -23 -150
3293 -150 266 -39 -321 287 -5 -116 120 -211 39 271 -215 -37 222 -40 -51 -122 -71 98 -17 -201 -28
3314 -28 176 76 -116 106 41 42 143 -305 -147 380 -174 -197 220 -112 159 108 -250 154 217 -117 -29 82 116
3337 116 132 -192 -88 76 189 -158 -166 287 108 -132 61 -195 223 188 -524 20 330 -212 -58 -95 -89 417
3359 417 -81 -345 201 305 -110 -170 -54 163 142 -125 -254 140 388 -193 -251 262 103 72 -190 -260 302 106
3381 106 -408 51 136 63 172 -277 -81 512 -95 -364 -18 222 56 -195 -268 107 286 -59 -458 134 490
$$ packed form
3226g0j21K53J0q4N5J7j16J08O8k59J30Q2l48L13N0l06M35j62l02M98k52k18M84
3249B65l74M0K26k82j7K86j98RJ04M2j42NP0j46J65k3j88L01j68j01K78k13j18
3272a79M48m75J30L65m76R3K54l23J57Q3k86K41J66k15q2K34m1j92K34j59j27
3293a50M16l05k82O08k92j11K36l31K50K32m86J78K59k62j1p1N1J69j15j84J73
3314b8K04j00j92K22o5JJ01m48J58N27n54k3M17l32K71n1l58M04O3l34Q8J11L4
3337A16J6l24J04J64J13l47qM53j79k40J93k56M18l5p12N44L10n42J54l7ON06
3359D17m98k64N46J04m15o0J16K17k1k67j29L94K48n81n8N13j59l1k62p0N62j96
3381A06n14M59Q5p3J09m49J96N93o07k69L46K40j66k51p3L75J79l45l99N92L56
$$ plain form
3402 490 -184 -218 -62 94 370 -218 -500 468 215 -239 -108 -28 307 300 -427 -143 472 101 -409 -219 265
3423 265 139 -102 -345 -78 530 144 -525 114 363 34 -70 -375 152 540 -276 -420 282 232 11 -278
3443 -278 -189 392 285 -367 -267 290 262 -170 -431 13 369 210 -515 -194 580 125 -438 -10 66 370 65
3464 65 -679 100 663 -208 -416 29 261 291 -221 -410 308 497 -254 -555 98 502 -101 -423 -222 334 417
3485 417 -491 -302 483 219 -78 -330 -154 573 99 -716 -52 544 135 -305 -220 274 478 -144 -456 48
3505 48 502 2 -563 -96 359 216 -311 -525 361 502 -426 -335 255 347 203 -480 -347 620 269 -512 -261
3526 -261 312 323 -126 -558 57 523 60 -653 -143 532 61 -412 -282 111 639 -123 -715 294 580 -194
3546 -194 -329 -172 313 402 -497 -452 382 373 -209 -472 84 537 89 -539 -130 581 242 -517 -233 264 242 -10
$$ packed form
3402D90o74l4J56J56K76n88k82R68k53m54J31Q0L35pp27K84O15l71n10J90M84
3423B65j26k41k43K67O08l86o69O39K49l29j04l05N27L88q16j44P02n0k21k89
3443b78Q9N81j07o52J00N57k8m32k61M44L56j59p25L21P74m55n63M28P6L04l05
3464F5p44P79N63q71k08M45K32L0n12j89P18J89p51l01O53M04o03l22K01N56Q3
3485D17r08J89P85k64k97k52J76P27m74q15O64N96m09m40Q5M94K04o22l12N04
3505D8M54n00n65M67M55j43n27k14Q86J41r28R1N90R2j44o83J33R67l51p81K51
3526b61N73J1m49m32O15M66m63p13N10O75m71m73J30L93N28p62n92J009K86p74
3546a94j35J57M85Q9q99M5Q34rn82k63N56M53m48o28M09P11l39p59K84M97k2k52
$$ plain form
3568 -10 -495 -80 775 13 -623 207 461 164 -228 -430 278 421 -310 -474 38 508 61 -453 -130 556
3588 556 365 -436 -429 507 316 -351 -215 -53 394 266 -626 -219 755 72 -394 -196 206 396 -195 -607 155
3609 155 466 -34 -446 -105 433 214 -270 -329 249 473 -235 -500 288 276 1 -215 -253 425 405 -526 -241
3630 -241 421 260 -60 -381 -50 577 -7 -544 -87 418 165 -280 -158 149 399 -30 -534 105 580 -252
3650 -252 -431 90 179 185 -277 -461 328 292 -250 -269 41 317 107 -483 -187 458 185 -459 -258 373 165 -116
3672 -116 -200 -47 502 114 -614 -85 452 0 -158 -228 63 438 -252 -396 242 295 47 -222 -188 317 245 -357
3694 -357 -268 345 288 -219 -140 132 170 126 -214 -242 449 186 -443 14 124 125 -8 -415 21 542 -56 -261 102
3717 102 184 77 -194 -209 183 200 -178 -294 118 251 -86 -124 -38 197 288 -308 -261 363 -43 -172 -103 -96 321
$$ packed form
3568a0m85M15Q55p62o36Q30K54k97l92k02P08J43p31j64N12M70m47n14L23O86
3588E56j91q01PR36j91o67J36J62M47j28q92M07R74o83m66J98M02J90n91m12P62
3609A55L11n00m12L41N38k19m84n9N78K24p08k65P88j2k75k16l8O78k0r31K85
3630b41O62j61l20l21L31O27n84n37M57N05k53m45J22L07K50m29n04O39M75q32
3650b52j79N21Q9Om62j84P89l6n42j9L10K76k10n90K96O45k73o44K01O31k08k81
3672a16q4J53N49l88p28N29N37m52j58p0K91L75o90j44O38N3k48k69L4N05p2o02
3694c57Q9O13n7n07P9K72L8m4l40k8O91k63o29M57J10Jj33m07M36N21n98k05L63
3717A02Q2j07k71j5L92J7l78j16M12J33l37l8Q6K35R1n96M7O24m06j29O9PM17
$$ plain form
3740 321 132 -382 65 352 32 -178 -44 77 216 -78 -241 -52 350 2 -271 151 169 35 69 -157 128
3761 128 321 -272 -238 126 3 64 -87 -153 211 118 -237 4 139 29 -42 -127 0 152 101 -294 -35 305
3783 305 -55 -99 79 -32 155 117 -267 110 151 -198 -54 -25 9 201 -116 -172 178 129 -23 -43 73 111 34
3806 34 -67 -127 82 162 -286 -57 250 -73 49 28 -150 222 45 -219 140 102 -121 -37 -121 18 136 -60
3828 -60 -63 63 122 -29 -57 61 -3 83 -39 -177 108 105 -220 78 14 -48 187 -208 -152 228 -75 -160 102 -38
3852 -38 -19 59 -61 39 151 44 -82 17 62 -119 -42 11 -83 67 -13 -124 187 -14 -87 133 -126 27 182
3875 182 -156 2 91 -161 2 14 -69 33 54 -26 -46 156 -40 -88 122 50 -113 95 -58 -127 164 -136 -76
3898 -76 150 -120 21 109 -106 45 5 -159 25 -41 -120 64 10 -4 105 -27 -70 -33 121 -99 -33 135 -112
$$ packed form
3740C21j89n14M47K87l20k10J34J21J39k94j63J89M02l48k73M22J8j34L4k26K85
3761A28J93n93L4L64j23O1j51o6L64r3l55K41J35j10p1q5J27J52n1l95K59L40
3783C05l60m4J78j11J87l8l84L77M1l49J44K9L4J92l17n6L50m9j52k0J16L8p7
3806C4j01o0K09Q0m48K29L07l23J22k1j78L72j77k64L59l8k23Q4q4J39J18j96
3828f0lJ26N9j51k8J18o4Q6j22j38K85ll25K98o4o2K35l95N6L80l03q5K62j40
3852c8J9P8j20J00J12j07j26R9M5j81P7N3r4J50q0j11L11k01p3K20k59J53J55
3875A82l38J58Q9k52J63J2q3J02K1q0k0K02j96m8K10p2j63K08j53o9K91l00O0
3898g6K26k70J41Q8k15J51m0j64J84o6p9J84n4j4J09j32m3L7J54k20O6J68k47
$$ plain form
3921 -112 -33 130 -142 -23 189 -109 40 59 -124 50 70 -93 104 45 -8 27 -50 -7 -50 -4 -26 36 99 -80
3945 -80 6 108 -92 17 49 -210 108 145 -172 132 75 -70 108 29 -50 78 -13 -138 -21 2 -20 -39 15 -43
3969 -43 37 130 -117 92 166 -134 40 54 -138 112 33 -161 168 32 -71 171 -11 -46 66 -35 -57 54 -21
3992 -21 -130 -49 64 -50 14 13 -146 161 129 -183 9 37 -167 83 -109 -89 195 -127 -97 122 -52 -9 58 -87
4016 -87 117 62 -160 -77 37 52 -25 -32 20 -31 113 -43 -155 227 20 -87 31 -50 2 114 -218 7 226 -92
4040 -92 -16 52 -15 136 -43 -106 77 196 -62 -165 46 129 -33 74 -57 59 185 -217 -150 177 -62 -55 -5
4063 -5 -98 99 88 -281 -3 128 34 -33 -103 87 120 -102 -202 -38 150 -9 -141 14 26 49 11 -223 131 192
4087 192 -229 -89 107 -42 84 -138 -167 210 111 -198 15 129 112 -9 -73 -28 198 58 -260 -43 213 59
$$ packed form
3921a12P9J63k72J19K12k98J49J9j83J74K0j63J97n9n3L5p7M3m3M6k2O2O3j79
3945h0Q6J02k00J09L2k59L18L7l17L04n7j45J78p9p9J28r1j25J17K3k2j9N4n8
3969d3Q0R3k47K09P4l00J74J4j92K50p9j94L29j36j03K42j82l5J12j01k2J11p5
3992b1j09Q1J13j14O4jj59L07l2l12J92K8k04K50j92K0K84l22L0K19j74M3O7j45
4016h7K04n5k22Q3J14J5p7pN2n1J44j56j12L82k07j07J18q1N2J12l32K25K19l18
4040i2P6O8o7J51j79o3J83J19k58j03K11Q3j62J07j31J16J26m02O7L27k39PN0
4063er3J97j1l69K78J31r4o7p0J90L3k22j00J64J88j59j32J55J2K3l8k34L54O1
4087A92m21J40J96j49J26k22k9L77r9l09K13J14j7j21o4M5K26j40l18K17K56j54
$$ plain form
4109 59 -126 -67 0 240 58 -311 147 187 -95 -8 -75 106 254 -214 -225 120 145 -41 -119 41 173 53 -157
4132 -157 -159 204 150 -307 -79 169 117 13 -207 -51 334 38 -217 12 149 58 -189 -300 81 257 -175 -225
4154 -225 110 215 65 -172 -36 195 177 -233 -391 250 177 -257 -42 122 141 170 -237 -120 300 -2 -272
4175 -272 -94 55 256 -99 -385 90 255 19 -180 -59 247 126 -90 -201 67 266 -123 -310 166 232
4195 232 -14 -127 -153 306 325 -303 -126 244 126 -77 -262 -44 258 6 -298 -18 323 198 -259 -144 169
4216 169 166 42 -311 16 355 -97 -249 44 123 166 -134 -275 264 252 -202 -167 67 164 97 -224 -116 278 157
4239 157 -247 -237 368 144 -178 -171 -18 174 52 -367 -37 258 84 -118 -144 35 338 -97 -244 132 178 -89
4261 -89 -251 -152 225 210 -205 -197 203 285 -138 -254 123 240 2 -239 -227 299 158 -360 -126 170 152 8 -322
$$ packed form
4109E9j85N9O7K40j82l69M58M0k82Q7o7J81J48m68j1L45K5j86p8J60J32j20k10
4132a57kL63n4m57K28K48n2j04k20J56L85k96k55K29J37r1k47j11L81J76m32n0
4154b25L35J05j50k37J36K31j8m10j58O41p3m34K15J64J9K9m07J17M20l02k70
4175b72J78J49K01l55k86M75J65k36j99J21L06j21k16j11K68J99l89j87M76O6
4195B32k46j13k6M59J9o28J77L70j18k03j85K18L02k52l04K80L41j25m57J15L13
4216A69lj24l53L27L39m52j52K93P9M3l00j41N39j2m54L5K34R7o7l21J08L94j21
4239A57m04J0O05k24l22PJ53J92j22m19L30K95j74k02k6J79L03m35j47L76M6k67
4261h9j62R9L77j5m15QM00Q2m23j16L77J17k38k41J2N26j41n18K34K96j8j44l30
$$ plain form
4284 -322 16 353 -36 -275 2 204 160 -172 -207 179 267 -97 -313 4 342 -57 -233 -62 155 288 -212
4305 -212 -320 308 110 -162 -126 -17 325 69 -296 -27 284 48 -189 -183 175 233 -156 -225 61 297 -6 -272
4327 -272 40 226 37 -80 -178 60 327 -227 -257 176 89 51 -133 -132 241 160 -189 -135 198 195 -159 -164 54 154
4351 154 10 -210 -162 319 152 -261 -24 21 211 35 -319 110 268 -84 -138 14 129 230 -183 -146 168
4372 168 164 -102 -196 86 165 -74 -127 -184 125 252 -200 -146 271 66 -52 -99 -22 227 -14 -226 79 90 59 -87
4396 -87 -183 93 198 -81 -122 30 127 -43 -181 -6 132 86 -34 -232 107 190 -189 -88 94 -29 60 -173
4418 -173 -176 214 32 -187 -63 112 113 51 -171 46 199 11 -185 -47 142 6 -146 0 -26 252 -2 -122
4440 -122 172 88 -76 37 -116 -9 140 -177 -105 126 20 -79 -70 43 137 -21 -97 10 113 46 -146 -42 41
$$ packed form
4284c22L38L37l89k39K77K02m4l32l5L86Q8l64k16L17L38l99j76J71K17J33n00
4305b12j08O28j98k72L6J09L42k56l65K69L11k36k37OL58N8l89o9K86K36l03k66
4327b72L12J86j89j17r8K38K67n54l0M33q7l8j84JL73q1l49N4L33ll54nK18J00
4351A54j44k20M8M81j67m13K37M5J90j76l54M29J58l52n4J52J15J01m13L7L14
4372A68mk66r4K82P9k39n3n7L09J27m52N4M17k05j18m7P7K49k41k12L05J1l1j46
4396h7r6K76J05k79m1J52R7j70j38J75J38m6j20j98L39Q3l79J01J82j23Q9k33
4418a73lL90j82k19J24J75Jo2k22K17J53j88j96J38J89j36j52J46k6K78k54j20
4440a22K94q4j64J13j53J07J49l17P2K31j06r9RJ13R4j58p6J07J03o7j92J04Q3
$$ plain form
4463 41 62 34 -72 -40 224 -69 -144 75 1 61 67 -187 98 115 -93 -21 64 129 63 -21 -61 83 23 -104 -146 140
4489 140 72 -91 -17 -6 -19 28 -197 -20 175 -30 -78 -54 -125 131 -14 -126 75 113 -145 -23 1 69 14 -33
4513 -33 -64 -21 120 -81 -142 73 -59 -41 47 -85 105 124 -100 -48 96 -78 76 -69 -64 53 -34 -114 -11 70
4537 70 -2 -43 27 -14 -25 -41 -45 36 111 -83 -63 -9 -105 91 -23 -67 129 38 -83 39 17 -16 25 -61 -37 -72 59
4564 59 -80 -78 27 -24 55 19 -33 35 54 -128 23 -34 -105 86 -58 -61 244 -29 -88 176 -128 -96 137 -51 38
4589 38 -24 -44 11 0 21 -102 -50 119 -18 68 40 -71 87 -46 -85 67 -42 -85 82 -81 11 77 -105 45
4613 45 66 -11 20 26 15 4 2 -31 -27 29 61 -5 62 18 -23 59 17 -88 78 -59 -23 47 -85 51 30 -102 54 26
4641 26 -18 19 16 -96 16 27 -38 -49 17 1 -47 90 29 -15 113 -49 -52 32 -162 -45 35 -27 -28 13 -177 32 59
$$ packed form
4463D1K1k8j06L2K64k93p5K19p4O0Ok54K85J7k08P2Q5O5o6q4m0J44o0j27m2K86
4489A40o8j63P4J1j3M7k25J77J95k05m8K4p1K56j45j12K01L8k58J22K4O8n5m7
4513c3l1M3J41k01o1K15j32J8Q8j32J90J9k24N2J44j74J54j45NJ17q7q0J03Q1
4537G0p2m1P0m1j1j6mQ1P5j94K0N4r6J96j14m4J96r1j21J22k2l3M1q6K4l5J31
4564E9j39KJ05n1P9l6n2O8J9j82J51n7p1J91j44lL05k73n9K64l04L2K33j88Q9
4589C8o2k0N5j1K1j23N2J69j37Q6k8j11J58j33l9J52j09m3J67j63R2O6j82J50
4613D5K1p7L1Oj1j1kl3MN6L2o6O7m4m1Q2m2j05J66j37L6P0j32J36k1j32J56k8
4641B6m4L7lj12J12J1o5j1O6j6m8J37o1m4J28j62lQ4j94J17Q0o2jM1j90K09K7
$$ plain form
4668 59 -107 96 36 5 1 -38 -11 17 11 -11 -69 36 -17 23 114 -65 12 56 -139 34 73 -77 -12 -65 -58 65 2 -23
4696 -23 45 6 -15 -47 -55 4 -6 9 -32 14 39 -72 35 87 -55 21 -1 -80 128 68 -97 43 37 -86 34 -90 -29
4723 -29 61 -79 0 3 43 -30 -43 9 -54 28 11 -136 76 62 -60 -16 0 -23 64 -16 -49 72 -42 -39 -46 -33 -20 -2 -163
4752 -163 9 85 3 -53 -9 57 9 -18 -33 -33 84 -38 -100 131 -21 -44 88 -68 33 68 -157 -59 135 43 8
4777 8 -56 -52 123 89 -103 -4 60 97 -41 -45 7 1 -67 -127 -55 104 -58 -75 87 38 77 62 -178 46 41 -129 -60 88
4805 88 28 16 -57 -21 23 42 -65 -85 112 111 -46 -30 -49 -7 123 -99 -23 151 -35 3 -52 -52 203 -4 -135 113
4831 113 71 -54 -62 -103 72 81 -95 -49 -10 100 -60 -20 84 47 15 -118 -126 89 92 -166 67 -5 59 49 -155 -111
4857 -111 160 29 -109 -26 75 30 -110 -76 16 84 1 -174 80 162 7 -84 -40 16 95 -62 -177 104 81 -38
$$ packed form
4668E9j66K03o0l1ml9K7K8ok2n8J05n3M0R1j79P7M4j95J73L9j50O5n3PJ23o3k5
4696b3O8l9k1l2qN9j0J5m1M6K5j11J07N2j42P6k2p9K08o0j65J40oj23J20j24O1
4723b9R0j40P9LM0p3j3N2o3Q2j7j47K12j4j22M4J6k3Q7q0l3J21j14LpJ3J3J8j61
4752a63J72P6q2n6M4O6m8k7j5%J17j22o2K31j52k3J32j56J01L5k25R8J94r2l5
4777Ho4MJ75l4j92R9O4L7j38mN2oo8o0P2J59j62j7J62m9L9j5k40K24nj70O9J48
4805H8o0j2p3L6M4J9j07k0J97jj57J6j9M2J30k22P6J74j86L8n5%K55k07j31K48
4831A13m2j25qm1J75Rj76M6L9J10j60M0J04l7l2j33qK15Lk58K33p2O4j0k04M4
4857a11K71j31j38Q3J01m5j40L4R2O8q3j75K54Q2j55r1M4N6P9j57j15K81k3j19
$$ plain form
4881 -38 -56 33 115 88 -149 -48 83 15 -83 -134 32 74 -30 -90 -29 183 30 -174 -20 149 16 -65 -99 31
4905 31 175 -103 -142 148 74 -10 18 -107 90 88 -149 -53 10 130 -139 -123 41 81 63 -166 -68 136 31 -185
4929 -185 -48 51 83 -66 -206 22 137 -44 -186 44 144 109 -84 -89 31 63 -32 -189 66 141 18 -109 -83
4952 -83 121 115 -77 -76 97 42 -5 -113 -20 151 14 -123 -55 151 40 -49 -105 -5 169 -21 -158 -3 170 6
4976 6 -141 -36 78 87 -22 -145 71 156 -72 -127 11 21 62 -110 -112 164 97 -110 -41 38 101 10 -101 36 127
5001 127 53 -192 -95 141 90 -55 -23 27 119 67 -138 5 136 -22 -102 -65 54 76 -174 -64 66 110 35 -93
5025 -93 47 102 26 -151 -58 87 86 -188 -102 102 63 7 -114 -34 233 -1 -141 44 94 53 -34 -112 43 138 -37
5050 -37 -128 50 70 -5 -46 -82 53 103 -1 -137 32 94 -78 -35 9 86 134 -116 -39 149 14 -64 27 65 119 38
$$ packed form
4881c8j8Q9Q2k7k37J01J31o8r8n1J66M2j04o0O1K12j53k04J54J69j33q1l4J30
4905C1J44k78l9K90p4q4K8j25J97kk37R6O3J20k69J6J64M0j8k29R8K04j05k16
4929a85J37R9L2j49j40K28J15j81j42K30J00l5j93nJ20L2r5j57K55P5j23j27K6
4952h3K04oj92JJ73n5m7j08R3J71j37j37O8K06j11q9n6J00J74j90j37J55J73j64
4976Fj47J05J14Rj09j23K16Q5k28n5J38J0M1j72kK76o7k07O9P9O3r1j11J37R1
5001A27p4k45R7K36n1j45L2N0R2n2k05J43J31j58q0L7J19K2k50J10J30M4p5j28
5025i3J40N5p6j77R3J45jk74Q6K04l9n6j21Q0K67k34j40J85N0m1q7p8J55R5j75
5050c7r1J78K0p5m1l6J35N0j04j36J69O2j72M3M4P7M8k50P7J88j35p8R1L8N4q1
$$ plain form
5076 38 -157 47 67 52 1 -19 118 18 -70 -49 64 38 -38 -102 28 83 0 49 -80 110 100 -108 -23 143 -33
5101 -33 -15 -74 -29 73 -35 -101 -22 79 120 -49 -49 30 37 -4 -156 -98 103 -6 -57 6 37 133 5 -71 10 90 -57
5128 -57 -23 30 37 89 -89 -50 116 1 -42 -12 42 56 -43 -8 -16 64 -9 -95 31 128 -28 9 -3 -30 123 19 -61 48
5156 48 75 42 -56 -37 61 -26 -56 -140 38 6 -23 -18 28 49 21 -23 -37 185 12 -27 -32 23 20 67 -72 -35 41 -27 -116 -27
5186 -27 3 12 -40 -28 3 6 -36 -60 32 39 -12 35 -27 9 66 -66 -70 7 29 39 14 0 88 -3 -72 16 102 -50 -64 -67 -57 -14
5218 -14 22 5 -64 89 48 -17 46 -7 -26 24 15 -52 47 -10 -48 5 -13 -6 79 -71 46 47 -109 36 -76 10 -63 6 26
5247 26 -13 33 -39 -35 38 -13 -71 24 -61 -35 51 -73 56 55 -49 13 40 13 63 -50 -20 128 -18 -6 -20 -79 6 -52
5275 -52 -15 55 45 7 -35 -61 82 -68 -7 7 -104 8 -12 -110 -49 31 -102 11 -63 29 24 15 34 30 -7 83 31 -20 0
$$ packed form
5076C8j95K04K0j5n1k0J37j00q8K1J13k6p6o4J30N5q3M9j29J90j0k08Q5J66j76
5101c3J8n9M5J02j08o6P9J01M1j69%P9Pm1j52N8K01j09n1O3L1R6j28p6Q1Q0j47
5128e7L4N3PN2j78L9J66j15m3L0N4J4r9L5qQ0p3q6J26R7j56L7j2k7J53j04q0J09
5156D8K7l3r8J9R8q7l0q4J78l2k9NM6K1k8m4j4K22j73l9nN5lM7j39L7P6o8q9Q9
5186b7L0Rn2J2L1Lm2k4R2Pn1M7o2L6N7j32mP7K2J0k5j4Q8r1o9Q8Q6j52j4lJ0M3
5218a4L6j7o9J53m1o5O3n3j9N0ro7R9n7l8N3j8PQ5j50J17Jj56J45j12Q6p3O9K0
5247B6l9M6p2MP3n1n8R5q5K6Q6j24J29jj04O2K7k7N0j13L0J48j46J2j4n9Q5n8
5275e2L7P0j0l8m2k6J43j50O1J4j11J12k0r8O1Q0j33J13p4R2nrJ9ml7R0n2n1K0
$$ plain form
5304 0 -67 31 28 65 -41 -48 82 -15 -132 2 -57 -44 74 -50 26 3 10 24 40 15 20 -30 32 3 -18 15 -56 -50 -13 -7 8
5335 8 24 -44 88 97 -81 7 -64 -57 15 -107 21 44 -15 35 78 -3 37 46 -56 -17 29 -55 -53 -10 18 -3 28 7 -7 37
5365 37 23 13 38 -34 0 81 -25 -6 20 10 -49 9 -35 9 9 63 -8 11 56 11 41 39 -54 31 10 28 33 -28 22 2 -72
5396 -72 -2 31 -13 18 18 -22 -56 -42 -18 27 18 40 6 -26 -29 -35 -20 37 29 11 15 -14 10 -88 12 61 -40 61 -26 -50 15 -36
5428 -36 -87 67 -43 -44 16 -8 23 2 28 -65 -29 -9 -53 -55 17 -38 13 -12 -53 56 -34 -72 72 -44 22 62 12 11 101
5457 101 -46 32 39 14 -6 10 1 -1 -10 -50 -56 14 72 -92 -2 89 -36 -83 -38 -30 65 -30 -60 3 -1 -8 14 -71 -24 -59 -58 -55 56
5490 56 28 -55 -62 -8 27 60 21 -55 39 50 -13 59 -14 -14 68 -45 40 39 -37 -5 9 -46 16 -15 -42 28 5 7 9 69 45 -36
5522 -36 -45 -34 -20 55 -10 -87 87 -5 -18 43 -37 29 79 -17 -73 24 -12 -123 -52 22 124 -90 -59 -13 39 89 4 -24 79
$$ packed form
5304@o7R8lL7j06pJ30r7j17J34n9J3J18j24P6k3PJ4J6k5Nn0O2k9k1L3p1OL7OJ5
5335HJ6o8J32Rj78Q8p1PP2j22J28K3n9N0M3q1M0Rj02L9M6q4KM3K8k1L1k1j4M4
5365C7j4j0K5p2L4Q1j06J9K6j0n9N8m4M4%N4p1J9M5m5L0kr3Q5k1J8No1N0k0p4
5396g2P0L3m4L1%m0l4J4K4M5rK2l4l2loJ5N7qj8Mk9K4r8J00M9j01J01q7k4O5n1
5428c6n1J54j10jO0k4L1k1K6r3L6K0m4kP2n5N1k5m1J09r0l8J44j16O6M0n0jR0
5457A01j47P8Pk5k0J6rkrm0oP0N8j64R0R1j25m7M5QR5r5l0O3mpK2q5M7l5JLJ11
5490E6k8q3pN4L5L3l9p6R4J1o3P2p3%Q2j13Q5jp6L2J4n5O2l1k7P0k3KKO0k4q1
5522c6rJ1J4P5o5p7J74r2j3O1q0O6N0r6n6R7l6j11P1P4J02k14L1M6N2N0q5k8J03
$$ plain form
5551 79 27 -61 6 -26 44 -88 -63 -46 1 7 -3 -79 47 83 -114 3 29 36 6 12 -2 3 -18 -61 -96 64 75 30 3 3
5581 3 98 38 -131 -17 28 -42 -42 -17 -12 92 -40 -43 30 -11 -26 -73 25 40 3 -22 -1 39 67 7 -34 60 -8 41 16 26
5611 26 80 35 -93 35 83 3 -86 -40 6 111 18 -6 -47 50 68 -16 -26 -3 61 13 -72 -1 49 -56 50 -20 33 74
5639 74 -93 -97 17 17 -28 17 60 41 -60 -63 -73 52 74 -91 -56 73 13 -66 -42 34 79 -34 -40 33 58 1 64 -87
5667 -87 -12 91 5 -46 52 2 -46 4 54 56 -12 28 47 73 66 -48 -37 58 61 -75 -57 -36 80 24 -84 84 -9 105
5695 105 23 -78 -52 60 -46 41 -1 -19 51 -38 -55 23 32 -15 -33 100 54 0 -4 -53 10 62 -50 -7 57 54 -80 -54
5723 -54 -2 25 41 -16 -27 -46 -45 -15 -46 4 29 -81 -2 23 32 5 -15 -12 -4 18 -44 -56 45 68 -53 -9 39 8 58 -66
5753 -66 -71 33 2 -54 -71 16 20 -12 -15 39 61 -59 -123 -28 51 6 -43 -70 22 2 -76 -34 71 42 -23 -69 -31 -14 8 -87
$$ packed form
5551G9n2q8O7l2P0j32K5J7M7Oj0p6J26L6j97J17K6Pl0Oj4Nk1m3l5J60J1m5k7%
5581CR5o0j69J14M5p0%K5NJ04j32lP3m1j5m7R8J5l7k5K1M0K8o0m1R4o8M9k5J0
5611B6N4m5j28J28M8q0q9M6M6J05r3k4m1R7J8q4j0K3O4m8q5P1N0j05J06p0N3M1
5639G4j67mJ14%m5M5M3j9j01lj0J25K2j65L5J29o0p9K4P6M5j13oP3K5n7O3j51
5667h7P5J03q6n1R8n0m8N0N0Ko8M0J9K6pj14J1R5Lj36J8K1J16n6j08J68r3J14
5695A05q2j01K6J12j06Q7m2j8P0q9j7P8Rm7j8J33m6n4mm9O3N2j12M3O4lj34K6
5723e4N2K7J6n7j1j9JL0l1N0K5j10P9K5Rk7k0LQK2o2j2J01K3j21M4M8l1N0j24
5753f6nJ04l1n6j7Q7Ml2lN4K2j20o4R5P9m5m9k7R2k0p8M2J05k9o5m6L8J7K2r5
$$ plain form
5783 -87 -36 78 -7 -22 -38 -4 38 0 13 -46 99 -15 -2 41 23 9 -23 9 16 61 -12 -27 35 40 2 -21 -76 12 79 -35
5813 -35 20 -23 10 60 -112 -33 19 -37 -16 -58 57 65 -57 -72 1 76 -34 -3 -27 53 -79 -56 33 -37 28 18 -147 50
5841 50 -65 -33 -61 1 45 -69 38 -35 -15 71 -38 -21 -63 -5 32 -53 -48 47 77 -120 36 1 -10 -13 -48 -81 9 30
5869 30 29 -76 -34 62 -72 -13 26 12 5 -42 46 51 -29 -69 -28 -64 31 -80 -115 52 76 -54 -22 -35 42 -8 -74 -7 -29
5898 -29 15 -32 -15 43 0 45 -2 -88 73 37 -32 52 -16 -28 -14 54 -26 30 10 -32 42 -9 21 -26 -8 -3 -21 -10 22 -40
5928 -40 8 22 13 2 -12 31 14 5 106 62 -48 2 76 -16 100 -37 -29 -4 -47 18 17 9 -53 -11 3 5 25 -30 -111 -22 -16 28
5960 28 25 8 -29 38 48 -21 2 -35 84 17 -52 11 60 10 -17 36 -33 -21 28 70 -40 -11 48 -42 56 28 -37 59 20 -54
5990 -54 42 -43 -5 54 11 70 10 0 38 -33 -69 16 10 5 2 -3 -31 21 -30 17 -36 21 -45 4 -14 -34 36 1 -14 53 -2 -32
$$ packed form
5783h7N1J14q5j5j6L4M2l8J3n9J45j14J3M3j8j4l2L2PM5p3j5O2Nl8k3n5Q8O7j14
5813c5N5m3L3N0j72P9N2n6K1m2J15Qj22j5P3P5j10L1k4Q0j32K3Q9p0O5j0j65J97
5841E0j15L2k8O2M4j14J07p3K0Q6j09J7m2N8L7q5NR5L0j97J56l5j1ll5l3R0K1
5869C0jj05M2R6j34N9L9j4pm7Q8Nq0m0M1l6R5j11l5J67K4j30L2j3P7n0o6O7k2
5898b9M4m7J7N8m3M5m7q6J61l6o9Q4o8j2J4O8q0N6k0m2P4n1L0m7J8Nj8J1L2o2
5928d0M8J4rj1j4M3j7rJ01m4j10N0P4r2J16j37QK5m3O5jqo2M2J4KK0n5q1Q9OM4
5960B8lj7l7O7J0o9K3l7J19o7o9O3M9n0k7N3o9J2M9M2j10K9N9r0R8k8o5R6l9p4
5990e4R6q5L8N9m3N9o0j0L8p1l6Q5onlnk8N2n1M7n3N7o6M9j8k0P0l5j5O7n5l0
$$ plain form
6022 -32 41 37 -9 30 -24 -29 -28 22 23 21 5 10 -10 48 24 28 -1 34 -36 33 1 -9 -23 5 22 58 -68 24 4 -34 59 -86 52
6055 52 -70 -40 -54 -65 28 21 -51 9 32 -56 74 -73 -18 80 1 4 21 -57 -23 3 -11 -41 -14 -4 40 -33 -42 -30 -65 -5
6085 -5 11 30 16 -19 18 0 48 34 -18 26 23 -37 4 3 -28 44 11 1 44 -7 -29 35 -22 25 57 -33 30 -34 -11 34 -14 38
6117 38 40 5 41 -34 -27 5 -28 85 2 3 44 -17 -42 20 43 -20 13 -91 2 25 27 6 29 67 11 -14 -12 5 -16 -18 -13 12 -6
6150 -6 -16 16 -8 -5 1 -20 52 66 14 -61 23 16 -18 12 -80 58 -32 26 30 -4 42 13 -28 -29 -45 57 -16 34 26 5 29 -34 -79
6183 -79 -53 40 -2 46 7 -11 41 -13 -60 38 -19 -45 8 37 -24 -31 -32 -21 56 32 -67 20 4 45 -56 -20 -32 65 17 -75 -11
6214 -11 -12 -51 -53 5 -5 -10 -8 5 6 -18 -1 -25 47 -50 -10 19 -25 61 -22 -50 -7 50 -1 -15 -59 0 -89 -48 -17 75 24 -20 -27
6247 -27 14 -6 0 -8 -12 9 19 44 32 10 22 10 -26 -32 23 88 -8 9 -70 54 31 -83 3 -4 -65 -60 -52 24 30 -7 -54 -8 4
$$ packed form
6022c2P3mm6L9n4nJN0Jkj6Nk0N8k4Mk9L5p0O9l2j0j4K8J7L6j26R2k0l8R3j45J38
6055E2j22L0j4j1R3pp2O0K3q8J30j47N5R8p9LJ7p8L4K6j4l0K7J0M4p3rJ2l5O0
6085eJ6J9j4l5L7j8M8j4n2M4lo0M1jl1P2l3j0M3n1k2O4n7M7L2r0O3o4K3M5m8N2
6117C8Kl5L6p5PL2l3J13q3JM1o1k5O2K3o3L3j04R3K3Kk1K3L8n6k5KJ7k1kNK5j8
6150fj0L2k4LOk1P2J4n2p5Q4pl4L0r2J38r0N8Ml4M6k9m1jj6J02p3N0qk1K4o3m5
6183g9K6R3m2M8l9j8N2n4m7R8n7k6N3K9o1pjJ1P7k4r9Q7j6M1j01L6j2R7m8r2O4
6214a1jl9kN8j0nKJ3Jk4J7k4P2r7M0K9m4Q6q3k8M3N7n1j4m4N9q9M1L1R2n1m4p
6247b7M1k0OqmK1J0K5j2k2J2j2l6oN5O5r6J7p9J24k3j14Q6po1NQP6Ol7m7M6J2
$$ plain form
6280 4 -92 -67 21 20 -21 7 -38 -5 -1 -52 -63 90 24 3 -67 -54 -24 -38 -4 -74 16 40 4 13 47 89 -40 -5 -5 -32 -97 -86
6312 -86 1 59 56 -1 -9 10 67 -32 7 33 17 93 -58 -60 38 8 -39 -51 -8 8 -4 -55 -4 25 -2 -30 -76 -16 -7 -60 -20 15
6344 15 12 7 -38 26 -32 77 -86 -46 31 70 -49 -47 3 -22 -30 12 29 16 9 47 -66 -23 85 -41 -21 4 39 7 8 -9
6374 -9 4 -6 -116 2 37 -61 -43 -68 44 -29 7 -9 -85 -15 39 -34 -31 77 59 6 -64 32 16 30 3 -7 32 30 -47 -25
6404 -25 49 54 26 -26 11 21 32 -6 -3 25 57 -39 43 4 70 -14 -2 10 0 -37 -92 26 34 33 -13 3 63 89 24 38 3 17
6436 17 -50 -25 44 57 81 -51 -12 27 32 -1 -6 -9 35 2 -19 -69 -7 32 -7 -7 -17 -35 21 -56 46 63 -4 3 -51 21 41 -13
6468 -13 -8 8 38 45 43 25 6 -38 -13 -22 -16 71 -18 -6 25 -31 18 -18 -29 11 -60 -41 22 84 -74 -19 21 -12 17 37 20 -17
6500 -17 50 -33 48 -17 45 -30 -11 9 -28 24 -20 71 -18 -57 -25 -1 6 -33 23 27 -1 -16 -8 -18 -16 -38 5 6 -9 21 -8 17 -27
$$ packed form
6280Dr6K5Q8jm1K8m5L3Mn1j1J53o6k1p0J3L0j4L4p0R0K4l6RL4M2j29L5%k7o5J1
6312h6Q7N8ln7qJ9N7r9L9K6j6P6j51kR8l0m7j2M3J6j2n1N1K9k7k8m6O0Rn3M0L5
6344A5lnm5O4n8J09j63M0P7L9j19KN0k5qM2J7j3pL8j13M3J08j26K0K5L5l2Jj7
6374iJ3j0j10J18L5r8J8k5J12p3L6j6p6P0N4p3LJ08j8n3p0R6j6J4k7j0L9kp7K2
6404b5P4Nk8n2L7J0J1l8LK8L2r6Q2l9O6q4J2J2j0l7n5J18Qjm6J6O0K6o5J4l5J4
6436A7o7K5O9J3K4j32L9L9Nl3nlM4l3k1n0O2L9l9%j0j8N6p7J02J7o7Pn4P2K0n4
6468a3NJ6L0Pkj8j9m4K5rOQ7q9J2L1n6M9l6j1M0p1J9O3O2j58N5M0l3K9K0j7l7
6500a7O7q3Q1o5O2p5J9K0l7N2m4R1q9l9L2K4Pl9N6Mk8j5Qj0Kk2M3Jj5L0k9K5m4
$$ plain form
6533 -27 -56 -20 -39 -9 -26 36 58 -54 38 -34 61 76 -4 -16 -29 -23 45 -9 8 36 -50 35 23 29 24 -71 12 12 -16 14 -61 -48
6565 -48 35 -15 -44 -40 -17 7 41 10 -38 27 25 12 28 81 -61 -7 1 -53 -12 7 -31 15 -49 10 -52 3 -8 26 -33 12 52
6596 52 -14 -16 -58 -8 -22 2 29 10 -47 2 19 -5 -21 12 -35 -5 -1 55 -35 -10 -35 41 -7 9 -16 6 18 -46 -32 -44 -13
6627 -13 3 46 8 -124 19 -10 19 -2 -33 13 -68 -30 7 45 -1 45 -43 -68 -64 91 -32 -7 25 -41 52 -25 -58 -9 -42
6656 -42 -33 55 23 36 16 58 -3 64 26 -3 -25 27 -56 -18 25 -14 50 10 3 -10 95 14 -12 -30 28 -5 -36 32 -7 -54 -23
6687 -23 -18 29 -21 17 8 24 -57 -25 -28 25 -13 29 19 4 -11 -74 -82 2 27 16 30 25 6 23 0 -41 11 -6 8 -7 54 43 19
6720 19 -92 -58 -41 -35 -16 -51 -10 -32 -45 17 28 21 34 35 32 -49 -65 -66 -29 -52 13 42 -17 13 -32 -23 -61 -37 -8 32 -29 -45 -16
6753 -16 73 6 69 17 -58 4 4 4 3 -6 5 86 -22 30 -23 -17 -47 25 -6 10 -62 -28 -7 -43 -7 -11 -21 -25 42 -2 -27 1 -16
$$ packed form
6533b7k9L6j9L0j7O2K2j12R2p2R5J5q0j2j3OO8n4J7K8q6Q5j2Onr5Q3%k8L0p5J3
6565d8Q3n0k9MK3K4L4l1m8O5kj3J6N3j42N4Qn4M1J9l8M6o4N9o2N5j1L4n9M5M0
6596E2o6km2N0j4K4K7j9n7M9J7k4j6L3m7L0MN6r0K5k5P6m8J6k5K2J2o4J4j2L1
6627a3J6M3l8j32J43k9K9k1l1M6q1L8L7L8m6M6q8k5MJ55j23K5L2o6R3p7l3M9l3
6656d2RQ8l2J3k0M2o1O7l8k9k2N2q3L8M3l9O4m0pj3J05q1k6j8N8l3l1O8l9m7L1
6687b3NM7n0L8rJ6q1L2lN3l8M2j0j5j5o3qQ4K5j1J4nj9J7k3m1N2j7J4j5O1j1k4
6720A9j11L4J7OJ9l5M1k2j3O2J1pJ3Jlq1j6jL7k3O5K9n9L0m5Rl8K4K9M0o1j6K9
6753a6Q9o7O3n2p5O2%%jrJ1Q1j08N2n3Ol0P2l1J6p2L4K1l6L6mj0mO7m4k5K8j7
$$ plain form
6786 -16 87 22 -3 40 38 5 -37 -9 -24 28 3 -11 -5 33 54 2 -13 -8 -16 24 -48 -54 -69 0 9 -3 39 29 10 -62 51 -20
6818 -20 -25 -16 19 -6 -5 42 21 -32 -69 19 -22 47 96 6 21 -12 56 -14 12 -25 -67 25 -31 -96 6 34 34 -21 -28 1 5 -29 38
6851 38 15 -15 10 -39 29 16 -25 -19 -63 37 -50 19 29 -71 15 -19 -54 -78 69 -42 62 44 -55 8 -16 60 9 -2
6879 -2 -15 -17 -36 26 18 -91 -36 32 17 -31 -43 -24 34 0 9 -28 -24 -41 -36 -10 -6 -77 -17 -28 13 5 -10 28 4 -12 28 -28 20 33
6913 33 24 14 -67 21 -36 -30 -46 -41 -109 -17 12 -22 55 -6 75 37 -50 -32 -53 -12 -7 -1 28 -27 14 -15 39 37 46 36 52 -23 3 23
6947 23 -4 -15 -25 39 8 34 -5 18 -14 -51 0 2 -15 -1 10 32 -16 45 4 -16 63 -30 20 3 -4 11 -3 3 -53 49 -9
6978 -9 -34 1 -22 -12 29 -27 -51 -10 -69 -23 52 -28 13 -23 -11 -15 -25 37 -54 44 0 35 46 -10 -17 15 -21 -14 -35 -16 -1 47
7010 47 -11 -28 -62 -24 24 80 -1 -7 -1 -49 -31 -1 -71 -33 -13 21 -5 -6 39 -32 21 42 -48 -24 41 33 12 0 2 -30 -3 2 61
$$ packed form
6786a6J03o5k5M3kl3m2K8j5N2k5j4OL8K1n2j5NqM0p2oj5O9Rj2M2j0j9p2J13p1
6818b0nRL5k5JM7k1n3l7Q8m1O9M9r0J5l3O8p0K6l7m2R2n6o5J02K8%n5pK9Ml4O7
6851C8k3l0K5m9O8j3m1Om4J00q7O9J0j00Q6l4l5k4J47j11J04j8r9O3k4P6n1j1
6879bj3kj9O2qj09N5O8j5m8j2J9N8l4Rl7Mj7NK6Mp1O0j1M1qj5L8k4j6M0n6M8J3
6913C3rj0q1Q8n7Oj6No8R2K9l4P7o1Q1l8q7J8k1M1NOK9n5M1k9N4kRj0J6p5K6K0
6947B3k7j1j0O4l1K6l9K3l2l7N1Kj7J4J1K2m8O1m1k0P9r3N0j7pJ5j4On6J02n8
6978ik5L5k3J0M1n6k4M1n9M6P5q0M1l6J2mj0O2r1R8m4L5J1n6pL2l6Pk1J9J5M8
7010D7n8j7l4L8M8N6q1oOm8J8L0p0L8K0L4k6jM5p1N3K1r0K4O5qk1j2Kl2K7NN9
$$ plain form
7043 61 -13 -8 16 9 -75 -12 -31 -58 8 -31 -19 10 66 -39 4 -68 1 25 -13 8 8 5 33 -43 -34 -12 -21 -74 -46 14 24 -32 58
7076 58 5 -61 21 -20 9 32 -13 -8 46 5 57 -18 -19 51 103 -27 -18 -38 -9 -9 -65 -23 -66 -43 -58 -57 8 39 10 -15 47 -4
7108 -4 -14 -11 -31 58 16 -56 -32 33 46 -37 46 -14 -7 30 -35 -8 27 22 7 0 -33 -9 -10 -49 -11 -61 -25 -39 -11 -29 -3 8 -38
7141 -38 -39 -11 2 -53 -46 -45 -9 -19 22 36 82 18 54 37 27 -28 -38 49 3 -6 8 -13 -5 30 -6 36 16 24 -19 -53 -39 -55 0
7174 0 -53 51 -21 41 2 -36 -3 7 -7 76 27 65 -24 -22 5 25 -17 -40 -39 -11 57 -71 -34 21 -28 38 -20 84 5 -42
7204 -42 17 31 19 -26 -8 -80 -35 16 -52 -62 -31 -4 30 61 11 22 15 -27 37 17 48 -4 58 1 32 6 -16 -87 -46 -8 -5
7235 -5 -41 -19 39 -30 20 -28 12 -31 0 67 62 5 23 23 -13 58 -13 -49 4 70 -24 -20 33 67 -42 -30 -24 -1 -34 27 -10 16
7267 16 63 -12 32 -9 25 -26 -22 -53 27 -6 36 -70 15 9 31 49 7 -14 -1 8 -48 -31 -33 -7 -22 -8 -24 39 -75 24 58
$$ packed form
7043F1p4NK4pq4O3j9k7O6l9J2K9N6j05M3p2O9K4l8K1%lK8p6RK2rn3K8O0J0n6R0
7076E8n3o6Q2m1K9K3m5NN4m1N2p5jP0N2j30Rk0K9%n6M2m3K3j5JO5L1k9k5O2n1
7108dj0Lk0Q9m2p2K4O5J3q3Q3o0PL7o5K7L5nj5pl3K4jl9L8n0L6j4K8j8K6J1m6
7141c8jK8J3n5PJL6j0M1J4M6o4L6j7j0n5j0Q7m6rJ4k1QL5l6M2k0Qm3l4J4j6N5
7174@n3J04p2O2l9l8L3J0j4Q3m9L8q9KK7K0m2k3JK8O8j28L7N5m9O6n8J04p9m7
7204d2N9J4j2m5J8p2M5N1o8j0L1K7L4L1n0J1pm2O4k0L1n2O2n7L1k6k2p1M1L8L
7235el6K2N8o9N0m8M0m3L1O7nn7J8%l6P1p1l6N3O6r4MN3L4j09J2OK3l3O1l7K6
7267A6M7p5M4m1L4n1Ml1Q0l3M2j06Q5oK2J8m2k1J3Rn6J7kK6j5J4j6O3j14R9L4
$$ plain form
7298 58 10 0 -44 -24 24 -29 -7 -30 -21 -12 -39 -70 18 -1 -8 18 10 -35 -35 -18 -10 26 -10 -34 13 -61 -75 25 -21 31 25 8 -15
7331 -15 11 24 9 -2 17 47 -3 0 -31 -29 -18 -20 -11 -16 -2 2 -41 34 35 -1 16 95 -2 -36 -13 29 44 74 -31 49 -52 -32 -36
7364 -36 49 -11 6 -29 -44 49 45 -19 33 104 9 40 56 9 28 10 -24 64 65 4 27 99 -12 93 -31 -48 64 -14 16
7393 16 0 -57 6 3 -19 55 8 26 32 10 -34 4 -33 -77 32 44 44 -32 30 11 -69 79 4 67 16 0 -18 10 -31 8 -3
7424 -3 -3 -14 -20 20 -19 -59 8 -47 39 -16 49 52 25 21 -7 42 -5 -28 -6 18 0 -6 28 4 -8 -19 -46 -74 2 13 40 38 10 -44
7458 -44 -42 1 -60 35 69 -38 20 61 -6 32 -11 30 33 11 -8 46 30 12 8 -16 35 -38 42 8 9 -28 0 0 81 -8 -73 62
7490 62 -35 -18 20 37 19 2 -18 26 0 49 76 18 -66 26 -24 3 -17 25 -55 -11 28 24 16 -14 -30 2 1 -59 -45 46 -47 64
7522 64 -106 -47 -54 1 -27 46 -8 16 -17 0 32 -37 27 -37 27 67 -17 -64 13 -15 -85 40 -15 77 21 -10 7 4 -8 -33
$$ packed form
7298E8m8j0m4K0M8n3K2k3RRk7l1Q8j9pK6qm5%J7QL6l6k4M7p4j4J00m6N2oj7k3
7331a5K6J3j5j1J9L0n0Ll1KJ1kRnJ4Mm3P5Jl6J7P9r7l4K3M2J5L0j05Q0j01K0m
7364c6Q5o0J7l5j5R3mo4N2P1r5L1J6m7J9j8l4Q8Jo1K3P2j11J05j24j7J12p8L0
7393A6j6n7O3lk2P4m7J8Ok2m4L8l7m4J09J2%p6O2j9q0J48p5O3n1j6j8K8m1L9j1
7424c%j1oM0l9m0O7n5Q6n5O5Lk7mk8M9m7k3K2K4j8oL4k4j2j1k7k8P6J1K7kk8n4
7458d4KM3o1R5L4j07N8M1o7L8m3M1Lk2j9N4j6j8mk4N1p3Q0l4Jl7K8%Q1q9o5J35
7490F2r7J7L8J7j8j7k0M4k6M9K7n8q4R2n0K7k0M2q0M4L9mql0j6L2jo0J4R1r3J11
7522F4j70N9pN5k8P3n4K4l3J7L2o9O4o4O4M0q4m7P7k8p0J25n5R2n6l1J7lj2k5
$$ plain form
7552 -33 -4 45 6 -29 -35 -26 -9 42 15 0 -25 -5 -18 33 -53 -22 -28 -21 33 -39 32 4 -15 -16 61 60 -20 24 -24 -16 13 -14 15 14
7586 14 15 -46 -43 38 -1 10 -78 12 -45 37 17 16 -68 -40 14 13 0 -107 52 -9 27 63 -47 -13 21 2 36 6 -31 -1 -9
7617 -9 -52 78 37 1 32 -36 25 -6 -86 -24 -70 21 10 29 -11 25 -15 -19 -3 -28 -2 -67 -61 5 24 47 10 -48 32 -29 -10
7648 -10 9 -8 25 34 -32 6 -8 15 17 -44 -7 -64 27 36 11 15 -24 -2 15 18 -4 -52 -44 -52 42 28 28 -11 -3 24 2 -19 28 -29 5
7683 5 -24 36 -15 44 -44 20 -50 -28 52 -5 -62 9 -18 -17 28 50 15 10 72 -50 -19 31 -4 -4 -44 25 -6 -44 -37 -22 -39 -48 9
7716 9 -59 -13 94 41 -42 -26 50 -4 20 -11 3 57 -41 -22 67 4 -20 94 10 -21 -37 -88 74 97 23 -49 -4 38 -15
7745 -15 23 -13 5 -64 -49 -55 -32 35 -4 -1 67 -48 -2 -61 -1 -7 16 -11 85 18 -30 23 12 -18 38 10 15 -20 -28 15 23 26 -25
7778 -25 -29 19 46 19 -31 -42 -13 -21 -18 29 -69 -13 -39 -16 -26 73 33 -27 46 25 11 -30 -24 0 -15 -38 38 28 67 23 33 -7
$$ packed form
7552c3K9M9l9l5oRJ7N1k7j5k5K0j3N1q6L1oPN4p2P1k8j9jP7jq0M4m8QK9k7K9j
7586A4Jo1LQ1l9J1q8R0n7Q2k0jq4K8N4jj3j07J59o1L6L6j10L4L4j9L4l0l7L0q
7617im3J30m1l6L1o8O1l1q0O2m6R1j1J9m0L6m0mJ6k5K6o5OO6J9K3l7n8Q0o1J9
7648a0J9j7L3Ro6L8j4K3Ko1L7n7R1Rk5Ml9K2J7Lk2m8QqR4j4%l9QK7k2k1M7n7L4
7683Ek9O0n1N9q8O4p0K2Q0n7n7P1k7JM5K2l5nO2j22L1N0l5%m0O9l1l8PJ5j7rN7
7716Io8M6J07n3q3J6P6n4K4l1J4N4r8J9Q9o3k4J14q4l1j6n1J62K3p4p2M5M2n3
7745a5L8l6J8o9J5oK3O7l9LO8j15M6n9O0oK3k7R6o7m8N3j1l0N6k8Nl5qM3QLn1
7778b5mM8K7k7n0j1K9qLM7r8N6k6K3j0R9m0o0P3k1j4m1OK4j5k3P6j0L9m4J0m0
$$ plain form
7810 -7 21 17 44 27 -31 12 -29 49 8 32 26 -85 -33 28 11 -10 75 58 21 4 13 86 10 -2 -24 55 -9 -22 55 27 88 -9
7842 -9 -25 -22 -3 -56 12 -5 22 -43 -45 -19 73 30 -2 51 43 -4 -1 7 49 -58 70 60 -6 -18 19 -10 17 -18 16 2 36 19
7874 19 -17 56 5 -7 15 38 1 12 16 4 47 15 28 1 -26 -18 10 7 63 -7 -23 2 -53 6 16 -46 -14 10 24 43 -4 -58
7906 -58 -13 24 50 29 7 -26 -21 -11 20 14 9 -3 41 40 31 18 -32 7 26 53 -18 36 19 3 -35 -59 -33 -42 31 34 38 6 -3 6 0 -21
7942 -21 -41 -4 -50 9 -20 9 -3 16 47 -16 -57 1 -10 -35 0 -1 7 -47 16 -26 -62 37 -3 -49 -15 17 -26 1 20 -8 53
7973 53 77 -24 77 61 -28 22 27 -2 -24 40 24 24 -1 75 10 -41 12 -31 39 22 33 -36 16 -18 41 31 16 2 52 -62
8003 -62 -10 -40 -4 40 -56 2 17 -66 -45 -52 29 -3 -9 -44 35 -8 -41 -1 -1 -6 4 7 -14 12 25 -11 -7 59 -26 13 -43 26 24 48
8037 48 16 -40 -50 -7 -5 15 9 6 22 12 0 -14 -56 -11 60 -29 -33 -7 21 -21 -47 12 27 -6 -45 -34 -72 19 35 36 38 -47 25
$$ packed form
7810gK8mK7j7n8M3m1P8m1K4oj11N2O1j7k1Q5j7l7j7RP3p6j2k2P9o4j3P7k8O1r7
7842ij6LJ9n3O8j7K7o5kK6R2m3l2N3qm7LQM2j07J28j0o6j2L7k9K7l5L4j4L4j7
7874A9l6P3n1j2K2K3l7J1Mj2M3l2J3k7k7QK8lN6p0j6K5n5N9J0o2L2K4J4J9m7n4
7906e8M5L7K6k1k2l3NJ0L1onj2M4jrj3n0L9J9K7p1N4j7j6l8k4K6rP3LMl2rRok1
7942b1k0L7m6N9k9K9j2J9L1o3m1N8j1k5L5jQn4O3m2l6R9m0m6L4L2m3K7J9k8O1
7973E3K4j01J01j6q9N0Nk9k2O4j6%k5P6o5n1N3m3P0j7J1o9N2l4N9j0j5j4N0j14
8003f2N2l0L6M4r6N8J5q3K1pQ1l2ol5P9m3l3M0%nJ0Lk1K6J3l6MO6q5L9n6O9kK4
8037D8l2n6j0M3KK0olJ6j0j2j4m2M5P1q9mK6K8m2k6N9J5l3l9J1l8R1J6JKq5P2
$$ plain form
8070 25 -17 -14 40 -22 -7 9 -39 21 63 -10 -5 29 16 74 30 9 11 8 46 -39 -20 -33 27 -18 17 -7 70 -50 -40 -41 10 11 -26
8103 -26 -14 -25 30 30 73 41 -25 -3 -75 -25 21 -12 18 31 -11 -8 -36 -22 0 -1 -59 9 -19 -17 -20 -14 -14 -58 -48 -14 19 -33 -3 -26
8137 -26 -15 -31 31 -7 81 -12 2 6 -20 39 -6 14 -8 -9 -5 -8 8 -68 -26 27 -55 -31 3 59 -8 61 42 66 2 19 -22 -39
8169 -39 -11 -9 15 6 65 -37 -7 -23 5 2 -55 -71 21 25 30 10 -34 33 15 -31 0 52
$$ packed form
8070B5m2LN4o2J5J6m8O0M2p3NL4j3N8m4k1KlL8q5J9j3O0m5L5k4P7j20J0jN1Jl7
8103b6J2j1N5%M3l2o6K2p2N0M6l3L0J3m2Lk8J4K2jn8O8k8KlO%m4J0L4L3n2L0k3
8137b6J1j6O2l8Q8r3J4Mk6N9m5K0k2jMlJ6p6M2N3q2K4L4N6o7O9j9K4o4J7m1j7
8169c9K8KK4rN9j02L0j6K8ln7j6R2MNk0m4O7j8m6L1N2
8191E2
$$ Imaginary data points
##PAGE= N=2
##DATA TABLE= (X++(I..I)), XYDATA
$$ plain form
0 0 0 0 0 0 -8 0 0 8 -8 9 -16 16 -16 24 -32 37 -40 48 -56 69 -80 93 -106 121 -139 161 -181 205 -230 262
30 262 -294 328 -368 409 -457 507 -564 624 -693 764 -847 938 -1039 1150 -1274 1415 -1577
47 -1577 1761 -1977 2224 -2526 2895 -3357 3953 -4748 5875 -7580 10433 -16016 30656 -136943
61 -136943 -254265 313890 -8422 -248436 202904 29059 -223793 195907 65623 -260046
71 -260046 121772 168613 -210130 -1222 145650 -104796 -3902 89751 -115869 10876
81 10876 131943 -101762 -67651 125374 -9638 -76249 52114 550 -48427 72705 -932
92 -932 -119425 77695 105454 -150310 -23886 158840 -80006 -71558 134083 -67887 -81841
103 -81841 175300 -54685 -176660 186976 59832 -222185 93326 119751 -167411 55840
$$ packed form
0@%%%%qQ%Qj6J7k5L2l2M0n6O9p7Q8j04J25j49J73j99K27k60L00l42L86m35M92
30B62n56O22o96P77q66R64j071J188j317J457j611J785j977K189k424K689k992
47a577L338l738M201m750N421o252P310q701J0623j3455J8013k6449M6672j67599
61a36943j17322N68155l22312k40014M51340j73845k52852M19700j30284l25669
71b60046L81818M6841l78743K08908J46872k50446J00894R3653k05620J26745
81A0876J21067k33705L4111J93025j35012o6611J28363n1564m8977J21132p3637
92i32j18493J97120K7759k55764J26424J82726k38846Q448K05641k01970j3954
103h1841K57141k29985j21975L63636j27144k82017L15511K6425k87162K23251
$$ plain form
113 55840 100196 -169985 60951 142663 -180217 -11320 164015 -101728 -43848 98737 -74176
124 -74176 2942 97755 -110431 -22993 140580 -71715 -71874 104208 -34141 -44774 89370
135 89370 -62168 -58585 128847 -24430 -114825 86214 49456 -84815 14922 41154 -44307
146 -44307 12845 41830 -59636 -19993 85499 -18580 -83230 55103 48686 -64263 3684
157 3684 37192 -38787 18459 35987 -70720 4591 82064 -57844 -42300 72988 -22815 -24561
169 -24561 54506 -54827 -12618 98879 -67423 -62200 111087 -24792 -74180 82280 -21434
180 -21434 -63187 100814 -19724 -106266 104987 39523 -124814 49345 65229 -89513 28702
191 28702 49130 -88316 31712 72588 -88073 -11096 83069 -36947 -33138 42929 -14746
$$ packed form
113E5840M4356k70181K30936Q1712l22880J68897J75335k65743N7880J42585j72913
124g4176P7118R4813k08186Q7438J63573k12295j59J76082j38349j0633J34144
135H9370j51538L583J87432j53277r0395K01039l6758j34271R9737K6232q5461
146d4307N7152K8985j01466L9643J05492j04079o4650J38333o417j12949O7947
157C684L3508p5979N7246J7528j06707P5311P7473j39908J5544J15288r5803j746
169b4561P9067j09333M2209J11497j66302N223J73287j35879m9388J56460j03714
180b1434m1753J64001j20538q6542K11253o5464j64337J74159J5884j54742J18215
191B8702K0428j37446J20028M0876j60661P6977R4165j20016L809P6067n7675
$$ plain form
202 -14746 -13157 35639 -25321 -29768 48952 4821 -50886 19428 29936 -27418 2154 15419
214 15419 -24647 13005 30000 -42730 -15361 59301 -17002 -51642 47052 11107 -48773 40622
226 40622 8008 -60711 54634 29670 -86991 31122 61956 -71670 -1110 56729 -51593
237 -51593 -510 57249 -57376 -14273 77387 -41087 -43342 66600 -14896 -39354 48394 -19109
249 -19109 -33039 56919 -14617 -49208 49393 11101 -44911 23812 13787 -30393 20969 11489
261 11489 -39146 16425 31361 -37552 -7714 36001 -15280 -14146 22728 -9864 -10764 24725 -7027
274 -7027 -25882 22310 15207 -32161 2323 26624 -21114 -3928 24549 -23324 -2664 34898
286 34898 -26948 -17671 40635 -13020 -27231 30627 -4767 -24266 30501 -3841 -32792 34924
$$ packed form
202a4746J589M8796o0960m447P8720m4131n5707P0314J0508n7354K9572J3265
214A5419m0066L7652J6995p2730K7369P4662p6303l4640R8694l5945n9880Q9395
226D0622l2614o8719J15345k4964j16661J18113L0834j33626P0560N7839j08322
237e1593N1083N7759j14625M3103R1660j18474k255J09942q1496k4458Q7748o7503
249a9109j3930Q9958p1536l4591R8601l8292n6012O8723j0025m4180N1362r480
261A1489n0635N5571J4936o8913K9838M3715n1281J134L6874l2592r00L5489l1752
274g027j8855M8192p103m7368L4484K4301m7738J7186K8477m7873K0660L7562
286C4898o1846R277N8306n3655j4211N7858l5394j9499N4767l4342k8951O7716
$$ plain form
298 34924 9791 -43248 24412 20933 -39356 16484 19309 -38350 17050 24941 -40613 7215 33743
311 33743 -30038 -5680 30097 -19185 -9010 27413 -17187 -15653 30863 -8967 -24871 26020
323 26020 2431 -22908 17713 4774 -19344 14457 7886 -20940 6281 15674 -16568 -5504
335 -5504 17950 -8507 -10101 17949 -5765 -13412 20642 -2076 -19927 18034 5435 -21502 10637
348 10637 9987 -19425 6461 14299 -19817 2062 21502 -19203 -5588 25072 -15864 -10571 24575
361 24575 -13794 -13054 25043 -10266 -16536 23971 -3212 -19088 19355 3087 -20350 14781 7597
374 7597 -22460 10826 12670 -23123 6379 16603 -20434 2609 17731 -16608 -1168 17146
386 17146 -12341 -6099 15639 -6748 -10758 13553 -665 -13648 11709 4581 -15054 9333 8300
$$ packed form
298C4924k5133n3039O7660l479o0289N5840K825n7659N5400P891o5554M7828K6528
311C3743o3781K4358L5777m9282J0175L6423m4600J534M6516l9830j5904N0891
323B6020k3589k5339M0621j2939k4118L3801o571k8826K7221R393l2242J1064
335e504K3454k6457j594K8050k3714p647L4054k2718j7851L7961j2599k6937L2139
348A0637o50k9412K5886P838l4116K1879J9440m0705J3615L0660m0936N293L5146
361B4575l8369P40L8097l5309o270M0507k7183j5876L8443j6268k3437L5131p184
374G597l0057L3286J844l5793K9502J0224l7037K3043J5122l4339J5440J8314
386A7146k9487O242K1738k2387m010K4311j4218j2983K5357p128j9635K4387j033
$$ plain form
399 8300 -15437 5488 10287 -13817 739 11464 -10518 -4029 12708 -5824 -8506 13626 -1336
412 -1336 -12574 13443 2070 -15720 11953 4728 -17276 9596 7499 -16500 6421 10570 -14250
425 -14250 2288 13074 -12193 -2400 14965 -10559 -6948 16402 -8444 -10090 16889 -5572 -11230
438 -11230 15867 -2802 -11561 13632 135 -12433 9771 3750 -12557 5118 7064 -11375 2136
451 2136 9701 -10649 132 12079 -9549 -3209 12016 -6381 -5693 9183 -3134 -6614 7433
464 7433 391 -8720 6195 6058 -10541 2408 9911 -9955 -741 10042 -9899 -1685 11360 -9290
478 -9290 -4944 12910 -4131 -8436 10335 496 -9019 8718 1227 -11839 9496 4697 -15388
491 -15388 6814 8621 -12943 3903 7439 -10241 4715 7443 -11371 1347 10532 -8089 -4945
$$ packed form
399H300k3737K0925M799k4104J4556J0725k1982O489J6737j8532k682K2132j4962
412a336j1238K6017j1373j7790K7673p225k2004K6872k097k3999K2921M149k4820
425a4250J6538J0786k5267R793J7365k5524L611K3350k4846j646K6979k2461n658
438a1230K7097j8669q759K5193j3497j2568K2204o021j6307J7675J946j8439J3511
451B136P565k0350J0781J1947k1628O340J5225j8397O88J4876j2317l480J4047
464G433p042r111J4915j37j6599J2949P503j9866R214J0783j9941Q214J3045k0650
478i290M346J7854j7041m305J8771r839r515J7737p491j3066K1335m799k0085
491a5388K2202J807k1564J6846L536j7680J4956K728j8814J2718R185j8621L144
$$ plain form
504 -4945 8787 -2857 -4757 7067 -3542 -4767 10692 -2243 -9408 8860 3055 -7997 2203
517 2203 2034 -3501 2259 1180 -5555 1103 7745 -4383 -6429 8572 1744 -7041 3951 -162 -4288
532 -4288 6885 -2165 -9105 7904 5292 -9730 595 7277 -4070 422 3897 -8210 3153
545 3153 10328 -12866 -4015 14612 -6373 -6161 8895 -5246 -681 10734 -9346 -6289 14723
558 14723 -1176 -12801 5937 5282 -6482 2310 540 -6614 8187 4463 -12527 2053 10619
571 10619 -4418 -5128 1622 1654 1840 -1828 -4328 639 5985 614 -8112 946 8888 -2461 -4963
586 -4963 1107 371 3824 -176 -9587 2484 10953 -6136 -8292 7896 3119 -4466 3365 -3813 -4063
601 -4063 13938 -3596 -17480 12806 9447 -14925 1306 6249 -4978 6141 517 -11736 7251
$$ packed form
504d945J3732j1644j900J1824j0609j225J5459j2935p165J8268n805j1052J0200
517B203j69n535N760j079o735O658O642j2128k046J5001o828q785J0992m113m126
532d288J1173r050o940J7009k612j5022J0325O682j1347M492L475j2107J1363
545C153P175k3194Q851J8627k0985K12J5056j4141M565J1415k0080L057K1012
558A4723j5899j1625J8738o55j1764Q792j770p154J4801l724j6990J4580Q566
571A0619j5037p10O750L2J86l668k500M967N346n371q726R058P942j1349k502
586d963O070p36L453m000r411J2071Q469j7089k156J6188m777p585P831p178k50
601d063J8001j7534j3884L0286l359k4372J6231M943j1227J1119n624j2253J8987
$$ plain form
614 7251 10794 -11241 -6465 9063 2105 -3699 -2399 -2930 6742 5453 -10759 -1840 10184 -589
628 -589 -3519 -2198 -1770 7992 1324 -12049 203 11008 -58 -9312 -1127 9061 1762 -6377
642 -6377 -1251 1605 3017 3240 -7821 -6488 12276 5826 -15862 -2091 15658 -2603 -8317 4493
656 4493 -1931 1999 8022 -12399 -5838 16670 -1043 -12552 2379 5330 3544 -1919 -9471 4737
670 4737 11550 -7409 -8164 6122 2204 -195 375 -9827 2695 16702 -10468 -14738 16141 6749
684 6749 -11946 -16 1794 589 5725 -5734 -8466 7624 8331 -6625 -9715 5850 11755 -5486
698 -5486 -10935 5224 8428 -3241 -5388 -1395 1999 6912 -1718 -12392 4535 13713 -6231 -9551
712 -9551 3726 6821 2822 -9187 -6353 12457 2768 -10770 1071 1791 1196 7599 -9311 -9869
$$ packed form
614G251L543k2035M776J5528o958n804J300n31R672j289j6212Q919J2024j0773
628e89k930J321M28R762o668j3373J2252J0805j1066r254Q185J0188p299q139
642f377N126K856J412K23j1061J333J8764o450k1688J3771J7749j8261n714J2810
656D493o424L930O023k0421O561K2508j7713j1509J4931K951j786n463p552J4208
670D737O813j8959p55J4286l918k399N70j0202J2522J4007k7170m270L0879r392
684F749j8695J1930J810j205N136j1459k732J6090P07j4956l090J5565N905j7241
698e486n449J6159L204j1669k147L993L394M913q630j0674J6927R178j9944l320
712i551J3277L095l999j2009K834J8810r689j3538J1841P20n95O403j6910n58
$$ plain form
726 -9869 18494 5723 -21419 1844 16094 -7066 -5359 3827 -5443 6053 8314 -15234 -3140
739 -3140 17005 -1073 -11358 -587 6669 5748 -7192 -8643 7921 6202 -5466 -3807 -363 4519
753 4519 6700 -6957 -9682 10509 9564 -12134 -7243 9106 4760 -3989 -6038 -157 8739 1142
767 1142 -7260 -1478 3066 6944 -640 -14530 4110 16720 -10187 -11818 10462 3675 -3873 1174
781 1174 -5151 328 12555 -4654 -13997 8681 9972 -8178 -5573 1495 4957 4834 -9297 -5113
795 -5113 12079 1388 -7137 194 -1078 5006 5465 -12829 -4008 15755 -652 -13386 2704 7735
809 7735 -609 -1955 -3632 -561 8662 57 -10496 541 8191 1219 -6867 -5708 8492 7175
823 7175 -10346 -3495 8075 707 -600 -2480 -5661 7642 6119 -11559 -3936 10297 2178 -6137
$$ packed form
726i869K8363j2771k7142K3263J4250k3160J707R186r270J1496K261k3548J2094
739c140K0145j8078j0285J0771P256r21j2940j451J6564j719j1668J659L444M882
753D519K181j3657k725K0191r45k1698M891J6349m346q749k049N881Q896p597
767A142q402N782M544L878p584j3890J8640J2610k6907j631K2280o787p548N047
781A174o325N479J2227j7209r343K2678J291j8150K605P068L462j23j4131M184
795e113J7192j0691q525P331j272O084M59j8294Q821J9763j6407j2734J6090N031
809G735q344j346j677L071R223q605j0553J1037P650o972q086J159J4200j317
823G175j7521O851J1570p368j307j880l181J3303j523j7678P623J4233q119q315
$$ plain form
837 -6137 -2770 2510 6148 -226 -8796 1035 8481 -2341 -4665 -699 156 7304 -1354 -12227 6763
852 6763 10772 -9109 -4027 5235 -25 2273 -1723 -7737 5270 7729 -7812 -5503 6453 3368
866 3368 -2014 -3178 -2107 6314 3667 -9275 -1628 7686 -815 -2741 -1886 -1659 7132 1150 -9614
881 -9614 2182 7909 -2105 -4173 -1035 2733 3945 -3470 -5439 3456 4859 -2509 -3755 345 3829
896 3829 3145 -4979 -4448 7218 2653 -6935 -283 1868 661 2782 -5333 -3034 9037 -37 -7069
911 -7069 2202 2546 295 285 -4836 -261 6960 -2170 -6759 3427 3874 -2194 -265 -1495 -113 6372
927 6372 -2731 -7159 5831 3127 -5193 272 -224 227 4451 -3754 -4011 6072 2031 -4637 -630
942 -630 1952 1102 -35 -2759 -1556 3869 1373 -4391 -490 3400 1011 -1135 -2557 1113 3941 -2563
$$ packed form
837f137L367N280L638o374q570R831P446j0822k324L966Q55P148q658j0873J8990
852F763M009j9881N082R262n260K298l996o014J3007K459j5541K309J1956l085
866C368n382j164J071Q421k647j2942P647R314q501j926Q55K27Q791n982j0764
881i614J1796N727j0014k068L138L768J212p415j969Q895J403p368j246M100L484
896C829o84q124N31J1666m565r588O652K151j207K121q115K299J2071r074p032
911g069R271L44k251j0n121M575P221r130m589J0186M47o068J929j230J382O485
927F372r103m428J2990k704q320N465m96M51M224q205k57J0083m041o668M007
942f30K582q50j137k724J203N425k496n764L901L890k389k146j422L670K828o504
$$ plain form
958 -2563 -2661 1782 11 1248 -588 -4233 3684 3791 -5032 -560 3545 -663 0 -404 -2565 2391
974 2391 2473 -4603 -1207 4692 -957 -1874 1727 -1557 1481 2976 -5257 -303 5447 -3247 -2136 2564
990 2564 -1652 976 1745 -3711 676 4041 -1953 -2275 1993 734 -997 -25 -1199 2 2422 -1671
1006 -1671 -1954 2519 322 -667 415 -1319 1534 1350 -3064 238 1552 -1036 122 -797 -371 2214
1022 2214 -602 -1441 1355 470 -216 39 -922 -192 1541 -916 -2307 2044 983 -2503 1524 716 -2062
1039 -2062 2765 -109 -3514 3175 676 -3688 1936 575 -2102 1772 14 -1861 2042 929 -2143
1054 -2143 702 1381 -1612 164 825 -1912 857 1316 -2561 1105 1791 -2103 1046 969 -1721 1400
1070 1400 167 -1734 1055 38 -970 307 37 18 293 7 91 127 380 -178 -140 91 -321 184 -443
$$ packed form
958b563r8M443j771J237j836l645P917J07q823M472M105m208O63m04k161M956
974B391Q2p076L396N899n649r17L601l284L038J495q233M954N750q694J111M700
990B564m216K628P69n456M387L365n994l22M268j259j731R72j174J201K420m093
1006a671k83M473k197r89J082j734K853j84m414L302J314k588J158r19M26K585
1022B214k816q39K796q85o86K55r61P30J733k457j391M351j061l486M027q08k778
1039b062M827k874l405O689k499m364N624j361k677L874j758j875L903j113l072
1054b143K845O79k993J776O61k737K769M59l877L666O86l894L149p7k690L121
1070A400j233j901K789j017j008J277k70j9K75k86Q4L6K53n58L8K31m12N05o27
$$ plain form
1089 -443 -587 1080 -707 -418 1663 -1195 -18 1932 -2052 118 1996 -2422 50 1843 -2223 159
1105 159 1894 -1725 -141 2127 -1093 -985 2231 -833 -1762 2381 -805 -2235 2654 -743 -2125 2850
1121 2850 -588 -1632 2593 -549 -1182 1752 -541 -1004 842 -120 -784 248 384 -424 151 559 -501
1138 -501 413 475 -822 325 -52 -579 499 -865 -33 903 -1170 490 793 -1063 1275 170 -1525
1155 -1525 1554 -44 -1690 1137 -16 -1150 1011 6 -1143 1347 831 -1827 657 1716 -1976
1170 -1976 170 1456 -2382 879 1617 -3112 1078 2340 -2574 643 1532 -1555 1016 816 -2088 648
1186 648 1475 -1680 -752 1492 -324 -715 1110 -788 -74 2051 -1472 -1080 2030 -512 -966 259 -591
1203 -591 871 21 -1253 731 426 275 294 -1511 877 1725 -1941 -955 1474 -141 -541 137 -646 258
$$ packed form
1089d43j44J667j787K89K081k858J177J950l984K170J878m418K472J793m066K382
1105A59J735l619J584K268l220J08L216l064r29M143l186j430M889l397j382M975
1121B850l438j044M225l142o33K934k293m63J846r62o64J032J36q08N75M08j060
1138e01R14O2j297J147l77n27J078j364Q32R36k073J660L03j856K338j105j695
1155a525L079j598j646K827j153j134K161j005j149K490n16k658K484J059l692
1170a976K146J286l838L261P38m729M190J262m914L217Q89l087K571k00k904K736
1186F48Q27l155R28K244j816l91J825j898P14K125l523L92L110k542m54J225q50
1203e91J462q50j274J984l05j51J9j805K388Q48l666R86K429j615m00O78p83R04
$$ plain form
1221 258 1834 -1040 -1946 2674 826 -2592 951 154 -864 2020 -1960 -1797 3678 -421 -2509 1739
1237 1739 221 -155 1263 -1862 -861 3002 -397 -3361 1336 1948 -1656 -2 279 -1020 2585 145
1253 145 -3610 1936 2300 -2154 -851 114 718 1146 -1978 -970 2007 825 -689 -1308 139 2531
1269 2531 -266 -2807 113 2385 -271 -2003 -205 1002 1313 31 -2752 756 3654 -1920 -2113
1284 -2113 1454 34 1185 -579 -3789 2852 3279 -3955 -1035 2915 -1 35 -418 -2156 2051 2823
1300 2823 -3907 -2444 4382 702 -3106 199 347 1289 1617 -3596 -718 4087 -508 -2453 -533 627
1316 627 2578 -1195 -3889 2237 3302 -1925 -2135 860 1744 813 -1677 -2466 1771 3159 -2646 -3297
1332 -3297 2340 2549 -729 -2596 -532 4060 586 -3970 346 1598 667 507 -3946 -533 5965 -1323
$$ packed form
1221B58J576k874r06M620j848l418L543p97j018K884l980J63N475m099k088M248
1237A739j518l76J418l125J001L863l399k964M697O12l604J654K81j299L605k440
1253A45l755N546L64m454J303R65O04M28l124J008K977j182j514o19J447K392
1269B531k797k541K920K272k656j732J798J207L11j282k783L508K898n574j93
1284b113L567j420J151j764l210O641M27p234K920L950k916L6m53j738M207P72
1300B823o730J463O826l680l808L305J48R42L28n213K878M805m595j945J920J160
1316F27J951l773k694O126J065n227k10K995Q84r31k490p89M237J388n805o51
1332c297N637K09l278j867K064M592l474m556M316J252r31j60m453L413O498p288
$$ plain form
1348 -1323 -5433 2499 3446 -1373 -1326 -791 459 3220 -1028 -5021 2040 4348 -2657 -2414 717 1700
1364 1700 2628 -2983 -3644 5122 2084 -4409 -586 1088 1056 1366 -3522 -2091 5032 1869 -4957 -1198
1380 -1198 4298 1339 -2689 -2015 942 3121 -506 -4009 159 3164 965 -2168 -3243 3119 4782
1395 4782 -4602 -3416 4405 1332 -1615 -1362 -1738 2927 2869 -4508 -2509 4563 2304 -2984 -2269 1391
1411 1391 3317 -27 -5011 -252 5389 -945 -3784 756 688 2461 705 -5903 1234 7096 -3315
1426 -3315 -4997 2839 2368 -404 -1688 -2277 1955 3807 -2263 -4101 2466 4001 -1373 -3564 -492
1441 -492 3894 1683 -5107 -1428 4441 623 -1873 -1630 -340 4501 638 -5902 726 4922 -622
1456 -622 -3294 -1531 2321 3224 -2670 -3904 2870 3649 -1948 -2614 350 2148 2332 -2970 -4507 4698
$$ packed form
1348a323m110P932R47m819M7N35J250K761m248l993P061K308p005K43L131R83
1364A700R28n611o61Q766l038o493L823J674l2L10m888J431P123l163o826L759
1380a198N496k959m028O74K957K179l627l503M168L005k199l133j075O362J663
1395D782r384J186P821l073k947K53l76M665n8p377J999P072k259n288P15L660
1411A391J926l344m984M759N641o334k839M540o8J773j756o608P137N862j0411
1426c315j682P836m71k772j284n89M232J852o070j838O567J535n374k191L072
1441d92M386k211o790L679N869l818k496K43J290M841l863o540O628M196n544
1456f22k672J763L852R03n894j234O774P79n597o66K964J798J84n302j537R205
$$ plain form
1472 4698 3801 -5760 -1658 3498 692 575 -2305 -2404 4946 1992 -5385 -1060 3596 1249 -2028 -2932
1488 -2932 851 4237 -638 -4800 1045 4313 -589 -2365 -958 901 3628 -1647 -5378 2867 4215
1503 4215 -2854 -2347 530 2390 1968 -3324 -2352 3857 1805 -2740 -2239 889 3166 -71 -4278 -313
1519 -313 4806 202 -4001 84 2382 1025 -401 -3598 97 5299 -1804 -4844 2354 2314 -297 -894
1535 -894 -2642 2076 4108 -3369 -3362 3126 2076 -1612 -1910 -546 2301 2150 -3257 -2515 4181 1745 -3167
1552 -3167 -879 783 1817 992 -4084 -896 4650 -557 -3209 275 1270 1892 -587 -3393 1289 3616
1568 3616 -1485 -2978 575 2282 439 -2059 -1734 2147 2728 -2478 -2208 2450 1339 -451 -1432 -1765
1584 -1765 2996 1780 -4480 -522 3294 -171 -876 -1078 -238 3111 61 -3659 624 2840 -719 -1922
$$ packed form
1472D698q97r561M102N156k806j17k880r9P350k954p377M325M656k347l277r04
1488b932L783L386m875m162N845L268m902j776J407J859K727n275l731Q245J348
1503D215p069N07K877J860m22n292R72O209k052m545N01L128K277l237m207L965
1519c13N119m604m203M085K298j357j426l197L695N202p103l040P198m0k611n97
1535h94j748M718K032p477PO488j050l688k98J364K847j51n407P42O696k436m912
1552c167K288J662J034q25n076L188N546n207k652L484R95O22k479k806M682K327
1568C616n101j493L553J707j843k498L25L881N81n206K70M658j111j790r81l33
1584a765M761j216o260L958L816l465p05k02Q40L349l050l720M283K216l559j203
$$ plain form
1600 -1922 -507 688 1929 -625 -3427 1630 3511 -2396 -1636 1603 -7 1012 -649 -3024 2238
1615 2238 2507 -2993 -1278 1802 1115 -102 -1563 -319 2245 451 -2180 -635 1490 607 -748 -1381
1631 -1381 -81 2577 29 -3092 1224 2322 -1264 -392 -398 -207 2158 -1040 -2502 1762 1382 -1001
1647 -1001 -754 -223 1393 1092 -1883 -868 2037 401 -1640 -221 351 234 876 -1483 -1317 3066 301
1664 301 -2768 1120 950 -642 628 -1373 -513 2210 -839 -1755 1027 717 -15 -110 -809 598 1436
1681 1436 -1011 -1585 1323 789 -1368 0 79 -143 1396 -800 -1314 1944 381 -1200 184 -166 604
1698 604 301 -1696 295 1242 -731 -272 108 -67 934 67 -1213 294 1400 -876 -1134 1045 -94
1715 -94 -525 584 -911 199 1674 -1221 -448 1341 -554 96 105 -1127 902 500 -1581 283 883
$$ packed form
1600a922J415J195J241k554k802N057J881n907P60L239j610J019j661k375N262
1615B238K69n500J715L080o87j217j461J244K564j794k631J545K125q83j355o33
1631a381J300K658k548l121M316J098l586Q72oJ91K365l198j462M264l80k383
1647a001K47N31J616l01k975J015K905j636k041J419N72j17O42k359J66M383k765
1664C01l069L888j70j592J270k001Q60K723l049r16K782l10p32r5o99J407Q38
1681A436k447n74K908n34k157J368P9k22J539k196n14L258j563j581J384l50P70
1698F04l03j997J991R47j973M59L80j75J001q67j280J507J106k276k58K179j139
1715i4m31J109j495J110J475k895P73J789j895O50Rj232K029m02k081J864O00
$$ plain form
1732 883 -588 33 367 -397 327 770 -1127 -403 1400 -742 -807 1005 -635 -50 890 -1132 267 1257
1750 1257 -992 28 442 -516 318 -169 -710 499 132 -434 60 268 25 37 139 -352 195 349 -831
1769 -831 81 494 -798 362 220 -929 975 204 -984 1099 111 -892 854 -336 -684 739 -273
1786 -273 -689 613 105 -459 467 388 -652 525 465 -957 495 427 -1219 577 227 -1085 937 136
1804 136 -882 1078 14 -758 864 -97 -575 416 -159 -468 232 156 -386 127 459 -430 180 494 -513
1823 -513 296 180 -723 387 -52 -522 610 -403 -111 763 -653 137 687 -679 214 439 -732 148
1841 148 436 -649 -64 578 -288 -269 727 -233 -345 1002 -440 -622 1196 -607 -799 1100 -593 -390
1859 -390 996 -771 -83 1085 -511 -271 658 -215 -249 103 -243 -255 378 -120 -553 620 162 -470 507
$$ packed form
1732H83j471O21L34p64P24M43j897P24J803k142o5J812j640N85R40k022J399R90
1750A257k249J020M14r58Q34m87n41J209l67n66M94K08k43J2J02m91N47J54j180
1769h31R12M13j292J160j42j149J904p71j188K083r88j003J746j190l48J423j012
1786b73m16J302n08n64R26p9j040J177o0j422J452o8j646J796l50j312K022q01
1804A36j018J960j064p72J622r61m78R91n75l09P00p6n42N13L32q89O10L14j007
1823e13Q09j16r03J110m39m70J132j013K92Q74j416P90N50j366Q93K25j171Q80
1841A48K88j085N85O42q66J9R96r60j12J347j442j82J818j803j92J899j693K03
1859c90J386j767O88J168j596K40R29q73l4L52l46j2O33m98m33J173m58o32R77
$$ plain form
1878 507 -123 -113 699 -801 -361 856 -652 -233 332 -473 574 260 -773 451 472 -361 -92 -122 44
1897 44 207 -320 -540 299 482 -631 -116 654 -241 344 170 -1034 924 670 -1673 324 822 -844
1915 -844 489 -52 -771 1086 319 -1243 235 997 -410 -538 157 -77 270 241 -1049 86 1276 -683
1933 -683 -466 562 -85 618 -204 -1245 975 561 -1135 -109 220 315 476 -822 -245 1154 227 -836
1951 -836 -245 506 378 -418 -791 -132 1157 -73 -1383 651 871 -350 138 -670 16 1672 -974 -1632
1969 -1632 1350 444 -675 -179 -460 730 962 -1126 -715 1313 631 -994 -473 295 451 360 -1294 -817
1987 -817 2029 193 -1823 495 637 151 419 -1403 -262 1997 -508 -1762 375 1018 126 -908
2003 -908 -663 973 975 -658 -1135 548 1162 -236 -1143 -488 1266 1027 -1935 -802 2045 240 -760
$$ packed form
1878E07o30J0Q12j500M40J217j508M19N65q05J047l14j033J224K1q33K69l0J66
1897D4J63n27k20Q39J83j113N15P70q95N85j74j204J958k54k343J997M98j666
1915h44J333n41p19J857p67j562J478P62j407j28O95k34L47k9j290J135J190j959
1933f83K17J028o47P03q22j041K220m14j696J026L29R5J61j298N77J399r27j063
1951h36N91P51j28p96l73O59J289j230j310K034K20j221M88q08O86J656k646o58
1969a632K982r06j119M96k81J190K32k088M11K028o82j625N21P68J56r1j654M77
1987h17K846j836k016K318J42m86K68j822J141K259k505j254K137O43q92j034
2003i08K45J636Kj633m77J683O14j398r07O55J754k39k962J133K847j805j000
$$ plain form
2020 -760 -224 -319 1441 606 -2367 36 1982 -300 -1190 -489 787 1310 -617 -1674 888 1862 -816
2037 -816 -1532 362 771 386 -657 -1808 1301 2142 -2092 -1284 1755 652 -194 -896 -886 1790 855 -2093
2055 -2093 -729 1446 871 -826 -1392 472 1920 -88 -2149 178 2152 -259 -1471 -407 402 1476
2071 1476 -447 -2449 1165 2280 -1068 -1338 179 1318 998 -1871 -1246 1928 829 -1397 -993 326
2087 326 1655 340 -2041 -529 2602 609 -2685 -105 1720 132 -440 -1308 -376 2606 -190 -2831
2103 -2831 753 2038 -63 -1115 -1084 1188 1884 -1657 -1977 1314 1520 -688 -1396 -184 1545 1161 -1759
2120 -1759 -1605 2271 1445 -2133 -1028 771 1054 337 -2131 -604 2747 312 -2026 -352 1205 1401
2136 1401 -818 -2286 892 2261 -955 -2058 266 1668 483 -1211 -1335 1277 2106 -1571 -2074 1602
$$ packed form
2020g60N36r5J760q35k973K403J946k282q90P01J276N23j927j057K562R74k678
2037h16p16J894M09l85j043j151L109Q41m234Q08L039j103q46p02J0K676r35k948
2055b093J364K175n75j697n66J864J448k008k061K327J974k411j212J064Q09J074
2071A476j923k002L614J115l348k70J517J139l20k869O25L174j099k226M04J319
2087C26J329j315k381J512L131j993l294K580J825j588n72q68R32K982k796k641
2103b831L584J285k101j052L1K272O96l541l20L291K06k208p08J212J729l84k920
2120a759J54L876q26l578J105J799K83p17k468J527L351k435k338J674J557J96
2136A401k219j468L178J369l216j103K324J402j185j694j24K612Q29l677n03L676
$$ plain form
2152 1602 1292 -779 -1137 -835 1802 1446 -2660 -926 2423 624 -1076 -1012 84 2027 114 -2711
2168 -2711 -123 2425 33 -1994 -331 1173 1132 -416 -2015 591 2726 -1035 -2200 650 1310 443
2184 443 -1164 -1692 1763 1888 -1803 -1162 1103 1331 16 -1829 -546 2117 578 -2250 -825 1765
2200 1765 864 -995 -1083 172 2014 238 -2655 144 2366 -313 -1379 -546 679 1749 -1004 -2093
2216 -2093 1391 1627 -740 -1129 -268 1366 1100 -1841 -1411 1960 1163 -1916 -948 1117 732 247 -1199
2233 -1199 -1054 2268 1010 -2597 -342 1723 304 -656 -1292 210 2047 -368 -1814 387 1486 325
2249 325 -1063 -1013 1036 1458 -1072 -1787 1082 1576 -922 -978 168 995 981 -1264 -1283 1778 833 -1262
2267 -1262 -717 65 1301 233 -1970 42 2072 -212 -1230 67 593 760 -240 -1493 79 1913
$$ packed form
2152A602l10k071l58L02K637l56m106J734L349j799j700O4J096J943j913k825
2168b711K588K548k392k027J663J504m1j548j599K606K135l761j165K850O60q67
2184D43j607n28L455J25l691O41K265K28j315j845J283K663j539k828J425K590
2200A765r01j859q8J255J842j776k893K799K222k679j066Q33J225J070k753j089
2216b093L484K36k367l89Q61J634k66k941M30L371p97l079R68K065l85m85j446
2233a199J45L322j258l607K255K065j419r60o36J502J837k415j446K201J099j161
2249C25j388N0K049M22k530p15K869M94k498n6J146Q27j4k245j9L061r45k095
2267a262N45P82J236j068k203K012K030k284j018J297N26J67j000j253J572J834
$$ plain form
2283 1913 -431 -2027 689 1264 -294 -540 -679 617 1465 -1209 -1234 1092 584 -255 -784 -729 1410 929
2301 929 -1764 -406 1658 284 -889 -339 282 651 337 -1318 -648 1648 208 -1483 4 809 624
2318 624 -186 -1156 546 1137 -780 -612 73 267 751 -752 -1126 1222 925 -1146 -501 821 429 -278
2336 -278 -427 -428 623 690 -1368 -458 1183 66 -294 -240 -177 1206 89 -1466 490 926 -597 -277 -265
2355 -265 -4 824 -253 -972 530 1135 -566 -657 418 376 28 -262 -705 566 709 -923 -163 516 46
2374 46 397 -511 -549 1164 143 -1073 218 334 -29 -40 -533 2 723 12 -596 94 612 -104 -335 -182
2394 -182 13 593 -379 -836 641 216 -529 297 -208 43 899 -698 -546 990 -147 -594 133 43 23
2413 23 184 -335 -236 605 226 -611 173 427 -238 105 -282 -361 720 -314 -678 592 -18 -129 376 -383
$$ packed form
2283A913k344j596K716N75j558k46j39J296Q48k674k5K326n08q39n29N5K139m81
2301I29k693J358K064j374j173N50O21L69l14j655O70K296j440j691J487Q05j85
2318F24q10r70J702N91j917J68O85J94M84j503l74K348k97k071O45J322l92p07
2336b78j49jJ051O7k058R10J641j117l60N4O3J383j117j555J956M36j523L20J2
2355b65K61Q28j077p19J502O05j701r1J075m2l48k90m43J271J43j632P60O79m70
2374D6L51r08l8J713j021j216J291J16l63j1m93N35P21p11o08O90N18p16k31J53
2394a82J95N80r72m57J477m25p45Q26n05K51Q56j597J52J536j137m47P27r0k0
2413B3J61n19R9Q41l79q37P84K54o65L43l87p9J081j034l64J270o10j11N05p59
$$ plain form
2433 -383 170 526 -586 -266 338 -9 -184 -33 -165 118 273 -246 -230 534 26 -376 284 -177 -121 388
2453 388 -527 -142 681 -360 -159 381 -327 186 275 -472 275 302 -396 11 59 -165 -12 109 -213 62 374
2474 374 -264 -122 524 -336 -115 416 -571 -15 506 -648 50 558 -471 180 283 -326 197 147 -276 47
2494 47 32 -237 -113 37 -109 -43 177 -156 22 438 -311 58 309 -469 166 215 -527 260 194 -500 366 153
2516 153 -259 381 -23 -264 254 -17 -235 25 -20 -201 -8 177 -268 136 267 -324 280 277 -448 278 28
2537 28 -457 413 -143 -416 476 -65 -253 420 -108 -92 329 -56 -255 179 51 -302 17 188 -259 136 173
2558 173 -456 414 204 -455 327 57 -330 288 -239 -225 414 -216 -128 265 -67 101 99 -181 73 219 -133
2579 -133 -244 141 11 -298 144 31 -155 530 -169 -392 584 -61 -321 323 -308 13 264 -600 -26 423
$$ packed form
2433c83N53L56j112L20O04l47j75J51j32K83J55n19J6P64n08m02O60m61N6N09
2453C88r15L85Q23j041K01N40p08N13Q9p47P47K7o98M07M8k24J53J21l22K75L12
2474C74o38J42O46q60K21N31r87N56N21j154O98N08j029O51J03o09N23n0m23L23
2494D7j5k69J24J50j46O6K20l33J78M16p49L69K51p78O35M9p42P87o6o94Q66k13
2516A53m12O40m04k41N18k71k18K60m5j81J93J85m45M04J31n91O04lp25P26k50
2537B8m85Q70n56k73Q92n41j88O73n28J6M21l85j99M34j28l53L19J71m47L95L7
2558A73o29Q70k10o59P82k70l87O18n27J4O39o30Q8L93l32J68kk80K54J46l52
2579a33j11L85j30l09M42j13j86O85o99k23R76o45k60O44o31L21K51q64N74M49
$$ plain form
2599 423 -197 -34 21 -59 224 26 -289 -60 320 -155 -387 213 29 -171 297 -434 11 688 -492 -296
2619 -296 509 -86 -57 69 -453 291 300 -534 -83 380 108 -89 -194 71 254 84 -414 -170 502 -20 -452
2640 -452 38 55 278 202 -582 307 577 -423 -123 -41 -25 425 -373 -603 495 293 -447 -123 222 205 47
2661 47 -261 -320 440 479 -813 -306 628 -143 -131 -91 -221 762 183 -915 251 495 -86 -225 -510 168 690
2682 690 -435 -659 452 529 -207 -351 83 305 379 -324 -727 503 610 -841 -379 383 234 221 -561 -412
2702 -412 976 179 -738 -83 258 466 -171 -914 220 883 -183 -714 132 622 146 -400 -394 198 779 -394
2722 -394 -1093 643 592 -431 -264 -285 499 795 -962 -481 949 214 -512 -371 -31 696 71 -969 -189
2741 -189 991 317 -898 -196 695 362 -171 -733 -20 1160 -285 -1100 179 601 256 -447 -809 810
$$ packed form
2599D23o20J63N5q0K83j98l15K29L80m75k32O00j84k00M68p31M45O77j180J96
2619b96Q05n95K9J26n22P44Rq34M51M63k72j97j05K65J83j70m98K44O72n22m32
2640d52M90J7K23p6p84Q89K70j000L00Q2J6M50p98k30J098k02p40L24L45j7j58
2661D7l08n9P60L9j292N07R34p71J2M0j30R83n79j098J166K44n81j39k85O78N22
2682F90j125k24J111P7p36j44M34K22P4p03m03J230J07j451M62P62j49j3p82J49
2702d12J388p97r17O55L41K08o37p43J134O63j066n31Q46M90m76n46ON92N81j173
2722c94o99J736n1j023J67k1P84K96j757M81J430p35p26J41L40P27o25j040P80
2741a89J180o74j215P02Q91l33n33n62P13J180j445q15J279M22l45p03l62J619
$$ plain form
2759 810 1010 -822 -540 514 538 -36 -770 -269 830 468 -914 -607 940 713 -571 -528 205 728 182
2778 182 -1258 -133 1133 -38 -703 -363 326 1077 -350 -1305 744 1033 -543 -745 -16 617 424 -671
2796 -671 -841 734 1045 -792 -969 771 692 -208 -628 -457 906 591 -1308 -428 900 392 -313 -825
2814 -825 136 1246 -234 -1186 117 925 233 -734 -617 591 781 -509 -1164 452 1197 -333 -849 82
2832 82 625 535 -824 -999 1065 714 -905 -509 195 805 317 -1235 -153 1302 278 -1031 -454 599
2850 599 515 -461 -840 103 1195 37 -1315 101 1043 102 -563 -536 555 1158 -812 -1119 798 650
2868 650 -262 -604 -289 954 720 -1033 -688 945 693 -782 -770 457 731 -69 -903 -344 1171 356
2886 356 -1000 -301 666 700 -278 -1279 452 1203 -683 -884 217 428 446 -480 -869 787 1005 -750
$$ packed form
2759H10K00j832K82J054K4n74p34N01J099l62j382L07J547k27j284M3P33N23n46
2778A82j440J125J266j171o65L40O89P51j427r55K049K89j576k02P29O33j93j095
2796f71j70J575L11j837j77J740p9r00m20J71J363l15j899Q80J328n08p05n12
2814h25R61J110j480r52J303Q08o92r67J17J208J90j290o55J616P45j530n16R31
2832H2N43r0j359j75K064l51j619L96P04O10m88j552J082J455j024j309N77J053
2850E99q4r76l79R43J092j158j352J416R42r41o65K7J091O03j970l07J917j48
2868F50r12l42L15J243k34j753L45J633k52j475J2J227K74q00q34N59J515q15
2886C56j356O99R67L4r78j001J731P51j886k01J101K11J8r26l89J656K18j755
$$ plain form
2904 -750 -951 586 869 -310 -747 -242 622 570 -940 -657 1041 519 -488 -601 -95 1061 119 -1403
2922 -1403 38 1114 -152 -658 -306 410 762 -330 -913 305 999 -137 -1067 56 777 169 -559
2939 -559 -697 623 891 -725 -572 492 461 131 -750 -491 1052 374 -1129 -197 700 361 -332 -700 227
2958 227 822 -75 -922 -92 799 63 -607 -369 327 806 -335 -1054 703 917 -565 -265 28 249 692
2977 692 -586 -741 821 514 -654 -497 341 561 -41 -570 -32 647 323 -707 -308 518 251 -184 -654
2996 -654 -14 977 -135 -971 416 519 -57 -167 -498 241 663 -510 -694 252 528 -94 -543 -98 571
3015 571 252 -556 -343 529 317 -585 -214 78 305 390 -678 -231 948 -78 -541 171 132 339 -37 -685
3035 -685 123 525 -267 -504 91 352 127 -224 -307 280 578 -414 -624 502 290 -331 -126 -192 219 494
$$ packed form
2904g50k01J537K83j179m37N05Q64n2j510K83J698n22j007j13N06J156r42j522
2922a403J441J076j266n06L52P16L52j092n83J218O94j136r30J123P21o08p28
2939e59j38J320K68j616J53J064l1l30q81K59J543o78j503R32Q97l39o93l68R27
2958B27N95q97q47Q30Q91p36o70K38O96M79j141p19J757K14j482L00K93K21M43
2977F92j278j55J562l07j168J57Q38K20o02n29N38O79l24j030L99Q26k67m35m70
2996f54O40R91j112q36J387J03n76j10l31P39M22j173j84R46K76o22m49M45O69
3015E71l19q08K13Q72k12r02L71K92K27Q5j068M47J179j026m63P12l9K07l76o48
3035f85Q08M02p92k37N95K61k25l51q3N87K98r92k10J126k12o21K05o6M11K75
$$ plain form
3055 494 -553 -266 518 44 -189 -176 -43 481 -122 -534 75 243 25 -276 -78 188 258 -27 -370 92
3075 92 526 -342 -334 345 -82 88 13 -412 441 460 -445 -17 244 32 131 -312 -166 328 7 -385 -97 228
3097 228 99 -55 -34 -89 278 94 -544 107 363 -347 -69 57 -279 409 -49 -432 397 194 -223 17 -112
3118 -112 17 89 -225 -173 102 118 -139 -115 236 42 38 12 -176 276 46 -401 175 44 -180 220 -244 -150 427
3141 427 -126 -142 239 7 -3 44 -211 8 164 -115 -158 107 120 -183 107 117 -112 298 -15 -329 352 -91
3163 -91 -295 159 -148 -108 200 -248 52 284 -100 -18 98 -73 -10 0 -118 -40 143 -54 -175 171 57 -232
3185 -232 251 -28 -212 264 -150 -94 192 -233 -25 175 -219 24 122 -181 115 73 -60 89 -6 -33 -65 5
3207 5 -97 -56 200 -105 -56 244 -108 -24 343 -231 15 219 -355 82 186 -233 153 119 -183 142 88 -114
$$ packed form
3055D94j047K87P84m74k33J3J33N24o03m12O09J68k18l01J98K66P0k85l43M62
3075I2M34q68QO79m27J70p5m25Q53J9r05M28K61k12R9m43J46M94l21l92K88L25
3097B28j29j54K1n5L67j84o38O51K56p10K78J26l36O88m58l83Q29k03m17K40j29
3118a12J29P2l14N2K75J6k57K4L51j94mk6j88M52k30m47N76j31k24M00m64R4N77
3141D27n53j6L81k32j0M7k55K19J56k79m3K65J3l03K90J0k29M10l13l14O81m43
3163i1k04M54l07M0L08m48L00K32l84Q2J16j71O3J0j18P8J83j97j21L46j14k89
3185b32M83k79j84M76m14N6K86m25K08K00l94K43R8l03K96m2j33J49r5k7l2P0
3207Ej02M1K56l05M9L00l52Q4L67n74K46K04n74M37J04m19L86l4l02L25n4k02
$$ plain form
3229 -114 -28 61 -13 -41 100 -89 -87 119 -100 -71 164 -171 5 254 -278 155 155 -317 153 46 -195 180 -48
3252 -48 -155 187 -3 -122 110 63 -29 16 78 -45 6 115 -164 2 163 -172 87 126 -180 204 -8 -191
3274 -191 282 -38 -222 196 -105 -147 120 -105 -69 242 3 -228 78 171 -121 -3 47 -203 173 38 -337
3295 -337 133 148 -259 156 -17 -48 273 -97 -177 158 -148 -87 0 -64 100 90 -139 -25 175 118 -167 -32 135
3318 135 4 84 -179 -224 330 -56 -294 305 2 10 104 -264 67 318 -242 -134 82 11 18 -187 -159 181 128
3341 128 -175 -76 270 103 -256 -5 -55 38 211 -349 -130 412 -135 -147 96 -38 205 87 -375 54 354
3362 354 -137 -214 -14 169 80 -82 -102 147 391 -181 -336 174 259 -138 -94 -263 175 197 -396 -95 325 53
3384 53 10 -180 -105 527 -2 -433 1 242 -36 -235 -208 194 238 -39 -341 151 455 -124 -330 62 108 178
$$ packed form
3229a14Q6Q9p4k8J41j89KK06k19K9K35l35J76K49n32M33%m72M70j07k41L75k28
3252d8j07L42j90j19K32m7r2M5O2j23N1J09k79J66J61l35K59L9l06L84k12j83
3274a91M73l20j84M18l01m2K67k25L6L11k39k31L06R3k92J18N0k50L76j35l75
3295c37M70J5m07M15j73l1L21l70q0L35l06O1Q7o4J64j0k29J14K00n7k85J35J67
3318A35j31Q0k63m5N54l86k38N99l03QR4l68L31K51n60J08K16p1Pk05K8L40n3
3341A28l03R9L46j67l59K51n0R3J73n60K19N42n47j2K43j34K43j18m62M29L00
3362C54m91p7K00J83q9j62k0K49K44n72j55N10Q5l97M4j69M38K2n93L01M20k72
3384E3m3j90P5O32n29m31M34K41k78j99K7M02M4k77l02M92L04n79k06L92M6P0
$$ plain form
3406 178 -216 -512 360 288 -398 -175 114 241 203 -445 -206 500 209 -478 -211 307 216 -171 -231 5 455
3427 455 172 -581 -26 491 -97 -205 -198 56 457 -273 -532 337 391 -44 -263 -117 366 230 -464 -267 270
3448 270 218 -296 -458 129 346 121 -407 -207 604 141 -519 -102 258 171 36 -537 19 686 -170 -512 173
3469 173 297 233 -285 -321 255 372 -260 -565 141 486 -150 -402 -74 337 317 -369 -425 587 246 -359 -206
3490 -206 -139 432 163 -686 -54 677 64 -340 -194 326 392 -200 -416 61 578 -101 -630 -20 445 74 -361
3511 -361 -399 328 614 -444 -488 279 243 27 -434 -361 551 286 -569 -163 378 222 -180 -378 131 519 4
3532 4 -620 -91 660 60 -464 -197 162 519 -115 -690 251 678 -325 -481 19 192 237 -389 -478 417 436
3553 436 -281 -399 112 552 -14 -628 -106 506 248 -561 -297 444 228 -183 -379 -146 672 133 -774 107
$$ packed form
3406A78l94k96Q72p2o86K23K89J27l8o48K39P06k91o87K67N18r1l87o0K36M50
3427D55k83p53N55N17n88j08PK54M01p30k59Q69N4m35k19J46M83j36o94J97N37
3448B70n2n14j62N87K17k25n28K00Q11m63o60M17L60q7j35n73N56O67q56l42O85
3469A73J24o4n18l6N76J17o32l05P06L45o36k52L28M11k0o86n6J012l41o05J53
3490b06O7N71k69q49O32P31o13m04J46N20O6n92k16M77N17o79n29O10M65l71m35
3511c61l8P27K86j058m4P67l6k16m61P3R12k65q55M06N41j56m02j98N09L88n15
3532Do24N29P51o00n24K67L59L57o34n75R41M27j003j56N00J73M5o26q9Q95J9
3553D36p17j18N11M40n66o14N22O12k58q09K64P41k16m11j96K33Q18n39r07Q81
$$ plain form
3573 107 506 -23 -350 -364 298 485 -359 -500 248 516 -74 -436 -103 488 229 -507 -452 466 396 -473 -249
3594 -249 172 257 223 -422 -292 771 123 -543 -118 279 237 -107 -556 113 580 -97 -460 -17 467 183 -357
3615 -357 -313 225 455 -293 -585 220 388 -160 -247 -122 329 381 -492 -308 554 200 -267 -353 -3 467 -46
3636 -46 -638 33 507 26 -329 -120 254 272 -63 -428 72 610 -113 -496 161 293 125 -175 -386 354 453
3657 453 -377 -299 159 287 80 -423 -180 434 117 -477 -199 413 256 -256 -213 -4 294 149 -534 -105 533
3678 533 -44 -334 -100 112 329 -141 -466 202 436 -128 -263 -123 223 215 -375 -203 289 337 -242 -258 229
3699 229 166 45 -263 -249 377 254 -458 -68 343 43 26 -242 9 446 -46 -388 175 181 -14 -242 -243 125
3721 125 278 -145 -305 207 383 -115 -150 39 97 152 -184 -339 243 92 -280 -72 -10 111 183 -307 -48 379
$$ packed form
3573A07L99n29l27j4O62J87q44j41P48K68n90l62L33N91k59p36N5R18p0q69K24
3594b49M21Q5l4o45J30J063o48o66M25L97m2l44m49O69M67o77l63M43M84k84n40
3615c57M4N38K30p48k92Q05J68n48q7J25M51N2q73J84Q62l54m67q6L50M70n13
3636d6n92O71M74m81l55K09L74J8l35l65N00N38p23l83O57J32j68l00k11P40R9
3657D53q30P8M58J28k07n03K43O14l17n94K78O12j57n12M3K09K98j45o83M29O38
3678E33n77k90K34K12K17m70l25O68K34n64j35J40L46qn90J72M92M8n79j6M87
3699B29o3j21l08J4O26j23p12L90M11l00j7k68K51M37m92l42N63Oj95k28jL68
3721A25J53m23j60N12J76m98l5J89N8N5l36j55N82j51l72K08O2J21P2m90K59M27
$$ plain form
3743 379 -53 -289 -62 94 77 -85 -164 1 326 86 -332 112 303 -6 -3 -144 26 313 -195 -221 204 42
3765 42 -5 -51 -139 316 163 -276 -75 205 28 -45 -115 42 142 45 -179 -86 299 -7 -215 67 62 33 20 -276
3789 -276 -36 262 -156 -115 48 -33 204 -79 -179 211 118 -176 -22 69 13 -45 -78 -8 114 158 -151 -90 303
3812 303 -48 -106 46 -138 49 111 -208 101 180 -119 81 -37 -69 212 -23 -144 83 132 -28 -65 -7 35 -32
3835 -32 -6 -110 92 202 -194 91 147 -134 112 3 -189 131 -3 -167 134 -23 -72 90 -54 -75 176 -15
3857 -15 -100 37 123 -59 -71 80 -86 16 76 -127 122 109 -153 142 -45 -76 129 -168 -129 178 -80 -75 156
3880 156 29 -5 125 -15 -18 38 54 -86 31 34 -122 65 62 -175 152 -50 -133 162 -28 -83 94 -84 -65 103
3904 103 -80 60 7 -73 56 53 -59 13 3 -36 -14 61 -55 -140 81 -49 -121 153 -82 -86 199 -75 -31 221 -179
$$ packed form
3743C79m32k36K27J56j7j62p9J65L25k40m18M44J91l09Lj41J70K87n08k6M25j62
3765D2m7m6q8M55j53m39K01K80j77p3p0J57J00r7k24R3L85l06k08K82nk9j3k96
3789b76K40K98m18M1J63q1K37k83j00L90r3k94J54R1n6n8l3P0J22M4l09O1L93
3812C03l51n8J52j84J87O2l19L09P9k99K00j18l2K81k35j21K27M9j60l7N8M2o7
3835c2K6j04K02J10l96K85N6k81K46j09j92L20j34j64L01j57m9J62j44k1K51j91
3857a5q5J37Q6j82j2J51j66J02O0k03K49j3k62K95j87l1K05k97L9L07k58NK31
3880A56j27l4J30j40lN6J6j40J17Lj56J87lk37L27k02q3K95j90n5J77j78J9J68
3904A03j83J40n3q0J29lj12P2j0l9K2P5j16q5K21j30p2K74k35mK85k74M4K52m00
$$ plain form
3929 -179 -63 105 -137 3 65 -113 42 -42 -8 48 29 38 10 119 -46 -95 134 -75 -87 109 -88 -4 201 -169
3953 -169 48 149 -174 58 63 -152 159 56 -127 -13 -1 -25 44 81 -37 8 51 -77 -28 65 -121 -13 116
3976 116 -123 51 22 -158 150 71 -144 122 4 -29 116 -69 -169 154 90 -113 6 53 -42 -2 84 -31 7
3999 7 119 -169 1 131 -168 49 13 -58 100 -46 -114 107 78 -4 101 -53 -20 158 -163 -27 50 57 -86 -12
4023 -12 16 -28 43 55 -140 70 20 -270 29 49 -56 45 -49 -118 264 -12 -113 68 -10 21 17 -140 61 79 -65
4048 -65 -127 40 104 -141 -23 7 19 145 -69 -237 160 70 -177 54 -90 95 106 -213 -56 252 33 -48 -61
4071 -61 54 112 -73 -139 -1 44 35 -165 80 151 -11 -12 -166 7 213 -188 -156 163 -10 -12 -61 -144 177 127 -151
4096 -151 17 164 24 -63 -150 4 119 11 -197 -126 206 21 -188 41 83 173 3 -231 110 300 -167 -115
$$ packed form
3929a79J16J68k42J40O2j78J55q4L4N6j9Rk8J09j65m9K29k09j2J96j97Q4K05l70
3953a69K17J01l23K32Nk15L11j03j83J14J2k4O9L7j18M5M3j28M9R3j86J08J29
3976A16k39J74k9j80L08p9k15K66j18l3J45j85j00L23o4k03J19M7r5M0Q6j15L8
3999GJ12k88J70J30k99K17l6p1J58j46o8K21k9q2J05j54L3J78l21J36P7Pj43P4
4023a2K8m4P1J2j95K10n0k90K99K0j05J01r4o9L82k76j01J81p8L1mj57K01J8j44
4048f5o2J67O4k45J18L0J2J26k14j68L97r0k47K31j44J85J1l19J57L08k19q1j3
4071f1J15N8j85o6J38M5rk00K45P1j62jj54J73K06m01L2L19j73km9q3L21n0k78
4096a51J68J47j40q7q7J54J15j08k08P1L32j85k09K29M2R0j70k34L41J90m67N2
$$ plain form
4118 -115 -18 -13 174 -171 -206 195 152 -137 -131 58 195 12 -185 -124 139 193 -151 -184 197 37 -123 -73 -86 295
4142 295 40 -382 35 170 22 -101 -187 46 260 -197 -151 190 232 24 -139 -28 216 125 -138 -247 218
4163 218 286 -281 -105 192 99 173 -213 -195 362 112 -355 -49 100 186 -52 -282 127 330 35 -205 -75 195
4185 195 63 -251 -113 76 244 -126 -366 100 318 -63 -227 -61 122 242 -300 -255 267 48 -103 -222
4205 -222 -7 215 78 -276 -31 290 123 -236 -156 198 127 -83 -248 -32 374 -126 -348 91 204 84 -68
4226 -68 -221 165 298 -266 -223 104 176 -21 -199 -154 241 146 -250 -168 222 232 -206 -148 69 187 59 -376 -167
4249 -167 323 29 -177 -77 71 260 -145 -352 112 339 -147 -208 -109 215 145 -180 -203 201 291 -124 -249 190
4271 190 272 -59 -155 -109 255 156 -303 -87 343 104 -60 -268 3 372 -36 -294 50 186 58 -176 -160 185
$$ packed form
4118a15R7NJ87l45l5M01m3k89OJ89J37j83j97O1K63N4l44l3L81j60j60N0j3L81
4142B95k55m22M17J35j48j23q6K33K14m57M6L41M2k08j63J11K44r1k63j09M65
4163B18O8n67J76K97r3P4l86J8N57k50m67L06J49Q6k38k30M09K03k95k40J30K70
4185A95j32l14J38J89J68l70k40M66K18l81j64J66J83J20n42M5N22k19j51j19
4205b22K15K22j37l54K45L21j67l59Q0L54p1k10j65K16M06n00k22M39J13j20j52
4226f8j53L86J33n64M3L27P2j97j78M5L95r5l96Q2L90J0m38N8K17J18j28m35K09
4249a67M90k94k06J00J48J89m05k07M64K27m86o1R9L24p0l25k3M04R0m15j25M39
4271A90Q2l31r6M6L64r9m59K16M30k39j64k08K71L69m08k58L44J36j28k34J6L45
$$ plain form
4293 185 171 -87 -272 102 287 -92 -217 50 121 121 -147 -289 253 232 -236 -96 71 109 56 -282 -91 287
4315 287 48 -224 -145 160 152 -92 -140 60 211 31 -295 42 275 20 -56 -187 132 335 -174 -289 177 185
4337 185 -10 -111 -86 213 154 -240 -131 169 167 -108 -187 80 253 -1 -192 -144 272 36 -300 -50 80 67
4359 67 -92 -249 49 274 -105 -200 88 159 161 -154 -255 219 165 -152 -166 85 212 -46 -138 6 156 224 -87
4382 -87 -143 243 5 -168 -63 -26 254 97 -232 64 206 0 -92 -132 19 213 -70 -213 59 156 -74 -198
4404 -198 -38 121 -13 -28 -112 95 256 -189 -160 139 45 -56 -94 -170 196 66 -223 -20 177 6 -49 -160
4426 -160 45 122 -1 -169 -66 132 14 -118 -3 60 99 66 -211 74 128 -85 -76 -27 -41 134 -177 -123 157
4449 157 33 -41 -39 27 29 -29 -123 -45 35 132 -114 16 148 75 -69 -104 -50 124 -33 -174 115 104 -38 -2 -98 47
$$ packed form
4293A85j4k58j85L74J85l79j25K67P1%k68j42N42k1m68J40J67L8n3l38J91L78
4315B87k39k72P9L05qk44m8K00J51j80l26L37K33k55p6j31L19K03n09j15M66Q
4337A85j95j01K5K99n9l94J09L00kk75p9K67J73k54j91M8M16k36l36K50J30j3
4359F7j59j57K98K25l79r5K88P1Kl15j01M74n4l17j4K51J27k58r2J44J50O8l11
4382h7n6L86k38j73J05L7K80j57l29K96J42k06r2m0J51J94k83j43K72R7k30j24
4404a98J60J59j34j5q4K07J61m45K9K99r4j01l8p6L66j30k89K03J97j71n5j11
4426a60K05P7j23j68J03J98j18j32J15O3L9l3k77K85N4k13RM9j4J75l11N4K80
4449A57j24p4KO6Kn8r4P8Q0R7k46J30J32p3j44l5N4J74j57j41K89j1j42L6r6J45
$$ plain form
4475 47 252 -101 -113 109 64 -23 -111 -40 14 -14 -94 -110 109 104 -99 -44 -2 8 84 -39 -39 203 -26 -106 73 -14 71
4502 71 21 -132 111 89 -51 -7 45 9 2 -14 -21 56 89 -48 -102 72 79 -39 119 -46 -39 126 -98 -37 156 -23
4528 -23 21 -22 -25 65 -40 -141 26 13 0 12 -7 21 -8 24 -94 -49 131 -42 -77 101 -61 -16 44 -30 89 61
4554 61 -62 44 82 -59 27 16 -9 52 20 -60 39 12 73 -48 -50 -56 -45 47 -102 -7 86 -65 23 70 -118 132 -23
4581 -23 -106 106 -1 -137 102 -53 -94 18 25 -15 28 24 -64 -44 31 -37 11 14 -88 33 -47 -125 72 7 -57 62 -18
4608 -18 8 150 -57 -50 50 -96 16 22 -78 -13 16 55 0 -5 24 -40 47 79 -112 -19 -29 -108 103 34 -93 23 -48
4635 -48 -16 99 -97 -30 29 -111 16 -57 -79 -24 -41 -48 23 -22 -19 0 48 -5 -10 33 -118 -28 164 -24 -57 86 -32
4662 -32 8 82 -48 -7 74 -93 53 64 64 -15 1 38 0 24 -8 -6 84 13 -36 115 -35 -75 42 -87 -78 115 -170
$$ packed form
4475D7K05l53j2K22m5q7q8P1N4k8q0j6K19nk03N5M2J0P6j23%K42k29q0J79q7Q5
4502G1n0j53K43k2j40M4N2l6pj6pP7L3j37n4J74Pj18J58j65PJ65k24O1J93j79
4528b3M4m3lR0j05j01J67j3j3J2j9K8k9L2j18M5J80j73l5J78j62M5O0p4J19k8
4554F1j23J06L8j41Q6j1k5O1l2q0R9k7O1j21koJ1R2j49R5R3j51Q8M7j88K50j55
4581b3q3K12j07j36K39j55m1J12Pm0M3mq8K0P5o8M8Lj02J21q0p8J97o5o4J19q0
4608a8K6J42k07PJ00j46J12Oj00O5K9L9n5nK9o4Q7L2j91R3j0p9K11o9j27J16p1
4635d8L2J15j96O7N9j40J27p3k2N5j7pP1m5LJ9M8n3nM3j51R0J92j88l3J43j18
4662c2M0P4j30M1Q1j67J46J1%p9J6L7l8K4l2KR0p1m9J51j50m0J17j29RJ93k85
$$ plain form
4689 -170 -46 107 -62 26 73 -44 60 50 -32 -49 -76 10 -53 -8 -16 -26 0 -35 -38 49 5 -2 60 -62 88 -2 -182
4716 -182 76 32 -43 28 -36 -64 120 8 -37 31 64 -36 -5 73 16 -9 86 -35 55 92 -88 8 112 -101 67
4741 67 -38 -39 124 -50 -90 -6 18 -17 42 -91 -48 84 -4 -34 20 62 33 -43 -63 -17 89 63 -83 71 114 -66
4767 -66 -2 -34 -46 85 -109 -44 167 -4 -59 -35 -44 173 90 -96 -33 75 119 -85 -58 9 13 47 26 -27 106 -35
4793 -35 -111 76 70 17 19 -100 -36 167 -70 -128 50 11 22 -76 -28 77 46 -72 -97 -38 92 -102 -140 -1 38 37 -111
4820 -111 6 154 -45 -54 -51 -38 137 60 -194 54 118 -70 -49 -24 73 102 -54 -112 169 147 -35 -166 32 33 -32
4845 -32 -41 -61 77 162 -104 -73 146 28 -1 -105 -51 138 -9 -202 -8 108 48 -82 -52 13 99 -41 -151 23
4869 23 174 -20 -68 48 145 49 -93 -141 152 43 -86 -79 19 126 55 -94 18 206 0 -48 -84 129 194 -68
$$ packed form
4689a70J24J53j69Q8M7j17J04j0q2j7k7Q6o3M5qj0K6l5lQ7m4pO2j22J50r0j80
4716a82K58m4p5P1o4k8J84j12m5O8L3j00L1P8n7k5R5j21R0L7j80R6J04k13J68
4741F7j05jJ63j74m0Q4K4l5N9j33M3J32q8l0N4M2k9p6k0M6J06k6j46J54M3j80
4767f6O4l2j2J31j94O5K11j71n5K4rK17q3j86O3J08M4k04K7O7ML4k1n3J33j41
4793c5p6J87on3Kj19O4K03k37n8J78l9J1r8M8J05l1j18k5N9J30j94l8J39L9jj48
4820a11J17J48j99rLJ3J75p7k54K48O4j88K1K5R7K9j56n8K81k2j82j31J98Jo5
4845c2rk0J38Q5k66L1K19j18k9j04N4J89j47j93J94J16o0j30L0O5Q6j40j10J74
4869B3J51j94m8J16R7r6j42m8K93j09j29PR8J07p1j49J12J88k06m8l6K13O5k62
$$ plain form
4893 -68 -55 39 169 69 -116 50 97 12 -15 -25 23 165 -3 -215 131 161 -15 -75 -72 65 61 -65 -74 60 75 -51
4919 -51 -125 39 117 39 -110 -75 107 60 -170 -53 56 24 -78 -98 53 261 -54 -146 -52 132 101 -93 -59 141
4943 141 137 -70 -88 82 156 -36 -153 37 81 150 -76 -127 98 89 -30 -88 -4 128 113 -161 -36 120 -14 -21 -81
4968 -81 32 159 -7 -171 86 157 -10 -134 -33 131 12 1 -45 11 157 -101 -191 49 52 21 -50 -87 213 124
4992 124 -163 23 108 120 -72 -122 -51 44 1 -142 -97 178 7 -119 33 -1 120 14 -134 48 161 -105 -143
5015 -143 3 58 132 -167 -92 129 56 -31 -115 2 60 12 -164 -95 113 33 -101 -87 132 18 -47 -23 -29 189 31
5040 31 -213 0 85 -3 -22 -57 -44 184 -89 -151 43 114 19 -88 7 62 22 19 -127 58 122 -12 -91 68 61 46
5066 46 -112 -59 150 22 -175 -32 22 101 -40 -127 -8 113 -22 -105 -13 83 -18 -52 21 45 56 -37 -141 13
$$ packed form
4893f8J3R4J30j00j85J66M7q5k7j0M8J42j68k12L46L0j76o0LJ37mj26rJ34J5j26
4919e1p4J64P8p8j49L5J82m7k30J17J09l2j02k0J51K08l15r2R4J84l1j94L4K00
4943A41mk07j8J70P4j92j17J90M4O9k26n1K25rj19n8Q4J32j5k74J25J56j34po0
4968h1J13J27j66j64K57P1j67j24J01J64j19j1m6N6J46k58r0K40Ll1p1l7L00q9
4992A24k87J86Q5J2j92n0P1R5m3j43M5K75j71j26J52l4J21j06j48J82J13k66l8
5015a43J46N5P4k99P5K21p3q7q4J17N8m8j76O9K08q0j34J4K19j14o5K4oK18j58
5040C1k44K13Q5q8j9l5J3K28k73o2J94P1r5j07R5N5m0lj46J85O4j34p9J59pj5
5066D6j58N3K09j28j97J43N4P9j41q7J19J21j35q3R2R6j01l4P3K4J1r3j04J54
$$ plain form
5090 13 153 -38 -72 -12 25 83 -138 -79 92 24 -9 -33 -61 63 59 -118 -32 56 12 -67 -51 100 -4 2 -47 -9 132
5117 132 5 -136 91 121 -5 2 -47 15 9 -116 -17 61 1 0 -27 24 101 -10 -101 -36 84 2 -25 -16 -66 24 66 -42
5145 -42 -30 166 -18 -111 -40 -1 6 16 -141 21 55 -26 33 18 43 70 -46 -41 74 101 -34 -55 76 60 -59 -23 -50
5172 -50 26 51 -79 39 124 -30 17 31 5 15 12 -27 27 84 -46 54 -13 24 52 28 -6 -4 45 -31 -40 35 -47 50 5
5201 5 -51 84 -12 -104 34 -63 18 75 -68 34 77 -56 15 -13 61 39 -54 -9 -5 78 38 -74 -18 84 -16 -3 -69
5228 -69 -51 32 -38 -21 87 0 49 24 21 67 8 -57 21 8 -65 -7 1 2 1 28 0 -25 38 23 -70 25 -20 -6 77 -58 -51 67
5260 67 -55 -7 39 -108 4 8 -63 47 18 -53 8 15 2 33 -31 -7 9 9 -34 -39 99 -37 -47 75 -29 51 40 -52
5288 -52 14 65 -31 42 53 -42 9 52 12 -14 -14 42 -18 -40 -28 -57 46 -75 -16 72 -53 4 -46 -91 28 -16 -77 -2 -28
$$ packed form
5090A3J40j91l4O0L7N8k21N9J71o8l3k4k8J24mj77Q6Q8m4p9J6J51j04Om9L8J41
5117A32j27j41K27L0j26Pm9O2oj25R9P8o0jk7N1P7j11r1O5J20q2k7Rn0R0M2j08
5145d2J2J96j84r3P1L9PJ0j57J62L4q1N9j5K5K7j16NJ15K7j35k1J31j6j19L6k7
5172e0P6K5j30J18Q5j54M7J4k6J0ll9N4N7j30J00o7L7K8k4l4KM9p6rP5q2R7m5
5201En6J35r6r2J38r7Q1N7j43J02M3j33P1k8P4k2r3M5MQ3m0j12N6J02j00J3o6
5228f9J8Q3p0J7J08q7M9k5lM6n9o5P8j3p3N8QJjK7k8k5O3j5r3R5m5J4Q3j35PJ18
5260F7j22M8M6j47J12Mp1J10k9p1O1Pj3L1o4K4J6%m3nJ38j36j0J22j04Q0j1r2
5288e2O6N1r6P3J1r5N1M3m0k6%N6o0k2J2k9J03j21N9Q8j25N7n0m5J19m4o1P5k6
$$ plain form
5317 -28 -18 -21 -28 -9 70 -71 -79 42 -44 -18 -89 77 -10 -25 66 -48 -5 24 -48 -25 90 -63 84 -62 36 36 -18 -82
$$ packed form
5317b8J0lpJ9P9j41qJ21q6K6p1J66q7j5R1j14M3K9p2K3J15j53J47j46R8%n4o4
$$ [...]
8191a2
##END NTUPLES=NMR FID
##END=
