##TITLE=1H_90-2021
 CDCl3,8 sc, 
 23.9.2021
##JCAMPDX= 6.0         $$ Bruker NMR JCAMP-DX V2.0
##DATA TYPE= NMR FID
##DATA CLASS= NTUPLES
##ORIGIN= UXNMR, Bruker Analytische Messtechnik GmbH
##OWNER= root
$$ XWIN-NMR		Version 3.5
$$ Thu Sep 23 10:12:39 2021 Russian Standard Time (UT+4h)  she@DPX200
##.OBSERVE FREQUENCY= 200.1314
##.OBSERVE NUCLEUS= ^1H
##.DELAY= (6, 6)
##.ACQUISITION MODE= SIMULTANEOUS
##.ACQUISITION SCHEME= undefined
##.AVERAGES= 8
##.DIGITISER RES= 18
##SPECTROMETER/DATA SYSTEM= spect
##.PULSE SEQUENCE= zg30
##.SOLVENT NAME= CDCl3
##.SHIFT REFERENCE= (INTERNAL, CDCl3, 0, 15.7039)
##AUDIT TRAIL= $$ (NUMBER, WHEN, WHO, WHERE, WHAT)
$$ ##TITLE= Audit trail, XWIN-NMR		Version 3.5
$$ ##JCAMPDX= 5.01
$$ ##ORIGIN= Bruker BioSpin GmbH
$$ ##OWNER= she
$$ F:/spectra/data/she/nmr/H-F/1/audita.txt
$$ ##AUDIT TRAIL=  $$ (NUMBER, WHEN, WHO, WHERE, WHAT)
(   1,<2021-09-23 10:10:04.50 +0400>,<she>,<DPX200>,
      <created by zg, POWCHK disabled, PULCHK disabled
       configuration hash MD5:
       00 E9 B6 7A A2 85 ED C7 34 08 36 98 17 FE 4E 26
       data hash MD5: 16K
       28 FF 7D 0D 1D BD 06 F7 A5 77 75 7B 39 53 BA 11>)
$$ ##END=
$$ 
$$ hash MD5
$$ 9C E6 66 AB 08 7D 45 22 5D 69 DA 7D 98 87 FB E3
##$RELAX= 
##$RELAX= 
##$RELAX= 
##$RELAX= 
##$RELAX= 
##$RELAX= 
$$ Bruker specific parameters
$$ --------------------------
##$DU= <F:/spectra>
##$EXPNO= 1
##$NAME= <H-F>
##$PROCNO= 1
##$TYPE= <nmr>
##$USER= <she>
##$AMP= (0..31)
100 100 100 100 100 100 100 100 100 100 100 100 100 100 100 100 100 100 
100 100 100 100 100 100 100 100 100 100 100 100 100 100 
##$AQSEQ= 0
##$AQ_mod= 1
##$AUNM= <au_zg>
##$AUTOPOS= <>
##$BF1= 200.13
##$BF2= 200.13
##$BF3= 200.13
##$BF4= 200.13
##$BF5= 200.13
##$BF6= 200.13
##$BF7= 200.13
##$BF8= 200.13
##$BYTORDA= 1
##$CFDGTYP= 0
##$CFRGTYP= 5
##$CHEMSTR= <none>
##$CNST= (0..31)
1 1 145 1 1 1 1 1 1 1 1 1 1 1 1 1 1 1 1 1 1 1 1 1 1 1 1 1 1 1 1 1 
##$CPDPRG= <>
##$CPDPRG1= <>
##$CPDPRG2= <>
##$CPDPRG3= <>
##$CPDPRG4= <mlev>
##$CPDPRG5= <mlev>
##$CPDPRG6= <mlev>
##$CPDPRG7= <mlev>
##$CPDPRG8= <mlev>
##$CPDPRGB= <>
##$CPDPRGT= <>
##$D= (0..31)
0 1.2 0 0 0 0 0 0 0 0.06 0 0.03 0 0 0 0 0.0002 0 0 0 0 0 0 0 0 0 0 0 0 
0 0 0 
##$DATE= 1632377403
##$DBL= (0..7)
120 120 120 120 120 120 120 120 
##$DBP= (0..7)
150 150 150 150 150 150 150 150 
##$DBP07= 0
##$DBPNAM0= <>
##$DBPNAM1= <>
##$DBPNAM2= <>
##$DBPNAM3= <>
##$DBPNAM4= <>
##$DBPNAM5= <>
##$DBPNAM6= <>
##$DBPNAM7= <>
##$DBPOAL= (0..7)
0.5 0.5 0.5 0.5 0.5 0.5 0.5 0.5 
##$DBPOFFS= (0..7)
0 0 0 0 0 0 0 0 
##$DE= 6
##$DECBNUC= <off>
##$DECIM= 32
##$DECNUC= <off>
##$DECSTAT= 4
##$DIGMOD= 1
##$DIGTYP= 9
##$DL= (0..7)
0 120 120 120 120 120 120 120 
##$DP= (0..7)
150 150 150 150 150 150 150 150 
##$DP07= 0
##$DPNAME0= <>
##$DPNAME1= <>
##$DPNAME2= <>
##$DPNAME3= <>
##$DPNAME4= <>
##$DPNAME5= <>
##$DPNAME6= <>
##$DPNAME7= <>
##$DPOAL= (0..7)
0.5 0.5 0.5 0.5 0.5 0.5 0.5 0.5 
##$DPOFFS= (0..7)
0 0 0 0 0 0 0 0 
##$DQDMODE= 0
##$DR= 18
##$DS= 0
##$DSLIST= <SSSSSSSSSSSSSSS>
$$ [...]
##$SUBNAM2= <"">
##$SUBNAM3= <"">
##$SUBNAM4= <"">
##$SUBNAM5= <"">
##$SUBNAM6= <"">
##$SUBNAM7= <"">
##$SUBNAM8= <"">
##$SUBNAM9= <"">
##$SW= 20.0188988654967
##$SWIBOX= (0..15)
0 0 2 0 0 0 0 0 0 0 0 0 0 0 0 0 
##$SW_h= 4006.41025641026
##$TD= 16384
##$TD0= 1
##$TE= 0
##$TE2= 300
##$TE3= 300
##$TEG= 300
##$TL= (0..7)
0 120 120 120 120 120 120 120 
##$TP= (0..7)
150 150 150 150 150 150 150 150 
##$TP07= 0
##$TPNAME0= <>
##$TPNAME1= <>
##$TPNAME2= <>
##$TPNAME3= <>
##$TPNAME4= <>
##$TPNAME5= <>
##$TPNAME6= <>
##$TPNAME7= <>
##$TPOAL= (0..7)
0.5 0.5 0.5 0.5 0.5 0.5 0.5 0.5 
##$TPOFFS= (0..7)
0 0 0 0 0 0 0 0 
##$TUNHIN= 0
##$TUNHOUT= 0
##$TUNXOUT= 0
##$USERA1= <user>
##$USERA2= <user>
##$USERA3= <user>
##$USERA4= <user>
##$USERA5= <user>
##$V9= 5
##$VALIST= <valist>
##$VCLIST= <CCCCCCCCCCCCCCC>
##$VD= 0
##$VDLIST= <DDDDDDDDDDDDDDD>
##$VPLIST= <PPPPPPPPPPPPPPP>
##$VTLIST= <TTTTTTTTTTTTTTT>
##$WBST= 1024
##$WBSW= 4
##$XGAIN= (0..3)
0 0 0 0 
##$XL= 0
##$YL= 0
##$YMAX_a= 822457
##$YMIN_a= -1076500
##$ZGOPTNS= <>
##$ZL1= 120
##$ZL2= 120
##$ZL3= 120
##$ZL4= 120
##$ABSF1= 10
##$ABSF2= 0
##$ABSG= 5
##$ABSL= 3
##$ALPHA= 0
##$AQORDER= 0
##$ASSFAC= 0
##$ASSFACI= 0
##$ASSFACX= 0
##$ASSWID= 0
##$AUNMP= <proc_1d>
##$AZFE= 0.1
##$AZFW= 0.1
##$BCFW= 1
##$BC_mod= 2
##$BYTORDP= 1
##$COROFFS= 0
##$CY= 11.3945322036743
##$DATMOD= 1
##$DC= 2
##$DFILT= <>
##$DTYPP= 0
##$F1P= 2.36226072786647
##$F2P= -0.459571619588291
##$FCOR= 0.5
##$FTSIZE= 0
##$FT_mod= 4
##$GAMMA= 1
##$GB= 0.15
##$INTBC= 1
##$INTSCL= 1
##$ISEN= 128
##$LB= 0.24
##$LEV0= 0
##$LPBIN= 0
##$MAXI= 10000
##$MC2= 0
##$MEAN= 0
##$ME_mod= 0
##$MI= 1.114404
##$NCOEF= 0
##$NC_proc= 0
##$NLEV= 6
##$NOISF1= 3.799351
##$NOISF2= 2.8
##$NSP= 1
##$NTH_PI= 0
##$NZP= 0
##$OFFSET= 15.70392
##$PC= 1
##$PHC0= -14075.54
##$PHC1= 10.60088
##$PH_mod= 1
##$PKNL= yes
##$PPARMOD= 0
##$PSCAL= 0
##$PSIGN= 0
##$REVERSE= no
##$SF= 200.130013532006
##$SI= 16384
##$SIGF1= 3
##$SIGF2= 2
##$SINO= 400
##$SIOLD= 16384
##$SREGLST= <1H.CDCl3>
##$SSB= 0
##$STSI= 0
##$STSR= 0
##$SW_p= 3612.71676300578
##$SYMM= 0
##$S_DEV= 0
##$TDeff= 0
##$TDoff= 0
##$TI= <>
##$TILT= no
##$TM1= 0
##$TM2= 0
##$TOPLEV= 0
##$USERP1= <user>
##$USERP2= <user>
##$USERP3= <user>
##$USERP4= <user>
##$USERP5= <user>
##$WDW= 1
##$XDIM= 8192
##$YMAX_p= 0
##$YMIN_p= 0
$$ End of Bruker specific parameters
$$ ---------------------------------
##NTUPLES= NMR FID
##VAR_NAME=  TIME,          FID/REAL,        FID/IMAG
##SYMBOL=    X,             R,               I
##VAR_TYPE=  INDEPENDENT,   DEPENDENT,       DEPENDENT
##VAR_FORM=  AFFN,          ASDF,            ASDF
##VAR_DIM=   8192,          8192,            8192
##UNITS=     SECONDS,       ARBITRARY UNITS, ARBITRARY UNITS
##FACTOR=    0.0002496,     1,               1
##FIRST=     0,             0,               0
##LAST=      2.0444736,     0,               0
##MIN=       0,             -1076500,        0
##MAX=       2.0444736,     822457,          0
$$ Real data points
##PAGE= N=1
##DATA TABLE= (X++(R..R)), XYDATA
0 0 0 0 0 0 0 0 0 8 0 8 -8 8 -16 24 -24 40 -48 56 -72 80 -96 120 -137 165 -192 224 -262 304 -351 400 -461
31 -461 525 -597 677 -765 857 -965 1082 -1208 1348 -1500 1668 -1851 2049 -2265 2505 -2763
47 -2763 3047 -3360 3700 -4075 4493 -4951 5461 -6035 6681 -7416 8261 -9239 10394 -11778
61 -11778 13476 -15613 18402 -22204 27732 -36537 52834 -93262 416324 344093 -655745 -691825
73 -691825 -189981 626813 786951 341726 -287121 -551051 -348989 215013 478067 320785
83 320785 -133125 -518109 -452622 34702 355738 309457 -70461 -375584 -196747 239793
93 239793 386969 177404 -206133 -324083 -11773 326047 367041 148557 -213803 -359169
103 -359169 -151256 144190 320005 216112 -170223 -426468 -332809 -4642 324002 293001
113 293001 -87962 -351553 -290750 2728 259400 162587 -109233 -186646 -85634 77855
123 77855 142310 -11669 -160907 -146458 -29761 150052 189023 -22965 -241984 -295302 -110276
134 -110276 248584 383900 121729 -272070 -488447 -269851 235521 470276 240853 -205166
144 -205166 -511401 -368246 59289 330449 296558 -11875 -364824 -395932 -121332 195189
154 195189 340989 147689 -188044 -294002 -135438 142595 296945 131223 -125681 -185409
164 -185409 -64833 123293 167254 -10116 -158048 -157848 -68108 73424 101267 -29951 -155331
175 -155331 -205588 -112818 98881 181970 79673 -78656 -193522 -107314 120449 225260 165386
186 165386 14318 -118739 -71968 54058 95733 92745 42055 -26556 -34109 -50900 -63193 -13896
198 -13896 2203 3318 29660 -3231 -49621 -67610 -80486 -538 122508 142365 77763 -50104
210 -50104 -147015 -48328 134085 216529 163655 -19014 -158360 -101429 29508 133597 158540
221 158540 36392 -100900 -134419 -85241 43644 128986 58986 -44009 -99014 -84838 26081
232 26081 90052 39273 -16436 -46505 -16309 63860 57614 -1792 -18363 -17768 23177 73108 46843
245 46843 9071 -20193 -54781 -11351 56233 58965 34637 -28606 -82956 -41774 12149 33523
257 33523 37467 -17121 -53766 -22983 -14305 -13010 4089 3354 31191 44073 -11705 -38867 -24813
270 -24813 2523 68196 89124 37801 -13265 -67111 -66186 29017 93106 83731 18602 -96567
282 -96567 -131364 -42329 55627 105146 48377 -87629 -130484 -64598 22806 92537 65250 -28014
294 -28014 -66034 -55157 2681 83712 74599 6145 -33469 -42053 12577 74759 47584 -7989
306 -7989 -44462 -48588 20438 67707 21138 -37393 -72213 -54526 24884 53845 17509 -21763
318 -21763 -66366 -58275 14467 52533 49375 12866 -50301 -41496 21522 51734 59917 24055 -31990
331 -31990 -17003 25522 42350 40484 -10007 -42844 -2693 25865 23643 4487 -49040 -60361
343 -60361 -15551 14997 36108 13222 -60609 -76344 -28314 29237 77960 44788 -39297 -63881
355 -63881 -34084 35898 102769 64777 -23170 -60927 -48444 19120 73860 36614 -23485 -65047
367 -65047 -76192 -16734 37020 18317 -24727 -73046 -78419 -8085 37181 24177 -8486 -56094
379 -56094 -50724 18481 54878 45084 2214 -52482 -33610 26909 44698 36476 -7174 -60407 -45681
392 -45681 -3606 22845 30267 -21284 -72876 -52950 -12503 23998 32898 -21345 -57548 -37272
404 -37272 -2919 42210 43868 -17062 -44094 -24504 9101 49485 34538 -18486 -35846 -31960
416 -31960 893 48867 32701 -17862 -43392 -43952 4800 53055 29808 -13453 -43062 -47282 8016
429 8016 52341 32024 -7472 -47698 -46721 13635 45055 28834 1199 -39512 -38808 13509 44102
442 44102 46476 16848 -33089 -24781 24267 50093 54135 18601 -28723 -18009 17192 41029 46933
455 46933 1184 -41415 -24155 6360 31533 32696 -11676 -36617 -20070 5623 44749 49349
467 49349 1371 -22558 -9117 24272 69563 60932 10320 -14036 -14609 18764 65106 50525 640
480 640 -32622 -41262 -294 42868 26672 -7099 -36518 -49598 -7449 35076 33306 11764 -25962
493 -25962 -34878 12690 45812 43916 24249 -16913 -23079 14901 37159 38854 12716 -34544 -33645
506 -33645 864 17710 21825 -6351 -44076 -36887 -12900 10305 27025 -3067 -38293 -28254
518 -28254 -5446 22511 33453 -1201 -25130 -18028 -4954 24409 28647 -9602 -28773 -24989 -7185
531 -7185 22686 13251 -22608 -31986 -30533 -9071 23938 12815 -19867 -37452 -39041 -1932 32395
544 32395 13398 -17197 -40066 -44731 -3833 28694 16264 -10455 -44965 -48913 -2558 25656
556 25656 18820 -3146 -38632 -40085 -2147 20236 26350 5307 -37278 -36271 -2749 16770 23080
569 23080 -3752 -40219 -33880 -10527 10243 20925 -10020 -41157 -30579 -7565 18733 26046
581 26046 -7283 -26861 -16671 249 30139 35370 1504 -18600 -16058 4400 36952 29226 -6997
594 -6997 -22159 -23239 -1141 30505 18865 -12058 -29746 -31051 4332 36303 19628 -7203 -25387
607 -25387 -23515 16630 44422 32377 7037 -24399 -24244 22152 48341 36726 5919 -33166 -29533
620 -29533 12955 36949 35743 3493 -41894 -36140 5217 33886 39015 3501 -37662 -29663 3133
633 3133 34610 47970 11404 -30014 -26780 1584 39818 49942 8715 -26018 -25899 -4570 35389
646 35389 44773 6313 -25983 -32919 -8673 35588 38456 3215 -23836 -34112 -8409 33704 35852
659 35852 7913 -22762 -38504 -5885 36682 34964 8618 -24370 -37606 -3182 32792 34635
671 34635 13478 -27925 -41435 -3096 30930 35904 12375 -32274 -40927 -7223 23196 37334
683 37334 13973 -35140 -44476 -13205 21482 39954 11117 -35212 -40744 -16496 19353 43435
695 43435 14785 -29413 -39408 -19301 23138 45978 14091 -24127 -37688 -23420 20752 43212
707 43212 16147 -20350 -42863 -28266 20297 38944 15241 -17292 -42797 -28246 17531 35755
719 35755 21446 -11663 -42552 -24476 18404 34544 24688 -9093 -37661 -20514 13466 32206
731 32206 28292 -9759 -38710 -20808 10325 31450 25519 -14004 -35878 -20800 4873 31414
743 31414 26435 -13835 -34748 -23128 5139 34683 25033 -12331 -29664 -24740 2809 35585 26491
756 26491 -7588 -29012 -28793 3904 34537 23235 -4778 -27270 -31273 723 29376 22466 -595
769 -595 -28958 -32646 2111 25258 20875 1737 -26895 -28606 692 21284 24496 4965 -27110
782 -27110 -25795 1557 20205 24459 3195 -25551 -22788 -2948 16476 25821 1843 -26285 -23525
795 -23525 -6205 15940 23908 -682 -21983 -22118 -10227 15041 24482 1045 -18359 -21985 -9596
808 -9596 17341 20351 769 -13256 -21058 -9655 15715 17330 1736 -13190 -23652 -7040 15700
821 15700 13381 1588 -12958 -22725 -5796 13892 14900 6778 -14040 -23546 -2882 14455 16754
834 16754 9460 -12086 -19583 -3991 9615 19397 12705 -11537 -17046 -4735 7005 17775 10752
847 10752 -8318 -10129 -5335 4203 17862 9534 -6360 -6526 -2415 8667 17132 5247 -3753 -3017
861 -3017 -1803 11346 17387 4275 -3633 -6471 -2265 14038 15601 3161 -2229 -8252 -4388 11878
875 11878 13106 6555 -416 -10039 -2423 11659 9991 7133 1937 -6019 1364 9022 7828 8054 -523
890 -523 -5624 5309 8973 5886 3974 -5995 -5385 5901 7388 7786 3166 -10326 -7833 4000 9014
905 9014 11860 2809 -9706 -5730 746 6175 13441 4686 -7123 -5287 -2699 5134 10022 -182
919 -182 -4614 -2264 -3559 2783 4695 -4241 -4991 -3786 -1352 7145 1619 -9308 -7542 -5390 896
934 896 8967 1505 -8166 -10825 -11819 549 10797 2205 -6272 -12086 -14067 -663 6492 2076 -1643
949 -1643 -11387 -13944 -1279 3938 562 -3043 -11877 -9560 949 209 -1404 -5869 -15077 -8316 2601
964 2601 2953 646 -10635 -18463 -6765 4116 7345 6499 -8021 -17507 -8317 2348 13047 12294
978 12294 -6314 -14678 -9664 -2018 10264 10226 -4275 -11687 -12135 -5964 8179 5775 -5868 -8936
992 -8936 -9153 -864 9456 4380 -3257 -5865 -6535 6314 16250 6829 -2765 -8819 -6691 9439 16476
1007 16476 8170 -1510 -14047 -13724 4823 14070 10657 -218 -15931 -13920 2078 10128 13427 5740
1021 5740 -10023 -8971 2549 10667 15833 6247 -6310 -2318 4957 10090 13367 1779 -7400 -3329
1035 -3329 3325 12574 12661 -3803 -11404 -5749 3011 15445 14496 -1648 -9902 -9529 937 18592 17776
1050 17776 2346 -7039 -10741 -563 15636 14547 5635 -4097 -11948 -1812 11866 11066 4674 -5172
1064 -5172 -9819 1217 9383 7358 3489 -7992 -10473 2650 10033 8888 450 -13610 -11732 2523
1078 2523 9490 11369 1947 -14506 -14159 -1794 9692 16118 4037 -12306 -11757 -4254 7496 15925
1092 15925 5715 -7724 -10617 -7508 4840 11809 853 -8346 -10613 -7766 3750 6760 -2142
1105 -2142 -7808 -11287 -6106 8071 8898 -951 -7397 -10974 -2187 11775 11075 3820 -5814 -13430 -3396
1120 -3396 10292 11208 4746 -7814 -15942 -6160 3743 6847 4613 -8214 -15638 -6958 1495 7093
1134 7093 4727 -8188 -10246 -2184 3434 8966 5452 -6719 -7650 -1306 6077 12792 3758 -9184
1148 -9184 -8863 -3759 5519 12091 2386 -9408 -12548 -8861 4731 12641 2740 -7319 -11582 -9424
1162 -9424 4253 11226 5061 -1693 -9389 -8057 5909 11016 6206 -44 -8255 -4666 6738 8331
1176 8331 6107 -846 -9726 -4732 5284 7413 5111 -4612 -11977 -4896 3258 6544 6121 -4871 -12247
1191 -12247 -5520 2064 9247 8193 -4244 -9155 -3704 1809 9694 8918 -2272 -6736 -4875 844
1205 844 9844 6261 -4095 -6965 -6535 -414 7483 2756 -4849 -8178 -8772 558 8073 2787 -3764
1220 -3764 -7567 -7304 2982 8452 4510 312 -6966 -6706 4187 8748 6373 550 -7539 -5655 3421
1235 3421 5959 5664 571 -8321 -6396 1236 4629 5719 -1513 -8743 -4552 801 4512 6351 -1215
1250 -1215 -7244 -4219 603 6718 7902 -1355 -5409 -2472 1158 7499 7877 210 -3160 -3187 413 8172
1266 8172 6243 -1396 -3570 -4602 -181 5985 2926 -1517 -4674 -7090 -486 6393 2949 -912 -4405
1281 -4405 -5111 2788 7506 5645 3759 -2247 -3236 4518 7957 7217 3828 -3527 -2721 2968 3702 4338
1297 4338 1183 -5896 -4858 -447 1186 3207 -1585 -6455 -2228 1159 3322 5639 492 -2878 856
1312 856 3322 7685 7949 155 -2665 -272 1769 5993 4615 -2159 -4419 -4840 -2213 4149 2032 -4084
1328 -4084 -5472 -5802 -2002 3663 1501 -1725 -2945 -4114 1033 5884 2445 -504 -3077 -3428 2522
1343 2522 4790 1014 -1513 -5851 -5912 1196 3200 1371 -2358 -8413 -6585 611 2336 2685 -704 -7163
1359 -7163 -5753 -733 2220 4097 -836 -6473 -4414 -1599 734 2833 -1721 -4922 -3166 -1524 2279
1374 2279 3411 -2391 -4242 -1530 310 4239 2913 -2792 -4095 -3220 -405 4664 1906 -4363 -6110
1389 -6110 -5960 -1713 3503 561 -3309 -5359 -6286 -783 5292 3299 270 -2757 -3050 3139 6123 4339
1405 4339 2009 -2433 -2813 2729 4390 2621 -941 -6850 -4964 860 2018 1615 -2494 -7975 -4884
1420 -4884 777 4427 6278 813 -5078 -1989 3006 7392 9567 3595 -1449 -1287 830 6056 7598
1435 7598 1240 -2757 -3701 -2676 2915 3379 -860 -2517 -3998 -1924 3781 3772 195 -955 -1790 2085
1451 2085 6680 4908 2305 134 -2016 2949 6808 4669 1896 -2862 -4272 1203 4045 3095 990
1466 990 -3950 -5073 -83 2769 3874 1428 -3952 -3508 1113 2739 3821 1414 -3558 -2379 522
1481 522 3057 4654 511 -4675 -2573 217 3455 5015 -73 -3807 -2686 -733 4595 5978 6
1496 6 -3646 -4117 -2027 4016 4499 -306 -3311 -5589 -4110 1730 2830 -177 -2852 -5599 -2708 2331
1512 2331 2371 1569 -528 -3294 -433 3123 3110 2337 -1070 -3382 194 2227 1123 51 -3744 -5122
1528 -5122 -1618 -134 601 -817 -5924 -5365 -1783 81 2476 547 -3750 -2480 -466 2369 4650
1543 4650 1886 -2051 -985 17 2615 4097 -139 -2856 -2677 -2256 1479 2435 -2216 -4250 -4413 -2542
1559 -2542 2101 2116 -1699 -2678 -3888 -1326 3984 4274 1439 -999 -3079 43 4671 4014 2205 -452
1575 -452 -3694 -611 2877 2832 1491 -2111 -4489 -1278 1229 1520 1530 -2448 -3492 -657 883 2308
1591 2308 1539 -2354 -2333 -39 1352 3194 1381 -1826 -1554 -27 1672 4134 1158 -2679 -1665 -250
1607 -250 1944 3654 -110 -2419 -2253 -1879 1227 2956 -29 -2695 -3276 -1873 2421 2301 -151 -1236
1623 -1236 -2955 -1266 3054 3578 1316 -458 -2611 -154 3678 3161 1473 -610 -3068 -661 2316
1638 2316 2521 1392 -2469 -4208 -1063 1355 1528 1074 -2477 -3420 -1013 790 2714 2137 -2170 -2788
1654 -2788 -90 1695 3378 2019 -1277 -1532 -239 1477 3822 1547 -1865 -2126 -925 1346 3080
1669 3080 100 -2209 -2420 -2125 1264 2820 -37 -1993 -2855 -1939 2462 2869 354 -1006 -2353 -1102
1685 -1102 2887 3480 2084 67 -2889 -396 3006 3206 2184 -435 -2963 -962 1628 2060 1689 -1691
1701 -1691 -3980 -1514 699 1841 1513 -1085 -2782 -1028 854 2979 2935 -730 -1329 150 1760 3829
1717 3829 2581 -519 -1022 -566 914 2726 1143 -1951 -2455 -2180 286 1949 -464 -2033 -2368 -2351 712
1734 712 2491 558 -722 -2001 -1156 2402 2798 1361 -426 -2032 -902 2115 2420 757 -1141 -3432
1750 -3432 -1820 1113 1261 657 -1996 -3989 -1899 488 1503 1563 -1455 -3870 -1368 866 2382 2120
1766 2120 -1095 -2777 -1304 -182 2214 2387 -1138 -2813 -2162 -670 2050 1476 -1030 -1669 -2059 -487
1782 -487 1847 1601 -775 -1894 -2425 -322 1847 209 -849 -1825 -2517 -383 1001 27 -620 -2339 -1905
1799 -1905 733 1610 612 16 -1365 -777 1559 1927 1224 3 -2080 -806 1437 1101 854 -1247 -2836
1816 -2836 -1349 -78 1011 930 -1667 -2981 -1220 1166 2421 2285 -715 -1755 62 1238 3669 3333
1832 3333 317 -1089 -973 1147 3111 2184 -838 -1762 -2237 -869 2181 1574 -541 -2015 -2228 -309
1848 -309 2438 2046 710 -354 -1542 793 2574 2419 1837 -334 -1210 780 1869 1587 1282 -635 -1292
1865 -1292 -153 291 991 289 -1384 -1371 51 554 1046 -148 -1113 -212 736 1121 1718 -8 -1013 121
1883 121 877 1680 1590 -721 -1319 -522 293 1234 1246 -709 -1864 -1125 45 2244 1624 -673 -1120 -1458 -378
1902 -378 1950 1238 -451 -1545 -2155 -304 1767 472 -116 -1341 -2307 -436 1275 1296 522 -1515 -1969
1919 -1969 -50 1355 1724 797 -1350 -2042 -575 290 1246 706 -1812 -2369 -1260 -343 526 51 -1145
1936 -1145 -1420 -1432 -428 846 312 -516 -292 -6 455 1011 203 -309 298 -182 715 516 -758 -813 -972
1955 -972 -419 942 -7 -1307 -1142 -1130 -181 1004 419 -406 -733 -878 204 1582 731 240 -239 -783 479
1974 479 1367 1157 276 -1087 -1370 415 680 642 -140 -1542 -1589 205 584 773 266 -1304 -945 314 869
1993 869 1510 491 -1033 -593 -162 794 1677 993 -664 -621 -520 323 1314 -78 -420 -260 -436 198 496
2012 496 44 -54 -177 -89 887 236 -630 -270 102 215 828 78 -452 -367 -171 724 1369 386 -307 -540 -288
2033 -288 1229 1152 696 -60 -759 -875 438 1168 152 -157 -1136 -612 609 459 572 -23 -1478 -633 499
2052 499 1096 1137 -547 -1665 -299 630 1372 1575 -148 -1425 -639 223 1117 1287 -175 -1120 -1074 -430 1078
2071 1078 999 -324 -587 -1173 -589 981 930 -60 -278 -800 -200 770 161 234 -525 -757 417 1049 428 -185
2091 -185 -480 -768 242 1137 359 30 -830 -1077 453 1124 552 -314 -1605 -1007 472 935 1044 132 -1108
2110 -1108 -1202 101 1141 1420 43 -1129 -525 172 627 1165 -150 -1098 -1094 -454 793 1299 -91 -1257
2128 -1257 -1047 -510 814 987 -163 -647 -1168 -565 1088 1053 92 -417 -1132 -543 902 1277 504 -383 -1236
2147 -1236 -472 809 719 509 -305 -1206 -286 367 230 450 -342 -988 -634 399 802 461 -775 -879 -163
2166 -163 367 607 730 -741 -698 -111 150 823 393 -718 -889 -740 225 651 203 -686 -851 -965 459
2185 459 766 254 -745 -559 -819 135 650 341 -227 -873 -656 301 870 417 -259 -757 -709 486 507 442 -173
2206 -173 -861 -341 525 804 579 -174 -835 -629 211 416 447 -211 -791 -498 -283 568 589 -214 -829 -302 -21
2227 -21 439 759 -75 -209 -286 265 885 751 -144 -167 -249 -168 738 378 -20 -224 -596 44 729 326 -204 -430
2249 -430 -497 179 787 607 -38 -258 -305 123 408 230 273 -190 -268 83 463 370 150 -279 -359 69 243 497
2271 497 328 -783 231 119 145 209 186 -407 49 212 321 402 -34 -276 61 169 378 456 -115 -142 -223 -224
2293 -224 368 291 -59 -176 -156 19 314 253 -285 -198 -193 172 412 -33 -188 -86 -413 448 349 370 -39 -226 -523
2316 -523 121 347 91 -308 -537 -133 -37 207 186 -74 -513 -185 49 92 139 -36 -445 -280 206 269 -8 -115
2338 -115 -466 -155 -216 59 293 -51 -323 -209 115 252 57 -260 -208 -340 -377 390 283 -353 -184 -385 -116
2359 -116 642 247 10 -74 -371 81 162 183 -119 -96 -157 246 196 124 58 -401 -549 -99 199 106 -219 -387 106
2382 106 -2 -223 290 115 -201 -261 -210 321 184 187 -447 -194 40 224 232 180 -21 -102 107 332 407 86 -61
2405 -61 -340 -30 327 373 80 68 -378 -30 74 142 400 -164 -68 -88 279 98 71 170 -83 -90 63 184 346
2428 346 181 -477 -179 170 -105 25 181 9 121 139 23 118 205 -422 124 -124 131 177 242 10 -36 -90
2450 -90 242 313 -194 197 -228 -66 -68 117 -85 -133 -50 -41 191 -7 40 -253 -253 -59 -3 -247 15 -31 -497 202
2474 202 62 27 -145 -78 -96 244 200 235 135 219 156 -7 67 288 14 25 -137 128 -248 185 101 -1 -99 -109
2498 -109 342 52 108 -250 15 164 243 -8 333 -262 -121 6 386 27 54 138 -52 -100 101 287 105 38
2520 38 169 -36 -50 -49 179 61 -523 -137 -27 183 149 26 -11 -92 16 71 158 -15 65 188 127 -92 123 -29
2544 -29 93 162 -468 283 394 105 186 123 -114 281 -44 -162 71 156 -285 -62 158 -416 -239 -163 -205 210
2566 210 154 46 -103 -11 14 -60 171 77 -147 -11 -111 194 -55 52 84 169 54 280 19 9 -180 70 410
2589 410 -94 83 88 92 -84 21 -17 47 63 -104 -70 -28 149 81 68 -238 5 -196 147 228 -202 -78 -262 -84
2613 -84 82 375 -27 -264 -40 18 -264 142 -43 171 -269 139 286 64 -156 -278 -181 -84 151 -13 121
2634 121 14 -45 -235 -149 172 -2 -95 -63 -20 -177 47 42 -174 -524 225 -100 -10 -49 -50 -51 256 -130 230 205 -55
2659 -55 -80 84 -134 -2 147 -89 -61 -283 -9 211 -91 -217 -91 155 -7 -143 12 -50 -100 -34 20 123
2681 123 132 55 -100 151 175 97 -73 46 -166 117 -164 222 32 -271 -102 -50 294 178 -223 -73 -205 -206 -20
2704 -20 -84 60 -70 -310 -250 -133 200 386 178 40 -265 -46 173 254 81 -119 -182 188 -106 140 93 -116
2726 -116 -89 11 -65 332 -71 -188 -172 -67 48 85 33 43 -142 7 121 217 107 -12 -246 -155 80 377 -10
2749 -10 -33 -115 -49 163 83 219 223 -163 264 -78 61 134 -210 49 -54 -21 198 4 -506 -109 34 279 -1
2772 -1 128 252 -136 172 280 256 272 -54 -290 -253 136 119 88 -150 16 -179 -98 285 -31 -196 -60 1 51
2795 51 -15 16 -219 -120 -64 65 192 5 286 -114 -121 19 77 9 139 -548 -148 -98 -120 159 -418 -229 -137 115
2819 115 -63 -17 159 -236 19 -46 228 240 -212 -86 -265 -60 127 223 21 -165 -105 196 120 117 -94 -96 -280
2842 -280 171 202 37 -68 -102 -217 238 481 95 64 -167 -144 162 268 -196 -112 -338 -138 266 72 392 332
2864 332 -86 4 305 160 97 -83 -262 -34 202 247 212 59 -64 -21 -219 3 79 -134 -56 -6 241 388 55
2887 55 294 87 -46 91 221 -32 170 35 -172 53 131 71 196 -351 -106 -31 91 73 39 -50 -154 207
2909 207 -16 203 -37 -24 -193 103 250 -111 32 -199 -131 303 198 74 6 -65 18 236 33 38 266 -181
2931 -181 -137 282 297 236 -247 -202 -115 15 261 531 47 -403 -14 0 355 -82 -267 -8 -109 155 189 72
2953 72 164 -183 -37 -93 165 -30 -230 -216 -88 -147 94 -156 40 -10 -355 223 305 66 85 -137 -22 116 368
2976 368 335 267 32 -168 239 224 4 24 -212 50 155 105 228 -5 -11 -159 431 234 497 -269 -37 -117 83
2999 83 220 486 81 -70 -109 177 546 251 40 95 -96 -50 282 34 86 26 -241 -217 58 379 -80 -116 -376
3022 -376 8 -108 -41 187 -23 -345 358 360 111 158 -192 -75 59 140 63 195 -31 -262 -11 283 81 109
3044 109 -189 -59 12 -109 292 210 -499 -300 -348 -51 235 83 -91 -29 -28 156 209 188 172 -142 -181 386 204
3067 204 -22 -131 -358 -16 219 326 9 -88 -426 -376 268 -46 -44 -252 -351 99 154 176 8 -19 0 158 78
3090 78 346 243 -133 -249 -275 246 216 248 -446 -261 35 -75 375 -161 18 15 -35 -165 473 179 -151 -193 -105
3113 -105 330 235 111 -63 -212 -194 38 319 -120 -113 -417 -288 181 113 229 -47 -145 -90 80 -87 182 -40
3135 -40 -95 7 288 289 305 -285 8 100 -27 73 139 75 -458 108 173 406 291 202 -35 43 236 153 160 -245 -275
3160 -275 -82 130 61 79 -309 29 -155 -41 60 165 9 -87 -189 110 367 -62 95 156 140 303 379 -15
3182 -15 73 -54 -68 -68 351 -299 -81 -539 -116 146 233 -206 9 -234 24 204 123 322 -186 -15 -81 148 25
3205 25 256 -121 -641 -23 50 61 194 -352 -609 -294 135 -76 -68 4 -212 188 -27 -76 -82 -115 52 -44 -52 456
3229 456 221 -321 -17 -105 30 70 170 -113 51 -388 -115 0 -17 145 -204 -142 19 401 36 -133 -184 -217
3251 -217 340 264 15 -57 -312 -296 185 -211 -114 -299 -364 -53 176 -59 206 -44 -441 -268 -117 289 447 -280
3273 -280 -326 -136 -71 67 412 -81 -254 -65 91 208 354 64 -236 -132 -178 152 383 81 148 -91 75
3294 75 149 55 -157 -28 -221 2 175 42 -146 -186 -152 216 171 263 -103 -195 18 116 138 95 -86 -430 -163 -188
3318 -188 230 415 235 -347 -416 44 177 69 -46 -451 3 30 341 11 -133 -491 -86 275 67 182 -56
3339 -56 -136 -204 173 385 326 -104 81 54 41 385 145 1 39 88 -255 315 -243 211 -140 -337 24 304 71
3362 71 163 -28 -310 76 59 0 -103 -19 -143 194 -146 -253 -17 -87 -364 -40 207 264 -66 -202 -193 367 54
3385 54 115 79 -414 -156 219 34 370 -308 -159 64 -266 300 188 -48 -270 -11 -20 66 28 -225 31 -104
3407 -104 -100 189 103 43 183 -178 -53 437 32 -112 -330 -432 -10 161 117 -58 99 -115 198 -48 -190 270
3429 270 -7 -23 204 200 123 234 -79 -51 -64 -66 319 41 -257 97 -46 379 -107 21 -172 74 11 92 93 -323
3453 -323 -251 6 -11 -37 -72 -52 -191 -253 -105 465 111 -28 -42 -228 -258 246 82 26 -11 -229 15 196 15
3476 15 -133 195 -193 -116 20 24 63 -59 -49 135 122 -13 225 152 -137 362 96 -18 122 158 -277 -37 -17
3499 -17 189 231 -432 -114 23 126 195 -31 -71 -72 -162 27 115 -175 -198 -103 -7 374 382 -21 -205 -239 56 386 184
3524 184 -103 21 -93 -98 175 106 -212 82 -224 -115 386 318 -25 166 -39 166 453 -99 81 -237 -428
3545 -428 25 46 129 22 -113 -56 159 239 215 -204 -462 -68 124 142 -56 -89 -178 -124 -116 -5 391 116 -201 79
3569 79 -126 56 298 25 -155 -50 -299 157 176 177 190 -125 -101 172 226 -30 -1 -191 -222 179 261 -72 -45 -264
3593 -264 84 207 -1 218 -109 -2 69 362 48 329 -134 -171 -63 265 151 147 -279 -184 -166 33 -29 149
3615 149 -175 38 67 53 289 -112 -150 -138 -9 -75 388 -64 -4 38 -159 197 104 298 -163 -143 109 254 406
3638 406 54 -163 -415 -80 -140 113 -107 -205 -139 -279 170 219 1 -68 130 -224 230 195 -267 -18 -419 -79
3660 -79 86 -169 -137 -191 -147 -212 177 257 -94 -414 -133 101 -49 194 47 -41 -215 -117 299 467 -190 -14 200
3683 200 -322 113 292 32 -324 -109 142 53 120 -10 -106 -126 -36 -54 489 116 -186 -163 -301 288 290 -169 83
3706 83 -162 -127 65 236 271 16 -202 -138 25 83 107 27 -194 76 243 -28 97 -4 -380 -199 339 343 499
3729 499 -193 18 120 -289 212 304 -256 -88 -122 84 200 156 -32 36 -167 45 296 37 11 -167 -194 195
3751 195 236 175 307 -13 -245 38 389 38 -208 -71 -105 63 249 -43 -33 -273 -136 76 -138 -69 86 -221
3773 -221 363 159 362 86 157 -71 101 -103 -3 482 -101 -250 -78 56 -30 158 -68 -185 24 -217 149
3794 149 214 -62 -144 95 -119 -62 -206 46 120 -132 -79 171 147 -407 129 -194 340 311 -145 -215 -247 -441 4
3817 4 -108 76 -200 117 164 -257 234 -71 334 -45 -296 -19 -39 13 -11 -224 -178 84 -105 224 248 -277 -116
3840 -116 142 60 11 -173 -178 -145 -122 144 195 -112 -279 -116 265 268 24 -93 40 87 52 106 190 -218 24 13 4
3865 4 287 85 -151 -28 115 -119 -34 -85 168 288 -274 -119 129 278 284 -184 -194 230 138 87 419 -85 -269
3888 -269 245 -5 -120 19 -466 -62 -35 -40 152 -118 -148 -123 129 -49 107 205 -151 -22 35 95 -113 -9 87
3911 87 -47 -198 186 300 -63 -140 -31 -138 290 -134 -115 251 -265 -143 223 -47 -392 -66 164 -199 77
3932 77 52 -39 -30 -213 249 11 192 138 -10 -167 -169 188 8 138 -64 -65 15 -131 216 -31 -330 -62 98 122
3956 122 196 -319 -242 -260 -227 173 178 -207 -59 306 135 -167 -63 64 -48 -38 79 -42 492 122 -113 -240
3978 -240 180 24 75 -73 -26 -213 -73 132 171 172 -100 137 116 156 -36 24 -196 1 186 181 -95 -122 -146 -226
4002 -226 340 169 -30 215 -120 -283 -58 -310 119 148 62 83 -54 2 -66 -234 223 209 156 153 345 52 -228
4025 -228 -188 -40 117 274 99 -19 1 -467 22 7 -107 94 -140 -269 60 -304 -107 32 -72 30 88
4046 88 181 49 197 -19 73 16 -50 -72 -77 -139 -113 -4 45 -24 57 -270 -12 140 64 0 -87 -63 -96 -88 164 109 -127
4073 -127 -63 -94 -246 101 -58 -278 137 -240 -209 85 -8 -131 98 -152 -94 121 -394 -72 -114 -80 -37 206 -210
4096 -210 -127 91 -87 403 73 231 -63 -240 49 70 -41 -142 167 -218 -11 7 -98 96 -148 183 151
4117 151 74 99 -30 -38 80 -48 282 125 -146 -67 -37 -134 -76 329 159 -60 171 -134 -155 336 409 222 -24
4140 -24 20 -2 111 386 224 -225 -192 -8 138 224 248 -282 167 -91 236 -235 173 -74 -54 109 220 119
4162 119 116 56 -378 -9 43 270 -5 -212 -194 419 335 -23 149 -80 56 36 171 121 134 -6 5 120 -101
4185 -101 79 138 43 23 -38 65 57 -251 -61 -155 57 312 -33 70 -205 -114 82 207 201 -16 51 -232 -113 -125
4209 -125 -73 -32 -166 -115 68 -1 -43 -182 -188 40 177 -110 -119 -82 -238 -61 176 37 24 106 -175 -196 195 146 263
4234 263 114 -112 58 -53 -126 110 -379 -175 104 122 -250 -40 -233 -17 -267 -195 108 -48 78 -65 19
4255 19 -136 -36 -255 -141 23 -63 -140 14 -40 -91 -43 139 114 259 -160 -66 16 -96 36 -96 206 -19 -318
4278 -318 -129 96 24 78 -70 3 -189 -79 76 129 -61 22 -201 145 201 200 -8 -164 70 17 125 48 153
4301 153 -201 -75 -144 18 -5 -370 -111 -22 14 218 164 -153 190 182 -82 103 -42 199 52 -17 81 125 106 -42
4325 -42 -34 162 -165 -203 204 82 -98 -48 45 -40 167 -21 29 -213 -154 69 72 144 -28 -241 24 204 116 213 -46
4350 -46 -112 -91 -44 -83 128 149 -117 145 -50 -18 287 -74 -44 186 -49 -96 2 -204 17 -166 -35 -100 -2 -18
4374 -18 -23 110 101 130 64 -85 -118 14 37 -33 -97 64 -73 124 43 165 -107 161 -336 35 133 -18 35 70 -332
4399 -332 -30 -30 56 219 160 -3 144 298 242 13 -172 17 20 125 -143 85 226 -46 -67 -55 173 -63 -185
4422 -185 -136 33 186 184 -161 389 72 124 -48 -37 -77 -37 117 -215 0 269 -307 79 221 -46 0 109 -165
4445 -165 64 72 -63 -32 32 -144 -31 -20 218 -155 -89 94 -86 -122 -29 115 -96 -56 60 51 -172 -203 200 77
4469 77 28 -92 123 -119 239 64 174 -17 -205 -147 85 -96 90 144 141 106 55 -48 -173 134 -118 -54 179
4492 179 57 -202 41 75 -274 83 -198 -70 -110 -303 126 -35 42 170 -88 -90 155 -117 132 22 -274 -55
4514 -55 -16 -146 183 95 379 72 -205 77 27 189 -162 -178 60 256 148 -65 -118 332 183 489 -95 -59
4536 -59 -19 -140 149 -170 59 -80 -233 -21 74 108 -37 -264 112 -181 -10 -133 200 142 19 -58 -44 11 -48
4559 -48 70 -5 98 43 -98 -41 -217 170 86 -127 48 -224 -133 -282 -153 -166 80 -252 -238 73 17 -11 225
4582 225 163 49 139 255 54 160 85 30 -170 -81 124 118 4 -161 -181 -7 -244 -185 -241 -13 -425 -210 -17
4605 -17 -217 130 -69 -159 -163 -251 274 -127 -22 76 11 -11 95 -37 49 -23 -25 -84 159 160 -125 159 228 -80 -9 -138
4631 -138 -96 59 -36 105 135 211 -105 -113 16 144 368 17 -39 -106 -2 7 110 -20 8 59 -72 -14 -259 140
4655 140 35 -52 -260 37 -46 -239 -10 115 -2 100 -26 -13 182 133 217 8 68 78 197 109 30 -94 -41
4678 -41 53 324 423 -42 37 82 -175 167 68 325 -127 -31 8 1 -112 62 -1 -115 53 65 4 51 -281 -122 142
4703 142 37 -115 -12 -125 356 -64 169 15 50 73 -34 4 116 88 -31 -60 94 -136 -180 140 -104 -213
4725 -213 236 72 -160 -185 -34 151 124 51 -51 -8 114 92 -30 62 -58 -166 73 74 248 139 -171 111 98
4748 98 -38 31 22 -73 197 -193 94 -123 -23 126 109 323 116 50 -28 -28 -170 46 126 -165 156 14 -36 156
4772 156 -124 -95 40 59 222 181 -55 121 133 -97 -66 -92 -122 151 67 -201 74 41 -185 10 191 -58 106
4795 106 170 229 48 -42 -78 -135 -160 -141 -21 89 57 -137 -122 -61 -72 79 83 -71 203 -91 -204 -164 7 -122 33
4820 33 114 143 -256 198 -32 19 -251 -48 -143 78 -80 -96 -130 -89 -108 -86 -231 134 207 -44 -194 129 106 -23
4844 -23 209 -189 -139 -142 -4 43 200 125 -10 18 94 58 -42 -110 112 -51 3 -192 162 -174 -43 31 122 -27
4868 -27 -69 13 -13 22 200 -43 -190 189 210 298 115 42 -179 -65 120 169 -75 -6 126 -50 -42 54 200 141 212
4893 212 30 53 161 -56 -148 33 143 192 -87 -17 220 -101 85 355 73 100 90 -111 -47 125 51 69 -4
4916 -4 -119 165 -87 -185 -38 216 -290 -52 -83 -159 12 -16 -184 -77 -140 177 -47 -91 26 -185 260 -152 32
4939 32 32 197 330 -69 133 216 -23 1 -144 51 75 137 -33 -178 -259 -15 -156 -10 317 -15 -61 165 -59
4962 -59 20 -170 -346 -62 -169 71 128 -102 -85 157 13 -85 -23 79 140 -238 -135 -194 -118 -125 -108 227 16 -211
4986 -211 -64 -100 -12 2 -35 -220 98 201 120 169 -28 161 24 139 98 55 119 34 -318 -180 64 -258 -18
5009 -18 -50 75 -55 -32 -91 -115 59 -46 -39 78 -34 46 -64 131 -31 305 30 225 -76 -155 83 -67 -289
5032 -289 -114 -182 -130 265 269 347 -164 85 -29 293 -288 136 119 -166 -135 48 62 132 -131 -6 96 182 53
5055 53 94 -2 -149 121 -26 -10 -140 -199 -389 -93 -73 -168 -104 29 191 -162 -48 31 91 170 -17 57 221 -234
5079 -234 -170 95 43 36 -145 -42 40 67 1 -33 -83 162 -163 214 178 -87 3 7 200 173 -62 107 147 116 244
5104 244 43 230 112 7 197 -397 74 -137 -159 166 -4 -15 20 217 134 -152 40 -21 -98 74 -164 127
5126 127 -35 -188 -158 -46 -58 -73 19 -125 20 -27 -145 213 -13 -124 165 -74 -64 -123 110 -137 332 -248
5148 -248 15 -23 -322 -106 -26 58 -205 31 213 -97 85 -97 -160 38 148 78 -92 -382 -127 44 239 143
5170 143 28 201 -96 -16 118 292 -134 -288 71 -103 -34 126 8 21 23 -270 25 -206 -25 -188 80 84
5192 84 81 -22 36 -92 -375 76 -408 -134 -41 -114 -36 -168 -92 -37 157 -66 151 173 -23 15 -66 -71 92 -158 -302
5217 -302 -144 -35 23 257 187 81 211 112 167 -146 4 -59 -29 37 -171 43 -118 -27 110 169 -240 49 12
5240 12 -52 -124 -34 269 -159 -18 124 -153 190 197 104 55 -72 -15 -140 52 -44 213 135 70 183 10 -43 286
5264 286 38 -162 -59 -131 101 257 -10 -25 72 -106 120 -233 190 -143 355 -13 -12 29 -230 -28 -71 49
5286 49 60 20 -103 213 -287 -37 283 -114 128 -220 -236 13 31 -119 12 -65 -26 -9 135 58 17 257 189 -96
5310 -96 170 -359 64 124 268 -137 -20 111 -139 114 47 -163 -5 164 -10 -258 -1 -113 -164 -30 -42 91
5332 91 24 -167 49 70 -25 -10 182 29 57 -69 28 151 -1 -135 200 -67 373 3 -191 -10 92 -228
5354 -228 -190 83 -314 -312 -85 9 208 192 -146 -266 67 366 -155 67 -1 169 -86 171 236 -12 -214 -104
5376 -104 183 264 -15 184 17 268 176 75 69 -37 177 -210 69 281 -112 -193 2 -317 78 111 268 25
5398 25 -125 68 40 -116 -93 253 -151 -325 -70 149 206 -280 -171 83 -297 100 3 194 -233 -131 -40 9
5420 9 89 100 39 51 -30 -88 258 -28 -167 180 110 271 51 -164 -72 -218 -130 -12 -126 -19 42 -130 -48 -243
5444 -243 -18 100 220 -86 238 -63 127 378 45 -128 -78 72 -135 -20 -8 -214 -65 130 2 -37 -129
5465 -129 48 -97 -95 231 126 -194 -45 -13 46 79 89 -208 117 38 71 88 53 84 -199 -71 38 13 -204 125
5489 125 91 36 -197 28 -185 -128 129 -205 116 -59 46 -44 50 182 160 -43 124 146 28 -296 -231 8 -94
5512 -94 287 -27 158 90 -157 262 -32 -440 -142 47 124 64 -184 35 7 -252 77 -100 -94 115 -72 -86 -41
5535 -41 -3 11 77 -243 -231 86 191 63 54 77 -62 -2 139 332 76 137 -83 55 74 0 -50 60 117 122 84 -21
5561 -21 11 -93 229 -79 97 73 -90 195 -122 -12 178 -118 -398 -100 -54 4 31 229 2 -180 7 -36
5583 -36 159 -174 -138 -325 -295 98 33 -128 -47 283 -10 489 -42 -83 229 15 -104 41 43 -508 85 -204 8
5606 8 270 112 -103 -243 -121 -237 343 118 -138 -185 -53 49 226 25 -56 -156 -47 34 28 -77 90 -235
5628 -235 -85 87 26 -32 -146 -155 -128 -111 179 213 -198 -150 81 32 181 91 -91 395 -334 72 137 430 -104 -376
5652 -376 -265 -16 90 371 69 88 49 -60 175 -169 -136 -104 18 219 120 93 104 -101 -211 -90 -66 38 -161
5675 -161 -166 -420 161 173 -23 238 15 -213 310 -11 85 121 -12 23 224 -39 186 -142 23 55 152 148 316
5698 316 103 -72 -175 -24 177 94 -63 42 202 -141 387 -122 -231 -217 -173 -205 255 55 -67 186 -4
5719 -4 211 252 -79 9 -55 -320 -98 8 -138 -95 61 -104 -25 -48 109 198 -207 211 185 14 42 232 -335 -25
5743 -25 317 306 50 208 128 71 189 -35 69 31 -16 200 -58 92 151 -26 -207 99 -23 -128 -70 -32 60
5766 60 18 -115 11 -138 -196 -47 148 96 48 135 -105 240 -234 26 95 -8 139 137 -170 90 27 -79 196
5789 196 267 -130 -28 71 160 113 68 -89 -281 129 152 -151 -65 272 58 87 172 258 -140 -57 69 -229 -73 116
5813 116 39 -40 54 -17 24 -36 68 -180 -24 -21 -54 -204 -259 -86 -34 305 93 -101 -178 -114 -40 329 203 32 241
5838 241 205 -48 50 92 319 -121 -412 -57 71 193 182 108 233 133 225 130 35 -506 -29 162 164 241 -270 -7
5862 -7 61 131 166 339 45 -223 33 -81 -40 24 -2 -4 163 -108 -48 17 109 -120 -32 103 48 276 -214 -4 -21
5887 -21 -186 176 56 -160 -72 27 -15 50 59 -23 -59 -150 -67 344 146 212 -111 80 142 103 -60 166 -158 -373 -20
5912 -20 140 316 -77 -163 -431 -10 207 -19 197 -136 275 -26 -57 270 91 36 -123 -127 190 419 71 -286
5934 -286 -2 72 -229 48 -16 139 110 -126 -266 291 -162 46 -184 -131 301 -189 77 39 -57 38 162 -105
5956 -105 -114 52 -233 -165 45 10 -31 -131 -237 63 228 -293 267 37 19 93 -136 14 131 -140 -90 93 -116
5979 -116 -12 66 -225 -136 -47 -315 -338 -15 -235 -291 -153 -274 200 248 -2 -21 -208 -67 265 -126 -79 206 36
6002 36 -72 174 21 -44 -8 195 93 137 -254 -20 -93 -209 149 -160 -72 -50 -70 -226 -18 -4 93 13 -402 -207
6026 -207 45 60 254 -63 -271 -184 12 -234 55 151 -235 236 -247 51 2 -186 -61 62 94 91 6 -33 -434
6049 -434 -139 -53 58 104 30 131 106 88 195 -83 92 -84 -213 136 -32 -68 195 -49 -129 -35 109 122 -52
6072 -52 -263 -346 40 4 21 -121 -350 -69 26 -85 98 61 -46 -86 80 -91 151 35 -211 -104 27 193
6094 193 36 -113 -239 108 -26 -61 -279 -81 -5 58 -10 -121 342 -191 -109 -91 -171 244 238 73 -302 -169 -61
6117 -61 -33 -58 66 77 72 225 -82 238 -169 124 36 271 -7 -216 48 -19 -117 -130 159 -5 -6 -201 -16 250
6141 250 -295 -122 -70 -9 -15 110 212 227 -102 -308 218 -13 -129 174 -214 -244 51 -59 106 21 -93 220
6163 220 -264 68 -58 281 52 8 25 -145 223 -16 -281 14 -17 155 41 51 -129 -56 82 -93 158 -256
6185 -256 127 -85 -139 9 -12 -141 -105 -158 57 94 -66 124 22 -281 141 154 43 -157 -86 -67 2 16 200
6208 200 406 203 -407 75 -44 -21 422 -113 100 242 94 95 -249 -142 -110 18 -17 81 89 -242 46 -132 78
6231 78 221 68 31 -128 -126 -37 103 165 -275 14 -67 -46 157 -190 33 -215 -297 -140 -133 -86 -26 -257 -255 32 -336
6256 -336 166 148 159 -232 58 287 -240 1 -155 37 1 -27 -62 153 -122 125 -360 -149 32 -54 15 -253
6278 -253 -34 73 -100 -137 -33 -27 49 -146 162 -162 -89 103 -166 -20 6 -31 -94 -10 178 -53 -14 275 81
6301 81 -33 -26 306 165 275 -64 11 39 130 130 276 -251 -165 81 117 108 -12 8 -156 -20 40 -225 41 -123 -161
6326 -161 89 -99 -20 210 248 -50 -93 155 163 76 21 148 -75 138 -113 53 280 -18 -94 -68 97 -9 -36
6349 -36 -47 111 -45 53 117 -90 -71 -125 162 -193 -116 70 -240 211 -222 -143 318 95 -68 213 17 -123 119
6372 119 229 -17 36 -239 -132 271 -254 67 86 -40 71 -22 157 -221 -254 185 65 -53 -33 388 25 82
6394 82 309 -257 214 -188 -10 116 -54 -130 -33 -77 -144 219 39 -61 -96 125 -285 -49 -146 -18 -216 -239 -84
6417 -84 260 -2 64 93 -235 133 331 -176 255 -23 -125 64 -246 87 209 -98 78 -38 7 59 -125 -413
6439 -413 -347 -14 -204 123 196 0 -187 81 -57 -1 121 -34 70 -102 -54 167 100 -18 -103 16 -171 125
6461 125 -4 -194 12 -80 417 185 -26 42 -73 -152 210 -202 52 41 -51 -128 24 135 -7 63 -287 183
6483 183 -55 -169 68 41 18 -162 164 -113 -266 -37 -251 11 -153 233 57 -105 166 -13 24 -187 64
6504 64 -229 213 14 114 80 -145 -134 2 -79 134 120 114 -86 -70 -165 -129 49 9 109 3 278 51 233 -46
6528 -46 156 66 -274 17 175 288 19 -226 -268 96 105 52 57 -138 -173 -140 48 70 -111 -154 31 17 313 -43
6552 -43 -218 9 248 167 94 43 -180 3 -219 -41 54 63 -303 40 19 -63 -138 -65 24 85 -19 182 -59 194
6576 194 265 -93 -129 34 187 48 -68 -150 -131 99 148 193 86 -51 -73 -61 126 60 -32 -576 -42 175 -126
6599 -126 -85 44 -79 -98 216 58 286 161 -118 -52 -202 117 195 -168 -53 -15 -91 -33 102 37 -173 84 -72
6622 -72 -25 227 294 -5 -32 10 316 122 126 -191 -107 193 53 157 -54 -33 -321 90 139 429 91 -52 0 126
6646 126 292 -89 81 80 -49 153 150 84 33 79 -13 24 3 120 118 -387 87 7 27 -70 -148 -98 -301 16 98 -24
6672 -24 -177 295 -80 40 99 -50 -110 -72 83 -56 -11 10 44 8 181 117 412 -8 -48 169 -8 -57 -27 105
6696 105 9 -159 -166 -236 19 21 -157 -388 14 -60 288 362 16 -125 190 211 -114 61 247 -408 13 -2 -137
6719 -137 230 85 -39 -177 -93 -147 161 -21 -3 199 53 146 157 -3 -136 -198 -215 -62 -146 -128 57 152 -159
6742 -159 7 19 -65 39 -114 -97 194 97 -220 183 -163 54 -158 -151 -56 8 -272 16 86 25 -111 -10 69 -75
6766 -75 433 -127 130 -2 247 -34 -44 -11 -178 -174 -35 -183 212 133 -228 -123 156 -46 151 169 142 -10 -267
6789 -267 14 282 183 -17 48 -176 -166 23 344 154 -203 145 364 -29 -18 282 111 58 -91 -24 70 65 127
6812 127 -287 -115 166 150 -52 -145 -45 143 9 116 -50 -195 -124 45 -59 261 290 -304 -24 -349 -191
6833 -191 -136 -15 -84 -213 -281 -123 157 5 -268 -84 -88 -20 70 33 -79 231 0 -14 79 -111 244 -131 -52 -210
6857 -210 49 -223 76 -203 -88 -215 322 170 47 32 104 31 -28 153 52 -329 95 210 118 -324 72 -111
6879 -111 420 -173 -184 323 1 31 76 236 91 213 -68 71 -193 -2 59 350 -63 205 -1 -247 -30
6900 -30 -30 -135 -157 27 -21 260 -208 -8 119 -251 99 269 -150 -86 113 -85 74 170 82 306 -7 -235 56
6923 56 -165 -97 133 -202 -171 -203 -436 -92 145 -42 -89 279 25 111 -125 -192 -67 150 -249 230 -306 -284 180
6946 180 -209 -70 163 -157 -111 9 -106 141 106 -67 -157 233 142 -105 -117 117 60 124 -117 111 -266 -278 27
6969 27 -147 -34 -260 -77 -240 37 -71 -118 -87 -62 -100 89 -16 -92 115 118 161 135 -139 109 -108 -133 93 -253
6993 -253 74 136 -45 327 -123 21 -53 27 -285 -100 -196 -118 92 -172 95 115 -182 175 271 -80 253 320 -234
7016 -234 149 -167 163 119 35 -189 -38 -67 -107 -47 -58 171 -119 147 96 86 145 244 -127 46 -228 69 -355
7039 -355 -12 -32 -360 255 31 245 -145 -86 294 81 -67 106 295 -206 -91 118 342 -11 -113 -44 4
7060 4 -153 -276 75 62 23 170 32 -1 -64 -156 -34 -138 35 -263 168 -1 -200 -17 -116 165 104 -111 23
7083 23 40 64 117 -106 -157 -315 78 164 42 -130 27 -132 -57 -233 130 116 143 386 190 228 11 184 71
7106 71 -282 -187 -32 85 289 142 27 -113 49 162 -17 -46 -9 197 -128 103 111 -163 -289 191 -164 -127
7128 -127 239 -134 88 -154 -39 -159 -109 -124 44 -281 -12 -38 90 -101 -225 -75 -6 100 -143 10 119
7149 119 83 -80 243 -239 203 -34 -128 136 424 -136 99 49 188 -88 124 11 139 44 -178 94 -251
7170 -251 -143 70 -58 174 220 36 447 23 151 -129 50 -39 -35 92 -81 258 -20 116 159 -11 147 21
7192 21 -174 38 18 -146 19 126 61 -138 68 -89 -97 159 -214 11 162 -63 -263 34 78 -51 83 193
7214 193 -67 -95 60 -185 112 130 54 -95 -141 147 360 187 -113 143 133 -244 -189 247 222 156 104 39 -69
7237 -69 58 -44 134 1 -207 -107 -267 -53 -108 -94 85 169 -102 78 -181 -146 58 28 19 47 -115 97 332
7260 332 136 154 62 103 25 45 -82 -189 58 -56 106 -108 -87 64 -91 223 -166 -155 346 364 -101 -135 168
7283 168 133 -287 -41 -78 -61 167 -148 -368 9 -102 110 0 -199 96 -72 4 120 85 -93 -54 -14 -198
7305 -198 -133 -5 -69 172 9 -163 89 98 309 32 -143 -280 315 -83 -40 45 -303 20 -205 13 221 -48
7327 -48 168 432 -231 66 44 200 127 35 -10 -13 -6 -89 100 36 77 -9 27 -126 -57 -146 124 49 -57 82 -139 56
7353 56 160 122 -202 35 164 -330 157 67 -142 9 -75 -121 193 -141 -21 -136 127 -255 -88 -72 101 355
7375 355 50 276 -154 115 75 48 -20 -100 -328 -172 -131 -63 270 -73 88 -158 43 105 -142 -154 -162 79 -8 -220
7399 -220 -97 -55 221 -140 -92 166 28 -85 17 65 -2 -9 176 -14 292 90 -148 111 245 46 89 -157
7421 -157 156 -326 -136 48 293 -51 82 220 44 135 -227 -34 -8 -11 -230 78 -161 -411 -12 -88 -34 -147
7443 -147 -163 -117 -64 -84 32 43 -370 273 117 -125 -129 -26 -204 205 -17 -85 -44 87 -34 -305 -229 289 -81
7466 -81 21 116 -47 -139 -102 49 254 -101 -247 -166 95 -40 -122 -162 101 -138 78 206 -155 44 -208 -58
7488 -58 80 -58 153 -66 331 245 -110 199 88 3 -77 46 13 -64 41 -159 -52 256 -98 123 55 -79
7510 -79 179 -180 49 225 -91 136 -453 -32 213 354 124 -165 -18 -86 9 -67 20 83 110 -132 78 -111
7532 -111 -236 261 -199 -49 54 63 -225 -5 13 129 -273 25 -153 36 -178 277 158 -167 33 -7 -92 148
7554 148 -104 15 62 -54 81 -68 -59 -111 30 -299 227 -65 7 157 -83 -226 3 63 128 39 77 103 315
7577 315 -114 169 210 -181 -116 9 192 -173 103 38 71 -146 71 81 -127 -278 -86 31 -146 189 -34 65
7599 65 110 97 -183 214 -136 31 77 3 73 -76 -182 -57 105 -54 102 89 50 134 -85 -146 -41 -127 11 -24
7623 -24 -17 -20 206 -356 335 -99 -27 72 85 -199 426 -164 -42 188 -163 14 -104 -1 150 105 -76 146 110
7646 110 -89 122 291 34 84 -183 -132 -169 -186 -357 -203 -275 -163 151 104 -141 188 8 91 152 163 197 199 266
7670 266 135 -66 -79 46 44 -201 125 -218 -58 -13 -95 -15 186 -278 -16 273 122 202 197 205 267 51 -20 -14 30
7695 30 -85 -70 -77 -344 45 -78 -43 160 59 10 133 -99 -53 52 -68 -92 115 87 -46 27 3 -267 -182 -461
7719 -461 -144 -268 40 26 -276 -135 19 -330 -18 6 -33 -82 -113 214 289 -81 -111 205 23 -64 102 -237 199
7742 199 117 78 -27 181 130 73 407 230 -54 -106 -9 188 -12 -12 34 104 145 95 -136 12 112 -125 -99 -52 -141
7767 -141 -193 -168 32 331 62 -84 -33 51 -55 -43 -70 -17 -220 -295 18 49 45 91 174 14 132 -37 58 -297 79
7792 79 -114 79 84 -265 152 -18 -130 16 -481 38 -242 -153 -87 130 234 -112 38 11 -54 -48 -70 -8 229 84
7816 84 100 -119 50 124 7 -228 142 32 297 68 -83 0 -11 346 32 120 -223 -56 -486 22 8 -202
7838 -202 79 -185 13 36 -93 -73 -56 -18 -64 69 -18 153 247 267 -113 40 -67 20 104 66 36 -83 -211 394
7862 394 146 -283 -62 21 -128 79 -199 -72 -175 -48 -81 -166 111 -122 49 -140 -95 142 240 -10 -62 102
7884 102 61 93 29 -137 87 123 220 175 72 74 -147 -178 -58 140 125 -51 -146 -54 -92 241 230 -57 -16 -45 -137 114
7910 114 139 -18 83 -216 -165 -16 -308 63 80 -145 -97 100 225 -173 -128 -103 13 -66 183 -75 69 -44
7932 -44 339 115 55 125 15 82 -11 -96 -321 76 -73 -162 78 198 50 -76 -122 -38 -29 44 -20 -365 19 -233
7956 -233 26 68 86 -39 114 -85 143 -152 284 71 -142 152 33 -33 -97 54 -156 151 -48 190 -190
7977 -190 -12 224 264 -21 -293 116 -223 -37 -65 34 -267 -105 17 64 -92 -240 2 182 -11 -20 -124 15
7999 15 207 -45 -18 -101 292 33 -38 -38 33 -90 -18 117 203 -221 113 -85 -39 199 381 -16 -33 -71 -25 -83 -4
8024 -4 275 -71 167 -46 161 67 215 -1 37 -139 96 -127 35 -130 -123 -35 -85 276 -102 109 -156 87 24
8047 24 192 78 62 86 -52 166 10 -239 115 132 -233 -218 17 -168 -9 50 -6 4 105 -17 -417 3 -342
8070 -342 28 16 27 50 -248 180 -92 -158 -96 -62 -228 -12 -251 -70 -44 -87 161 -72 320 -3 15 61 86 -80
8094 -80 100 143 -115 39 58 -156 -183 323 -14 -130 -157 27 87 33 209 12 100 -256 -264 -312 -45 -254 -153 49
8118 49 -21 249 -4 48 107 -214 -24 -113 239 -112 88 -168 184 16 -196 26 -219 -19 -120 28 -83 200
8140 200 -44 39 -62 85 -25 227 -81 2 64 -7 -5 33 117 11 -79 6 -107 49 87 -50 -227 -159 305 26
8164 26 -13 -7 19 -124 -164 17 -87 -98 104 -106 -372 -33 -153 -289 -64 -205 -53 31 293 -31 -72 -150 -48
8187 -48 28 -47 -264 49
8191D9
$$ Imaginary data points
##PAGE= N=2
##DATA TABLE= (X++(I..I)), XYDATA
0 0 0 0 0 0 0 0 8 0 0 -8 0 -8 8 -8 16 -24 24 -32 39 -40 55 -64 72 -88 103 -118 140 -158 182 -211 240 -271 308
33 308 -349 393 -442 498 -554 621 -692 768 -854 945 -1047 1158 -1278 1409 -1555 1713 -1885
50 -1885 2077 -2290 2524 -2788 3084 -3416 3798 -4240 4754 -5369 6112 -7033 8211 -9779
64 -9779 11968 -15258 20743 -31581 61311 -321948 -1076500 -604726 212581 822457 636016
75 636016 -60774 -560715 -457379 8082 517827 541630 106283 -355114 -512200 -241321
85 -241321 259180 391092 82949 -329451 -489465 -193318 225778 211091 -127441 -405351
95 -405351 -336935 73023 354945 211433 -97445 -330146 -282138 62070 327145 300022 51972
106 51972 -294488 -390630 -110313 224795 351805 135298 -287745 -432378 -186380 131411
116 131411 260428 58544 -237085 -232107 -30181 107803 102718 -66441 -182564 -80543 69276
127 69276 156199 102932 -128773 -268959 -157682 85733 319908 275878 -95986 -393742 -346768
138 -346768 24244 451596 459815 26608 -374348 -426626 -82769 357354 438863 160610 -199367
149 -199367 -407557 -251183 122560 331544 258139 -44882 -333834 -284138 9004 244219
159 244219 263259 24812 -204601 -140186 76609 227343 199739 -1635 -113830 -18108 109860
170 109860 184326 137713 -37293 -138192 -98340 19447 162535 144278 -49901 -193297 -197915
181 -197915 -49164 161626 183154 25848 -114236 -153835 -31969 135949 153574 92320 38184
192 38184 -12828 3923 33238 30599 67910 77332 35200 24065 -15059 -70246 -61916 -38872 19166
205 19166 93948 48059 -66306 -144343 -150145 -3208 168911 162720 29452 -121157 -169852
216 -169852 -23644 144285 178525 116590 -25353 -131665 -83427 24289 117796 137518 14181
227 14181 -104666 -103855 -43426 51430 83489 -8641 -76919 -68641 -25150 38557 23330 -51503
239 -51503 -52907 -17492 16215 49016 11115 -39741 -38183 -32451 14509 75951 50204 -4970 -44764
252 -44764 -63820 -3121 61131 47852 17214 -31860 -64357 -20408 3977 -10663 -2147 -7155
264 -7155 -9190 -4688 -53015 -71481 -23500 13138 47373 45079 -24296 -62897 -56356 -17544 76859
277 76859 114945 49534 -28741 -90964 -72003 49365 123782 95014 41 -115063 -113311 1099
289 1099 75827 79300 11576 -89501 -98950 -37245 21708 67647 32833 -51264 -65543 -28795
301 -28795 27890 73580 30493 -33995 -35838 -7267 51948 80688 12240 -48991 -44100 -4640
313 -4640 58842 63131 -9700 -53225 -61688 -37044 31653 47480 612 -43099 -78895 -52406 23629
326 23629 39222 11352 -22547 -58632 -26873 33553 37288 17529 -15947 -33372 18260 52544
338 52544 26885 100 -31616 -29847 24639 44062 23447 -12952 -72190 -69228 327 39507
350 39507 36741 -16854 -94249 -85967 -14699 43848 70127 11437 -74008 -68501 -6165 58668 88907
363 88907 30301 -38268 -41835 -15933 40671 75669 24839 -35903 -57620 -42594 21854 47786
375 47786 -3205 -48781 -69113 -47485 23167 43253 1128 -38221 -59973 -19929 51745 55582
387 55582 19785 -13073 -38906 -3346 52302 57097 35457 -12361 -50823 -11849 38099 44056
399 44056 24597 -30106 -57884 -14456 25738 40230 24068 -35069 -48894 -260 36328 51582
411 51582 25989 -27400 -27291 7715 36798 62825 33231 -24752 -29277 -555 40899 69002 26339
424 26339 -27058 -30092 -8167 41232 69465 24734 -23300 -35002 -13904 43862 61041 14963
436 14963 -20628 -37709 -22574 31701 47299 17137 -17035 -46742 -24515 35111 46828 23358
448 23358 -8853 -37284 -7713 41775 49881 34610 -5211 -34910 -168 38798 39459 20009 -24270
461 -24270 -44269 -11820 13654 22845 8874 -42498 -57985 -21290 13143 34241 13355 -39227
473 -39227 -43767 -10188 26451 56961 30717 -24241 -33903 -11797 28941 57307 20081 -29186
485 -29186 -41780 -34688 2591 31851 2309 -36901 -58367 -52390 -2366 24230 -2029 -28616
497 -28616 -47943 -37357 12983 31841 13401 -11066 -38788 -22943 23700 31206 12289 -16032
509 -16032 -44023 -26656 6869 12588 6368 -26296 -57718 -34486 -1635 9062 5306 -29277 -47651
522 -47651 -21249 2335 17626 14765 -22390 -34252 -8969 11110 26336 11454 -27369 -27608 -6469
535 -6469 9897 27807 7846 -30742 -32576 -14421 17054 38875 6657 -30018 -31461 -15638 22183
548 22183 44229 11926 -22053 -35060 -22864 23853 42900 11865 -16778 -34587 -22420 22274
560 22274 36914 19719 -3675 -30688 -16489 28782 40715 26061 580 -24907 -5770 28351
572 28351 34369 26226 -4704 -31354 -8921 20651 27518 18257 -16920 -33272 -7053 14904 27008
585 27008 22541 -12899 -24355 -1145 23526 43012 28982 -9973 -13283 6887 27524 45384
597 45384 24110 -14126 -18478 -4026 23435 41077 9050 -26070 -27448 -12287 21953 37851
609 37851 7371 -21854 -30996 -14295 32385 48887 16061 -14990 -30342 -10233 37179 48584
621 48584 21607 -11976 -39247 -18749 30177 41135 18704 -19599 -48618 -23841 18466 31497
633 31497 20498 -18757 -50220 -26219 14785 35589 26304 -19098 -44620 -20032 13015 36129
645 36129 29203 -16591 -40920 -22735 8499 38176 25707 -21116 -39027 -25242 4488 35275
657 35275 20977 -20163 -38076 -31424 4740 38590 18661 -20965 -38076 -31215 8351 37590
669 37590 18258 -14561 -38808 -33927 12693 40353 20709 -11457 -40056 -31453 14701 37046
681 37046 25154 -6040 -43143 -34649 12029 36249 28589 -8369 -46527 -33810 6909 30558
693 30558 31006 -6787 -46644 -34822 2466 33195 35692 -7145 -41786 -30215 57 34224 39997
706 39997 -1903 -35551 -32801 -3852 37447 39568 -3086 -32805 -34703 -8081 33278 34977 -208
719 -208 -29045 -39652 -10085 33368 32410 2503 -26011 -37038 -7048 30625 31192 9974 -22580
732 -22580 -37187 -4166 30592 31769 11137 -24075 -34566 -3104 24544 30485 12526 -26779
744 -26779 -35904 -5821 21781 32355 10511 -28973 -33018 -8303 17270 34191 12775 -25853
756 -25853 -32533 -12943 18502 37168 11365 -22628 -28752 -15198 16398 35338 11788 -17603
768 -17603 -30298 -19868 16099 32198 9186 -15440 -30036 -20309 13795 26745 11364 -11170
780 -11170 -31534 -19588 15610 25559 13060 -9435 -28884 -14567 14435 23673 17987 -6977 -28782
793 -28782 -13311 12768 23910 18747 -8730 -26247 -11679 6974 21875 20731 -7797 -24016
805 -24016 -12548 5265 23663 19255 -8014 -17236 -9859 4681 23882 18726 -4828 -14033 -11358
818 -11358 6357 25529 14935 -5384 -12722 -12069 6299 23590 13739 -2793 -14989 -16059 8394
831 8394 23703 13136 -382 -14670 -14791 7757 20087 16495 5437 -14745 -14512 6804 17176
844 17176 16222 5889 -12688 -9854 4005 10702 15463 5147 -12158 -7332 3621 9853 13027 -243
858 -243 -10060 -2574 3021 10283 13444 -1870 -9651 -3472 2987 14348 12767 -4429 -8326 -4787 -281
873 -281 12727 11007 -3261 -8044 -10324 -2148 11653 5619 -4008 -6053 -9387 -2130 7028 1641 -2173
888 -2173 -5645 -9229 2248 7166 -1464 -4317 -8153 -6912 4946 4908 -1950 -5664 -14032 -9974 4748
903 4748 5107 -395 -8105 -17840 -10066 1563 2427 3247 -5161 -16339 -9394 -1144 2085 4127 -5853
918 -5853 -11534 -4126 -2609 -191 1676 -7372 -8761 -2485 -1458 2713 -1836 -12848 -7965 -291 1948
933 1948 5874 -2589 -13124 -9377 -3865 4619 11353 -1130 -12085 -10673 -6491 4652 10586 222
947 222 -6625 -9382 -8742 4630 9475 507 -3964 -6854 -3656 7484 5903 -706 -2303 -6714 -328
962 -328 11107 6795 -1261 -7791 -11306 2163 12938 7385 588 -9676 -14232 516 12710 13992
976 13992 7961 -8427 -12710 1815 11704 16487 12783 -3469 -7785 215 7655 15743 10649 -5201
990 -5201 -5523 197 5302 11547 3768 -6808 -4677 -489 8298 14366 2366 -7921 -4832 2006 15958
1005 15958 19405 5044 -4589 -6908 -1302 16849 21564 7367 -4824 -13030 -6531 11652 14804
1018 14804 6809 -2940 -14797 -9946 6232 10215 7102 -2247 -12108 -3759 7714 8314 7278 -2193
1032 -2193 -9474 178 8959 10665 7004 -8374 -12980 -518 7905 11677 5810 -11905 -16055 -6342
1046 -6342 4235 14794 7806 -11397 -16193 -9340 2482 14535 8516 -6152 -11609 -11298 294
1059 294 12869 6351 -4822 -9807 -9579 2322 9747 2247 -4603 -9783 -8911 4993 10571 1941 -6813
1074 -6813 -14247 -8668 7858 10454 3170 -7290 -17873 -12025 4416 10538 7078 -6350 -20118
1087 -20118 -12267 2377 9258 10262 -1583 -14691 -9922 -382 9286 12119 -1514 -11041 -6019 -122
1101 -122 7746 7757 -4539 -10093 -6771 -1612 7847 5381 -8825 -12565 -8618 430 10904 6083 -5927
1116 -5927 -10178 -9443 2453 15959 10810 -770 -8081 -9328 4048 14458 10088 2394 -7356 -11366
1130 -11366 803 9272 6793 716 -10185 -10495 1425 6112 4699 -88 -10099 -7714 3462 8591
1144 8591 8805 28 -10616 -4961 6011 11136 11918 379 -10419 -6485 1851 10753 13564 -785
1158 -785 -11838 -9169 -2379 8076 11208 -1281 -9213 -10261 -5472 7754 9914 -432 -6480 -8556
1172 -8556 -2568 8864 8505 864 -3779 -7303 -531 10801 8654 1739 -5281 -8529 889 10056 6890
1187 6890 1580 -6991 -11570 -1228 7247 6915 2058 -9182 -11575 -911 5237 7346 4052 -6855
1201 -6855 -8666 -434 5454 10060 4932 -5975 -5332 778 5766 9714 3362 -6094 -5091 -1827 4599
1216 4599 9367 191 -8397 -7400 -3473 4765 8181 -642 -6263 -7681 -4696 6217 9362 1438 -3817
1231 -3817 -7027 -2746 7697 8537 3334 -1068 -6641 -2162 7262 7735 3667 -2284 -7355 -1277 5962
1246 5962 5344 3543 -3026 -8270 -1850 4210 5804 3887 -4721 -7977 -850 3548 6236 4645 -3772
1261 -3772 -5156 -480 3663 8325 5717 -3249 -3285 375 4272 8469 3856 -2995 -3171 -2123 2639 7103
1277 7103 951 -5411 -5921 -4884 1801 4545 -1013 -4277 -6542 -5524 2977 6271 1690 -1393 -4813
1292 -4813 -2239 5380 6024 3201 663 -4501 -2384 3773 3428 1354 -3086 -7849 -3195 760 -833
1307 -833 -1673 -5664 -8431 -3153 669 1311 1059 -5163 -6162 239 3471 5087 3500 -3072 -3895 5
1323 5 2514 5776 2967 -5365 -5447 -2747 -132 3056 -1260 -6413 -5696 -4671 -917 3300 -1795 -5447
1339 -5447 -4495 -2681 3241 4806 -758 -3126 -3445 -2361 4521 5448 149 -3634 -6448 -2855 4541 4433
1355 4433 244 -3161 -7071 -4010 2816 3843 2499 -1897 -6386 -2230 2871 2552 2627 -1512 -5054 -1046
1371 -1046 1388 2365 2259 -3100 -4097 795 2811 3968 2662 -2909 -1971 2118 4521 7344 4058 -2860
1387 -2860 -2248 1096 4457 7345 2316 -3784 -3541 -2504 2243 5965 812 -3840 -4480 -2791 3320 5888
1403 5888 1650 3 -1504 -25 6529 7966 4041 1163 -1429 1427 7843 6464 2006 -1736 -5455
1418 -5455 -2123 4161 3780 919 -4517 -8821 -3572 2773 4216 3361 -1878 -5935 -1293 3394 7328
1433 7328 7448 895 -2732 302 3119 6131 5170 -988 -2683 -1888 -571 3196 1578 -4486 -4728 -3226
1449 -3226 -418 3064 -137 -3846 -3364 -2190 2037 5914 2198 -1441 -2937 -2255 3573 5824 1805
1464 1805 -1482 -4229 -3993 1729 3458 814 -2113 -6021 -4424 1019 2065 611 -1867 -5318 -3216
1479 -3216 1659 1802 1242 -2389 -6334 -2789 1776 2443 1107 -3792 -6341 -2583 575 3453 3362 -3024
1495 -3024 -6001 -2836 1119 4985 3958 -2010 -4257 -3014 -520 4070 3432 -2280 -4709 -4659 -1816 2390
1511 2390 798 -2728 -3364 -4419 -1422 2711 1631 -692 -2202 -2425 2150 4809 2316 947 -749
1526 -749 -1387 3273 4354 2067 -30 -4076 -3477 1556 2219 530 -1428 -5295 -3554 139 1333 1746
1542 1746 -727 -4223 -1335 2257 3498 3806 370 -1806 858 2346 4340 4200 -484 -2495 -808
1557 -808 1221 3725 2066 -3111 -3820 -2441 -299 3502 2093 -2667 -3373 -2843 672 4510 2880 -648
1573 -648 -1385 -1874 1301 5106 3788 1005 -1278 -2181 1870 4102 2278 746 -1661 -2825 1098 2506
1589 2506 1482 -221 -3338 -2672 1084 1989 1340 -550 -3469 -1909 1237 2057 2343 35 -3431 -1192
1605 -1192 1642 3099 3421 -399 -2924 -739 858 2847 3087 -649 -3147 -1665 -90 2755 2132 -2327
1621 -2327 -2999 -2415 -771 2261 1585 -2002 -2922 -2955 -22 3563 1958 -587 -1630 -2005 903 4035 2588
1638 2588 349 -2023 -2545 1302 3697 2104 -77 -2559 -3166 454 2050 1501 1 -3370 -3212 575
1654 575 2081 1446 133 -2798 -1897 991 1953 2824 665 -2405 -1053 995 2534 3077 42 -2175
1670 -2175 -671 433 2223 2943 -620 -2940 -2068 -358 2189 1979 -1823 -3382 -2518 -938 2493 2099
1686 2099 -879 -2485 -2593 -245 3849 2507 85 -1454 -2198 478 3486 2708 1001 -1692 -3128 98
1702 98 2534 1252 477 -2716 -3610 -716 663 871 -47 -3398 -3624 -158 1392 1836 618 -2133 -1546
1719 -1546 615 1681 3263 1467 -1740 -1280 246 2104 2384 -443 -2736 -1884 -1057 432 1270 -1427
1735 -1427 -3298 -3153 -1517 1132 1366 -1549 -2504 -1966 -576 2661 2084 -177 -1443 -2132 30 3367
1751 3367 2373 -304 -2002 -3047 -126 2207 1412 -278 -2789 -3817 -611 1889 1713 556 -2336 -3107
1767 -3107 -145 1503 2191 1526 -1802 -2748 -183 1580 2822 1454 -1682 -1973 -376 835 2820 1349
1783 1349 -1306 -1123 -329 1077 2869 963 -936 -607 -601 1279 2351 572 -930 -1158 -1149 1286 1648 -195
1801 -195 -972 -1261 -464 1794 2011 336 -190 -1021 684 3120 2377 1118 -116 -973 1120 2658 1970
1818 1970 778 -1261 -2746 -139 1722 1393 78 -2453 -2824 -405 1536 1771 1433 -1211 -1898 539
1834 539 2564 3547 2087 -744 -874 173 1753 3431 1678 -1305 -1954 -1304 319 2325 323 -1878
1850 -1878 -2362 -2317 -138 1841 895 -518 -1595 -1737 1099 2350 1041 253 -764 -1032 796 1647 777
1867 777 385 -1594 -1167 518 372 -366 -1102 -1870 -960 199 -163 -66 -1054 -2096 -429 1005 575 590 -1308
1886 -1308 -1707 -81 829 1053 545 -1717 -2206 -405 560 1323 582 -1862 -1819 -635 219 1685 578 -1438
1904 -1438 -1790 -1248 349 2208 359 -1337 -1926 -1542 289 1314 45 -1039 -1956 -2152 575 1672
1920 1672 850 -201 -1751 -1355 432 1682 1467 464 -1374 -1390 302 908 927 523 -1544 -1386 -547 -237
1938 -237 603 -185 -1470 -881 -359 44 959 -375 -451 570 445 583 878 -136 322 539 958 1362 533
1957 533 -822 -720 128 206 1127 -31 -1025 -1129 -644 217 1439 49 -829 -535 -247 730 1911 746
1975 746 -74 -534 -357 1589 1919 522 99 -1100 -745 963 904 467 -265 -1385 -1054 850 1025 829
1993 829 -405 -1600 -793 593 872 948 260 -1042 -595 374 544 1125 17 -637 28 171 224 875 -374
2012 -374 -233 -131 -89 466 157 -643 -260 253 -34 352 -347 -897 -486 -296 497 767 -140 -1090 -744 -318
2032 -318 975 967 -244 -472 -577 -509 1066 1348 -3 -555 -783 -144 1178 873 68 -427 -1268 -281 922
2051 922 881 -83 -875 -1468 -3 693 633 342 -784 -1675 -482 1148 1413 977 -658 -1215 -213 639 1116
2070 1116 1205 -518 -704 -615 -206 655 758 -629 -674 -704 196 718 335 -682 -842 -485 397 1129 54 -513
2090 -513 -375 -347 969 1135 -19 66 -639 -511 1214 1366 347 -417 -1306 -653 1042 898 257 -710 -1725
2109 -1725 -434 768 909 783 -374 -1324 -590 482 797 672 -488 -1145 -338 507 1020 992 -514 -1274
2127 -1274 -396 251 1249 758 -719 -1561 -872 -128 993 705 -736 -1228 -1202 -95 1233 962 -363 -920
2145 -920 -1097 -138 910 763 -149 -677 -821 228 970 491 166 -437 -1215 -140 531 316 117 -881 -901
2164 -901 387 415 528 -126 -980 -975 228 399 755 395 -840 -447 297 662 907 211 -671 -746 -248 688
2184 688 978 -278 -875 -505 -374 637 946 -259 -422 -601 -303 943 561 105 -392 -579 -269 893
2202 893 548 -65 -327 -1057 -263 957 876 94 -279 -759 43 835 456 421 -373 -866 -216 495 530 643 -246
2223 -246 -523 -189 375 669 613 -219 -310 -139 475 690 276 -413 -171 -56 481 695 287 -338 -77 -96 612
2244 612 690 -65 -341 -208 -72 276 515 8 -602 -351 -7 396 660 -77 14 -618 -255 404 541 115 63
2265 63 -401 -224 252 53 234 -317 -642 116 174 -70 247 44 -595 94 -80 258 203 -203 -270 -17 195
2286 195 348 109 -14 -503 -163 73 252 1 -428 -319 67 -173 140 -75 -576 -507 -530 234 353 167 -384
2307 -384 -419 -113 25 435 -4 -140 -206 -243 -63 250 -118 -450 -608 -283 279 179 13 -241 -240 -265 78 370
2329 370 -83 -309 -557 23 242 141 288 -173 -559 -224 129 211 268 29 -171 177 102 33 243 -309 -389 -88
2351 -88 -181 534 130 -98 148 5 273 59 58 -371 -347 -46 213 361 -132 -186 -198 -317 306 134 310 58
2373 58 -287 -248 -81 501 136 127 -273 -340 278 117 146 -319 -258 -277 288 -54 267 101 -257 -85 254 159 231
2396 231 -19 -250 -345 223 391 301 -210 -99 72 123 178 115 144 -183 -282 -88 -18 74 -8 -306 -35 147 -38
2419 -38 85 31 -235 -91 -113 167 259 -2 -47 -205 -32 102 124 64 34 -155 -3 144 206 -52 -172 -386 308
2442 308 254 22 -74 -57 -347 101 195 171 177 -130 -240 7 212 51 119 -402 -239 -66 -91 83 -43 54 -67
2465 -67 -172 44 240 -179 5 174 -163 128 318 131 23 0 56 85 61 -65 223 -168 -161 126 376 -17
2487 -17 -227 -45 249 -107 116 -75 -109 -94 -348 -23 42 6 -139 -179 141 250 114 265 -182 -51 -143 260
2509 260 5 329 -45 -269 -166 139 95 -135 190 4 -200 254 23 120 24 -292 -24 189 151 -142 52
2530 52 -37 70 92 59 155 156 -68 -187 -19 44 -55 235 61 -253 -11 -53 108 207 -28 34 176 2 234 113
2554 113 108 100 -155 19 179 92 81 -91 -124 65 193 -91 160 -243 -284 -141 -124 -27 -190 -9 119 165 252 37
2578 37 25 -58 -251 19 376 18 148 -160 -194 81 -84 -217 -327 60 0 -6 180 44 140 25 -232 89 267
2601 267 -15 103 -68 -178 -66 90 31 8 21 76 -10 10 118 27 -75 40 115 180 -31 6 -104 6 -264
2624 -264 90 227 113 -106 -20 -43 -26 -64 -36 236 -142 -70 -44 61 -62 101 101 -172 203 150 144 43 227 -223
2648 -223 -42 187 25 -69 -228 -194 320 -70 14 -90 -36 47 -59 78 92 -33 -92 -3 47 -107 71 -86 230
2671 230 -20 100 57 282 -51 83 -47 -29 69 -93 -311 -296 -102 -140 186 24 -106 -228 -98 214 -78 103
2693 103 48 -226 -95 150 -53 190 -78 110 -125 -139 217 305 59 -148 -31 80 367 -102 -98 -213 -93 304
2715 304 136 142 239 -49 241 -334 -70 144 -8 -155 -99 291 124 -56 -326 -160 39 277 153 148 -139 -63
2737 -63 -33 148 -45 19 -20 -42 -189 -50 362 5 175 -301 -303 133 255 -82 154 133 -61 45 117 100 -154
2760 -154 -172 -359 -98 23 -10 53 25 -223 -201 -289 364 -300 -354 -171 -62 -183 199 -248 -150 53 -63 121 55
2783 55 46 105 0 -52 30 350 2 -12 -91 -185 97 40 -23 -209 -444 -220 168 -99 170 68 -362 -185 175 -105
2807 -105 18 -60 -373 -119 201 98 -187 -180 -36 -184 273 148 -121 -201 -386 -26 -196 -10 72 -255 -72 -66
2829 -66 28 226 52 -225 -189 297 248 139 -13 -327 9 77 115 266 105 42 -100 -130 381 216 46 -183 -137
2852 -137 86 63 306 -2 7 -197 -211 295 148 -6 -89 -26 -138 -15 313 214 -91 33 119 165 65 41 159
2875 159 -205 105 202 244 3 8 30 -135 147 127 -161 -201 -285 -88 -86 282 -206 -245 -114 94 244 317 55 18
2899 18 -11 -132 86 337 -61 -296 -11 -97 90 45 -98 -205 -35 -392 81 233 -80 -112 -210 164 198 268 -4
2922 -4 -201 -185 -63 212 103 -136 -69 -142 36 201 33 4 -137 -315 -121 -21 112 156 -156 -369 -117 47
2944 47 37 97 -258 -156 43 33 272 82 -316 -178 -260 22 253 133 -126 -31 -6 -67 392 40 -124 -234 -108
2967 -108 254 181 -348 -363 -13 201 71 196 34 -11 -129 5 82 411 126 -72 -240 380 300 367 -14 -77
2989 -77 -404 -223 302 261 -69 36 -568 -281 -71 76 -121 -182 -190 -332 117 247 55 -26 -135 -178 -292 322
3011 322 72 -249 95 -201 -290 269 60 -242 -24 -275 5 117 -70 -190 -286 8 191 6 -23 -160 -44
3032 -44 -175 154 418 191 -38 -25 16 146 -115 -50 199 -246 -64 260 194 -52 -160 -75 -299 -107 284 3
3054 3 -169 -323 -124 14 178 213 -180 -617 -149 507 -113 90 -186 -108 -234 118 275 79 -24 -120 -166 -287
3076 -287 324 104 -141 -50 -9 24 107 -32 -274 152 -304 -41 317 -43 240 -79 -263 261 292 59 121 121 -165
3099 -165 102 -51 138 -245 -259 -103 115 454 51 -123 -222 -24 33 477 40 109 -194 -173 -163 -7 216 -87
3121 -87 -62 -83 -70 112 414 -101 -166 -190 18 270 156 -93 79 -78 -64 181 257 -162 251 -255 244 164 267
3144 267 -19 -132 -20 64 349 211 -10 -322 2 200 199 -60 -250 -147 -234 102 357 455 -15 -127 -165 -32
3166 -32 65 2 -10 -138 -185 -116 167 -71 -338 -419 -151 93 307 100 41 -134 -14 -2 344 354 -109 -114 -26 -125 25
3191 25 138 -436 -223 -169 -61 132 -242 -94 -190 -429 -7 295 -22 -103 17 65 -97 390 15 -138 -211 -335
3213 -335 43 164 274 125 -171 -387 -67 -223 -187 -110 -354 -94 290 204 476 73 -157 -168 59 246 343 -127
3235 -127 -253 -168 -99 153 111 -135 63 86 -75 7 281 51 -11 -134 107 347 148 -31 -51 -303 -61 379
3257 379 -39 116 -145 -293 40 336 263 7 -452 -295 -202 148 155 -82 -10 -198 -50 325 310 73 -182 -122
3279 -122 115 64 79 115 -262 -146 66 -85 101 247 -373 -287 58 137 33 248 -117 102 132 156 289 -107
3301 -107 -217 126 -75 -11 306 -136 -33 -315 -434 51 79 -86 128 -10 24 276 182 -157 49 -89 -198
3322 -198 196 74 -286 436 -112 236 194 202 350 108 -292 88 196 -50 -37 -351 -136 161 71 5 68 -173
3344 -173 -253 137 -62 418 -108 -253 -29 250 29 325 177 -67 -35 -145 155 117 -231 -177 -144 -528 -95 316
3366 316 42 -132 -338 -456 158 46 143 -175 40 217 135 210 205 140 -87 162 417 -81 -239 -9 -57 153
3388 153 207 234 -15 97 -267 112 31 117 -135 -8 -467 88 80 11 -235 -460 -128 -73 200 187 182 -229 -143 -62
3412 -62 77 136 277 -48 374 -230 60 340 -43 -82 -242 -193 35 373 46 159 -84 -213 302 496 -72
3433 -72 43 -133 -150 442 -8 167 283 -241 199 198 52 -39 -79 58 -35 68 -219 99 127 -131 74 128 139
3456 139 -55 -267 19 -211 258 88 70 102 -147 407 -46 180 133 -119 9 -171 37 224 -45 -52 57 -140
3478 -140 -67 367 -65 -163 -125 -80 150 197 203 -394 102 -364 305 282 -141 -189 -263 -90 -17 307 258 151 -302 84
3502 84 -26 318 495 -70 -251 -160 -244 99 108 -170 -319 49 -49 423 63 -37 -278 57 -83 143 335 -85
3524 -85 -152 22 147 226 47 -293 -101 250 -13 350 91 -78 -246 -211 235 274 -55 -300 -289 78 49 273
3546 273 365 -247 -371 -208 156 261 200 139 -97 -18 217 98 17 109 -305 -308 -62 146 131 -231 -159 -34 286
3569 286 146 16 -86 -410 -164 72 340 174 -261 -236 -43 -137 -37 445 -147 40 -65 184 361 151 -120
3590 -120 208 -21 -288 565 -127 -55 -183 -389 -76 210 -74 -152 -243 -180 -176 50 215 153 192 -37 197 -67 -77
3613 -77 34 -70 23 -116 -5 82 105 80 -297 126 461 183 17 -443 -109 -37 -8 134 205 -13 -503 15 141
3636 141 279 20 -189 -29 105 257 268 -65 -336 -44 47 102 83 -169 -214 -94 -16 267 73 -90 4 -92 -295
3659 -295 267 209 -166 -312 -145 -190 221 196 -23 -138 -233 100 206 300 75 170 0 101 175 53 -271 -149
3681 -149 -289 -147 44 399 -114 -295 -372 -175 24 153 248 -182 -142 -111 224 310 94 -68 -131 101 208 296
3703 296 -37 -296 9 44 241 -117 -133 -85 -327 -32 208 99 -137 -95 -345 -75 476 180 104 -135 -40 -20
3725 -20 155 -228 99 -135 -195 442 13 203 41 -268 -106 129 -1 166 -109 -170 -387 -7 144 128 42 -47
3747 -47 -63 -29 -37 275 240 -252 -6 -78 245 267 -25 -294 -98 -110 168 137 -430 6 -354 -42 35 364 -29 -73
3771 -73 -366 -120 83 446 71 -129 -312 121 339 35 307 -94 -125 -187 442 -157 236 -97 -261 -143 111
3792 111 19 54 -397 -146 118 175 -54 10 54 -273 271 -105 239 288 -97 -71 -77 127 -103 157 -158 174 -128
3815 -128 98 271 -198 -195 -61 -48 -194 129 36 35 -192 -195 -82 493 -124 56 -146 -134 -22 252 -185 110 -177
3838 -177 -39 156 160 42 63 -219 -41 64 164 342 -115 -341 31 259 -141 110 -92 -285 -97 132 120
3859 120 331 29 11 83 8 -124 -67 -188 -33 200 -19 86 73 -153 -169 17 219 180 46 -22 48 128 239
3882 239 120 113 -336 -183 -190 348 206 141 5 -122 44 180 243 37 -80 -194 -40 291 336 189 51 -75
3904 -75 -54 -41 44 -115 -218 -115 -97 191 -55 50 29 -87 -77 -180 189 -42 -15 -94 29 10 408 -60 -42 -53
3928 -53 -5 158 162 -23 -10 -240 -31 -6 71 273 -134 135 -125 -99 10 -66 -161 -76 -444 208 -188 -151 77 143
3952 143 -187 69 220 131 159 14 119 80 -160 60 126 79 6 187 1 41 113 -195 381 -19 242 34 -62
3975 -62 -201 173 -70 25 122 -146 -152 -141 -132 292 380 -289 183 -293 -248 95 -13 -144 -16 -116 -112 97 -113 104
3999 104 -101 29 153 128 141 90 -70 70 133 385 -96 2 -283 -368 31 164 32 -40 54 -89 131 115 134
4022 134 -179 -182 69 197 -20 -41 -7 -210 -155 -175 245 67 -94 -109 -57 -133 34 227 -140 21 -6 259 323 83
4046 83 -143 -34 154 243 62 -25 211 -145 -296 375 7 -13 154 -20 -179 -232 -135 -22 132 -32 -230 32
4068 32 -82 20 143 -110 -78 -14 -65 -181 -49 278 10 6 -29 -10 0 -99 47 192 177 -23 47 -31 254 -148
4092 -148 160 355 -130 -61 131 -76 -125 184 29 -161 97 -162 -164 -1 -223 -59 -83 -17 171 -50 -38 173
4114 173 -42 -62 -4 16 73 -195 21 87 64 169 -122 13 5 -66 -59 -222 -91 -112 -339 -69 231 318 84 -216
4138 -216 166 -196 34 257 77 -299 -119 130 72 -75 -61 -171 -75 13 17 47 34 -149 31 92 167 201 141 -96
4162 -96 -93 277 240 286 -39 251 56 -77 115 0 -106 -283 -124 119 -47 77 64 -131 110 33 -8 139 -80
4185 -80 -9 -142 134 134 182 135 -244 293 -215 40 280 -269 -77 13 -51 239 361 70 -18 183 149 145 160 205 71
4210 71 207 -181 254 326 -134 -101 -9 -109 -273 199 -43 131 -168 5 123 49 -52 159 -190 22 179 160
4232 160 -74 54 -99 -34 344 73 285 -268 -153 -13 -17 195 -182 -65 12 -54 61 151 -63 75 23 -100
4254 -100 15 -162 -263 152 292 95 -70 -47 219 45 273 39 55 447 -44 -68 293 -208 -51 -96 260
4275 260 51 134 -72 -64 257 -85 27 193 49 -91 31 27 151 -105 111 -29 -63 -135 140 30 192 173 79
4298 79 27 31 -10 16 12 -123 -40 85 94 48 -141 237 265 -92 93 -54 -45 -64 -166 -120 -124 303 -110 26 100 139 117
4325 117 -172 188 -209 98 -41 53 -67 -317 -48 -69 2 -55 -133 -340 73 -5 60 9 -110 197 -221 -131 -51
4348 -51 34 -119 -228 65 79 -39 155 -105 151 187 78 -140 -179 110 -168 -142 155 -366 -145 -59 214 267 110
4371 110 -217 -91 -92 -110 36 71 40 178 6 -3 -51 33 65 -249 -133 26 243 -127 322 37 8 480 -45 -77
4395 -77 75 87 42 -74 -50 34 -231 118 -116 -222 -267 38 269 -70 -122 7 273 -247 101 99 -113 0 205
4418 205 93 124 -229 16 108 239 -63 248 -72 -255 30 124 77 -201 116 36 -44 182 30 16 24 90 -174
4441 -174 3 259 -67 -41 68 228 321 -292 37 -76 61 -139 -89 206 5 146 -77 45 -19 24 -60 -165
4463 -165 -62 134 -145 -91 -63 -147 -235 -17 25 -92 243 15 -113 82 177 -170 -84 131 -162 87 -56 -153 -92
4486 -92 -203 -182 64 263 -93 89 14 196 -248 1 32 88 -84 8 41 127 -104 -143 -45 -235 -200 132 -210 -10
4510 -10 185 -257 -31 -52 -2 76 163 -108 178 63 -94 -343 -77 -73 73 250 13 -126 115 224 -82 -47 -169
4533 -169 75 -265 -90 -11 26 91 20 -42 -16 177 34 -240 -162 49 -372 -122 15 -28 19 236 34 53 437
4556 437 -118 1 -142 -195 -146 175 83 -30 -215 -238 88 69 -140 -10 -97 160 -24 -226 147 -186 12 -66
4578 -66 -68 -43 57 -106 -195 87 -116 -121 396 -9 152 -91 -163 120 -94 68 -235 -181 76 -247 -96 -305 -90
4601 -90 174 -74 -85 112 201 -290 6 94 60 -114 292 -238 -227 -55 86 151 -57 182 26 28 -43 1 179 -233
4625 -233 267 -176 -90 199 -200 81 -106 31 -20 98 101 101 132 29 -12 -202 -155 -137 -8 323 185 61 -20 57
4649 57 241 -63 119 5 -30 -114 13 -270 -108 -73 27 -176 -160 106 49 363 -118 122 -5 -206 121 120 -309
4672 -309 121 183 -159 7 -61 60 195 -214 205 116 134 -152 55 -144 8 -144 -83 -272 35 134 -232 -113
4694 -113 -77 71 71 -130 92 20 -20 6 -170 63 -29 -54 272 240 -143 75 49 113 -324 329 51 11 -103 -106 125
4719 125 56 184 -127 33 237 14 77 3 -5 -279 -230 18 7 100 143 -134 -8 198 110 226 303 -21 138 20
4743 20 63 -33 -75 177 -59 61 16 -77 -12 -91 37 -63 -82 126 72 -121 -129 -100 44 -43 -315 -73 245 -34 -71
4768 -71 -167 -216 -85 260 -119 146 94 343 14 -93 139 139 -32 14 3 102 117 140 123 -84 190 187 -86 124 78
4793 78 -19 206 126 -100 -29 -83 -125 137 227 -38 -106 182 -1 -96 10 32 176 120 15 0 -11 -80 -50 112 -257
4818 -257 -58 -111 -236 -88 -90 8 199 208 -118 243 141 -116 -6 82 -20 -110 80 -54 74 -294 -55 136 -11
4841 -11 207 -102 104 -127 6 86 34 141 62 -33 -102 33 115 246 -215 -27 -59 -12 -54 -183 54 15 219 -93
4865 -93 -8 39 -53 89 15 113 71 56 -171 -133 -187 -194 247 -230 -102 -70 13 83 -93 -33 31 -124 123 -121 -211 -22
4891 -22 83 -132 211 207 141 -26 -75 -12 -151 1 22 47 57 124 217 64 -262 344 112 -7 85 -51 -9 5 -28
4916 -28 -135 -157 -72 156 106 -60 -70 47 -89 -173 110 -12 -80 -125 148 -10 -120 -14 -121 -21 -84 187 -49
4939 -49 146 15 147 28 283 -260 -110 102 -158 97 223 202 -148 -139 -195 35 -56 78 240 -55 -67 -19 -131
4962 -131 273 132 38 104 187 36 -2 6 -134 156 85 163 -233 -108 -5 -57 244 -157 115 217 -106 206 70
4985 70 -157 115 -207 330 232 -128 132 -44 -135 159 -109 153 304 -108 -231 -27 -72 -43 193 -97 7 -30
5007 -30 139 333 72 -81 150 55 -99 53 -154 4 217 -51 74 114 -11 160 -39 -181 -151 -122 3 65
5029 65 109 -87 141 14 70 -37 -168 -167 146 313 -105 319 -119 174 79 130 80 -276 -6 109 -10 -145 -31
5052 -31 89 -362 -16 -78 -116 -82 143 -148 -47 -109 64 0 38 -35 -59 63 -16 20 -179 -127 -71 171 -315 177
5076 177 -152 -247 -268 116 -331 131 97 -204 -240 34 -29 78 46 -325 -58 -150 -63 -64 142 26 -128 64 -324
5099 -324 -7 76 122 26 15 22 128 -66 137 -79 72 -33 2 210 -223 -266 -236 205 90 168 23 53 -104 23
5123 23 151 -8 88 23 -164 45 150 21 59 -124 -98 -46 -78 -45 -55 -303 -46 -136 101 333 207 -80 62
5146 62 89 -106 -192 -39 -94 92 -207 153 170 95 12 -53 -103 -27 198 -9 -22 125 294 19 13 -207 77 -188
5170 -188 -83 -6 -65 38 126 5 92 191 66 -148 -87 224 155 -217 -64 91 -111 -105 -288 70 128 -11 162
5193 162 -47 -51 150 -123 228 -334 -160 -3 112 -102 -113 -120 144 -68 28 58 -237 -227 -300 82 295 26 13
5216 13 -195 181 -431 -258 33 -25 -34 -2 47 -119 93 -88 -50 -229 -41 -123 -143 203 11 -354 142 155 -370
5239 -370 -56 149 101 -181 92 -144 203 30 -98 -50 -19 -51 147 -154 -16 114 28 80 -64 -77 -67 -103 -174
5262 -174 -29 2 183 157 -391 56 63 132 -83 132 191 -349 135 -205 -121 71 -34 174 6 49 67 52 -60
5285 -60 -30 11 -158 -155 33 -262 160 49 -134 108 -24 -95 45 -161 21 46 -191 17 84 -14 -36 -325 98
5308 98 110 -42 47 189 -65 88 255 51 265 -47 12 -69 252 -58 236 -176 -99 301 -145 -223 -303 -393 141
5331 141 -81 96 -7 27 -126 11 -29 12 -122 48 174 225 -296 -215 171 62 -83 -249 -110 52 120 167
5353 167 -143 -78 -138 -293 263 -27 -131 222 12 -108 -26 -55 309 292 -18 -140 269 215 58 -238 94 -5
5375 -5 -21 116 -70 43 -42 -2 -37 -280 162 35 -16 175 -363 364 -89 -120 -101 -65 114 38 -63 -78 -14 -4 242
5400 242 -33 15 195 -224 -52 -20 61 140 85 -38 -75 104 -161 45 -77 -299 32 42 -35 173 -56 -121 -38
5423 -38 1 -141 187 -21 158 -121 -107 102 -91 -178 -51 -111 -283 171 63 -252 -165 174 -33 158 64 -68
5445 -68 -181 -65 127 71 7 29 -101 -182 -50 64 -16 -35 211 -38 14 9 -1 287 42 79 -47 255 191 -43
5469 -43 169 -46 79 183 -189 94 -55 98 155 132 -124 7 -63 107 112 -18 -2 -66 102 -44 -28 -108 128
5492 128 -13 9 38 -190 -39 119 -58 -307 8 4 -13 124 22 90 16 75 104 -32 333 -76 -35 -136 16
5515 16 195 97 13 -286 209 24 58 175 -124 -72 -257 103 -76 -126 -171 -265 6 -37 -99 35 58 70 -23 45 -138
5540 -138 -255 -117 -104 160 -10 217 -24 109 -46 -40 175 36 -119 -10 154 146 144 -25 -202 -158 193 -104 125
5563 125 -44 -101 77 -60 121 134 13 -29 -20 40 90 34 0 -123 46 -285 -167 250 -112 314 -221 -308 48
5586 48 113 119 -6 27 1 57 -6 38 -45 94 171 12 88 68 -111 129 -28 -138 22 -11 12 8 -104 115 37 -58
5612 -58 -207 168 -5 -144 233 100 -169 -49 48 -13 -40 191 108 156 126 -28 3 -73 -17 -69 26 229 202 -70
5636 -70 128 -36 8 32 -219 62 -57 -47 56 210 -95 18 121 55 -20 55 -250 -182 113 -204 127 155 -59
5659 -59 -50 131 -121 99 -123 -121 -160 -252 -76 153 -165 198 226 -115 -50 -100 -103 -31 17 228 92 123 -144 75 -41
5684 -41 262 157 -37 -45 55 50 147 -63 -454 -40 -111 -16 97 -197 -134 153 -103 -16 88 -162 -319 182 201 92
5708 92 -311 -47 -116 250 156 -36 155 -225 192 -145 -67 9 -341 -220 150 81 125 81 239 -34 60 64 -109 -124
5732 -124 197 -1 -132 -37 -8 -41 -137 56 -170 93 13 164 49 -294 -333 -77 223 117 93 71 -113 74 64
5755 64 -102 264 -104 -277 -69 34 6 -128 173 61 5 -106 177 259 -81 -23 233 89 -157 273 44 79
5777 79 -101 19 213 103 -311 -1 170 -82 138 -276 127 50 8 86 271 117 -169 65 -66 127 104 -200
5799 -200 -49 -134 28 -13 44 -93 271 26 34 -75 -119 323 -26 -57 36 58 -110 -181 75 -385 157 81 289 222
5823 222 193 31 -36 -101 211 63 -69 -139 117 -98 137 -86 245 -123 11 188 213 17 -13 -32 -83 69 33
5846 33 -13 79 -119 -25 111 87 29 -10 -6 -65 77 -423 -142 -29 128 135 73 98 -230 -2 66 84 133 116 5 221
5872 221 92 22 -48 -135 -124 -92 -147 225 -30 -160 149 -56 -44 199 113 50 -66 123 -141 -262 -24 288 -28
5895 -28 62 38 -55 8 274 -268 -125 115 9 -96 214 171 -79 336 32 -75 -230 -177 -53 13 109 -4 40
5918 40 86 214 -91 20 126 -30 36 -6 72 72 -93 74 262 -93 122 114 -131 -28 151 53 50 -216 12 -68
5942 -68 68 -135 143 -187 -70 165 -241 -260 103 30 -168 -108 49 13 -86 -288 -18 345 -364 116 63 265
5964 265 69 63 87 -119 -50 -126 -50 -32 -123 52 313 -191 -30 -63 151 53 -61 -22 -34 19 230 349 -204 -161 -29
5989 -29 -17 -38 7 -323 -79 192 14 173 -245 -21 157 -257 393 110 -87 -321 234 99 183 -142 -234 148
6011 148 -124 -10 299 105 33 -162 -196 42 -156 126 -108 52 97 -152 5 202 132 -261 -239 -106 161 -132
6033 -132 120 61 -11 -79 -63 -32 37 -238 -139 142 -48 120 69 -37 -191 111 91 49 -70 -70 -139 -111 28 143 100
6058 100 -51 -25 -268 183 86 160 107 -96 -152 -171 -10 -75 149 60 -105 86 -27 26 -204 -106 -18 195 206 -125
6082 -125 367 -25 -32 104 -72 -78 88 -429 105 106 -83 -114 -29 80 247 -88 -199 124 -259 45 174 -72 137
6105 137 219 -150 130 -82 -125 106 -28 -350 -104 -325 68 63 145 -172 -75 183 -232 -7 -39 34 62 195 179
6128 179 306 229 42 135 82 30 -27 93 -156 -276 -185 394 39 -57 -67 -150 152 294 -33 27 40 10 320 317 -24
6153 -24 154 -151 26 -9 63 37 110 -42 -169 -18 -80 -18 152 -227 102 -96 -261 257 -78 -85 -99 49 124 -2
6177 -2 -35 -212 -210 -74 -241 106 -65 -287 183 95 150 196 -10 -38 -25 -369 50 8 65 17 49 -43 87 -128 112
6202 112 -56 -141 207 -104 0 137 -32 -330 41 101 -145 -79 310 -39 135 116 24 -14 -76 -19 149 27 170
6225 170 -333 112 -49 -170 -10 170 252 -119 117 -213 -315 335 -111 6 62 -2 229 -53 -208 140 87
6246 87 -237 -18 52 -59 17 164 -44 48 119 67 -169 64 12 163 229 -96 -159 -187 316 65 98 178 362 -19
6270 -19 -5 39 113 -36 -70 98 77 -162 24 168 -19 171 -298 -64 148 213 -153 -368 101 -114 -101 53 -77
6293 -77 -263 -220 -140 90 -213 -172 -152 -213 -475 148 -38 -15 121 -20 -136 -20 45 368 28 -164 146 35 -20
6316 -20 53 47 -108 240 80 -105 30 -307 -26 -92 218 42 85 -18 133 136 -134 244 132 22 -98 154 63
6339 63 307 106 62 101 -70 84 314 -27 -305 -60 -137 -118 -152 -139 -89 -107 28 253 -40 -280 -136 -66 -113 167
6363 167 161 -107 -32 -117 245 418 -93 5 -185 25 202 -119 -45 204 -206 -63 202 -188 53 48 160 -175 180
6386 180 -95 6 70 -389 25 -129 -12 26 38 -106 138 147 207 332 -101 244 43 -111 176 39 9 -302
6408 -302 -31 8 101 268 -23 -28 -220 -101 -384 -277 -1 -35 -266 -110 -203 95 143 -11 -151 230 32 -156
6430 -156 -18 97 -47 315 -75 -56 341 -190 -1 123 -153 -60 14 75 18 -21 -133 172 11 -129 281 -125
6452 -125 114 275 -261 -54 109 -209 -30 185 133 105 -234 -156 48 7 -40 0 -121 -93 148 115 -2 230 -59
6475 -59 208 334 59 267 91 56 -120 289 -235 72 -235 -108 302 55 -205 51 -36 -208 233 17 62
6496 62 -66 -94 229 237 289 -25 -204 -184 127 -95 -58 218 -166 -119 180 36 38 181 -165 63 50 -251 141 231
6520 231 60 -26 90 -103 89 1 221 7 2 -1 52 -104 -30 -297 -126 -24 116 35 -261 -231 -130 17 82 74
6544 74 197 -51 -78 163 -190 -56 -44 -185 15 -124 -254 118 40 -86 -206 17 42 -150 257 55 -44 -87
6566 -87 -308 78 21 39 211 191 -47 -54 -77 67 -162 -179 -59 57 84 133 -41 288 -82 90 -102 237 -26
6589 -26 -13 138 164 -129 170 -211 64 118 -82 91 -79 -47 29 -147 158 -147 -36 -107 122 151 308 113 71
6612 71 -96 -264 18 69 194 -195 -108 1 -133 49 87 -167 212 -44 -128 73 120 169 131 -132 -141 108 48 5
6636 5 44 -19 -54 314 -152 -100 179 -532 20 -135 -141 65 -126 -70 175 107 11 326 -8 41 105 82 -134 11 -17
6661 -17 94 311 135 -111 63 186 -1 134 163 63 207 -196 -22 -187 -114 381 16 -265 -467 26 -3
6682 -3 -71 -96 139 -87 -46 -80 -45 15 45 -65 -198 115 45 -75 -67 -101 -103 40 -210 -122 -37 -33 211 -34 -45 121 8
6709 8 -308 3 287 378 -233 -235 275 157 23 -48 111 -99 111 18 152 -18 78 -24 205 27 -42 169 -189
6732 -189 190 6 -95 -11 274 -72 -210 -156 -76 208 -36 -184 17 -24 -181 144 -43 -182 -19 -109 -193 231
6754 231 199 69 188 -90 -159 -120 59 75 -42 -24 161 -45 53 -220 123 189 82 -18 -152 235 149 103 84
6777 84 -102 374 -42 61 93 206 -35 30 -3 -306 -8 38 67 238 -115 -234 -42 4 210 341 232 112
6799 112 233 -147 102 31 -186 -65 -38 -72 -15 -114 61 209 109 -183 51 -359 -199 -209 -339 -98 -65 63
6821 63 143 -363 -136 30 143 -127 216 -78 -356 -28 167 115 -220 -153 144 15 -81 132 -78 -134 -23 84
6843 84 -4 84 -30 237 46 -79 -106 201 -65 -25 216 101 5 338 118 70 -165 205 23 -19 -158 -240 151
6866 151 -52 370 -58 187 61 72 3 -34 -328 217 -39 -235 100 138 -183 230 -66 265 213 7 57 9
6888 9 55 -8 103 195 38 48 81 142 321 96 -104 8 55 126 307 -146 -114 181 -350 -100 149 404 68 103
6912 103 -68 -196 -59 63 299 -398 77 71 -341 254 20 35 -109 -229 -201 190 275 92 -16 -89 -16 458
6934 458 -80 85 111 99 107 23 -215 29 -121 -31 194 -64 21 291 -39 -8 191 -72 -85 171 -46 -372 199
6957 199 -45 38 -33 -106 295 171 -151 269 -55 10 249 37 196 -100 47 -100 46 64 -43 156 -3 32
6979 32 83 -128 64 14 -155 -22 -295 101 105 100 69 328 243 -102 280 3 -20 269 149 -35 208 -199 -224 -96
7003 -96 -291 91 -94 202 -42 -20 235 -279 -104 -39 -80 -15 -96 70 -182 -211 273 228 123 -86 -134 67 -30
7026 -30 -220 301 -193 145 -12 -94 -165 188 85 -109 -187 -166 32 -144 87 -140 -80 -61 -174 81 -166 174
7048 174 156 -49 -29 13 79 105 119 -100 331 -198 -90 85 70 -64 29 -341 -15 -58 99 318 -5 -110 224
7071 224 -67 35 120 -24 -77 -132 220 99 -82 -230 -27 -173 74 170 -110 46 235 -166 -9 329 -123
7092 -123 -22 -336 -56 -113 129 -57 -223 -166 -198 80 140 25 -130 -131 -153 162 67 -26 -76 -110 -82 -200 98 -143
7116 -143 240 -64 47 -47 144 252 140 -113 83 -77 212 -31 -173 28 -79 -22 24 -61 12 -232 -23 8
7138 8 43 13 86 167 -182 -138 142 -42 -70 -87 -217 23 59 51 -144 9 -105 -152 -98 -225 -26 109 -433 275 145
7163 145 125 211 -46 174 14 68 186 -99 -28 -22 -23 21 -88 200 -117 -257 -54 -107 66 136 -60 -251 29 121
7187 121 43 -223 -217 237 -90 -121 65 180 27 86 -79 34 210 -358 -20 154 181 7 2 -329 -37 -196 -123
7210 -123 86 39 -90 -139 28 140 -34 -80 65 119 -122 113 97 -7 -41 -5 24 156 -99 135 168 -50 12
7233 12 -19 28 271 -107 -37 97 245 -100 -102 51 -144 141 -153 34 207 -28 -145 -17 24 26 -195 -270 11
7256 11 195 -33 268 87 -162 99 -12 120 173 -97 27 168 125 -157 -250 -42 -110 142 -310 -35 213 -29
7278 -29 -169 0 -186 48 199 9 -9 -170 -93 225 77 72 225 28 -1 -11 -30 165 129 50 -373 0 85 115
7302 115 -9 -141 1 -34 -8 15 -152 -17 96 186 -42 37 100 -122 -269 -88 -218 92 14 -230 -142 79 314
7325 314 -74 -65 -57 70 -6 -271 -110 -11 175 -237 269 174 86 68 114 -245 72 -93 -29 -34 -97 -53 8 -184 -74
7350 -74 -11 70 -72 52 118 163 406 -8 259 -67 -170 -50 107 47 51 -89 58 117 -32 -38 -235 -75 20 286
7374 286 36 146 -21 19 -61 8 90 360 -196 263 166 127 -216 -37 102 140 -45 -11 -136 -112 -135 106 -146
7397 -146 51 -189 65 153 -108 -116 -46 -104 -150 -230 -9 21 -86 118 -192 -118 76 -223 86 123 0 157 -73
7420 -73 -212 62 89 -91 -57 -98 152 231 80 -113 6 24 217 -174 -162 -181 -110 -128 -136 133 -179 113 72 92 -71
7445 -71 62 -255 -233 -158 -75 104 72 -16 -7 -241 -49 210 -119 -7 -39 -12 30 -118 -156 -80 -213 74 14 -134 -125
7470 -125 136 51 327 -7 -179 -429 -129 -262 -60 101 -94 -178 30 -139 40 -4 225 -77 -138 -34 161
7491 161 -68 -50 198 -225 80 -127 -321 -92 -17 66 121 -159 146 113 -21 29 193 -318 -145 110 -41 -121
7513 -121 -607 -127 -105 -94 -17 126 -98 171 205 -2 60 404 135 -33 73 -76 -193 -30 -3 77 21 26 92 121
7537 121 -229 168 -59 -5 63 24 322 23 -307 32 247 -350 -134 64 -215 -232 147 -257 27 -75 -200
7558 -200 -29 172 101 -334 -248 106 36 -190 95 -65 245 -152 204 -289 136 60 -223 -54 -194 171 23
7579 23 -137 7 30 16 228 -13 -108 -116 54 -69 253 -98 -115 71 -96 72 149 124 23 -10 69 60 -34 -230 183
7604 183 268 200 -39 -30 -169 -5 -107 -297 -2 -79 -128 85 6 -89 210 -41 150 -122 5 2 166 330 101
7627 101 -438 146 67 122 -69 -74 -369 -238 -119 -23 398 26 -48 9 315 22 -10 176 -22 -174 -157 14 142
7650 142 -27 101 -166 -39 99 227 -214 -308 -171 -222 -18 -1 36 25 206 91 -24 -146 -110 -49 284 -173
7672 -173 17 282 -13 6 -3 -271 32 91 -123 185 24 -192 -50 -356 18 59 24 130 138 -19 163 118 -92
7695 -92 -1 -85 130 241 -76 44 89 -130 165 -17 286 64 6 104 -24 257 8 282 -265 -61 131 70
7717 70 -60 -66 -23 -79 -138 -164 -65 -70 -2 -70 -58 -174 -48 -164 -130 33 17 -119 -87 -249 -121 -150 29 -25 460 -9
7743 -9 -55 42 27 -389 80 122 23 305 -7 246 135 36 -82 -47 -103 10 110 -176 -26 -223 4 -2 -288 53
7767 53 -10 -2 160 -46 91 -140 22 43 -279 1 -182 -324 -11 45 114 31 -31 -171 -34 -469 -92 92 -13
7790 -13 -129 -85 -132 161 11 27 122 -92 -24 34 -80 -121 -117 -33 -4 87 7 27 -17 226 257 45 -76 3 -59 76
7816 76 106 186 11 -67 153 77 216 -79 233 181 -121 -188 -148 116 -19 -83 -135 -93 -32 -19 69 24 93 -114 47
7841 47 -44 -235 -82 131 -201 -228 38 128 30 -104 -28 -109 20 145 -92 -174 86 171 -363 -40 -60 60 -155
7864 -155 -7 -289 -137 379 -58 -74 9 -221 281 -229 9 -189 -127 72 95 -64 -343 115 92 152 -238 -177
7886 -177 0 115 -269 -104 104 83 -3 -75 263 214 185 105 28 33 -144 126 284 -47 -20 106 -35 -98 -196 116
7910 116 -139 115 -125 124 -68 -398 -93 94 275 27 -90 -82 -16 114 -203 -118 -379 -174 -164 324 158 -17
7932 -17 -6 116 285 -108 73 -16 -82 -91 -40 142 55 -277 41 111 6 -67 45 124 209 16 21 -185 86 63 -205
7957 -205 62 -21 -217 6 49 -60 182 155 208 57 14 -113 -5 -89 176 44 59 -120 24 -113 -181 120 -26
7980 -26 -136 99 -58 271 -158 51 63 340 -264 44 170 -305 12 -161 50 23 -83 -267 -88 -164 272
8001 272 46 77 91 67 147 -187 260 92 -225 94 35 11 14 -272 68 -106 108 117 190 60 84 93 -189 14 -71
8026 -71 105 21 -11 7 218 -3 -272 -178 124 124 173 -214 -236 194 -101 293 39 -111 -43 410 49 -40 -160 -158
8050 -158 -399 -18 52 9 -97 289 -165 -144 49 143 202 -80 -18 -253 172 -140 30 39 -287 -13 142 -132 -131
8073 -131 -119 -169 -56 -21 -223 -81 94 -22 66 -252 88 131 12 211 26 80 127 -85 -14 119 92 -116 88
8096 88 254 -126 10 81 -43 -170 276 114 -87 85 -25 66 -111 -8 -20 -146 -52 40 -220 105 143 -29
8118 -29 70 -108 -176 -50 2 -162 113 56 77 59 158 -82 149 -105 197 76 330 130 165 -43 -70 7 73 -59
8142 -59 -80 -59 -25 113 -64 18 -45 -7 -125 -151 -94 171 -26 -36 -166 -119 158 -52 51 58 89 263 -24 66 101
8167 101 -31 179 39 -15 -85 -110 -50 92 190 -171 -174 29 -106 -2 31 236 -15 76 -111 3 -4 -15 296 105
8191A05
##END NTUPLES=NMR FID
##END=
