##TITLE=1H_9-2022
 CDCl3
 8 sc, 
 14.02.2022
##JCAMPDX= 6.0         $$ Bruker NMR JCAMP-DX V2.0
##DATA TYPE= NMR FID
##DATA CLASS= NTUPLES
##ORIGIN= UXNMR, Bruker Analytische Messtechnik GmbH
##OWNER= root
$$ XWIN-NMR		Version 3.5
$$ Mon Feb 14 11:20:25 2022 Russian Standard Time (UT+4h)  she@DPX200
##.OBSERVE FREQUENCY= 200.131346
##.OBSERVE NUCLEUS= ^1H
##.DELAY= (6, 6)
##.ACQUISITION MODE= SIMULTANEOUS
##.ACQUISITION SCHEME= undefined
##.AVERAGES= 8
##.DIGITISER RES= 18
##SPECTROMETER/DATA SYSTEM= spect
##.PULSE SEQUENCE= zg30
##.SOLVENT NAME= CDCl3
##.SHIFT REFERENCE= (INTERNAL, CDCl3, 0, 15.7039)
##AUDIT TRAIL= $$ (NUMBER, WHEN, WHO, WHERE, WHAT)
$$ ##TITLE= Audit trail, XWIN-NMR		Version 3.5
$$ ##JCAMPDX= 5.01
$$ ##ORIGIN= Bruker BioSpin GmbH
$$ ##OWNER= she
$$ F:/spectra/data/she/nmr/H-F/1/audita.txt
$$ ##AUDIT TRAIL=  $$ (NUMBER, WHEN, WHO, WHERE, WHAT)
(   1,<2022-02-14 11:19:01.45 +0400>,<she>,<DPX200>,
      <created by zg, POWCHK disabled, PULCHK disabled
       configuration hash MD5:
       00 E9 B6 7A A2 85 ED C7 34 08 36 98 17 FE 4E 26
       data hash MD5: 16K
       0E A3 A2 94 DF 7D 73 38 CC 9F 10 2C 1A 24 22 BD>)
$$ ##END=
$$ 
$$ hash MD5
$$ 1B 72 A1 03 C4 06 3C 8D EE D1 C8 69 C4 B2 F6 85
##$RELAX= 
##$RELAX= 
##$RELAX= 
##$RELAX= 
##$RELAX= 
##$RELAX= 
$$ Bruker specific parameters
$$ --------------------------
##$DU= <F:/spectra>
##$EXPNO= 1
##$NAME= <H-F>
##$PROCNO= 1
##$TYPE= <nmr>
##$USER= <she>
##$AMP= (0..31)
100 100 100 100 100 100 100 100 100 100 100 100 100 100 100 100 100 100 
100 100 100 100 100 100 100 100 100 100 100 100 100 100 
##$AQSEQ= 0
##$AQ_mod= 1
##$AUNM= <au_zg>
##$AUTOPOS= <>
##$BF1= 200.13
##$BF2= 200.13
##$BF3= 200.13
##$BF4= 200.13
##$BF5= 200.13
##$BF6= 200.13
##$BF7= 200.13
##$BF8= 200.13
##$BYTORDA= 1
##$CFDGTYP= 0
##$CFRGTYP= 5
##$CHEMSTR= <none>
##$CNST= (0..31)
1 1 145 1 1 1 1 1 1 1 1 1 1 1 1 1 1 1 1 1 1 1 1 1 1 1 1 1 1 1 1 1 
##$CPDPRG= <>
##$CPDPRG1= <>
##$CPDPRG2= <>
##$CPDPRG3= <>
##$CPDPRG4= <mlev>
##$CPDPRG5= <mlev>
##$CPDPRG6= <mlev>
##$CPDPRG7= <mlev>
##$CPDPRG8= <mlev>
##$CPDPRGB= <>
##$CPDPRGT= <>
##$D= (0..31)
0 1.2 0 0 0 0 0 0 0 0.06 0 0.03 0 0 0 0 0.0002 0 0 0 0 0 0 0 0 0 0 0 0 
0 0 0 
##$DATE= 1644823140
##$DBL= (0..7)
120 120 120 120 120 120 120 120 
##$DBP= (0..7)
150 150 150 150 150 150 150 150 
##$DBP07= 0
##$DBPNAM0= <>
##$DBPNAM1= <>
##$DBPNAM2= <>
##$DBPNAM3= <>
##$DBPNAM4= <>
##$DBPNAM5= <>
##$DBPNAM6= <>
##$DBPNAM7= <>
##$DBPOAL= (0..7)
0.5 0.5 0.5 0.5 0.5 0.5 0.5 0.5 
##$DBPOFFS= (0..7)
0 0 0 0 0 0 0 0 
##$DE= 6
##$DECBNUC= <off>
##$DECIM= 32
##$DECNUC= <off>
##$DECSTAT= 4
##$DIGMOD= 1
##$DIGTYP= 9
##$DL= (0..7)
0 120 120 120 120 120 120 120 
##$DP= (0..7)
150 150 150 150 150 150 150 150 
##$DP07= 0
##$DPNAME0= <>
##$DPNAME1= <>
##$DPNAME2= <>
##$DPNAME3= <>
##$DPNAME4= <>
##$DPNAME5= <>
##$DPNAME6= <>
##$DPNAME7= <>
##$DPOAL= (0..7)
0.5 0.5 0.5 0.5 0.5 0.5 0.5 0.5 
##$DPOFFS= (0..7)
0 0 0 0 0 0 0 0 
##$DQDMODE= 0
##$DR= 18
##$DS= 0
##$DSLIST= <SSSSSSSSSSSSSSS>
$$ [...]
##$SUBNAM2= <"">
##$SUBNAM3= <"">
##$SUBNAM4= <"">
##$SUBNAM5= <"">
##$SUBNAM6= <"">
##$SUBNAM7= <"">
##$SUBNAM8= <"">
##$SUBNAM9= <"">
##$SW= 18.0517287032376
##$SWIBOX= (0..15)
0 0 2 0 0 0 0 0 0 0 0 0 0 0 0 0 
##$SW_h= 3612.71676300578
##$TD= 16384
##$TD0= 1
##$TE= 0
##$TE2= 300
##$TE3= 300
##$TEG= 300
##$TL= (0..7)
0 120 120 120 120 120 120 120 
##$TP= (0..7)
150 150 150 150 150 150 150 150 
##$TP07= 0
##$TPNAME0= <>
##$TPNAME1= <>
##$TPNAME2= <>
##$TPNAME3= <>
##$TPNAME4= <>
##$TPNAME5= <>
##$TPNAME6= <>
##$TPNAME7= <>
##$TPOAL= (0..7)
0.5 0.5 0.5 0.5 0.5 0.5 0.5 0.5 
##$TPOFFS= (0..7)
0 0 0 0 0 0 0 0 
##$TUNHIN= 0
##$TUNHOUT= 0
##$TUNXOUT= 0
##$USERA1= <user>
##$USERA2= <user>
##$USERA3= <user>
##$USERA4= <user>
##$USERA5= <user>
##$V9= 5
##$VALIST= <valist>
##$VCLIST= <CCCCCCCCCCCCCCC>
##$VD= 0
##$VDLIST= <DDDDDDDDDDDDDDD>
##$VPLIST= <PPPPPPPPPPPPPPP>
##$VTLIST= <TTTTTTTTTTTTTTT>
##$WBST= 1024
##$WBSW= 4
##$XGAIN= (0..3)
0 0 0 0 
##$XL= 0
##$YL= 0
##$YMAX_a= 287303
##$YMIN_a= -280952
##$ZGOPTNS= <>
##$ZL1= 120
##$ZL2= 120
##$ZL3= 120
##$ZL4= 120
##$ABSF1= 10
##$ABSF2= 0
##$ABSG= 5
##$ABSL= 3
##$ALPHA= 0
##$AQORDER= 0
##$ASSFAC= 0
##$ASSFACI= 0
##$ASSFACX= 0
##$ASSWID= 0
##$AUNMP= <proc_1d>
##$AZFE= 0.1
##$AZFW= 0.1
##$BCFW= 1
##$BC_mod= 2
##$BYTORDP= 1
##$COROFFS= 0
##$CY= 11.3945322036743
##$DATMOD= 1
##$DC= 2
##$DFILT= <>
##$DTYPP= 0
##$F1P= 2.36226072786647
##$F2P= -0.459571619588291
##$FCOR= 0.5
##$FTSIZE= 0
##$FT_mod= 4
##$GAMMA= 1
##$GB= 0.15
##$INTBC= 1
##$INTSCL= 1
##$ISEN= 128
##$LB= 0.24
##$LEV0= 0
##$LPBIN= 0
##$MAXI= 10000
##$MC2= 0
##$MEAN= 0
##$ME_mod= 0
##$MI= 1.114404
##$NCOEF= 0
##$NC_proc= 0
##$NLEV= 6
##$NOISF1= 3.799351
##$NOISF2= 2.8
##$NSP= 1
##$NTH_PI= 0
##$NZP= 0
##$OFFSET= 15.70392
##$PC= 1
##$PHC0= -16229.46
##$PHC1= 10.20079
##$PH_mod= 1
##$PKNL= yes
##$PPARMOD= 0
##$PSCAL= 0
##$PSIGN= 0
##$REVERSE= no
##$SF= 200.130013532006
##$SI= 16384
##$SIGF1= 3
##$SIGF2= 2
##$SINO= 400
##$SIOLD= 16384
##$SREGLST= <1H.CDCl3>
##$SSB= 0
##$STSI= 0
##$STSR= 0
##$SW_p= 3612.71676300578
##$SYMM= 0
##$S_DEV= 0
##$TDeff= 0
##$TDoff= 0
##$TI= <>
##$TILT= no
##$TM1= 0
##$TM2= 0
##$TOPLEV= 0
##$USERP1= <user>
##$USERP2= <user>
##$USERP3= <user>
##$USERP4= <user>
##$USERP5= <user>
##$WDW= 1
##$XDIM= 8192
##$YMAX_p= 0
##$YMIN_p= 0
$$ End of Bruker specific parameters
$$ ---------------------------------
##NTUPLES= NMR FID
##VAR_NAME=  TIME,          FID/REAL,        FID/IMAG
##SYMBOL=    X,             R,               I
##VAR_TYPE=  INDEPENDENT,   DEPENDENT,       DEPENDENT
##VAR_FORM=  AFFN,          ASDF,            ASDF
##VAR_DIM=   8192,          8192,            8192
##UNITS=     SECONDS,       ARBITRARY UNITS, ARBITRARY UNITS
##FACTOR=    0.0002768,     1,               1
##FIRST=     0,             0,               0
##LAST=      2.2672688,     0,               0
##MIN=       0,             -280952,         0
##MAX=       2.2672688,     287303,          0
$$ Real data points
##PAGE= N=1
##DATA TABLE= (X++(R..R)), XYDATA
$$ [...]
2034C67m57N62j593J574O72k559J750L0q61J806k132k38K892j615L0P26p07R55
2052A202j245n92J364r16O72o42j161K283j421j417K493q21M70R60k525J444R91
2069A139k003J262j33J67N99j921Q52K73p38J187j227N38J593k868O2J792j511
2086i37J580o32j425K001o87q66R61k94J345o44q86J583j539K27P15j542K343
2103A303K14l109J638j36o78J549j375O74J447j910J26k08L26J280j306R94P23
2120A552j706N82q54q09L033j694j256J876j423P6J38j175K011K17r09N83j023
2137g81R54k59j136K709m56j263J068k210J013J699k394R93R26j288O59j405m26
2154a597J669n78N98N4r54J172k017M37K696j017N73J41j875K026o03j720J922
$$ y = [367, -90, 472, -1121, 453, 1125, -1434, 316, 346, -515, 1291, -841, -1079, 1813, 198, 228, 954, 247, 1202, -43, -635, 729, -187, 485, -157, -1318, 965, -456, -1873, 620, -201, 269, 1229, -1296, 148, 1139, -864, 398, 265, 432, 1031, -890, -38, 235, -503, 684, -543, -5, 1588, -1280, -1218, 574, -937, 643, 11, -1414, 587, -100, -966, -5, -299, 1046, 402, -484, 1099, -440, -213, 502, -1040, 1303, 1517, -1592, 46, -90, -768, 781, -594, 80, 1527, -383, -257, -465, -139, 1141, -165, 829, 1552, -154, 428, -426, -1235, 1798, 104, -1152, 724, -699, -623, -485, -1660, 351, 568, -341, 242, -781, 173, -86, -1222, 1487, 1031, -232, 836, -1374, -361, 1338, -1056, -63, 863, -425, 234, -1171, -1597, 72, -506, 92, 146, -808, 364, -1653, -1216, 1480, 463, 1036, 1177, -698, 1328, 725, -995, 927]
2171I27L7j56K58k135K99L07q50J579l83Q04K38k875J674J065j696J888n62n98
2189a79J692k232q27J537l49J445l72r02Q09j653K2J044n40J741r15k141K425
2206F05j233o62J417q56J753J100k643N51o5l26J324p55Q42k75k032R33p27L17
2224g32K024k011N49K263k179j00M3n26K331k62j308O00j209j8R8j24K083j022
2242E00p47R14j616Q13M94k139K333N88j905L43j417J78J684p02R98L71r00M89
2260B79j293P23J466j801J372J07j689J297j753q41K952l96l37O95j626Q33K3
2277A1o74J405l24K05k18j826J496l27j201K424k16K1O57k476O30J537p44P38
2295A118m04n76O16j548j27R91m29J234o40l15J546k155j59J391n81J357l27k439
$$ y = [927, 964, 808, 1066, -1069, -770, -463, -1313, 266, -117, 687, 925, -1950, -276, 789, -907, 981, 419, -179, 1513, -719, -1546, -9, -358, 1087, 715, -187, 622, -1031, -1009, 35, -505, 1236, 321, -1820, 605, -628, -1290, 127, -729, 1024, 2124, -519, 32, -33, -359, 965, 210, 1052, 777, -1255, -322, -1049, -732, 1292, -719, -170, 2093, -86, -186, -143, -669, 1662, 1400, 92, 692, -517, -535, -437, -561, 1522, 500, -247, 667, -949, -136, 358, -1781, 552, 1140, -765, -422, -1839, -1661, 23, -679, 319, 690, -210, 279, -1014, -291, 1175, -626, 746, 853, -836, 461, -1292, -2133, 819, 423, 86, 781, -845, -12, 11, -663, 742, 418, 623, 405, -1421, 75, -252, -1453, 971, 755, 776, 1433, -1043, -413, 1124, 380, 1118, 714, 138, 754, -794, -921, 70, -359, 875, 235, -80, 1466, -689, -848, 543, -38, 1319, 992, -1447]
2313a447J187k42q43J083k61J101o5j253R51l66k16J417j512J298M93k504K95
2330h84L60m60J800q55l50J343j292L15k78j5J510r76l56Q58j708N88N3r62K777
2349A468p41j434J335q56K59J039j238R55J76j122K73r44O47O27j169J424J35
2366H34j107Q86j311J71K009j549j13P83j409O92p73m99J530n16L91K34q78J132
2384E07p68o11J934q79L9M65k077J402M53j623J201N6j44M43j206L68R74r15Q83
2403E02n92j66P49j899N36J167j119J203l91r12J930q95o88J254n11O90m65q47
2421d54J007o57l74P51q68J214j4j652J555r2n95J003j212M00R99j588L17K74
2439A4m63R45q59L82Q28j042O14L2o13J797j369p48J465r73K4L21j142J246K0
$$ y = [-1447, -260, -502, -1345, -262, -523, 578, 513, -740, 211, -155, -371, 1046, -466, 832, 1325, -1179, -884, -524, -984, 816, -39, -389, 954, -338, -23, -301, -316, 1194, 218, -138, 720, -988, -400, -347, -1309, 1468, 727, -707, 628, -228, 31, 1070, -168, 787, 963, -159, 114, -830, -183, 444, -725, 699, 834, -273, 613, -698, -527, 1482, -67, -180, 603, -806, -114, -887, -1386, 144, -372, 19, 253, -625, 507, -261, -872, 1062, 183, 222, 687, -1390, 12, 465, -1158, 43, 99, -45, 398, -808, -440, 534, -381, 502, -90, -256, 493, -1406, -870, 297, -822, 381, -10, -922, 1008, 113, -575, 679, 168, 858, 393, -454, 553, -104, -478, 273, -595, 619, 605, -1047, 508, 416, -179, 824, -388, 12, 1011, -577, -260, 14, -449, 496, -363, 19, 847, -195, 419, 451, -162, 1635, 266, -482, 983, 10, 34, 355, -787, 459, 479]
2458D79j252Q84l76L84L03j212J418j69j021Q07j007L53J183k067Q26Q59q91P37
2476B38n26k46J211r89QK87m07P08q54l61J577j093K8O68j058J405k68j319J530
2495E39k15m25O55j291O66L81j056Q53l49J07P16j599J181N33j340J236n02m12
2513c22J424j340j75J372r81N26k67l21J022q74l13Q13p55P15l65j217J658o73
2531g3p01Q41r17P36N69j428R82L96q18M85m36M80N34j127O51r2k80R91j400K80
2551c27J000j256L22M03q29J296n91r22J353o01K71M2o61J323k34r41R77o67L60
2570C18L19j440J435L84j306P91l88k88J080j303M40M79r01P83p59J63J007j205
2588c91M93M73r61J022r22m65J512p42l15M41q37O70q6q01Q22r7r6K16q30R94
$$ y = [479, -773, 111, -265, 119, 422, -790, 628, 459, -562, 245, -762, -409, 774, -1293, -467, 392, -499, 238, -288, -534, 677, -312, -304, -17, -424, 284, -570, -931, 646, -447, -419, 249, -809, 596, 328, -991, 539, 324, -101, 554, -737, -71, 310, -746, 107, -242, -135, 581, -1018, 163, 696, -644, 592, 90, -322, 1102, -238, -413, 959, -22, 504, 237, -84, 938, 64, -249, 564, -191, 524, 159, -1058, 600, -73, -774, 67, -850, -114, 455, -973, 9, 405, -413, 72, -364, 116, 650, -477, 174, 82, -198, 793, -607, -327, 673, -583, -261, 142, -687, 609, 18, -904, 449, -152, 119, 161, -500, 823, 589, -352, 625, -42, 318, 637, -803, 632, 1016, -290, 501, 113, -175, 905, -398, 42, 521, -380, 403, -356, -193, 814, -391, 102, 575, -386, 636, -286, -751, 761, 19, -296, 145, -692, -22, -108, -909, -87, -184, -280, -64, -894, 100]
2608A00N7r91J420k59l16O44j450M86J088j114M23j27m46Q39r35J02N50m85Q45
2627D31p77j52J118j231j78J159m87O61o4j148J078J01q11R57n07M29M2j219O57
2646E9j35m59P95r71P06O05j460M97K87k77J053q32j89J053r27j21L30k72R43
2665F85o09m63Q33j008N78J48o61J492n72j103J036n77J92N56j088J124K84j112
2683b65N63n62K97R60j029P46Q5r81L80o20J28J374j200o6N57p32M13k01m39J375
2703G83j42l98K35r30N35k35m18J312o01l43Q0j098Q79M69j106R74J53n12L88
2722B5j153L36Q39n67O36k59j87N45j306P46J094o97M72l07p39J216q62p01J372
2741E03m19L41n8j065N78p2L7P17l95O17k46j235J005o0n07Q59n87L69M97j394
$$ y = [100, 157, -834, 586, 327, 11, 655, -795, -309, 779, -335, 88, -39, -485, 354, -581, -479, 71, -414, 431, -346, -498, 620, -611, -789, 370, -117, 544, 480, -668, 410, 511, -300, 657, 150, 579, 621, -598, 59, -76, -535, 260, -711, -5, 600, -860, -363, -76, -353, 700, -132, -321, 732, -195, -316, 14, -258, 685, 76, -387, 446, -562, 16, 164, -497, 995, 423, -680, 356, -221, -29, 527, -561, 563, 847, -265, 298, -264, 33, 993, -36, 710, 795, -186, 194, -426, -298, 1076, -124, -190, 367, -365, 48, -153, -592, 783, 641, 243, 478, -452, 83, -152, -570, 742, 141, -202, -122, -1220, -341, 128, -978, -4, 149, -363, 25, -1128, -792, 47, -520, 116, -143, -330, 215, -1091, -345, 749, 52, 524, 217, -522, 694, -168, -869, 503, 84, 425, 367, -698, -120, -192, -155, 562, 167, 784, 538, -697, 308, 248, -259, 600, 13, 382, 879, -515]
2761e15J51O61l12J148o95k84M34r68K13L35m06J067p39o11J133r89j03O64o84
2780e00J279k67r58M10n67K12N81o22Q61k81q75P01n90M32P84p74M52M68j019
2799b73J22j95p4J317q14j79L62p96M11j12K2Q48m49q2K65r11O45j95o23J299
2819E88J33o33K4q66N55P14o53P59k36m64L62q50N14P07r90O71j06n34O86j065
2839f84j17J300m25L25j65p89O61l67l14R35m99K82j90n71Q15l85m00J023k09
2858B26K19K81j553N41M15k78N66m94m2M28j036O91P9m05P23m67o2P97j265K13
2878d23N97n27R74l47q42O41m70J60N52n28Q20m8q71O92o48J74N72o92P64N3r65
2899c62L09j40k2P26n91K02L65o96L29l82J31P47o86J42L92r04P80n43j76J137
$$ y = [-515, -364, 297, -15, 1133, 438, 154, 588, -380, -167, 168, -238, 829, 90, -521, 612, -377, -480, 184, -500, 779, 512, -446, -36, -603, -391, 190, -432, 429, 148, -727, -26, -616, -184, 600, -174, 278, 746, -273, -151, -346, -420, 897, 83, -96, 266, -530, -119, -231, -209, 639, 190, 108, 373, -538, 107, -88, -711, 588, 721, 88, 112, -754, -199, 515, -138, 621, 385, -79, 283, -567, -53, 654, -336, 335, 229, -305, 381, -684, -801, 499, 74, 399, 234, -555, 106, -261, -575, 360, -139, 143, -47, -618, 197, -188, -588, 435, 226, 445, 726, -827, -286, 129, -149, 417, -77, -119, 309, -727, -36, 43, -362, 361, -106, -168, 629, -636, -423, 174, -353, 621, 274, -568, 73, -397, -237, 315, -213, 607, 559, -312, 380, -268, -94, 478, -214, 550, 603, -362, -53, -193, -215, 511, -80, 122, 487, -209, 120, -262, -131, 616, -70, 72, 464, -440, 340, -203, -379, 758]
2919G58m75l77N11o63N52k1p23R18k32m10M31q89N35J87p24R14K8o53N38r72L17
2940d50R20r31L23k6l19N47l94q2O95m78L50k75l67P50n44j81Q79o47K75P9q43
2961g19Q79n6m31O96n31K88O6p50O24J47m95O48m82J86N56j121L78M70l42M96
2981E07o15m3Q63o26l24O15m76O41m12l39P34p25L03J80o16P52k52p62P96m35
3001b34j53L12m44N83J20o15N08k51J78L24q11M43J80m24O15n02j75J001q26M3
3021a28O02r05N44j95l34R25m28l29N63n38M51q2o47R61k34k97N01p73O00L27
3041E84r13P83P8o10M47o73L76L97n37K42r6k58Q18j049J35P58q41N06j31n71
3061e55Q86l19m73P57o67L53k1m17P58l52l07N97m62J54L38p63O92Q7q10P85m76
$$ y = [758, 283, -94, 417, -246, 306, 285, -438, 480, 248, -162, 269, -620, -85, 102, -622, 292, 320, -333, 205, -767, -450, 470, -461, -138, -164, -483, 64, -330, -412, 283, -195, 155, -120, -487, 263, -281, -462, 417, -230, 45, 124, -719, 160, 104, -327, 369, -162, 126, 192, -558, 66, 213, -282, 366, -116, 70, 626, -495, -117, 353, 11, 507, -108, -151, 712, 86, -238, 377, -99, 542, 130, -209, 525, -200, 103, 283, -333, 419, 167, -595, 201, -234, -387, -75, -519, 64, 184, -431, 77, -174, 4, 328, -483, -40, 140, -284, 331, -171, -346, 655, -171, -128, 474, -431, 113, -82, -416, 509, 81, -248, 315, -223, 228, 146, -501, 460, 226, -71, 430, -343, 257, 584, -329, 454, 532, -78, 369, -304, 72, 469, -68, 174, 78, -180, 638, -411, -276, 482, -359, 147, 16, -555, 331, 12, -461, 296, -371, -18, -39, -456, 302, -50, -357, 240, -222, -68, 270, -493, 199, 286, -524, 261, -215]
3082b15Q0P73j167L63M00m34M31m22j63P76p48N1M84m33M95l85l03Q57o08LK69
3103A04m61N63P1p24O88j25k12M05p80Q87j52o19P56m85J0N69r37J81P42r05M97
3124G3j23l07P16m54k11P31n56K75Q6m03P10o59M5O93q27M43J03p53J022l42l19
3145e7N74o76K68N37q53N71k48m8L19n76K35M53r52M96J89n99P09o99NR20o46
3166g8J60N7m47O08m78p0N38m19R9K0o53P88k78l67P86n50K28J23r96O98K79n33
3188d85N08k88J5L27q01N40J83l49O99m79k49P91q70K99M38k58N59m08o15O78
3208B35k72P9K69l61M56n5p19N66l60K8N69o93N83rq37N55m1n1N38n53J93N69
3230F89q62L12j69L9O95n72j21L62p48M60k5n15J122l99n87L72l84L35J79n94
$$ y = [-215, -135, 638, -529, -166, 234, -200, 231, -191, -354, 422, -326, -275, 209, -224, 271, -114, -417, 440, -168, -165, 104, -357, 206, 277, -447, 241, 116, -96, 309, -471, 416, 264, -355, 401, -84, -74, 495, -442, -261, 481, -424, 73, -50, -357, 359, -95, -306, 425, -131, 144, 230, -173, 537, -122, -77, 616, -211, 232, 335, -418, 604, 262, -57, 517, -159, 109, 646, -207, 364, 116, 68, 387, -189, 46, 499, -453, 43, 232, -367, 342, -357, -352, 568, -78, 82, 139, -308, 300, -178, -248, 290, -129, -30, -10, -663, 125, -153, -520, 266, -284, -56, 67, -929, -231, 48, -485, 23, -265, -250, 77, -724, -184, -1, -350, 349, -130, -379, 412, -458, -159, 279, 21, 580, 172, -443, 235, -37, 42, 311, -50, 406, 351, -368, 198, -162, -134, 435, -258, 325, 316, -521, 34, -7, -58, 480, -73, 120, 689, -173, 139, -30, 9, 704, 132, 11, 373, -375, 85, 60, -455, 667, 268, -319, 53, -331, 4, 183, -411]
3250d11O79r5n50N51p55L76M29o01P66l69m65M87n57L75P26q32K68Q4m07N44n16
3271b73r2Q70o77M72k45m78O70m83j12R71p54J64j44o16Q75M2p09P31j75J45j92
3292a0n45M86K83l56O97m96j5L32r26N74L93n70O54m17k52N29p05J97L84m73P12
3313D76l77l67L17m29L50K46l93N62k99o92P95l33m5M99m93L92J73p55L59j38
3333a52K59M47p59K54m6o33O27j45o1P77p72JM53p00M31Ml87Q89m91l70L37m69
3355e06O72J25m32O81m25l24M96p24L74N94p11L81K37q57O55n12K96N23m74K34
3375C03l32k41O19n99J39O41q37M65m0m09N47k13m52R44l35r5l0m59L14J13j13
3396g0M42n73R3L31p33M38K12n32P12m02j63L85p48K85M91m27M87k73m18M97m82
$$ y = [-411, 268, 173, -377, 174, -581, -205, 224, -377, 389, 20, -445, 42, -515, -140, 586, -246, 22, 106, -301, 243, -273, -365, 505, -172, 300, 55, -423, 247, -236, -348, 623, -131, 33, -111, -727, 148, 190, -519, 212, 37, 182, -10, -555, -69, 214, -142, 555, 59, 44, 376, -550, 24, 417, -153, 501, 84, -168, 361, -344, -147, 237, -236, 476, 99, -268, 49, -380, -30, 216, -177, 385, 86, -606, 189, -144, -189, 310, -183, 209, 382, -373, -14, -152, 107, 554, -205, 49, 3, -630, -3, -148, -209, 568, -204, -203, 250, -450, -19, -15, -402, 487, -4, -374, -37, -506, 166, 291, -141, 540, 115, -209, 287, -437, -63, 531, -180, 201, 438, -419, 236, -276, 20, 543, 69, 303, -29, -270, 349, -250, -111, 530, -307, 158, 118, -291, 256, 43, -409, 535, 200, 105, 75, -384, -70, 43, -70, 372, -201, -108, 223, -510, -72, 140, -392, 320, -82, -245, 140, -608, -323, 168, -259, 228, -45, -463, 34, -448]
3417d48L21L59n85R35o23l48P86p11K28M83n47M33j80o11N90j9KK11l62K71j47
3438C8l56K99j84J59M57n79K84om36L01K05l17P01m51k47K62k95L75j51k26O26
3459D59n48k18M55n19O61j61m54O09n1q25O11k28k0N80m55K37j38k93N36n18J23
3480a57L77m51M51r9l64N94k86j67N33n32J46L02n92L86n9j17N28n80K3L85m73
3501a52N71m51j26M83l52j39L40n62M80J75o98M81m3m4M38o73K62K18k85L69j96
3522I6j79M43o89M06J23m55N58j92m02N08m34k2L94m79M32j76k15L52l05k0O75
3543D19p50L67N9m77P15k93j92M77n26Q9K86l78J30J14j23L28m98K8N39p89L90
3564h5Kl14Q00m29j47M63m27J19K61l51L00J8m39N02m06L17Kn54O20j34k62M29
$$ y = [-448, -127, 232, -353, 582, -41, -389, 397, -314, -86, 397, -150, 283, 103, -508, 82, 63, 65, 276, -86, 185, 38, -318, -19, -203, -44, 413, -166, 118, 112, -324, -23, 182, -135, 566, 115, -132, 130, -165, 210, 59, -167, 459, -89, -307, 148, -371, 290, 129, -325, 284, 233, -592, 19, -209, -229, 351, -104, 133, -5, -298, 238, -280, -157, 220, -231, 220, 121, -243, 351, 65, -102, 431, -101, 45, 347, -245, 141, 82, -35, 493, -87, -64, 321, -152, 419, -32, -158, 325, -27, -166, 174, -388, 92, 267, -431, 50, 7, -37, 401, -272, -10, 208, -77, 292, 96, -83, 360, -329, 77, 200, -255, 303, 111, -291, 217, -217, -239, 155, -324, 108, -68, -283, 69, -236, -256, 419, -331, 36, 95, -382, 333, 40, -152, 325, -201, -112, 174, -204, -74, 40, -83, 245, -253, -225, 314, -475, -85, -83, -397, 403, -26, -173, 290, -137, -18, 243, -108, 192, 210, -229, 273, -133, 184, 186, -368, 252, 118, -144, 285]
3586B85m52K7O45p89K53K45n61O60k90L2K82l20K9R0l36M72k93l89Q75o36L26
3607A55P3m28M66q5m22L95k4k07M96o21N06k1m32L98j69j71L74o28M15J78n89
3628c41N52l11k62O91n96J0K88l40L47p7j96K96k64J38K35m58N00k41m14P44m29
3649a28r4L26m08K60L19q85M62N1OK70n50L19K39n61M90q0k61N53n20n6P44q12
3671c16L32J79m22O35k04j63J52r0L7K00l68L23k46j30M15m63L91J93p03N30k7
3692B55n44P45o67J97L74n02J86K03l65K34j96oL78l54K08Ll43N12j74l27N55
3713C72l36k40L30m54L31J68m42L90j80m4K20n53N15Pl47M19l73JL43n84K99M59
3735C01k90P0j04j20K97k01NJ63k56L53j83k98N30n73K13L90n72M23J0o10L76
$$ y = [285, -167, -140, 505, -284, -31, 214, -347, 313, 23, 55, 337, 17, 46, 136, -200, 272, -21, -410, 465, -171, 155, 228, -200, 266, 181, -241, 154, 130, -77, 419, -202, 304, 283, -149, 249, 80, -91, 283, -345, 70, 248, -341, 211, -100, -362, 329, -267, -257, 31, -309, 38, -39, -235, 61, -203, -65, 170, -288, 212, -29, -443, 301, -128, -222, 104, -304, -44, 275, -610, -148, -97, -91, 179, -371, -52, 187, -374, 116, 36, -225, 328, -192, -248, 496, -316, 16, 195, -227, 408, 204, 41, 193, 103, 140, 340, -28, 295, 49, -81, 334, -129, 262, 455, -248, 282, 255, -289, 456, -211, -14, 360, -142, 44, 247, -118, 116, -80, -86, 292, -62, 146, 149, -194, 318, 144, -183, 372, 36, -204, 126, -328, 3, 171, -271, 119, -61, -105, 115, -438, 77, 84, -263, 156, -217, -216, 127, -457, -158, 301, 11, 81, -23, -143, 154, -47, -42, 121, -135, 218, 35, -263, 267, -306, -93, 297, -275, 148, 158, -452, -76]
3756g6J68k31L12k51L1K05l38K96j23j32L46k29J05J55n09L07K69o00P55m55k76
3777b71L52k91J93J12k69L75j06l90L66l06J00L70n40P21l98k98M95o07M44K93
3797C45l86J16J02n6n5k12R5K81j97Q4k43j44L12k70K78K80n08L9J90n15N38J2
3819H6k00L29l19nP1l27M35n7j47N41o73J19L02n07N02j4k89L22q5k72M27n66
3841c27L12L01l69L94m97k04N00l44K42L32m30L34k48j87M00l35q7O90o21J64
3861B0K8l77L08Q0q4M87o83K56p9m49N91p6j43M06n35L2M96p88N78j12o8K02j46
3884e6r2J15k63L39J3j06L17l59j89O25l97R4K59l24L31r4n32L87j40O6L13n15
3906b08L04K9l93L71l48P6M83n73K17Q5m11L63J78k08L61k46k57K65j98L22k23
$$ y = [-76, 92, -139, 173, -78, -47, 158, -180, 116, -7, -139, 207, -22, 83, 238, -271, 36, 305, -295, 460, 5, -271, 81, -210, -17, 95, -174, 201, 95, -295, 71, -235, -135, 235, -305, 416, 18, -280, 215, -392, 52, 345, -41, 75, 177, 121, 66, -146, -51, 230, 33, 117, -126, -270, 42, -228, 50, 330, -178, -139, 51, -464, 74, 86, -114, 215, -104, -109, -38, -365, 70, 13, -134, 407, -266, -147, 155, -352, 150, 136, -153, 169, 84, -188, 239, -327, -15, 286, -83, 311, -186, -390, 110, -234, 8, 340, -90, 244, -4, -191, 209, -126, -213, 477, -144, 20, 48, -329, -21, 59, -25, 462, -221, 35, -44, -493, 98, 22, -121, 285, -250, -218, 278, -510, 68, -44, -112, 90, -56, -148, -33, -296, 43, 56, -50, 267, -92, -281, 344, -53, 41, 300, -24, 307, 213, -319, 68, -72, -6, 307, -208, 96, 125, -268, 103, -245, -169, 314, -259, -42, 43, -368, -5, 173, -35, 326, 80, -177, 88, -110, 212, -11]
3927a1l3M39m85pL46n46K46J64m42O93k69m16L00l73M67P6k04J33j36j40L95l44
3949a47J11L06m44M71k22l12L94k53mN28m45J77j14k89L89k00L8L08l74K48ol42
3971a82O42m22j19L91l55kJ27m46M06J30k05J50k92J45K62m08K79N3k36M58l61
3992A5j58L86m49L97j02l20M66j31m68O19m02k8K33k69L25l1l55M69l48J57K91
4013B97m92K25J32m85M31l26k8N05m59Q8K96l51K34j00p7L19l46K78n3m74N92
4034B06j40l12N38l36j13K17k63K06J51k74J35q1mK29k80J53J46j93K88j35k25
4055h7L74m78K25K48l15P5P6k62L52j32p3K71m46M02j20k63L87l60J87J98l65
4076a06J67J19m09M98L9l38L10l36J13K15n30M06p4j49M38m56J06O4m35M59j56
$$ y = [-11, -44, 395, -90, -97, 249, -297, -51, 113, -329, 364, 95, -321, -21, -394, 73, 149, -55, 78, -58, -198, 197, -147, -36, 270, -174, 297, 75, -237, 157, -96, -100, 428, -17, 160, 46, -243, 146, -54, -16, 292, -82, 166, 160, -182, 460, 38, -81, 310, -45, -47, 80, -366, 40, 170, -35, 115, -177, -32, 230, -178, 101, 154, -82, 376, 15, -143, 243, -206, 191, 89, -231, 235, 104, -364, 255, -147, -175, 58, -211, 114, 83, -272, 197, -151, 6, 297, -195, 30, 162, -323, 108, -218, -246, 259, -200, -112, 184, -167, 67, -33, -110, 209, -137, 141, 88, -386, 206, 66, -246, 292, -44, -157, 60, -203, 3, 154, -120, 15, -66, -70, 159, -121, 32, 178, -15, 273, 138, -87, 287, -191, 34, 282, -33, 42, 118, -144, 208, 76, 3, 274, -172, 230, 110, -153, 234, -126, 61, 259, -106, 61, 180, -229, 269, 308, -30, 280, -56, 57, 272, -258, 148, 74, -75, 363, -93, 13, 77, -358, 101, -55]
4097e5j83K98j15k65N03l13J21J65l70M24j14k34L91l28Q2R1n58O98k25l25M91
4118A79k95P6L80n63K27m1j46L09m1l59M28m10K89rl90L78N1j73K76k61J01K97
4140C03l60KN5o1K88k28r3K30k69L71q3j85J69k56k5M83n35L18Ol07M05j50j90
4163a12K80j94q1M60o17L41p1j27K78l64J29K35l78L08N5l50N32k18j21K38k63
4184d0K5Qj18K18j62j90L36j98M3J36l47L64ql86N50m00N4R9l12K27J88k53K10
4207D4Q0j65J07j80J74o0k49L63j38j77M14l54J94J54m20L04J36m29K88j40L8
4228a6K06l31K06J15k58K12j77M9J09l92M22R7n11M94j54k59N28m06j21K61l01
4249b27L50o2k86J70K3l1L19n10K68O0l51M68j85k41M45l16J64O7k07J18R5j83
$$ y = [-55, -238, 60, -55, -320, 183, -130, -9, 156, -214, 210, 96, -138, 253, -75, 7, 98, -460, 238, 13, -312, 179, -116, -40, 340, -223, 4, -37, -183, 126, 85, -274, 154, -256, 33, 24, -366, 12, 63, -110, 166, -95, 6, 303, -57, -55, 0, -61, 227, -1, -94, 136, -133, 238, 155, -30, 139, -117, -142, 341, -194, 124, 130, -177, 228, 78, -112, 168, -26, -107, 353, -264, 77, 6, -121, 157, -207, -78, 157, -221, 87, 142, -208, 324, 106, -15, 223, -40, -15, -7, -125, 93, -69, -259, 77, -121, -78, 58, -289, 75, 67, -319, 231, -169, -115, -16, -328, -101, 87, -166, 44, 124, -41, 66, -114, 60, 0, -249, 114, -24, -201, 213, -141, 53, 207, -213, 91, 227, -202, 86, -54, -16, 190, -141, 65, 180, -78, 134, -43, 6, 115, -277, 145, 242, -269, 225, 71, -188, 340, -66, -187, 74, -227, 123, 61, -225, -55, -32, -63, 256, -254, 14, 74, -277, 191, 6, -235, 210, -106, 58, 125, -82, 36, 131, -52]
4271e2K22l31K18K36n34M90k07l21N94l88q4O76p07J94o2l05M94r8j34K63j80
4292a6L1J33m78N05k55j00M76l26m0J29k27L49J8l63M31k33j81K60k53J91k6k21
4314a96M67l35j25L16k80J81P0l60M15k55j36L70k76J10L30m12K69l2l28K71j40
4335g6J79J69l90K80J6m65M88k14j68M10n42K00L00m15J66n9n0L63j23r9q2j58
4357b70N57o9l02L66l51o5M27l21n4J86j74K93k21o9R4k0K2J63l08L30k13l12
4379c11L69k36L00J34m09J14N5k76M40j88j11K93k74J29K00m25J12o7L5N16m18
4400a8J92o6l24L71k7l70L06j83n6K92m19L29j19kR7j94l9L70l90L04J20m63M78
4423A89l18j32M78k36J11J17m35L43j51j27K05k17K06R4m54N11k00j22L65k15
$$ y = [-52, 170, -161, 57, 293, -241, 249, 42, -279, 315, -73, -157, 519, -188, 6, -56, -361, 133, 35, -99, 164, -16, 15, 148, -330, 175, -80, -180, 296, -30, -70, 59, -168, 181, 199, -164, 267, 34, -147, 113, -140, 51, 25, -196, 271, -64, -189, 127, -153, 28, 98, -262, 153, -102, -238, 132, -144, -34, 296, -116, 153, 121, -207, 64, -76, 103, 272, -118, 162, 178, -287, 201, -13, -181, 229, -313, -113, 187, -228, -62, -121, -171, 192, 69, -30, -112, -270, 287, 218, -84, 282, -69, -134, 293, -28, -82, 104, -70, 223, 2, -67, 27, 7, 29, 192, -116, 214, 1, -311, 58, -178, 122, 256, -153, -39, 16, -260, 180, -8, -119, 174, -100, 29, 229, -196, -84, -151, -116, 400, -18, 174, 108, -216, 155, 128, -242, 64, -119, -175, 117, -302, 27, -92, -94, 3, -191, -230, 140, -250, 54, 174, -289, 189, -129, -261, 217, -19, 92, 209, -226, 117, -34, -161, 44, -173, 33, 127, -327, 184, -16, -138, 227, 12]
4443A2j45L20k91J31n3j25J10Qj16K78k17j60L73j84J13L5j86L47k85Q3%k00L07
4466A55J05l28J23M8k55K60l42J58K00j76K11k94m4L80k59R7N4k45L74m6k72J68
4488G2r0N1K61n42J51K4k05K36J61l5j1j14N9j07r5L19j52j22M48l16j18L34m72
4511b63L88o2j46M20n89L51L4k19J40J2j64L97j72r6J26m03L38K15k80K50l50
4532g3o7J62N3%M7l64K71%j24J99k71O5L42l74J77q8j78M45j72L1J76m00K75j99
4556f7k14M07l3l06M20k67Q3J37l97M29l7k84J87j00l3K73l83J57k8j04K40j53
4578g3O9K19m39J94J00m47M56j00j13K90j73L5K68m28K64j13q8K36j71q6L11l32
4600a21L35j52l30L48j08KL40m27J12R4k30L83k71M7K32k84MK24k90J09Q2k49
$$ y = [12, -133, 187, -104, 27, -26, -151, -41, -33, -149, 129, -88, -248, 125, -59, 54, 89, -97, 250, -35, 48, 48, -152, 155, 260, -68, 55, 103, -152, 108, -234, -76, 124, -52, 159, -135, -179, 201, -58, 39, 93, -152, 222, 176, -96, 72, -18, 33, 294, -248, -97, -73, -278, -42, 119, 84, 73, -41, 18, -89, -184, 135, -17, -139, 309, -7, -125, 209, -263, 125, 63, -83, 337, -252, 99, 133, -86, 54, 66, -98, 299, 127, 31, 157, -246, 92, 307, 27, 277, -73, -140, 22, 75, 75, 122, -242, 29, 29, -95, 104, -167, -102, 240, -134, 43, -45, -223, 222, 50, 81, 257, -143, 132, -67, -281, 126, 93, -213, 207, -60, 23, 160, -237, 192, 155, -129, 58, -42, -75, 198, -185, -28, -56, -160, 80, -73, -4, 215, -224, -30, 70, -377, 79, -21, -134, 156, -17, 18, 286, -142, 122, 9, -79, 157, -14, -100, 211, -121, 214, 62, -268, 80, -28, -26, 314, -113, -1, 93, -137, 246, -25, 22, 254, -30, -26, 198, -92, 17, 99, -150]
4622a50L88k30j63L71l87K19Nk3J06r5p1K31l67K18R4m02L26k77K2J63q6J20P2
4645H4j03N9R6l72L99k29j1L32l75J64j5j67L89l48n8M04m36K66O6l03J80J6k26
4668a88K72k86j6K69j88K89j06j40K15m01K45K58k75J56k8p6J17l06kL31j51j28
4690a39K39j87Q8q4J3J56j26J18J16k84K62l87O9K45j73J97K98l65N7Ml50M35
4712B02j43j28J61k07J08n6j24L92j23k82M31n30K19J94k76K31k6p2K79k49j09
4733a08M05m95K86p1j93M34j48k30K26l26K97k9j87J61n0jK68m29K7K51l84J63
4755a33J64k17J46J8M2R3l50J97J89k11K86k58j6J43j27R2K50l86J99k34j37M41
4777A91k77j4K57j89j2K40k75J00j82J85K7k40L04j70m9R2O1k65K56k21M4L16
$$ y = [-150, 238, 8, -155, 216, -171, 48, 53, 30, 136, 41, -30, 201, -166, 52, 146, -256, 70, -207, -185, -22, -108, 12, 84, -19, 40, 136, -236, 163, -66, -77, 255, -120, 44, 29, -138, 251, -97, -155, 249, -187, 79, 145, -158, 22, 38, -188, 84, -202, -218, 51, -137, 152, 46, -94, 121, -280, -35, 223, -52, 104, 76, 0, 117, -189, -191, 140, -11, -139, 100, -87, 1, -83, -70, 86, -40, 78, 194, -90, 172, -215, -146, 99, -74, 123, 421, 56, 113, 117, -233, 202, 59, -69, 92, -115, -7, -63, -187, 205, 82, -200, 231, -299, -80, 114, -162, 69, 43, -29, 250, 1, -108, 297, -198, 88, 17, -176, 258, 110, -120, 106, -220, 77, 48, -139, 22, -28, -29, 239, -190, -163, 88, -296, -133, 31, -186, -40, -22, 20, 113, -237, -40, 149, -62, 224, -34, -50, 93, -34, 58, 308, -78, 121, -113, -250, 191, -86, -100, 157, -32, -44, 196, -79, 21, -161, 24, 51, -189, 115, -55, -104, -12, 49, -216, 40, -181, -137, 179]
4799A79k41K53j64k18L42j94JJ88j92K17k5l78M40k72J26K5j74J39N4k55K34q
4821G7j65K38l19J65N2k28L13M4j24J61j70m1L7k45K46K05l13P4j71R5K03j98
4843f4K10r3j00J02Nj35P5j81J88J59l48M03k70q8K45j15j47J98p5J04q0p3J51
4866G1Q3k97L40l44K48p6k72L55j96J03J65k13OJ23k13K26j42L5K15l01J32j2
4888C6k34L14P3j91J52p1j96L20k54J04r9q9K93k42J2J75k10Q7L21m22K15n1k36
4911a93M10k65J27o6j70J66l9j03K80j58k44K79j81K31o7k00J36K7J0O6j83K39
4933A02p9l04L07p3j8L91j82k39J16k2l1j0k03L32k38p5K84j24K23r3j05L35k94
4956@j85K72M2o9n7r8J80M2k54J88RK8P7l80K47J4j56K66j87p4K78l40L42j13
$$ y = [179, -62, 191, 27, -191, 151, -43, -42, 146, -46, 171, 146, -232, 208, -64, 62, 87, -87, 52, 106, -149, 85, 77, -88, 150, -169, -4, 48, -180, 133, 177, 53, 214, 44, 3, 40, -205, 41, 246, -67, 7, -164, -69, 134, -64, 146, 53, -47, 55, 60, -75, 0, -181, 7, 166, -182, 221, -49, -137, 108, -7, -154, 44, -31, 73, -7, -80, 71, 154, -143, 197, -147, 101, 25, -247, 108, -88, 15, 180, -33, -27, 96, -117, 109, -33, 2, 217, -84, 48, 36, -198, 116, 189, -2, 150, 79, -117, 203, -51, 53, -46, -135, 158, -84, -72, 103, -107, -20, 301, -121, 94, 43, -193, 217, -48, 79, 13, -157, 9, -30, -133, 147, -11, -255, 24, -157, 74, 7, -193, -57, -30, -20, 46, -137, 102, 23, -281, 26, -47, -65, 326, 144, -95, 21, -1, -32, -42, -245, 87, -151, -226, 58, -66, 157, 64, -41, 294, 0, -185, 87, 129, 60, 3, -95, 85, 127, -127, 61, 70, 98, 175, -205, 42, 56, -100, 166, -21, -95, 183, -157, 185, 72]
4980G2l17L81j14j63J36p8Q3K8q7J99j6k40L12l68J83J42j30m7K29j76M0q9j23
5003a43J75n6K63j27j24p9N2n2K86k75J32M9j39K0m4q6K77%l8J37l17J02j61M7
5027a01K74m9k52K74k89J48O1j97J69P4k3N2j99n3J42k54J76J82j55J12k97L27
5049A22j02j21J98l8j14K02k33m5K95m15K51K46m68J78Q5L6k9q8J52l6l06L59
5071A29j06j08R6j76J83j29j4P5N8j70N6j19K09K2p9j12L19l28J93j7q5J77k45
5094a71K6K09j66K2N2j6M4Jq6Q4N3j31K10m89M94j35j35K69l04K03K41l70L27
5117B32j80k33K87J6n2O9j21K7J08j58M6K6K7j4k28R5J07j86L22j32k72J58n9
5140a15K18j42r4J41J06l02L11j43Q4J04k52J28J28j27J97l67NL25j86j7k8ML5
$$ y = [72, -245, 136, 22, -141, -5, -83, 0, 28, -59, 140, 124, -116, 196, -172, 11, 153, 23, -24, 205, 29, 69, -20, -143, 32, -24, 239, 112, -12, -91, -39, -91, 195, -80, 52, 101, -38, -18, -62, -148, 129, 129, 91, 228, -89, 13, -148, -101, 173, 124, -128, 146, -143, 5, 66, -131, 38, 112, 89, 141, -58, -111, 31, -223, -47, 135, -20, 92, -205, 122, 20, -101, 97, 59, -55, 147, -86, -131, 164, -251, 0, 246, -222, -44, 41, 77, 48, -40, 112, 76, -230, 129, 23, -85, 11, -165, 18, -111, -125, -50, 8, -162, -106, -225, -16, 6, -73, -185, 134, -194, -1, -18, -103, 74, -171, -145, 64, -102, -80, -28, -44, 0, 1, -85, -1, 52, -79, 131, -358, 136, 1, -134, 135, -169, 34, 275, -95, 232, 52, -181, 106, 122, 70, 139, 18, 45, 153, -5, 41, 67, 94, 80, -148, -53, 54, -132, 190, 58, -214, -56, -115, 103, -39, -133, 8, 114, -188, 123, -20, 64, 168, -84, 44, 172, 45, 242, -125, -120, 205, 19, 2, -26, -22, 13]
5163A3J6k21L64o2J2r8j03J67j01r1L24j92M6K6k80J43j6lk9j5J21J01l05Q3Q6
5188a4j68M55k90m1J98l73K43R4k20J72j70J9K07o9j61J33j38L00n8j20J42j82
5210d1j04J90r7K10n5k65K23j6Q4k3p7N7J14k51J23j77o8K45j67R9J7j90L13j52
5234hoJ21j02m6K99m14K68j34j71K88j28m0J21j09Q2r1k33M35j63l6K02j90p3
5257a28J81j16J1M9j32J25j61N9M02l84RK14j89J72k44o4M15l27J64J60k62K17
5279A71n0j49K17j71q3L95l82K4Q6o6J79k09LK81m01J32L20m64J23L6k9KJ3j04
5303a26K13n0O7l4k76L53k25J70k5j15K09j73j39J81J08k81J84r9J57j39k5J33
5325F8j44QO5p6R3K13l03J74k13L6L31k45Nq8M6k1J84j23P2o9l3K50l46q7J95
$$ y = [13, 29, -192, 172, 110, 122, 24, -79, 88, -13, -104, 220, 28, 74, 100, -180, -37, -53, -56, -85, -100, 21, 122, -183, -100, -14, -182, 273, -17, -58, 140, -233, 10, 104, -116, 56, -114, -95, 112, 43, -118, 15, -123, 177, 119, -1, 141, -41, -145, 45, -52, 158, 103, -162, 61, 45, 129, 106, 29, 86, 200, -51, 72, -105, -173, 72, -95, 4, 21, -169, 144, -8, -14, 107, 5, -41, 258, -156, 112, -22, -193, 95, -33, -73, 48, -61, 21, -70, -303, 132, -31, -67, 135, -55, -128, 53, -63, -52, -3, -135, -10, -171, -112, 290, -94, -85, 129, -60, 112, -132, -196, 219, -108, 56, 216, -46, 171, 121, -28, 189, 18, -65, 330, -52, -28, 58, -8, 171, -38, -35, 246, -155, -23, 297, -167, -44, -8, -37, -35, -22, -126, 87, 37, 104, 70, -206, 147, -78, 92, 67, -48, 161, -12, -151, 30, 138, -143, 41, -58, 99, -40, -65, 68, -76, -68, -3, -79, 14, 227, -76, 98, -115, -79, 252, 7, 12, -76, -30, -51, 133, 10, 82, 13, -20, 230, -116, -203, -8]
5350hn0K67k81j85K38N8k6l4o0J09J33k06L45k67p9K01l47K67m7Q1k04j09K86
5373H2j13n4K59o4k15L06l76p9L91p5j38K44k07QR1j53J63k22K11k4j65K08L8
5396A16l16K42P2k40J74j20Q2K1j36K24k1j43K20m06M9L16k30J97j7r2j1r2J43
5419C2K96n43K77j7q0K00k11j98L64j31J9K13l86J82j2j4J85j99N1j12m4J84J51
5442B07m05J87p5o0J07r2K12Q2k28J54j10j33L24k19J00j57j71L13l3j8J39k73
5464a49p6K44k01K23J97m70K09K7l4J58k27J61p3r6J53j45M5K24k86N5ln9O6q3
5488a40n3L95j08p8J97l14J9L73l57L75l07m0J61k84K10rk3R2Rj97L05l72K28
5511H2k7k6J20m9j41K38k52R0M6j75K49q4j78L29l16M4K83k58M2M2k88L68k69
$$ y = [-8, -58, 209, -72, -257, -19, 39, 13, -21, -81, 28, 161, -45, 300, 33, -46, 155, -192, 75, 28, 109, -95, -204, 82, -31, -85, 174, 110, -105, 201, -175, -254, 137, 62, -76, 168, -39, -31, 60, -93, 70, -152, 59, 35, -130, 78, 116, -200, 42, 114, -126, 48, -72, 10, 31, -105, 119, 98, -45, 175, -231, -182, 134, -96, 101, 84, -8, -19, -111, 32, 328, -215, 62, 45, -35, 165, -46, -244, 120, -11, 8, 221, -165, 17, 5, -9, 176, -23, 28, -84, -128, 56, 207, -198, -11, -86, -146, -39, -131, 81, 163, -65, 89, -21, -154, 170, -49, 51, -106, -277, 36, 3, -15, 124, -149, -225, 19, -182, 41, 238, -232, -23, 4, -30, 128, -99, 62, -11, -107, 46, -99, -54, 170, -116, -61, -64, -123, -57, -140, -193, 202, 94, 16, 213, -101, -82, 291, -66, 309, 2, -38, 123, -161, 49, 40, 17, 109, 118, -79, 226, -146, 82, 55, 29, 149, 100, -41, 197, -55, 35, 81, -94, 155, 71, -107, 222, -94, -50, 233, -25, 17, 59, -229, 139, -130]
5534a30J06M2j64K93j9l01J18L8r0K28k10J53lk9l1m8k8J24j07J9J42j8k20J74
5558C9j38Q0K7j50J64k10J65kj92L12l9k81L77j68o5K48m19L64j31p5J07l8M4
5581A9lk87K39Q4J9K14j10k38J94j08n4K7q0K87k85q6J66P4j03K07l44J71J7j17
5605i7J60J3j3r9j80J31K51l20L03k02M9O8k74L82m6k72J93J0p8K03k27n8M1j0
5629g2K99j81p3K13k29j06L02k18J38jk34K65o8j85J53r5J27P6k51K20k00N9K06
5652A45k84L23j25l17J90J32k17J39j59R7J45k26J17J14k24L24k23j35K68q1p2
5673f9J30k63K79J3j96P3l3nK19k07J28N5k89L55k19M7J53l77K10p7nK07k86J58
5697AK09k15j08P9o4K33j69J0J5lO7R4j04p8J8j53K05l5j3J30k35K04j78m4R4
$$ y = [-130, -24, 18, -146, 147, 128, -173, -55, -17, -107, 121, -89, 64, 61, 32, 1, -47, -75, 49, -58, -39, 103, 85, -135, 39, -99, -19, 8, -142, 22, -188, -23, -25, -217, 95, 56, -225, 152, -16, -81, 167, -252, 112, -19, -94, 13, -25, 19, 16, -271, -32, 52, 71, 285, 175, -63, 131, 23, -31, -4, -84, 203, -82, -168, -2, 72, -31, 176, -168, 3, 20, -97, 63, 76, 63, -36, -216, -85, 166, -154, 149, -53, -4, 64, -210, 172, 126, -146, 47, 57, -21, 182, -45, -103, -62, -72, 227, 46, -27, 186, -43, -149, 153, -65, 73, 72, -162, 103, 35, -150, 3, -92, 35, 111, -140, 80, -120, -61, 145, -139, 184, 59, -258, -68, 64, -153, -14, -173, -76, 69, -157, -40, 74, -150, 174, -49, -184, 84, 3, -69, 61, -202, 77, 90, -106, -33, -66, -71, 148, -59, 69, 124, -165, 190, -29, 18, 171, -206, 4, -73, -78, 129, -157, 1, 210, -5, -113, -34, -98, 135, -34, -24, -9, -12, 55, 149, 45, -33, -15, -168, 37, 2, -11, 119, -116, 88, -90, -134, -40]
5722d0l7M9P7j84j10L78j70k28J56r3K84j46j65K81k21L35l06J69R5j65J25n1
5744C3m6R9l7q2O0M3p9J37l28L62j97j39K43j44NK31j75l0O0k05K25J9k20K20
5768E5l1q7Q3j61J10J27j05J74l16J56J13j99K71k50p8K12O5m20L84j83J56j59
5790h3j27K45lj98K50q8P8O5p4O7j05j44J97nj25J65j68M6Q2l21K37P3j04P5p4
5815c9K8K62l79J94j5j02N9j56kL05j65J3k7j01L77k09j15k1o9J10M3q4J94j66
5839f5P6n5L5m0J43k44K41P0k73P3p6J3j8J44q1j0j20K72j81J05j30J47m8j19
5863a41L5lJ30k86L96p7R4m8j79P8p6N3J88q8p9R4j53j9P8n0K19j82j69L53k48
5888h0J91j71M3J45q3n7Q1k40K00J05j85N2l5j79K53O8pn0r4nJ66m5p4R1j72J66
$$ y = [-40, -77, -28, 49, -135, -245, 133, -37, -265, -109, -202, 82, -64, -229, 52, -169, 166, -140, 29, 124, -41, 84, 33, -13, 86, 49, -33, 27, 70, -9, 128, -200, 162, -35, -174, 69, -75, -70, 161, -14, -44, 16, -189, 36, 55, -165, 55, 24, -63, 20, -141, -31, 96, -9, 165, -151, 5, 118, -81, 190, -60, -138, 74, 139, -281, 103, -80, 76, -83, -210, 35, 32, -166, 84, -4, 74, 139, 65, 132, 27, -117, 80, 75, -50, 115, -53, -7, 75, -246, -9, 64, -40, 35, -39, -11, 251, -128, 66, 51, -51, 8, -148, -150, 155, -10, 3, -24, -125, 252, 43, -72, -93, -162, -52, -9, -93, 101, -65, 11, -44, -9, -49, 94, -150, 91, 161, -112, -39, -115, -102, -120, 24, -57, -67, -187, 85, -96, 9, -121, 26, -22, -141, -106, -109, 21, -265, 131, 54, 148, 100, -79, -1, -77, -24, 164, 76, -3, 91, -62, -81, -3, -53, 166, -16, -185, 168, -80, 111, -60, -17, 128, 45, -12, 69, -171, 29, 134, -51, 1, -34, -213, 40, 108, 101, 51, -43, -48, 118, 73, -1, 90, -82, 84]
5914H4j43M0MP6k9k33J33K34k30J84j93l6Q5j3j15K64Q3l26J81j23Q6o5Q9m4k9
5939c6N9J39l50K38m7k14K43J3k41L29j81O1k0j07J54L2m5R6j89J15P3j62o7K37
5963A30j44Q7Mj84K83j06Q2J21l03OJ9r1K15k56J75j9m3j32J22j11M11l24J84
5986A26l5q5R6j73jO0R4j83J58j70J77j04J7R9J19l27R1K1J8O3k72K45P2k17J31
6011B0j53m0K35r9K9N3n5K6l7l0k6j53J53O2j49J87k33J60K78j09p0K22l03m9
6035h1K12k23J34k6L0n3n9o5J78j89L19l0j42L2J4j06K31l01M4J91o1l2j39J10
6059a2J01j71k4R2L3J97m03m4J81R6j03n8KK37n9j17R6l2K4L2j20Q5J16k66J94
6084G7j18KJ77k75K17k7k9J65k08J33m0M6q1m6n4M4k2J38o1l19J25J98j38J67
$$ y = [84, -59, -19, -15, 61, 32, -201, -68, 166, -64, 120, -73, -109, -24, -37, -152, 112, 195, -131, 50, -73, 13, -52, 37, -7, -36, 23, 162, -188, 50, 3, -211, 32, 45, -196, 133, -48, 13, -7, -114, 40, 72, 27, 123, -66, 49, 122, -40, -107, 130, -14, 73, 77, -107, 176, 70, 152, 273, -30, -24, -5, -96, 119, -137, 38, 19, -24, -156, -34, -145, 266, -58, 126, 91, 6, 102, -71, -72, -12, 82, -101, 57, -113, 64, -40, -23, 76, 195, -132, -41, -20, -2, 61, -211, 34, 106, -111, 20, -133, -173, 62, -37, -8, 45, -10, 16, -21, -51, -77, -230, -77, -15, -164, 23, -210, -50, 228, 119, 49, 271, -32, -81, 131, -92, 42, 16, 46, -7, -66, -131, 47, -142, 177, 147, 5, 37, 51, -55, 176, -125, -81, 110, 49, 17, -122, -12, 89, -82, -106, -14, 19, 216, -187, -231, -50, 46, -57, -115, -113, 124, 65, -52, 44, 12, 36, 68, -52, 33, 149, -117, 77, -41, -39, 138, -137, 80, 53, 24, 189, -19, 114, 74, 120, 39, -7, -61, -17, -39, 99, 38, -281, -156, 42, -96, 71]
6108G1l1M1j65M3p5K17k23J32j1k40J16J3J05N0j38J46J13k08P2jj9J47j96k6
6132f7Qm6J99k74L8J2J80j36J6L0J96J31l18O8J22k92L05k45J21q9Q8J74k37J69
6156A53j09k6J46j70j42L20k79J5J0j2K05r0k7J03n4j61L75k55j4R7o4J11j66
6179c4J01M5m0j41J2n0K13k12P3lK0m1R5r4J34J05j60j66J67k9J11k21P3J40j07
6204ik15J35r0L83l04J73Q8k63J87jk45K22N0j88K38m4j55J4j4k0L20k13j5n7
6228b3j08J36j04J58J63m50L62l15n5L85l52K06J11j92O6J70k09P4j28J07P1J
6250G4L0j30k1J71j22p1J75j07o4R1o6J2p4J05J9o2K0J68k31J05K08j96o4j11
6274a41K18J55k68K4M0j48K9J45k50K02jQ1k20n6J51J51j74K54k07R4j5j36J96
$$ y = [71, 40, 81, -84, -41, -116, 101, -122, 10, -1, -241, -125, -112, -7, 43, -95, 51, 164, -44, 28, 27, 8, 155, -41, -67, -59, -105, 94, -180, -142, -130, 50, -86, -70, -40, 156, 287, -31, 37, 159, -133, 172, -73, 48, -41, 47, 221, -16, 153, 44, 18, 164, -6, -148, 172, -107, -92, -82, -94, 111, 21, -6, 97, 43, -118, 257, 2, -12, 85, 21, 132, -34, 67, 112, 72, -69, -57, -107, 106, -106, -33, -36, -16, -57, 38, -56, 78, 183, 23, -143, 24, -5, 106, -115, -42, 98, -9, -224, -89, -179, 204, -100, 73, 161, -102, 85, 84, -161, 61, 111, -77, 161, 117, -38, -24, -38, -58, 262, 49, 34, -23, -131, 5, -99, 59, 222, -228, 134, -181, -236, 149, -203, 3, 114, -78, -12, 158, -51, 23, -105, 2, 73, 74, 104, -26, -47, 124, 2, -69, 106, -1, -65, 26, -40, -28, -102, 3, 22, -40, -20, 148, -83, 22, 230, 34, -30, -141, 77, 232, -36, -12, 28, -120, -91, 54, -196, 6, 5, 86, -134, -190, -39, 112, -62, 192, -15, 79, 64, -72, 124]
6297A24ll00L01j75q5J93j47K62J00l29J28j07r4Q5q9p2K34j46J32J8j61J02O4
6320C5n5J67k03R2P5j94M9j7p1P8p3K28n4j9J05k14o4J76o1L2j5j62Q8L7M3J7
6346B0j8k3O3j57K55j37p3M0J07q9O5J2Qj7j79J67Mk41K81J1j92O8p3P0J3pj9
6373d1J6jK51l35J52j9p3J08p5PJ57k28K35r1j70J80j07n1j4m7K28j03n1K66j17
6398G7k31J78k1L3j0j08J76m4k4R7j08J5P1pq7J14j02L5l31R1L40k98j8J21n7
6423i8K45j77P3J01k67J5J81r3J03j49j3J59j36p0J74J6K2N0k84L15j26q2ro2
6447a12K39O0l57R9p0K47o9j19oK3J0rJ92k68K68j65P2l2j94J21J00l19K76Q2
6471F9l4K5m1q0N3j33L33k65j26J10L2OQ5k01K68j2j35J8p8J52P9k84K04K8m0
$$ y = [124, 121, -179, 122, -53, -138, 55, -92, 170, 270, -59, 69, -38, -132, -47, -136, -208, 26, -120, 12, 30, -131, -29, 35, -20, 147, -56, 36, 111, -83, -34, -51, -122, -44, -117, 111, 57, 38, 143, -71, -135, 41, -20, 12, -3, -165, -77, -40, 3, 20, 2, -21, 42, -115, 140, 3, -70, -30, 77, -12, 53, 65, 73, 56, -123, 44, 48, -193, 88, 99, -93, -25, -98, -28, -15, -22, -41, -25, -26, 225, -110, 42, 23, -50, 58, -17, -10, 147, -81, 154, 63, -107, 73, -34, -85, -99, -146, 82, -21, -72, 194, 77, -154, 24, 3, 36, 26, -82, 94, 50, 26, 123, 15, 30, 101, 94, 7, 121, 19, 54, -277, -186, 154, -144, -162, -41, -98, 147, -30, 43, 144, -123, -108, 73, -20, 83, -66, -79, 80, -56, -126, 48, 64, 86, 136, -148, 167, 41, -41, -50, -112, 127, 187, -170, -71, -141, 106, 37, -82, -88, -65, -55, -64, 128, -140, 128, -37, 35, 3, -191, -70, 30, -289, -13, 69, 35, 60, 19, -61, -8, -141, 192, -73, -199, -89, -57, -51, 34, -167, 101, 89, -46, -28, -106, 46, 125, -159, 45, 73, 33]
6496C3J53k21k6J64j24o3j5p5J50L5oK04j79r4J47j48qOP9Q4k80L81j57j07P7
6521A0P2k58J82n2j03L04k60J0R9J2m4j3j13K66k43J84P0l5J43l06j66K07p6N
6545a05J20o8J86j60o8L91k69O9nL9k53K62k47O2k8n8K79j11Qk7m1J26n3j31J76
6570I4M2j05m5j15J11J69l11L79k65J1L5P1J9m8j75K0J9K6J63k16k1K00K6q7P0
6595F7j63K13k49M3K88k55K0j3RJ77k21Q4J26j32pO5j77J6M0l4R9r2j4K41k71
6620a40J35Q5k4J75k24M4rk27K78j00J7P9j33j73M39k50j7O8j04J63j73J57P2
6643A38j01J14j75RL6n0k9Q2j05j33J90j4mM9j41J03Nj3R9j32N8J28k38J15j00
6668a09Q5K18l50N0J70j64P1k3o3L06k12m0J35k06J18n0O2K23k83K8R0j29n2Q7
$$ y = [33, 186, -35, -61, 103, -21, -84, -99, -174, -24, 11, 5, 209, 30, -64, 83, -65, -73, -67, 12, 96, -184, 197, 40, -67, 10, 82, -176, 6, -46, -149, 155, -105, -95, 4, 16, -28, -41, -154, 112, -131, 53, 123, 88, 231, -75, -241, -34, -110, -105, 15, -53, 133, -27, -95, 296, 27, 96, 91, 130, -123, 139, -108, -46, -74, -132, 147, 36, 44, 17, -24, 102, 49, -82, 94, 136, 31, -14, -129, -18, 151, -160, 219, -46, -35, 0, 71, 90, 42, -133, -113, -94, -68, 95, -121, -142, 58, 84, -3, 67, -96, 117, -132, -89, 199, -56, -36, -49, -40, 137, -84, 0, 126, -6, -13, 52, -125, -109, -69, -103, -4, -96, -110, 131, -140, -5, 80, 56, 231, 7, 51, 42, -185, 93, -7, 10, 89, -44, -217, 222, -28, -45, 23, -81, 82, -91, 66, 138, 37, 151, -24, -15, 21, -29, -58, 24, -81, -214, -24, -38, -42, 7, -134, -31, -26, -39, 60, -72, -14, 114, -124, -9, -109, -24, 194, -156, -106, 64, -100, -29, -52, -115, 191, -21, -61, 74, -132, -14, -64, -2, 221, -62, -34, 56, -73, -125, -38]
6692c8k43L17j69Q1N8j09L7J30j74J83j05O3J1j26n8J79j7j02J48k47K10j72J00
6715d3J46j44Q5j14L1O9M9j85J31J0j99L53l13K43r9j00J20k09J98J32k75M0J10
6738C6Q2k19J51j29J11j36nK07q1K0Q2l28J99j01Q6M1k15J62J0j30J67l7n7P8
6762fL0P5q9k0K4N7o8J93j97P1L0k98J35J96k1m7N1j16K36j78p6J31j48L90n25
6787a70O4K78k52N5j8M3N1Jm3n9j82O3K62k11L18j75j8O4n4j74J85j5j15Q7n2
6812f7J3J39j20K1r1K05o1j55P5N4p7J77n5k2L2l21L21l4j66M8K2l1J01k56L11
6837F3m5K3J28r1M4q4k42J79j0j15J77o8M1%J01n2L35m21J28L0j73K65k04O6m4
6862C1k76R5N2J6Q1qj38K12Q7j09q4J61r3q6J9M9j14J65J08l56J41M0o6J50j45
$$ y = [-38, -281, 36, -133, -52, 6, -103, -66, 64, -110, 73, -32, 31, 42, -84, -142, 37, 20, -82, 66, -181, 29, -143, -43, 103, -41, 44, -70, -39, 30, 79, -106, 25, 35, -164, 189, -124, 119, 20, -80, 40, -169, 29, 161, -114, -74, 36, 118, -101, 50, -79, 32, -104, -109, 98, 17, 37, 119, -209, -10, -111, -25, 16, -199, -37, -27, -157, 10, -27, -84, -6, 24, 99, 10, -10, 14, 71, 3, 196, -1, 70, 100, -198, -63, 133, 112, 65, 116, 0, 236, 58, -18, 113, -35, 355, -170, -106, 172, -80, -25, -43, 0, 51, 52, 9, -50, -232, -169, 93, -118, 200, 25, 7, 71, 17, -157, 28, 13, -102, -15, -67, -54, 85, -35, -14, -105, 100, 39, -116, -41, 13, -64, 113, 58, 36, 68, -253, 68, 34, -132, -84, -62, -93, 8, -248, 63, 18, 41, 169, 78, 122, 38, -204, -25, -35, -150, 27, -41, 0, 0, 101, 49, 384, -37, 91, 121, -52, 213, 9, 75, 31, -245, -150, -98, -82, -1, -9, -147, 65, 152, 43, -41, 120, 27, -59, -40, 9, -105, 60, 168, -188, -47, -7, -73, 77, -68]
6887f8N9J22k08J52m4m1J20n6pR1o6q5J31j58J57n7O6j4k08O0J63j71K08j87K05
6912A64O3l54P8O2j36J85j64L1L2Jj3jn0N6Mk4J04j20P1P1k28J62j11j06K42r6
6938g7J02J01p7j13P5o0J13j38j51J85L7j24Q8q1J66N2j56M1n8R6l1k14J52K51
6962A79q1O3p4j69P9m9P2m3o1J24P0j76K13l2j81R6p9O1LJ09j20Q4n8o1p0J45
6988D4J22j35kj26J72k7j54J73j23N7j2n7QJ98k63j61L17n9P2O2j60L9J21j15
7012ij7RN0j0l2J94j13j21O5p0P2L8j17J4Q1Q3j31l9PK23k92R8o9l0L1N1J69j00
7040C5k3L3j1l3J2J04j37P4j20p2Om7J16O0j46N6k6J8K53k94J47j09MP1n2O9J89
7067A77k06R5R4k85R8n5J24K6k6j30K65k06j27J67rM7o0p2J74j32N1J64l60J00
$$ y = [-68, -9, 113, -95, 57, 13, -28, 92, 36, 29, 120, 54, -31, 100, -58, 99, 42, 108, 94, -114, -54, 109, -62, 146, -41, 164, 227, -127, -49, 13, -123, 62, -102, -71, -39, -38, -51, -52, -102, -46, -42, -66, 38, -82, -11, 60, -168, -6, -117, -223, 19, -77, 25, 126, 49, -64, 11, -49, 64, -74, -225, -40, -3, -127, -39, -120, 46, 98, -58, -17, -75, 21, -10, -224, -72, 179, 98, 161, 87, -82, -3, -52, 20, -23, -84, 40, 110, -66, 147, 115, -66, 30, -49, 12, 15, 124, 4, 88, 30, -31, -101, 44, 166, 31, 29, -97, 75, 48, -106, 67, -56, 1, -11, -68, -60, 138, -125, -286, 31, -28, 44, 106, -54, -15, 106, -9, -26, -17, 33, 23, -9, 185, 72, -49, 16, -54, 18, 56, -61, -47, 34, 117, -14, -53, -46, 177, -115, -17, -86, -116, -85, -34, 135, 35, 12, 45, 34, 1, 13, 117, -20, 54, -66, -138, -132, -179, -63, -3, -149, -93, -119, -101, 152, -142, 5, -104, -100, -29, -81, -12, 177, -29, 66, 160, -125, -27, -82, 42, 68, 42, -88, 177, -29, -156, 11, 2, 49, -11, -83, 91, -41, 10, 174, -186, -86]
7091h6J1M3o1M8P3N9k36J58K1k17J50J14o3J53k65l5K13k27J85L9p6J99j51j82
7115a33J66j73K79k79J12J51j50j0Q7j75J47p9L3J07j19N7j03j00L30p7kK5j25
7138c1J4k9l9R0J2J0K1Q8j52J64k11N7rMjN3j71J69n1J58P5k39l8l9M6n3R2j19
7166a29J42K2K2k10N7J72j37J7L4j15k7Q4L6l0M9k5J05Q8j72K2N7j95K05m6l5
7191iR6j0j6j74Q6R8j81J78m8j08j1N9J10j01R2q1q6J62L7k16Q0R1j15n0J32J1
7217B6M4k61J03J23j16J3J79j34J21q9j70L90j47j23K21k20M8J63k60J02p2J82
7239A23j61J12lj71q3O7J88o9J03j68j25K41j01J70j61m9R9M6n1lj59J06R1j07
7263f5K06l69K65p5n0J43m6r2M0nJ09N3p0j83K14j85k0R0J17o5q6M4J22j27LR
$$ y = [-86, -75, -32, -93, -45, 28, 87, -149, 9, 30, -187, -37, 77, 14, 167, -98, -133, 80, -147, 38, 77, 1, 200, 49, -133, 33, -140, 139, -140, -28, 123, -27, -37, 50, -125, 22, -57, -24, 83, -36, 21, -82, -182, 148, 71, 69, 94, -31, -17, -46, -85, 5, 17, 27, 48, 136, -16, 148, -63, -6, -15, -11, -12, 41, -130, 39, -12, 146, 221, -18, -56, -95, -49, -102, -10, -129, 13, 35, 57, -153, -96, 76, -61, -44, -10, -125, -152, -68, -32, -62, -13, -38, 67, 155, -17, 5, 62, -133, 72, 26, -9, 87, 77, 61, -113, -27, 71, -110, 68, 20, -88, -99, -40, 70, -31, 61, -20, -106, 56, 93, -123, -43, 48, -67, -117, 15, 26, 70, -191, -88, 35, -81, -68, 111, -23, 98, 9, -161, 229, 82, -41, 180, -40, 8, 171, -89, 13, -59, 123, -38, 74, 71, -100, -183, -116, 72, 3, 106, -62, -187, 54, -47, 123, -38, -87, 12, 58, 7, 4, -155, -49, 42, -65, 141, -228, 37, -38, -88, 55, 9, -83, -43, -48, 61, 114, 44, -139, 75, -110, -130, -40, 77, 12, -74, -30, 92, -35, -32, -23]
7289b3N5J7j05p6L20k20J41k47J73k2q4o5K11m6M8k27L1J10M3m1K35k05Q3J3k13
7314i4m1P9n0K32k92Q6Q3Q8m7O5j08J3o0j21J78j5rL7j81J12k2o4P8j05P6J36
7340E4j52J35N8j27j0M5n0N4j2p7J38k27J65M3j15mO8l5J36j26Q8J26j23j66q4
7365a98J51J11j3nj99J39P4M3j36P2j63J98Qj12N8M8j20R2pj14J32k68P6K35N6
7390A58k1l56J79M8p3J44K1j86K28Rl35R3J7j7J61k20K72k8j37Q3j82K33m3oP3
7415A15j05L1J25j12j10J59k05P6m3J33j13O2p4Rj11L01K0j72R2j04J32j7p3l8
7439b2J11j09J59j54q0L0J93m3n6k60J37J22MO0p5N3L6l37J27K44j66N6Nk15J99
7464A9p1R7M5r3q3J38p5P9l3o2Nj7o2M7P2K49k47p6M6M7r4J65m0j80Q4N5J57k91
$$ y = [-23, 32, 49, -56, -132, 188, -32, 109, -138, 35, 13, -71, -136, 75, 29, 77, -150, -119, -9, 34, -7, 228, 23, 106, 119, -94, -135, -56, -106, 126, -166, -80, 3, 91, 44, 109, 1, 14, -46, -167, 11, -4, -13, 24, -157, -45, -67, -131, -53, -158, -82, 54, -98, 37, 95, -32, -42, 3, -47, 7, -5, -82, 56, -171, -6, 37, -78, -82, -14, -49, 87, -39, 49, 175, 52, -114, -198, -47, 64, 51, 46, -153, -14, 60, 103, -33, 39, -124, 74, 82, -30, 28, 76, -44, 48, 41, -73, 59, -209, -133, 102, 158, 137, -219, -40, 8, -65, 79, 100, -86, 142, 151, -184, -91, -74, -91, 70, -150, 122, 94, -43, 40, -142, 91, 48, 42, 115, 10, 41, 166, 54, -56, 103, -102, -26, -69, 64, -49, 13, -61, -52, -163, 138, 158, -14, 78, -26, 106, 89, 16, -22, 89, -20, 139, -15, -95, -65, 128, 85, 29, -231, -94, 28, 32, 92, 17, 70, 106, -231, -104, 140, -26, 30, 35, -180, 19, -52, 45, 90, -3, -86, 52, -23, 56, 23, -39, -34, -51, -113, -66, 6, 255, 8, -68, -22, 25, -69, 96, 56, -124, -40, 15, 172, -119]
7492a19O8J84j38R1k13lK15k78J61k6%J14k43K93j53j7P6K8q3J21j22M5j3L6j71
7517a47J52n6L7n5N3R0K7k50J13J51P5j62j36O9Q9j27J87j71J17j18J09k7On1
7541b5J01l8q5J13l0j01O8L2O2j12J23q4j21J33j06Q6j8J33J0k07R9j47J34j6
7565Dj09K43j10p9J17m0mR8j23p0m7J09j22j1K46j20K7J38j66m7K33l85K67j68
7589a19k0M40l83J35O1j75J03R3j91J24k35J82k0J03L7k52J8K8J0Q3J53m88K03
7612a10J96j49M3O5k31L31j99J74q4l3j5K1j61L06n4j55Q7k9P3k5j62R1M7n8P0
7637C9j03j59K53l9j40J09R8J45l95J65m8N4K7Pr3L64k23k2M8K1m5P3k48K35n1
7662G2L6L5j92R0j34M2K59l79K41r7j6N3qm3p9J73o4J29j77J6J16K7J42l41J28
$$ y = [-119, -51, 133, -5, 86, -127, -130, 85, -193, -32, -58, -58, 56, -187, 106, -47, -64, 12, 40, -43, 78, -44, 1, -12, 24, -147, 5, -51, -14, -69, -16, 74, 101, -149, -36, 115, 190, 28, -108, -39, 50, -77, 110, -61, 56, -62, 47, 20, 26, -25, 76, 38, -47, 66, 36, -65, 3, 35, 97, -15, 108, 24, -97, 36, -70, 16, -2, 131, 141, -66, 33, -114, 20, 4, -105, 138, 28, -51, 66, 26, 22, 120, -3, -73, -120, -11, -133, -144, 102, -18, 9, 147, -19, -66, 167, -218, 49, -119, -139, 301, -82, 53, 114, -61, 42, 135, -56, 68, -167, 15, -5, 98, 135, -117, -99, -71, -61, 22, 175, -313, -110, 86, -63, -20, 45, -186, 145, -54, 120, 36, 3, -12, 9, -152, 154, 100, -55, 32, 3, 76, 51, -111, -20, 27, -31, 39, -64, -223, 30, -9, -149, -40, 58, 203, -192, -27, -75, -21, 6, 13, -80, 284, 61, 39, 87, 108, 63, 136, -112, 123, 72, 108, 143, -49, 41, -93, -51, 208, -171, 70, -27, -43, 10, 2, -41, -120, 53, -11, 118, -59, -43, 73, 100, 242, -99, 29]
7687B9j4J40l24L71k55N8K2oJ84k32P5j9j22J38M5j74J88Q0k92K88k93J19K50
7710B56m82J65J51j85J29r7lK90l61Q8J1j9L0O2k26L14r8J04j05j02K22k19J44
7733F9Nj09K79l16j24K83k6j61k7J49j48J46j57R9J07l9J62j41rJ31j91l7J3p
7757d9l9J94k09K84k84J44Q1mj36O7o5J52j43j8J87k77K20J4k55K02j16LK19j86
7781a4J37M9k29k5o7K43m1N0Mj51P0Qm6K0M9O8p1J8j35n1J73n0j10J05j25J85
7807F4k12K23J5j28j37J75r2K56k00N5R7j78J2L1K5Q8j22J48k26R1J16j91J38
7830D8j04N9p1j12Q8J19o2o3%L31j20r2NN9N0q5P0r8q8O4j13M0J5J9r6K08j89
7857a18J41j5n4P7j95J27J91p3m9j01k6K05j75P3O2j44K00p9j02J85k35J52L0
$$ y = [29, 15, 155, -169, 202, -53, 5, 27, 21, 205, -27, 48, 29, -93, 45, 90, -84, 104, 184, -108, 180, -113, 6, 256, -226, -61, 90, -95, 34, -63, -66, 224, -137, -49, -38, -57, -27, 35, -191, 123, 25, 129, 24, -78, 144, -75, 69, 74, -35, 244, -72, -196, 87, 61, -100, -127, 22, -126, 20, -137, -38, 69, 30, 192, 51, 42, 173, -18, -55, -42, -49, -88, 106, -103, 181, -103, 41, 122, 118, -18, 49, -16, 136, -7, -25, 162, -115, 105, 119, -136, 66, -50, -47, 172, -14, 123, 172, -57, -82, -149, 94, 53, 103, 107, -44, 26, 34, -12, 8, 57, 125, 54, 72, -63, -114, 59, 9, -101, 4, -121, 64, -148, 75, 90, -38, -175, 0, -92, 164, -36, 19, 116, -62, -50, -19, 6, 94, -28, 120, -106, -15, 101, -90, 48, -56, 3, -68, -180, -92, 27, -35, -98, -98, 233, 113, 21, 26, 85, 135, 50, 120, 22, -66, -2, -115, -75, -60, -41, -137, 71, -118, 23, 8, -46, 31, -164, -37, 154, 81, 32, -69, -95, 110, -65, 8, 70, -74, 126, 47, -55, 130, -105, 47, 77]
7880G7k7N7J0j99J58o1j91K44j83J04K4j44K44j15K3K8m4N5k9q3P1m9o2J9K94
7905B21m38K09p0kK2Jk4K48j52N1q2j05J16j25K32o5j14J29N6k32J46p7k14K33
7929c6m3o9J76K9j5k9R4L4J8j43j67J78J14k65O8O8p2QN5R2K0j61J0J22j87K34
7955A33j22n9J16ql29L10j70J15J63j18M2q4j63J72k0n4J21l4N7j17j42J50k0
7978f1M9J54j77J29L8k34Q8j1j44J49j04L17j63p3ONk9J49j01o2Q6p3J79k10n9
8003a52K92p2k0M7j26R8k4KJ55j21n4m7L3oM9O7k53k1J72R2j23j2L5k19J92J13
8029I7o8j5p1LM5K6q6JJ6R6j1J13q3j34J7J5p2K47j66J28q3k12L52p6j09J32K0
8056A22q0Q7j24K0o1N5kN1j22k7L3k2J32j91J14N3k47J81R3j30N2j54J56J92k55
$$ y = [77, 50, 107, 117, -82, 76, 15, -176, 68, -115, -11, 13, -131, 113, -2, 21, 49, 5, 60, 31, -52, 19, -30, -92, -73, 221, -217, -8, -78, -80, -58, -57, -81, 167, 15, 66, -16, -121, -5, -130, 102, 37, -77, 52, 108, -124, 22, -55, -269, -36, -79, -148, 28, 57, 42, 13, 107, 141, 159, 16, -151, 27, 141, -124, -56, 12, -60, -52, 3, 95, 115, -46, -36, 86, -101, 133, 11, -48, 68, 60, -269, 41, -129, -14, 149, 31, 73, -11, -174, -2, -22, -76, 45, 11, 68, -49, -191, -41, -61, -12, 142, -35, 94, 132, -102, -14, -25, -169, -20, -124, 193, 30, -43, -37, -32, -61, 88, -13, -75, 11, -62, 117, -93, -152, 140, 68, 48, 95, -31, 67, 43, 45, 200, 79, 25, -22, 11, 5, 54, 121, -132, -153, 19, 111, -12, -24, 11, -208, -16, 97, 29, 14, -57, -54, -9, 17, -69, -68, -52, 44, 33, 146, 63, -71, -54, -39, -111, 136, -30, 98, 15, -197, 155, 79, -30, 102, 122, 42, 129, 5, 25, -36, 19, 17, 68, -54, -81, -48, -70, 62, -129, -15, 38, -209, -28, 65, -65, -13, -167, -11, 181, -74]
8081g4l7R5j85L85q9Nk37M8j7J41q2J23m6J6j7j05J24k1j90L24K7l44J56n4j9
8106g3K09k18J34q8j14L44k76O0J69j32p0R6j20J85j97J2%J34o2k9j2L4m0QK77
8131B31k65J33r1O6j59K36k89R0r7NL47l48R8J23j84Q1N4r0M0m9P4ok13K96q4
8156ar8K06k8j70LJ08j13POQ7J8j23K8O3K3O2j07J06Pk8q0Q5N4r7mp1Q5o3P7j05
8186f3N3M4r4J39n8
$$ y = [-74, -111, -16, -201, 184, 95, 100, -137, -89, -106, 35, -47, 76, 30, 46, 29, -76, 48, 27, -163, 161, 188, -156, 0, -54, -73, 136, -82, 52, -36, -150, 194, -82, -22, 147, 15, -55, 41, -79, 106, -91, -79, -79, 55, -7, -36, -48, -14, -54, -46, 231, -34, 99, 8, 74, -85, 151, -138, -48, -145, -140, 207, -141, -43, 80, -104, -23, 31, -59, -19, -68, 6, 0, -213, 83, -1, -99, 107, 79, -91, -88, 20, -93, -86, -80, 7, 25, -98, -70, -7, 16, 78, -29, 77, 84, 56, -24, 61, 115, 18, 14, -57, 28, -35, 42, -63, -10, 34, -60, 79, 21]
8191B1
$$ Imaginary data points
##PAGE= N=2
##DATA TABLE= (X++(I..I)), XYDATA
0@%%%%%%%%%%%%Qj6J6j6J6j8K6l2L6m4N3o1P2q5R5j08J24j43J65j88K12k37K66
35A41l01L40l79M22m70N23n81O43p11P85q67R57j054J159j277J408j552J710j886
54i90K087k316K576k876L229l650M159m791N600o672Q167j0385J3992k0781L7511
69B4860j45131j60681M97701j34375l09587L56832J20324l94942N8145K83951
79A97097k02891j50741K75623j9035k06009J47897M8798j92952N9857J48267n5354
90E0557p8125P6214L8010j52220M002J73783j00712p9441J80784n0671j64660
101a02479J47303O8728k06305N9013K42387j83173j79366K54396m0877k58959
111a99332K22488J08625k60161Q1981J56634j92163k5934J96322o1933j17111
$$ y = [0, 0, 0, 0, 0, 0, 0, 0, 0, 0, 0, 0, 0, 8, -8, 8, -8, 8, -10, 16, -16, 20, -24, 29, -32, 40, -45, 50, -58, 66, -77, 88, -100, 112, -125, 141, -160, 180, -199, 223, -247, 276, -305, 338, -373, 412, -455, 502, -552, 607, -670, 738, -814, 896, -990, 1097, -1219, 1357, -1519, 1710, -1940, 2219, -2572, 3028, -3644, 4523, -5862, 8130, -12651, 24860, -120271, -280952, 216749, 82374, -227213, 129619, 249943, -144999, -86854, 197097, -5794, -156535, 119088, 100053, -105956, 41941, 90739, -102213, -42356, 105911, 50557, -27568, 48646, 86656, -65564, -61562, 112221, 11509, -67932, 112852, 62181, -102479, 44824, 113552, -92753, -33740, 208647, 25474, -153892, 100504, 59627, -199332, 23156, 131781, -128380, -46399, 110235, -81928, -107862, 88460, 26527, -90584]
121i0584J52759L4993j76652M3782P7025j06596M8242Q3214j00485j7339O2669
132A1028k8082l8779L7455P0497m2494o3319Q4629L981j10698M5908P9173o0730
144a1431j4381Q7394m3326j13139J10270P9468j52945M6317J35463j49739m4334
155g0383J31064p1767o0155J02921j2326p3533O4737K2678j07515L9223J12730
166G7674q1065k1649R6094p2945m6613Q4634l1176m3120N8540J1370n2156j3395
178c3807M8304o455n8092M9022N4618n4185k3741K8191m049k6901J9253M1793
190C3951m7656j3633P7469n6482n2636J05766j2561p1723P1735J7266p3363J1738
202a0129L4988m0562j374O7305m4506o1012Q5660k235q3470O7574L4288o3426
$$ y = [-90584, 62175, 97168, -79484, -35702, 41323, -65273, -17031, 66183, -34302, -51641, 11028, -17054, -55833, -18378, 52119, 9625, -53694, 30935, 34916, -75782, -29874, 49299, -11431, -25812, 61582, 18256, -94883, 15387, 94855, -58090, -11773, 123690, -26049, -70383, 60681, -11086, -71241, 31680, 19354, -54179, 10558, 33236, -74279, -35056, 77674, -3391, -25040, 71054, -1891, -48504, 36130, 4954, -38166, 20374, 31744, -20412, -33807, 14497, 8042, -50050, -1028, 53590, -595, -24336, 3855, -194, -27095, -7842, 33951, -13705, -27338, 50131, -6351, -58987, 46779, 34218, -37505, 34230, 51496, -21867, -10129, 24859, -15703, -17077, 50228, 5722, -55290, 30370, 28135, -55335, 12239, 46527, -16899]
214a6899K3374K3054l8463m618K3079l582k4118K5154K2537n5119m885M6086j4868
227G32j2329J3930N889l154j9159J2481K669k7750L7569N516n2271L9580K1465
240B5168n8324J2512M4863j6807k2336K2950N082l8601K4490K5093n8799K4460
252a0249N2205o3707p386N2999k5574j7488K6237P268j4452j039J4879k1584m968
265a2859M0853k4644k6231M0086l960k4724O842P059P188j1932q8J5900k2691
278i201N426J8835l3612J0148L1681k7379j5474K0803J1320k0170r193L1390j1071
291C503j9472L3704j8649k1418M3661j2781l0483K9139J0131k0741q474J7059
303E179O657k1711J1819P796k3971K2030M569l1828K0512J3274j6896k048K047
$$ y = [-16899, 6475, 29529, -8934, -13552, 9527, 5945, -18173, 6981, 29518, -25601, -30486, 15600, 732, -11597, 2333, 8222, 5068, -14091, -1610, 1059, -26691, 10878, 16394, -35877, 3703, 25168, -33156, -20644, 24219, 7412, -14924, 8026, 13108, -25493, -1003, 24090, -34709, -10249, 41956, -21751, -29137, 23862, -1712, -19200, 7037, 14305, -147, -1186, 13693, -7891, -12859, 27994, 3350, -22881, 17205, 13245, -11479, -4637, 2422, 9610, -2322, -2410, 13490, -9201, -3775, 15060, -18552, -8404, 23277, -4102, -19576, 1227, 12547, -7623, -16816, 14574, 3503, -15969, 17735, -914, -22332, 21329, 8548, -21935, 7204, 17335, -3406, -11880, 5179, 11836, -9875, 1944, 9740, -14231, 7799, 12368, -19460, 1052, 14326, -2570, -4618, -2571]
316b571J1941o378j5869J8491l409q467J5050j5429j782K0327j0820p435L433
329b918J0031L145k4205J1175J7202k5587P876Q070j9995J6903L898k0705Q129
342f981J1624n05j4162Q17K2694j5457r874J9527j3969K079J4332k1375O121J5702
356A0573r716j347j078J0353N785j8719P832P508j0337O472q793l298J5527j1233
370d71l619M436j619J3251j1961p089K3213j0292q638R484r416O825K907j4817
384g806M734L881K080n652j0129K0913J29j8355J4409m111p146J3254j4922k606
398a1327J6137r329m517l81M706R630j2685K930J2411p200M092p087p728J6966
412F618o993q375P397o304O887k238j2646K0177L442j0510R364k614J622L567
$$ y = [-2571, 9370, 2992, -12877, 5614, 2205, -6262, 8788, -6641, -8423, 11904, 1084, -6351, -2918, 7113, 10258, -13947, -2772, 14430, -11157, -3281, 4789, -15206, 1697, 5595, -15110, -6981, 4643, 4138, -10024, -9207, 13487, -1970, -11844, 7683, -6286, -4207, 10125, -11250, -5129, 10573, 857, -490, -1568, 8785, 14570, -4149, 3683, 11191, 854, 7326, -1467, -4765, 10762, -471, -4090, 346, -1273, 11978, 17, -7072, 16141, 5849, -2789, 6695, -2721, 4104, 7011, -7806, -3072, 809, 2889, -2763, -12892, 8021, 8150, -10205, 4204, 93, -7053, 6201, -8721, -11327, 4810, -4519, -9036, -9417, -4711, 4919, -7766, -4836, 7575, 375, 4467, -2620, -10348, 6618, -375, -8750, -1353, -7657, -770, -3008, -15654, 4523, 7965, -2545, 6819, 4205, 5827, 9394]
426I394j1081K985M336L093k265j8914J1900J0669k0941J1188R062j2095R610
439F941p002j0002J2971l012n136l42K353Q762j3926n797J4970r10P059J325j1443
454c189J3040l647j3733R939l431K051L667j8636O377Q448j4688L169R767P416
468F550K016r834L376j292k14J3822j3482r80J9720j8524p991J2942n676O547
482F980K763n901J1524m280j3548j522M675J1856p540q424Q407j1003M64R796
496D247j2891J2949J3270j5896L241p83p264M664r310M489J3724j3662j3699l136
510b0057P286O703q447J0207O902j2762R257m936j3024K0967n95j0105J3117o260
524a747q410o83n374J1881J1916k554q684n871J3224n653j5635K0085M194j0746
$$ y = [9394, -1687, 1298, 5634, 8727, 6462, -12452, -552, 10117, -10824, 364, 9426, -2669, 6941, -61, -10063, 2908, -104, -5240, -5582, -3229, 5533, -8393, -14190, 780, -130, 6929, 8254, -3189, 9851, 6204, -7529, 2410, -1021, 1030, 4697, -13939, -7562, 886, -13802, -10633, -866, 6550, 8566, -1268, 2108, 816, 602, 14424, 942, -38, 19682, 1158, -6833, 6109, 433, 6980, 9743, 3842, 15366, 11086, -2462, -3984, 691, 12547, 5007, -3417, 4990, -6013, -5549, 4247, -8644, 4305, 17575, 1679, 4920, 4137, -3127, 1537, -7773, -3284, 10440, -3222, -16921, -20057, -12771, -6068, -14515, -4308, 2594, -10168, -911, -5847, -18871, 2096, 1501, -8604, 4513, -1747, -10157, -10840, -16214, -4333, 7583, 5029, -3655, -9526, 3698, -1955, -17590, 2495, 6689, -4057]
538d057R192j0158m788J1286o666R722J4868n616Q9p650o730J0671M244j250q272
553D885J469J0403k1737r579J9235m593L842J0726j1444L712m226j5151J5375
566B917J0331m770j025p077l321j730K549L350q884J5182J2389k6782j022R432
580A539j2919P129O938j970N339j6139j0735J2383M395K633J180K125L910q174
594b366Q73k708p880K0635K830j7020P474o611j1325Q549k15J1232J0529j7484
608c487l319Q559j691m127j02J3710Q40j0123M571j3133o696K1415m549j801J4554
623A4621j2685q445J987l189J1276K136q577K583J760j841j2330l034K0851R47
637F060k953P800j3190k494O402p601J2425P024j1727J158o491m936R933l892
$$ y = [-4057, 5135, -5023, -9811, 1475, -5191, 4531, 19399, 13783, 13872, 6222, -508, 10163, 14407, 13157, 4885, 6354, 16757, -4980, -14559, 4676, 83, 3925, 14651, 3207, 6919, 2693, -12458, 2917, 13248, 8478, 7453, 376, -2945, -4675, -2126, 1224, -7660, 7522, 19911, -6871, -7893, 1539, -11380, -4251, 2687, 717, 6056, -10083, -20818, -8435, -4040, -1407, -227, 1898, 5808, -2366, -1493, -4201, -12081, 8554, 11384, -5636, 1838, -4773, -16098, -7549, -7764, 3468, 13997, -3487, -6806, 1753, 62, -4065, -4167, 9543, 10383, 260, 4831, -8302, -14998, 6417, 1868, 67, 14621, 1936, -6509, -4522, -7711, 3565, 5701, -2876, -293, 1467, -374, -12704, -15738, 5113, 6060, 3107, 10907, -2283, -4777, 1625, -5976, 6449, 13473, 1746, 2904, -3587, -8523, 1410, -2482]
651b482k562Q901P548m104j8306L937J2110r266R522P844j4408L880m539j0462
665a2387J5369L745m616L961k548R34l743o871M207L828R118j524j7496O239J343
680d41j1123J1706L632j907N665j2649k031R411o638J444M662J116L832r490o681
695i492J287L569J1450n717m639J1697j1464o287J1579m402M632N842j1127L558
709D86K751q726j681L377J1217L20r762K356m883m88R657p660L891R516j2539
724b168j926L102l241O537l625m20J0203n404o106k286N53J0141k146k697L318
739C835o869L456j302q724J4245K026j1385P009j813m060K872n256M946O862l052
754B790k780o827N258N338r081O412M437o887N759n753n155J1905l781l206O206
$$ y = [-2482, -5044, 3857, 11405, 7301, -11005, -7068, 5042, -4224, 5298, 13142, -1266, 2614, -1925, -12387, 2982, 6727, 2111, 6072, 3524, 4458, 715, -6156, -1949, 1879, 10997, 9473, -8023, -1784, -441, -11564, 142, 3774, 1867, 7532, -5117, -7148, 2263, -4375, -2931, 1731, 2847, 6679, -2811, -9492, -8205, -4636, 6814, 1097, -3542, 8155, -3309, -9596, 1983, -2419, 2213, 8055, -3072, 486, 3237, -5489, -7170, -3793, 7424, 7744, -2018, 338, -4545, -5033, 4624, -3036, 855, 10371, -2168, -4094, -992, -4233, 2304, -1321, -1741, 8462, 3058, -3048, -5334, -4781, 5360, 3214, 517, 3835, -3034, 422, -880, -9604, 4641, 6667, -4718, 2291, 478, -3582, -710, -5966, -1020, 5842, 2790, 10, -6817, -1559, 3779, -5302, 1110, 5547, -1340, 4419, -1334, -6489, 5416, 1635, -1571, 4635]
769D635j357J428o278m478J0415n33j988M93n239N655k248p132P778j250O71L950
785D522j0394M846N932j1202L654N454j160J205o991O16M250k227K862m306J030
800a909R583j1434k421J0031n755J537J922n416O307j937n722K758o4N964j568
815A876q032Q477P46n116L183k688N119K484r602N065J343m076N088n363Q62R398
831H764p962k807M384J85K009n712P15N787o286J424j051n151J0425l576q324
846g176R457o72l219J219l459O018P4n672L068k213K521J763r519O396M441o483
862c456K659k040J542N816q637J249N941m669K168k882k342Q436m473l253L602
877c39l09M162m858k452R044m430j729L770n879N937J546j0133N958L735l593
$$ y = [4635, 3278, 4706, -1572, -6050, 4365, 3832, 1844, 2337, -2902, 2753, 505, -6627, 1151, -99, 572, 4522, -5872, -1026, 4906, -6296, -2642, 2812, 1652, 2857, -4134, -3518, 732, -1495, 1367, -2939, -1909, 7674, -3760, -6181, 3850, -1905, -368, 1554, -3862, 2445, 508, -5214, -2456, -2520, 3444, 1876, -6156, 2321, 3067, -2049, 1134, -1554, 3565, 6049, -3553, 1512, 2855, -1221, 3867, -1496, -634, 8764, 802, -2005, 2379, 2564, 4573, -1139, -424, 5363, -923, 501, -550, -5701, 4724, 1148, -7176, 2281, 1609, -1610, -391, -3850, 2168, 2242, -3430, -362, -2575, -54, 1709, -7810, -1414, 3027, -3456, -797, -2837, -1295, 4521, -4116, -2867, 3074, -1595, 573, -2309, -4651, 3785, -688, -3941, -339, -648, 3514, -1344, -3796, 5248, 818, -911, 2859, -3020, 2917, 4463, -5670, 288, 4023, 430]
892D30O90k946M881J609o120L946j324k90N050r650J195P672p438o0J208j371
908b518N757n974k161O928l114J095q44l724P650k433n185L867j075L541j129
923F81o285R223r43n985N968l420J302M979q417O79M693k162n37l478M570M226
939E094p945L271J979l712O796m107l315Q980m010l926K234j468M938l008m186
954b385O287k136j087N90m582O594Q84o543L263k098N83J458p576O264M338q458
970d604K575M74k223M636m345k48M309j227J95o154P83Q504p119J30O309n542
986c547K488K40n534P650Q67l920K049j410K945k173n733O874J127j000J847o234
1002c464K801L627n928M343J868j333L337p207O96O979n935L71L981n05K136n291
$$ y = [430, 1120, -1826, 3055, 4664, -1456, 2490, 1166, 876, 5926, -3724, -2529, 5143, -2295, -2355, -1147, -2518, 3239, -2735, -4896, 2032, -1082, 13, -831, -4555, 3095, 662, -4523, -656, -1731, 1810, 681, -5604, 3619, 2676, -3309, 2659, -761, 541, 5520, -2897, -2218, 2475, 313, -224, -3702, 868, 5094, -2851, 420, 2399, -1313, 5483, 1376, -1939, 7041, 3031, -895, 1339, -129, 4809, 1801, -2385, 3902, 1766, 679, 1269, -3313, 3281, 4165, -2378, 885, -1213, -630, 828, -6748, -484, 3854, -4604, -2029, -1555, -3778, 858, -3487, -3735, 574, -653, -458, -6612, -5829, 2675, -4444, -4314, 1995, -3547, -1059, -819, -6353, 1297, 2164, -1756, 293, -1117, 1828, -345, -6078, 796, 1923, 923, 2770, -3464, -663, 2964, -2964, 1379, 3247, 1914, 5251, -1956, -1260, 5719, -216, 155, 4136, 3631, 5767, 476]
1018D76k228L930q68M693k320n176P637n019o382P490j633L34K445n791L076M83
1034A147m947J645O02N761L84r056L230P84l506N280k503O64N405p399m07K006
1050i10k877N292j878j235P000n296n540J209J845N909k967k941M883n133q7K268
1066d58n295P633K739p459M124p47m330K128j474M915M214m646j972m164K897
1081a895N970o868L041N844o414M89j966k598O281k499L55N151m759q81k678l043
1097f470Q402J950k339o13l364L886j959n516Q432Q84k357M146o803p11L961n573
1113d044M240N799k050j769n907J217M094k784L606n11j770N388p292m836P297
1128F78j327J924K634l731K144m457m912P023K457J233r26n317L402r35l503L520
$$ y = [476, -1752, 2178, 1310, 6003, 3683, -1493, 6144, 1125, -5257, 2233, 600, 934, 3379, -2412, 664, 1147, -3800, -2155, -1553, 4208, 4592, -4464, -1234, -450, -3956, 1324, -1179, -515, 4890, -2509, -2916, -910, -3787, 1505, -373, -1608, 5392, 96, -5444, -4235, -2390, 3519, 552, -2389, 2494, -2639, -2726, -458, -5753, 1880, 4619, -2840, 1284, 537, -3793, -1665, -3139, 1776, 5990, 1344, -628, -4792, -1895, 4075, -2793, 248, 6092, -322, 167, -1799, -4397, 1884, -615, -260, 4891, 132, -749, -3427, -6470, 1932, 3882, 1543, 930, -2434, 1452, -507, -6023, 2409, 3293, 936, 5082, -1721, -2432, 1529, -4044, 196, 5995, 3945, 2176, -3731, -2514, 1580, -1204, 2402, 1891, 121, 5509, -1783, -6619, 678, -649, 1275, 3909, 178, 2322, -2135, -7047, -24, 2433, 3666, 2740, -2577, 825, -110, -3613, -93]
1144i3j423M699L306r314J129J131m746N301J727L58L008p591k967L523J192K643
1160A883k887Q92M919o634j091J188l012Q040J099n338M295l424m454K788L94
1175a342N649N13o078J624j226k26Q64l482O112L444o028P44l876j276O514l452
1191a522J787N338o113k343k40j60N561k001p60L133k110O12m407k614R184p22
1207B623j788L134o258O3K149m219N619L098l715m72k817K143R49m717M167K756
1223B715o77J329p216M5N514l497L465K516l931J902l781k643O564n12n27O04
1239A870j728L037l990l797M447M58L147k75o880M195l39n138N809P94q32K057
1255B835n230M64K025k176J659p98K500L215p151p34K519r95M779k152k070N505
$$ y = [-93, -1516, 3183, 6489, -2825, -1696, -565, -5311, -10, 1717, 2075, 5083, -2508, -5475, -1952, -760, 1883, -1004, -112, 4807, -1827, -2918, -1730, -4742, 3298, 4397, -941, 3354, -70, -4524, -1736, -1342, 4307, 4820, -1258, 366, -860, -1086, -222, -3704, 2408, 5852, -176, 568, -3308, -4584, 1930, -1522, 265, 5603, -510, -2853, -3093, -3253, 2308, 307, -453, 2680, 570, 1182, -3225, -5839, 3345, 2623, 835, 3969, -2289, -2226, -77, -4296, 1323, 4421, 706, 234, -2583, -440, 509, -4208, -41, 2715, 2038, 3367, -3849, -3804, 1710, -1787, 1678, 4194, 263, 2165, -1616, -4259, 2305, 1793, 1266, 1870, 142, 3179, -811, -4608, -161, 297, 3444, 3169, -3711, 484, 145, -4993, 816, 1610, 778, 2835, -2395, -1931, 94, -2082, -423, -1221, 1279, 4494, -2657, -3391, -872, -1867, 2912, 760, -1310, 4195]
1271D195n001k582L944j530K643l32k920L776j990k468Q00p28N718j8n204K501
1287H04j936l55L428m339L101L913o277N22J413r46K166k353J703L394l529j88
1303E21k321j89N716l651j243L350l575Q69p6l229N774j04l861K781j236L75p61
1320h60k910M423R36k253Q49l557K826K638n278L606K184l039K490l395n03M438
1336B595l255k87J821j005J676l717q58M951j893O16K4k413M511k325l825N150
1352A766j299q08J926l744K603J537l824K297L60J370M32m428K639J519l574K341
1368A113k161j88L973n307k02L848k252J354m44j386M442k624j838J727o84K484
1384A855k320k654M640j762j365K291k830L649R87n238L563R31k249J402k336
$$ y = [4195, -806, -3388, 556, -974, 1669, 1337, -1583, 2193, 203, -2265, -1465, -2193, 3525, 3507, -1697, 804, -1132, -1487, 1941, -2398, 703, 4616, -1661, -1139, 274, -672, 1494, -859, 844, 4238, 709, 521, -1800, -1989, 3727, 76, -1167, 2183, -1392, -523, -599, -3828, 1946, 1842, -2019, 762, -474, -99, -860, -3770, 653, 1589, -664, 185, -3372, -546, 2092, -3186, 420, 2604, -435, 2055, -1340, -1843, 2595, -660, -947, 874, -131, 1545, -2172, -3030, 1921, 28, 644, 668, -1745, 2766, 441, -3384, 1766, 467, -341, 1585, -2159, 444, 1981, -1843, 454, 814, 2184, 2616, -1812, 827, 2346, -1228, 1113, -1048, -1236, 2737, -2570, -2772, 1076, -1176, 178, -266, -1652, 2790, 166, -1672, 55, -629, 1855, -465, -3119, 1521, -241, -1606, 685, -2145, 1504, 2491, -2747, 816, 1747, -502, 900, -1436]
1399a436J552J910l607J015J49L94K411m279J635M047m229J071M6j922L768k779
1415b54k701L996j290l38j63j254L930j121j697K247j348K029l91m141M043J50
1431A697l522K450k215P33K613m416J314K565j663M66j631R28K254l493P54O91
1447d75j264L286l317j084N373k690n81K449k036K693o94l472K864M4q16n93k241
1464b554L405m86l012L064r82R93K219m627K274K712m106J689k05p68K702l403
1480a085o81K890o75N85j682L31L685l612m66J948k205K750j110l933M576q66
1496D50l023K637o46J471P46l036J933L98n52K68k930L027J354m790J826J58j377
1513b086L233k512K41M272l536m43J146o05K408j783j297K271j434Q8j329j257
$$ y = [-1436, 116, 2026, -1581, -566, -417, -23, 2388, -1891, -256, 3791, -438, 633, 679, -1243, 2525, -254, -2955, 1041, -249, -587, -750, -2004, 1926, 805, -892, 1355, 7, 2036, 1645, -2496, 1547, 1697, -1825, 625, -1590, -857, 1756, -2660, -1346, 1219, -444, 22, -1609, -681, 1573, -1920, -1166, -475, -1739, 1547, -1770, -2854, 2519, -171, -752, 1697, -339, 2354, 1660, -1812, 1052, 1096, 280, -313, -2554, 851, 365, -2647, 417, -565, 428, 2647, -1980, 294, 3006, -1100, 589, 384, -384, 2318, -1085, -1766, 1124, 449, 1034, -648, -317, 3368, -244, -710, 1238, -967, 1783, 673, -3260, 1316, 450, -2573, 64, -582, 889, 1635, -1401, 532, 930, 378, 646, -2284, 743, 2097, -2693, -867, -709, -2086, 1147, -1365, -1124, 3148, -388, -831, 315, -290, 2118, 335, -962, 1309, -125, -37, -1366, -2623]
1529b623M999j553k043K895k631O00J496l699L200J555l743P86m35O42P73k215
1545a996K532J039o72J198l683P04L966l710Q39J982k908J334j581k044M402r91
1561D11j197J194l00J109k047j640L195q2P29j91m199L146L18l480L888M40j034
1578B60J780l054K31K702k461O12P13R64L51m489M45K006j140K824j331j977L997
1595B433l368k069L830j028P55O19k513K154j034k186J095R49L259q73l650K300
1611F73j031q11K839k549J781K472n131N14J158j900K060k33O38K052k691j311
1627a470o67J398L819k759p57K526l293L69O32k716M595L91l091J993r84j651
1643a665N23m23L397J032k358p68k019K153J750l288L070J340l165J337k318j146
$$ y = [-2623, 2376, 823, -1220, 1675, -956, -356, 1140, -2559, 641, 2196, -1547, -761, -1196, -554, 219, -1996, 536, 1575, 903, 2101, -1582, -878, 3088, -622, 217, 2199, -709, 625, -956, -3000, 1402, 411, -786, 408, 108, 1217, -830, -2470, 725, 643, 1372, 1181, -3018, 128, 446, -3034, 854, 1294, 260, 2040, -1014, -783, 1919, -542, 70, 783, 1747, 2098, -2391, -1946, 60, -1080, 1744, 413, -1564, 2433, -935, -3004, 826, -202, 553, 1172, -1341, 813, -221, -2407, -1312, -363, 2896, 2023, -1627, 673, -358, -1169, 1670, -879, 902, 3374, -1757, -1243, -85, -1985, 75, -158, 480, 2532, -159, -1470, -2137, -739, 3080, 321, -436, 2090, -1203, -834, -202, -2918, 1677, 2068, -1023, 970, -14, -1665, -1142, -1565, 1832, 2864, 506, -262, -2281, -128, 1622, -1666, 1404, 2744, -421, 916, -1402, -2548]
1659b548M024j734n8K883k184j245j903J72L516p9K49r34j635K893k321k059N022
1676B059n65p75J977l449KJ160k412K452J853o64j325l430J425J518j493K110
1692D43o81L38K313m542l05L525j953K093J366k249J050k338j825K871R17J101
1708B124j297j927K208j799q63J609j456L437Q19n145J811J97k669K914Q58O25
1724A446R80l530l80J186N91J154j988J273J576l705K32l09j520M683n94k032
1740i37K958k386j732J631L28K505m74k312O14o10o2o12j448M096K24k618J618
1757G83k562p2L227k144J162K454l052q81m37L96J954j257O92J187p78P69k872
1774a431k02M420j765l41J465l468O30O1k144L309P20j567K51q30J278q5j844
$$ y = [-2548, 1476, -258, -316, 2567, 383, -862, -2765, -2593, 923, 844, 1093, 159, -1476, 1417, -904, -2963, 2059, 1494, 719, 2696, -753, -751, 409, -2003, 449, 2302, 1638, 313, -3117, -1692, -174, -1667, 443, -238, 100, 2413, -2129, -2434, 1091, -862, 1231, 2597, 348, 1398, -940, -2765, 106, 1023, 2124, 827, -1100, 1108, -691, -1554, 55, -1401, 2036, 2855, -2290, -479, -282, -2951, -37, 821, 1446, 2426, -1104, -1484, -298, 293, 1447, -541, 732, 2308, -1397, -1165, -1474, -2994, 1689, 1095, -937, 2021, -365, -2097, -466, -138, 2367, 1893, -419, 195, -415, -477, -1089, -2537, 1559, 1783, -835, 783, -1779, -1851, 1376, -768, 394, 2848, -204, -1085, -1522, -1126, 828, -429, 263, 1450, 672, 1441, -1431, -1633, 2787, 1022, 681, 2146, -1322, -692, -631, -2775, 534, 1254, -313, -62, -892, 386, 301, -1543]
1791a543K482M29L45N3m365J341K041k854K637O25j530J387k173k63K874o94k85
1808E07r8l06J120k860p02J645n61K451o15k731L211q61k311L287l45R1P79l037
1826a336Q49P09j473Q15m59K042O78l070J089M81m03K507k152k97K741l719r11
1843a909K039j383J581m61q79J860q93l44j05K53K990j498k116K014j983j05J506
1860E67k667K297J430l120J056O10l07R89j386J159J102j730n6j743P52K326k892
1877a613Q09J686j961J658o36j274L296q61j840J422p14j20n54j227K124k93k04
1894c02O66j622K507K85k486K730O9j455J270k307J40J855k505K01Q92j51Q72
1911F59j967P56K001j416R36p16r25K782k608j297K943j695L02Q23j840K101L25
$$ y = [-1543, 939, 1368, 1713, 1766, -2599, -1258, 783, -2071, 566, 1191, -339, 1048, -1125, -1388, 1486, 792, 507, 409, 103, 1223, -1637, -2339, -694, -1255, 1196, 581, -2150, 1061, 200, -2111, 1176, 831, 922, 1701, -1336, -487, 222, -1251, -436, -895, 1147, 1825, -1245, -156, 325, -78, 2429, 277, -20, 2721, -998, -1909, 130, -1253, 328, -133, -1012, 848, -45, -389, -494, -241, 2749, 1251, -865, 1149, -834, -939, 567, -2100, 197, 1627, -1493, -437, 173, -134, 855, -531, 628, 1730, 0, -56, -1799, -1047, 1279, -1613, -804, 882, -1079, 579, -57, -1331, 1965, 1104, -736, 686, -28, -148, -702, -1929, 195, -98, -302, 364, -1258, 1249, 1534, -952, 1778, 1847, 392, 1662, -645, -505, 1350, -1155, -954, -62, -213, 659, -1308, -552, 1449, 33, 969, 253, -672, 2110, -498, -1795, 1148, -547, -245, 578, -1262, 839, 1164]
1928A164j657J117J35L16l78j988J775n34j327J369j837J054J936l321J336J986
1944A146j731J311n00m06J671j583n73L38k26J215j844k34K474j612K84R79j671
1961i62K505m54k622K247k21j252P04j414J291P30j647P71O5O40Q05k365J715
1978E36J094k237J256q47p91K530k552m14K430j124K6J55n83K227r44o45O59p86
1996a0J206j024j917K989j114j192J684j469J102J276k732J414J123j091L44j108
2012e19O64N80j607O64j10j93J746k436M86K580k390O63R78j731J812j053j549
2029a415J951m05m18L6j095K113r70r05J554j079J041L78k712K057M88k246J774
2046A47n71k3J660k364L63J716o81O08r90O52J180k198L56M01j212K163j347j396
$$ y = [1164, -493, 624, 759, 1075, 697, -1291, 484, -50, -1377, -8, -1845, -791, 1145, -2176, -840, 1146, -585, 726, 226, -180, 1491, -92, -665, -327, -553, 662, -1182, -1416, 1058, -554, -270, 709, -962, 1543, 1089, -1533, 714, 493, -759, -55, -1469, -178, 552, -1095, -324, -259, 381, 1186, -1179, 536, 1630, -607, 649, -198, -989, 1541, -1011, -1425, 1005, -119, -93, 62, -521, 1706, 762, 117, 776, -10, 1196, 172, -1745, 1244, 130, -1062, 622, -847, 255, 1531, -1201, 213, 1336, 245, 589, -519, 145, 725, -882, -218, -328, -521, 1225, -1211, -725, 1855, -535, 128, 1106, -625, 1187, 134, -1415, 536, 131, -287, -251, -1346, 767, -203, -1108, 446, -633, 408, 786, -1926, 131, 619, -1627, 147, -424, -447, 1213, -1151, -788, 928, 247, 855, -135, 517, 1697, -501, -145, 256, -956, 1207, -140, -1536]
2064a536K582j610r19J638p90J322K6j848J588n0k99J50j114K205Mk172J397r09
2082c35k04J930k322Q98J696k665M88J03m21J585j453q2J362q75M22j090k60K936
2100A713j495n68J467k053J069K29j815K476M6j852J049q69L77L63j298J639K91
2117G69m80L96k169J538J455j959J720J07j391J126j522o82K476j232l82O62p23
2134b91L79j283k96J852m46Q59l69j800K006n68j416K586n95k47R79k223Q84P01
2152G12j683J059K55N25L2k596M59O26l03J530j479j30J915k491K42J846j121
2169f02J578o6r64J611j328j228Q50L49J578r95j654J127j249L13J376j879K017
2186H34P94k753R34J81r92J353n20O32R26j875k21j20O00J814j556K31R76k133
$$ y = [-1536, 1046, -564, -1483, 155, -635, 687, 713, -1135, 453, 403, 104, 254, -860, 1345, 1349, -823, 574, -335, -539, 1391, -931, -33, 1663, -1002, -514, -411, -832, 753, -700, -782, 580, -295, 127, -963, -1223, 1713, 218, -350, 1117, -936, 133, 362, -1453, 1023, 1069, -783, 266, -603, -226, 137, -1161, 478, 769, 289, 685, -1484, 54, 1509, -450, 1270, 1377, -14, 1112, -410, -1092, 1384, 152, -230, 432, -291, 88, -1195, -1491, 361, -85, 774, 405, -1395, 611, 43, -1373, 1213, 618, 371, 1350, -873, 11, 712, -971, 88, 343, 868, 900, -1696, -1237, -611, -914, 616, -863, -993, 922, -1569, -1327, 519, -602, 976, 910, -54, 1557, 229, -999, -149, 200, 1778, 783, -871, 256, -993, -680, 696, -1183, 834, 1628, -1125, -191, -10, -1002, 351, -169, 463, 1389, -486, -707, -827, -227, 1587, 31, 262, 1238, -895]
2204h95P68l25j132K565p78j069J580j605j63M23l03K209J96j139o2j273J432
2221D29Nj736K249l05j370J293k122J16K161j646J313J319j373j41j257L49K057
2238A341p64L61m58j005J713j678n51K598r94L71Q00k344J039m73j387J999J16
2255F84m60l02j682R04N61o00J547o39O38Q77k792O45J190j496J783l18j099J093
2273E34k040l04J785j51R66o36o83J331j671j28R48r62K110m01k450J611n25p74
2291a440J801l05J005M79k218P45K21j82O80j243J089L47j727M23m88J33K503
2308A823j387k08J494j911j18M84n01J621q18r63O26r82N50l06o46K503n39q33
2326a11R77j858P39J035j659J472K16j525L84p86M39J239j062O81O09o39L60j476
$$ y = [-895, -127, -452, -1584, 981, 203, -866, 714, -891, -1054, -631, -934, 1275, 1471, 332, 270, -1003, 429, 434, -1302, 947, 642, -728, 565, -1557, -1441, 720, -926, 387, 1706, 333, 192, -1065, -716, 1341, 577, 938, 480, -525, 1188, -490, -1041, 1557, 563, 934, 1734, -610, 429, -44, -1431, 568, 684, 224, -78, -1760, -856, -295, -895, 652, 13, 651, 1528, -1264, -619, 571, -925, 858, 540, -559, 534, -1506, -1810, -25, -176, 790, 154, -529, 802, -869, -997, -49, -1011, 1099, 698, -1752, -141, -666, -1440, 361, 56, 1061, 1540, -678, 67, 288, 106, 786, -457, 632, 979, -748, -325, -813, -680, 1823, 436, 228, 1722, -189, -307, 177, -324, 1297, 479, -484, 142, -840, -290, -596, -1242, 1261, 722, -111, 866, -992, -253, 782, -877, 595, 811, -714, -330, -1116, -677, 562, -500, 181, 790, 151, 511, -965]
2344i65K55J824j573M95N20j954J343o78o39K161m00m44N60q22R13n15o96J185
2362E70k14K28J13k139J373M25j189J914m64k69Q79j593K29J287j261O75n05k51
2380a92Q75j736K05Q59m17J334q10q89J815j228n13J572j038N47J56j638J158
2397F0k08m53O40m76J152l7j394R60n02nJ134j690L72J218k019M30O54o25J254
2416D65n64l49R64p06J30r9m54J766j023r07J200r62L94L61j323J754k6j329J192
2435D84p29J74O40j114P21J96p04K32p04O08O98j448J129M21r71J129p14l67J596
2454A277j166j87P30o13M04n59m05J451p24K1L58j062J567o46j046J492o79k66
2472e3P65j682Q80Q83j469P45P3j98O90j225N74P18j030O95q12p4J334j576LJ332
$$ y = [-965, -710, 1114, -459, 36, 556, -1398, -55, -733, -1372, 789, 389, -55, 505, -317, 596, 81, -615, 570, 356, 584, 697, -1442, -69, 356, -833, 1081, 617, 348, 1227, -366, -137, 1150, -111, 564, 59, -192, 683, -1053, -848, 11, -406, 928, 118, -771, 1044, -184, -697, 875, -163, 384, 540, -1098, 60, -148, -601, 39, -437, 715, 678, -716, 244, -258, -263, 871, -819, -447, 771, -1248, -818, -164, -789, 465, -99, -448, 516, -190, -60, -159, -613, 1153, 130, -777, 423, -539, -145, 216, -1107, 647, 621, -708, 484, -245, -71, 569, -545, 176, 372, -332, -100, -804, -196, 502, -946, 183, 604, -367, 762, 48, -319, 1277, 111, -76, 654, 41, 445, -114, -519, 932, 208, 229, 587, -475, 1092, 446, -600, 892, 213, -53, 712, -970, -90, 793, -676, 69, 142, -56, 634, -591, -17, 701, -329, 366, -446, -520, 814, -762, -759, 573]
2492E73j329Q22J36j023J535p93n97J026o25O20j55j227J284m99l49P06j051R12
2510c4N71j646J151J90p97J026q72J79J210j448L75K95l82J095j075J93R52j028
2528d5L92J39q46J369j016o98J343r41OL90r77J176n0p87P33m16N91N3j192J493
2548G17j70r19J039r04QJ133j466K62P61q85M31m47k17J259j005j34N78m77Q74
2567D38o94n88J439o50O4N86j032Q53O9j196J140Q5n54L14o99N58L43q42O53k92
2587eN5Q42j617P21R78j277P27%o19J296j168k25J068o45J88l94n41J080o67m30
2607f33O20m13Q32l40j108J394l34o01J274p97L49M63j460P07K01k97M00p57N30
2626C0N69j385O66j03l77J195r97j71J109j219K85K67k56R63m60n00J072o94Q5
$$ y = [573, -756, 66, 202, -821, 714, -79, -676, 350, -275, 345, 190, -1037, 247, -252, -601, 105, -946, -34, 537, -1109, 42, 232, -565, 461, -411, -232, 978, -470, -95, 200, -182, 913, -162, 31, 983, -45, 347, 486, -360, 1009, -7, -705, 638, -303, -297, 93, -884, 292, 242, -545, 188, -228, 363, 416, -776, 717, 547, -372, 667, -237, -229, 904, -562, -300, 461, -424, 7, -440, -657, 602, -403, -537, 41, -436, 438, -256, -844, 595, -55, 9, 595, -437, 416, 485, -711, 429, 514, -40, 274, -425, 133, 476, -366, 287, -5, 50, 892, -725, -4, 974, -303, 424, 424, -195, 1101, -67, -292, 776, 131, 319, -75, -616, 464, -203, -633, -13, -426, 406, 66, -1042, 352, 18, -583, 691, -106, 243, 706, -754, -47, 154, -143, 257, -500, 30, 599, -786, -120, -223, -600, 595, -402, -573, 536, -683, -398, -131, -387, 576, 116, -384, 688, -6, 79]
2645G9J75o05J470l55j106O69j030M41P47j262R21L20j119O33l76m2R11r34L84
2664g9N96n71L9o45J23J186q97K10L42r83Q73m92l74J483m79n42L64n76L11Rl75
2685d77R93k36lJ73j191Q72N00o97Q62k85m57M83j293O07Q51q39N25k3l92Q60
2705H33j436L76R22l35O74n07j009J156p59l36J089o12M31O9j214J021j78q54
2723f69R52l02M34j46j383N93P0k07J044r13K94N78j142K86N10m94J006m33n05
2742d27Q55j183P0L56L2R30o52o48O84o35M74K79p34J299k54j115O86m97p1R68
2762D17p16P94K66j028J29k39N06R06j024N68K35j147P40n94l13J232o72q8N05
2781D77q42L01j77j70J368n93l56J26j047J112j28o60R73j92l29L57j004N14O37
$$ y = [79, 254, -351, 1119, 764, -342, 327, -703, -262, 485, -777, 144, 464, -655, -22, -398, -440, 471, -463, -79, 517, -54, -15, -660, -537, 649, -248, -38, 304, -679, 194, -298, -672, 811, 332, -210, 154, -422, -111, -102, -477, 516, 280, 277, 450, -741, 131, 631, -66, 796, 511, 54, 537, -756, -149, 702, -137, 388, 365, -27, 833, -603, -227, 695, 360, 1034, 527, -482, 674, -85, -421, 668, 56, 487, 556, -658, 363, 185, -669, 283, -19, 415, 269, -1114, -521, -451, -658, 386, -527, -233, 345, -797, -511, -1, -495, 511, 78, -427, 428, -755, -685, -329, -297, 633, -19, -667, 17, -618, -144, 135, -599, 700, 446, -669, 17, -480, -551, 417, -299, 495, 761, -267, -138, -377, 129, 1035, 11, 579, 814, -333, 407, -187, -500, 732, 60, -28, 477, -365, -64, -241, -411, 957, 364, 8, 134, -913, 199, 71, -589, 384, 192, -137, 220, -784, -270, 367]
2800C67q87J224j44n21J72q50K90P67l57R8r6l82P74r26j03J142o39M04%j051
2820g18Q86o18j99R50j63J42j96r13R48m6k64P36n36M68L34j509N98K94n06R40
2840F28l78k97N04j126K80O28m18Q97o77l37O01q66L51P3l42J165m33p89P27n98
2860d07J67N67l75O39k97p90O24l63L11J82p57Q01J54r59M57m78J41J130q95K23
2880G5L63q78J63j9J41N94n69r4L06m96L24m9m06J171l83l16K80p72O54J67p06
2901d50Q69j30n37J95m87N08L52n50N99k49j73K49q60M33P59q18N52m4n59P96
2921D55o60k1P61l73K97k16l98P18n36k78P99n64N40k06q03Q41j97n11J022o02
2941F8OL15j048N70K01l38N24n49J42O03j150M06L47n54Q69m56l23Q08q24n1O62
$$ y = [367, -520, 704, 560, 39, 211, -639, -349, 418, 61, 159, 63, -319, 455, -471, -574, 568, -71, 333, 333, -718, 168, -450, -649, 301, 138, 280, 84, -829, 119, 73, -191, 545, 9, 477, 811, -698, -100, 194, -312, 628, 250, -47, 457, -669, -389, 239, -179, 718, 41, -296, 305, -561, -210, -137, -479, 686, 253, -536, 191, -407, -240, 327, -48, 591, 294, -496, 128, -235, 76, 258, -499, 302, 456, -503, -46, -524, -383, 747, -148, 75, 438, -440, -277, -296, -155, 439, -130, -224, 82, -414, -90, -139, -545, 626, 243, -73, 207, -565, 89, 256, -450, 419, 289, -248, -53, -540, -32, 320, -230, 369, 120, -53, 196, -664, -231, 528, -290, 262, 218, -341, 455, -205, -226, 535, 162, 459, 243, -155, 563, 27, -251, 548, -16, 524, 318, -485, 356, 159, -352, 670, 68, 74, 389, -659, -89, 112, -226, 298, -251, -109, 494, -656, -250, 97, -457, 412, -44, -367, 441, -383, -434, 228]
2962B28m98M85m14l72R14n56rL01n44R19k88p43N39j84J01L82p19M36K89r17P07
2983E7k26R9N39q06O18K21p37M63k69j8O70o46M3N42r64Q44j84p18R18m17r5L21
3005B55p09N47l2o70R73m60j35M18p94N60L72j020J046l26l29O67q74K46P53q74
3025c86L40J35k57N30p41K38L41n89O07j95l71R05n41m80Q63n66J58L65r10R05
3045C51L6o20O26m17L59J35r91Q28Rl67N58m98J2O99j100N62J73m48O17n90j22
3066a88Q10q87J55K63m03O49n35k19O79o57J77M01p99Q84j63p46Q52m40N4M62
3086C49p45M19K12o20M41j89O6M19p08L57K81n96M33q5n45Q63m28k70P60q57N51
3107A08K0n71Q16l53j79K66n99O76r8o83R91l60l01L60o53N46M85r24P03j06m70
$$ y = [228, -270, 215, -199, -571, 343, -213, -222, 79, -465, 454, 166, -577, -38, -222, -121, 261, -458, -22, 267, -650, 57, -169, -70, 469, -337, 281, 502, -235, 228, -41, -59, 611, -35, 8, 550, -414, 430, 246, -472, 446, 29, -66, 255, -454, 93, 61, -609, 364, -96, -231, 187, -607, -47, 325, -695, 351, 25, -304, 363, -511, -265, 488, -386, -46, 89, -168, 362, -379, -141, 200, -389, 218, 23, -348, 557, 16, -464, 399, -167, -9, 356, -554, 351, 387, -233, 393, -24, 335, 470, -521, 307, 316, -51, 507, 9, 21, 720, -380, 182, 355, -93, 524, -66, -188, 622, -265, -110, 153, -250, 399, -136, -355, 324, -333, -156, 245, -554, 330, 167, -579, 273, -167, -113, 349, -396, 23, 235, -385, 56, -133, -67, 352, -356, 1, 282, -314, 119, 34, -511, 352, -76, -346, 414, -443, 108, 128, -443, 373, 20, -159, 107, -492, 184, 86, -597, 394, 34, -267, 93, -560, -14, 471, -453, 250, 144, -326]
3128c26N15n12r6P44o27L01o5k62P86q40j1J029r69M49J13p00P89n03j37Q45n62
3149c9J39Q8o57R71k78k90N65o41L20M90j219O29L96o76N87k18j73M77p29K86
3169B8K73k27M03m80j57P78r03L54L39n48Q70m82o38Q53o09R7K99m02M71j6p13
3190d10L61k0q9K31p19O13K55r24O11m45J38Q84j017K73M42p82M40m8m0O28o56
3211b74RN12p04M11j67k60R97n89j41K47o13O29K74o85P32k50m63M82m42J71M46
3232C22o00M37J51l34K59o08M34N31o64O46k74n37P00o32J8P91n43Q6q9l35N89
3253C48n55l4O91l02J4j26o46P46j82k82P99n25j19N15n94K40K27l60M70j76j67
3274a8L03q11M55K44k37N32o93k09P95q79P8P54m44L15j23o53O63m95J21O27m93
$$ y = [-326, 189, -323, -419, 325, -302, -1, -66, -328, 458, -382, -393, 636, -333, 116, 229, -471, 318, -185, -322, 523, -39, 100, 188, -469, 502, 224, -66, 499, -142, 178, 668, -551, 78, 474, -202, 385, 167, -6, 471, -258, 28, 301, 74, 477, -3, -160, 618, -285, 69, 408, -140, 730, 248, -390, 463, -146, -49, 250, -152, 319, 303, -410, -49, -69, -158, 73, -646, -33, 222, -702, -91, -536, -398, 486, -531, -258, 184, -598, -158, -206, -246, 382, -274, -265, 247, -457, -46, -213, -473, 524, -65, -206, 41, -572, 57, 331, -354, 378, 128, -335, 147, -295, -124, 322, -278, 159, 310, -24, 235, -373, 61, 592, -72, 574, 300, -237, 463, -169, -151, 640, 97, 183, 94, -241, 348, -207, -241, 450, 148, 162, 36, -610, 136, -46, -328, 471, -54, -173, 342, -252, -12, 215, -145, 325, 149, -18, 285, -526, -71, 173, -64, 468, -225, -434, 361, -518, -440, 314, -130, 185, 62, -591, 72, -423, -302, 325, -168]
3295a68N00k25o98N75k02K1P82q20M03K54r29N42j06j72P79o56J67K07o38L26
3315e8M9k51R79q16MK31o65O88J5m68P98l61j79J63m76R2L79k74P03m64n33N31
3337H7o33O81J98n81O07k64n42P55q44L32O21o00K82J1n28M03k51M9Q01q01J32
3358h5O5o03Q52k80n27J079m72q3J75o68N69K10n19P38k72j95J98n76M38P7j79
3379e8K87m50K20L21q77M87L79n98Q43l49o58P24m43l3N84m28K92k27l67O80m94
3400a65K34M77o53L62J13p96P22k52k38N69n36K31P9p45M66L5j57N47m92J80J42
3421A23o01N78j61k90Q62n26k79N68o50K75L70l87M71l61j90K44k48M00j88j75
3441a65N66l32m06L97o17L73N46n83L88lm59L99m17K21L78m03L60j79k91M60m44
$$ y = [-168, 332, 107, -591, -16, -218, -197, 585, -235, 168, 422, -507, 35, -71, -243, 536, -120, 47, 254, -384, -58, -9, -260, 719, -97, -93, 138, -527, 161, 176, -292, 506, 145, -34, 129, -347, -255, 124, -150, 553, 89, -444, 87, -546, 135, 333, -248, 359, 95, -447, 308, -536, -204, 417, -183, 99, 110, -418, -15, -266, -217, 584, -217, -85, -20, -623, 229, -51, -578, 501, 29, -54, 121, -547, 22, 232, -287, 451, 179, -16, 182, -394, 44, 121, -58, 229, -221, -1, 320, -557, -70, 309, -289, 554, 205, -453, 271, -172, -205, 379, -49, 243, 16, -351, 329, -165, 69, 546, -107, 255, 368, -428, 294, 42, -196, 373, -163, 68, 147, -598, -132, -97, -254, 293, -199, -19, 123, -478, 100, -61, -351, 511, -15, -294, 274, -376, -101, 269, -118, 353, -8, -198, 46, -202, 198, 10, -165, 401, 69, -337, 60, -557, -184, 362, -221, 167, 164, -295, 104, -313, -92, 286, -117, 243, 64, -227, 233, -211]
3462b11Q8P11o54K1K91n99O36m84m1N65l81j21M54n37L98nm21O55n99Q5N59q87
3484d77N54O7l60L92k98j20L10l72J82K43k34K96j36k12M29m26K18J15l81N18
3504C08k69m90P78n54J19N85n40J82K9o05M93M5k27o4L4K47J63l57L93k88j03
3525a21P19q36K61O06o54R3o4j59N14m08j71M79n14L22o5l01N85l64n6K87l68
3546b15K87N0l74O33j71n60O41l86J09L61o64L18K3j62L65m61L1L81n83L08L46
3567B77p61O93l70o8L97m68N6L93m66L29p4k12L44k81K59on12N44k5m70O64l61
3589a18q0M94o76M70J58o12M66k32J38J77m93M18j31k00N85m40j58O57q38L57
3609e8N05p60O31q6m52N76j55k82L63k43K18Rm66N59j89j54N55p87L79J86m55
$$ y = [-211, -123, 588, -66, -45, 246, -353, 283, -201, -242, 323, -58, -179, 275, -262, 136, 131, -290, 365, -234, -149, 410, -477, 77, 144, -216, 176, -122, -242, 68, -304, -122, 121, -113, 183, 47, -165, 264, -162, 56, 171, -210, 308, 39, -451, 327, -227, -108, 477, -63, 119, 148, -457, 36, 81, -146, -210, -176, 71, 234, -123, 270, -18, -121, 598, -238, 23, 629, -25, 68, 4, -155, 359, -49, -220, 259, -255, 67, 2, -299, 286, -78, -134, 153, -215, 72, 122, -252, 381, 210, -350, 291, -95, 14, 375, -289, 29, 52, -110, 255, -206, -175, 206, -377, -69, 277, -484, 209, -161, -229, 168, -300, -244, 149, -317, 12, -62, -274, 70, -211, 48, 42, -470, 74, 49, -421, 243, -118, -198, 296, -380, 90, 248, -364, 102, -130, 8, 185, -308, 110, -21, -221, 364, -76, -234, 423, -415, -58, 447, -313, 318, 232, -220, 356, 201, -81, 282, 39, 257, 266, -200, 359, 170, 16, 571, -216, 163, 349, -106]
3630a06L88l9l94M56k91J2K93n41L78n9k26L23l21M1L95m75L96j89l84P61m86
3651f8k95O98p60K71K92m52M03j51k57L39k66P5L31n76M11k6l45M60l08J03L15
3672A94m32J07L27m71J67JL8L49n12K19M8k67M29l14l12N90k34o0L37n18M70p3
3694H3k92M02l07L1K74l93K84L4l26M89m50j00M60m67K71K57l59M38j70l48M47
3715B58j80j52M00l84K14j15l23M37k82N6L21m42M23m3n98O59k78j69M38l63J17
3736fJ16m32L32J53l20M33m48J64K62n12L03K3l63O77n00k00M77l96j1K94j11
3757f5L14l11j77K80k27J58Ok76N22k75k32L93k71K82J52p18O74o6l28L20l69
3778b14J09M56m81J96K2m53M73k47J7M70k97r8M0n33O32%m20N24j28k02K81k84
$$ y = [-106, 282, 243, -151, 305, 14, 26, 319, -222, 156, 97, -129, 194, -127, -86, 309, -166, 230, 41, -343, 418, -68, -363, 335, -425, -154, 138, -314, 89, -62, -319, 20, -246, -171, 160, -416, -5, -31, -376, 84, -224, -121, 194, -238, -131, 196, -275, -108, -107, -69, 280, -232, -13, 35, -232, 197, -117, -429, 161, -73, -133, 204, -314, 156, 83, -209, 193, -114, -83, 191, -202, 82, 116, -210, 279, -171, -271, 189, -278, -7, 250, -109, 329, 159, -189, 258, 78, -74, 326, -58, 156, 41, -282, 155, -127, -71, 250, -192, 231, 188, -410, 249, -29, -198, 240, -123, -6, 110, -322, 10, 163, -157, 276, -172, -8, 254, -258, 45, 68, -295, 382, -118, -318, 159, -237, -248, 46, -65, 249, -62, -239, 41, -186, -28, -22, -298, 224, -51, -283, 110, -161, 121, 273, -445, 229, 163, -165, 155, -214, -105, 351, -130, 66, 88, -365, 108, -139, -122, 348, 51, -47, -7, -540, 92, 92, -328, 196, 68, -134, 147, -137]
3800a37J61l6j41M55l13m3L38m93L39J68n31N73m28o9L06k22O3K94l89K42k35
3821i8j95M27l39P3K74k56J64p7k30M12k04j90M86l45N6K76o75O11ol12L77m59
3843b30L30j69j89M60j55r7M59o50J14K88l49K60K5k34K91k12J4L05n69J73J88
3864E3j34L82l89j94M20l42K09L58n64N05p5m32L74k74j2M19l43N6j0l20K15R
3886h9J20L25n99J55J56m52N26k04M4K11l39L2K61n24N42j01k27L96j64o0J16
3907A25o71O90ok83L00j84l13N31n78L04K38m36M09r1l46K49j19J36K48j40Q0
3928A43q1k33L18k63RM58l97M5K1m31M37j30q4L60k08P4Nl69L76Pk19L19l87K98
3952F8J53n75L06O3j35M09l47j05K00j74L63R1l13L19m35%J58p3J58J78n61M23
$$ y = [-137, 24, -12, -153, 302, -11, -54, 284, -209, 130, 298, -233, 340, -88, -157, 149, -73, -10, 284, -105, 137, -98, -293, 134, -205, -132, 142, -114, 50, -27, -257, 155, -49, -239, 247, -98, -42, 234, -441, 170, 164, -148, 229, -230, 100, -69, -258, 202, 47, -50, 409, -241, -127, 161, -188, 72, 97, -137, 154, -58, -44, 261, -308, -135, 53, -81, 301, -88, -282, 138, -204, 5, 363, -201, 304, 229, -203, 171, -103, -115, 304, -39, 17, 7, -313, -98, -89, 31, 356, -243, -88, 68, -384, 142, -62, -18, 193, -146, -114, 147, -377, 165, 64, -163, 233, 69, 9, 125, -546, 144, 138, -145, 155, -29, -342, 189, -389, -85, 153, -283, 126, 35, -311, -62, -181, -45, 203, 63, 143, 62, -171, 147, -116, -107, 351, -46, -1, 20, -411, 26, -104, -188, 172, -36, 38, 43, -326, 50, 57, -162, 157, -230, 68, 221, -354, -48, 15, -120, 289, -58, -163, 37, -137, 226, 317, 4, 323, -112, -112, 46, -27, 131, 309, -252, 171]
3974A71k23k81N24l50J35L27k87R0J4n51M22o9L5J94m24K57M2k66N30k91nN45
3996E39n78J9L54n35M56m6j78L09l46N5M4l36K93o8j49L65l95J34R4l44M59J8
4018A64l66M29j72k9J02k36K51p8k28K59p6j35J17l47M65J79n69M27k25l49M89
4039G2j53%K73n50J91Q6j72L71j67j75M37m50K71j1j86J88K8k01L58m59J09M35
4061B95n20K48R1k34K20q6k15L89m12K26J17j80M16l60k65M25l99J82K77m12K87
4082I0K7k57K57j63J06J29k61K64m8k43M66l90k5M64o48L92n8l80M79j82q1L92
4104C30n96K96J23m27L36J2k54K42k00O6K31m98L82p0k97N85k57k55M65m85K82
4125A1P1k16L63k76n5K29k56M8J35m22M03r7k41N82m73J7J63k40K32n9j92M27
$$ y = [171, -52, -333, 191, -159, -24, 303, 16, 106, 120, -431, -9, -78, -43, 151, -273, -16, 26, -240, 290, -1, -6, 539, -39, -20, 334, -201, 255, 209, 31, 340, -6, 49, 93, -243, 50, -18, -167, 198, -197, -63, 31, -313, 146, 164, -202, 227, 55, 26, 128, -108, 143, 65, -163, 96, 20, -115, 2, -345, 120, 299, -270, 157, -68, -417, 72, -81, -81, 192, -358, -167, -81, -253, 118, -49, -224, 213, -237, 34, 23, -163, 25, 53, -148, 210, -249, -140, 295, -225, 23, 114, -120, 100, 14, -201, 188, -224, 2, 119, -61, 355, -5, -270, 155, -244, -62, 215, -197, 90, 117, -140, 117, -46, 60, 189, -72, 192, 144, -99, 367, -23, -48, 416, -232, 160, 102, -278, 201, 19, -62, 330, -266, 30, 153, -274, 62, 74, -180, 62, -138, -72, 159, -339, 43, -27, -324, 261, 4, -251, 214, -271, 11, 82, -134, 229, -47, -102, 127, -129, -81, 54, -368, 35, -62, -303, 279, -194, -177, -14, -254, -22, -81, -273, 154]
4147A54k46r8M30l74K29m1l46N74l85J15K28l05J04J02k81L40l0k62K38k95K21
4168G2J02l28J48J24l90M25k50K3L99m34J62J60l97M43j80j11L54m50N7M15l14
4189C0K34p4k55K65l87K49J14m18L31l8k81L47k61K2L41m52J03J75l07L11q0k
4211c3K94l62K00Ql81L69m7k37O07n95O4J15j85K38Q7l11K58m5j78Q3l43M29j12
4234g7j42N28m98J02L22m04K38O6m22K02K19l40K70k15jM23m77M33k18KK79k77
4256A3m6K59m10K34J80m44M01q7r3K36l15J34O5k16L49l31mJ92k08J89lk13J54
4279C6K1k19L12k75m7M69m60J66K14l18K72k31k4L49l15m4L88n46O01l26j35L61
4301B49m71M16J05l05L2l1k06L44k62K1K25k75J72l1k34K90o1L1L11n12k9L38
$$ y = [154, -92, -190, 240, -134, 95, 54, -292, 282, -103, 12, 240, -65, 39, 141, -140, 200, 170, -92, 146, -149, 72, 174, -154, -6, 118, -272, 153, -97, -74, 325, -109, 53, 213, -184, 259, 79, -32, 322, -128, -71, 344, 30, 264, 190, -65, 200, -187, 62, 176, -242, 89, 51, -230, 117, -144, -122, 219, -233, -130, 45, -262, 49, -31, -33, 261, -101, 99, 107, -274, 95, 48, -189, 418, -177, -113, 2, -183, 55, 142, -169, 89, 44, -134, -51, -394, 35, -77, -219, 309, -189, -87, 235, -169, 69, 135, -287, -85, 134, -206, 64, -151, -152, 271, -206, 227, 9, 11, 290, 13, -33, 226, -184, 50, 230, -214, 187, 100, 7, 243, -72, 62, 127, -89, 260, -71, -75, 117, -91, 98, 95, -118, 36, 57, -162, 150, -125, -172, 297, -163, 3, 217, -101, 171, -60, -84, 265, -50, -94, 294, -252, 349, 23, -112, 249, -222, 194, 299, -6, 26, -5, -211, 133, -129, -108, 117, -158, 14, -17, -251, 39, -22, 9, 320, -192, -221, 117]
4323A17l45L22qk01L08l31r7K55k84L48p2n7K22l81k3M21l09L69L8n55L45p0j31
4346a19L76l60J17J39k70J42J15m44L62j49RK68l15J57L6k24L13l28J5M00k27
4367A3m2K00m39K53J30k01L68m67K13p9j64L01L5k22M25m24p0M47m65K02n1j40
4389a77K44j48mK14m07L54j9k50M82n00Q0L65k75J27O8m21L38J39n15L36n8j15
4411a42M49l39J26j16l02N01k24o6L25l72J86N5j75J85j21k30L23j47M3nk79N04
4433A79j3j69K82l94l1M07n74M34m9j70J30r7j57L66k49O6J37k47L70l42j31K64
4455A2k1M6J48m76M28k83R9J74k6k21M05l95N3K11l96M06j65mK22l15J27O9l09
4478b11M20Jl08K43l03J04O7l87N29l15n0L78l37oJ59q7K00M3l25L88m72R9J91
$$ y = [117, -228, 94, 86, -115, 193, -138, -235, 20, -264, 84, 12, -45, 177, -204, -227, 194, -115, 254, 292, -263, 82, 12, -119, 257, -103, 14, 153, -117, 25, 140, -304, 58, -91, -82, 186, -129, 28, 64, -160, 153, -175, -160, 240, 13, -29, 171, -268, -15, 115, -86, 282, -185, 28, -51, -215, 86, 121, -101, 324, -100, -170, 277, -188, 14, -37, -177, 67, -81, -85, 129, -278, 76, 57, -193, 289, -211, -131, 234, -41, 86, 154, -267, 71, 210, -305, 31, -27, -142, 307, -32, 94, -22, -324, 177, -47, -113, 212, -160, 26, 81, -94, 91, -30, -260, 63, -84, -41, -46, -325, 179, 166, -3, 279, -115, -146, 261, -313, 121, 72, -98, 32, -65, -222, 144, -105, -39, 98, -149, 221, -121, -252, 12, -9, 37, 185, -291, 137, -146, -47, 127, 101, -120, 285, -110, -57, 154, -242, 164, -1, -5, 217, -98, 29, 98, -211, 209, 210, -98, 145, -158, -54, 13, -374, 155, -160, -210, 168, -169, -175, -16, -103, 97, 140, -185, 203, -269, -170, 21]
4501B1j25J64p3j40L50l12RL28l80K20J47l89K27j84q7L51k75J18J44l58L67r2
4523C1k96K87j64O7L51l90J56R5l63L31o4j78K99k34Q8K24m57M33k46j21L36l34
4545a49K43k5k47K22J28k55J43j19j05L90k57O2K10k71J49K5j89Pj32J76L18n03
4567a79J66Q0l41M47j70j2J73l33J72M4j68J16m5J74O2l98K03J77m67M11r9k06
4589a93L36k59J25J41l95L81k3l04L69k32L9M7k92M45R1m33M21n28N4L27k24R1
4611a6R2k62K81j12k04L56k41J4J89l04L53j32k41M88k84J70O4k41Q8P3k95K86
4633A22j72J1K14j80k6Rj66L61j03k23K60j59r7J68k24M66j53j23M16k92j34J74
4655A49l28K22n4j14K92q5k92M10k14K79q9m26M51j85j35L82k34K5J26l30K02
$$ y = [21, -104, 60, -13, -153, 197, -115, -106, 222, -158, 62, 209, -180, 47, -137, -224, 127, -148, -30, 114, -244, 123, 31, -265, 22, -142, -75, 276, -114, 42, 137, -226, 105, 41, -137, 162, -72, 16, 240, -217, 216, -30, -151, 185, -149, 94, 69, -178, 44, 172, -83, 60, -59, -164, 226, -31, 31, 241, -30, 119, 144, -45, -38, -170, 6, 324, -179, -13, 67, -274, 173, 3, -9, 164, -169, 3, 47, -121, -5, -50, 124, 186, -212, -9, 168, -299, 112, 13, -193, 143, -116, 9, 150, -245, 136, 113, -191, 178, -54, -15, 32, -260, 185, 276, -157, 264, -264, -210, 117, -107, -16, 76, -186, 95, -17, -221, 135, -106, -92, 97, -207, 146, 14, -227, 261, -23, 147, 211, -30, 58, 131, -164, 122, -50, -39, 175, -5, -31, -22, -188, 173, 70, -153, 107, -52, -149, 19, -205, 261, 108, -15, 401, 109, -25, 149, -179, 43, -11, -125, 167, 82, -210, 200, -14, 265, 176, -250, 201, 16, -119, 263, 29, 54, 180, -150, 52]
4676E2K4k07L00k67Q8K18k36J09J27l86K30j06q8K77l49K14J14m45K17o2J18K40
4698A82l01nM21m15L99l43k44L76j51o9K85j95J47r5k22L19K%l1j03Q6L9k53J34
4722c7J49j39K61k56L1J72l43J25J88l12L05k21n1K76j48j21J95k02J58n0M8Q0
4744A08j12j03L15l56L68j17k47L22k39J06J37j77J41j53j67M30k94j26J83j72
4764a53K00l6j06J94j65k3J34j25n8J70q4MO9%J37l19J50J98j91J37l16J39R2
4787D8m3j21J25k35K58J23l54J89L7k30L00j02q0j5k26M93j20k07L37k17LJ10
4809G3j56J30J69k73L34l30K2K30j58n1J82k44J03M2k41J82j76J85J31k71J12
4830eq3j11L52k93P5K28m26L36j11m3K99l12j10M66k66Q3J13m80M11j96J78J1
$$ y = [52, 76, -131, 169, -98, -10, 208, -28, 81, 208, -178, 52, -54, -142, 135, -214, 0, 114, -331, -114, -176, -58, 182, -119, -124, 297, -118, 281, -62, -306, 70, -81, -150, 135, -60, 87, -8, -230, 89, 91, 91, 60, -43, 43, 82, -171, -37, 112, -27, 234, -22, 9, 181, -162, -37, 151, -161, 144, -77, -128, 148, 0, -121, 74, -128, 30, -20, 28, 108, -4, -107, 208, -148, 220, 103, -144, 178, -61, 45, 182, 5, 146, -7, -174, 256, -38, -164, 19, -153, 47, 11, -95, 99, -66, -89, 45, -80, -138, 32, -52, -48, 21, 21, 158, -161, -11, 187, -4, 133, -183, -44, 48, 5, -116, 9, -226, 32, 155, -199, -10, 27, -203, 97, -5, -85, -100, -326, 167, 47, -160, 177, -40, -37, 73, -83, 47, 216, -57, 277, -53, -31, 199, 41, -10, 172, -72, 31, 73, -168, 14, -162, 23, 154, -117, -5, -88, -199, 153, -140, -65, 163, -263, 73, -38, -81, 218, -94, -204, 262, -4, 79, 192, -288, 123, -73, 105, 116]
4852A16l06J73R0k53L09k14nJ62l33K22Q4k56L83j46l59M50k45mL14j46j9K24
4874B41k77J23j79J7J95l47R6K62l11K53K9l83L13j26o3L59m01L69%m55L79o9
4896B5Ol3j57J12J64l35M84k14j92N02m19j2J27k69L08J20k07q0M1l5O4j04P1
4919c3K11k03J03j07q3K78m62M81k32o4L74l52j87M32j68j22K68k19P8P7j08J76
4941A38j25R2J7l69L70k30M1K60j82j35L34l16J21J84l32K25o9n7J6j34J8J12
4963b1k53L64m4j53K88k94j60N56m30K29J09k94L16l24J35J01k29J79R7k75K31
4984A28k71J01J80j39m3K04l26K58jk82L41j56J5J43k73J11N6k1K15k32o9J54
5006I3l06J48J87k65J99J2k81L13l10R5J86l25K74j20oJ51lj87K35l24L11l3j65
$$ y = [116, -190, -17, 73, -180, 129, -85, -90, 72, -261, -39, 45, -211, 172, 26, -333, 117, -128, -132, 182, 36, 17, 241, -36, 87, -92, -75, 120, -227, -131, 131, -180, 73, 102, -281, 32, -94, -157, 202, -199, 170, 170, -285, 94, 25, 31, -2, -159, -47, 117, -218, 266, 52, -140, 362, -57, -69, 58, -211, 97, 217, 10, -70, -29, -64, 0, -104, -33, 178, -25, 78, -29, -112, 166, -296, 185, -47, -111, 263, -89, -276, 156, -12, -134, 134, -85, -7, 70, -38, 138, 13, 105, 122, -247, 123, -107, -66, 194, 12, -123, 211, -105, 16, 200, -132, 93, 24, -33, -17, -151, -133, -21, -274, 90, 46, -107, 181, -113, -273, 283, -147, 82, 191, -103, 213, -111, 24, 125, -104, 75, 172, -103, 128, -143, -42, 138, -1, -44, 160, -166, 92, 91, -191, 150, -6, 9, 152, -121, -10, 46, 25, 240, 8, -61, 93, -213, -65, 122, -143, 56, 68, -213, 100, -210, -115, 71, -254, 20, -100, -106, 45, 42, -145, 90, -234, 77, 44, -121]
5029a21J51j45pK89k15M8J05k95M10k79j5K84j28j78J62l39L75j18n1J58o9l2
5051a0K27l81K15M1k37J03p6N2K92k39P1J51k27K00k24K37l2l22J44J17m32M58
5073A28nk82J82M2j33K75k83m2J85p7J30k49K0J49q3O0J76m22L74j32k60M27k15
5096c5k5K32m16J25J90l04L97k23j5J82k96K23n3r4K35o7q1J23k20L2N2p9K18
5119A01j10m6J25j23J08m8p1L3J32r1O5j42k0M29n20J97r5k4K91j73j92M07l32
5142i9J54R9k99L73k78k0K50l39J13J60l10K19J78k39J35j94J69k3k41L30R0j60
5164F8q3l5O3m8Pq6K24l6k8K5j60K27j74L4K1j33J44j80P6K09M9j29O5l10K72
5189H2J10m20J20J04k05M41l54O7J6l36M68l01j19M91k07k5R1k13K4J26j28J72
$$ y = [-121, 30, -115, -122, 167, -48, 0, 105, -190, 220, -59, -74, 210, 82, -96, 66, -273, 102, -16, -67, 91, 22, -10, 217, -164, 51, 92, -145, -42, -118, -66, 226, -13, 58, 209, -18, 182, -42, 195, 163, -159, -15, 102, -330, 128, 123, -159, 23, 65, -68, 207, -76, -118, 67, -10, 120, -129, -109, 40, -43, 17, 193, -229, 145, 13, -247, 180, -35, -60, 172, -244, -119, 71, -233, 164, -59, -74, 108, -188, 35, -18, -112, 123, 56, -25, 98, -122, -90, -38, -117, 101, -9, -55, 70, -53, 55, 7, -64, -31, 101, 10, 75, -67, -87, 342, -178, 19, -76, -100, 191, 18, -174, 233, -99, 55, 154, -145, 228, -50, -70, 180, -159, -46, 114, -196, 23, 201, -38, 97, -97, 72, 49, -192, 138, 228, 68, -15, -50, 13, -35, -28, -114, 110, 74, 46, 71, -89, 138, -36, -2, 19, -114, 30, -150, -74, 135, 184, 55, 120, -190, 82, 192, -228, -108, -4, -209, 232, -122, -55, -39, -375, 93, -208, -327, 164, -43, -68, 23, -190, -166, -40, -168, 4]
5211Dm1n7K31l71K59J31k95L35j00l28L89l06R0J19j10J16q1p3L57l18J8J29k54
5234a56J74R2j51OR1k6J26k24J21Q5j05p1O3j26K29k31K49j10j23J08O0o3J38
5257A56j62J6J77k09J36k4j15P5j72qJ48j89L28Q2m94L37j47j40L24k82L50j44
5279D3q1j7p0J36N7j49J25j29m9J19Q7k1j34L3J31k1k71K24M1k00J44P2k06K45
5303A09j86P8R7k71K89j00q7J89k18J51L2j32J17q0k9K58j75j44L50j69l43J96
5325f8p7J39Ok98M30j52k9Nj33l3J05j14K73m1j5O9k22K49J18l06L42m13R4Q6
5349A5j88K80j7k17M4J6J26j5j64oJ26M4p1R9j63J12k5oK31m05K53j70p6K78q8
5374A3j24L25k84J34j67j28J25j19L50j34k3l0J63k96K09j45LK20j34L9K4j90
$$ y = [4, -37, -94, 137, -234, 25, 156, -139, 196, 96, -232, 157, -149, -59, 60, -50, 66, -15, -88, 269, -49, -31, 98, -156, 18, 110, -41, -35, 56, 30, 156, -68, 53, 138, 33, -38, 25, -101, 128, -103, 146, 36, -87, 21, 81, 18, 156, -6, 10, 187, -22, 114, 90, -25, 50, -122, -130, 18, -171, 157, 239, -255, 82, -65, -205, 119, -163, 187, 43, -38, -55, -125, 11, 68, -81, 44, -85, -134, -15, 72, 51, -83, -50, 81, 60, -211, 13, 54, -146, -2, 70, -136, 109, -77, 1, 98, -173, 116, 16, -71, 118, -100, 51, 83, -49, 68, -12, -41, 217, 42, -102, 248, 79, -264, -68, -145, -6, 0, -298, 132, -20, -49, -44, -177, -210, -105, -219, 54, 13, -2, 67, -155, 94, 212, -94, 248, -165, -71, 15, -173, 107, 90, -127, -83, -67, 59, 44, -120, -126, 0, 44, -27, 72, -91, 21, -4, -10, 221, -184, 69, -101, -177, 101, 13, -111, 214, -70, 64, -103, -231, -106, -225, 125, -9, -32, -62, 101, -195, 14, -131, -128, 92, -42, -3, 21, -169]
5396a69R8K2j43L09k20k6L7M6QJ34j92R8O8M7r8j13j16L08l01J73j7n8J96k45
$$ y = [-169, -71, -49, -192, 117, -103, -129, -92, -46, -38, 96, -96, 2, 70, 117, 19, -94, -210, 98, -203, -30, -47, -105, 91, -154]
$$ [...]
8191c8
##END NTUPLES=NMR FID
##END=
