##TITLE=1H_89-2025
 200.13MHz,CDCl3,
 8 sc
 
 5.8.2025
##JCAMPDX= 6.0         $$ Bruker NMR JCAMP-DX V2.0
##DATA TYPE= NMR FID
##DATA CLASS= NTUPLES
##ORIGIN= UXNMR, Bruker Analytische Messtechnik GmbH
##OWNER= pz
$$ XWIN-NMR		Version 3.5
$$ Tue Aug  5 13:53:59 2025 Russian Standard Time (UT+4h)  she@DPX200
##.OBSERVE FREQUENCY= 200.1313
##.OBSERVE NUCLEUS= ^1H
##.DELAY= (6, 6)
##.ACQUISITION MODE= SIMULTANEOUS
##.ACQUISITION SCHEME= undefined
##.AVERAGES= 8
##.DIGITISER RES= 18
##SPECTROMETER/DATA SYSTEM= spect
##.PULSE SEQUENCE= zg30
##.SOLVENT NAME= CDCl3
##.SHIFT REFERENCE= (INTERNAL, CDCl3, 0, 14.3821)
##AUDIT TRAIL= $$ (NUMBER, WHEN, WHO, WHERE, WHAT)
$$ ##TITLE= Audit trail, XWIN-NMR		Version 3.5
$$ ##JCAMPDX= 5.01
$$ ##ORIGIN= Bruker BioSpin GmbH
$$ ##OWNER= she
$$ F:/spectra/data/she/nmr/H-C/1/audita.txt
$$ ##AUDIT TRAIL=  $$ (NUMBER, WHEN, WHO, WHERE, WHAT)
(   1,<2025-08-05 13:52:31.48 +0400>,<she>,<DPX200>,
      <created by zg, POWCHK disabled, PULCHK disabled
       configuration hash MD5:
       00 E9 B6 7A A2 85 ED C7 34 08 36 98 17 FE 4E 26
       data hash MD5: 16K
       FC FB D5 5D 5A 20 06 61 B2 86 6B E3 CB 6A F4 BE>)
$$ ##END=
$$ 
$$ hash MD5
$$ D8 54 0B B8 D3 F7 C0 25 05 3D 90 35 BC DC B1 37
##$RELAX= 
##$RELAX= 
##$RELAX= 
##$RELAX= 
##$RELAX= 
##$RELAX= 
$$ Bruker specific parameters
$$ --------------------------
##$DU= <F:/spectra>
##$EXPNO= 1
##$NAME= <H-C>
##$PROCNO= 1
##$TYPE= <nmr>
##$USER= <she>
##$AMP= (0..31)
100 100 100 100 100 100 100 100 100 100 100 100 100 100 100 100 100 100 
100 100 100 100 100 100 100 100 100 100 100 100 100 100 
##$AQSEQ= 0
##$AQ_mod= 1
##$AUNM= <au_zg>
##$AUTOPOS= <>
##$BF1= 200.13
##$BF2= 200.13
##$BF3= 200.13
##$BF4= 200.13
##$BF5= 200.13
##$BF6= 200.13
##$BF7= 200.13
##$BF8= 200.13
##$BYTORDA= 1
##$CFDGTYP= 0
##$CFRGTYP= 5
##$CHEMSTR= <none>
##$CNST= (0..31)
1 1 145 1 1 1 1 1 1 1 1 1 1 1 1 1 1 1 1 1 1 1 1 1 1 1 1 1 1 1 1 1 
##$CPDPRG= <>
##$CPDPRG1= <>
##$CPDPRG2= <>
##$CPDPRG3= <>
##$CPDPRG4= <mlev>
##$CPDPRG5= <mlev>
##$CPDPRG6= <mlev>
##$CPDPRG7= <mlev>
##$CPDPRG8= <mlev>
##$CPDPRGB= <>
##$CPDPRGT= <>
##$D= (0..31)
0 0.7 0 0 0 0 0 0 0 0 0 0.03 0 0 0 0 0 0 0 0 0 0 0 0 0 0 0 0 0 0 0 0 
##$DATE= 1754387550
##$DBL= (0..7)
120 120 120 120 120 120 120 120 
##$DBP= (0..7)
150 150 150 150 150 150 150 150 
##$DBP07= 0
##$DBPNAM0= <>
##$DBPNAM1= <>
##$DBPNAM2= <>
##$DBPNAM3= <>
##$DBPNAM4= <>
##$DBPNAM5= <>
##$DBPNAM6= <>
##$DBPNAM7= <>
##$DBPOAL= (0..7)
0.5 0.5 0.5 0.5 0.5 0.5 0.5 0.5 
##$DBPOFFS= (0..7)
0 0 0 0 0 0 0 0 
##$DE= 6
##$DECBNUC= <off>
##$DECIM= 32
##$DECNUC= <off>
##$DECSTAT= 4
##$DIGMOD= 1
##$DIGTYP= 9
##$DL= (0..7)
0 120 120 120 120 120 120 120 
##$DP= (0..7)
150 150 150 150 150 150 150 150 
##$DP07= 0
##$DPNAME0= <>
##$DPNAME1= <>
##$DPNAME2= <>
##$DPNAME3= <>
##$DPNAME4= <>
##$DPNAME5= <>
##$DPNAME6= <>
##$DPNAME7= <>
##$DPOAL= (0..7)
0.5 0.5 0.5 0.5 0.5 0.5 0.5 0.5 
##$DPOFFS= (0..7)
0 0 0 0 0 0 0 0 
##$DQDMODE= 0
##$DR= 18
##$DS= 0
##$DSLIST= <SSSSSSSSSSSSSSS>
$$ [...]
##$SUBNAM0= <"">
##$SUBNAM1= <"">
##$SUBNAM2= <"">
##$SUBNAM3= <"">
##$SUBNAM4= <"">
##$SUBNAM5= <"">
##$SUBNAM6= <"">
##$SUBNAM7= <"">
##$SUBNAM8= <"">
##$SUBNAM9= <"">
##$SW= 18.0517328524113
##$SWIBOX= (0..15)
0 0 2 0 0 0 0 0 0 0 0 0 0 0 0 0 
##$SW_h= 3612.71676300578
##$TD= 16384
##$TD0= 1
##$TE= 0
##$TE2= 300
##$TE3= 300
##$TEG= 300
##$TL= (0..7)
0 120 120 120 120 120 120 120 
##$TP= (0..7)
150 150 150 150 150 150 150 150 
##$TP07= 0
##$TPNAME0= <>
##$TPNAME1= <>
##$TPNAME2= <>
##$TPNAME3= <>
##$TPNAME4= <>
##$TPNAME5= <>
##$TPNAME6= <>
##$TPNAME7= <>
##$TPOAL= (0..7)
0.5 0.5 0.5 0.5 0.5 0.5 0.5 0.5 
##$TPOFFS= (0..7)
0 0 0 0 0 0 0 0 
##$TUNHIN= 0
##$TUNHOUT= 0
##$TUNXOUT= 0
##$USERA1= <user>
##$USERA2= <user>
##$USERA3= <user>
##$USERA4= <user>
##$USERA5= <user>
##$V9= 5
##$VALIST= <valist>
##$VCLIST= <CCCCCCCCCCCCCCC>
##$VD= 0
##$VDLIST= <DDDDDDDDDDDDDDD>
##$VPLIST= <PPPPPPPPPPPPPPP>
##$VTLIST= <TTTTTTTTTTTTTTT>
##$WBST= 1024
##$WBSW= 4
##$XGAIN= (0..3)
0 0 0 0 
##$XL= 0
##$YL= 0
##$YMAX_a= 294174
##$YMIN_a= -457878
##$ZGOPTNS= <>
##$ZL1= 120
##$ZL2= 120
##$ZL3= 120
##$ZL4= 120
##$ABSF1= 10
##$ABSF2= 0
##$ABSG= 5
##$ABSL= 3
##$ALPHA= 0
##$AQORDER= 0
##$ASSFAC= 0
##$ASSFACI= 0
##$ASSFACX= 0
##$ASSWID= 0
##$AUNMP= <proc_1d>
##$AZFE= 0.1
##$AZFW= 0.1
##$BCFW= 1
##$BC_mod= 2
##$BYTORDP= 1
##$COROFFS= 0
##$CY= -3
##$DATMOD= 1
##$DC= 2
##$DFILT= <>
##$DTYPP= 0
##$F1P= 0
##$F2P= 0
##$FCOR= 0.5
##$FTSIZE= 0
##$FT_mod= 4
##$GAMMA= 1
##$GB= 0.15
##$INTBC= 1
##$INTSCL= 1
##$ISEN= 128
##$LB= 0.25
##$LEV0= 0
##$LPBIN= 0
##$MAXI= 10000
##$MC2= 0
##$MEAN= 0
##$ME_mod= 0
##$MI= 1.114404
##$NCOEF= 0
##$NC_proc= 0
##$NLEV= 6
##$NOISF1= 3.799351
##$NOISF2= 2.8
##$NSP= 1
##$NTH_PI= 0
##$NZP= 0
##$OFFSET= 14.38212
##$PC= 1
##$PHC0= -1196.472
##$PHC1= 10.1923
##$PH_mod= 1
##$PKNL= yes
##$PPARMOD= 0
##$PSCAL= 0
##$PSIGN= 0
##$REVERSE= no
##$SF= 200.129724274929
##$SI= 16384
##$SIGF1= 3
##$SIGF2= 2
##$SINO= 400
##$SIOLD= 16384
##$SREGLST= <1H.CDCl3>
##$SSB= 0
##$STSI= 0
##$STSR= 0
##$SW_p= 3205.1282051282
##$SYMM= 0
##$S_DEV= 0
##$TDeff= 0
##$TDoff= 0
##$TI= <>
##$TILT= no
##$TM1= 0
##$TM2= 0
##$TOPLEV= 0
##$USERP1= <user>
##$USERP2= <user>
##$USERP3= <user>
##$USERP4= <user>
##$USERP5= <user>
##$WDW= 1
##$XDIM= 8192
##$YMAX_p= 0
##$YMIN_p= 0
$$ End of Bruker specific parameters
$$ ---------------------------------
##NTUPLES= NMR FID
##VAR_NAME=  TIME,          FID/REAL,        FID/IMAG
##SYMBOL=    X,             R,               I
##VAR_TYPE=  INDEPENDENT,   DEPENDENT,       DEPENDENT
##VAR_FORM=  AFFN,          ASDF,            ASDF
##VAR_DIM=   8192,          8192,            8192
##UNITS=     SECONDS,       ARBITRARY UNITS, ARBITRARY UNITS
##FACTOR=    0.0002768,     1,               1
##FIRST=     0,             0,               0
##LAST=      2.2672688,     0,               0
##MIN=       0,             -457878,         0
##MAX=       2.2672688,     294174,          0
$$ Real data points
##PAGE= N=1
##DATA TABLE= (X++(R..R)), XYDATA
$$ [...]
2175A292k211J625L85l258L037K74l638M176j87l160K825j684m70J897k070K017
$$ 1292 -919 706 1091 -2167 870 1144 -2494 1682 1495 -1665 1160 -524 -994 903 -1167 850
2191H50Q09l814L082n36k986L768l74k157K858k316Q8J669k530J900J191l213
$$ 850 1659 -2155 927 391 -2595 1173 799 -1358 1500 -816 -728 941 -1589 311 1502 -1711
2207a711L063m56l270L759j351j221K634k082l44J633k560K016J089k634L049
$$ -1711 1352 896 -2374 1385 34 -1187 1447 -635 -979 654 -1906 110 1199 -1435 1614
2222A614o06l155L250j139j027K968k381K65J653l257J804O88k404K702l72k430
$$ 1614 1008 -2147 1103 -36 -1063 1905 -476 -211 1442 -1815 -11 677 -1727 975 603 -1827
2238a827L197j576j119K912k515M49J802l063K078N17k457L147n44k214K796j965
$$ -1827 1370 -206 -1325 1587 -928 -479 1323 -1740 338 855 -1602 1545 1001 -1213 1583 -382
2254c82n92K480k555R30J464l350K356M39k719L040r27j431L069j890l90K129
$$ -382 -974 1506 -1049 -119 1345 -2005 351 790 -1929 1111 184 -1247 1822 -68 -458 1671
2270A671k785J106J394l500K727J52k626K814m47j605K235k081j0J791k718J654
$$ 1671 -1114 -8 1386 -2114 613 765 -1861 953 506 -1099 1136 -945 -955 836 -1882 -228
2286b28J194k529K446K15k352K714j203r99K254j772j0J525k643J600P49k667
$$ -228 966 -1563 883 1098 -1254 1460 257 -742 1512 -260 -270 1255 -1388 212 961 -1706
2302a706K745l96k263L169j110j629K700k330J73J547k716K218L74k081K828o73
$$ -1706 1039 643 -1620 1549 439 -1190 1510 -820 -647 900 -1816 402 776 -1305 1523 850
2318H50k164K844j762r57J939k296P55J609k351J832J27k059K951r20j774K816
$$ 850 -1314 1530 -232 -1189 750 -1546 -791 818 -1533 299 426 -1633 1318 398 -1376 1440
2334A440j607q05K673k278Q9J535k384J827K39j984K990j430j387K708k309m49
$$ 1440 -167 -972 1701 -577 -488 1047 -1337 490 729 -1255 1735 305 -1082 1626 -683 -1132
2350a132K474k706Q36J484k138K143n91j358K290j852q78K777k657L46K119k374
$$ -1132 1342 -1364 -528 956 -1182 961 370 -988 1302 -550 -1428 1349 -1308 -962 1157 -1217
2366a217J153J256k311J615o7j460J763j068n05K162k404M89J926k882J872J048
$$ -1217 -64 1192 -1119 496 429 -1031 732 -336 -841 1321 -1083 -594 1332 -1550 322 1370
2382A370k249J813L2j887K028j286p72K085k498J101J366k152J567M99k468K197
$$ 1370 -879 934 966 -921 1107 -179 -951 1134 -1364 -263 1103 -1049 518 1017 -1451 746
2398G46o34j246J998j057l95J568j943J092J155k633J974L78k708K760q05j344
$$ 746 112 -1134 864 -193 -588 980 -963 129 1284 -1349 625 1003 -1705 1055 250 -1094
2414a094K015j374n46J888j862Q97Q59k199K693n74j879K665r26j984K505j124
$$ -1094 921 -453 -999 889 -973 -76 783 -1416 1277 703 -1176 1489 563 -1421 1084 -40
2430d0m67J372j218Q52K38k054K298j047j694L129j595j232L130j935n57J992
$$ -40 -507 865 -353 499 737 -1317 981 -66 -1760 1369 -226 -1458 1672 -263 -820 1172
2446A172j864R70J61j656K113r05j549K997j675j239K975k007l7J728j951Q44
$$ 1172 -692 278 439 -1217 896 -9 -1558 1439 -236 -1475 1500 -507 -544 1184 -767 77
2462G7K22j199J613j111p48K663j813n20K548k400K93J547j859R57K54j756J893
$$ 77 299 -900 713 -398 -1146 1517 -296 -816 1732 -668 -375 1172 -687 270 524 -1232 661
2479F61r51n67K292j943j63K241k635O50J676k387J324K99j354J701r38p45K063
$$ 661 -290 -857 1435 -508 -671 1570 -1065 -415 1261 -1126 198 497 -857 844 -94 -839 1224
2496A224j800K60J574k183O53J335k302J532L8j514K076p55j017K107j982P50
$$ 1224 -576 -316 1258 -925 -272 1063 -1239 293 331 -1183 893 138 -879 1228 -754 -4
2512dJ171j907R40P49k242J840j89j358K172j151p13J632j528J96J280j942J431
$$ -4 1167 -740 200 949 -1293 547 358 -1000 1172 21 -692 940 -588 -392 888 -1054 377
2529C77J93j877J905j77j900K574p90j075J950j661K28R85j820J663M6j841K296
$$ 377 570 -1307 598 421 -1479 1095 305 -770 1180 -481 -253 732 -1088 575 621 -1220 1076
2546A076r80j392K305j032n14J649j522mO95j295J223j56q66K309j203j602K692
$$ 1076 96 -1296 1009 -23 -537 1112 -410 -414 281 -1014 209 53 -813 1496 293 -1309 1383
2563A383j674n71K008j524J33P25j464J456l80r48K359j843p62K261j798k56J730
$$ 1383 -291 -862 1146 -378 -245 480 -984 472 92 -856 1503 -340 -1102 1159 -639 -895 835
2580H35j241N50M14j175J043j78j054K236j450n01J812j999m20J865j437P17O28
$$ 835 -406 144 558 -617 426 248 -806 1430 -20 -521 1291 -708 -1128 737 -700 17 645
2597F45j249J334j083o84K321j737l12K156k033J47J013j198P99O49j512J384
$$ 645 -604 730 -353 -1037 1284 -453 -765 1391 -642 -495 518 -680 119 768 -744 640
2613F40o80r13J604q42o74K028k051M5J414j647J408R4j003J463q81r24J937j495
$$ 640 -40 -953 651 -191 -865 1163 -888 -843 571 -1076 332 426 -577 886 5 -919 1018 -477
2631d77r2J865j790J23Q00j197J113q4p06J346j265n11J644j402J51J839j801
$$ -477 -569 1296 -494 -371 429 -768 345 261 -445 901 -364 -875 769 -633 -482 1357 -444
2648d44M12O46j376J349l37r75J876j354l82J729j698K22J242j479P34K25j321
$$ -444 -32 614 -762 587 250 -725 1151 -203 -585 1144 -554 -332 910 -569 165 390 -931
2665i31J366k15j009J787j177m36J864j793K77J064j323Q45L97j315J284j095
$$ -931 435 220 -789 998 -179 -615 1249 -544 -267 797 -526 319 716 -599 685 -410
2681d10n26J894j387m43J885j468K4J512j916Q55M78j178J684r11r04J717j179
$$ -410 -936 958 -429 -872 1013 -455 -431 1081 -835 20 498 -680 1004 93 -811 906 -273
2698b73q9J655j792L47R54j719R09K47j087J534j146p12J903j300R8J350j583
$$ -273 -362 1293 -499 -152 802 -917 -8 239 -848 686 -460 -1172 731 -569 -471 879 -704
2715g04N91O70j439J085J11j079J745j216j99J363j422M48J098j470O12N47j757
$$ -704 -113 557 -882 203 314 -765 980 -236 -435 928 -494 -46 1052 -418 194 741 -1016
2732a016R83J47p47J487j293J76J031j377N16J147j521O23N15j495J076l33p27
$$ -1016 -33 114 -633 854 -439 -263 768 -609 -93 1054 -467 156 671 -824 252 -81 -808
2749h08J443q94k73J561j979Q26Q89j714J173O17j531J370o26p18J408j060P5
$$ -808 635 -259 -532 1029 -950 -124 765 -949 224 841 -690 680 54 -664 744 -316 -241
2766b41J233j311M86O44j787J314J42j529J631m93o48J239r46J04J098j352P06
$$ -241 992 -319 167 811 -976 338 480 -1049 582 89 -559 680 -266 -162 936 -416 290
2783B90K02j524J149K20j206J529o06n44J131r93j12R30j193P51J55j364J770
$$ 290 492 -1032 117 337 -869 660 54 -490 641 -352 -464 466 -727 24 179 -1185 585
2800E85m88r61J855r72o83J912j539Q1J140j581N06N41j038J288q34o04J757j520
$$ 585 97 -864 991 19 -664 1248 -291 -210 930 -651 -145 396 -642 646 -188 -792 965 -555
2818e55j54J680j302k79J212j130P38j26m63J099o44m99J583j498k12J478j325
$$ -555 -709 971 -331 -610 602 -528 210 84 -379 720 76 -423 1160 -338 -550 928 -397
2835c97J65R04j218M32K67p76J266q23k87J542j758K26J328j645M59J247j459
$$ -397 -232 672 -546 -114 153 -623 643 -180 -467 1075 -683 -457 871 -774 -315 932 -527
2852e27N38N99j169Q75o48j22J271j439J94J602j935P98O17j464Q70M26j003J055
$$ -527 11 610 -559 316 -332 -454 817 -622 -428 1174 -761 37 654 -810 60 486 -517 538
2870E38o22k9P05j277N15J017j675R97L67j429J246R3j137J051m48k67P13j209
$$ 538 -84 -113 592 -685 -170 847 -828 169 536 -893 353 446 -691 360 -88 -355 358 -851
2888h51J173M22j895J352L42j639J554j99j075J259l11m11M92o78P34P3j259J490
$$ -851 322 744 -1151 201 543 -1096 458 259 -816 443 132 -279 213 -465 269 342 -917 573
2906E73p3j322J439k28j236J187p01J23P52p18L75K37q61J239o37j110J811q02
$$ 573 500 -822 617 389 -847 340 -361 -238 514 -204 171 408 -453 786 149 -961 850 48
2924D8q52J234m10o58J232q17O19k59q15J554r77p00J565o65r69J653j113k98
$$ 48 -804 430 20 -638 594 -223 396 137 -678 876 -101 -801 764 99 -870 783 -330 -628
2942f28J479j040K13J31m12P17o14k44Q54o45n58J811j357N5Q55j091K60N17q44
$$ -628 851 -189 24 155 -257 460 -154 -398 456 -189 -747 1064 -293 -238 617 -474 -214 303 -541
2961e41J042p11m63J547j228j18J363j111j34J308j525K83Q93j255N49l48r1J605
$$ -541 501 -210 -673 874 -354 -472 891 -220 -354 954 -571 -288 605 -650 -101 -449 -540 1065
2979A065j846M89J215j742P27R25j514N88N62j123P34m70J72P45p17K85N48j801
$$ 1065 -781 -292 923 -819 -92 833 -681 -93 469 -654 80 -390 -218 527 -190 95 643 -1158
2997a158J036Q36j674J173L71j113P87j88o70J085o82n2Q90j145P60J47j045J116
$$ -1158 -122 714 -960 213 584 -529 258 70 -600 485 -197 -249 641 -504 256 403 -642 474
3015D74k40q54R42k46o87J250r32K14L96r99O38M59j418J283L58j498J484o13
$$ 474 234 -620 322 76 -611 639 -293 -79 317 -682 -44 415 -1003 280 638 -860 624 11
3033A1l60J072p20o0O84j340Q69K23j262J635n58j220J704p94l27J306j054j2
$$ 11 -349 723 3 -57 627 -713 156 379 -883 752 194 -1026 678 -116 -443 863 -191 -203
3051b03P46r62P66k26o02J051o34m28J210q13n85J087q24L82N41j098P92m16l75
$$ -203 543 -419 347 121 -481 570 -64 -492 718 -95 -680 407 -417 -35 506 -592 200 -216 -591
3070e91R92m39o06J393r48p1J013j023M4O18r43P96l30l67J320j236o5J277j139
$$ -591 401 -38 -644 749 -199 -270 743 -280 -236 382 -561 235 -95 -462 858 -378 -443 834 -305
3089c05M8R50j325O63L69q39Q15k74o10J327j016k01J145j177J45J263j470L87
$$ -305 -257 693 -632 31 400 -439 376 102 -508 819 -197 -398 747 -430 -285 978 -492 -105
3107a05M04r89R76l18l81J043q61l09J243j094L02N81q19O42N6q27Q46n00k73
$$ -105 299 -690 286 -32 -413 630 -231 -540 703 -391 -89 492 -327 315 371 -456 390 -110 -383
3126c83J015q01p3Q68j063J08O77j046Q35J17q19R99o54j91Q27p19J98Q95j428
$$ -383 632 -169 -242 626 -437 -329 348 -698 137 254 -565 434 -220 -411 416 -303 -105 790 -638
3145f38N93N33j153Q66j06m28P98o94l04J057j159M24Q83r18L15M40j193J045
$$ -638 -45 488 -665 201 95 -333 465 -229 -533 524 -635 -211 672 -246 69 509 -684 361
3163C61j55n39J252j130M6R42j497O58O46q29M72J5r70R03o2n29J099r23q0R23
$$ 361 206 -333 919 -211 -165 777 -720 -62 584 -245 227 242 -728 175 113 -416 683 -240 -320 603
3183F03j257K81P83p67M86J52n52P55l99o07J116q14k27J031q79J24M65l92J83
$$ 603 -654 -373 410 -357 129 281 -271 484 85 -522 594 -220 -447 584 -295 -171 294 -98 85
3202H5m0k95Q08n71m23R88p52O4P37r38K66O09q02N97o4o89O96m34j44R07j075
$$ 85 45 -250 558 -13 -436 552 -200 -136 601 -337 -71 538 -264 333 269 -420 276 -158 -302 605 -470
3223d70N15Q85j252J63O44p62N12k24l68O19m72k9Q29j002O8J047j142L95K68
$$ -470 45 930 -322 -159 485 -277 235 11 -357 262 -210 -239 590 -412 -344 703 -439 -44 224
3242B24j047J145l54l79Q31n13l85R48r46K82Q86j148O70L28r44N01j5l36R22
$$ 224 -823 322 -32 -411 420 -93 -478 470 -476 -194 692 -456 214 542 -402 99 84 -252 670
3261F70o65LO06j010K33O80r83P39Q8p88P41k34p28R83o71M22K51o55L75J94m65
$$ 670 5 8 614 -396 -163 517 -466 273 361 -427 314 80 -648 335 -336 86 337 -318 57 251 -214
3282b14N22k46o22Q14k64l70O55l91j01O00n99K65L92j118Q88n7n50P96k48n10
$$ -214 308 62 -560 254 -10 -380 275 -116 -217 383 -216 49 441 -677 211 154 -396 400 152 -358
3302c58Q28n52M6L50m60K51r6o35R49n98k50J073q51r2Q24p56M9N82j58j64L32
$$ -358 470 -82 -36 314 -146 105 9 -626 323 -275 -525 548 -303 -395 429 -327 -278 304 146 -18 314
3323C14p61Q23k95n90R58m13k20N39o69N0M56k83J68K44o68P88m87k27Q69r10
$$ 314 -447 376 81 -509 449 36 -184 355 -314 -264 192 -91 77 321 -347 441 -46 -273 596 -314
3343c14K30O68n78L0O54r40L36J99m44M37m21j58Q06r57M81N59j047L38N47q05
$$ -314 -84 584 6 36 690 -250 86 285 -159 278 -143 -301 505 -452 29 588 -459 -121 426 -379
3363c79L35K34n47N17j31j63P36r88M90M96j209P55K33r99R67Lq04N67Ll84O27
$$ -379 -44 190 -357 160 29 -134 602 -386 104 600 -609 146 379 -620 347 350 -454 113 116 -268 359
3384C59p98L29K75m58K59K73n46M71K41p35M65l65K56L19o76J65L63q54R25J4
$$ 359 -439 -110 165 -293 -34 239 -307 164 405 -330 135 -230 26 345 -331 -166 197 -657 268 282
3404B82q02Q89j23m95M53k11k83N24n54M18Q9n92P13j95o46P30j76n29O92n76
$$ 282 -520 369 246 -249 204 -7 -290 234 -320 98 187 -405 308 113 -533 197 21 -508 184 -392
3424c92K34L53m75N12j79m22M89j5m28P68m71k63R07m47k28L32n69K60J17k54
$$ -392 -158 195 -280 232 53 -369 120 105 -323 445 -26 -289 618 171 -57 275 -294 -34 83 -171
3444a71L56l23m1P00o37jO08o70j28Q03n69n2N90p89N10j71l53N64l96K9P50o96
$$ -171 185 -138 -179 521 -116 -117 491 -179 -307 496 -73 -125 465 -324 186 15 -338 226 -170 -141 609 -87
3466h7j28O80p34M86j63j01M35n82J03N13l46j1J87n99M63K35o11M39L0n40K90
$$ -87 -215 465 -269 217 54 -47 388 -194 -91 422 76 65 252 -347 116 351 -260 179 209 -331 -41
3487d1J37l39O90n57K4K43o64N80M00o95L82o9l57L88j19l02O80n75M54j5o81
$$ -41 96 -243 447 -110 -86 157 -507 73 473 -222 160 91 -266 122 3 -299 381 -194 260 245 -436
3508d36O87K03r76Q20j08l90M29n37M14K54p31J79N77o21M61j08k00M56j64o06
$$ -436 251 454 -522 298 190 -200 229 -308 106 360 -371 -192 385 -236 225 117 -83 373 209 -397
3528c97N96m9k23K39k62m9Q1l35O13J9n72M87P5m99K82j65j18N82n63K70K69q43
$$ -397 199 150 -73 166 -96 -145 -64 -399 214 233 -339 148 223 -276 6 -159 -277 305 -258 12 281 -562
3550e62Q43J72p30L84O9o62O15l69L59K84o79L86J22m39K88R5n56R41l67l87L44
$$ -562 281 453 -277 107 176 -486 129 -240 119 403 -276 110 232 -207 81 176 -380 561 194 -193 151
3571A51r4l96O75n37M41K81j007O59J02n85L83J17m37N85m61L4K5k98L60Q7k25
$$ 151 57 -339 336 -201 240 521 -486 173 275 -310 73 190 -247 338 -123 -89 -64 -362 -2 85 -140
3592a40K83J71n60L23Q0l95L05j78L1L56n61K52K61l51N68j77l14K55k93mM33
$$ -140 143 314 -246 77 157 -238 67 -111 -80 276 -285 -33 228 -123 445 268 -46 209 -84 -88 345
3613C45m26K7J04m40L05L35o28Q56m18j87K41m98O8K15n7K23K41m56L95q7m87
$$ 345 -81 -54 50 -390 -85 250 -378 478 60 -127 114 -384 -316 -101 -158 65 306 -150 245 158 -329
3634c29N65k65k41N20j14k37L49l16j2K58j62J58K49q58M55K04m35M5J67R2J46
$$ -329 236 -29 -270 250 136 -101 248 -68 -80 178 16 174 423 -435 20 224 -211 -166 1 93 239
3655B39o65M54P3k88L75k08k88L94p0k79K95j79L6K32j44J86k5j92K54m9l08K24
$$ 239 -426 28 101 -187 188 -20 -308 86 16 -263 32 -147 -111 121 -23 163 138 -54 200 151 -157 67
3677F7p1k3O35q20J50K50j89q0L06n38O76k38k73K43rj10j01N6J97J70n35L27
$$ 67 -4 -27 608 -212 -62 188 -1 -81 225 -313 363 125 -148 95 86 -24 -125 -69 128 298 -237 90
3699I0N7j19K33ro37N55l29k3J76l31N39k29k05L65r5j73N10k95j44k2M2M1Ln5
$$ 90 147 28 261 252 -385 170 -159 -182 -6 -337 202 -27 -232 133 38 -135 375 80 -64 -86 -44 -3 0 -55
3723e5R2J52m11N61q9m45J03J21k24L12j10j0M7l44L13L23n93L57J1n78M45k12
$$ -55 37 189 -222 339 250 -195 -92 29 -195 117 7 -3 44 -300 13 336 -257 100 111 -467 -22 -234
3745b34K41Q7j95J00L02m53N7J95k15K41r9k82K22r7Q4J42j47QJ28q3q9p9l8K97
$$ -234 7 94 -101 -1 301 -152 -95 100 -115 126 27 -255 -33 -130 -46 96 -51 -43 85 2 -87 -166 -204 93
3769I3J64m73L54j03p7L27m31L46k64P5J34M6n44N23j93l21M64q0m3K81j46j23
$$ 93 257 -216 138 35 -42 285 -146 200 -64 11 145 191 -353 170 -23 -344 120 40 -3 278 132 9
3791Ik36M14L6k04k42M25j52j77J59j34k57L51q5K15O7m91J87J11r1L64l45j42
$$ 9 -227 187 223 19 -223 202 50 -127 32 -102 -359 -8 -93 122 189 -302 -115 -4 -95 269 -76 -218
3813b18L79l56L3K05o3K47N0m34K37Qm38M43j47j56K88k3n4R2j51J28k56q9K37
$$ -218 161 -195 -162 43 -20 227 277 -157 80 88 -350 93 -54 -210 78 55 1 93 -58 70 -186 -275 -38
3836c8J32j41J27Kl00J60K98m53L53m38L87j01j91K23j05J41j12KK61k8j26j01
$$ -38 94 -47 80 82 -218 -58 240 -213 140 -298 89 -12 -203 20 -85 56 -56 -54 207 179 53 -48
3858d8L20m15K3J84j19R0m0l6J25J94l84K91P4k29j75q8K82O9j66K19J1n84L32
$$ -48 272 -143 -120 64 -55 35 -5 -41 84 278 -106 185 259 30 -145 -233 49 118 -48 171 182 -402 -70
3881g0j20J32J8p0K86O0j00R6k22l90L95O2P1m0N1j54j04J45QR0j20J80k29l12
$$ -70 -190 -58 -40 -110 176 236 136 232 10 -380 15 77 148 108 159 5 -99 46 54 144 24 204 -25 -337
3905c37K61J40Q1K6k94J94j66q3L64Pj98m1j57L02r3k14K21l8P9j3J01j91L6k75
$$ -337 -76 64 145 171 -123 71 -95 -178 186 193 -5 -46 -203 99 6 -208 13 -25 54 41 142 -49 -13 -288
3929b88O30l33K6j33K12Pj46o0N2k77N05k62K07j5j80J51q0p8J65r2j7N9Jl14
$$ -288 342 9 35 -98 114 121 -25 -85 -33 -310 195 -67 140 125 -55 96 16 -62 103 11 -6 53 54 -260
3953b60K92Mj93J12j11j0j11K21J96k67J05jJ9N9M5J40l37K07j29k40J33O7m2
$$ -260 32 36 -157 -45 -156 -166 -277 -56 140 -127 -22 -23 -4 55 100 240 -97 110 -19 -259 -126 -59 -101
3976a01J05n9J44j71O0J45R8j42o2O8j55P9j29K18l2jP1M4k27O2m11M28J74m64
$$ -101 4 -55 89 -82 -22 123 221 79 17 85 -70 9 -120 98 66 65 136 180 -47 15 -396 32 206 -258
4000b58N03k94K06j98J9P7P9r3n8L7J27k20M6J93K8J0k97J70n4k87K86K30k43
$$ -258 245 -49 157 -41 -22 55 134 41 -17 20 147 -73 -27 166 194 204 -93 77 23 -264 22 252 9
4023Ij01m6j65J91l4J30K61n3N7m94L85j30P5J1j03O7k91J39K13j79r9n4j02K96
$$ 9 -92 -138 -303 -112 -146 -16 245 192 249 -245 140 10 85 96 -7 60 -231 -92 121 -58 -157 -211 -313 -17
4047a7j8J94l25J04J91j73n7O7k97K88k4OL23j96J21j62j73K36p4M3K07j46l59
$$ -17 -35 159 -166 -62 129 -44 -101 -34 -331 -43 -67 -61 262 66 187 25 -148 88 14 57 264 118 -241
4070b41J25K56k13K5J82p7O4l82K28j30k49N97k18o8K68M5k51J5N7J31Qj79O9
$$ -241 -116 140 -73 -48 134 57 121 -261 -33 -163 -412 185 -33 -101 167 212 -39 -24 33 164 172 -7 62
4093F2J87n06L69j72J24K3k03K17j87J24k13J33Q6m0J3r6J23j74J07R6k8j08j
$$ 62 249 -257 112 -60 64 87 -116 101 -86 38 -175 -42 44 4 17 -79 44 -130 -23 73 45 -63 -64
4116f4o8Q5O7k2QK79q7Q3k18k55J55o7j26L76k41M2J26J84L8j08l9k81J06k96
$$ -64 -132 -47 20 -2 6 285 198 281 63 -192 -37 -104 -230 146 -95 -53 73 257 295 187 148 -133 -27 -323
4140c23L13l02L27q1j01J41N4j73RL20l02K28MJ02l31n9K46j23k4J44l6K7lj58
$$ -323 -10 -312 15 -66 -167 -26 28 -145 -136 184 -118 110 114 216 -115 -174 72 -51 -75 69 33 60 57 -101
4164a01J47R4R6k09l64K14L45l2j21j37k28J82M6J10r0J78j95kK81n64M17pJ39
$$ -101 46 140 236 27 -337 -123 222 190 69 -68 -296 -114 -68 42 -48 130 -65 -67 214 -350 67 60 199
4187A99k89R9O3q9J4m8R9n20M62l80J63J93J48k85K86k48J35J34j80M8M33l85
$$ 199 -90 9 72 -17 -3 -51 48 -472 -10 -390 -227 -34 114 -171 115 -133 2 136 -44 4 437 52
4209E2j17J80n1k39J20J36k12J47P4j6k3k70K10j19R9J96m27j13L34K16l43K84
$$ 52 -65 115 64 -175 -55 81 -131 16 90 74 51 -219 -9 -128 -29 167 -260 -373 -39 177 -166 118
4231A18L7l2q1N6k50K89K15m05J16jj48l2L2m1p7L04r9j45m8L47k94K44J05j8
$$ 118 155 123 42 98 -152 137 352 -53 63 62 -86 -118 -86 -127 -204 100 1 -144 -192 155 -139 105 210 192
4255A92j01k74N20l94R5j29L6J5J04j04k56J81M0J51q6k28J51J91j85J87k50J84
$$ 192 91 -183 337 -57 38 -91 -55 -40 64 -40 -296 -115 -75 76 -10 -238 -87 104 -81 106 -144 40
4277D0j3l1r9M0R8ok38J09M75m63k51L55K1J29J07l95j31K05Q2k44M41j53m0P1
$$ 40 27 -4 -103 -63 35 29 -209 -100 375 -88 -339 16 37 166 273 -122 -253 -48 34 -210 231 78 38 109
4301A09j42j23J65K99j35P0l02Rr9K60N1r5mK3j03K99k76O5J08j18K3p6J70j70
$$ 109 -33 -156 9 308 173 243 -59 -50 -149 111 162 67 63 86 -17 282 6 71 179 61 84 8 178 8
4325Hoj97L61Qj81o7j69L46j70K1J56o0j04P1L57m95K60M4n26J69J03mJ98l98
$$ 8 2 -195 166 174 -7 -74 -243 103 -67 -46 110 50 -54 17 374 -121 139 183 -343 -174 -71 -75 123 -275
4349b75J48Q4p0K42k45J32NK6j32K16J10j18r2j28J15Q9p8J25l29J62q5J09O9
$$ -275 -127 -43 -113 129 -116 16 21 47 -85 131 241 123 31 -97 18 107 29 154 -175 -13 -98 11 80
4372H0m5k18J72J24j06J0m0Q8k80J95n6P2L0j32lN1Q0l16L49j8k20K98p1K34k56
$$ 80 35 -183 -11 113 7 17 -23 65 -215 -20 -76 -4 26 -106 -109 -58 22 -294 55 37 -183 115 44 278 22
4397B2%o3j67R8K42l23K58O7J96j82k41K54P2k56j60J88r4j00K04j18M45k51k28
$$ 22 22 -41 -208 -110 132 -191 67 134 330 148 -93 161 233 -23 -183 5 -89 -189 15 -103 342 91 -137
4420a37k94M14L6j9J1L40m75J21J83m12J27P0j51N92l91q4l17R5L64r8N5j26K17
$$ -137 -431 -17 19 0 11 351 -124 -3 180 -232 -105 -35 -186 406 15 -69 -386 -291 73 -25 30 -96 121
4443A21j24J10n8j79J33j00K6J66j95k74L84L2n7L2J34j77N62o69L62k82l8n7
$$ 121 -3 107 49 -130 3 -97 -71 95 -100 -374 10 42 -15 17 151 -26 536 -133 229 -53 -91 -148
4465a48J64j48JJ79p4j03O2J41j0j55j5N3rJ3J29j3K22k39N7rj10q3L43j43NJ43
$$ -148 16 -132 -131 48 -26 -129 -67 74 64 -91 -106 -53 -62 -49 80 67 289 50 107 98 -12 -95 248 105 110 253
4491B53m09J3L1l9L0K14m4N0k6k00L30p0L3J33n83L97j43j01RK11j16k5j34K20
$$ 253 -156 -143 -112 -151 -121 93 49 99 73 -127 203 133 166 299 -284 113 -30 -131 -122 89 -27 -52 -186 34
4515C4n7j%P2j88MJ22R5o3K39k33k8l9J15j59l5K21j61O1j5M3o9J54k97m1J70
$$ 34 -23 -24 -24 48 -140 -136 -14 81 18 257 24 -4 -43 72 -87 -122 99 -62 -1 -16 27 -42 112 -185 -226 -56
4541e6K3K9j49o9M76k3j38j90O7K58q5j11J69j62j46k16M60l20L95k37k96K96
$$ -56 -33 -4 -153 -222 254 231 93 -97 -30 228 143 32 201 39 -107 -323 137 -183 212 -25 -321 -25
4563b5J32r8J19j94J90N0m33J89oj37K56k05J37O1K4l52J04L6K05J87q9k33J38
$$ -25 107 9 128 -66 124 174 -259 -70 -76 -213 43 -162 -25 36 60 -292 -188 -152 53 240 151 -82 56
4586E6n2K8J87j64K09n7l20jJ06p9k15K47P5R4l6k18K95j30q5rL11Jp4m62K62
$$ 56 4 32 219 55 264 207 -113 -114 -8 -87 -302 -55 20 114 78 -140 155 25 -60 -69 242 243 169 -293 -31
4611c1k12J29K11l00J99j79p5K62r0J79O7J22j07J7j73k45M41l22L7k39L65P0
$$ -31 -243 -114 97 -203 -4 -183 -258 4 -86 93 160 282 175 192 19 -226 215 -107 -70 -309 56 126
4633A26m5mJ65l11O4J17j32R7Q4k67K77j60j84M49j50k03J68r4j28K46l37N55
$$ 126 81 77 242 -69 -5 112 -20 77 161 -106 171 11 -173 276 126 -77 91 -3 -131 115 -222 333
4655C33j46P3j12j75j33J92j24J14P7o8R2k66J83j6j09o9O2J45J62K04l14k25
$$ 333 187 260 148 -27 -160 32 -92 22 99 31 123 -143 40 24 -85 -154 -92 53 215 419 105 -120
4677a20J66k02L74n2j51k1l01L18O7M1j91j60j44K68m8K8L00j32M0N9Mm47L56
$$ -120 46 -156 218 166 15 -6 -307 11 78 119 -72 -232 -376 -108 -156 -128 172 40 80 139 143 -304 52
4700E2J33j05j25J31p8O9k51J38J85j12p0J89l29J94j36J31M0j01J98j39k3J62
$$ 52 185 80 -45 86 8 77 -174 -36 149 37 -33 156 -173 21 -115 16 56 -45 153 14 -9 153
4722A53j75j56K93n5J07j67m57K75L99p5R2q2l70J78L70m52N0Q2j53K73j5L18
$$ 153 -22 -178 115 60 167 0 -457 -182 217 142 234 152 -218 -40 330 -122 -72 10 -143 130 115 433
4744D33n51M5j78K75n7kJ32n7k18R4J3p9q9K36j41K66m05K28k9K96J3k53R4J59
$$ 433 -118 -73 -251 24 -33 -35 97 40 -178 -84 -71 -150 -239 -3 -144 122 -283 -55 -84 212 225 -28 66 225
4768B25l10L55j38k70L27r2L0j55j01J05J7m1n1J81J39l29M00l82M8L3K0k45P5
$$ 225 -85 270 132 -138 189 97 127 -28 -129 -24 -7 -48 -99 82 221 -108 292 -90 -42 -9 11 -234 -159
4791a59O17n67q8J75O9l11L87j67L2l4n5K58j64k79M84j98k58L73j56P6N5j85
$$ -159 458 -109 -197 -22 47 -264 123 -44 -12 -46 -101 157 -7 -286 198 0 -258 115 -41 35 90 -95
4813i5K43k21j1q9J02J50R5J26m23Q5R2j05L05k85q5K19j76N4o2K92j31J83m43
$$ -95 148 -73 -84 -173 -71 79 174 300 -123 -38 54 -51 254 -31 -116 103 -73 -19 -81 211 80 263 -180
4836a80J99m1J80j77Q6K24m58J12M7m2j40O5M0o6K02j63J50j24M7J19jj48K48
$$ -180 19 -22 158 -19 67 291 -167 -55 -8 -50 -190 -125 -85 -151 51 -112 38 -86 -39 80 79 -69 179
4859A79k30P6M5P%N6p6k26J64J38m12L94k03m9K04K19k06j42j71L13mk21J5J5
$$ 179 -51 25 70 77 77 133 57 -169 -5 133 -279 115 -88 -137 67 286 80 -62 -233 80 76 -145 -130 -115
4883a15J85Q8k5j23o0R5k0j19M0j70J62K4L3P9j08K96m99L05O1Pk5m33M65j42
$$ -115 70 158 133 10 -50 45 25 -94 -54 -224 -62 -38 -5 74 -34 262 -237 68 129 136 111 -322 143 1
4907AR4j63J79j31J07J69k38J08L5j80j51K9o6K24L3j65J56j11k2L63l70L77l47
$$ 1 95 -68 111 -20 87 256 18 126 161 -19 -170 -141 -207 17 50 -115 41 -70 -92 271 -99 278 -69
4930f9J17LJ31l31Q5l26O7M19p9j66J82j49J48j39J51kj29K13o6l57K87J87k43
$$ -69 48 51 182 -149 -64 -390 -323 96 17 -149 33 -116 32 -107 44 42 -87 126 60 -297 -10 177 -66
4953f6L92j6m04P2J15j74K77l91N3J54nQ2l5r9j0j18M31k07LM6l5k45Q7J01m1
$$ -66 326 310 -94 -22 93 -81 196 -195 -142 12 7 89 54 -45 -55 -173 258 51 54 100 65 -180 -93 8 -33
4978c3J70R2k17K71k47k79N91l72J92k76P4K49k48k5j7L67k17J5R1k45K71k47
$$ -33 137 229 12 283 36 -243 348 -24 168 -108 -34 215 -33 -58 -75 292 75 90 181 -64 207 -40
5000d0k07J67P6J98j02l55M13Mj40j28R1k9J18p0M3J32l63J87P6j8rK61j91j49
$$ -40 -247 -80 -4 194 92 -263 150 154 14 -114 -23 -52 66 -4 39 171 -192 -5 71 53 44 305 114 -35
5024c5J1k37K98l5J36n1k55K19N5k22J21R8N3j08N5k52N48l71k39L45k52J67j49
$$ -35 -24 -261 37 2 138 87 -168 51 106 -116 5 103 156 48 103 -149 399 28 -211 134 -118 49 -100
5047a00j22J57N7P0n1j0k9k4k1J84p7J60m17L80k25K31j63j45K35l24J51L33k96
$$ -100 -222 -65 -8 62 11 1 -28 -52 -73 111 34 194 -223 157 -68 163 0 -145 90 -234 -83 250 -46
5070d6J8kk19J81j05J89K21k72k19Q6J08k36L54r2J21j73k14M38k50k16L90k30
$$ -46 -28 -30 -249 -68 -173 16 237 -35 -254 -168 -60 -296 58 -34 87 -86 -300 138 -112 -328 62 -168
5092a68j13J98n5K4K34j77K1K83m32L9J99q0k2j4k4%J34q2J99J0k94K96o8k46
$$ -168 -281 -83 -138 -114 120 -57 -36 247 -185 -146 53 -27 -49 -63 -87 -87 47 -35 164 174 -120 176 108 -138
5116a38R5l32L43p3J96K33l26l6P1q1P1N1j94J00J00k33L23n41K33K36r2k61K37
$$ -138 -43 -375 -32 -105 91 324 -2 -38 33 -48 23 74 -120 -20 80 -153 170 -371 -138 98 6 -255 -18
5139a8K6ml3J10j6K25n30J43L59j46R4n73Q1L80j21O3J2Mj58m6J61p8J76j80K79
$$ -18 8 4 -29 81 65 290 -240 -97 262 116 210 -363 -282 98 -23 40 52 56 -102 -148 13 -65 111 -69 210
5164B10l83J43J72oq7J9N9J6N1k45K62l2j1m8k84J06M1j72LK20k85L47K30k52
$$ 210 -173 -30 142 136 49 68 127 143 194 -51 211 179 168 120 -164 -58 -17 -189 -186 34 -251 96 326 74
5188G4J18m0m30N57m01J9k35L24KK28j89J46J50m2j31R3m52r6M11j17K2r6L10
$$ 74 192 152 -278 279 -122 -103 -338 -14 -12 216 27 173 323 281 150 243 -209 -305 106 -11 11 -85 225
5211B25m0m15O4J84j3m4k30J16K06L7l0k55k03P59l17k72L40j36k7J89p3r3N0
$$ 225 185 -230 -166 18 5 -39 -269 -153 53 90 60 -195 -398 361 44 -228 112 -24 -51 138 65 -28 22
5234B2r5K30l96J61L91m01j76L10K21k28R1k16K88P4l63K02k05q4K32p3p3L7K11
$$ 22 -73 157 -239 -78 313 -88 -264 46 267 39 130 -86 202 276 -87 115 -90 -174 58 -15 -88 -51 160
5257A60k25J70J2j08J30j16K13k34l30M65k96r0N19p1k15L74j02k18K17m23K17
$$ 160 -65 105 117 9 139 23 236 2 -328 137 -159 -249 270 199 -16 358 256 38 255 -168 49
5278D9j38J9K50j29q6j66L86j54j67L8J59J47l03J39j99K01p3k4r6O6N9J4J46
$$ 49 -89 -70 180 51 -35 -201 185 31 -136 -98 61 208 -95 44 -155 46 -27 -51 -147 -81 -22 -8 138
5301A38l13J10J94l42K37J36l51K87J26l69k2J90k17K70j9L9R1k79K80l64oM31
$$ 138 -175 -65 129 -213 24 160 -191 96 222 -147 -169 21 -196 74 55 94 185 -94 186 -178 -184 247
5323B47L5m49J05jq9N6J05p3L93l94K21k60J73j36J53l80M51J5j57j95K84j08
$$ 247 282 -167 -62 -63 -152 -96 9 -64 329 -65 156 -104 69 -67 86 -294 157 172 15 -180 104 -4
5345dJ27k94K04j87J21J60k1j90K03k0j30n2k36J67K51n8p2l55K64J4J63m67O53
$$ -4 123 -171 33 -154 -33 127 106 -84 119 99 -31 -83 -319 -152 99 41 -31 -386 -122 -108 55 -412 241
5368B41l48k5J87k14K99j83l35L19K57l07L23j28j60J85k08L5l4J8L44M4k84N3
$$ 241 -107 -132 55 -159 140 -43 -378 -59 198 -109 214 86 -74 111 -97 -62 -96 -78 266 310 26 79
5390G9k15N7j3J9J82K7k98Q4J02j35M31j81n24M23q9j8K11j83p3K63l25L44jk52
$$ 79 -136 -79 -92 -73 109 136 -162 -78 24 -111 320 139 -385 38 -51 -69 142 -41 -114 149 -176 168 167 -85
5414h5P5K30l83L76j77j97K56j21N3N1k60K25J33j89K12l52j28M64j7l74K17M8
$$ -85 -10 220 -163 213 36 -161 95 -26 27 78 -182 43 176 -13 199 -153 -281 183 166 -208 9 57
5436E7j22Q2j31j5K82m76O32l52N8K86j82l53L30m57N21o9j61J04p2r9k01L66
$$ 57 -65 17 -114 -129 153 -323 309 -43 15 301 119 -234 96 -361 160 91 -70 34 -38 -137 -338 28
5458B8j07K62q4j92M07k73K9K11p02M29J19m10L67J7l65L05j96Q3L11n26J85L61
$$ 28 -79 183 99 -93 314 41 70 281 -421 8 127 -283 84 101 -264 41 -155 -72 239 -287 -102 259
5480B59j15NJ63n28N61l8l85J46nr4J42m73M20J5Q2j57J41k07K27K22o27M69k98
$$ 259 144 149 312 -216 345 307 -78 68 63 -31 111 -362 58 73 155 -2 139 -68 159 381 -246 223 -75
5503g5j84K47J73j61L7j89J51j1m7O1k61R1L00Ol14L60l69J92l9j46J75P5l92
$$ -75 -259 -12 161 0 37 -152 -1 -12 -59 2 -259 -168 132 138 -176 184 -185 7 -32 -178 -3 72 -320
5526c20N88l37j10L80k55R1J21m88K97L73k35o3k67J03K36l42r4M32K6K6q3j21
$$ -320 268 -69 -179 201 -54 37 158 -330 -33 340 105 42 -225 -122 114 -228 -322 110 136 162 79 -42
5548d2M8K7k99M80k59j74J24K32p0k39J54j1K48m27J44J37l89O20m36j43K18J61
$$ -42 6 33 -266 214 -45 -219 -95 137 67 -172 -18 -29 219 -208 -64 73 -316 304 -132 -275 -57 104
5570A04o4K1N2J56m07Q1OJ63o2J84k5j06n6P3p5K10k35K20Jk33J4P5j90K80m4
$$ 104 40 61 113 269 -138 -57 -51 112 50 234 209 103 47 120 45 255 20 240 241 8 22 97 -93 187 143
5595A43m80O05l47M1K38J6J79j74j80J65k98k00M35k81l56O22j67j54M96o62M80
$$ 143 -337 268 -79 -38 200 216 395 221 41 206 -92 -292 143 -138 -494 128 -39 -193 303 -359 121
5616A21k43N5J93J76m84L23p3l43K85J9j64n7J0L14j58j10R4j57j27N07n3l66
$$ 121 -122 -67 126 302 -182 141 68 -275 10 29 -135 -192 -182 132 -26 -136 -42 -199 -326 181 128 -238
5638b38M79j68J7O9m87L46k90l2N55k97j36K49n8m0M8k01n0M98l31L9J18k07L36
$$ -238 241 73 90 159 -328 18 -272 -304 251 -46 -182 67 9 -31 17 -184 -234 264 -67 -28 90 -117 219
5661B19l2n11K28J29k75K70K34l35J85j70K12k74J09J35k22l1L11p8k14L94m10
$$ 219 187 -324 -96 33 -242 28 262 -73 112 -58 154 -120 -11 124 -98 -129 182 104 -110 284 -126
5682a26K88k60r2K59l37M42J08m64j01M17q1J69j02O3k72K8j92K85r4j86K38j25
$$ -126 162 -98 -190 69 -268 174 282 -182 -283 134 53 222 120 183 -89 -61 -253 32 -62 -248 -10 -135
5704a35j23L55R7j39J51Mk93r7K32K06k98j49J80K93j57o6oj92J20j94L08J09
$$ -135 -258 97 194 55 206 210 -83 -180 52 258 -40 -189 -9 284 127 61 55 -137 -17 -211 97 206
5726B06l31L0k33QM24J54q7k8r4Q9J20l25J18k29J70L32j11m58K44j28J38K25
$$ 206 -125 -95 -328 -320 104 258 171 143 49 138 258 -67 51 -178 -8 324 213 -245 -1 -129 9 234
5748B34j59j27j84J58K28j95L7J95j10k08K98j45l14N05l23M2k9j52K86j09j30
$$ 234 75 -52 -236 -78 150 -45 -8 187 77 -131 167 22 -292 213 -110 -68 -97 -249 37 -72 -202
5769b02N72l86n4K50k95L8J39l47K62m0J19N0k30n7M34l76jL66k65L0K69k48j39
$$ -202 370 -16 -70 180 -115 -77 62 -285 -23 -63 56 106 -124 -181 253 -123 -124 242 -23 7 276 28 -111
5792a11Q0k9K61k45o3L07p6l95M69j46J8O2m05K19J15k38K00j31j10L44n6l83
$$ -111 -31 -60 201 -44 -107 200 124 -271 198 52 70 132 -273 -54 61 -177 23 -108 -218 126 70 -313
5814c13M73p2j81j58L9K20q7r1M28k01q7L50m57j5L67j99J29k09J5J32m9r8N40
$$ -313 160 88 -93 -251 -212 8 -79 -170 258 57 -30 320 -137 -152 215 16 145 -64 -49 83 34 -64 476
5837D76m93j51K16k0j14J84m43K76L39k30Q4O8l62Q5O4j80M40o09K08p9J65k07
$$ 476 -17 -168 48 28 -86 98 -345 -69 270 40 124 192 -170 -85 -21 -201 239 -370 -162 -241 -76 -283
5859b83L37j55K36O3m91N07j88m7J98O0k22K22l27J48J85j53L9l09K94j31J54
$$ -283 54 -101 135 198 -293 214 26 -21 177 237 15 237 -90 58 243 90 129 -180 114 -17 137
5880A37m47N11j63j76M60k22r4M3j52L50l34m4L49P4k4K2j81j15K05l98J54K8
$$ 137 -310 201 38 -138 322 100 6 49 -103 247 -87 -131 218 292 268 290 109 -6 199 -199 -45 -17
5902a7j55L20k08j54K20r1N2M84l18j03O1l28N39rn73M85l40j36M00k16J21J85
$$ -17 -172 148 -60 -214 6 -85 -33 451 133 30 91 -237 302 293 -280 205 -135 -271 129 -87 34 219
5924B19k48o6M25m61%K99pOk4m63O08m49l6M25l16J42k4m31N62j28l72M40j43
$$ 219 -29 -95 330 -131 -131 168 161 167 143 -320 288 -161 -197 228 -88 54 30 -401 161 33 -339 101 -42
5947d2k16L60m12M68j17J37m48M72J29j85J82m83P2k4l54Q51l51%j15J64M9j64
$$ -42 -258 102 -310 158 41 178 -270 202 331 146 328 -155 -83 -107 -461 390 39 39 -76 88 137 -27
5969b7j20K26j79k9L10l72J37J23j09p8N67m47J66j32%K07m22k44M47J05k73K99
$$ -27 -147 79 -100 -129 181 -191 -54 69 -40 -118 449 2 168 36 36 243 -179 -423 24 129 -144 155
5991A55l37O8K24k26Q5r9N0L06q9l7O0m81L62J41j75K4J6l07K98j58P1M01m70
$$ 155 -182 -114 110 -116 -31 -130 -80 226 137 100 160 -321 41 182 7 31 47 -260 38 -120 -49 352 -118
6014a18O4K82j50j61K78j33j63L94l62j45M36j24p8o8O4J58l20Q1J04j20L26j33
$$ -118 -54 228 78 -83 195 62 -101 293 -69 -214 222 98 20 -48 16 174 -146 -65 39 -81 245 112
6036A12o13N64M6j06Q9n1m7L39l09k64M92p33M82J17k34M1K9j20K96k51j20M40
$$ 112 -501 63 109 3 92 41 -6 333 24 -240 252 -481 1 118 -116 -75 -46 -166 130 -121 -241 199
6058A99j43jJ84m33J41K44l08L19j58k99K85k53q3O48k69k03L21l21O8o9K23n5
$$ 199 56 55 239 -194 -53 191 -117 202 44 -255 30 -223 -306 342 73 -130 191 -130 -62 -131 92 37
6080C7j18O3K67l89K9J19j59J20J88l01J92L2l15O04l70P7J40m47J22K37l4nN14
$$ 37 -81 -18 249 -140 -111 8 -151 -31 157 -144 48 80 -235 369 -1 76 216 -231 -109 128 94 89 603
6103F03q18L7L57m15N49n81K26N05n66j30L7q6K60K44n16L30J03k55M76l88j61
$$ 603 -215 -178 179 -236 313 -268 -42 463 -103 -233 -196 -282 -22 222 -294 36 139 -116 360 -28 -189
6124a89K74j29o0P7j53L8M91m17n1k13K09K61m43R9N84o14q1J65k2K3L36l85J38
$$ -189 85 -44 -104 -27 -180 -142 349 -68 -119 -332 -123 138 -305 -206 378 -236 -317 -152 -174 -151 185 -200 -62
6147f2J01k98M52q03O28K32n07K19K08m48J38L14l04J94Q7k35K61k90k26O51l82
$$ -62 39 -259 193 -610 18 250 -257 -38 170 -278 -140 174 -130 64 151 -84 177 -113 -339 312 -70
6168g0p7M64m26R9N7J50k87M78l53L36m17L76j00n20P8N24m56q3K39r2j3l0K16
$$ -70 -147 317 -109 -10 47 197 -90 388 35 371 -46 330 230 -290 -212 312 -144 -227 12 -80 -93 -123 93
6191I3jl77J29J00l94O61j65j71j2K32n6k38J94k2M25o32J09M32n22K82L87n21
$$ 93 92 -285 -156 -56 -450 211 46 -125 -137 95 39 -199 -5 -27 398 -234 -125 307 -215 67 454 -67
6213f7J6P0m4K49l25k83N00j99K20J29l20K8K33j21j9j16J08K18o66M96J28m78
$$ -67 -51 19 -25 224 -101 -384 116 -83 137 266 -54 -26 207 86 67 -49 59 277 -389 107 235 -243
6235b43k8M95m82J48M6j53K75n4j86J71J23k84M08k69m7L45p81N83J87l08j9j12
$$ -243 -271 224 -258 -110 -64 -217 58 4 -182 -11 112 -172 236 -33 -80 265 -516 67 254 -54 -73 -185
6257a85L03J96m99R2K65m24K05K44k27O8QJ22j17j77L56j9m25K82L93q50L87J02
$$ -185 118 314 -185 -93 172 -252 -47 197 -30 38 46 168 51 -126 230 211 -214 68 461 -389 -2 100
6279A00o2J93k39m22L38j27K86K65m95K75M6k15l3J98m47L38J86k18K42l87R1
$$ 100 38 231 -8 -430 -92 -219 67 332 -163 112 158 -57 -90 108 -339 -1 185 -33 209 -178 -87
6300h7K06p4K0Pn40M30P8j47J9J07l2J63l31K05J5k1l0O4k17K72j03q3J56l27
$$ -87 119 45 65 72 -468 -38 40 -107 -88 19 -13 150 -181 24 39 18 -12 52 -165 107 4 -79 77 -250
6324b50K99M10l91j8o0j81J74K32j44N9J08n41L01j7J31Q7j13j62K95k51j6L49
$$ -250 49 459 68 50 -10 -191 -17 215 71 130 238 -303 -2 -19 112 199 86 -76 219 -32 -48 301
6346C01n30J19K59q7N5k14k01O78n62j09M94k31J32L3j51r1J35k95J78J27M1K6
$$ 301 -229 -110 149 62 117 -97 -298 380 -182 -291 203 -28 104 137 -14 -105 30 -265 -87 40 81 107
6368A07k71K94o1l23M37O8m38M43l31J17K42k04k19K74J7Qj30q4N24j65m65N58
$$ 107 -164 130 69 -254 183 251 -187 256 -75 42 284 80 -139 135 152 160 30 -54 470 305 -160 398
6390C98m16l27P76n34J41j56j84K07M32n91N25l2k22J45k07l54P05l66j03K28
$$ 398 -18 -345 431 -103 38 -118 -302 -95 337 -254 271 239 17 162 -45 -399 306 -60 -163 65
6410F5k42qL89l09M0L72l05L3j20j87M40k46J99L0l20J55J51m9J27Jn67K25k4
$$ 65 -177 -185 204 -105 -65 307 2 35 -85 -272 168 -78 121 151 -169 -14 137 88 215 216 -351 -126 -150
6433a50K5K1k50J68K81q6j7r0r1M00q0k37K21j63j01L51l62K16L51n61K36J68
$$ -150 -125 -104 -354 -186 95 9 -8 -98 -189 211 131 -106 115 -48 -149 202 -160 56 407 -154 82 250
6455B50k72Q1m3j39K8Q9r9J73j01pL9po7K91l00J1J83k38J80k06j01O08n62J35
$$ 250 -22 59 16 -123 -95 -6 -105 68 -33 -40 -1 -8 -75 216 -84 -73 110 -128 52 -154 -255 353 -209 -74
6479g4O2k91L36Nj78N03m99p1K15m0q3l6j75N80O4m60L72lq2J72m13J25L14m01
$$ -74 -12 -303 33 38 -140 363 -136 -207 8 -32 -115 -151 -326 254 318 -142 230 227 145 317 -96 29 343 -58
6503e8J12o2JM1J37m34L23K05k61Q8O1k53K16m5J62j94m8J03l65m6N5N9J68M69
$$ -58 54 -8 -7 34 171 -263 60 265 4 92 153 -100 116 71 233 39 -9 94 -271 -317 -262 -203 -35 434
6527D34m48K4J33k27l8p5j35K46J55j45L06lj62J18o1l6K26n20K51mj56K79p8
$$ 434 -14 10 143 -84 -122 -197 -332 -86 69 -76 230 227 65 183 122 86 312 -208 43 39 -117 162 84
6550H4j74K92L1m47L05j00j32L17l60R9k6k16N54k01j75J39P5o2J94R5l48J05
$$ 84 -90 202 233 -214 91 -9 -141 176 -184 -85 -111 -327 227 26 -149 -10 65 3 197 292 -56 49
6572D9l56J79J47J10J36j25j70k3J12l70J96O6K51J1o58P07j9n91M15oj15L20
$$ 49 -307 -128 19 129 265 140 -30 -53 59 -311 -115 -49 202 213 -445 262 243 -348 67 61 -54 266
6594B66j56j68O6j25J73p3j73J4L64k25m0m4R4J28r7K04o4m3p0l6J62rj22o3K96
$$ 266 110 -58 8 -117 56 -17 -190 -176 188 -37 -77 -121 -27 101 4 208 144 101 31 -5 157 148 26 -37 259
6619B59K1l97K77l37j4M60n05K25l8k42J23L95j33J99j04j86k78K7K40J9N7J05
$$ 259 280 -117 160 -177 -191 269 -236 -11 -49 -291 -168 227 94 293 189 3 -275 -248 -8 11 68 173
6641A73o5n39M65k41O0L47k4m18M69k17j26Rp0L19j5m22J98K29m17K57r2J37j6
$$ 173 108 -431 34 -207 -147 200 176 -242 227 10 -116 -107 -177 142 127 -295 -97 132 -285 -28 -120 17 1
6664Aq7j84J47K3M55m74JL62m2k81J04J6k04M5J2O2N1j90K48K09l28J20l8j92
$$ 1 -86 -270 -123 -100 355 -119 -118 244 202 -79 25 41 -163 -118 -106 -44 7 -183 65 274 -54 66 28 -164
6688a64O3K82l17J02j18Q6N9j08K07K66m81L38n24K29J14J64m07J92K6K29k02
$$ -164 -101 181 -136 -34 -152 -66 -7 -115 92 358 -123 215 -309 -80 34 198 -209 -17 9 238 36
6709C6k64J71J01l38K25J03l22M18j21R7l2p6J82k73r3M45l92j79N45k80J92m58
$$ 36 -228 -57 44 -294 -69 34 -288 130 9 106 74 -2 180 -93 -186 259 -133 -312 233 -47 145 -313
6731c13K70L8k27P8M55q8l92L46Q9m27O3L67k56R2Q6Pj79q5K72j83j63K84J48
$$ -313 -43 -5 -232 -154 301 213 -179 167 256 -171 -108 259 3 95 181 188 9 -76 196 13 -150 134 282
6754B82l25J78p5k93O11k25j6n0j50K42P8k02nj25o9L73Po00L45j77L22n6K5J5
$$ 282 -43 135 60 -233 378 153 137 87 -63 179 257 55 50 -75 -144 229 236 -364 -19 -196 126 70 95 110
6778A10l6P0M9ql54K87j96K93k1l33K80M2l13oL40k51K20k45j16K10j19j90L33
$$ 110 74 144 193 185 -169 118 -78 215 194 -139 141 183 -130 -136 204 -47 173 -72 -188 22 -97 -287 46
6801D6K38k74L49m45J21J76m06N60m33o1J74jK60k20j08J8j42k1L54j71j43M47
$$ 46 284 10 359 -86 35 211 -195 365 -68 -129 45 44 304 84 -24 -6 -148 -169 185 14 -129 318
6823C18l33j74K12l0L09J14o46L22j98j08n8M07k02J50J98l90J65n22O19l20n9
$$ 318 -15 -189 23 -7 302 416 -230 92 -106 -214 -272 135 -67 83 281 -109 56 -466 153 -167 -226
6844b26L99o0k10K60J4l89N22n65M59K80o53K96l3l35Q6l4k10N04Nj14L55n54
$$ -226 173 113 -97 163 177 -212 310 -255 204 484 -169 127 94 -241 -155 -189 -399 105 110 -4 351 -203
6866b03J23M46j48k17J99k06R7q5p9K57j52m08N16q1k19J6k2J03j75J89J89q8
$$ -203 -80 366 218 1 200 -6 91 6 -73 184 32 -376 140 59 -160 -144 -166 -63 -238 -49 140 52
6888E2k92J34K52l88Q4J68M2J70l81K42j62J91j56M02l18M9k02p6K24J99l43n3
$$ 52 -240 -106 146 -242 -158 10 52 222 -159 83 -79 112 -44 358 40 89 -113 -189 35 234 -109 -162
6910a62J51q9K45k39J77j28k7J65P4j58J48l7lj51N5L8K9j54K6J32j72M29r5n34
$$ -162 -11 -100 145 -94 83 -45 -72 93 167 9 157 120 117 -34 21 59 88 -66 -40 92 -80 349 254 -280
6934b80M28j80n8Q4q3p2K45j70J07k02p5N74k50l43M46l42K48J1j21O6n0l56M87
$$ -280 148 -32 -90 -6 -89 -161 84 -86 21 -181 -256 318 68 -275 171 -171 77 88 -33 33 -17 -373 114
6957A14j44j61K15r0L5K9j11K73k82R8j04J0J67J43l46N4K86l32L83j48k50J1
$$ 114 -30 -191 24 -66 -31 -2 -113 160 -122 -24 -128 -118 49 192 -154 -100 186 -146 237 89 -161 -150
6979a50M2k14L49J60j67n9K71j89K21l36L32Kl60J73ol50J91L16n80M90k7j65
$$ -150 -108 -322 27 187 20 -39 232 43 264 -72 260 262 -98 75 69 -281 -90 226 -354 136 109 -56
7001e6M07n15P7M77m32K05j56j4M2k2J1MpJ75j24k66J39K55r9j20J27j73K18m68
$$ -56 351 -164 -87 390 -42 163 7 -7 35 13 24 28 21 196 72 -194 -55 200 101 -19 108 -65 153 -315
7025c15K03K15k95RL05l09Q2K83k38M7O6l0J15k95P4L43k36p5M50n66p9L34k54
$$ -315 -112 103 -192 -183 122 -187 -105 178 -60 -13 53 23 138 -157 -83 260 24 -51 399 -167 -246 88 -166
7048a66K01m7o5N17n37J80N2j06Kk7k20K9J57k8J4q5j55L31Ok12M28m62J63J41
$$ -166 35 -12 -77 440 -97 83 135 29 31 4 -216 -187 -30 -58 -44 -129 -284 47 53 -159 269 -193 -30 111
7072A11J09k33o5J21K22m29j30N91k04R7M7k45LL45m41J37k8k69M04l97N53j55
$$ 111 220 -13 -78 43 265 -164 -294 297 93 190 237 -8 -5 340 -101 36 8 -261 143 -254 299 144
7094A44j28j28M2J84n22L36j28K96N3O9l00J64k78N12k39P3K07k91k37L12m50
$$ 144 16 -112 -70 114 -408 -72 -200 96 149 218 -82 82 -196 316 77 150 357 66 -171 141 -309
7115c09K07M93l13K10R7k76q8q8L3L11l44n5L42k17j01M9k85O46n25lN27l57O1
$$ -309 -102 391 78 288 385 109 21 -67 -34 277 -67 -122 220 3 -98 -49 -334 312 -213 -216 311 -46 15
7138A5J09m8p1Q7k15j58K84k74M04j22k8L14k13j64o8M5K73k39J9K2k5n9M45k50
$$ 15 124 76 5 92 -123 -281 3 -271 133 11 -17 297 84 -80 -148 -103 170 -69 -50 -28 -53 -112 333 83
7162H3j15N87p52R3K39j19N2l48K35K97l95J57J59n11L42J7l01J45M64l83N1j54
$$ 83 -32 555 -197 -104 135 16 68 -280 -45 252 -143 14 173 -338 4 21 -280 -135 329 -54 -3 -157
7184a57K30M6J5o6K23m84j7L57l28%M8K2J35j53R5KNq8K81j26k85M85k71m6J03
$$ -157 73 119 134 68 291 -193 -210 147 -181 -181 -133 -111 24 -129 -34 -32 -27 -115 166 40 -245 240 -31 -77 26
7209B6J54j59k21J15L44k54j31J74j80r2M85k13J69k49P6J50k08k4J64N9k21J87
$$ 26 180 21 -200 -85 259 5 -126 48 -132 -224 261 48 217 -32 44 194 -14 -38 126 185 -36 151
7231A51j16J6N4m26K59k5J27j0j67j29O34m47J58j7Q7j04N8j00n3P6j62P6q7K61
$$ 151 35 51 105 -321 -62 -87 40 30 -137 -266 368 -79 79 62 149 45 103 3 -50 26 -136 -60 -147 114
7255A14Jo5j74M07l36Q0K21r2k27J5J12L9k03n4N16l15r7K23j24j18K53k76K02
$$ 114 115 50 -124 283 -53 27 248 156 -71 -56 56 95 -108 -162 354 39 -58 165 41 -77 176 -100 102
7278A02N7k5J2q3m53O09l80r0K46k69M84n68J44K45J30k16K21j46k37L90j77m4
$$ 102 159 134 146 63 -390 219 -161 -251 -5 -274 210 -358 -214 31 161 -55 166 20 -217 173 -4 -48
7300d8J96j69K4K6N8j32J91j74J76k38O4j69O1J03J62k08j30K04r3L16j44p6J78
$$ -48 148 -21 3 29 87 -45 146 -28 148 -90 -26 -195 -134 -31 131 -77 -207 -3 -96 220 76 0 178
7323A78m53J51K60k07j1J53j8o6K4K0j67p2J53k5j27Q1N73o02R8M15k40k14L39
$$ 178 -275 -124 136 -71 -82 71 53 -13 11 31 -136 -208 -55 -80 -207 -126 447 -155 -57 358 118 -96 243
7346B43k34o5J08p2Pj04K25r7J6j49L13o5j2k39Rl0O3Q2R8k64o8L49k75K10J95
$$ 243 9 -56 52 -20 -13 -117 108 11 27 -122 191 126 114 -125 -116 -146 -83 -1 97 -167 -235 114 -161 49 244
7371B44k57J66J1m86M18j76J54p6j11O6J7J87P7Nk23j87L18o7K9L1J4p9L7Q0k32
$$ 244 -13 153 164 -322 96 -80 74 -2 -113 -47 -30 157 234 239 16 -171 147 80 109 140 154 75 112 192 -40
7396d0J8L4Q1j02j20K97k08Q1j10J98Rp2j23R0j82k8N22k91l4l0k65L05k9k09
$$ -40 -22 12 93 -9 -129 168 -40 41 -69 129 138 66 -57 33 -149 -177 345 54 20 -10 -275 30 1 -208
7420b08J16Q3L3N7j91K53mj4m6l84K76o2Q9O4n5J28k60J19k14K72k16J11L2Q8
$$ -208 -92 -9 24 81 -110 143 139 125 79 -305 -29 -91 -2 62 7 135 -125 -6 -220 52 -164 -53 -21 67
7444F7k28K24k81J14J44m5M2lj61Q1J55j86K06l32J11j2K33k09Lj23J46J95n8
$$ 67 -161 63 -218 -104 40 -5 37 34 -127 -46 109 -77 129 -203 -92 -104 129 -80 -77 -200 -54 141 83
7467H3n5O3k65J94j01j09L63l00J20R8j6k40J06k95N24j25j81K64J09j25kk55
$$ 83 28 91 -174 20 -81 -190 173 -127 -7 91 75 -165 -59 -354 170 45 -136 128 237 112 110 -145
7489a45N0J5Ok0K57k66N9J32j75L83l45J60j06J60n6K03l03K1j04q5J31J27l6
$$ -145 -95 -80 -74 -94 163 -103 -44 88 -87 296 -49 111 5 165 109 312 9 30 -74 -159 -28 99 63
7512F3r6k21o7L62j27J83J27k61RM7j45m4J93m1m8r4lL42k84M46m22k0j20M98
$$ 63 -33 -254 -321 41 -86 97 224 -37 -28 19 -126 -170 23 -18 -66 -160 -163 179 -105 341 -81 -101 -221 277
7536B77m22M77m68K85mm50J95M05j54K37j90l21N37j10m15M39l40L9J85k31N2
$$ 277 -145 332 -136 149 145 -305 -110 295 141 378 188 -133 404 294 -121 318 -22 17 202 -29 23
7557B3K60l32l1L79k36l9J2j25k4J44J63r5o2j56Qo5L84k19j87K23O5n8J76k85
$$ 23 283 -49 -80 299 63 24 36 -89 -113 31 194 99 37 -119 -111 -176 208 -11 -198 25 90 32 208 -77
7581g7j26J72j85J02O7J07j61o4J33k05J29m3K16R7r7L5j88j4J68L8k53L45k94
$$ -77 -203 -31 -216 -114 -47 60 -101 -165 -32 -237 -108 -151 65 162 65 100 -88 -102 66 104 -149 196 -98
7604i8K2J15kJ22l95Q3K00K29j68J27J72j93j22l21L64m3j82K01k15j9K30l14
$$ -98 -76 39 37 159 -236 -153 47 276 108 235 407 214 92 -229 135 92 -90 111 -104 -123 107 -207
7626b07K55J57m13K92k50N7L80j41j09J2q4nJ97pk51J37k0q8L29l29J71k90j4
$$ -207 48 205 -208 84 -166 -109 271 130 21 33 -51 -56 141 134 -117 20 0 -88 241 -88 83 -207 -221
7649b21L83J9l91M43p9j21j83j06K41k9N3r9j1M7M02m81K43q3m4j61Q4J57J06
$$ -221 162 181 -210 233 154 33 -150 -256 -15 -44 9 -90 -101 -54 348 -133 110 27 -17 -178 -94 63 169
7672A69j79l10K66J27k92J96J18j21K86n32L67K37l50L6j91J01J28k43K82k9n1
$$ 169 -10 -320 -54 73 -219 -23 95 -26 260 -272 95 332 -18 18 -173 -72 56 -187 95 66 15
7693A5k8j50J98j30K62k72r3K78k59K82l84K87J74m22N24n86K64R8n7KP8r8K5
$$ 15 -13 -163 35 -95 167 -105 -198 80 -179 103 -281 6 180 -242 282 -304 -40 58 1 3 81 -17 8
7716HK59n13j03L50P9k09M1Q8j18J86O9m0jl07M52j31j26M03m92j07K32l68P75
$$ 8 267 -246 -349 1 80 -129 -88 0 -118 68 137 97 96 -211 241 110 -16 387 -105 -212 20 -348 427
7739D27k00m80M1K62RK12o44K54L32j97P9j2M5M5L2l49J76Q0j08R8J8k34J92k31
$$ 427 227 -253 -212 50 59 271 -373 -119 213 16 95 83 128 173 205 -144 32 112 4 102 120 -114 78 -153
7763a53j09M21j7k9j56O0J92k99j9L44m01K21P0l83J63L26k27j95L24j49J16n0
$$ -153 -262 159 142 113 -43 17 209 -90 -109 235 -166 55 125 -258 -95 231 4 -191 133 -16 100 50
7785E0j81K85l33M5J98j56L30k8l96K15j64J25K26j65l05L48n6rJ05m7j32Mk85
$$ 50 -131 154 -179 -134 64 -92 238 210 -186 29 -135 -10 216 51 -254 94 38 29 134 87 -45 -41 -326
7808c26L58K75m28J69Q5j65J93R9k71J21l02K0L05l31K14j27R0J97l54o1K17k72
$$ -326 32 307 -121 48 133 -32 161 260 -11 110 -192 -172 133 -198 16 -111 -21 176 -178 -239 -22 -294
7830b94L66j19j15j03K69j54K75m41N1N89m41L8P1k1o4J38O6o2N7K6k8j82j3K12
$$ -294 72 -47 -162 -265 4 -150 125 -316 -265 324 -117 -79 -8 -29 -93 45 111 49 106 132 104 -78 -91 121
7854A21k54J92J39j84M3K20m00K06j92j1k8J6LK13j80j43M36l85K13%j5r4j35
$$ 121 -133 59 198 14 57 277 -123 83 -109 -120 -148 -132 -129 84 -96 -239 197 -188 25 25 10 -84 -219
7877b19k07N06N1k78O2K22k31L02k75R9N5j95R0K36k72J25K40j29j47k04L0K54
$$ -219 -426 80 131 -147 -85 137 -94 208 -67 32 87 -108 -18 218 -54 71 311 182 35 -169 -139 115
7899A15r4q4M33l51L17l89j1M08k60l14Q5J83m0j34k28J92K50l86L76J32l29R6
$$ 115 21 -63 370 19 336 -53 -64 344 84 -230 -145 38 -2 -136 -364 -172 78 -308 68 200 -129 -33
7921c3o8Q0J6J35j96K21L0j99J74j27J0K6k81J02K51j06l2J4j47K89k93L0O7J05
$$ -33 -101 -21 -5 130 -66 155 185 -14 160 33 43 69 -212 -110 141 35 3 17 -130 159 -134 -104 -37 68
7945F8o4q4J19J15l7n7n8p5RJ15M1j52J53l84N99l07q4Q9O4N0j36k38K19Lm4J91
$$ 68 4 -80 39 154 117 60 2 -73 -64 51 92 -60 93 -291 308 1 -83 6 70 120 -16 -254 -35 -32 -76 115
7971A15M7k51K28j08l21L27k3k70L62l32L19L5l56M79j12l06J63M3j53Oj61K37
$$ 115 162 -89 139 31 -290 37 14 -256 106 -226 93 128 -228 251 139 -167 -4 39 -114 -108 -269 -32
7993c2k8j81K35ok14L01J10m57M72l28J77K01r2m14L01k02M11j21k03J01k1QN
$$ -32 -60 -241 -6 -12 -226 75 185 -272 200 -128 49 250 158 -256 45 -157 254 133 -70 31 10 18 23
8016B3J41j54N3l8J26k29l5K34R9m31K65j33j1J60pm1J88m9k35Q9k04K99j01N2
$$ 23 164 10 63 25 151 -78 -113 121 220 -211 54 -79 -90 70 63 22 210 161 -74 15 -189 110 9 61
8040F1q1J72j38L2m6J61l80L9K95R6m01N80n35r4L83j93N3mR3k67l1J12k6J07
$$ 61 -20 152 14 46 0 161 -219 -180 115 211 -190 390 -145 -239 144 -49 4 0 93 -174 -205 -93 -119 -12
8064a2k39K86M3l10L56j18J77k2m7J7j23k3m9K00j81J42j60m01K60K69J1j49K11
$$ -12 -251 35 78 -232 124 6 183 161 114 131 8 -15 -64 136 -45 97 -63 -464 -204 65 76 -73 138
8087A38M0R2k82K37k1Pm3k03j79K30P6r5K79m2m45L69l64J33k05J15P4j05oJ40
$$ 138 178 270 -12 225 204 211 168 -35 -214 16 92 -3 276 234 -211 158 -206 -73 -278 -163 -89 -194 -200 -60
8111f0J40n3J21o6p0J52j52K7L3m3K19j72Qj89R1K25J7l48J99lk92M95l63P4R0
$$ -60 80 27 148 82 12 164 12 39 72 29 248 76 84 -105 -14 211 228 -120 79 76 -216 279 -84 -10 80
8136H0j33P1K2P3k36J90n6J32J60k94J40l12P5N1K16j45L31n62L21O7l83Q7m3
$$ 80 -53 18 40 113 -123 67 11 143 303 9 149 -163 -88 -37 179 34 365 -197 124 191 -192 -105 -148
8159a48j9J98j76L8L29j78o3K90m05J30J60k63J30J71j34k36L00j78o9K81j10
$$ -148 -167 31 -145 -107 222 44 -19 271 -134 -4 156 -107 23 194 60 -176 124 -54 -123 158 48
8180D8j23J84J30l71j06K61J20k74ML67j9
$$ 48 -75 109 239 -132 -238 23 143 -131 -127 240 221
8191B21
$$ Imaginary data points
##PAGE= N=2
##DATA TABLE= (X++(I..I)), XYDATA
0@%%%%%%%%JrJ6j6K4l2L2m0N6p2Q8j04J21j45J76k09K42k82L30l84M46n12N85
$$ 0 0 0 0 0 0 0 0 0 1 -8 8 -8 16 -16 16 -24 32 -40 48 -56 65 -80 96 -113 129 -153 177 -207 239 -273 312
31C12o70P63q63R77j103J242j393J555j737J938k156K393k651K936l247L583l954
$$ 312 -358 405 -458 519 -584 658 -735 820 -917 1021 -1135 1258 -1393 1543 -1704 1879 -2075
48b075M360m803N292n830O424p084P820q648R585j0651J1883j3326J5038j7108
$$ -2075 2285 -2518 2774 -3056 3368 -3716 4104 -4544 5041 -5610 6273 -7053 7985 -9123
62i123J9675k2960K7325l3441M2700n8539R2857l00556K19137L00756n02495K11117
$$ -9123 10552 -12408 14917 -18524 24176 -34363 58494 -242062 -22925 277831 -224664 -13547
74a3547K05421k72771j24352L18866R928k66610J25335L11904l38691j82537L75042
$$ -13547 191874 -80897 -205249 113617 123545 -143065 -17730 294174 -44517 -227054 147988
85A47988l4638k70422K23590J33937j48207p1720M2652k2821j28522R3879K52605
$$ 147988 113350 -157072 66518 200455 52248 -19472 23180 359 -128163 -34284 218321
96B18321k19259k03506K59282j0570k15400J70075J46409j21793p8706Q1426O267
$$ 218321 -938 -204444 54838 44268 -171132 -1057 145352 23559 -55147 26279 32546
107C2546j79476O8986K26404k07638q2348L25959q9184k51136J46394N4114r7909
$$ 32546 -146930 -77944 148460 -59178 -141526 184433 95249 -155887 -9493 44621 -53288
118e3288O0089O9346n9700j16225O0449J21821j33886n603J89074j10917j06348
$$ -53288 6801 76147 16447 -99778 -39329 82492 -51394 -56997 132077 21160 -85188
129h5188J10795j4705j5532K3545m6952L2827o376j4098Q4320q5944o2333J44631
$$ -85188 25607 10902 -4630 18915 -28037 4790 -1586 -15684 68636 -17308 -79641 64990
141F4990o298o6332L2114k7531j2447j8052j3167Q5257l6551l9417R6953p0601
$$ 64990 58692 -7640 24474 -3057 -15504 -33556 -46723 38534 1983 -37434 59519 -11082
153a1082m3747J28050n1208p6500M7290r546K8736Q705n4721M2240j3586k8398
$$ -11082 -54829 73221 22013 -54487 -7197 -16743 11993 20698 -34023 8217 -5369 -33767
165c3767Q4495l0656m1835N3434l7300n495K4194l4607M8637l0762q1564J03187
$$ -33767 50728 20072 -21763 31671 -5629 -11124 13070 -21537 27100 -3662 -85226 17961
177A7961Q444p6572P5864j2470n7643O6087P761k2956j7646j9358O2946k3378
$$ 17961 26405 -50167 25697 13227 -44416 21671 29432 6476 -11170 -30528 32418 9040
189I040l9211J00141m2993q1662Q7933k0257m5271O0758k7704k0137J5840j4401
$$ 9040 -30171 69970 26977 -54685 33248 12991 -32280 28478 774 -19363 -3523 -17924
201a7924N0042k7408o1357P2041j6205m4355P4882k2624l6121L9868j6519J8824
$$ -17924 32118 4710 -56647 15394 -811 -45166 29716 7092 -29029 10839 -5680 13144
213A3144Q079l9892M6659k3422m8323Q8873j7131o3016N4884k3416k6628M3011
$$ 13144 21223 -18669 27990 4568 -43755 45118 27987 -35029 19855 -3561 -30189 12822
225A2822k0006N924N8l0103N6436j2939m4882N9755l0939l7384O6232j8295q168
$$ 12822 -7184 -1260 -1202 -31305 25131 12192 -32690 27065 -3874 -41258 24974 6679 -1489
238a489L0690m1571K1508J3789m4949M2917j4681n3691N6804n324k5144M0083
$$ -1489 29201 -12370 9138 22927 -22022 20895 6214 -47477 9327 4003 -21141 18942
250A8942k8151o29K1269l4169L9568K389n5385N3999k361m5075N6758j3486l4573
$$ 18942 -9209 -9838 11431 -22738 16830 19219 -36166 17833 15472 -29603 27155 13669 -20904
263b0904L4580j6429J0391J6704l9909L0147o129m8836N3720r163m7224M8918
$$ -20904 13676 -2753 7638 24342 -15567 14580 8451 -40385 13335 4172 -43052 5866
275E866r641j5783L9409k0049O633O488l9337L8662j810m5705N1787r403l7771
$$ 5866 -3775 -19558 19851 -198 6435 12923 -26414 12248 10438 -35267 16520 7117 -30654
288c0654N3820q584j8664K7270k3870J0521Q493l3401L5691j3038m5521N1618
$$ -30654 23166 14582 -4082 23188 -682 9839 18332 -15069 20622 7584 -37937 13681
300A3681j4223l5104M8939j8003j5619L2449k0406J1473M630l3945L5575j0232
$$ 13681 -542 -35646 13293 -4710 -20329 12120 -8286 3187 7817 -26128 9447 -785
312g85l1692N4871j6314k6774M9901j9335j1848K8127k7083P307L028k7639L5200
$$ -785 -32477 22394 6080 -20694 29207 9872 -1976 26151 -932 6375 9403 -18236 16964
325A6964j4005k8364M8500k4319k3479M5802k6313j2149K6768k5073R489M107
$$ 16964 2959 -25405 23095 -1224 -24703 21099 -5214 -17363 9405 -15668 -6179 -2072
337b072k1976L3031j5430j8715M9696k4528j4890M6961k7241q540K6012k5053
$$ -2072 -24048 8983 -6447 -25162 24534 6 -14884 32077 4836 -3704 22308 -2745
349b745Q099J164j8065L0778k1328j5206M6476l3237j5805M3206l4918r891K7046
$$ -2745 5354 6518 -11547 19231 -2097 -17303 29173 -4064 -19869 23337 -11581 -21472 5574
362E574k1517Q657K583j0328K9944k2192m982M6469l8530r606M5763l4429m963
$$ 5574 -15943 -7286 -4703 -15031 14913 -7279 -12261 34208 -4322 -13928 31835 -2594 -7557
375g557K7918k5324M618J206q062K4513k7332l130L9739m2779l862M4336l6744
$$ -7557 20361 -4963 -345 861 -7201 17312 -10020 -13150 26589 -16190 -20052 24284 -12460
388a2460l215K6263k1017J0170M809n093J9616k8586L274L8077m4317k657L8446
$$ -12460 -15675 10588 -10429 -259 4550 -543 19073 -9513 -6239 31838 -12479 -15136 23310
401B3310l8468K621K7736k2209P713K58p744J7201k4148P600L0272m5147M161
$$ 23310 -15158 -12537 15199 -7010 703 961 -6783 10418 -13730 -6130 24142 -21005 -16844
414a6844L6909l2494J0830J8919k6513J5962L003j0266J6856k5041O68K6171l6408
$$ -16844 20065 -12429 -1599 17320 -9193 6769 9772 -494 16362 -8679 -8011 18160 -18248
427a8248P466K6989l0329J2828R608k0590K7402m561j9125J9422k1663K569K8273
$$ -18248 -10782 16207 -14122 -1294 8314 -12276 15126 10565 -8560 10862 -10801 -8232 20041
440B0041l2800J523J9604j9550J9058j40k0520K9545j4575j9413K9343j7335m511
$$ 20041 -12759 -11236 8368 -11182 7876 7736 -12784 16761 2186 -17227 12116 -5219 -9730
453i730K4513k5633R43J7645q836J4974j8107j3994M1755k1346k3129L3478k3223
$$ -9730 14783 -10850 -9907 7738 -1098 13876 -4231 -18225 23530 2184 -20945 12533 -10690
466a0690j0475L5016j3506o777R747j967R617k4165M044M7143l7775k2488M3600
$$ -10690 -21165 13851 345 -6432 3315 1348 10965 -13200 -9156 37987 212 -22276 21324
479B1324k5937j1715L9582j7519j5498J4233Q593J427l5468O206M2252m1749q323
$$ 21324 -4613 -16328 23254 5735 -9763 4470 13063 14490 -20978 -14772 27480 -14269 -22592
492b2592N0843l6031j7889L8991j5344j0503K0647J0266q888m1444J5555M5086
$$ -22592 28251 -7780 -25669 13322 -2022 -12525 8122 18388 9500 -31944 -16389 28697
504B8697m5088l521N1278l8182j4201M1676j9060j8925J8386J6462n531l6090
$$ 28697 -16391 -19912 31366 -6816 -21017 20659 1599 -17326 1060 17522 11991 -24099
516b4099K1205L1764n7448M293N9811l2981r704L6498k8992j9943K3196J7728
$$ -24099 -2894 28870 -28578 -24285 35526 2545 -7159 29339 347 -19596 3600 21328
528B1328p334l3669K0093K5642n3821P783M8892l6216m737L2278k4499j1522J0897
$$ 21328 13994 -19675 418 26060 -27761 -19978 28914 -7302 -12039 20239 -4260 -15782 -4885
541d885M141p72k3082K5486L1778n0317l347L9446k5561L184K8102j7382q289
$$ -4885 -744 -1516 -24598 888 32666 -17651 -20998 18448 -7113 -3929 24173 6791 -1498
554a498k017L407Q843k6474J7776L1304m7138l052L9831k4525o939J6615q622
$$ -1498 -3515 -108 8735 -17739 37 31341 -15797 -18849 20982 -3543 -10482 6133 -2489
567b489M044l907K651P615l2874J5200M0028l5793l950L1405k3779r399J2016
$$ -2489 1555 -2352 299 7914 -24960 -9760 30268 -5525 -9475 21930 -1849 -11248 768
580G68K361R975j6223J168J8149l4109Q160L8879l8357j1517L7315j0355j4773
$$ 768 3129 13104 -3119 -1951 16198 -17911 -9751 29128 -9229 -20746 16569 6214 -8559
593h559J718O145O114k2207J5711K7157m4989K970M0499l8900o711M4039j2506
$$ -8559 -6841 -696 5418 -16789 -1078 26079 -18910 -15940 24559 -14341 -21052 22987 10481
606A0481k1179K793J3068M353k4419J8316K3289m4556J0216L9942m3314j0321
$$ 10481 -10698 -7905 5163 9516 -14903 3413 26702 -17854 -7638 32304 -11010 -21331
618b1331L6996j1658j3128Q170J3121k185l2745J8586K7520m1829J1142L6810
$$ -21331 15665 4007 -9121 -951 12170 9985 -22760 -4174 23346 -18483 -7341 29469
630B9469m4630q455L9694q983j6282N744J5797l204k9289K4025K0418m8412J5270
$$ 29469 -15161 -23616 16078 7095 -9187 -3443 12354 9150 -20139 3886 24304 -24108 -8838
643h838L7858m1862j522L3619k0223j5270J1954J6362k109k5373J8767J1939m0204
$$ -8838 29020 -12842 -14364 19255 -968 -16238 -4284 12078 9969 -15404 3363 15302 -24902
656b4902K0333K9141l8159M196K6240j7320m022N727N963r63k3315J8397J6978
$$ -24902 -4569 24572 -13587 -9391 16849 -471 -4493 1234 7197 6234 -17081 1316 18294
669A8294l5765J3057K1864l2636Q141K2426j4959m343m50O452M369k0416J7592
$$ 18294 -17471 -4414 17450 -15186 -7045 15381 422 -3921 -4371 2081 6450 -13966 3626
682C626J2928l4737J5998K0930k8330R561J3981j7274L674M43K650L630k2007
$$ 3626 16554 -18183 -2185 18745 -9585 -24 13957 -3317 357 800 3450 7080 -14927
695a4927J0966J2595k4056J5611J2507k4195J0896O258j1453R788p703j27J0931
$$ -14927 -3961 8634 -15422 189 12696 -11499 -603 5655 -5798 3990 -3713 -3840 7091
708G091j8487R902J5527k3418Q315J1257j6651J0739J464r065P733j0888L495
$$ 7091 -11396 -1494 14033 -9385 -1070 10187 -6464 4275 5739 -3326 4407 -6481 -2986
721b986J3320j9867Q096J2078k2025J2514R969j6162J0463k334r130J2890j0806
$$ -2986 10334 -9533 -1437 10641 -11384 1130 11099 -5063 5400 3066 -6064 6826 -3980
734c980P3J1650j7927P619J2082j7017J0566J869j4281J3333n655n191J5068j5020
$$ -3980 -3907 7743 -10184 -2565 9517 -7500 3066 4935 -9346 3987 -1668 -6859 8209 -6811
748f811L04J6676j6912O511J0920j7393Q422L215j0033J1711p874m813J3090j3728
$$ -6811 -6507 10169 -6743 -232 10688 -6705 1717 4932 -5101 6610 -1264 -6077 7013 -6715
762f715L732J3334j7877P128Q217j5483J2003P1j1990J2962q603l954J5878j3164
$$ -6715 -2983 10351 -7526 -398 7819 -7664 4339 4410 -7580 5382 -3221 -7175 8703 -4461
776d461Q45J2415j4683P316N640j3070R921m209p953J5021j0272k668J6023j6212
$$ -4461 -3616 8799 -5884 1432 7072 -5998 3923 -286 -8239 6782 -3490 -6158 9865 -6347
790f347K843J3773j5502O220N351j3051J0866k960o896J3149j1574j042J3913
$$ -6347 -3504 10269 -5233 987 6338 -6713 4153 1193 -5703 7446 -4128 -5170 8743
803H743j4806M381J0271j6037Q428L508j2258J1934m593p470J4695j0737q6J4162
$$ 8743 -6063 -1682 8589 -7448 980 4488 -7770 4164 -429 -7899 6796 -3941 -4027 10135
817A0135j5050L998R311j4407Q746J398j0600J1518o117m401J3890j2767O71J1867
$$ 10135 -4915 -917 8394 -6013 2733 4131 -6469 5049 -1068 -5469 8421 -4346 -3675 8192
831H192j5789N717Q700j4322R012J299r780J2261o008m087J2584j2064K707J0677
$$ 8192 -7597 -1880 6820 -7502 1510 2809 -6971 5290 -718 -4805 7779 -4285 -1578 9099
845I099j5155O781O150j4266J0047p80r101J2856p268l619J2501j2050K903R686
$$ 9099 -6056 725 6875 -7391 2656 1876 -7225 5631 -1637 -5256 7245 -4805 -1902 7784
859G784j5401P599O010j3138J0473q48p200J1810q342j227J0568j3752M977Q642
$$ 7784 -7617 -18 5992 -7146 3327 2479 -4721 7089 -1253 -2480 8088 -5664 -687 7955
873G955j6675R193N836j3971R650l13p344J0668q327P04Q938j3360P699O862j6941
$$ 7955 -8720 473 6309 -7662 1988 1675 -5669 4999 -3328 -2624 6314 -7046 653 7515 -9426
888i426J1080N357j4446R780M4o355R139p475R97P093j3617R443M821j6779J2912
$$ -9426 1654 7011 -7435 2345 2389 -3966 5173 -2302 -1305 5788 -7829 1614 6435 -10344 2568
903B568N107j4781R966L65o209P855p745L233N476j3384J1206K579j8180J5417
$$ 2568 7675 -7106 2860 3225 -2984 4871 -2874 359 5835 -7549 3657 6236 -11944 3473
917C473L866j5970J0446oo194O510o309M331L555j1752J2799J89j6669J6866K349
$$ 3473 7339 -8631 1815 1809 -4385 2125 -4184 147 3702 -8050 4749 4938 -11731 5135 7484
932G484j5834J2264k69o641N887n940L041K636r815J2721j809j4816J6602j028
$$ 7484 -8350 3914 3645 -2996 2891 -3049 -8 2628 -7187 5534 3725 -11091 5511 4483
946D483j4054J3128j175n270O542o888L669L275r480J2083k093j2770J5676k918
$$ 4483 -9571 3557 2382 -2888 3654 -3234 435 3710 -5770 6313 4220 -8550 7126 4208
960D208j2991J2536l323l403O751q431M619L065j0874J1071l18j0795J4919l857
$$ 4208 -8783 3753 430 -2973 3778 -4653 -34 3031 -7843 3228 2910 -7885 7034 3177
974C177j0604J0974m447q54O943j0091O465M186j2753R624p8r443J2316l903o736
$$ 3177 -7427 3547 -900 -1754 5189 -4902 1563 5749 -7004 2620 2542 -6901 5415 1512 -5224
989e224Q486p028K273N957j2401J0613N629j5766Q368K741r553R450j481l274
$$ -5224 3262 -3766 -1493 4464 -7937 2676 8305 -7461 907 3648 -5905 3545 2064 -1210
1003a210N007p672N644K466j4444J3972N658j7841R377M020j1331O437K79j467
$$ -1210 3797 -3875 1769 4235 -10209 3763 9421 -8420 957 4977 -6354 83 362 -1105
1017a105L928o176P538j065j5957J6554N136j8814J1380N324j2915M421J048R6
$$ -1105 2823 -3353 4185 3120 -12837 3717 8853 -9961 1419 6743 -6172 -1751 -703 -607
1031f07K110n443J0811l632j6574J8812K884k0400J4503O885j2922L453Q46r60
$$ -607 1503 -3940 6871 3239 -13335 5477 8361 -12039 2464 9349 -3573 -120 726 -234
1045b34M36l377J1729m949j5419J8598j337j9953J6146N827j2327M921L57j666
$$ -234 202 -3175 8554 3605 -11814 6784 5447 -14506 1640 7467 -4860 61 418 -1248
1059a248p2l269J1578m558j2187J8711k953j9190J5314L904j0410O421n43q34
$$ -1248 -1320 -4589 6989 2431 -9756 8955 6002 -13188 2126 6030 -4380 2041 1498 664
1073F64o06n642J0622m178j0602J8112l623j6819J4126J865q798O305o51Q62J65
$$ 664 58 -5584 5038 860 -9742 8370 4747 -12072 2054 3919 -4879 1426 775 1637 1802
1088A802n902R505m232r860J6857l747j4130J3663n04p965N366l090K738J324
$$ 1802 -4100 5405 1173 -8687 8170 4423 -9707 3956 3452 -4513 853 -2237 501 1825
1102A825p190Q950k633r678J4364k986j1105J1894q51m365M269n184M898O89r110
$$ 1825 -5365 3585 952 -8726 5638 2652 -8453 3441 2590 -1775 2494 -2690 2208 2897 -6213
1117f213J1010j304j0685J3184k496j0809R639p74k265K701n641O581n29j0310
$$ -6213 4797 3493 -7192 5992 3496 -7313 2326 1552 -713 1988 -3653 2928 2399 -7911
1131g911J1971j110j0749J3117j827j0117Q073j350j243K025n286Q340k078j0551
$$ -7911 4060 2950 -7799 5318 3491 -6626 1447 97 -1146 879 -4407 3933 1855 -8696
1145h696J2390j443j0779J3293j028q637O685j622K43M38n081J0469k853j1120
$$ -8696 3694 2251 -8528 4765 3737 -4900 1785 163 406 844 -4237 6232 3379 -7741
1159g741J3566k380j1751J2945r90p921O376j713k46m24m933J0228l053j0023
$$ -7741 5825 3445 -8306 4639 3649 -4272 2104 391 145 -279 -5212 5016 1963 -8060
1173h060J4051l565j0822J2144j437o662O681k723P39r3n489R450k968q498J3054
$$ -8060 5991 2426 -8396 3748 2311 -4351 2330 -393 346 253 -5236 4214 1246 -7252 5802
1188E802l838r292J1245l009n077O597l400J960J89n844R483l304p777J2380m336
$$ 5802 1964 -7328 3917 908 -4169 2428 -972 988 1177 -4667 4816 1512 -6265 6115 1779
1203A779p594J0108l901l884O134m525K425L67n756Q557k804o779J1596n065n552
$$ 1779 -5815 4293 392 -3492 2642 -1883 542 909 -4847 3710 906 -5873 5723 658 -4894
1218d894R901n406j628N934n919L809O25o629P944k615o178R656n006l955Q092
$$ -4894 5007 -399 -2027 3907 -2012 1797 2422 -4207 3737 1122 -5056 4600 -406 -4361 3731
1233C731o298p4N449o717M594J035p144Q438k657n428R786m785k898P610o354
$$ 3731 -2567 -2641 2808 -3909 685 1720 -5424 3014 357 -5071 4715 -70 -2968 4642 -1712
1248a712Q18M805p596N270N97o525P357k834m361Q398n690j433P657p020J973
$$ -1712 -894 3911 -3685 1585 2182 -4343 3014 180 -4181 4217 -1473 -2906 4751 -2269 -296
1263b96M151p344N439Q78o717P833k735m333P519n462o87O170p776L058L236p835
$$ -296 3855 -3489 1950 2828 -3889 3944 1209 -3124 4395 -1067 -1754 4416 -3360 -302 2934 -4901
1279d901O152L44p051P881k987l587P124n194J39N559p062M329K691p573O904
$$ -4901 1251 1595 -5456 2425 -562 -4149 2975 -2219 -2080 3479 -3583 746 3437 -4136 2768
1294B768n62n956P660l470l288P060n855J019M718p195M624J810p884P038j99
$$ 2768 2206 -3750 3910 440 -2848 4212 -1643 -624 4094 -3101 1523 3333 -4551 2487 2288
1309B288o628P510l064l207O506n552J222L477o638N353Q63p513Q186j625n708
$$ 2288 -4340 3170 106 -3101 3405 -2147 -925 2552 -4086 1267 2130 -5383 2803 1178 -4530
1324d530P813l318l038O451n338J718L373o066M999O5o047P780l226m452Q214
$$ -4530 3283 -35 -3073 3378 -1960 -242 3131 -2935 2064 2129 -3918 3862 636 -3816 4398
1339D398n436k002O707o418J626L409n848M702l81m864P487l569l600Q327n385
$$ 4398 -1038 -3040 3667 -2751 -1125 2284 -3564 1138 757 -4107 3380 -189 -3789 4538 -847
1354h47j343O698o585J517M014o149M282o51m121O702m134k830P896o780m45O693
$$ -847 -2190 4508 -2077 -560 3454 -2695 1587 936 -3185 3517 -617 -3447 4449 -2331 -2776 3917
1370C917p381K436L847o213M089rl494O217m620r39P063p366J186N910q301L236
$$ 3917 -3464 -1028 2819 -3394 695 686 -2808 3409 -1211 -2150 4913 -2453 -1267 4643 -3658 -422
1386d22M176p081M058L20l582N162m334r9N853p095K584M768q728N222L107q038
$$ -422 3754 -3327 731 1051 -2531 2631 -1703 -1802 4051 -3044 -460 4308 -4420 802 3909 -4129
1402d129N589M01m279M809l027o88M048n762L239K676p916O601J477q204O683
$$ -4129 1460 1861 -2418 2391 -636 -1324 2724 -3038 201 2877 -5039 1562 3039 -5165 1518
1417A518J66m820N825k944j046L944n006L399O87o131P839o77p906Q294j400n892
$$ 1518 1684 -3136 2689 -255 -1301 2643 -2363 1036 1723 -4408 3431 2754 -5152 3142 1742 -4150
1433d150O978k590j952L684l685J723l48l732P825k923o207R945l011o715Q236
$$ -4150 2828 238 -1714 1970 -1715 8 -340 -4072 3753 830 -5377 4568 1557 -5158 3078
1448C078k899k858N364k442P7j042k272O938m874l621J0829n504n788R282m808
$$ 3078 179 -2679 2685 243 320 -722 -2994 3944 -930 -4551 6278 774 -5014 4268 -540
1463e40l393O680j791r04o52j020N023o329j430J1140o696l604R719p618l888
$$ -540 -3933 2747 956 52 -600 -1620 3403 -2926 -4356 6784 88 -3516 6203 -1415 -5303
1478e303P811k552o13J329k05K936o819j060R585p385m18J0408q825k475P418
$$ -5303 2508 -44 -657 672 467 3403 -3416 -4476 5109 -2276 -2694 7714 -1111 -3586 3832
1493C832n054j191L141O92K364o214j86O388p942J065R825q664K40O841p278j005
$$ 3832 -1222 -2413 728 1420 3784 -2430 -2616 3772 -4170 -3105 6720 -1944 -1704 5137 -2141 -3146
1509c146L354o68L205l387J36M919q408J340O559p884L426O239p833R04K231l607
$$ -3146 208 -460 2745 -642 -506 4413 -3995 -2655 3904 -3980 -554 5685 -2148 -1244 987 -2620
1525b620L255j812J88M837n780J399L554p412M922M116p014M081J236n650M120
$$ -2620 635 -1177 -989 3848 -1932 -533 3021 -4391 531 4647 -2367 1714 2950 -2700 1420
1540A420k151j705M973l203J228J559o537M436J393o587O946P74n574N557k399
$$ 1420 -731 -2436 2537 -666 562 2121 -4416 20 1413 -5174 1772 2546 -3028 2529 130
1555A30l902M996j942R19K123l617M346j890o078P607j803m910Q432k799n108
$$ 130 -3772 1224 -718 201 2324 -1293 3053 1163 -4915 2692 889 -4021 4411 1612 -3496
1570c496N425k683j210J929j361M416k757m315P210l835m020R235l933l985P303
$$ -3496 1929 -754 -1964 -35 -1396 3020 263 -4052 3158 -677 -4697 4538 605 -3380 3923
1585C923l295k679J821j053L560k295k013O748o237l404R342n060l162Q313l489
$$ 3923 628 -2051 -230 -1283 2277 -18 -2031 4717 -1520 -4924 4418 -642 -3804 4509 1020
1600A020k846K061j292J781k044m54O927o635j952R004p305k565Q047l620j930
$$ 1020 -1826 235 -1057 724 -1320 -1774 5153 -1482 -3434 5570 -1735 -4300 3747 127 -1803
1615a803K834j378J333k845K53N791n950q33Q053p375j708P744m819j370L470
$$ -1803 1031 -347 986 -1859 -1606 4185 -1765 -2598 5455 -1920 -3628 4116 -703 -2073 1397
1630A397j772J403k109q59N394n968J62P151p009q31O503n046j31K902k158K661
$$ 1397 -375 1028 -1081 -1940 3454 -2514 -2352 4799 -2210 -3041 3462 -1584 -1715 1187 -971 1690
1646A690k029o52N282n633k10O180o417k89N441m749Q65J959k701K956k492q44
$$ 1690 -339 -991 4291 -1342 -1552 4628 -1789 -2078 3363 -1386 -521 1438 -1263 1693 -799 -1643
1662a643N145n201l61N663n941N51M219m461J750J125k711L438k227j368N120
$$ -1643 3502 -1699 -2060 3603 -2338 -1787 2432 -2029 -279 846 -1865 1573 -654 -2022 3098
1677C098m529l97N255n751R26K833l590K258O60k096M559k832k100N379m656o62
$$ 3098 -1431 -1828 3427 -2324 -1398 1435 -2155 103 763 -1333 3226 394 -1706 3673 -983 -1645
1693a645N171m453J027K119l823K508p11k278M689l323j165N051n011O2M165m504
$$ -1645 3526 -927 100 2219 -1604 904 193 -2085 2604 -719 -1884 3167 -1844 -1782 2383 -2121
1709b121J536K193l727L072q77k386M917l114r53M614m703KL608m406K000K095
$$ -2121 -585 1608 -2119 953 76 -2310 2607 -507 -1460 3154 -1549 -1547 2061 -2345 -345 1750
1725A750l779L601j085k833M770l438p92M863l972J67L496m662K249R99k875L440
$$ 1750 -2029 1572 487 -2346 2424 -1014 -1806 3057 -915 -748 2748 -1914 335 1334 -1541 1899
1741A899j603k175M602l611q16M445m450P70L214m374K102J089l041L632j456
$$ 1899 296 -1879 2723 -888 -1704 2741 -1709 -939 2275 -2099 3 1092 -1949 1683 227
1756B27j857M158l709q43M218l758J267K498m057K560N7k666L739k007j437M238
$$ 227 -1630 2528 -1181 -2024 2194 -1564 -297 2201 -1856 704 761 -1905 1834 -173 -1610 2628
1772B628l737k53L618m356J747K147m266L096N6k945M026k146p02M098m063M69
$$ 2628 -1109 -1362 2256 -2100 -353 1794 -2472 624 680 -2265 1761 -385 -1087 3011 -1052 -583
1788e83L183m842K476K002m394L567k83l071L625k325o58L541l571Q79K794m293
$$ -583 2600 -2242 234 2236 -2158 1409 1126 -1945 1680 -645 -1303 2238 -1333 -454 2340 -1953
1804a953K326J376m329M083q65k774L904k171j039L242l334J052K176m202L107
$$ -1953 373 1749 -2580 1503 638 -2136 1768 -403 -1442 1800 -1534 -482 1694 -2508 599
1819E99N68m161M413m10l467M350j663j195L294l259J414J312l991L484k61l963
$$ 599 1167 -2994 1419 1009 -2458 1892 229 -966 2328 -931 483 1795 -2196 1288 1027 -2936
1835b936M984j515l235M600k068j320L185k873P89J352l305L618j071l081N237
$$ -2936 2048 533 -2702 1898 -170 -1490 1695 -1178 -389 963 -2342 1276 205 -2876 2361
1850B361j991k445N077k896j342L263l150J050P36k425K961j307k307N001l175
$$ 2361 370 -2075 3002 106 -1236 2027 -1123 -73 663 -1762 1199 -108 -2415 2586 -589
1865e89j809N020l126j180M007l167M27J248j815K141j157j603M443l585j280
$$ -589 -2398 2622 -504 -1684 2323 -844 -417 831 -984 1157 0 -1603 2840 -745 -2025
1880b025N035m541r8L940m059O67K109k395K027j454q4L959m250M28L891m902
$$ -2025 3010 -1531 -1629 2311 -1748 -1081 1028 -1367 660 -794 -878 3081 -1169 -741 3150 -1752
1896a752N39M339n198J222K308k468J556j021m68K909l893J207L637n322J907
$$ -1752 -1213 3126 -2072 -850 1458 -1010 546 -475 -943 1966 -1927 -720 2917 -2405 -498
1911d98L530n509J955K488l191J614j76n65K181l272J375K363n085K738K644n514
$$ -498 3032 -2477 -522 1966 -1225 389 213 -352 1829 -1443 -68 2295 -2790 -52 2592 -2922
1927b922K521K140l513K377l9j152K104k708J207J928m763L504J391n227L879
$$ -2922 -401 1739 -1774 603 564 -588 1516 -1192 15 1943 -2820 684 2075 -3152 727
1942G27J036l821L208k68j779K228k155Q37R50l473L432L23m290M432l08l898
$$ 727 1763 -2058 1150 882 -897 1331 -824 13 963 -2510 922 1245 -3045 1387 1079 -2819
1958b819M393j198j780K802k091P60J195l226L521n78l302M527j478l102M087
$$ -2819 1574 376 -1404 1398 -693 67 1262 -1964 1557 979 -2323 2204 726 -2376 1711
1973A711k036j729L662k239j22J584k433K275j91k414M575k432k205M728l258
$$ 1711 -325 -2054 1608 -631 -753 831 -1602 673 482 -1932 2643 211 -1994 2734 -524
1988e24j643M692l181l00K360k194J439p14j693L449k944p54M754m034l06M534
$$ -524 -2167 2525 -656 -956 1404 -790 649 -65 -1758 1691 -1253 -2007 2747 -1287 -1593 2941
2004B941l943P1L256k827R41r3j206K513l072J20M143m800L60M626m752N27L202
$$ 2941 -1002 -931 2325 -502 439 346 -860 1653 -1419 -1299 2844 -1956 -1596 3030 -1722 -1195 2007
2021B007l058J098J94r69K055k912Q86L524m615J116M257n305J256K719l874J373
$$ 2007 -1051 47 241 -728 1327 -1585 -699 2825 -1790 -674 3583 -1722 -466 2253 -1621 -248
2037b48N33q34J505k615R52K866m480J958L233m838J843K462l861J252P88j486
$$ -248 285 -549 956 -1659 -707 2159 -2321 -363 2870 -1968 -125 2337 -1524 -272 516 -970
2053i70K275k266Q47K118m335K169K447m521K317K128m191J888n1j338K366j724
$$ -970 1305 -961 -114 2004 -2331 -162 2285 -2236 81 2209 -1982 -94 -145 -1483 883 -841
2069h41R19K123m102K070J603m155K788J255l199K553p53j441K405k280Q88K614
$$ -841 78 2201 -1901 169 1772 -2383 405 1660 -1539 1014 261 -1180 1225 -1055 -167 2447
2085B447l915J887J245m202K511P68k668L399j298j306K923l020M72L171l649
$$ 2447 -1468 419 1664 -2538 -27 741 -1927 1472 174 -1132 1791 -1229 -757 2414 -1235
2100a235J695J329l931J939j92j899L436j478l63L160l633N32K836l970J640J808
$$ -1235 460 1789 -2142 -203 -395 -2294 1142 -336 -699 2461 -1172 -640 2196 -1774 -134 1674
2116A674l459K400p63j220K663j890L83L199l733N82K487l875J248J966l051J809
$$ 1674 -1785 615 -148 -1368 1295 -595 -212 2987 -746 -164 2323 -1552 -304 1662 -1389 420
2132D20p00j300K756k492Q61L126m032J040K844m803K193J028k439K051n83o10
$$ 420 -280 -1580 1176 -1316 -455 2671 -1361 -321 2523 -2280 -87 941 -1498 553 -30 -640
2148f40K518k894M21L221m472J465K486m210J885J623k561K437j038o95K193l107
$$ -640 1878 -1016 -595 2626 -1846 -381 2105 -2105 -220 1403 -1158 1279 241 -454 1739 -1368
2164a368J290K698l848J634J802m184J947Q71k004K154j190m35J933k945R53K710
$$ -1368 -78 2620 -1228 406 2208 -1976 -29 842 -1162 992 -198 -633 1300 -1645 -692 2018
2180B018m079J964J866l957J857R70k061K817j342p7J946l581P84K519l894K372
$$ 2018 -2061 -97 1769 -2188 -331 639 -1422 1395 53 -24 1922 -1659 -875 1644 -2250 122
2196A22J569l567K295j28j909K562j173R9K423l273R46J706l730K715J055l196
$$ 122 1691 -1876 419 291 -1618 944 -229 -130 2293 -980 -34 1672 -2058 657 1712 -1484
2212a484K434m46k254K553j705K58K646l041J026J467l976K641R63k315K348o17
$$ -1484 950 504 -1750 803 -902 -644 2002 -1039 -13 1454 -2522 119 1082 -1233 1115 498
2228D98j858K339k029KK430k804J921J042k961J939L53k726K891j267j051K564
$$ 498 -1360 979 -1050 -1048 1382 -1422 499 1541 -1420 519 872 -1854 1037 -230 -1281 1283
2244A283k480O17K375k749J226J676l150J863R5k350K998j116j119K466k739M85
$$ 1283 -1197 -580 1795 -954 272 1948 -1202 661 756 -1594 1404 288 -831 1635 -1104 -619
2260f19K361l147J766J186l103K289m35k062K659j534n12K512k508O02K287l214
$$ -619 1742 -1405 361 1547 -1556 733 298 -1764 895 -639 -1151 1361 -1147 -545 1742 -1472
2276a472J986J037l061K372q31j546K506j381j97K528k797O21J963l286J932N59
$$ -1472 514 1551 -1510 862 31 -1515 991 -390 -587 1941 -856 -235 1728 -1558 374 933
2292I33k524K720r12j045K293k025k08K473k678J337J311l127J565R36k760K065
$$ 933 -1591 1129 217 -828 1465 -560 -768 1705 -973 364 1675 -1452 113 1049 -1711 354
2308C54p57j251K427j739L71K125k700J480J036l103K277r9k364K976p40j232
$$ 354 -403 -1654 773 -966 -595 1530 -1170 310 1346 -1757 520 421 -1943 1033 293 -939
2324i39K455k125M84J806k967J689R74l008K386l00k148K565j260q12K612j940
$$ -939 1516 -609 -125 1681 -1286 403 1377 -1631 755 455 -1693 872 -388 -1200 1412 -528
2340e28L16J572k396J716L90k708K312m85j788K824j674p10K473j848n5J642k521
$$ -528 -212 1360 -1036 680 1070 -1638 674 189 -1599 1225 -449 -1159 1314 -534 -589 1053 -1468
2357a468J457L37j911K571p73j532L167j998n71K626k528N56J330k218J312p8
$$ -1468 -11 326 -1585 986 213 -1319 1848 -150 -721 1905 -623 -67 1263 -955 357 279
2373B79j541K214j173j095L072k616J0K713k494P96J152k342J435j10j755K278
$$ 279 -1262 952 -221 -1316 1756 -860 -850 1863 -631 165 1317 -1025 410 300 -1455 823
2389H23j037m94K590k665L36K045k985J093J436k609J833m4j849K498j030p23
$$ 823 -214 -708 1882 -783 -447 1598 -1387 -294 1142 -1467 366 322 -1527 971 -59 -782
2405g82K201k137N98J757l144J881R34k585J730K57j748J738r30j70J593j878
$$ -782 1419 -718 -120 1637 -1507 374 1308 -1277 453 710 -1038 700 -230 -400 1193 -685
2421f85R62J191l310K193O08k702K304Mj516J748q95k65J402j868R36J011k701
$$ -685 277 1468 -1842 351 959 -1743 561 565 -951 797 -98 -363 1039 -829 107 1118 -1583
2438a583K193N68k922K665j67j930J810j123l32J499j704J043P35k083K277l83
$$ -1583 610 1178 -1744 921 754 -1176 634 -489 -821 678 -1026 17 752 -1331 946 563
2454E63k048K399l91j590J944n57j053J576j830J392K52j957K263k86k245K716
$$ 563 -1485 914 523 -1067 877 320 -733 843 -987 405 657 -1300 963 677 -1568 1148
2470A148q14j723K618j801L2J337j722J308Q5j512K159o45j637K471j909r31K627
$$ 1148 334 -1389 1229 -572 -540 797 -925 383 468 -1044 1115 470 -1167 1304 -605 -1536 1091
2487A091j668K92J201k009J048K93j496K123o99j074K415j912p08K436j993K81
$$ 1091 -577 -285 916 -1093 -45 248 -1248 875 176 -898 1517 -395 -1103 1333 -660 -379
2503c79J618k012J066L55j821K164r10r87J862j583l3J399j744J133J126k348
$$ -379 1239 -773 293 648 -1173 991 81 -906 956 -627 -660 739 -1005 128 1254 -1094
2519a094J605K55k009J812p13p08J641j315L20J495k436J237R15k256J859L40
$$ -1094 511 766 -1243 569 -144 -852 789 -526 -206 1289 -1147 90 1005 -1251 608 948
2535I48k009J545o75q17J605j281N90J363j883R74N97k363J987J73k177J964l12
$$ 948 -1061 484 -191 -1008 597 -684 -94 1269 -614 360 957 -1406 581 754 -1423 541 229
2552B29j396J670j201P36O73j707J557L06k290J782M67k012K140p33r50J549j135
$$ 229 -1167 503 -698 38 711 -996 561 867 -1423 359 826 -1186 954 221 -729 820 -315
2569c15M54N34j394J330j25k040K284l30j694K288n63j068J352j054M43O72j450
$$ -315 139 673 -721 609 484 -1556 728 398 -1296 992 429 -639 713 -341 102 774 -676
2586f76J786q29j557K046p50j512K561j050m86J251j171M17L66j489K063p09j815
$$ -676 1110 281 -1276 770 20 -1492 1069 19 -467 784 -387 30 396 -1093 970 261 -1554
2603a554K306o54j303K097r32k71J374j404L76L77j393J665l49j335K025r34j299
$$ -1554 752 98 -1205 892 -40 -311 1063 -341 35 412 -981 684 335 -1000 1025 91 -1208
2620a208K171j107kJ032j382O27%j527K028n11j119K128j333l33J517j399M11
$$ -1208 963 -144 -146 886 -496 131 131 -1396 632 121 -998 1130 -203 -536 981 -418 -7
2637gQ05j565J083P7j613K109p10j153K107j198n62J255j074J68J114j505J156
$$ -7 798 -767 316 393 -1220 889 179 -974 1133 -65 -627 628 -446 -278 836 -669 487
2654D87l33j534K125n76j170J984r07n72J337j536M04P32j477J550m0j541J927
$$ 487 154 -1380 745 169 -1001 983 76 -496 841 -695 -291 441 -1036 514 474 -1067 860
2671H60o67j030J893r62k18R68j348N43N13j361J386M1j324J629n83j207J770
$$ 860 193 -837 1056 94 -124 844 -504 39 552 -809 577 618 -706 923 340 -867 903
2688I03r02j64R78j641R78L07j595J690j58j252J689r05n35J319j148L50O25j329
$$ 903 1 -163 815 -826 152 459 -1136 554 396 -856 833 -72 -607 712 -436 -86 539 -790
2706g90R73O9j136J629p35o35J544j017o12J485j544M44J014j137Q20J03r86J459
$$ -790 183 252 -884 745 10 -625 919 -98 -710 775 -769 -325 689 -448 372 475 -511 948
2724I48q09o60J597j182n47J290j273M1J049j112J037k88j087J509p05p73J713
$$ 948 139 -521 1076 -106 -653 637 -636 -595 454 -658 379 91 -996 513 -192 -965 748
2741G48j107l83J261j174K81Q19j093J075m2j050J532j111l99J800j452l38J603
$$ 748 -359 -742 519 -655 -374 445 -648 427 385 -665 867 -244 -643 1157 -295 -633 970
2758I70j644O93N59j304J197P5j239J425o61m70J273j356K93Q14j305P04Q21j687
$$ 970 -674 19 578 -726 471 546 -693 732 71 -399 874 -482 -189 625 -680 24 845 -842
2776h42J122j18q34J082p84j49R48j099Q28N06j378J099J56j358J230k33p59J086
$$ -842 280 162 -672 410 -374 -523 425 -674 154 660 -718 381 537 -821 409 176 -583 503
2794E03m93k93R77j284P50L04j619J495J29j245J482n48j147J247o32J19R08j258
$$ 503 10 -283 694 -590 160 464 -1155 340 469 -776 706 158 -989 258 -374 -255 653 -605
2812f05J075K14j456J168m9j555K150j029o02J374r44j00J012j127P22K48j284
$$ -605 470 684 -772 396 347 -1208 942 -87 -689 685 -259 -359 653 -474 248 496 -788
2829g88J648p46j086J744q53j012K019r23k43R35j144P27k09p56J355q75o80J514
$$ -788 860 114 -972 772 -81 -1093 926 3 -240 695 -449 278 69 -687 668 -207 -887 627
2847F27p50p68J863j407j90J512j268N51Q3n66R82m92n70J747j393o11K067j946
$$ 627 -123 -891 972 -435 -625 887 -381 170 253 -313 669 177 -393 1354 -39 -650 1417 -529
2865e29K65J213j512L73L33l55P31o30k09J292j551J87J555j774J42J143j154
$$ -529 -264 949 -563 -190 143 -212 519 -111 -320 972 -579 -392 1163 -611 -469 674 -480
2882d80N06K07r39J086l80j58Q47j332M70J020j711N69R75j627J027N19j162Q73
$$ -480 26 233 -706 380 0 -158 689 -643 -173 847 -864 -295 680 -947 80 599 -563 310
2900C10k82j88J006j425M64R00j651R34M53j658J357K98j283J158m36j40Q00j050
$$ 310 28 -160 846 -579 -115 785 -866 68 521 -1137 220 518 -765 393 -43 -183 617 -433
2918d33N70K27j336J324L13j954J760J72j274J121l29k79M78j062Q50M73j519
$$ -433 137 364 -972 352 665 -1289 471 643 -631 490 161 -118 360 -702 148 621 -898
2935h98J097M14j576J597j46j242J382o49m85Q96m91k23O46r17J118j02j293J568
$$ -898 199 613 -963 634 488 -754 628 -21 -506 390 -101 -324 322 -595 523 421 -872 696
2953F96o51o60J210m63o40R76q68N41j01p35R59l26p48J823j054n42J611j146
$$ 696 45 -615 595 132 -508 468 -400 141 40 -695 264 -62 -810 1013 -41 -583 1028 -118
2971a18k61J256j019j25N12n67P35o34o65J589j096r8J402j349m54J463j012K06
$$ -118 -379 877 -142 -267 245 -322 413 -221 -886 703 -393 -491 911 -438 -892 571 -441 -235
2989b35N41m88P94l78m83J102j317j53J542j295j08J239j273M21O39j190Q35K90
$$ -235 306 -182 612 234 -249 853 -464 -617 925 -370 -478 761 -512 -91 548 -642 193 483
3007D83o26R93j090j12J206j513O10P45j186M22O40q48P07l71m92R22j003l4J394
$$ 483 -143 850 -240 -352 854 -659 -49 696 -490 -68 572 -276 431 60 -432 490 -513 -547 847
3026H47j388N26N43j212R24M30j236R56k87m71Q77q02L28M19r82Q36M68j496J158
$$ 847 -541 -15 528 -684 240 670 -566 390 103 -368 509 -293 35 454 -528 308 776 -720 438
3045D38Q4j230J072p2n62Q07p96R6K32n57R12J04j157J509n08j248J359m57j77
$$ 438 522 -708 364 292 -270 537 -259 -163 69 -488 424 528 -629 880 372 -876 483 26 -151
3064a51R05j218L92N07r60Q16J89j100R88k28p61J100o12r9O78p04K01P28j237
$$ -151 754 -464 -72 435 -525 291 480 -620 368 140 -621 479 -133 -232 446 -258 -57 671 -566
3083e66Q08k12n28J324p19n72J085q31k06R61j024M16P97j378Q83l17n74J396
$$ -566 242 30 -498 826 107 -465 620 -211 -417 544 -480 -64 733 -645 238 -79 -653 743
3101G43p60n65J466j008k23J021q51K75K1n70P08k50p33J325m44q83J621j101
$$ 743 -17 -582 884 -124 -347 674 -177 98 119 -451 257 7 -726 599 155 -728 893 -208
3119b08j7L61p28N24L27q84J073l14m19R15p59k61J212r39R5M89r21P04r7n96
$$ -208 -225 136 -592 -68 259 -625 448 134 -285 630 -129 -390 822 -117 -22 467 -454 250 153 -443
3139d43P96m5q15J226r72l76J170q20J64N82o10R8P4p22J122l65l51Q70o17l77
$$ -443 353 308 -507 719 -253 -629 541 -279 -115 467 -143 -45 29 -693 429 64 -287 583 -34 -411
3159d11P45p64J38P22r52R89k54q41J069l18o40J162m81k44O86j233O30L81j054
$$ -411 334 -430 -292 430 -522 467 213 -628 441 123 -517 645 164 -80 606 -627 3 384 -670
3178f70J068k72o50J129p78n24J282o21M4M53p86O29p3n09O17j93n08Q44k02q20
$$ -670 398 126 -524 605 -173 -697 585 -36 8 461 -325 304 231 -278 339 146 -362 482 280 -540
3198e40J053o68M3L70p26O29J82j126J178k69p21R91k99q15J255p39P5L91p29
$$ -540 513 -155 -112 258 -468 161 343 -783 395 126 -595 396 97 -718 537 -202 -127 264 -465
3217d65Q48j78o62Q64l70o29R15j26n97O80l09k77P04q21M91K48r95J108m13m08
$$ -465 383 205 -457 407 37 -592 323 197 -400 280 -29 -306 398 -423 68 316 -679 429 16 -392
3237c92Q54n60l15J010r93J21O06o20L12K74p27R94o21m26J124j036k25Q68m79
$$ -392 462 -98 -413 597 -396 -275 331 -289 23 297 -430 564 -57 -483 641 -395 -620 248 -231
3256b31L46J11o83L79J62l14O58o65j3R38j066J15P15q77L23L09m27M01P1o71
$$ -231 115 226 -457 -78 84 -230 428 -237 -250 688 -378 -263 452 -425 -102 207 -220 181 252 -419
3276d19N81k98k26Q96j279O08N45q29M93K68o33O00k30l97O89m52r7N34o68L26
$$ -419 162 -136 -362 534 -745 -137 408 -421 72 340 -293 307 77 -320 369 -83 -180 354 -314 12
3296A2N07j083J010k62q15R31k80l24O42j21k54M94q50M88K35m82O86m57p63J315
$$ 12 519 -564 446 184 -631 300 20 -304 338 217 -37 457 -393 95 330 -152 534 77 -686 629
3316F29o17o62J200n42o13R03o11K24L41p91R97k36o27J110n66o60R04l27l67
$$ 629 12 -650 550 8 -605 298 -313 -89 252 -539 458 222 -405 705 139 -521 383 56 -311
3335c11O89n38L38J5n42M86m4n22P06l49m09Q25l15l28O54o36M47J33l62N57l95
$$ -311 378 -160 178 193 -349 137 93 -429 277 -72 -481 344 29 -299 355 -281 166 299 -63 494 99
3356I9m60J088q04j55P41n68K2K48o65M69j29J4J26p8j57Q07q08M1P07j160N91
$$ 99 -361 727 -77 -232 509 -59 -37 211 -454 15 -114 -100 26 -52 -209 598 -210 -169 538 -622 -31
3377c1L82p39M32Pj71L33m75rN95p04O6R85j065O38O3q08N29N9n20O99j59m38
$$ -31 351 -388 44 51 -120 213 -262 -271 324 -380 -314 671 -394 244 307 -501 28 87 -433 266 107 -331
3399c31O70l50N4L92q85P20m6r65Q92Oo69O88k44J3N00n90j5L60o57L97O41j000
$$ -331 339 -11 43 435 -450 270 224 -741 151 157 -512 176 -68 -55 445 -145 -160 200 -457 -60 581 -419
3421d19N68J27n30N42l13pK95o85N23M68j071O06q9m46M96J66q16R36k51k99O49
$$ -419 149 276 -254 288 -25 -32 263 -422 101 569 -502 104 15 -431 65 231 -585 351 100 -199 450
3442D50o60J00K74n90O17N1j006J050j67o24O23j02r8L15o27K62L85m90N55j28
$$ 450 -210 -110 164 -426 191 242 -764 286 119 -505 118 16 -82 233 -394 -132 253 -237 318 190
3462A90m51P03j65o53Q15n83p0M27m78L51K27n94N23l44k75N12m13J38N43o92
$$ 190 -261 442 277 -376 439 -144 -214 213 -265 86 313 -281 242 -102 -377 135 -278 -140 403 -289
3482b89k02P43l33J12K39p63O00k80j24O95n72o9P15n91j3N69p44J59L76n94M27
$$ -289 -491 252 -81 31 270 -493 107 -173 -297 398 -174 -243 472 -119 -132 437 -307 -148 228 -366 61
3503F1j78R0K82n13J89M94m31j42N88p01K68J41m69L47k7k05L23k47J34M30p59
$$ 61 -117 -27 255 -258 -69 425 -6 -148 440 -261 7 148 -321 26 -1 -206 117 -130 4 434 -325
3524c25L83J67n45K63M68n81M33l34R6K7l53P3M33o98N41J49n23L80n8l02K08
$$ -325 58 225 -320 -57 411 -170 263 -71 25 52 -301 -228 205 -493 48 197 -326 54 -4 -306 -98
3545i8j61K48M28o97L55K06p40O06N0o84O05j47q3L90l3l51P33q73J98N06o45
$$ -98 -259 -11 417 -280 75 281 -459 147 197 -487 118 -29 -112 278 245 -106 627 -246 -48 458 -187
3566a87K82L76m94J68O5n30Q36m06k04M46p04L22N47r03M04J46l13K67Q7m16L94
$$ -187 95 471 -23 145 210 -320 516 110 -94 352 -352 -30 517 -386 18 164 -149 118 205 -211 183
3587A83k42q9L01k75j86N57p12N69L22m92J09L0l56L78j14k87O65l35J11R2o20
$$ 183 -59 -148 153 -122 -308 249 -463 106 428 -64 45 75 -281 97 -17 -304 361 26 137 229 -391
3608c91L98J17n54P07l16mM89p77L62L55m54j51O17o94R5J25J18Q0m4j67K35l75
$$ -391 7 124 -430 277 -39 -43 446 -331 31 386 -68 -219 398 -296 -201 -76 42 122 78 -89 146 -229
3630b29K08J34l87J64K82l36M47l40j89M31n58L32M18n79L00o2k36M29q4l25O2
$$ -229 -21 113 -274 -110 172 -164 283 -57 -246 185 -373 -41 377 -202 98 36 -200 229 145 -180 -118
3651a18L1j09L57k21K0L6j90L97k52m0J25J65k28K54l94j22M21j26j77L33l80
$$ -118 -87 -196 161 -60 -40 -4 -194 203 -49 -89 36 201 -27 227 -167 -289 132 6 -171 162 -218
3672b18N3M39o68M21K14o71P15m75Q9P7L6J30R1l28J81J16l55K11M2l34K83K5
$$ -218 -165 274 -394 27 241 -430 285 -190 -101 -24 12 142 233 -95 86 202 -153 58 100 -234 49 74
3694G4m02O37p68L51J86j82n2N51p52M08P6n96M79j25J00K86o15Q5L72m46N38
$$ 74 -328 309 -459 -108 78 -104 -156 395 -357 51 127 -469 10 -115 -15 271 -344 -259 113 -333 205
3715B05Q8m63P6jk64M74q3o1M48o31J04L22m97J74L41l01J21n8k63J99L30j72
$$ 205 293 -170 -94 -95 -359 115 32 -29 419 -212 -108 214 -283 -109 232 -69 52 -6 -269 -70 260 88
3737H8Qo6J0M1j08k21Q39p14R4j5k83L69l49N7L23k68L43J03l01K46M3j64lL8
$$ 88 96 30 40 81 -27 -248 591 -123 -29 -44 -327 42 -307 -250 73 -195 148 251 -50 196 239 75 72 110
3761A10j28Q4l28L79O1m39J12M02l25r8K43k20L57k77P4J14m59M84J85m68J46
$$ 110 -18 66 -262 117 178 -261 -149 253 -72 -170 73 -147 210 -67 7 121 -338 146 331 -137 9
3782IM3n6j95N12k92J08n7j16K52p5j09J34k59J28K00l60K14N5j07q0j4rn2L5
$$ 9 52 -4 -199 313 21 129 72 -44 208 133 24 158 -101 27 227 -133 81 136 29 -51 -65 -74 -126 -91
3806i1R5M23m26n1L65p39L11K3L5K14J45l64K87m99O3K83l26M09K8l91K24J00
$$ -91 4 427 1 -50 315 -424 -113 -90 -55 159 304 -60 227 -272 -209 74 -252 157 185 -206 18 118
3828A18k85L16k28k78L99j96K48L5j26L92n48J31J12J3k35L68k75j33L35k08J4
$$ 118 -167 149 -79 -357 42 -154 94 129 3 395 -153 -22 90 103 -132 236 -39 -172 163 -45 -31
3849c1M32j72j77J22m93M73k95K40J61k15M2J14k75L73k21j48K40q1k31N4L8K2
$$ -31 401 229 52 174 -319 154 -141 99 260 45 87 201 -74 299 78 -70 170 89 -142 -88 -50 -28
3871b8K42l95K12j1k1j09J14p1k51J70r2J92R2k25M14k29M1j54j01L04J40k67
$$ -28 214 -181 31 20 -1 -110 4 -67 -318 -148 -240 -48 44 -181 233 4 45 -109 -210 94 234 -33
3893c3J05k7r2L51m12n8N70n98J22J5j47j90M24j47j2K41q7K13l33J14K22k11
$$ -33 72 45 -47 304 -108 -166 404 -194 -72 -57 -204 -394 30 -117 -129 112 25 238 -95 19 241 30
3915C0k65J98J6m6J01l5K18o8k24L9j27K93r1n0J44k86k5P7J29r3P0n5j48L11
$$ 30 -235 -37 -21 -67 34 -1 217 149 -75 -36 -163 130 39 -11 133 -153 -178 -101 28 -65 5 -50 -198 113
3939A13k13K01p3k08K83Lk10PJ89j17k51L91l46L79k65pJ43J01k78J1K14J74l06
$$ 113 -100 101 28 -180 103 106 -104 -97 92 -25 -276 115 -231 148 -117 -124 19 120 -158 -147 67 241 -65
3962f5J0J58j62n9R3j17J25N8l57N65o8n49L79j7k83K47k34K35q3J6J71p6l23
$$ -65 -55 103 -59 -118 -25 -142 -17 41 -316 249 181 -368 11 -6 -289 -42 -276 -41 -124 -108 63 -13 -336
3985c36M95n9l9K45k85k48J59j90L09n0n8J73Q5m31K64j2j87J83O2p0R9k26M55
$$ -336 159 100 61 306 21 -227 -68 -258 51 1 -57 116 201 -230 34 22 -165 18 80 10 109 -117 338
4008C38n21J05K65j85j26J62J25k32L21l2j68J15m16M18j34M1O7K67n77nN07m70
$$ 338 -183 -78 187 2 -124 38 163 -69 252 220 52 167 -249 169 35 76 143 410 -167 -172 335 -135
4030a35J65K72l58J26n74J61M05j57L78l96J28k93O38n80K67o3l05K31J16o8J10
$$ -135 30 302 -56 70 -504 -343 62 -95 283 -113 15 -278 360 -220 47 -16 -321 -90 26 -42 68
4051F8m18L49J67k60M14m16J88n6k21J01J93p4K5q0k28K22j75J24Q9j67J06K94
$$ 68 -350 -1 166 -94 320 -96 92 36 -185 -84 109 35 60 -20 -248 -26 -201 -77 12 -155 -49 245
4073B45R9n0l94J35J6J17j40J19l66K47j37O6J23j21J82k26K25j75M3p6Jo0M6
$$ 245 344 294 -100 35 51 168 28 147 -219 28 -109 -43 80 -41 141 -85 140 -35 8 -68 -67 -127 -81
4096h1r8M9M21k48O0o6j54JJ46jL2L8r5J30l1k19M23k88kL0j77P1K2M8J67n9Q6
$$ -81 -179 -130 291 43 103 37 -117 -116 30 29 61 99 4 134 103 -116 307 19 17 47 -130 -59 -37 11 178 119 205
4123B05k15K4J4K71m89M31m12K32j4n5j25J70j61N4L20j52j40%p9O5K05j48l2
$$ 205 -10 14 28 299 -190 241 -171 61 47 -8 -133 37 -124 -70 250 98 -42 -42 -121 -56 149 1 -31
4146c1J15q3j32N3J14J10k28L0N4m1J83j66N8O9l50J56J73j14r6L06K3j18k24
$$ -31 84 1 -131 -78 36 146 -82 -52 2 -39 144 -22 36 105 -245 -89 84 -30 -126 180 203 85 -139
4169a39N5J10j77K5K68Q5n2l47K57l2j44K78j09j45J23m1j51L43l54o3M66j07
$$ -139 -84 26 -151 -126 142 227 175 -172 85 53 -91 187 78 -67 56 15 -136 207 -147 -210 256 149
4191A49j90J86n5k71K86j58L0L8k8Q2m8K6l5k27K42m9q1L4J13j68M8J2M3L2j3
$$ 149 -41 145 90 -181 105 -53 -23 15 -13 69 21 47 12 -215 27 -22 -103 -69 44 -124 -76 -64 -21 11 -2
4216bJ6K22j30k99J1j4K35L73m72J06j00j32J54J89o0k1j88J50K07k65r0K16m5
$$ -2 14 236 106 -193 -182 -196 39 412 -60 46 -54 -186 -32 157 97 76 -112 38 245 -20 -110 106 61
4239F1j18K4M6J45r2k37L0K94j63K03k62%O1Q9o4O6j66Q9J60k06L8m0J65j33K16
$$ 61 -57 -33 13 158 66 -171 -141 153 -10 193 -69 -69 -8 81 17 83 -83 6 166 -40 -2 -42 123 -10 206
4264B06k60K63K2j4k35K89m51L17j67m1K02k02O8J68q2j19K3j88J52k3K78l48
$$ 206 -54 209 231 217 -18 271 -180 137 -30 -71 131 -71 -3 165 83 -36 -13 -201 -49 -72 206 -142
4286a42J86j63L7J98l03K91N5j31m3J29j8j63J50n7l8l22L48j59j25K06O3j5J32
$$ -142 44 -119 -82 116 -187 104 159 28 -15 114 96 -67 83 26 -12 -334 14 -145 -270 -64 -1 -16 116
4309A16k91j44L52PO5O7k37J42J10l58R0M6J55l18L28j53N2k22R8J15K41j11l61
$$ 116 -175 -319 33 40 105 172 -65 77 187 -171 -81 -35 120 -198 130 -23 29 -193 -95 20 261 150 -211
4332b11K64n1p0o9O2K03P9j60k43J76N2Kj10L32n54L68M0j80R0J23j2k72K47J03
$$ -211 53 2 -68 -137 -75 128 207 47 -196 -20 32 34 -76 256 -298 70 110 -70 20 143 131 -141 106 209
4356B09r5K7kl80K54J05n7J74k39J11r7l14J83L28l09K04K20j36j24K3m9q8J79
$$ 209 114 141 139 -241 13 118 61 235 -4 107 10 -304 -121 207 -102 102 322 186 62 85 36 -52 127
4379A27n3K08l20J55k40K04l2j23K18j96J23l08K78j0K41k41n4J09q5Q7J17k84
$$ 127 74 282 -38 117 -123 81 49 -74 144 -52 71 -237 41 31 272 31 -23 86 1 88 205 -79
4401g9J26jk2j03L03m23J19j95L82k06J45j13K84k57p1L55l81J44r1P6j93m0J37
$$ -79 47 46 24 -79 224 -199 -80 -275 107 -99 46 -67 217 -40 -111 244 -137 7 -84 -8 -201 -241 -104
4424a04l4J54J89r0l10L9J75P5j36L9K43Mo9k82L31j1jl93J39K2K39l38J48J26
$$ -104 -138 16 205 115 -195 -156 19 94 -42 -3 240 244 175 -107 224 213 212 -181 -42 -20 219 -119 29 155
4448A55j12q7J84k00J8K0J57Q3j88M12m40k27J60Q5m28M95k31%M24l26L26j77
$$ 155 43 -44 140 -60 -42 -22 135 218 30 442 2 -225 -65 20 -408 87 -144 -144 280 -46 280 103
4470A03j66j91L12j90j9K43J86l16O6q5j70R2O4n2N3M8k7l3J07p4k07J73j28J20
$$ 103 -63 -254 58 -132 -151 92 278 -38 28 -57 -227 -135 -71 -123 -70 -22 -49 -82 25 -49 -256 -83 -211 -91
4494i1J75m3n8k00L04l01K85k1q5K0N0j37l4J47l55M82j17K4m2Q0o2j03K4Nr3
$$ -91 84 41 -17 -217 87 -214 71 50 -35 -15 35 -102 -136 11 -344 138 21 45 3 83 21 -82 -58 -53 -146
4519a46P2K62j42o9J14knj60J82M8M8k3r7ok14o8N04m58j34L98q0j4J40k99J15
$$ -146 -74 188 46 -23 91 89 84 -76 106 154 202 179 82 76 -138 -206 298 -160 -294 104 24 10 150 -149 -34
4544c4q2K79j47k80L84m19J25L07k94J74L8%P6L56n59o9J5L44r1M3l59J97o7O4
$$ -34 -116 163 16 -264 120 -299 -174 133 -161 13 51 51 127 483 -76 -145 -130 214 123 166 -193 4 -63 1
4568Aj7J12j07j79K47L19n58K84p6p8k7J56k1p5Q4q8K32k57M0j05J28j88K83l31
$$ 1 -16 96 -11 -190 57 376 -182 102 26 -52 -79 77 56 -19 65 -23 209 -48 -8 -113 15 -173 110 -221
4592b21L40l31N8K29j54j49L61j9k18M04m75K55j04J4Jk23m2M56m2l13J39k21
$$ -221 119 -212 -154 75 -79 -228 133 114 -104 300 -175 80 -24 -10 -9 -232 -274 182 140 -173 -34 -255
4614b55K31L95o41L04K84k79L33l64m80N40J7o2k59M54m46K23j8M8J55l96K13
$$ -255 -24 371 -270 34 318 39 372 8 -472 68 85 23 -236 218 -228 -5 -23 25 180 -216 -3
4635cM3j37r9MM41l06r3L41R7l16P3j54K23J11l49L44k03J7j92L53k46N0J63j65
$$ -3 40 -97 -196 -192 249 -57 -150 191 288 -28 45 -109 114 225 -124 220 17 34 -158 195 -51 -1 162 -3
4659cJ46k31J78L9p7k35L24m28J13J68k45Q7M39k43k03q6J37J08J61j02m1j18
$$ -3 143 -88 90 129 52 -183 141 -287 -174 -6 -251 -164 275 32 -171 -257 -120 -12 149 47 6 -112
4681a12K00K0m61L59J0r8J21ko1J52l0J68r2k40J03L1j63Q6J65l14K27j39r2K96
$$ -112 88 108 -353 6 16 -82 39 37 -24 128 98 266 174 -66 37 68 -95 -9 156 -158 69 -70 -162 134
4705A34j64j05J2N40l99J59j92j73o4J24O2K09k66Ml6J95j5j66RJ92n2j09K67
$$ 134 -30 -135 -123 417 18 177 -15 -188 -252 -128 -66 143 -123 -119 -155 40 25 -141 -132 60 8 -101 166
4728A66l85J48K56m2K33n54O7J9J49R9j26j65J39L7J0L2j28O6j17k11L54MJ53
$$ 166 -219 -71 185 143 376 -178 -111 -92 57 156 30 -135 4 41 51 83 -45 21 -96 -307 47 51 204
4751B04j77k07K56N3J97l68n0K29j41L72m76L2K60k88J69J23j49j43L76m49J92
$$ 204 27 -180 76 129 326 -42 -92 137 -4 368 -108 -76 184 -104 65 188 39 -104 272 -177 15
4772A5p9j29K10j55K36J16m24J00On6j9L96k90j08p3N34k70N8j0N7l23J02J42
$$ 15 -64 -193 17 -138 98 214 -210 -110 -104 -160 -179 217 -73 -181 -254 280 10 68 58 115 -208 -106 36
4795C6M3j19j79K13J62j1l53J48P6k8rN4J71k7j41j14K36o7l0j97M1J41m1l7L14
$$ 36 79 -40 -219 -6 156 145 -208 -60 16 -12 -21 33 204 177 36 -78 158 91 61 -136 -95 46 5 -32 282
4820B82l71Q8l7n2K03k96jK86j61j82L06j33J58k69P0L18q0l60M36m17J08K55
$$ 282 -89 -1 -38 -90 113 -183 -184 102 -59 -241 65 -68 90 -179 -109 209 129 -231 205 -212 -104 151
4842A51m24L91O9j66j46K52o7j01J52l71M71Q0l50O5n8J08L0l3M5O8l58K75L6
$$ 151 -273 118 187 21 -125 127 60 -41 111 -260 211 291 -59 6 -52 56 86 53 98 166 -192 83 119
4865A19O8j95K7j26J44j08o6L73l01l27O20l20r0L33l49J60j0J02O4l88L35k50
$$ 119 187 -8 19 -107 37 -71 -137 236 -65 -392 228 -92 -182 151 -198 -38 -48 54 118 -270 65 -185
4887a85M55k77o5L1j93K06k15K69L7QO4m5M9q7k56J9K38k75L98k48K58j69j03
$$ -185 270 -7 -72 -41 -234 -28 -243 26 63 71 135 90 139 52 -204 -185 53 -222 176 -72 186 17 -86
4910h6K58k6r7P6J7j85JNMj04R9q1J76j3l7J63m0o1J91k84J40Mk04K0J57k90O5
$$ -86 172 146 49 125 142 -43 -42 -37 -33 -137 -38 -119 57 44 7 170 130 69 260 -24 116 120 -84 -64 93 -197 -132
4937a32K10j17K13j98l8Q1nJ00O1j17J0j45J73l10K04J93qJ4m01L33J26j65K10
$$ -132 78 -39 174 -24 -62 19 14 114 175 58 68 -77 96 -214 -10 183 175 189 -212 121 247 82 292
4960B92l61L92j71l05P2K84l90L44m29J85K77k46o5K00m09N09j17j57J16QJ09
$$ 292 -69 323 152 -153 -81 203 -187 157 -272 -87 190 -56 -121 79 -330 179 62 -95 21 29 138
4981A38p8p8O6j80J88q9J19n3J1ML4r1j02K27m0P4k3j25K61j15l71K91l10L22
$$ 138 60 -18 48 -132 56 -33 86 33 44 48 82 -9 -111 116 76 150 127 2 263 148 -223 68 -242 80
5005H0J65om92L97j70o4j01K40j27J50j06p6M4R0j28J96j13j2%M4J19j69q0N2
$$ 80 245 239 -253 144 -26 -90 -191 49 -78 72 -34 -110 -66 24 -104 92 -21 -33 -33 11 130 -39 -119 -67
5029f7J86k77K66j39j64J19j27K82k15K79q2J96k43l7j2j76J81k37K70Q4j63n4
$$ -67 119 -158 108 -31 -195 -76 -203 79 -136 143 61 257 14 -23 -35 -211 -30 -267 3 87 -76 -130
5051a30K74j01O7k22O4K07r4O8kk93p3R6N1M5J35L7K9l26M92j58o2k1O7m19K84
$$ -130 144 43 110 -112 -48 159 65 133 131 -162 -235 -139 -88 -43 92 129 158 -168 324 166 104 83 150 -269 15
5076A5Q6l92N67k02j26K23l82j57O56m09k62L31Q5L5n1j46L73q7l19J64J46n6
$$ 15 101 -291 276 74 -52 171 -211 -368 288 -121 -383 -52 33 68 17 -129 244 157 -162 2 148 92
5098I2j48J18m6J09Mjq6M4j23j6k2Q7R7N5n2n7j5n2J5k71M40k45J01J2j84K60
$$ 92 -56 62 16 125 129 128 42 86 -37 -53 -75 12 109 164 112 55 40 -12 3 -268 172 -73 28 40 -144 116
$$ [...]
8191A25
##END NTUPLES=NMR FID
##END=
