##TITLE=1H_89-2024
 CDCl3
 8 sc, 
 9.10.2024
##JCAMPDX= 6.0         $$ Bruker NMR JCAMP-DX V2.0
##DATA TYPE= NMR FID
##DATA CLASS= NTUPLES
##ORIGIN= UXNMR, Bruker Analytische Messtechnik GmbH
##OWNER= root
$$ XWIN-NMR		Version 3.5
$$ Wed Oct  9 13:46:35 2024 Russian Standard Time (UT+4h)  she@DPX200
##.OBSERVE FREQUENCY= 200.1318
##.OBSERVE NUCLEUS= ^1H
##.DELAY= (6, 6)
##.ACQUISITION MODE= SIMULTANEOUS
##.ACQUISITION SCHEME= undefined
##.AVERAGES= 8
##.DIGITISER RES= 18
##SPECTROMETER/DATA SYSTEM= spect
##.PULSE SEQUENCE= zg30
##.SOLVENT NAME= CDCl3
##.SHIFT REFERENCE= (INTERNAL, CDCl3, 0, 15.7039)
##AUDIT TRAIL= $$ (NUMBER, WHEN, WHO, WHERE, WHAT)
$$ ##TITLE= Audit trail, XWIN-NMR		Version 3.5
$$ ##JCAMPDX= 5.01
$$ ##ORIGIN= Bruker BioSpin GmbH
$$ ##OWNER= she
$$ F:/spectra/data/she/nmr/H-F/1/audita.txt
$$ ##AUDIT TRAIL=  $$ (NUMBER, WHEN, WHO, WHERE, WHAT)
(   1,<2024-10-09 13:45:11.43 +0400>,<she>,<DPX200>,
      <created by zg, POWCHK disabled, PULCHK disabled
       configuration hash MD5:
       00 E9 B6 7A A2 85 ED C7 34 08 36 98 17 FE 4E 26
       data hash MD5: 16K
       C9 B0 D9 2F 38 86 C7 05 83 03 2D 89 FF 42 92 91>)
$$ ##END=
$$ 
$$ hash MD5
$$ 1B 64 C9 F3 88 F8 48 E7 3B 21 25 2C 96 95 94 74
##$RELAX= 
##$RELAX= 
##$RELAX= 
##$RELAX= 
##$RELAX= 
##$RELAX= 
$$ Bruker specific parameters
$$ --------------------------
##$DU= <F:/spectra>
##$EXPNO= 1
##$NAME= <H-F>
##$PROCNO= 1
##$TYPE= <nmr>
##$USER= <she>
##$AMP= (0..31)
100 100 100 100 100 100 100 100 100 100 100 100 100 100 100 100 100 100 
100 100 100 100 100 100 100 100 100 100 100 100 100 100 
##$AQSEQ= 0
##$AQ_mod= 1
##$AUNM= <au_zg>
##$AUTOPOS= <>
##$BF1= 200.13
##$BF2= 200.13
##$BF3= 200.13
##$BF4= 200.13
##$BF5= 200.13
##$BF6= 200.13
##$BF7= 200.13
##$BF8= 200.13
##$BYTORDA= 1
##$CFDGTYP= 0
##$CFRGTYP= 5
##$CHEMSTR= <none>
##$CNST= (0..31)
1 1 145 1 1 1 1 1 1 1 1 1 1 1 1 1 1 1 1 1 1 1 1 1 1 1 1 1 1 1 1 1 
##$CPDPRG= <>
##$CPDPRG1= <>
##$CPDPRG2= <>
##$CPDPRG3= <>
##$CPDPRG4= <mlev>
##$CPDPRG5= <mlev>
##$CPDPRG6= <mlev>
##$CPDPRG7= <mlev>
##$CPDPRG8= <mlev>
##$CPDPRGB= <>
##$CPDPRGT= <>
##$D= (0..31)
0 1.2 0 0 0 0 0 0 0 0.06 0 0.03 0 0 0 0 0.0002 0 0 0 0 0 0 0 0 0 0 0 0 
0 0 0 
##$DATE= 1728467110
##$DBL= (0..7)
120 120 120 120 120 120 120 120 
##$DBP= (0..7)
150 150 150 150 150 150 150 150 
##$DBP07= 0
##$DBPNAM0= <>
##$DBPNAM1= <>
##$DBPNAM2= <>
##$DBPNAM3= <>
##$DBPNAM4= <>
##$DBPNAM5= <>
##$DBPNAM6= <>
##$DBPNAM7= <>
##$DBPOAL= (0..7)
0.5 0.5 0.5 0.5 0.5 0.5 0.5 0.5 
##$DBPOFFS= (0..7)
0 0 0 0 0 0 0 0 
##$DE= 6
##$DECBNUC= <off>
##$DECIM= 24
##$DECNUC= <off>
##$DECSTAT= 4
##$DIGMOD= 1
##$DIGTYP= 9
##$DL= (0..7)
0 120 120 120 120 120 120 120 
##$DP= (0..7)
150 150 150 150 150 150 150 150 
##$DP07= 0
##$DPNAME0= <>
##$DPNAME1= <>
##$DPNAME2= <>
##$DPNAME3= <>
##$DPNAME4= <>
##$DPNAME5= <>
##$DPNAME6= <>
##$DPNAME7= <>
##$DPOAL= (0..7)
0.5 0.5 0.5 0.5 0.5 0.5 0.5 0.5 
##$DPOFFS= (0..7)
0 0 0 0 0 0 0 0 
##$DQDMODE= 0
##$DR= 18
##$DS= 0
##$DSLIST= <SSSSSSSSSSSSSSS>
$$ [...]
##$SUBNAM2= <"">
##$SUBNAM3= <"">
##$SUBNAM4= <"">
##$SUBNAM5= <"">
##$SUBNAM6= <"">
##$SUBNAM7= <"">
##$SUBNAM8= <"">
##$SUBNAM9= <"">
##$SW= 24.0689170037331
##$SWIBOX= (0..15)
0 0 2 0 0 0 0 0 0 0 0 0 0 0 0 0 
##$SW_h= 4816.95568400771
##$TD= 16384
##$TD0= 1
##$TE= 0
##$TE2= 300
##$TE3= 300
##$TEG= 300
##$TL= (0..7)
0 120 120 120 120 120 120 120 
##$TP= (0..7)
150 150 150 150 150 150 150 150 
##$TP07= 0
##$TPNAME0= <>
##$TPNAME1= <>
##$TPNAME2= <>
##$TPNAME3= <>
##$TPNAME4= <>
##$TPNAME5= <>
##$TPNAME6= <>
##$TPNAME7= <>
##$TPOAL= (0..7)
0.5 0.5 0.5 0.5 0.5 0.5 0.5 0.5 
##$TPOFFS= (0..7)
0 0 0 0 0 0 0 0 
##$TUNHIN= 0
##$TUNHOUT= 0
##$TUNXOUT= 0
##$USERA1= <user>
##$USERA2= <user>
##$USERA3= <user>
##$USERA4= <user>
##$USERA5= <user>
##$V9= 5
##$VALIST= <valist>
##$VCLIST= <CCCCCCCCCCCCCCC>
##$VD= 0
##$VDLIST= <DDDDDDDDDDDDDDD>
##$VPLIST= <PPPPPPPPPPPPPPP>
##$VTLIST= <TTTTTTTTTTTTTTT>
##$WBST= 1024
##$WBSW= 4
##$XGAIN= (0..3)
0 0 0 0 
##$XL= 0
##$YL= 0
##$YMAX_a= 226116
##$YMIN_a= -202224
##$ZGOPTNS= <>
##$ZL1= 120
##$ZL2= 120
##$ZL3= 120
##$ZL4= 120
##$ABSF1= 10
##$ABSF2= 0
##$ABSG= 5
##$ABSL= 3
##$ALPHA= 0
##$AQORDER= 0
##$ASSFAC= 0
##$ASSFACI= 0
##$ASSFACX= 0
##$ASSWID= 0
##$AUNMP= <proc_1d>
##$AZFE= 0.1
##$AZFW= 0.1
##$BCFW= 1
##$BC_mod= 2
##$BYTORDP= 1
##$COROFFS= 0
##$CY= 11.3945322036743
##$DATMOD= 1
##$DC= 2
##$DFILT= <>
##$DTYPP= 0
##$F1P= 15.6554695791079
##$F2P= 12.8336369535428
##$FCOR= 0.5
##$FTSIZE= 0
##$FT_mod= 4
##$GAMMA= 1
##$GB= 0.15
##$INTBC= 1
##$INTSCL= 1
##$ISEN= 128
##$LB= 0.24
##$LEV0= 0
##$LPBIN= 0
##$MAXI= 10000
##$MC2= 0
##$MEAN= 0
##$ME_mod= 0
##$MI= 1.114404
##$NCOEF= 0
##$NC_proc= 0
##$NLEV= 6
##$NOISF1= 3.799351
##$NOISF2= 2.8
##$NSP= 1
##$NTH_PI= 0
##$NZP= 0
##$OFFSET= 15.70392
##$PC= 1
##$PHC0= -26341.56
##$PHC1= 12.38743
##$PH_mod= 1
##$PKNL= yes
##$PPARMOD= 0
##$PSCAL= 0
##$PSIGN= 0
##$REVERSE= no
##$SF= 200.130013532006
##$SI= 16384
##$SIGF1= 3
##$SIGF2= 2
##$SINO= 400
##$SIOLD= 16384
##$SREGLST= <1H.CDCl3>
##$SSB= 0
##$STSI= 0
##$STSR= 0
##$SW_p= 3612.71676300578
##$SYMM= 0
##$S_DEV= 0
##$TDeff= 0
##$TDoff= 0
##$TI= <>
##$TILT= no
##$TM1= 0
##$TM2= 0
##$TOPLEV= 0
##$USERP1= <user>
##$USERP2= <user>
##$USERP3= <user>
##$USERP4= <user>
##$USERP5= <user>
##$WDW= 1
##$XDIM= 8192
##$YMAX_p= 0
##$YMIN_p= 0
$$ End of Bruker specific parameters
$$ ---------------------------------
##NTUPLES= NMR FID
##VAR_NAME=  TIME,          FID/REAL,        FID/IMAG
##SYMBOL=    X,             R,               I
##VAR_TYPE=  INDEPENDENT,   DEPENDENT,       DEPENDENT
##VAR_FORM=  AFFN,          ASDF,            ASDF
##VAR_DIM=   8192,          8192,            8192
##UNITS=     SECONDS,       ARBITRARY UNITS, ARBITRARY UNITS
##FACTOR=    0.0002076,     1,               1
##FIRST=     0,             0,               0
##LAST=      1.7004516,     0,               0
##MIN=       0,             -202224,         0
##MAX=       1.7004516,     226116,          0
$$ Real data points
##PAGE= N=1
##DATA TABLE= (X++(R..R)), XYDATA
$$ [...]
2047I34l410J909J238r19M64j946K003K118l055j3J217j71O55k798N54K894j910
2064b36j23k89L55K138k294j141K967j080Q8r70p55L099j541j789J535q4J201
2081A081p83k317K937J93j939N73q02J987J08l404K093J005n65Q6j707J783J700
2098B029k945M18P64l55R91k375N83K560k116P0j58J93K323k271o80K209j065
2115A75m0n73j135K950j341j613J372oJ150q73j768K981n9j521M93j083J762M8
2133I19k957K026N14q08Q40j954J814J486k536M78P05k39Q78k215J53J969j631
2150e58J94k49K32J923j971l91J988j081N43p07j105K845j607q74Q04k74J052
2167G64r44j131K270j24j367R59j006J491j29k511J982N8n38O76j713J490J048
$$ plain form
2047 934 -2476 -567 671 -248 216 -1730 273 2391 -664 -677 540 369 1024 -1774 -1220 1674 -236
2064 -236 -359 -648 -293 1845 -449 -1590 1377 297 385 -585 -1340 1759 218 -1571 -36 -120 1081
2081 1081 298 -2019 918 1111 -828 -255 -1057 930 1038 -2366 -273 732 167 253 -1454 329 2029
2098 2029 -916 -498 266 -89 902 -1473 -890 1670 -446 -376 -534 -341 1982 -289 -969 1240 175
2115 175 135 -438 -1573 1377 36 -1577 -205 -211 939 66 -1702 1279 1220 -301 192 -891 871 919
2133 919 -2038 -12 502 -306 534 -1420 394 1880 -656 -178 527 288 1166 -1049 -896 1073 -558
2150 -558 -364 -613 -381 1542 -429 -820 1168 87 630 -77 -1182 1663 56 -818 -14 -288 764
2167 764 -180 -1311 959 835 -532 427 -579 912 783 -1728 254 312 -226 450 -1263 227 1275
2184A275k311J035K06k00Q99j953M38J822j929N61j06l3J376j555q5J481j007
2201h6N74n08j000K064r89j066J208m91J046o99j132K061m77r56J112j114J138
2218F85J52k029J548l26o57J034j416J393P43j792R19N8k91P67j671P44Q74j625
2236h90O28k17k6J677j627L64J086j367Q89n76p33J632j080n55J166j068R26j64
2254F5q62J945o57m34O74j213J044O3j784J439o91rQ42j325R60Q41j730J721p89
2273A00m12J246j579M11P52j579J291m06o13J720j386K82Q96j101J029m60j033
2290h42J643j412n2R75j283Q02J30m66J537r47o0R32j543Q35J9j186J084p25N1
2309e08J067q95P50M04j108J242p95n73J341j556N30J19j131J465n72m75J598
$$ plain form
2184 1275 -1036 -1 205 5 904 -1049 -611 1211 -718 -157 -263 -296 1080 -475 -560 921 -86
2201 -86 488 -20 -1020 1044 55 -1011 197 -294 752 53 -1079 982 505 -451 661 -453 685
2218 685 837 -1192 356 30 -627 407 -1009 384 1127 -665 254 312 21 788 -883 -139 735 -890
2236 -890 -262 -479 -505 1172 -455 -91 995 -372 517 -59 -792 840 -240 -795 371 -697 229 65
2254 65 -797 1148 491 57 731 -482 562 625 -1159 280 -411 -420 422 -903 57 898 -832 889 100
2273 100 -312 934 -645 -234 518 -1061 230 -176 -789 931 -455 -173 723 -378 651 191 -842
2290 -842 801 -611 -663 312 -971 -169 -39 -505 1032 85 25 957 -586 249 268 -918 166 -559 -508
2309 -508 559 -336 414 818 -290 952 157 -416 925 -631 -101 18 -1113 352 -220 -695 903
2326I03j078M15N56j434J064k39p96J162j023J37Q69j514J547j66q91J263r21
2343a46M1R20j282N41l59m52J475j137l21J672j347P05J23q83J404j096n25J239
2361E72j218N96J89j321J829m81o76J173r25N43N89j611J433k66q74P58j042N18
2379b14O74j457J185R6l89Q98r63M62P81j824K87L87o35J171j149R5J392r94Q97
2398G00k99p02J371j074r14J101p71K70J82r41J634j85o01J101q11Q13K7j899
2416i98J198k55q84J044j188J024P41j570J384J23m21P64j261K19Q14j743M59
2433e50J17n13J660j386K88J593j323O49l65l42J455j433r41J227o05J83l73m93
2451a152K196p84n63J152o26P49l15j672J564m13j034M61p85R13Q83j546J400
$$ plain form
2326 903 -175 240 796 -638 426 187 -609 553 -470 -333 536 -978 569 403 -488 775 -146
2343 -146 -105 815 -467 74 -285 -737 738 -399 -720 952 -395 310 433 -450 954 -142 -667 572
2361 572 -646 -50 139 -1182 647 166 -510 663 -262 281 870 -741 692 426 -448 310 -732 -214
2379 -214 460 -997 188 284 -105 793 -170 292 1073 -751 -464 -77 -712 459 -690 -595 797 -197 700
2398 700 401 -301 1070 -4 -918 183 -588 -318 -136 -1077 557 372 -229 872 61 874 901 -998
2416 -998 200 -55 -939 105 -1083 -59 682 -888 496 619 198 962 -299 -80 734 -1009 -550
2433 -550 -433 -946 714 -672 -384 1209 -114 535 170 -172 1283 -150 -1091 136 -469 -286 -659 -1152
2451 -1152 1044 260 -303 849 223 972 657 -1015 549 136 -898 -437 -1222 -309 574 -972 428
2468D28N17m95N38j182O14P25j999J16r9J39P24q98J14J923r92J29K65m07J144
2487A304j622n69J161o67J23n22n51K016m09m11P53l87Q48l19j854J665k91j065
2505g97L78o98J116M96j321J182K18j02M15j366N05Q66j788L92L22lJ199j942
2523i28P86J234r06KO0n09J555k025k63J061l17N14p54k51K189r54p14P71m68
2542H3O83p68j283J644j73p39O16q96J575Q0j342Q03M03m36j0j109Q37O85j598
2561i45K41J48L16O67j482O52J642q44R1m77J30J359k045p42J074n64O05l64m06
2580i44K265o91n17P91o80J028j063j543J553k25p06K7j76J373M90j858J186L54
2598F64j03n3j454J197N96j504J16K48J65Q35j584N90J009o70J38m76J63J464
$$ plain form
2468 428 945 450 988 -194 420 1145 -854 -738 -837 -698 26 -872 -758 1165 173 302 567 160 1304
2487 1304 -318 -887 274 -393 -270 -792 -1343 673 264 -147 606 219 1067 748 -1106 559 268 -797
2505 -797 -419 -1117 -1 495 -826 356 574 472 887 -479 26 892 -896 -504 -182 -185 1014 -928
2523 -928 -142 1092 186 188 248 -261 1294 -731 -994 67 -250 264 -490 -741 1448 494 -220 551 83
2542 83 766 -2 -1285 359 186 -553 63 -833 742 822 -520 283 686 250 240 -869 -32 653 -945
2561 -945 -704 -556 -240 427 -1055 -403 1239 395 486 9 139 1498 -547 -1289 -215 -779 -174 -538 -944
2580 -944 1321 630 113 904 224 1252 189 -1354 199 -26 -732 -705 -881 492 982 -876 310 664
2598 664 561 508 -946 251 847 -657 -541 -293 -128 707 -877 -287 722 52 190 -286 -123 1341
2616A341j588m96J300o79M77q88m35J835n89r96Q41k29Q96n89j384J882n48p25
2634e74M16n79J601q2j731J260L42o00L61j389J141M75j577O57K17M16O91j560
2652e15M16J184j159J69o87j20J531j835JJ188n08R34o89k91J608j174j86J02
2670c1q6Q42r12j295J692l17l68M99o84J324l8j374J376M7n06J59j182R66N39
2689F51j573M04J42L74R79j703R26Q93q28K5n09J60N48j436l23J444n21O11l72
2708a08j95J586r16p04L83k96P26q38o91J644o30j16O6m61J267m91q30N45J29
2727G0Q2K39j392J068O85j705Q00n6J01Q84j577P74J104j349O00p97L25Q60j299
2746e83o8R85q36P86l96k72J431q23l34L63n03O10Mj640J550o57n7K74n31J270
$$ plain form
2616 1341 -247 -743 557 -122 355 -533 -968 867 278 -718 123 -106 790 201 -1183 699 151 -574
2634 -574 -158 -737 864 782 -949 311 653 53 414 -975 166 641 -936 -279 -62 354 1045 -515
2652 -515 -99 1085 -74 95 -592 -712 819 -1016 -1015 173 -335 599 -90 -381 1227 53 -133 -31
2670 -31 -117 725 -187 -1482 210 -107 -475 24 -660 664 626 -748 628 675 169 328 -854 112 651
2689 651 -922 -518 -376 -2 977 -726 200 1093 265 290 -219 -59 489 -947 -1270 174 -347 264 -108
2708 -108 -303 1283 367 -337 46 -250 476 -362 -1053 591 -39 -155 -89 -550 717 226 -604 -59 70
2727 70 152 391 -1001 67 752 -953 -153 -209 -108 776 -801 -27 1077 -272 328 -469 -144 716 -583
2746 -583 -651 334 -502 284 -112 -384 1047 224 -110 253 -250 360 364 -1276 274 -383 -440 -166 -697 573
2766E73J5j302J220j92j10J54j263Q34M92j352P42k20K36P22j132Q93P22j003
2784B9M01q33Q6R20j204N0P30q77R28o51J58J320r69j23P79o15L85n70j140J426
2804B30n99m5L39l41J102j04j024J021m47J65j5j004Q87K55j196P69j67L54L61
2823E41j105O53M60o02M38o41r7J119j132L7O29p41O93o22m6J193q75J27M47q77
2843d01R44n26p13J118q59L83J81r10J049j5o44J104n47l1M06q72M39O5r02Q00
2863F9m96J86P89j035N13O46r30O59m09k33R54j255K19L18n46Q06k90j50R65j179
2883c99L16P13j041O88k60p26R93o89L07M16j061J146j07p28R82n00J6L71r02
2902d65O92k0o58O87o64j6Q69r95Q23J89p78R37p64J71N10r20L85J91p99Q11p58
$$ plain form
2766 573 588 -714 506 314 204 358 -905 -71 421 -931 -189 -409 -173 549 -583 310 1032 29
2784 29 430 -403 -317 603 -601 -551 179 -698 230 -421 -263 1057 88 -35 744 129 514 -56 -1196 230
2804 230 -369 -414 -75 -416 686 582 -442 579 132 297 282 -722 165 420 -776 -7 -174 180 541
2823 541 -564 89 549 -53 385 -256 -353 766 -366 -329 300 -441 252 -370 -416 777 -98 29 476 -401
2843 -401 543 17 -696 422 -437 -54 127 -783 266 251 -393 711 164 133 539 -333 106 171 -731 69
2863 69 -427 -241 548 -487 26 672 -258 401 -8 -241 713 -542 -323 -5 -551 255 -35 -185 780 -399
2883 -399 -83 630 -411 277 17 -709 284 -405 -98 318 -743 403 296 -432 550 50 66 437 -465
2902 -465 227 207 -451 236 -428 -444 425 -570 253 442 -336 601 -163 8 518 -402 -17 174 -625 186 -572
2923e72J45P53p99O56L65n76N63k99m15O25r87R6N05q22Q89Ko09J250p55J00P81
2944H96j180O32l80o98P04m18J30Q15n86N37J59p62Q57p79j32N06r74O28J29p32
2964f48Q08l02RR05j031N86K02j039P98n20m23Q86o51L91M37p82Q05k82k52P02
2984E99p35Q6N62r40M77j8o29J120p47n3L78n70L99R3n12J013l80n96R70j057
3004e40O90ro55O26l58r0Q05p23K92N61p69M33k74l81O29q33M99L86p16P00l51
3025g8l85J196p76l3K80o69L72j31o77J427q83K69N54o06O46l91n73Q14o19j45
3045d08O14p18O94j71m38P40m4j78M00o95L56Q6j189J011l52P4M48q12Q34J42
3065C94o42N57j70k51O44r14K73L66p77N28k86j18J171j091J82N83p11P55l73
$$ plain form
2923 -572 -427 326 -473 183 548 -28 535 236 -179 446 -541 -445 60 -762 127 129 -480 770 15 115 896
2944 896 -284 348 -32 -730 -26 -444 -314 501 -85 452 611 -151 706 -73 -205 301 -673 -45 84 -648
2964 -648 160 -142 -133 772 -259 327 529 -510 288 -232 -655 231 -420 -29 408 -374 431 149 -103 599
2984 599 -136 -50 512 -428 49 31 -598 522 -225 -278 100 -470 -71 22 -490 523 143 -453 517 -540
3004 -540 150 141 -514 112 -246 -336 469 -254 38 599 -170 263 -11 -392 237 -596 -97 289 -427 273 -78
3025 -78 -463 733 -43 -76 204 -465 -93 -224 -901 526 -357 -88 466 -140 506 115 -458 356 -263 -408
3045 -408 206 -512 182 11 -427 313 269 91 491 -204 152 238 -951 60 -292 -218 230 -582 252 394
3065 394 -248 309 139 -112 532 -382 -109 257 -520 8 -278 -396 775 -316 -134 449 -262 493 120
3084A20n09R44q10j88O42p44P20q5p14J197n01O2L06m91Q52o09o09O62l66l09
3104d30M47o94M98P96p32M14j82J83N50j147N3O46o95O3p4p3R92r54J08O62m37
3125fN30j28o74P57o60j94K19n06O31r0m73Q52j14r5N17p56M83j56q27R91n10
3146b09p9J93p78R72L82o78M19p9Q5N28j290L63K84p08M29j3m73J260q50J66O04
3167E28l41L24p00l66J106q15k9L48m70P92k53m35R56n96O9Q1l79P14j58j024
3187f48N75K5j25N30q88M51M65m25K91j00J60P2q85L86L79o80L06l43J39R23q76
3208b68L45L58k58M63n42m93Q92o95k41K93l65P26l07k51J086j91k92J38o85P42
3228D55l02q75N95j64L76J65p18O78L39p44L16l48K69K13q58N95M40o87L28n13
$$ plain form
3084 120 -389 555 -255 -443 199 -545 175 90 -624 573 72 134 440 -51 801 192 -417 245 -121 -430
3104 -430 17 -677 -179 617 -115 299 117 300 850 -297 -244 402 -293 -230 -304 -377 615 -339 -231 431 -6
3125 -6 524 396 -278 479 -181 -375 -156 -662 -31 -121 -594 258 144 49 566 -190 293 137 -690 301 -209
3146 -209 -288 -95 -873 99 481 -197 222 143 228 756 -534 -171 113 -595 -166 -179 -652 608 -242 -76 528
3167 528 187 511 -189 -555 551 -264 -293 55 -415 377 124 -311 645 49 118 199 -180 534 376 -648
3187 -648 -73 -48 -173 357 -531 -80 385 -40 251 151 311 383 -502 -116 263 -417 -111 -454 -315 608 -268
3208 -268 77 435 177 640 98 -395 497 -198 -439 -146 -511 215 -92 -343 743 552 260 398 -287 455
3228 455 153 -722 -127 -291 85 250 -468 210 549 -195 121 -227 42 255 -603 -8 432 -255 73 -440
3248d40J94Q54j026L76M15m11N94o75j09Q45o67k79L20j06N62m65o57J056k21
3267A60k56K92k38L68jo63J99P4J83Pp17J018K4n64P28p59M90j23q95N90K72l62
3289a73M18n16O8P62p17J57J45k78M55m95j16Q07m56j99O2j85Q03m38l09P81p75
3310a99M92j75m75O95m35m42N85j67K06O5n99N50L13k87p3j13K52J11r45L48J45
3331a48l45N12m57M00N86n51M8K63m26M57o05l33R10o57J31j38N5P21m56j26O11
3352D52k04p7k63m43P62l14m93P71l25L42no09P57j4m29K17k22j7M31o98N13J6
3374A48n41M42j33R1M64q09M67J55m89N86o77q6P28n28KJ89K9J57j84k38P14k56
3396B31k69J0l54O29k77m82N06k92K72J21o71J093k34l61L86m37R4K61o35L94
$$ plain form
3248 -440 -246 608 -418 -42 373 -38 556 -119 -228 617 -50 -329 -9 -115 447 -18 -675 381 160
3267 160 -96 196 -42 326 325 -338 -139 -65 118 125 -592 426 450 -114 614 -145 345 222 -673 -83 189 -173
3289 -173 245 -271 -203 559 -158 -1 144 -134 321 -174 -290 517 61 -138 -76 -261 542 104 -205 576 -199
3310 -199 293 118 -357 338 -97 -539 46 -121 85 150 -449 101 414 127 54 -59 193 304 -641 -293 -148
3331 -148 -493 19 -438 -38 548 -3 45 308 -118 339 -266 -599 311 -346 -215 -353 -298 423 -33 -159 452
3352 452 248 171 -92 -535 227 -87 -580 191 -134 208 203 -406 351 337 -92 125 -97 -114 317 -381 132 148
3374 148 -393 49 -84 7 471 -338 129 284 -205 381 -296 -382 346 -182 -180 9 38 195 11 -227 487 231
3396 231 -38 -28 -382 247 -30 -512 -6 -298 -26 95 -576 517 283 -78 308 -129 -35 226 -409 -15
3416a5k2k05L26n00L01O65o10J76m1lK33p08M2N06k95O5L6k16N41l06j19N43j48
3439B46L4k35l93L24j9l36N30j73J39Q0m16O26j23k95J97l24J36K60n67K68J50
3460A09m37N52o15L05N02n83K49J71j92L12n46j93N99l76L1o9L9N14n62K74O37
3481G21o04J08k24k26N17m82q6N21k75N1J9j52N36k34m55L80j90L04l6o04L57
3502e4j8j37J96m1k8K74j72J08n2j00K71o20M9L44l58M47j56j21N53l32r7J41
3524I7l03R5J32k10K78j14k17K62j35J6K50l35P05k20n87O49m93N9K46n02M22
3545I5Ok15K18k04K5O02p64N4M08k35L13l73m0L66l64J0J35l01O24o42K37K82
3567B37l58J59J44l02Q2m3k27L52m21K89J59o05P57j11j47N81p28K3L94n39N18
$$ plain form
3416 -15 -37 -242 84 -416 -115 550 -60 116 75 72 305 -403 -361 145 -150 -85 -49 -265 276 -30 -149 394 246
3439 246 280 45 -348 -24 -43 -379 151 -22 117 197 -219 407 284 -11 186 -138 -2 258 -309 -41 109
3460 109 -328 224 -391 -86 416 -167 82 253 61 373 -173 -366 233 -143 -112 -181 -142 372 -190 84 721
3481 721 117 225 1 -225 292 -190 -276 245 -30 21 40 -112 424 190 -265 115 -75 229 193 -411 -54
3502 -54 -72 -209 -13 -54 -82 192 20 128 76 -24 247 -373 -324 20 -338 109 -47 -168 385 53 -44 97
3524 97 -206 -111 21 -189 89 -25 -242 20 -115 -99 151 -184 521 301 -286 363 -130 -71 175 -327 95
3545 95 101 -114 104 -100 -75 527 -237 -183 225 -10 303 -70 -110 256 -108 -98 37 -264 360 -282 -45 237
3567 237 -121 38 182 -120 -38 -81 -308 44 -377 -88 71 -534 223 112 -35 546 -182 -159 235 -304 214
3588B14k38m32L82m3J48L82m85L73m27p4M05m09J1J38k17J89J40l16M99L1j26
3609A45M10n52j18O6j85L94k91J16K40k65k1L38p79Q25n67N5O10n66K90q7j83
3630a25L52k55j22R7k06J49R1k71M04N8k16K83j53J7J24p73P58O8o04M71l2j50
3652c5L88l65J37N7n11M82m85M40l83k3M56P7m08N42l09j36M62q59N65l8k28K75
3674A01j37k39L29j2j08L27m42M32k91j77M65n94J36J66j58K84k49o0O32m85j7
3695i7N72p99K03L36o36L79Mq3M03n24K97K57m27J69l38j9M21n44K18J91j07K69
3717A45l06OL75k38K7J43l64N35m38k43M96k61K14r1k19M45q9n09M81n1N9J38
3739B55m21L32j8m86M44J0j00M48n85l4K96j30K55n81J14M42m71K94P2k92K25
$$ plain form
3588 214 -24 -456 -74 -117 31 413 -72 301 -126 -200 205 -204 -193 -55 -272 -83 57 -259 240 271 145
3609 145 555 3 -115 -49 -234 160 -131 -15 225 -40 -61 277 -502 323 -244 -189 421 -145 145 58 -125
3630 -125 227 -28 -150 -53 -259 -110 -19 -290 114 172 -44 239 86 103 227 -546 212 280 -324 147 115 -35
3652 -35 353 -12 125 182 -329 153 -332 108 -275 -298 158 235 -173 369 60 -76 386 -473 92 54 -174 101
3674 101 -36 -275 54 42 -66 261 -181 251 -40 -217 248 -346 -210 -44 -202 82 -167 -227 405 -80 -97
3695 -97 475 -324 -121 215 -421 -42 -38 -121 282 -242 55 312 -115 54 -284 -303 118 -426 -208 -17 -124 145
3717 145 -161 -155 220 -18 9 152 -212 323 -115 -358 138 -123 91 0 -219 226 137 -372 109 58 117 255
3739 255 -166 166 148 -338 106 116 16 464 -121 -155 141 11 266 -315 -201 241 -230 64 136 -156 69
3760F9k94J11L66j77m5L35o07L73k36j73M06m32M61O7m32K68o9o5J66j41R5P3
3782A19m54L99P8l92L10n9O2K40o35L03K43l07K95m11M3J91k70M02R9j79po1j62
3805a53N12m37o6L32m02J49k32J14L04k09J06qk31N87l31k84M23k44L00j79k8
3826B3J51K1l85K22q9j42K74k63J36O7P3K91n39J78M51p58L73K25l86K50l07J2
3848a22M48l40J67j42k06M80l20p4J2J78O2O1n21M02J50q3j27%N1K5m13K36J07
3871C1m1j66o7L50J12m30K23J74j96K18m50J8K66j93K26p5r0L82l56n5L86j16
3893A51l2Ml64M70j31l25M08k59L41l42O7K80k40j37K04k49J99J7l94M34k72j14
3915b84K60j48L97ln11K53K13j35N7l06m9M53k55J97l19JN50m42J90J6m58O9L12
$$ plain form
3760 69 -225 -114 252 75 30 365 -242 131 -105 -278 128 -304 157 224 -208 60 -9 -74 92 -49 46 119
3782 119 -335 64 142 -250 60 1 63 303 -332 -29 214 -93 202 -209 -166 25 -245 157 256 77 70 9 -153
3805 -153 359 -78 -144 188 -214 -65 -297 -183 121 -88 18 10 -221 366 35 -249 174 -70 230 51 23
3826 23 174 195 -190 32 -57 -199 75 -188 -52 15 88 379 -160 18 469 -289 84 309 -77 173 -134 -122
3848 -122 326 -14 153 11 -195 285 -35 -109 -97 81 143 204 -317 85 235 152 25 25 76 101 -312 -76 31
3871 31 -10 -176 -243 107 219 -211 12 186 -10 208 -242 -224 42 -151 75 0 -90 292 -64 -119 267 151
3893 151 119 123 -241 229 98 -227 181 -78 263 -79 -12 268 28 -109 95 -154 45 62 -332 102 -170 -284
3915 -284 -24 -172 225 222 -289 -36 177 42 99 -207 -256 197 -58 139 -180 -179 371 -71 119 135 -323 -254 58
3938E8k10J96L3k14K80m8J55K8k49N7j18L9J09k08J59N7l72K03J09k36J11k13
3960b74K22L44o36M18j7m3K12l98n8M19n98J72L19j59K00j64K0N51p26J75k49
3981b70J21J39k18J23O7k7K81j51l01M80k33O3l42L35J16j17l32N07l10P4n2K27
4003A80P1k6l02J1P0P1p3M8j43L86n01K13J21j47K64m24K98J38m32M33m18lL36
4026A71m56K90R2r7J1p7j08K61j41K1M43n97K59j1k57L19k8l60K28p7L14k34m0
4049g4J04P4j41J34k88pK32j41J60j94k1L90p1k18J21J23o8l01K59L9l98p4N16
4072A56m27L07o2j08M38j19l58M40l20M2J90n73N38j11o8J61j87J4N4j23J19J13
4094A16m9Pl66L93%l69K76k02J4L90l17K9K34l52J55J93l95J47n3lL13j21K1L3
$$ plain form
3938 58 -152 44 77 -137 143 95 250 278 29 86 -32 7 116 -92 67 124 -248 -45 64 -172 -61 -274
3960 -274 -52 292 -344 74 57 14 226 -172 -230 189 -409 -237 82 -77 123 -41 -21 530 -196 -21 -270
3981 -270 -149 -10 -228 -105 -38 -65 216 65 -236 244 11 74 -268 67 183 66 -266 241 -69 5 -47 180
4003 180 251 225 -77 -66 4 75 2 50 -93 293 -208 5 126 -21 243 -181 117 255 -177 256 -162 -165 171
4026 171 -285 5 97 0 11 -66 -174 87 -54 -33 410 -187 72 61 -196 123 95 -265 -37 -114 200 -34 -74
4049 -74 30 104 -37 97 -191 -198 34 -107 53 -141 -162 228 157 -61 60 183 115 -186 73 112 -286 -360 156
4072 156 -271 36 -26 -134 304 185 -173 267 -53 -11 179 -394 144 33 -35 126 -61 -47 7 -116 3 116
4094 116 67 74 -292 101 101 -268 8 -194 -180 210 -107 -78 156 -196 -41 152 -243 -96 -149 -152 161 40 61 94
4118I4j99J65j01j86L35k95L70q8k97J45J61q0R8j20J28Q6m75L49k38pJ31M5j87
4141a66M14l07K04qk28L40l38JL33k83J70j64n4L71o14L63l6l31L27J69k57J35
4163D1M7j25L77o01L05j05m22O18l77J6L13m68L90l2j83K95k71J55k38J68P0K2
4185ek33L81J6j66M55m69k08K76j83K96j88J5nn6J05rK5J50Pl66P5J74k94L92
4209A85j74j02O5J01K43k24j36J20k0m9o9O5J65l42J82M6j31j89L11k80K65j45
4231a13o1K77q0O9j47mK23k9k54J18K7J27j00l48L38k6o6J72j14r8K66m35J27
4254a31J00MK21l05k7L74j10j5N5n31N46l47j19M19k12J59L8k89J89K22j45K74
4276C70o40M27K43p43J77L15l58M57L9l72J38N3k48L33j64j00J95k36K46k81J28
$$ plain form
4118 94 -105 60 -41 -227 108 -187 183 95 -202 -57 104 24 122 2 130 216 -259 90 -148 -155 -24 21 -166
4141 -166 248 -59 145 137 -91 249 -89 -88 245 -38 132 -32 -86 285 -329 34 -2 -333 -6 163 -94 41
4163 41 88 -37 340 -261 44 -61 -483 135 -242 -226 87 -381 9 -23 -206 89 -182 -27 -265 -97 -27 -5
4185 -5 -238 143 159 -7 448 -21 -229 47 -136 160 -28 -13 -18 -74 31 22 47 197 204 -162 -87 87 -207 185
4209 185 11 -91 -26 75 318 94 -42 78 58 9 -60 5 170 -172 10 56 -75 -264 47 -233 32 -113
4231 -113 -174 103 23 92 -55 -59 164 135 -119 -1 26 153 53 -295 43 17 -49 123 9 -89 177 -258 -131
4254 -131 -31 -27 194 -111 -138 236 126 111 166 -365 181 -166 -285 134 -78 81 119 -170 19 241 96 370
4276 370 -270 157 400 -343 -166 149 -209 248 287 -85 53 106 -142 191 27 -73 122 -114 132 -149 -21
4297b1J66l80L16p3n8J35j63J89p6j19L46j98O8j85k78K01M14m10J12j29j63N72
4319B66k68k09M9Q8R3o5k45K94j52K12l8j69K86p3o1J13J60m30Q8k13P1K27m2
4342a8P0k74L92k92j8K91l62j58K75m3K0P6j40J07J16j91J44m9J12J00j08K37
4364B87k45k19M38k96p5J10o0%J22k52M02k41j83L58r7M2k3j76K71j51p6K37k86
4387a13J00K64l75J97P0k96N20l76k36K30j30K9L4K64k17o4n6K26j57J50j64k04
4409c04L24K2l5K44m78K37Kk96N01k82J11o5J87r4p5Q4k89M51k53K6j85KK73q4
4433B4l7K22k77K25m06O1K05j23J83j47k03L46j42N7J85l6k34K94j83o1j88L25
4455I0J24k98J86l3P5K1k28N9L25k92mJ38l19J20R3l16L77p8N7M72p02K20j3l5
$$ plain form
4297 -21 145 -235 81 8 -50 85 -78 111 35 -84 262 64 132 -53 -331 -130 284 -126 -14 -143 -306 266
4319 266 -2 -211 -162 -74 19 -46 -291 3 -149 63 25 -144 142 69 8 121 281 -149 -61 -274 -203 24 -18
4342 -18 52 -222 170 -122 -140 151 -211 -369 -94 -137 -117 -41 -181 -74 42 -149 -5 -54 58 158 50 287
4364 287 42 -177 261 -35 -110 0 -60 -60 62 -190 212 -29 -212 146 49 91 68 -108 163 12 -64 173 -113
4387 -113 -13 251 -124 73 143 -153 367 -9 -245 -15 -145 -116 -82 182 -35 -99 -155 71 -86 64 -100 -304
4409 -304 20 42 7 251 -227 10 12 -284 217 -65 46 -19 168 74 -1 83 -206 245 -8 18 -167 -165 108 24
4433 24 -13 209 -68 157 -249 -188 17 -106 77 -70 -273 73 -69 -12 173 137 -97 197 14 -47 -235 90
4455 90 214 -84 102 69 144 165 -63 -4 321 29 25 163 -156 -36 57 -259 118 40 97 569 -133 87 74 39
4479C9j12m3J17J17j48kPn3J06k5o3J86l66J82J24k76K36l0k68K76k75L18J13
4502A60k97K54J1l11L91k59p0J02j75L12j99J38ok44J82J46k15J03j7k78N32j81
4524G9j91K97k65J12J13j50J51k10j62K67j58L8n9j6J50Q9l31K2J69K43j86j63
4546a61K83k56J19J40j79N4J11j71J04o0p4Q7o4J47j73K84n6k6M4k67J98r2Q2
4569G4j74K89J24m41K6Q7j35M39j19j75J28k32M0J10o1p7n6J83o4k57K21o9Q7
4592e2J38j30k62N42j52j18j30J33j49L08j26J56k17j62K66M3m9L17l71L11m79
4613a83M00k01k06M24l48Q9K11q0R6q1k23R9J21l93K80j63L38O7l36O2p6P7K15
4636A89k50j06K27l06K65k33K58J1j9k13K97k80K87K5k39Q8o3j75K64k53K00j97
$$ plain form
4479 39 -73 -116 1 118 -30 -32 -25 -78 28 3 -60 126 -240 -58 66 -210 26 -4 -272 4 -271 47 160
4502 160 -137 117 128 -183 208 -51 -121 -19 -194 118 -81 57 51 -193 -11 135 -80 23 6 -272 260 79
4524 79 -112 185 -80 32 145 -5 146 -64 -226 41 -117 -79 -138 -154 -4 85 -246 -224 -55 188 2 -161
4546 -161 122 -134 -15 125 -54 0 111 -60 44 -16 -90 -3 -67 80 -93 191 135 109 153 -114 84 -8 74
4569 74 -100 189 313 -128 -102 -15 -150 289 170 -5 123 -109 -69 41 -20 -97 -153 30 -34 -291 -70 -139 -52
4592 -52 86 -44 -306 236 84 -34 -164 -31 -180 128 2 158 -59 -221 45 88 39 356 -15 296 -183
4613 -183 217 16 -190 234 -114 -25 186 106 202 121 -102 -3 118 -275 5 -158 180 247 -89 -27 -103 -26 189
4636 189 -61 -167 60 -246 19 -214 44 55 36 -177 120 -160 127 152 -87 1 -62 -237 27 -226 -26 -223
4658b23K90R2n5j95J10j37k38K10p8M57m8j80RR0j46J20m0K10l24r6K25J89n81
4681c39N57k89M9m3j82K49n3K20j23j53J13rl6O6jJ91k22o6J64j37k90N82l31
4704h3M7L66n07K32J83o02N08l20O2M00l79M3K73m02J49q9m6J43q5j50L55j63
4726f5J1j24J61M0j01j2J02N5l18J02l3P8k2J00J17m2J22j51j99N01j85l27L91
4749B01j79j03O3j35L51k82O6J07l9p5R0j0j56J25l01L57j51L1Nj03K99l59J40
4772e8K63k40J28m9k83J92n3J72j15j25N4K33k69K33K09l95L34k00p2K3oJ36j26
4795a4j24N4k5K07Q0j28J62k03j81M74j76n1M8j51J2Q1j32J72o5j58L25k72K3
4818d2O9o2o4O1j40J98O7K0j10k6J34j3M1R3j34j48J96l95K19J60r8n3J05o6J17
$$ plain form
4658 -223 67 159 104 -91 19 -118 -356 -146 -224 233 185 5 14 104 -42 78 38 248 -76 -172 53 242 -339
4681 -339 218 -71 -22 -65 -247 2 -51 169 46 -107 6 -3 -39 27 26 217 -5 -71 93 -44 -334 248 -83
4704 -83 -36 330 -177 55 238 -364 144 -176 -114 286 -93 -50 223 -179 -30 -119 -165 -22 -107 -257 98 -65
4726 -65 -54 -178 -17 23 -78 -90 12 67 -251 -149 -182 -104 -126 -26 91 49 171 20 -179 322 137 -190 201
4749 201 22 -81 -18 -153 198 -84 -18 89 50 -25 65 55 -101 24 -277 80 -71 -40 -35 -138 161 -198 -58
4772 -58 205 -35 93 44 -239 -47 -100 72 -43 -168 -114 119 -150 83 292 -103 231 31 -41 -18 -24 112 -14
4795 -14 -138 -84 -109 98 178 50 212 9 -172 302 126 75 123 -28 -16 65 -67 105 40 -118 207 -65 -42
4818 -42 27 -35 -99 -38 -178 20 87 107 -3 -29 105 92 133 226 92 -56 140 -255 -36 124 26 -27 78 12 129
4843A29j41M1m7k6q2p7j47M56l2p4j9k62M42l01J18r3L2N9j49p9M76j93q0N0J31
4868A32k7j33m4K25o2k64R9K0K20q7o7N6m7j47K09m2m8J53L8p8P1n02L54k4j76
4893a71L08k47O3J74n2J56k02n9K62j75J23j95j61J68J5j75K85k99K11r7J4K08
4915A54k20J87l44K44j9p2n1J07K18m08M54k35Q6j66J94jj37L4K41j63k50%L02
4938A55m9r0j20J90j03j43K46L3j0l4j88M9nj19K44q6J00J09l71nM87m20J38k56
4962b48J5K66L5l8N5l08J48n7J53j35j6K19q0j07J27o2k16K12j42J49n7L8J90
4985A41j60l6J47j70P7K00j14J77l26j17mJ72L2l3k6M9J43l00K81j88K6J17p7
5008A1J68R8k71PK6l13K42j39M8M32k50n6j98K56m1k09K44j90N3J62k7j14r5J33
$$ plain form
4843 129 -12 29 -18 -44 -126 -203 -350 106 74 0 -19 -281 161 -140 -22 -115 -83 -24 -173 -252 224 31 -49 1 132
4868 132 105 -28 -72 153 91 -173 -74 -54 166 79 12 68 21 -126 83 41 -7 146 184 106 177 -325 29 5 -171
4893 -171 137 -110 -47 127 75 231 29 -30 232 57 180 -15 -176 -8 7 -168 117 -182 29 -68 -54 154
4915 154 -66 121 -223 21 2 -70 -121 -14 204 -204 250 15 101 -65 129 128 -9 25 266 103 -147 -147 155
4938 155 106 16 -104 86 -17 -160 86 119 109 75 -113 -64 -69 -188 56 -30 70 179 -192 -197 290 -130 8 -248
4962 -248 -233 33 68 30 85 -223 -75 -132 21 -114 -130 89 9 -98 29 -33 -249 -37 -179 -30 -87 -49 141
4985 141 -19 -55 92 -78 -1 199 85 262 -64 -181 -185 -13 19 -14 -40 9 152 -148 133 -55 -29 88 11
5008 11 179 277 6 13 39 -274 -32 -171 -123 309 59 3 -195 61 20 -189 55 -135 -82 80 53 -61 -156 -23
5032b3j32J60j07K11j89J08l8j0M6o0K4n6J8k5K01j17O8j5j37N4k00L12J46k94
5056e5m2K10j54J47j91n8L03k28j3J55p7J55j37P3J6j33j51N19l13J33J16m43
5078a68L16q8j29J41k64P6M0N3J50q3Q0k6o7kLn4K27k06q7K87j45Nk17K6R6J33
5104I7j73n7N7L31j83L7O4j36j08J94j92J02n4j1J02k63J8J43K47l0j83k54K11
5127d1Q5n6R3q6KJ24L8j41K11l12Rj9l7J26o1J15j69J51q7J76l8J60l14j33K5
5152a79k7K75p9r1J95Q8j37j3j85K71m8j54K0J50m19K05K58O1K2k10J33j24k20
5175b08K67N0K1k7k90J97k61J12N03m23J1p3Jn3mJ25J69lr2J0J9l5K0k36J90m
5201a4K5L2l16K06K19k45L35l34O6J53J0k62K73l76K61L2k82K39n1K18j94J00
$$ plain form
5032 -23 -155 5 -102 109 -80 28 -10 -20 26 -34 -10 -66 -48 -73 128 11 79 64 -73 -19 -219 93 239 -55
5056 -55 -97 113 -41 106 -85 -143 160 -68 -81 74 -3 152 15 88 104 -29 -180 339 26 159 275 -168
5078 -168 148 60 -69 72 -192 -116 -76 -23 127 44 124 98 31 29 32 -22 205 -1 -88 199 54 59 -158 -132 -36 97
5104 97 -76 -133 -76 255 72 109 173 37 -71 123 -69 33 -21 -32 70 -193 -175 -32 215 185 2 -252 -41
5127 -41 44 -12 81 -5 -3 121 159 18 229 -83 -74 -93 -130 -4 -65 50 -119 32 -55 121 83 243 -71 -204 -179
5152 -179 -206 69 -10 -101 94 182 45 32 -153 118 70 -84 -64 86 -333 -128 130 191 213 3 136 12 -208
5175 -208 59 109 130 103 -187 10 -251 -139 364 -59 -48 -121 -120 -173 -177 -52 117 114 22 32 51 16 36 -200 -10 -14
5201 -14 11 43 -273 -67 152 -93 242 -92 -26 127 137 -125 148 -228 33 65 -217 22 -29 189 -5 95
5223I5k05P6O6M55p21M36j77j10L6j90K97K08k16o2N5p9Q3L4j37K78l74K5K02
5246G5J02k3n7J6j67K31l50L04J1l32K35k65L43r9n1m4j29O2J25j18J15N2n3K5
5270HO0j95J08L2L2M3j16j57P6k7J2kJ20k90M28l25n4J73J27rN9J9l50J74M5p2
5296h1LJ15j00R1l97L89L1K7k4j99K91k50R7J97l42K22j86j08K2K62k57J07K30
5319A40k88K60Jk38L94j51j53N7l49N56j13k91J26R8j56j05LR4Q5k39L22NJ97
5342B55l47K03N3rj46J17r3P9M0j12K60k79J13p5k9m4o1K8N1J21r5J71k91J54
5366F4K04n89M67J88l92O9K6j08K04m1o1k54O8J87l6J69k62q8K60O5j88J18k5
5389D5j15K09l3j44p9J45J66j58R6j79J90l65L18o0j56R0L08n2l12j64K60O4j92
$$ plain form
5223 95 -110 -34 32 487 -234 202 25 -85 -49 -239 58 266 50 -12 43 -36 47 81 -56 222 -152 -127 75
5246 75 177 154 97 113 -54 177 -173 131 142 -190 45 -220 123 24 -27 -71 -200 -138 -13 -131 -16 36 -17 8
5270 8 68 -127 -19 13 45 88 -28 -185 -109 -136 -124 -126 -6 -296 132 -193 -247 -74 53 44 103 122 -228 -54 -9 -81
5296 -81 -78 37 -63 28 -369 20 51 78 54 -145 146 -104 -7 190 -152 70 -116 -224 -202 60 -197 -90 140
5319 140 -148 112 113 -125 269 118 -35 22 -327 229 116 -175 -49 49 -107 -212 -209 -115 -30 -269 53 58 255
5342 255 -92 111 164 155 9 126 33 112 152 40 300 21 134 59 30 -14 -75 -47 4 125 30 201 -90 64
5366 64 268 -321 146 334 -58 11 37 -71 133 92 31 -223 -155 32 -4 165 -97 -185 75 140 -48 70 45
5389 45 -70 139 106 -38 -117 28 194 36 132 -47 143 -222 96 36 -120 -30 278 226 -86 -250 10 74 -118
5412a18J31j75L99j80j66K21k03J38K14j78j26M7j72L66k56R8N6j75J58j26J65
5433A18o1q6M2M5k98J03J43j57J04K8O0L20o17J51K97k41K2J54j32j8j78L10j28
5456a9j23J51n5J31O7k63J91j09l5R7Rk72M41k70m5L18j37m3OJ13k65O7J31j44
5480e8J11j6J3j49K50l5P0J9k65N7j48J7J01P2j84J87l9l3K1j8L45k95O5K7r8
5505A7o7o1N9Q2n9PP9nl0N3j48J3K01q7j17j33Q1p9J54R6m2j69K7P4Q9l1j34M6
5533h4K00k40J49k05Q6J31j03K6N6P2J94n16K00K9R8K5l34K97j30o5P0J45l11
5556b10M9L08j08n7l36J09K48q6J85j46n6R9J1k1J0o0K46k25L4J76k14J13k5j83
5580a39J65p0j25M05j58J78Q1k93R1j4j93J14k26J33J24j41M0K63j25P2j54k09
$$ plain form
5412 -118 13 -162 237 57 -109 112 -91 47 261 83 -43 4 -168 198 -58 40 96 -79 79 -47 118
5433 118 57 -29 13 58 -240 -137 6 -151 -47 -19 41 361 -256 -105 192 -49 -27 127 -5 -23 -201 109 -19
5456 -19 -142 9 -46 85 152 -111 80 -29 -64 33 42 -230 211 -59 -104 214 77 34 40 153 -112 -45 86 -58
5480 -58 53 37 50 -99 151 116 186 205 -60 -3 -151 -134 -33 39 -145 42 3 -30 -9 -27 318 23 88 115 17
5505 17 -50 -111 -52 30 -29 -22 57 52 22 75 -73 -60 141 54 -63 -196 -115 -194 -40 56 14 -155 -128 -54 35 4 -130 -84
5533 -84 116 -124 25 -180 -94 37 -66 -40 16 88 282 -234 -34 -5 93 118 -216 81 -49 -114 -44 101 -210
5556 -210 -161 147 39 -18 -354 -245 3 -83 102 -44 -100 -1 10 -11 -1 -61 185 -40 -6 170 -44 69 44 -139
5580 -139 26 -44 -169 236 78 256 337 44 135 121 -72 42 -184 -51 73 -68 -28 235 110 182 28 -181
5602a81R9O5R0O6j70j48J37j62K92o1J6L7m24K52R9j61R4J09m5J7j80J80j49J65
5626C7m5Q5q4J57k12J22O6j36K50j91j84L30k34r2L25j55m8N4l1k22J54J62O8
5649A76o7j84J32O4n4o0KN1k35J98Mrj83J90k64L41k86L00k11j37J87Rk23R3N6
5674a10J90j39J29j36J75k55M74l35j81L52l34M07l75L6K35l99J18J18n0J80k19
5695a19L73k26j13r0J88N7k4J39k85o4L0N7J65j34L6J67k09K07j90j45J43n8J07
5718A2J34L7p5P0k92J57j09p9L04l49J98J20j15j2k6k07L32j25MJ54k39l2qK9
5742a17P4k30N12N8n03L3L09k07O9m6P4J37j52j86M33l73L0Q8K01j69P9r7j68
5765a51lJ78m1j87J22r7J99k8pp8j6o5L74m59K47M4p5J54p4J09j06M8o4N2l58
$$ plain form
5602 -181 -82 -17 73 139 -31 -179 -42 -204 88 27 43 80 -344 -92 7 -154 -60 49 4 21 -159 21 -128 37
5626 37 -8 77 -7 150 -62 60 126 -10 240 49 -135 195 -39 -131 194 39 -9 45 14 -208 -54 108 176
5649 176 109 -75 57 121 67 7 9 60 -175 23 27 18 -165 25 -239 102 -184 116 -95 -232 -45 -36 -259 -166 -110
5674 -110 80 -59 70 -66 109 -146 328 -7 -188 164 -170 237 -138 -102 133 -266 -148 -30 -80 100 -119
5695 -119 254 28 -85 -175 13 70 46 185 -100 -164 -134 -77 88 -46 -10 157 -52 155 -35 -180 -37 -95 12
5718 12 146 183 108 178 -114 43 -66 -145 159 -190 8 128 13 1 -25 -232 100 -25 -21 133 -106 -138 -146 -117
5742 -117 -43 -273 239 297 -206 -173 136 -71 -2 -48 26 163 11 -175 258 -115 -85 3 204 35 114 17 -151
5765 -151 -154 24 -17 -204 -82 -179 20 -8 -15 -93 -109 -174 200 -259 -12 32 -43 111 37 146 40 88 24 76 -282
5790b82L09k23L0j28L31k1j71J65j12L7q8K48lQ4k27L0K63l50J17j72n3L71J5
5813A70k83P7j79J49P2l54J23J16Q7J35m64JO81m48J67O8n4l2J62l31J48J74j29
5836E6p6j75K39j14j17L59l70K15J1j61K31J09m29L27j42r9N01k42l2M1j52O7
5858D7m1j89K02j07J39K8Q0rk69K01j75J36m7m3J06Q4l26J11L60n28L27m37K86
5881f4k2J43j96L33j93J13J47n35N89j36m03K54j08n9K89l11J0L06j87M5J79k20
5903b6R0k07k8K93k7q0K27m88O30k31j4L9l18L23k30k1L29k27rL2j87L09J4L4
5927B27%k12Mj16j11K78j29OL6j73R9J50J54k35J68l4l8j14r4o6J90lJ59m35L80
5952I1J02k17R7j51j28L56m61K47J39j63Q4k48L51N3j03k08K65j80K20j29L7J13
$$ plain form
5790 -282 27 -196 -166 -294 37 16 -155 10 -102 -65 -153 95 92 176 -51 -21 242 -108 9 -163 -216 155 170
5813 170 -113 -36 -215 -66 6 -348 -225 -109 -22 113 -351 -350 331 -117 50 118 64 32 194 -137 11 185 56
5836 56 -20 -195 44 -70 -187 172 -198 17 28 -133 98 207 -222 105 -37 -136 365 123 91 132 -20 47
5858 47 6 -183 19 -88 51 79 159 150 -119 82 -93 43 -4 -47 59 143 -183 -72 288 -240 87 -350 -64
5881 -64 -86 57 -139 194 1 114 261 -274 315 179 -224 30 -78 -137 152 -159 -149 157 -30 15 194 -26
5903 -26 64 -143 -171 122 95 15 242 -246 384 153 139 178 -140 183 -47 -68 261 34 25 57 -130 179 193 227
5927 227 227 15 19 -97 -208 70 -59 -53 -17 -190 -91 59 213 -22 146 112 74 -40 -134 -200 -10 -13 146 -289 91
5952 91 193 -24 73 -78 -206 150 -311 -64 75 -88 -4 -252 99 152 49 -159 106 -74 146 17 54 167
5974A67r8j17K15P5j48k2k44L64l00j12j5K13j97J41k0J65K4p7k40J01o3L62j59
5997A5J77q1k38J23m6J16j55j6N2J87j72J48k35J75n3j40J96q0j13K3Q3n7J66
6020G5j1j88J14j50Q1j5J49J68m11K26j21J35J78k77k17K11MK73L0m30L20nk59
6043a20R7k8J49k25R3K79l46j17N31l34nk1j44L49k83NK23j89J58o4n8J27j86
6066a09p7K83m0j99J76l40L06pq3K78j91j90L17o2j63O8j49L30j38m0J1L3n9j0
6090e5M0l1MP1J15l26L14n4j42j09j22N98j25m87L96j02O0K3j05l2M08m45n3K00
6114D1j58K05O3m29L78j42k38L37mj74L67l6p0j78J43q7J70m5k59J74l8j50j32
6137b62N20k95J36j32K2K56k08k84L52k40J93j03k6L37mj54K04o00L13M6k28L6
$$ plain form
5974 167 69 -48 167 242 94 72 -172 192 -108 -220 -235 -22 -219 -78 -98 67 91 14 -226 -125 -188 174 15
5997 15 192 111 -127 -4 -50 66 -89 -105 -53 134 -38 110 -125 50 -3 -143 53 -27 -140 -117 -34 -91 75
6020 75 64 -124 -10 -160 -79 -94 55 223 -188 38 -83 52 230 -47 -264 -53 -49 224 254 -176 144 139 -120
6043 -120 -23 -51 98 -127 -34 245 -101 -218 313 -21 -26 -47 -191 158 -125 -120 103 -86 72 8 -50 77 -109
6066 -109 -186 97 57 -142 34 -306 0 -7 -90 188 -3 -193 124 62 -101 -33 -182 148 10 -30 -19 14 -45 -55
6090 -55 -15 -46 -42 29 144 -182 132 78 -64 -173 -295 303 178 -309 87 -15 45 68 -37 -69 339 -106 -159 41
6114 41 -117 88 151 -278 100 -42 -280 57 53 -121 246 210 140 -38 105 18 188 143 -116 58 20 -130 -262
6137 -262 258 -37 99 -33 -11 245 37 -247 105 -135 58 -45 -71 266 262 108 312 -288 25 71 -157 -121
6159a21L6J98k08N6j7J55m31N22j5m60N08j09N3k27m2K44l28J17J7K23j02R3m5
6182A17j88O9mJ25P4j40j26q9L41m12r1L77K8o9J31L2M1k3j6K3k35n3L2J29j29
6207e6K58l02J18PR5J82l50Q1K91n19M54l21KK67m60K89p4R4K07j02j10j76K23
6230I8l1J1N3m25K60p4J91k70K14L3p7J02K7k61M52l88N7j67J89K22j16k28q2
6253b10M69l72L53j22j94J51j81L72m71l9K35r0M8K69p0j21K77l15J97m80J05
6274a89J91o3K10n4l24M35k22j74J88n4K8J49j64J2o0K8L6j67j8K60k49J31j29
6297a99L05k4k09P2O1R1l36R2J47l4k46K46R1m7j28K56P6k22j38J42P8k38J68
6320DJ1J8Q4j23P6R2k53K2p6q9J12J3J78p8O2Q5j83j38J83ol7K08k35L47k28r8
$$ plain form
6159 -121 -85 113 -95 -39 -56 99 -332 190 175 -285 223 114 167 -60 -102 142 -186 -69 -52 171 69 162 117
6182 117 -71 -2 -6 119 193 53 -73 -162 179 -233 -324 53 81 12 143 175 216 193 177 200 -35 -88 -56 73 -56
6207 -56 202 -100 18 25 120 302 -48 33 324 -195 259 -62 -60 207 -253 36 -38 56 263 161 51 -125 98
6230 98 67 78 131 -294 -34 -108 83 -187 27 60 -17 85 112 -149 303 -85 -28 -195 -6 216 100 -128 -210
6253 -210 259 -113 240 118 -76 75 -106 266 -205 -244 -9 -99 -51 218 148 27 304 -11 186 -294 -189
6274 -189 2 -61 149 95 -229 206 -16 -190 -2 -56 -28 121 -43 -31 -91 -63 -27 -194 -212 48 -201 -70 -199
6297 -199 106 82 -127 -55 6 97 -239 -147 0 -34 -280 -34 57 10 -118 138 214 -8 -146 -4 74 -164 4
6320 4 15 33 117 -6 70 162 -91 -69 -145 -234 -122 -109 69 -9 53 138 -45 -183 0 -6 -43 165 -70 277 49 -49
6346d9J19L0l47K70L7L7K5k13O6Q1J23pk54m3J97j11L6L5j9q2j90J46J25L9k82
6371b31K17o0K57kk00p7J45Nj37N9J64O6k64K04j59L8J68j04m1j89l1L65m87M63
6395A69m02J30K26l85OK06rl33R5k01N61j56l6R2j52kL04j57R5j86J48K62m34
6418a59k12K65k51L09r7K79j66k33K00L7J21j8j49m2K46o1r4L2Jr0r3L9K2q4K95
6443I7M1k88R4K5J07J87l04L0K21l9l10N9J93o2r4J06J49k65k79M70k85K46j34
6466c5j12L59j17M8j32K3j18k06M53k48M7J7L8p5O5J65m10M28j55l3j33R7J00
6489F6jJ04j9p6m08J83O4NJ30J9M8k58qJ98j58J22O1k2p3J97j85J37k83O2L29
6514B34j45l32K28j53J87j56K9J99m6R1k12J34J44q9n8Pj79K02J2o7K08q9l61
$$ plain form
6346 -49 70 100 -247 23 60 97 122 -91 -25 56 179 172 -82 -125 72 -39 -3 32 13 -69 -259 -113 12 51 -231
6371 -231 -14 -74 183 181 -19 -96 49 54 -83 -24 140 206 -58 146 -13 25 193 89 48 -141 -172 193 -294 169
6395 169 -233 -103 123 -262 -256 -50 -59 -392 -297 -498 63 -93 -129 -37 -189 -191 113 -44 51 -135 13 275 -159
6418 -159 -371 -106 -357 -48 -145 134 -32 -265 -65 -28 93 75 -74 -116 130 69 -25 7 8 -82 -175 -136 -114 -198 97
6443 97 138 -150 -56 -31 76 263 -41 -11 210 171 -139 -80 113 51 -43 63 212 -53 -332 138 -147 99 -35
6466 -35 -147 212 95 143 11 34 -84 -290 163 -85 -38 -21 17 -58 7 172 -238 190 35 2 -131 -34 66
6489 66 65 169 150 74 -334 -151 -87 -82 48 67 115 -143 -151 47 -111 11 72 50 -23 174 -11 126 -157 -95 234
6514 234 89 -243 -15 -168 19 -137 -108 91 45 136 -76 58 202 113 55 62 -117 85 97 30 238 149 -212
6537b12J92L6q9J61J0J7j85r7R9m9M01k03l34L18q0J85j23j59kJ76j36K6J27k94
6561b15O5K0J77K75m66k6M26l33J40n5K5j8K3J45l31P8L01k71Q5p0p0R8k83K31
6585d9K0j15j50L16q3j02R9k19M21m7N2J89l59Q1Q3k5k57O1L08m52L13K5J44j53
6609A01k00J70J42M4j20j84L8j51P8k03L63m7p3l3j19J57O3n9r9J48J01r6N5j
6633G5r6j55K06j59n6J94R7q6k64O50n16j0K49J2p6j72N0PJ60J81l28j72K13j29
6657a25O1L20n00M2K33R0m16N2L11K56j9m9j00l44J21M5Q1L9l02K55J9j11PJ35
6681A01m2m4J25j94mJ18o2j11o9L62k47r7J68r9K80o9j63J16O5j95Nj66Q3K01
6705F2k8l3q5J82p3J47j32J6K76m74L74k11p9j6K56Nj84j12J80l8k1M2kr6j76
$$ plain form
6537 -212 -20 16 -73 88 98 115 -70 -167 -68 -117 284 81 -253 65 -15 170 47 -112 -114 62 -74 -48 79 -215
6561 -215 -150 -130 47 322 -144 -170 256 -77 63 8 33 15 38 183 -148 -70 231 -40 45 -25 -95 3 -280 -49
6585 -49 -29 -144 -294 22 -61 -163 -64 -283 138 91 143 332 -27 54 137 112 -145 -84 224 -228 85 110 254 101
6609 101 -99 71 213 257 137 -47 -9 -160 -82 -285 78 31 -42 -75 -194 -37 26 -33 -132 16 117 21 76 75
6633 75 -21 -176 30 -129 -185 9 106 20 -244 406 -110 -120 129 141 65 -107 -57 -50 110 291 -37 -209 4 -125
6657 -125 -64 256 -244 -202 31 121 -295 -243 68 324 305 256 156 -188 -67 -22 59 98 -204 51 70 -41 -34 101
6681 101 59 15 140 -54 -58 60 -2 -113 -182 180 -67 -164 4 -95 185 116 -47 69 134 -61 -56 -222 -139 62
6705 62 34 1 -84 98 25 172 40 56 332 -142 232 21 -58 -74 182 187 3 -109 71 33 12 54 52 -44 -220
6730b20L05O0k72K35m3p8J43k47J77J77l03R2j86J47p6K7M0J16K8j94r4n3L14
6753I5J4r2J16j68J42j72j9M45m64N7J78l46M07N5m18K92j13J67j45j98M36l63
6775i4K10l3l30K17M0l1J74L8j65K30p3k90J81j31J07j39M4J13k22K83j51k00
6797b22M86l16j61J54P1K7K9j52K82l74NL37k44L1J15L1k16Q1k10K87r6k69M48
6820A24k55o5L33k52J90q7p5J57or4K83j91Mj31l8K64k36L26j78o3j9j82J93l0
6844b8J14j39k55J12J67O3P1r3PP7n7Jr9Q1j99M42l51j39K53k4J15p7J65j27j22
6869d2J40Q5Ml32K81k12j86J43M8J76L8p8K7q2R3j33k10K93k29K78q1k10J35J73
6893A19l02L73l0k9k08N7KL0k8J70j61mK52k91qM5m5K68Ln5k81j50L15j09J5J63
$$ plain form
6730 -220 85 145 -127 108 65 -13 130 -117 60 237 -66 26 -160 -13 -89 -62 -22 94 122 -72 -166 -219 95
6753 95 109 17 133 -35 107 -65 -84 361 -103 -46 132 -214 193 248 -170 122 9 176 31 -167 269 -94
6775 -94 116 83 -247 -30 10 -21 153 191 26 256 183 -107 74 -57 50 -89 -45 68 -154 129 -22 -222
6797 -222 264 -52 -213 -59 12 39 68 -84 198 -176 -171 166 -78 -47 68 99 -117 -36 -246 41 -55 -324 124
6820 124 -131 -196 137 -115 75 -12 -87 70 64 -30 253 62 66 -65 -103 161 -75 251 73 10 -9 -191 2 -28
6844 -28 86 -53 -308 -196 -29 34 105 12 19 96 39 40 -59 22 -177 265 -86 -225 28 4 119 42 207 80 -42
6869 -42 98 183 187 -145 136 -76 -262 -119 -71 105 143 65 92 10 103 -30 -240 53 -176 102 21 -189 -54 119
6893 119 -183 190 160 131 -77 -20 -18 12 -16 154 -7 -11 241 -50 -58 -13 -58 210 213 158 -123 -273 42 -67 -52 111
6919A11Q9m28K38r9J43M8J7K40m07P3j27j61J35J55lN6m9m27L51m8RK85k01j26
6943a26L53l21lK03j48J53k2k49K41k8K92l10j93olK70n0k07J85n1J58l3k07J51
6967D9J84k76n6J5j95K97l3j10J43p4r1J05j46J93J12q8M7j75M03n43K02N4k67
6990b50K06n0J3P1K9q2K15j56k4L55m90K31q1j98n3J82l9J43j01J74p4l05K69
7013a5J18k38J07k30J4M20k21K3J06r0K92k3k76j34L7K17k20M8J32j99k1Q2l1
7036a02J53k1n4L13n13P2J4M1J7M20o2k11j18O6l58K20K27J89l29K10o9j47J67
7059A25n8k9j50j23L82l10K37M7n3l1o6j04M51l48l18L79j84qL47l14J23M5j96
7082a56J94n0O9M9l95L40k07KlK11J05m7j2j73O2J88j43k13N8K49l68L93k55Q2
$$ plain form
6919 111 200 -228 10 -89 54 102 119 359 -48 25 -102 -263 -128 27 24 80 31 -396 -45 -93 -84 201 0 -126
6943 -126 227 -94 -97 106 -42 111 89 -160 81 53 345 35 -158 -164 -167 103 53 -154 31 -20 138 105 -102 49
6967 49 233 -43 -99 -84 -279 18 -15 -125 18 -56 -147 -42 -188 5 117 29 76 -99 304 -239 -37 17 -250
6990 -250 -44 -94 -81 -10 19 -63 152 -4 -28 327 -163 68 -13 -211 -264 -82 -121 22 -79 95 21 -284 -15
7013 -15 103 -135 -28 -258 -244 176 -45 -22 84 -6 286 263 -13 -147 -110 107 -113 -65 67 -132 -153 -71 -102
7036 -102 51 30 -24 289 -224 -152 -138 -97 -80 340 278 67 -51 15 -343 -123 104 293 -36 174 105 -42 125
7059 125 67 38 -112 -235 147 -163 74 121 68 37 -29 -133 318 -30 -348 31 -153 -161 186 -128 -5 40 -156
7082 -156 38 -12 57 106 -289 51 -156 -154 -157 54 159 112 100 -73 -11 177 34 -179 -121 128 -240 153 -102 -20
7106b0L00k07j11K34l14J35J67k82J1J95j17k49J24L28j97m9J57r6l76K90p8K21
7128F6j38j49M01l61j51J15L23j78J57j13J8J33k63J84l05n7J74K24j78J98k13
7149a13J97L3k01L1L04q2k77O6j21K04j0K02l33j91L39j14m4K35k49K57O1j01
7171I3K08m46K53K6k04Kn3N9J69l2m9P1o1Jk23J7K48k00NJ38j15J80l55J76L46
7196B54l29k51N68m63K07R1j93J09J07Mj83j95L26l0k2P8j38pK31j52J61j57o
7219A0j29J39K8K53k26j59O2N9J29j7l04K54j99J07m2J05j48J38q5R6l50K20q2
7242a41r7L00O6l59K50J63k46JK60j45J43m41K03q0N2K8l6M19l41j19O8J12q9
7265b9j51J0J58j34L98k78K75l02K0K1J0Om9K67m62R5K75k7k01K9J2J58k21L6
$$ plain form
7106 -20 280 73 -38 196 -118 17 184 -98 -87 108 -9 -258 -134 194 -3 -52 105 9 -367 -77 -155 66
7128 66 -72 -221 180 -181 -332 -217 106 -72 85 -28 -10 123 -140 44 -261 -318 -144 80 -98 100 -113
7149 -113 84 117 -84 -53 251 169 -108 -42 -163 41 31 233 -100 -291 48 -66 -110 125 -124 133 194 93
7171 93 301 -145 108 134 -70 -68 -121 -62 107 75 26 97 36 37 -186 -169 79 -121 -116 22 -93 87 -268 -92 254
7196 254 -75 -326 242 -221 -14 77 -116 -7 100 104 -79 -274 52 22 0 78 -60 -67 164 12 173 16 10
7219 10 -119 20 48 301 75 -84 -22 37 166 149 -155 99 -100 7 -35 70 -78 60 -25 71 -279 -59 -141
7242 -141 -238 62 128 -231 19 182 -64 -63 197 52 195 -246 -43 -123 -71 -43 -79 340 -1 -120 -52 60 -29
7265 -29 -180 -170 -12 -146 252 -26 249 -53 -33 -12 -2 4 -45 222 -240 -145 130 103 -98 -69 -57 101 -120 -84
7289h4J72j09j63J26k01L62j38j83L10j21j1J20j28O1l7k21L11k63J94J28r8P5
7311A02j73k82K88J23m4N2J9J8L4pJ10k38o9M77n43K20J29l97K25r5q0O2L24p
7335B48j90p6M7K03l58P7j28Q4j30J31J96j6p5M2q0k5Q9J72j71J3l77L50k03J25
7359e2M9j27M16k43M7k54m9K1N0j03N20k18L7k06J51k44K23J84m61M17k99K60
7381A19m1P0j92J4r5J41j8J28k10K00Q1l30L6K76m9j59J24Nk15l0K92j98k08J99
7405f0P1m0K99k49mo9jK5Q6j49r2MO1L52j69P5N4k83J57o5j20J65j4j55J23O5
7431F7J59lj82j3o5L05j21k10M3J67m29K06P8J66m6k41NJ71j38KP6J4k53J69K4
7456d9k1J00J66j93Q7j64M9J52K4k31j23R2k0K3J49K7j85N3J42l04L31j91K65
$$ plain form
7289 -84 88 -21 -184 -58 -259 103 -35 -218 92 -29 -40 80 -48 13 -24 -245 66 -197 -3 125 27 102
7311 102 -71 -353 -65 58 14 66 85 103 137 130 240 2 -67 410 -133 87 216 -181 44 -51 -131 -69 255 248
7335 248 58 -18 29 232 -126 -49 -177 -93 -223 -92 104 88 13 55 -25 -50 39 211 40 53 -324 26 -177 -52
7359 -52 -3 -130 286 43 90 -164 -213 -192 -142 -245 275 57 94 -112 39 -205 18 202 -259 158 -141 119
7381 119 78 148 -44 -30 -125 16 -2 126 -84 116 197 -133 -97 179 130 -29 95 100 -115 -145 147 -51 -259 -60
7405 -60 11 -29 270 21 17 -52 -53 -28 58 -91 -183 -179 -118 234 65 140 194 -89 68 3 -117 48 34 -121 2 67
7431 67 226 223 41 28 -37 268 147 -63 -20 147 -282 -76 2 168 122 -119 -114 57 -81 -79 -3 11 -242 -73 -49
7456 -49 -70 30 196 3 90 -74 -25 127 151 -80 -203 -111 -131 -108 41 68 -117 -64 78 -226 105 -86 179
7479A79j93l0k0P1P4r9J73K0M0k24J77l95L76k23P2j41J7J71r2J33j58RJ7j38
7503a84P7J92j71K79j42o1O8L0k19L13n73L99p6j3K15j45K37k57J64j72K08k26
7525e7J79j86J00l25J5L12j11L3l1J79L3o7o0j34P6j74K69j94NplJ13K88m06j8
7550a71K13j42K59k54J68O2k15K44j50j12K20j99J5J20kJ7m2k40L81J3k28P6j4
7573A9L7j81Q2J75M7m2k50k2J21K2Q7J17k21j91L51l7j12P0m8j12K46m65N24j14
7597A03m31K82K90k70j61R7L18q1k16L17m31J63K2P5kn06L80J47j73P2K46k63
7619b2P6j66j55M47j66J3L3q5qj8P1j59n7R3J12K00k79N1K1j82M4J64j03n6N4
7644g7L17j75mk25j6L79k38K00j46p8M2j28J1K59m02J20J19k6J32m4k24M19k81
$$ plain form
7479 179 -14 -44 -64 7 81 -18 155 175 215 -9 168 -227 149 -74 -2 -143 -126 45 -47 86 -72 -63 -46 -184
7503 -184 -107 85 -86 193 51 -10 58 88 -131 182 -391 8 -68 -81 134 -11 226 -31 133 -39 169 -57
7525 -57 122 -64 36 -289 -274 38 -73 -40 -71 108 141 74 14 -120 -44 -218 51 -143 -138 -145 -148 -35 253 -153 -171
7550 -171 42 -100 159 -95 73 135 -80 164 14 -98 122 -77 -62 58 56 73 31 -209 172 185 -43 33 19
7573 19 56 -125 -43 132 179 137 -113 -135 -14 8 95 212 -9 -200 151 114 2 72 24 -88 158 -307 217 103
7597 103 -328 -46 244 -26 -187 -90 228 147 -69 248 -183 -20 2 77 75 -431 -51 96 -77 -5 241 -22
7619 -22 54 -112 -267 180 14 27 60 -25 -33 -51 20 -139 -196 -103 9 209 -70 -19 2 -180 -136 28 -75 -131 -77
7644 -77 240 65 61 -164 -180 199 -39 161 15 -63 -21 -149 -138 121 -281 -161 -42 -68 64 20 -204 215 -66
7667f6L3J82l54J49K3JJ35j40J70n0j79J55L2j6m6J25m60K54lJ70j87J5m3R9j05
7692a06K58j4j07M1k90J91j65J58J93j8l32J12j03J19O3k18L45k56J68j63K97
7713A73l01K56k85kM0N7J8k00J72L8J87j41P5j8J43j31j71J76r3R7n2lJ9N5oJ10
7739B13l47L26k53j3J85m0j01J4j77L45l66K52Q9k94j7K27j56J4j08J68J58J50
7761B69l94J07J3O9j45J06Q3k09j26K92k3k20J32j30K43m8J83j58r2L5K70l46
7783h9J30k68K81o4R4J13k69qK8J3O0K93l37k08L18k45L86l36K7L98l68q0O8j85
7807b48L16k1o5K17j00p9k27J15P1qNJ8O4k58K08j20J10k2K16j17j15kL54l89
7831g7J24n0j3J21j12q5J78o6Mj49Q1J3K55m70M74j14p4j31Q4J02M6l16K96r7
$$ plain form
7667 -66 -33 149 -205 -56 -33 -32 103 -37 133 83 -96 59 91 75 29 154 -306 -52 -55 115 -72 -57 -100 -1 -106
7692 -106 152 138 31 72 -218 -27 -192 -34 159 141 -191 -79 -182 -63 0 -218 127 -129 39 -124 173
7713 173 -128 128 -157 -159 -119 -62 -44 -244 -72 -34 153 12 87 69 212 81 -90 86 -7 90 38 35 54 109 103 213
7739 213 -134 192 -61 -74 111 71 -30 -16 -193 152 -214 38 127 -167 -184 43 -113 -99 -207 -39 119 269
7761 269 -125 -18 -5 64 -81 25 108 -101 -227 65 42 -178 -46 -176 67 19 202 44 -48 -13 257 -89
7783 -89 41 -227 54 -10 84 197 -72 -80 -52 -39 21 314 -23 -231 87 -158 228 -108 -81 317 -51 -131 -63 -248
7807 -248 68 47 -18 199 99 20 -207 -92 -21 -29 -24 -6 58 -200 8 -112 -2 -24 192 75 -40 -42 312 -77
7831 -77 47 -3 -16 105 -7 -92 86 20 24 -125 -44 -31 224 -246 228 114 40 -91 -7 95 141 -175 121 24
7855B4q3M00k47O7J44n36K88j60Q4M9k57K91m6j35K68jj80Q2r6J88k4p9J14l4
7879A21Oj63q3n0L41l96L47k59K36O6l41K75j75J54J11l75K50J19l87JqJ44j31
7902a97L29L1j21n9M4K78j41k87L08j32M2j62k18K95J83k59L7j61L80k53M5o0
7924g8j06L00k10j72M40m16K65n0p2J05j92K27K78l25n9K60k97K30q3k51L49j80
7946c7k7J30k41K82r8j12R9J89l37lM1J70J18k88N5k04L06n9K1K7J50J8l14j17
7970b31Q3J54k32L50k03lj32K11J38N6Mk43O7k95L17J38j80K11k68p8L28k11j4
7993c3J14k10J16m2k8K2Q9o2J63J29k42J99n7m4m12J85J64M1j98L99k91J34lq
8017A25k22r6J10K8j0l1K41N3j31k38K45l5k02J23N4l22P06m51Q5j60j09K63j61
$$ plain form
7855 24 -59 341 94 161 305 -231 57 -103 -19 30 -227 64 18 -117 151 150 -30 52 -44 144 120 41 155 121
7879 121 127 -36 -119 -169 172 -224 123 -136 100 166 -175 100 -75 79 190 -185 65 184 -203 -202 -210 -66 -197
7902 -197 132 163 42 -17 27 305 164 -123 185 53 95 -67 -285 10 193 -66 -29 -190 190 -63 -18 -78
7924 -78 -184 116 -94 -266 174 -242 23 -27 -99 6 -186 41 319 -6 -65 195 -102 128 45 -206 143 -37
7946 -37 -64 66 -175 107 9 -103 -4 185 -152 -155 -114 56 174 -114 -59 -263 43 -16 5 32 182 200 -114 -231
7970 -231 -148 6 -226 124 -79 -82 -214 -3 135 191 195 -48 19 -276 41 179 -1 210 -58 -136 192 -19 -33
7993 -33 81 -129 -13 -55 -83 -61 28 -34 129 258 16 215 158 114 -298 -113 51 92 -106 293 2 136 133 125
8017 125 -97 -193 -83 -55 -65 -96 145 198 67 -171 74 39 -163 -40 14 -308 398 -53 32 -128 -237 26 -135
8040a35j5J80j45J77j5mJ61j9j90j2J40j33p5L7pQ2k55M13n5o2J00n02K94K48
8064B08k29O6k38K30J00k26J70L3l87K27O4r8L94l52M5pK26j20k85J03J67j44
8086e3P2K7nJ17J63k05j20j66K27k26K97N0r5k13J17J58j63j7j00K86j63l5L59
8109C12j95k00j45l7L89Kq5k95M72m12K49j71j38L11k40L92r2n7k9lK38m60K86
8132I2K65r7m32K01o7j34N45m96J37n0L59j30k97O2N9k43L36qk68L72k73k1K64
8155A76l13J63R1k26J05j72J7K54k69j9L19k92L01j64K5J81k53M8J98j36K5j7
8177D2j79R1J6K84m15N6O5N3O1m0p8q4J35l24
$$ plain form
8040 -135 -150 30 -115 62 47 43 204 185 -5 -17 123 -10 -85 -48 -55 27 -228 185 130 68 168 -334 -40 208
8064 208 -21 45 -193 37 137 -89 81 114 -273 -46 18 -80 314 -38 7 0 226 106 -179 -76 91 -53
8086 -53 19 46 41 158 321 116 -4 -170 57 -169 128 178 83 -130 -13 145 -18 -35 -135 151 -12 -47 312
8109 312 117 -83 -228 -265 124 126 41 -254 218 -194 55 -116 -254 57 -183 209 117 60 31 28 266 -194 92
8132 92 357 260 -172 29 -38 -172 373 -123 14 -36 323 193 -104 -42 17 -226 110 102 -166 206 -67 -88 176
8155 176 -137 26 117 -109 -4 -176 -159 95 -174 -193 126 -166 135 -29 -4 177 -76 -28 170 34 59 42
8177 42 -137 -46 -30 254 -161 -105 -40 13 74 34 -44 -128 7 -317
8191c17
$$ Imaginary data points
##PAGE= N=2
##DATA TABLE= (X++(I..I)), XYDATA
0@%%%%Qj6J6j6J6k4L2m0N1n9P2q8J10j34J58j82K11k50K93l39L87m41N02n70O47
29C44p33Q26r26J035j159J297j444J606j784J978k192K428k689K976l293L648
45A918m048M498n007N591o269P067q025R196j0663J2565j5138J8825k4570L4779
59B0719n8047J91888M5129l62879L24503o5981j99065J76014j42178j18019K90922
70A03006j26971j25279K40394k8348o8746J43686j61844k4680K39329k34925j57846
81b02224L24325j15868j64621K39288j12296m9729K51714k18238o9602K80605
91A63354j60437q1545J51429j31568O0494J00102k41353P8131K00486k16972k3541
102a01420J81650j11110R721J22861j72551L7158J92996k14397n5528J89267j25125
$$ plain form
0 0 0 0 0 0 8 -8 8 -8 8 -16 16 -24 27 -32 40 -48 62 -72 86 -96 115 -135 158 -181 206 -235 267 -303 344
29 344 -389 437 -489 546 -613 684 -760 846 -938 1040 -1152 1276 -1413 1563 -1730 1918
45 1918 -2130 2368 -2639 2952 -3317 3750 -4275 4921 -5742 6823 -8315 10510 -14060 20719
59 20719 -37328 154560 199689 -163190 161313 95332 -103733 72281 -69897 -187916 103006
70 103006 -23965 -149244 91150 62802 -5944 137742 -24102 -48782 190547 -44378 -202224
81 -202224 122101 6233 -158388 80900 -31396 -81125 170589 -47649 -117251 163354
91 163354 2917 -78628 72801 -58767 1727 101829 -139524 -61393 139093 -77879 -101420
102 -101420 80230 -30880 -21159 101702 -70849 -33691 159305 -55092 -110620 78647 -46478
113d6478o543Q5740j52338J39918J11571k45557J07294J42908j93019N4383M0498
124C8377j51911J31114L6781j96801J11905J30981j36287J5921P3819p0142O2723
135D6480P15j57784J17879P2213j89585P5864P5069j12767J20664j2075j44358
146a07685J92324R729j90819J15929L2896r8088O5777m6773n1277J30165l9909
157A2269j00872J10398L3180p2496N1402j6250m8817J09160o0191j28676J45220
168C4327M712j27610R5923o020l8713J18035q3767n2484J48479o2476p7943P3791
180B6254l8956k377M9784q6782Q258J10469o1011n9149Q6335l793m0480M5175
192C3727n0400j2020J02724q2718n8470J16037m1914l8609N6938o6897L6159P2825
$$ plain form
113 -46478 -53021 32719 -119619 20299 131870 -113687 -6393 136515 -56504 -2121 38377
124 38377 -113534 17580 54361 -142440 -30535 100446 -35841 -19920 53899 -16243 46480
135 46480 47195 -110589 7290 79503 -110082 -34218 40851 -71916 48748 36673 -107685
146 -107685 84639 94368 -96451 19478 52374 -45714 20063 -26710 -77987 52178 12269
157 12269 -88603 21795 54975 -17521 33881 17631 -31186 77974 17783 -110893 34327
168 34327 39039 -88571 7352 1332 -37381 80654 -3113 -55597 92882 30406 -47537 26254
180 26254 -12702 -15079 34705 -52077 -43819 66650 5639 -53510 32825 29032 -11448 33727
192 33727 -16673 -28693 74031 -8687 -67157 48880 6966 -31643 25295 -41602 -5443 67382
204F7382j13015J9606R4637o7695p439K8656m2971L2346J3629p7254K1718P0117
216C9717m7232k3208N5618j3811M850K4142p2835K6378O1964r8573O65O5107n0791
229b8009L1167J7240n8670P3835J8442q5424L2934K2768l9487Q857j2678j3409
241c2434M6106P40m4716L2250M1604m1129o426J8277l0525K7195j135o4902N6453
254A358K8723o3793L4571J2169k3925M3656l4510k9909O1969k0111l8132K7648
266b86j38k034R479k0096j444L3351p732l6192K4966K1051k9758J1965k771j7180
280a6819M3346k5597l8540N5696j1273k7433L1162k2233R352L0944m3138L871
292a0662L3123k1733q271M314l305Q363O24j3295J125K6096p358k5161K5258P43
$$ plain form
204 67382 -45633 -26027 68610 915 -6524 22132 -20839 11507 25136 -52118 -30400 39717
216 39717 -7515 -30723 24895 11084 15934 40076 -32759 -6381 55583 -42990 -42325 22782 -28009
229 -28009 3158 20398 -38272 35563 54005 -31419 1515 24283 -15204 -6347 -19025 -32434
241 -32434 13672 14412 -30304 1946 43550 2421 -4005 14272 -16253 10942 9807 -55095 1358
254 1358 30081 -33712 859 13028 -10897 32759 -1751 -31660 30309 10198 -27934 -286
266 -286 -424 -2458 7021 -13075 -14519 18832 11100 -25092 -126 20925 -8833 3132 361 -16819
280 -16819 26527 930 -37610 18086 6813 -20620 10542 -11691 -2339 28605 -14533 -10662
292 -10662 22461 728 -7543 -3229 -6534 1829 2453 -10842 -9717 16379 9021 -16140 9118 9861
306I861j7196J7953k2899p37L5820l6035l817L3985k1685P735O990k3941K5702
319A1736J842k8250J2680O431o684j030l077N403L917L084q242l126K1535j2904
333C315j3282J8969j3584K079J0862k7007J8383J4485k8162J6484N451j2828J7105
346A2270j2361o984J7502j1300m691M095j857N003n075J463L712j139Q018j1097
360b441M65J4682j8203K738Q595j6912J4362j175j4759K0948o566p741J5841j2232
374b398L213O960j4131P935j92o250N930n242M872R95o591J1032o716j497Q789
389F709j2014P381K424j3674J4369l963q074J3564j0946K485Q552j4640Q469L433
403D075q080Q399o914K302P903j2462M856J925n524P172j0471K408J0986j1384
$$ plain form
306 9861 -7335 10618 -12281 -13018 22802 -13233 -17050 16935 -4750 2985 9975 -13966 11736
319 11736 13578 -14672 -1992 4439 -2245 -3275 -6352 -949 2968 6052 -2190 -5316 16219 3315
333 3315 -9967 9002 -4582 -2503 8359 -18648 -265 14220 -13942 2542 7993 -4835 12270
346 12270 -91 -7075 10427 -873 -5564 -1469 -3326 1677 -3398 -1935 1777 638 8656 -2441
360 -2441 -1976 12706 -5497 -2759 5836 -11076 3286 2111 -12648 8300 1734 -6007 9834 -2398
374 -2398 815 7775 -6356 1579 1387 -4863 1067 -4175 697 1692 -4899 6133 -583 -2080 6709
389 6709 -5305 2076 4500 -9174 5195 1232 -6842 6722 -4224 -1739 6813 -7827 642 4075
403 4075 -4005 4394 -2520 -218 7685 -4777 79 2004 -3520 3652 -6819 -4411 6575 -4809
417d809N080K217m745J2067j0433n032J2856r009J07o12o408J4422o106p005J1915
432D505l688M355j712j0829J4479l433j0828P233o146P542L345j6136J2882O166
446G735r014M036o581N498O930j6269L479N503j393L587j1223O401J1939j2758
460b130J383r82R8J1745j7147k023J8012q797j97o19m981J7039r203j3504J2893
475A587j69k44l446o483J5457J432j0501J224K43R156o834j5702J4057L044n083
490b262K644q345J5734P478k2508O777O215o498K158j4388L435J9016j1562m168
504f274Q884N436N440j3951m685J0944m714o574r240O283J8035j2497l586J4241
518G742o39O716j1772j3739K1154o066j8306P438J137J0348J693j5930J4389J2151
$$ plain form
417 -4809 271 2488 -2257 9810 -623 -5655 7201 -1808 -1701 -2313 -8721 5701 -405 -7410 4505
432 4505 817 5172 3460 -7369 7110 3677 -7151 82 -6064 1478 4823 -11313 1569 7735
446 7735 -1279 2757 -3824 1674 8604 -7665 -4186 1317 -76 3511 -7712 -1311 10628 -2130
460 -2130 -747 -1729 -1631 10114 -7033 -9056 8956 159 -38 -657 -5638 11401 2198 -11306 1587
475 1587 1418 1174 -2272 -8755 6702 8134 -2367 -1143 -900 8256 1422 -14280 -223 2821 -2262
490 -2262 382 -7963 7771 15249 -7259 -482 5733 -765 1393 -12995 -9560 9456 -2106 -6274
504 -6274 2610 8046 13486 -465 -5150 5794 1080 -5494 -14734 -8451 9584 -2913 -6499 7742
518 7742 7103 13819 2047 -11692 9462 3396 -14910 -7472 -6335 4013 5706 -10224 4165 16316
532A6316j1300p208l736R292J153j6210J990R058P226j935j5226J4717J2039j7911
546a735k057p00M377J0547k2059m87K3591p742n311j368o33J6537j0463j5930
560a3433J2893P185k066j0248k571J7014j787j1879k555M184J4220j1574j4497
573a5114K0139M289o431j371j0206J6516M526k7046N284J2030k687N40j1131Q848
587a814J9047j2663r850O063P851q08j8183j60J2802r60m479r663J0590J9701
601A7474j7676o840J3757m31L542j3725j0528K3762m199j9390O892N022Q797k937
615C520j5247J4286J2936r348j0417p19J4186l484j8201K725P658P220m573j5466
629a4924J9212J3555j8044j200J77M896P116k3728j640K2883n893o787n33N497
$$ plain form
532 16316 5016 -2192 -5928 3364 4517 -11693 -9703 -645 6581 4646 -10580 4137 16176 -1735
546 -1735 -3792 -4492 -115 10432 -11627 -12114 11477 3735 -1576 -2944 -3577 12960 2497 -13433
560 -13433 -540 6645 4579 -5669 -8240 8774 6987 -4892 -7447 -3263 10957 -617 -15114
573 -15114 5025 9314 2883 1512 -8694 7822 12348 -14698 -9414 2616 -71 469 -10662 -1814
587 -1814 17233 4570 -5280 783 8634 7826 -10357 -10517 2285 1325 -3154 -12817 -2227 17474
601 17474 -202 -7042 6715 6284 9826 -3899 -14427 9335 5136 -14254 -7362 -2340 6457 3520
615 3520 -11727 2559 15495 6147 -4270 -4989 9197 5713 -12488 -9763 -2105 5115 542 -14924
629 -14924 4288 17843 -201 -1401 -1224 3672 10788 -12940 -14580 8303 2410 -4377 -4910 587
643E87J4757j1263j4343R206P568l043j4843O46J9856l289r263j64M632J3532
657A4576j4064j6327J8373L046p863j269n835J8149N360k3891M215J1723k370
670C823o261j1520J0647J5103j0710o218O469J1111j123k0231J60J1250m281n488
684g269r244J3206K0813j5621m847J5053o4j660j5708j0222J8181n334j5329O362
698a1683R475J3162k595j1407J3232Q496j1314j4440l640J3645n146j5472Q253
711i434R043P630j607j3388J5734R857j7978l220l23N770N751k0548R00K0126
725H313n275p873k014O699J1134j0823p830J0065O821p61j4101r12J5828p561
739A710j0640n89M175J3994j0454j0509K0771L369p630k423o744J1469K71k0779
$$ plain form
643 587 15344 4081 -10262 -1056 6512 3469 -11374 -10728 9128 5839 -3424 -3588 1044 14576
657 14576 512 -15815 2558 5604 -2259 -3528 -9363 8786 14146 -9745 -5530 6193 3823
670 3823 -2438 -13958 -3311 11792 1082 -5136 1333 12444 11321 -8910 -8750 2500 -1781 -7269
684 -7269 -16513 -3307 17506 1885 -2962 12091 12027 10367 -5341 -15563 2618 -2716 -18045 -11683
698 -11683 -2208 10954 8359 -3048 10184 18680 7366 -7074 -10714 2931 -2215 -17687 -9434
711 -9434 -391 7239 5632 -7756 7978 17835 -143 -3363 -3686 2084 7835 -12713 -11813 8313
725 8313 3038 -4835 -6849 -150 10984 161 -7669 2396 9217 8456 -5645 -6557 9271 1710
739 1710 -8930 -9519 -5344 8650 -1804 -12313 8458 11827 4197 1774 -4970 6499 6770 -14009
753a4009L177J1286J617l619p473J3389J0736j1576o458J821P864k288j7888M765
767h656J1796l171o91o034P940J5383j5865o891J0742k39j064j0844l908J7447
781E945l460j0580M034N679Q269p307r325J1505L690n858p745k760J3407l758
795A736j3468O955N248M544j763j0715J3016Q023j3887k045J3L535L074j6339
809a2073K261J4566l116l509j534P022Q994j1176n703N593J673k64j1564J17J4741
824F028n035n476K156K633R930r574r486J3497L56o150j074l336J0612J68j3033
839g784M410N523Q54l785p496J0252N889q542j126J297O227N0j4249M597P100
854C217n122L06m746N370J1503j1071k519P988j474P8q411k566J1597m607n782
$$ plain form
753 -14009 -10832 454 2071 -1548 -9021 4368 15104 3528 -2930 -1109 6755 4467 -13421 -8656
767 -8656 3140 -31 -722 -6756 1184 16567 702 -6189 4553 4314 3250 -7594 -11502 5945
781 5945 2485 -8095 -4061 1618 9887 2580 -6745 4760 8450 2592 -5153 -7913 5494 1736
795 1736 -11732 -4777 471 5015 3252 -7463 5553 13576 -311 -2356 -2343 1192 4266 -12073
809 -12073 -9812 4754 1638 -1871 -3405 3617 12611 1435 -4268 1325 2998 2734 -8830 -8713 6028
824 6028 993 -4483 -2327 306 10236 662 -8824 4673 5029 -1121 -2195 -5531 5081 5249 -7784
839 -7784 -3374 2149 3003 -782 -8278 1974 7863 -679 -1805 -508 5719 5769 -8480 -3883 3217
854 3217 -1905 -1599 -6345 -975 10528 -543 -3062 4926 3452 3530 -4881 -7447 4150 -457 -6239
869f239L588L352O780n746n626Q766p18l351m188l755J0891k967q714P320K508
884A901K041j64q766Q756L381j0836J244j21K432L069r593L486P956l348m12l542
900b516L718O029r376j231M482n67K175p397L43R744o083j864K732j301P190n131
916I47n912R229j811l109k12l669P195j327p325N563J682Q01j82n587P032J187
932D502o409J796k374K972J987q981N232M037l961L515m122K225O279q865M3M121
948A997l157K342m008r60P505m383o97K003j126M894m561k994O248k932m67r4
964c90l637O693k288m841O539k208R21J840n840N769O22n880L228k295Q12K764
980A809o269L894K878l368L031k514J296L739o411J876J018l715L605l572l91
$$ plain form
869 -6239 -2651 701 7481 1735 -3891 4875 4157 806 -3382 -7137 3754 787 -7927 -607 1901
884 1901 3942 3778 -4988 3768 7149 -3687 -2443 -2564 -132 2937 -6656 -3170 4786 1438 1026 -2516
900 -2516 1202 7231 -2145 -3376 1106 539 2714 -4683 -4340 5404 -679 -2543 189 -1112 6078 947
916 947 -4965 4264 2453 -656 -868 -4537 2658 1331 -5994 -431 1251 2052 1870 -3717 3315 4502
932 4502 -1907 -111 -2485 487 2474 -6507 -1275 2762 -1199 2316 -1806 419 6698 -2167 -2124 1997
948 1997 -1160 1182 -2826 -3786 3719 -664 -1361 642 -484 4410 -151 -3145 3103 171 -296 -390
964 -390 -4027 2666 378 -4463 2076 -132 789 2629 -3211 2558 3180 -2700 528 -1767 -955 1809
980 1809 -4460 -566 2312 -1056 1975 -539 757 4496 -1915 -39 979 -2736 869 -2703 -3094
995c094N828m772K080K369l324N127l322k852M667m264k24J930l787M522j105
1010b21j849M961k622J070J804n323M071j308l592M301l812J029L240m541M457
1025A665J15l546M975l226r02L452n154K798R94m164M542j830r94L627m549K554
1041C57J491m276M162j871n45L416m881K268K256n036L315j405j228M565m853
1056b265J136M057m110L450j708k107M914m267j336K846l217L514j377k321O161
1071C370k543o78K202l746L719j754m757M874j463p37K731m430N250J289n362
1086b035L777j186m38J609n799L157L063m920K882q23J164L845n853Q72L288l690
1102a087J524l020n19O330m817l58M142j574K871l433l134O484l563k615J746
$$ plain form
995 -3094 2734 -2038 42 2411 -913 4214 892 -1960 2707 -1557 -1781 149 -3638 884 -221
1010 -221 -2070 2891 269 1339 3143 -2180 1891 583 -3009 1292 -2520 -1491 1749 -2792 1665
1025 1665 1780 -1766 3209 -17 -919 2533 -2621 177 1171 -2993 1549 -281 -1275 2352 -2197 357
1041 357 1848 -2428 1734 -137 -682 2734 -2147 121 2377 -2659 656 -749 -1977 2588 -2265
1056 -2265 -1129 2928 -1182 2268 560 -1547 3367 -900 -2236 610 -2607 907 -470 -2791 3370
1071 3370 827 149 2351 -1395 2324 570 -4187 687 -776 -1513 1218 -3212 2038 3327 -2035
1086 -2035 1742 556 118 1727 -4072 -915 2148 -2772 110 -713 451 4296 -1557 -685 2603 -1087
1102 -1087 437 -2583 -3102 3228 -1589 -1947 2195 621 3492 59 -3075 3409 -154 -2769 -1023
1117a023j982N262j546m031O559q68j041K09n027N281p5o879L748J007J036J778
1133B408n591M932L211n637Q05j794J163L014p162J771N138j985J403k850J056
1148a18N936o799k079L213j278K689m214j255Q169k621k293J278j338M419l512
1163A97n543N884J15r69k51k949P282J74p111L482L65L44m19o208N385L893n268
1180a597J121p4K723K398q004J235M691k716k82l331K370O884o365j066M020p37
1196A270J923n771j910P670k911l049J557J89N761l887n204O697j02k000j562
1211a329k967P009j94o941L674J843J136n31o528N724L354o112J97o41L725K854
1227D273q379K253N326k376m49m019K645N815o839j624L797M30K170n438r66Q380
$$ plain form
1117 -1023 -3005 2257 711 -3320 3239 2371 1330 1539 -3488 1793 1718 -5161 -1413 -406 630 2408
1133 2408 -3183 1749 4960 -677 128 -1666 -503 2511 -4651 -2880 2258 273 1676 -1174 -118
1148 -118 5818 -981 -3060 153 -1125 1564 -2650 -3905 4264 1643 -650 628 -710 3709 197
1163 197 -5346 538 653 -316 -567 -3516 3766 3940 -3171 311 676 1020 601 -5607 -222 3671 -1597
1180 -1597 -476 -550 2173 4571 -3433 -2198 2493 -223 -505 -3836 -1466 5418 -947 -2013 2007 1270
1196 1270 3193 -2578 -4488 3182 271 -2778 -1221 -1032 4729 842 -4362 2335 2233 233 -1329
1211 -1329 -4296 2713 2519 -4422 -748 1095 2231 1700 -4828 896 4250 -1862 -1665 -2306 1419 4273
1227 4273 -4106 -1853 3473 1097 648 -3371 -726 5089 -1750 -3374 423 853 3023 -2415 -3381 4999
1243D999l419l310J61N99N166m701n190P158M60j600j692k055P787r47p041L398
1259b27J039J394j370p096O389L560n568M11j04M556K003q318K165M946l273j275
1275g68l934K956O036o487q63M443J121J968o175r76P354m208l745m6R96O018
1291C690m190l963P626L61j337k531k923O584j471p156L134J787K363q53n441
1306d320O648K896n667p87j006L861J015q227L548N195j691p15l429K919M945
1321E185p376j867L613J068J717n278M24Q024l103l507j74N46M535n843l972O909
1337I01N64o81j473j460P372j685o907K609M57J820k216n597P158K856m440N39
1353a83j90L711Q32q506K406L690j947o92l082L724N506o507q45L205L43J373
$$ plain form
1243 4999 1580 -1730 -1569 -970 4196 -505 -5695 1463 1923 323 -1369 -3424 4363 3416 -3625 -227
1259 -227 812 2206 836 -6260 129 3689 -1879 -1468 -1572 2984 4987 -3331 -1166 3780 507 -768
1275 -768 -4702 -1746 4290 -2197 -3060 1383 2504 4472 -1703 -2679 4675 467 -3278 -3324 -2328 3690
1291 3690 -500 -4463 3163 3524 2187 -344 -3267 3317 1846 -5310 -2176 -389 1974 1121 -4320
1306 -4320 2328 5224 -443 -1230 -2236 1625 2640 -5587 -2039 3156 1465 750 -2679 240 5185
1321 5185 -2191 -4058 -445 623 2340 -2938 -2514 5510 2407 -1100 -1274 -728 3807 -2036 -6008 901
1337 901 1465 784 -689 -2149 5223 3538 -3369 -760 -303 1517 -699 -6296 862 3718 -722 -183
1353 -183 -373 3338 4170 -4336 -1930 1760 -187 -879 -3961 -237 5269 -1238 -2083 1122 1465 2838
1369B838o569M31P248l588k340P34J315M735n501l568O145q36j109j901j442P238
1385C830j346n685L261J339J068k221n562O008K035m770L06p0M526Q69o978L302
1401h8L294k710m75l957L164M820o572q0L375O57J617n180K29O161l713k115m5
1418a618M89M901m844k775N641l25m53k062j560O721k146n077L012K95J438j598
1434C9m838N683J326l832J033n33L690P39o492K895K709k331m8m069L347L910
1450C228n692N16K654N43K026n135N49N230l829j819j87P03L961m140k191N698
1466B115m77m50j688j095N302k500m439K983n7J947j816l721N476O68l474R51
1482b75j371L514O77n965L314K063j702K10l209K305L275n212Q26K176n21K309
$$ plain form
1369 2838 -3731 -3300 3948 360 -1980 -1246 69 4804 -697 -4265 1880 1044 -65 -1966 -3408 3830
1385 3830 2484 -3201 60 1399 2467 246 -5316 692 2727 -2043 -1737 -1807 2719 3588 -3390 -88
1401 -88 3206 496 21 -3936 -772 4048 -2524 -2604 771 1428 3045 -2135 -1906 4255 542 -1573 -1618
1418 -1618 -1129 3772 -1072 -3847 1794 1469 1016 -1046 -2606 4115 1969 -3108 -96 199 1637 39
1434 39 -4799 884 2210 -1622 -589 -1122 2568 3307 -3185 -290 2419 88 40 -4029 -682 3228
1450 3228 -2464 -1948 706 1249 3275 -1860 -1311 3919 90 -1729 -1916 -1213 2748 -1392 -3583 2115
1466 2115 1638 1188 -500 -1595 3707 1207 -3232 -249 -306 1641 -175 -3896 1580 2248 -1226 -275
1482 -275 -1646 1868 2545 -3420 -106 1957 255 465 -2744 -439 2836 -2376 -1550 626 105 2414
1498B414m271O24N161l414j049r9m20L456l915j787M867j054L37j291j176N046
1514C429k335l258K541j007J586j330l685N384K90k553J240j121K824L57n316
1529b954L188J046j693P08l057K794K829m488J275J223m71J954m106Q79L918l806
1545g61K68l61j99L252l328q92L801j798P64q16j605M562k290k316K439j544J606
1562G82q71l168M593j15k196J875j600K159N38m330K839L69j606R91k719K338
1578a21K299l926J749O53n82K261l811R06L010l661P54n7q72L087k786l40L322
1595A885k550J579n93j715L843k429j562K519j925J374l58k647L667n62j459J811
1611H78j708J841M80l209K467n13j122J958k839J427J859l336K135K06j005K522
$$ plain form
1498 2414 -1857 -1233 3928 514 -535 -634 -1054 2402 -1513 -3300 1567 513 850 -441 -1617 3429
1514 3429 1094 -2164 377 -630 956 -374 -4059 1325 1615 -938 302 -819 2005 2362 -2954
1529 -2954 234 1280 -413 295 -2762 32 2861 -1627 -352 871 400 2354 -1752 -873 3045 -761
1545 -761 -493 -854 -1053 2199 -1129 -2021 1780 -18 746 -70 -1675 2887 597 -1719 720 -824 782
1562 782 -89 -3257 1336 1221 -975 900 -700 1459 1997 -2333 506 875 -731 260 -2459 -121
1578 -121 2178 -1748 1 654 72 2333 -1478 -572 2438 -1223 -469 -526 -1398 1689 -1097 -1437 1885
1595 1885 -665 914 321 -1394 2449 20 -1542 977 -948 426 68 -2579 1088 526 -933 878
1611 878 -830 1011 1491 -1718 749 236 -886 1072 -1767 -340 1519 -1817 318 524 -481 2041
1627B041k999P10J923k869J489n95j382L042k482N7K642k538J699J75j867K969
1643B015k460m33J832k404J514J04k169L344j156o98K530k639J481M61k835K304
1659G91r76j234K382k604J658J087k517K708p53j279K257k157N00J344l083K586
1675G10m36j777K603j936N65J535k627K239J67k155K464j834J75J977l184J340
1691a74O99j902K486j897P5K633k612J110O73j920K019j697j147K760k564R32
1707e26Q55j787K996p93j445K649j935L27L68k842K773r12j509K236j417J470
1723E08J112k740K291N30k001J398k198N91J522l284J444J312j225K127k081O86
1739hK644l336Q30M73j734J996k291l38L180k183Q02O19j412L196j870j831K505
$$ plain form
1627 2041 -958 -248 1675 -1194 295 -300 -1682 1360 -1122 -1065 1577 -961 738 913 -954 2015
1643 2015 -445 -878 954 -1450 64 168 -2001 1343 187 -511 2019 -620 861 1322 -1513 791
1659 791 -185 -1419 963 -1641 17 1104 -1413 1295 542 -737 1520 -637 -137 1207 -1876 710
1675 710 274 -1503 1100 -836 -271 1264 -1363 876 1043 -1112 1352 -482 -307 1670 -1514 -174
1691 -174 525 -1377 1109 -788 -713 1920 -692 418 1091 -829 1190 -507 -1654 1106 -1458 -526
1707 -526 329 -1458 1538 745 -700 1949 14 341 709 -2133 640 -272 -1781 455 -962 508
1723 508 1620 -1120 1171 1701 -300 1098 -1100 -509 1013 -2271 -827 485 -740 1387 -694 -8
1739 -8 2636 -700 130 603 -1131 865 -1426 -1764 1416 -767 35 654 -758 2438 568 -1263 1242
1756A242j557K91j88k031L313n96k264K549r65J083P26l535K909M54j902R46j713
1773a238J378J305l623J545J432j111J294j986R94K488l051K23J035j043J761
1788A403k940m63L514k273L15J18m99L372k049j824L075j462K33o87k214L528
1804A147j149k183J922k67J888J21l055L283M13k753Q42j852J607R49l614J954
1820g47J510p50J289k393J270K662l559J35N96j92J563l142%L785k419J71k27
1837d48l09L019k087j939L024r03K81q98j820L738j156k294J875p57J605r4l082
1854b245L351M47j877M84j241J989O35m083K018J259q93R83k658J839K742l516
1870g66J37O74J36J431l307N5L639k066j90n52J26L091k667j870L111p26j3j150
$$ plain form
1756 1242 -315 -24 -212 -2243 1070 474 -1790 759 -206 877 1603 -1932 977 1431 -471 475 -1238
1773 -1238 140 1445 -2178 -633 799 -312 982 -1004 -10 2478 -573 -350 685 -358 1403
1788 1403 -1537 -2000 1514 -759 -444 -326 -825 2547 498 -1326 1749 287 520 -167 -2381 1147
1804 1147 -2 -2185 -263 -530 1358 1479 -1576 1707 2120 -633 209 -1643 -36 913 -2701 -747
1820 -747 763 13 1302 -1091 179 2841 -718 -583 13 -179 1384 -1758 -1758 2027 -392 -221 -448
1837 -448 -757 2262 175 -1764 1260 357 638 -260 -2080 1658 502 -1792 83 -674 931 837 -2245
1854 -2245 1106 1553 -324 160 -1081 908 1543 -2540 -522 737 -156 827 -1831 8 2750 -766
1870 -766 -629 45 181 1612 -1695 -1640 1999 -67 -257 -809 -683 2408 -259 -2129 982 256 243 -907
1888i07j374L916q71k509J738NJ804j043k784K889P57k409R6q52K108P83l827
1905b480J983J684n53L81k574J815K599l695j34N68J37J648l637M48L523j554
1921A59j81l04M20K899l069j619K509o15J30j369j431M330j136k359J707J7K047
1938B135j244l023L437J36j617K4j322K543K16l734J851J298l73K98k332K187
1954D80J948l019j93J013J06J099l352N34L095j997l55k96L91L099k788j241K526
1971A050m33M34k004q00L563j147k536J825q7J827j431k716L351M30j892J36j241
1988a671K986J10l422K399N54k80j50k449K059J609l337P25L03Q83J314l238Q29
2005g76L063j732m39n96J57K539l072j212K573o92M51j347k73L507j530j959J440
$$ plain form
1888 -907 -2281 1635 764 -1745 -7 -2 1802 759 -2025 864 1621 -788 -692 -1544 564 1347 -2480
1905 -2480 -497 1187 634 1015 -1559 256 2855 -840 -974 -406 -269 1379 -2258 -1810 1713 159
1921 159 -22 -326 94 2993 -76 -1695 814 199 329 -1040 -2471 1859 723 -1636 71 88 2135
1938 2135 891 -2132 1305 1441 -176 -152 -1474 1069 1285 -2449 -598 700 327 625 -1707 480
1954 480 2428 -591 -784 229 335 1434 -1918 -1384 1711 -286 -641 -937 -546 2553 -235 -1476 1050
1971 1050 617 1051 -953 -1753 1810 663 -1873 -48 -135 1692 261 -2455 896 1326 -566 -430 -1671
1988 -1671 1315 1425 -1997 402 956 676 526 -1923 136 1745 -1592 -867 -564 319 1633 -1605 -776
2005 -776 2287 555 116 -480 -323 2216 -856 -2068 505 -187 264 -1083 -1356 2151 621 -1338 102
2022A02R1J379j208k657L394j52j688K5q27K568K5l112K286J032m54j01k250K092
2040E45J312l164K48O71M62Q15k876J011K833j685j81m57N66K375l087q02K257
2057H43p80M04j612o43L801j630j600J514l20J494j068k474K981Q4j621K28n63
2074i62K149k10k922K339K96k07J72k174J851J211k880Q74L10O18N59k584R85
2091e75K160j642l9o62O91J940k668m92K063q56M84j299m10L064j774q72J144
2108B57N2J215j271k329L267o32j228K98q49K160k67k450K062M03j05L0j885J836
2126E64Q51k392M57j76O83P82k609J236K087j870O96n56J07K116k388n66J599
2143F21p85Q03j739j99K779j731o66J101l85J414j089j628K903q22j083M58j324
$$ plain form
2022 102 193 1572 364 -2293 1101 949 -739 -714 -1541 1027 1052 -2060 226 1258 804 703 -1547 545
2040 545 1857 -1307 -1059 -388 74 889 -1987 -976 1857 172 -9 -466 100 2475 -612 -1414 843
2057 843 63 467 -1145 -1788 2013 383 -1217 297 -23 1471 403 -2071 910 994 -627 -399 -962
2074 -962 1187 977 -1945 394 690 483 655 -1519 332 1543 -1337 -463 -153 465 1024 -1560 -575
2091 -575 1585 -57 -96 -758 -67 1873 -795 -1287 776 -80 404 -895 -1305 1759 -15 -887 257
2108 257 309 1524 253 -2076 1191 559 -669 -371 -1220 940 673 -1777 285 688 583 613 -1272 564
2126 564 1415 -977 -520 -696 -13 769 -1840 -604 1483 -387 309 -247 -140 1976 -412 -978 621
2143 621 -164 639 -1100 -1299 1480 -251 -917 184 -201 1213 124 -1504 1399 577 -506 -48 -1372
2160a372K261l31k108J764J02m4O49k048J813P17k308Q61M7K6P85k466J441J285
2178A074j426N26p23K08J797k348J38J787j024M61j160m06K463j600k69P59n54
2195b97J233r25j058K166p72o66O60j402J698k29j907J981l24k28N48j350J548
2212F76M20k278J595m19mM85j513P91Q50j267J037n93K34J482j911J82Q84j107
2230d56P98j160l26K255j524r1J170j063J427r47o91J707j045l17N88j335J322
2247C12m8j519J795o13J56P32j429J154M06j737J103m43j88R00j647R05M26r30
2265f65J226q12p9J603j820M32P83j176J000p41m25J579j588L64Q99j156J498
2282I22p22o90J519j224j03Q65j312J167l58j132J729q03n7J100j295Q47k0j182
$$ plain form
2160 -1372 889 558 -1550 214 316 272 921 -1127 686 1403 -905 -44 3 29 814 -1652 -211 1074
2178 1074 -352 174 -549 -341 1456 -892 -754 1033 9 470 -690 -1096 1367 -233 -502 257 -297
2195 -297 936 11 -1047 1119 347 -319 341 -1061 637 408 -1499 482 158 -70 478 -872 676
2212 676 1096 -1182 413 -6 -10 475 -1038 -247 603 -664 373 -220 14 1496 -415 -233 651 -456
2230 -456 342 -818 -1144 1111 -413 -504 666 -397 1030 83 -608 1099 54 -263 325 -1010 312
2247 312 264 -1255 540 -73 83 815 -614 540 946 -791 312 -131 -319 581 -1066 -161 265 -665
2265 -665 561 -251 -330 1273 -547 -115 668 -508 492 -249 -674 905 -683 -319 580 -576 922
2282 922 200 -490 1029 -195 -298 567 -745 422 64 -1068 661 -142 -199 901 -394 453 433 -749
2300g49J217p73o4O68j151Q78L60j135J405m89MQ08j321P60Q3j760J537o69l31
2319g22J132j038Q86O24j240J251m81p68J101j316K26O26j286J137l81rJ006j045
2337b97J79J071j075O52k79r74J370j233k54J313j115J042j09q45J486r59k17
2354b44Q41j225P60N9j283J554m84m43R70j177Q34N87j582J451m39n79R31j418
2372h87O57O00j488J172k49Q4J033j422L81J104j236P31l80j057J696j247j01
2389f09P88q74P24J93r37J948o73q32P20p82O23l44j520J666k88m7O42j002J406
2408H02L46j630R47m5m85M88j532O35J108j588Q07P2K2J235j284K01R02j186K62
2427G7l71o00J729j646p2J155o42J145n16p70J998r96n99M61q86R41n66j378J773
$$ plain form
2300 -749 468 -305 -369 299 -852 26 386 -749 656 167 171 979 -342 418 501 -1259 278 -391 -722
2319 -722 410 -628 258 882 -358 893 412 -356 745 -571 -345 281 -1005 132 -249 -258 748 -297
2337 -297 -118 953 -122 530 251 -723 647 -586 -840 473 -642 400 291 -554 932 -27 -244
2354 -244 597 -628 132 191 -1092 462 -22 -465 505 -672 162 749 -833 618 179 -400 531 -887
2372 -887 -230 370 -1118 54 -195 -111 922 -500 -119 985 -251 480 100 -957 739 -508 -609
2389 -609 179 -695 29 222 -715 1233 560 -272 448 -334 289 -55 -1575 91 -197 -244 398 -604 802
2408 802 1148 -482 465 420 -65 423 -1109 -474 634 -954 -147 -75 -53 1182 -102 99 1001 -185 77
2427 77 -294 -894 835 -811 -883 272 -370 775 259 -511 1487 491 -108 353 -533 408 -158 -1536 237
2446B37j66m57P98r91J451L31j612R97mn41L62j816R46P26j440P55L44J42J305
2465A367j706N98J331j543M58p76n72J459j583k35J174m45J105o16m21J955q04
2482G46q17N44q98P54o14j553J905j95l11N25p57J613K42j714J122k01l10K09
2500B90j831J381O36j386L81L91L53J095j660K91J392j060J12j273K44J632k049
2517a061l3J350n00J003o84l66J728j235o66N09p49J451q75j400J909J37k84J46
2535C80p12J436l53j824J405l90N7L4j400J364Q58j473O95R1L19P52j674J58J098
2554H21r97J40p93R6J664j633k56J207l05R76j024k16J834j123p20qj54P38r73
2573g26j127K075j67k23O23p78J636o6j705N76j03qk72j518J276Q20j226J011
$$ plain form
2446 237 71 -386 412 -579 872 1203 -409 588 584 43 405 -1411 -465 261 -1179 -424 -80 62 1367
2465 1367 -339 259 1590 47 505 -271 -843 616 -967 -1202 -28 -473 632 16 -405 1550 746
2482 746 -71 473 -425 329 -285 -1838 67 -128 -439 86 -671 942 1184 -530 592 391 81 290
2500 290 -1541 -160 476 -910 -529 -138 215 1310 -350 -59 1333 273 385 -888 -644 988 -1061
2517 -1061 -1094 256 -244 759 75 -291 1437 202 -464 45 -704 747 -128 -1528 381 518 234 380
2535 380 -332 1104 751 -1073 332 -58 -1 33 -1367 -3 855 -618 77 168 487 1239 -435 -277 821
2554 821 -176 -36 -829 -733 931 -702 -958 249 -56 920 -104 -320 1514 391 -329 -337 -491 247 -726
2573 -726 -1853 222 55 -168 455 -323 1313 1247 -458 118 15 7 -265 -1783 -507 313 -913 98
2591I8M2M58N61j734O62Q49r67k15n46K93J290j538j9J186m36Q27j196j16J665
2610A164q80m73O17n80J166j267r21J580n76J89ro52J518k05j479J049K85k14
2628C12K31j925J587O53j854P73mO72O02j718O22Q41j017Q2p93N67J354j386J70
2647b31O88j36O48j024m63J627j476o6L8R2Q11r44n12J650n6l01m4q27J435m94
2667D15j540J198j57K09j6j455J572M17j172P72m42P76L26j757P25Q51r84K27
2685c5o18J76J328j494R2R72m30R38r70l13J768j394o50K99k62R75j064n62J710
2704D66k53j5L41r65J600p72j051P14k99K11J30j052J279K23j019P16l20L79N00
2723H13j552M87R26r82M94j029O48J171j693M55O79l21N55q07j86J078q78k33
$$ plain form
2591 98 140 598 1159 -575 87 936 -31 -246 -792 -499 791 -747 -766 420 -16 811 -385 -501 1164
2610 1164 284 -189 428 -152 1014 -253 -1174 406 -170 19 10 -642 876 671 -808 241 526 312
2628 312 543 -1382 205 858 -996 -223 -227 445 1047 -671 -49 792 -225 -143 -936 -369 985 -401 -231
2647 -231 457 321 969 -55 -518 1109 -367 -433 -395 -303 508 -436 -948 702 646 345 301 -526 909 415
2667 415 -1125 73 -84 125 109 -1346 226 643 -529 243 -199 577 903 -854 -129 722 -262 -35
2685 -35 -653 -477 851 -643 -551 421 -9 929 -41 -354 1414 20 -630 -331 -593 382 -682 -1244 466
2704 466 213 198 539 -426 1174 402 -649 65 -234 -23 107 -945 334 557 -462 254 -66 313 813
2723 813 -739 -252 674 -308 186 -843 -195 976 -717 -262 417 96 651 -156 -342 736 -142 -375
2741c75N14p78J232q34o95J440l61k44M37p89J432p07j097R49l96Q3K11j063J466
2760D25n6q15O17p7O05P2j356N81M49j137N61q36N68J051j270L99Q35o20Q67r97
2780a34j08J372j275L1j05l04P96o90m70J283n86K74m1n09J473n96q89R05n93
2799a66J89M8j249J155N27r35N21j48M40M05j275Q36J27p28L30m12Q5P58j210
2818g02P90K26m81P52q95N3J225j247L06J5m74J051r02m44J345r49K96L90p24
2837c69R78l89p56J286r69L77m0j012J188m48m85R90p42P95M08j490Q67N82j144
2856c73P15r96K78P85j247P92L31m90Q24n00j64R95j256J87J51o93J061r29p8
2875f07R43o73N23M05q88J047l01q04P64q04L00K35p67Q06R7p00R75o64J46M38
$$ plain form
2741 -375 139 -639 593 -241 -936 504 143 -101 336 -453 979 272 -825 124 -272 -189 22 -1041 425
2760 425 369 -446 171 94 699 771 -585 -4 445 -692 -131 -967 -399 652 -618 -219 616 -4 863 -134
2780 -134 -242 1130 -145 -114 -219 -523 273 -417 -887 396 -190 84 43 -466 1007 411 -478 427 -166
2799 -166 23 71 -1178 -23 504 -431 90 -58 382 787 -488 348 475 -253 77 -335 -250 508 -702
2818 -702 88 314 -167 585 -310 -257 968 -279 27 42 -432 619 -283 -727 618 -331 -35 355 -369
2837 -369 609 220 -536 750 -219 158 118 -894 294 -154 -639 351 -391 404 812 -678 189 771 -373
2856 -373 342 -654 -376 409 -838 -46 285 -205 619 119 -45 950 -306 -119 32 -661 400 -529 -607
2875 -607 336 -337 186 591 -297 750 449 -355 409 -395 -95 140 -627 179 276 -424 551 -113 33 471
2895D71j003N88J36m36N38o70J68M41r80P03K58m90Q08o20Q2N05n93L73r2o46
2915d59R84p48k00P19o87L10M53p07J002l57n41Q88p36K85j99q47P82l69l41J147
2935C79n32L76K46o10P90j65j006Q85o21J2J54p41R48J41m51Q12n75J92M72r55
2955b49o1K64p49J002p23N4Q12m68O35P3o93Q61q35l23Q67q88L52J41o15Q53m15
2976a05M2P92q70J73L22p52Q77m13m27O59p82M46K40n41P04l70k52O20m63J5M10
2997C25q90P85n3r34R44l32M0M22q96O06M76q91P69j33K4K18j074K43M95n12L17
3018e1N8m80R81o67O3O46o88L72m00k89P70o76P8L94l99N70q2m61Q46o59j2M03
3040C17p38M96j79n34R12l89J41O61j109R27J16r89O11n57K0L81p56M98M74n27
$$ plain form
2895 471 -532 56 192 -244 294 -376 -208 233 -747 -44 214 -276 532 -88 -6 499 -94 279 187 -459
2915 -459 525 -223 -423 296 -391 -81 372 -335 667 310 -231 657 -79 206 7 -840 -58 -427 -768 379
2935 379 -153 223 469 -141 649 484 -522 363 -258 -246 -92 -833 115 256 -195 617 42 234 706 -249
2955 -249 -310 -46 -795 207 -516 -462 350 -118 517 590 -103 758 -77 -400 467 -421 -69 72 -543 310 -105
2976 -105 -63 729 -141 32 354 -398 479 66 -361 298 -484 -38 202 -339 365 -5 -257 363 -100 -85 325
2997 325 -565 220 167 -767 177 -155 -115 307 -589 17 493 -398 371 238 262 480 -594 -351 144 -368 -51
3018 -51 7 -473 508 -159 -96 550 -138 234 -166 -455 315 -361 -283 111 -288 282 200 -261 585 -74 -86 317
3040 317 -421 75 -104 -638 274 -115 26 687 -422 505 621 -368 243 -314 -294 87 -669 -171 303 -224
3060b24O41n02pR17r37n1N22p28M70n08l69J364q39m5M85m67P33q3o17Q28n48
3081C5k55K08p44R14l5p13P69l61J11N07p60P51N1n06M13n29R1L60j018M94P4
3102a43k94O91m85L05N93r25L59M91q16N88q71j46J006q23K91L56k91P60o78j71
3122b03Q97l31q0n8q80Q55j43r13P03j23J39O05q17P09M12j059O24o44O23r1p83
3143e58K80L19m36N18m53L41Q51q82K97K9k45M13j127K90P92n59L1J44j15Q23
3163G53n98n89J069p88K78k48n35R67k99m79O32o5N7j6p84Q29L33q45N03n07K93
3184c9K62r90Q24J67m49O83r78N49O39q03J12K21l59M25p43N5O59o16L21P4j60
3205a46R11l18m61O95o44J37m65n28N46L20n26O25m5L65K82r86P47j60m24J26
$$ plain form
3060 -224 417 -85 -92 825 -112 -163 359 -369 101 -407 -776 588 -251 -296 189 -278 455 372 -245 583 35
3081 35 -220 -12 -756 158 123 -590 179 -182 -71 436 -324 427 478 -28 385 -144 -53 307 -711 -217 -143
3102 -143 -437 254 -231 74 667 -258 101 592 -224 364 -507 -653 353 -470 -179 177 -114 646 -32 -203
3122 -203 694 363 283 225 -655 200 57 -856 -153 -276 -137 468 -349 360 772 -287 337 -307 316 225 -558
3143 -558 -278 41 -395 123 -330 11 862 -20 277 306 61 474 -653 -363 429 -130 -99 45 -70 753
3163 753 155 -434 635 -153 125 -123 -658 309 10 -469 163 98 155 139 -645 184 517 -328 175 -332 -39
3184 -39 223 -767 57 224 -225 458 -520 29 668 -135 -23 198 -161 264 -479 -424 235 -381 -60 14 -146
3205 -146 765 447 -14 681 37 174 -291 -819 -273 47 -479 146 101 466 748 -238 509 349 -75 51
3225E1o47M55L30j058R47M0r3M40o52M20M66j066O2M71k75L28p63J64R79r20P0
3246b51M05k07M18l39l13Q04n92M42l41m72O70l08n49Q40n38O17n5o53Q33j24
3266B87n45L04k20J47M62r65N55J69l33K28l46M10L58r35L11J41k95N64p93M40
3286e6M26l54K41j17j47N65n98n01Q02l13j13o6k85J089n33m10N69k25Q2L36p21
3307c29O56j55n30L99l45N22J61j070O24J9n2K07l17M37M21j020J69P8Q6J10o05
3328e34K27N55j75j08J53k0O21p81l18O05l91J29k99l20R62k40l28N66j57M62
3348F09k93m47N04l87l77M97o24O06km37L73M9O3J34o06J13P60p77K47j37j25
3369b57M27j99j18N03n27J68K56m41O71m79k59N59l48P8j6n09P61l54l44Q40n65
$$ plain form
3225 51 -596 -141 189 -869 78 118 25 465 -187 233 699 -367 -305 166 -109 219 -544 -380 599 -321 -251
3246 -251 154 -53 365 26 -287 517 -75 367 26 -446 224 -84 -633 207 -331 286 231 -422 411 287
3266 287 -258 46 -174 -27 435 -530 25 194 -139 89 -257 153 511 -424 -113 28 -267 297 -496 -56
3286 -56 370 16 257 140 -7 558 -40 -541 261 -52 -165 -231 -516 573 40 -370 199 -26 56 392 -329
3307 -329 327 172 -358 41 -304 218 379 -691 -67 -48 -100 107 -210 227 648 -372 -203 -125 -39 71 -534
3328 -534 -307 248 73 -35 118 98 719 -62 -380 225 -166 -37 -336 -656 306 66 -262 304 147 609
3348 609 316 -131 373 -14 -391 106 -518 88 86 -351 22 71 134 268 -338 -225 535 -242 5 -132 -257
3369 -257 170 -29 -147 356 -171 -3 253 -188 483 4 -255 304 -44 34 18 -491 270 -84 -428 412 -153
3390a53N23l00l58L93q7j61K00n89L33M81q02N00K71l30N13o78K61M12q42O15
3410B02k93o3L83o37K76M91n57M59j08j27N85o25j01L83o61L43j20n42J137l45
3430H0k3M53m77M61k58m97O43n17r4M09o39L26J56n11L55R5M8M29n62J51L03n84
3452b53J45J88n29L72k92L60J78l92L40N8k34O09n47j77N33l96K60l85k62N84
3472A60j91j55O03r16O71n4l92M69q5l43L84k85J80rn53Q25j29l17N37o00N39
3493C39m8l64Q4J38l37M10p35K15O75o00M75j67p0K87k87J22J96p82L92J24n17
3514d50O23m67J79M94m73L01j8k80L14k41k19K13k53M03pl76P64n42q4J51l38
3535c06K40J05k51N60o68NN52n31K58K39n05M78j21k06N12o40N3L51k34j15N10
$$ plain form
3390 -153 370 70 -288 105 18 -143 57 -532 -199 282 -520 -20 251 -79 434 -244 17 429 -413 202
3410 202 -91 -154 229 -408 -132 359 -198 261 153 26 611 -14 -115 268 -393 -50 -170 -712 425 80
3430 80 57 510 33 494 236 -261 382 -135 -229 180 -459 -133 23 -488 -133 -38 10 439 -123 28 331 -253
3452 -253 -108 80 -449 -77 -369 -9 169 -223 117 175 -59 550 3 -174 359 -37 223 -162 -424 160
3472 160 -31 -186 417 -499 172 118 -274 195 110 -233 151 -134 46 37 -516 309 180 -137 400 -200 339
3493 339 291 -73 11 149 -188 222 -513 -298 377 -223 252 85 15 302 15 137 333 -449 -57 67 -450
3514 -450 173 -294 -115 379 -94 207 189 -91 223 -18 -237 -24 -277 126 119 -257 507 -35 -119 32 -306
3535 -306 -66 39 -212 348 -320 -315 237 -294 -36 203 -302 176 55 -151 361 -279 -226 125 -109 -224 286
3556B86m17L68l46k07L43n93O87P3l03M29k53j60M60q66L97J55l95K47J38rP8
3577A12%j08K78k94J86k03l34N39m79P4K34k22M48k45J80K6j84K6L85o38J2m0
3599b47J65L50k19ON6l06M23P4n29M63m29n1M21m68J15L94n03N91m71m7L10j09
3621a1p2Q5l46O48n55J15J68j98K19K83n98M92k95k50O62n34k3L56l31L42k34
3642g7l16L65J1j15M57n30N14j55j24L58m14j69L83l16n5Qj45N83l93k7J05j71
3664b23K31K45n66M25q5j65J57l35N06k37k16M25Nl10M54m53J26K88o30N95j35
3685A02l58L35j64J76R8m21L31j71Q9J43j79j08J77m45L24r3J74M23n13k9K83
3706A74l60J86RRO9k75j66P07j44j94Q5m73O92j94k18J46k68K12J32l14J91j62
$$ plain form
3556 286 -131 237 -109 -316 27 -566 121 194 -109 320 67 -93 367 -499 -102 53 -342 -95 43 34 112
3577 112 112 4 282 -12 174 -29 -363 176 -303 -229 5 -217 231 -14 166 192 8 34 419 -219 -207 -247
3599 -247 -82 268 49 55 111 -195 228 302 -227 236 -193 -244 177 -291 -176 218 -285 306 -165 -212 98 -11
3621 -11 -83 2 -344 304 -251 -136 32 -166 53 336 -262 230 -65 -315 347 -187 -210 146 -185 157 -77
3642 -77 -393 -28 -17 -132 325 -205 309 154 30 388 -26 -195 188 -128 -183 -175 -320 263 -130 -157 -52 -223
3664 -223 8 253 -313 112 27 -138 19 -316 190 -47 -263 162 167 -143 311 -142 -16 272 -358 237 102
3685 102 -256 79 -85 91 189 -232 99 -72 17 160 -19 -127 50 -395 -71 -164 10 433 -80 -109 174
3706 174 -186 0 9 18 87 -188 -354 353 209 15 100 -373 319 125 -93 53 -215 -3 129 -185 6 -156
3728a56j23M22j16M4N6k14J84J79l76K33l80J89M52p44L86k00N2L48j11j34L38
3749C29m35J77j49o8L66l94J3rk4L61M2l46L42p2j55J36j78K72K4n79M77r4k42
3772b06L01l64L69O1m46L77o2k24K18k75Q8L54n37M49j40m1K27k90j15N53l57
3793f0J32j21j93N49n39K26J35j92J99J77o51M91j41l7K6k05J39L96n93N70k67
3814D1m64P84n48K44K18l69K37O9l44L08l69K99J10m60M30j27j45L07l05j02O15
3835D29m40q2J56k5J95p7k15J47k5N9Mm04Q36p86O3K42k48L36l49j68O61r5j84
3858C0J38k79J98J60n20K92j33K84P3n58o1P60m01m2N5N3J99l39K54n3k14J99
3880I5N2k93M63l33J75q3J19Jk28k87M43L0rj8j76m1L47m02K36Q6j47N0o03N02
$$ plain form
3728 -156 -279 143 27 71 127 -87 97 276 -100 133 -247 -58 394 -350 36 -164 -112 236 125 -9 329
3749 329 -106 71 -78 -146 220 -174 -161 -170 -194 167 209 -137 205 133 -22 114 -64 208 232 -347 130 36 -206
3772 -206 95 -269 100 161 -285 92 30 -194 24 -251 -163 191 -346 103 -37 -78 149 -141 -256 297 -60
3793 -60 72 -49 -242 307 -232 -6 129 -63 136 313 -338 153 12 -25 1 -204 -65 331 -262 308 41
3814 41 -423 361 -187 57 275 -94 143 212 -132 176 -193 106 216 -244 186 59 -86 221 -84 -186 429
3835 429 -11 -93 63 38 233 156 -59 88 63 122 126 -278 558 -228 -165 77 -171 165 -184 -352 309 214 30
3858 30 168 -111 87 247 -273 19 -114 170 243 -315 -376 384 -17 -59 -4 49 248 -91 163 110 -104 95
3880 95 147 -146 317 -16 159 76 195 196 -32 -319 124 154 145 127 -49 -90 257 -145 91 177 30 80 -523 -21
3904b1K32l48K60j39k30K57k97N1L24l18L88r6j33L78n00J35K06n14R6q4J02M50
3926A99m66J47J19J40JP5k90J31l8j43j5m6L33R5k60N28k81k35J67m35L76j53
3948e1l13M67l49J49P7k23L75J4j30N6r%J53n93L85J64k52O3J7r4J89m07M80Q7
3972B55l38N32m10J06L2p4k18K16l77M14k88j01M73j80jJ9K2J27p6o36M60Lq1
3995a21K99m60K37J97j82K46k50m0QM5LJ80l85pM44j59K37m08J45L91o70M95j11
4018A34k11L33o33N87l5l72L21q4j22K63j95M5L4P4j74P2k24K93Q1q8J1n04N26
4041A32L3m15M85k90J8J86K2j76K00l30K26k44J30L50m53K15J95j18o5q5J14K3
4063A53l98M02m7K2j9Q1m02L94l7j27J7j07O1k9l29O05o25N01j39p7m5J58M5K17
$$ plain form
3904 -21 211 -137 123 -16 -246 11 -286 -235 89 -229 159 63 -70 308 -192 -57 149 -365 -269 -353 -251 199
3926 199 -267 -120 -1 139 140 215 -75 56 18 -125 -140 -186 147 242 -18 510 229 -6 161 -274 102 -51
3948 -51 -364 103 -246 -97 -20 -243 132 146 16 72 63 63 216 -377 8 172 -80 -17 0 -94 95 -312 168 255
3972 255 -83 449 39 145 177 103 -115 101 -276 138 -150 -251 222 42 41 60 82 209 133 -503 -43 -40 -121
3995 -121 178 -282 -45 152 -30 216 -34 -74 -66 -21 -18 162 -223 -230 214 55 292 -116 29 420 -250 245 134
4018 134 -77 256 -377 210 175 -197 124 40 -82 181 -14 31 65 139 -35 37 -187 106 187 99 110 -394 132
4041 132 165 -250 235 -55 -37 149 171 -5 195 -135 91 -153 -23 327 -126 89 284 166 101 16 130 153
4063 153 -245 157 110 132 113 194 -208 186 149 22 39 -68 -7 -36 -365 240 -385 116 -23 -100 -145 13 58 275
4087B75k57k5L41n04R6K13k53J49q6QJ58l03J16j1O5PK47o74O05l24k13L71k44
4110b43K54k18j18L71J5j70K95l10N51l85j4J43k31j49M33l99J32k6o5L83l02
4131e3p0L60k61J35j21j75n1RL42J07m59K69K09r1J88l74J33K02k82j58L66m11
4153a86J17M2r1N45k12k56K51k28K07K7l90L87k00k19R3k6K31K5j92J74L15m71
4175e7K61k80p5J83j42opK4M21l33J22j10J3J50j36L9J17l24j01L68k95M14p0
4198A76k20J27j47J06J32j88p7J20l79N30q0q3kr0J0L59m14J64Q3j65K50J1k91
4221f8Mp3K65j76j90N06m41J91J43r4rp2k42L27k57n4M15l87L78j59j34L75m85
4244b37K56J17k08P2q9k35M28l20J93K05k58J94j98n8K23j12j66J80k43Q5K45
$$ plain form
4087 275 18 -7 334 -170 -74 139 -114 35 -51 -43 115 -188 -72 -83 -18 -11 236 -438 167 -157 -370 1 -243
4110 -243 11 -207 -325 46 61 -109 186 -124 427 42 28 171 -60 -209 224 -175 -43 -69 -134 249 -53
4131 -53 -123 237 -24 111 -10 -185 -236 -227 115 222 -237 32 241 150 338 -36 97 299 17 -141 225 -186
4153 -186 -69 -27 -118 427 215 -41 210 -18 189 216 -174 213 13 -206 -113 -139 92 117 -75 99 414 -57
4175 -57 204 -76 -151 32 -110 -116 -123 -99 322 -11 111 1 14 164 28 67 184 -140 -241 127 -168 246 176
4198 176 -44 83 -64 42 174 -14 -91 29 -350 180 100 17 15 -75 -65 294 -120 44 127 -38 212 223 -68
4221 -68 -64 -137 128 -48 -238 268 -173 18 161 67 58 -14 -256 71 -186 -240 175 -212 166 7 -127 248 -237
4244 -237 19 136 -72 0 -89 -324 104 -216 -23 182 -76 118 -80 -138 85 -27 -193 -13 -256 -171 74
4265G4k41J08O1J44j59k48J68J11k12K28o7J15j5p8n6P5j47K05K6j43K12k05j62
4288b06L1K98o7J44m07K91k65J26J40j10L33j70n6J12k00k6N6j10K64l25n0J73
4310b4J12m87M80k61K54j0j11K77j96j12j09L99k16K37k90K37o9k12L98j56l56
4331b15K62k35m4K31j95L59l16mM16l75N5J18n4Lk41K51K17n67L75j04k53N94
4353B78k30j84K61l00K81j27p8J56k24L4J92j59r1K55l04K58Mp1N5o8R8N0j00
4376a4J46j90K0Q8J6l17O54m80j22M06k76P2q4P9M18n51L7N5n1L06l08K93j05
4399I2j31J70k06O6J32n9Q2M4k44L4o8J26O5k11j03M18k70Q5J88k57k6J21l19
4422b71M28l80q1N60l28K69j9k52L11m90L59o2j53K20L7m00K33J0j37L58j38j4
$$ plain form
4265 74 -167 -59 2 146 -13 -261 -93 18 -194 34 -33 82 67 -11 -67 8 -139 66 92 -51 161 -44 -206
4288 -206 -175 123 56 200 -207 84 -181 -55 85 -25 308 138 82 194 -6 -32 24 -86 178 -147 -197 -24
4310 -24 88 -399 81 -180 74 64 -47 230 34 -78 -187 212 -4 233 -57 180 111 -101 297 141 -215
4331 -215 47 -188 -232 -1 -196 163 -153 -157 259 -116 -61 57 3 6 -235 16 233 -334 41 -63 -316 278
4353 278 48 -136 125 -175 106 -21 -99 57 -167 -133 59 -100 -191 64 -240 18 22 -49 6 -62 36 86 -14
4376 -14 132 -58 -38 50 66 -251 403 -77 -199 207 -69 3 -81 -2 416 -135 -98 -43 -94 212 -96 197 92
4399 92 -39 131 -75 -9 123 64 146 190 -54 -20 -88 38 103 -108 -211 207 -63 22 210 -47 -73 48 -271
4422 -271 157 -223 -304 256 -72 197 178 -74 237 -253 106 44 -109 111 148 -252 -19 -9 -146 212 74 60
4444F0nl5J15l00k48N58j77J58j76J80k63J69JJ55j30O7mj57RL10n29j64K27J12
4468f7K07k20M16j31l86L59l1l35J66r7L34k82n7R0n8j92K37J44j90J74j64K28
4490A45k4j51J12l84L58j19L9j24N9J09K11j61j20K03l29K34j0n6J64m23K60L8
4512C1j40K61l00M5K72P0k30l5j57K80o3j21J77p2j31K23n90M94R4k36J80np4
4535b7M9k19L22j6m27N47r4j37kj16%K04k54kPl0J59pj40K92j59J00j08R3J20
4560A55j8l66L20k56K22k06j55L37M4l5J29j80j27K86l31n1K69k92P46o41O0K79
4582A89j68j52R3J11j73L7L12j13k42M74k64k64J83k24K30Q4j60J25q5r3O7n4
4604h7r2l0j5L00j00l64M97l05J06K48j19J02J61j43j88k59K65J56j13rJ21k8
$$ plain form
4444 60 55 20 135 -165 -413 145 -32 126 -50 130 -133 36 37 192 62 129 125 -32 -23 287 -242 -406 -179 -67
4468 -67 140 -80 336 205 -181 178 147 -188 -22 -119 215 -67 -124 -34 -92 -284 -47 97 -93 81 -83 145
4490 145 121 -30 82 -302 56 -63 -24 -148 -89 20 231 70 -50 153 -176 58 48 -8 156 -267 -7 31
4512 31 -109 152 -148 -103 169 239 9 -26 -183 97 34 -87 90 18 -113 110 -480 14 108 -128 52 47 -27
4535 -27 22 -197 125 109 -318 229 135 -2 -4 -120 -120 84 -170 -172 -165 -195 -36 -43 -183 109 -50 50 -58 35 155
4560 155 137 -229 91 -165 57 -149 -304 33 77 42 171 -9 -136 150 -181 -232 37 -255 491 -150 -90 189
4582 189 21 -131 -38 73 -100 -63 249 136 -106 368 104 -160 23 -201 29 113 -47 78 -7 -100 -33 -87
4604 -87 -179 -209 -224 76 -24 -388 109 -196 -90 158 39 141 302 159 -29 -288 -23 133 20 11 132 104
4626A04N7k20K53j65l04L86j30r6K84r9K7q4oo6K42q6J17K0r3p8j78j7K56l68
4650b44K11O0k34L19nl59O62l53O2O6k49J86q1j48J73l59N31j10j11K11k95J16
4672D9J87l87J87m5k26M05j89j53J85p4k7ol89N50q0j46K52j18q8J29p4K31J27
4695C00l94J77Ll31J96J1L66j13k04n9J32k52K36j15j03L15Q6k40j43k31L03N4
4717fkL4r5J63Q6r0J52M7l40K23k17o0J24N6O5k15j47K28Q8n9J43j81j22L36j73
4742C8J06m14J98Q3j51J56j48L24k12l7K40k71K4L10j60j93J47j70L34O8m65L67
4764A74l09j48M79rr6M2j19j60K67k02J33p5J88k82n0L78j89J44j51J09k18k07
4786c01L38Q8k57K72k52J00J87J40l68j22K91l7L54k38j49k7j52R4j9q2K54j62
$$ plain form
4626 104 161 -59 194 29 -275 111 -19 -115 169 70 97 13 7 -59 183 97 214 234 141 63 -115 -132 124 -244
4650 -244 -33 27 -207 112 107 -252 410 57 119 185 -64 122 41 -107 66 -293 238 128 17 228 -67 49
4672 49 236 -151 36 -9 -235 170 -19 -172 13 -61 -88 -94 -483 67 -13 -159 93 -25 -113 16 -58 173 300
4695 300 -94 83 86 -245 -49 -38 328 215 11 -48 84 -168 68 -47 -150 165 251 11 -132 -363 -60 -6
4717 -6 -8 26 -69 94 180 90 242 289 -51 172 -45 -105 19 75 140 -75 -222 6 94 35 178 -3 -125 211 38
4742 38 144 -270 -72 11 -140 16 -132 192 -20 -57 183 -88 -64 246 86 -107 40 -130 204 272 -193 174
4764 174 -135 -283 196 187 91 133 14 -146 121 -81 52 -23 165 -117 -167 211 22 166 15 124 -94 -301
4786 -301 37 125 -132 140 -112 -12 175 315 -53 -175 116 79 433 195 46 19 -133 -39 -58 -140 114 -48
4808d8%J66l05M41q6m0j23j12k1J65j61p8L54m9r4%J09L2rrj12J02J4j61l3J25
4834F7r9N0J46k71j9K27k61J65j54J96j17k78L53j33L26o6k18O8J87k68J49J04
4856A54l60J14k3K63m9j12q2K38k11m5J90l40K23n3K3J34j63q0K97k21K58r7K2
4879H0j19q0O1K71o4k26P6L11j66j13K33l51j22K91k8k03j14J37O0P0k9o2J40
4902E3j39L29k38Lj05K23j35L27l18J9N3J19k7k75K48l74K63O2q3k1M8l32L27
4925B7M3j58J91o3o7o5j34J77K09k04p3J79j02J12j91kK48J24R2l12k52L76j75
4948b0q1j68J21M6L03l14J19R9j40L1l21L56k06j54M71k86L4J46k13J42K41j32
4970G4j3J40k80L86m63K55R8j0j9l12j97M21l37M68K60n85K41k09L8J65j74J43
$$ plain form
4808 -48 -48 118 -187 254 168 128 5 -107 -128 37 -124 -202 152 103 9 9 118 150 141 132 20 122 136 -25 -58 67
4834 67 -32 18 164 -107 -126 101 -160 5 -149 47 -70 -348 5 -128 198 132 -86 -18 169 -99 50 154
4856 154 -206 -92 -115 148 99 -13 -95 143 -68 -113 77 -263 -40 -93 -70 64 -99 -179 118 -103 155 58 80
4879 80 -39 -119 -58 213 149 -77 -1 310 144 31 264 -87 -209 82 54 -149 -263 -126 -66 4 -25 -87 53
4902 53 -86 243 5 8 -97 126 -9 318 0 19 72 191 164 -111 137 -237 26 88 5 -16 32 -300 27
4925 27 70 -88 103 40 -27 -92 -226 -49 160 -44 -117 62 -40 72 -119 -121 127 251 343 31 -221 155 -20
4948 -20 -101 -269 -148 -102 201 -113 6 105 -35 -4 -325 31 -175 -329 142 -144 -110 36 -177 -35 206 74
4970 74 61 201 -79 307 -156 99 197 187 168 -144 -341 80 -257 211 471 -114 127 -82 -44 121 -53 90
4992I0k07j8J49n2lQ6j0n9K50m3q8m7p6L65l18l63L14k46M59K2n29K10K40n8P0
5017A38m9k22N2O1J88k25K3M1o8J82J0k59m0J13K9K7k25K32N1j64l0K95k18j2
5041g0j05L4L03m89K43J34j66K32o9n3j44K12J21pj34J28k00p3K81n56L42K80
5063B44j61p8J05k85N25m24j51K10r1K52Ln9j72J02p4k13L54r0K8r5R1j6mJ66
5087A67m22K16QJ6O9j00J42K16k74m8J40j84K78p4j34J47l25K05j26p7J4K63j29
5110a2K2j23N4K6L3L85l72j13K67k41J42Q6k35L53j5j69m6j52K09jk74K65J18
5133B07l67K03k00Q7K36j01k22J28O2j7k5l2L5l2m9J74k13J53k42J04p6K71J75
5156B59j05l39J09J09j42n9L60k88K7k2K29j62k07R8J26j48l8J5K19J1nJ80k56
$$ plain form
4992 90 -117 -135 14 -38 -41 45 35 -24 226 183 95 48 -28 337 19 -344 -30 -276 183 205 -324 -114 126 68 138
5017 138 89 -133 -81 -20 168 -57 -34 7 -61 121 131 -128 -168 -55 -26 1 -224 8 59 -105 -135 160 -58 -70
5041 -70 -175 -141 162 -327 -84 50 -116 116 47 -6 -150 62 183 176 42 170 -30 -103 178 -378 -36 244
5063 244 83 5 110 -175 350 -74 -225 -15 -106 146 149 90 -82 20 -54 -267 87 -3 25 -70 21 5 1 167
5087 167 -255 -39 -31 -15 54 -46 96 312 38 -10 130 -54 224 150 16 163 -162 43 -83 -160 -146 117 -12
5110 -12 10 -113 -59 -33 0 385 13 -100 167 -74 68 154 -81 272 257 88 42 -110 99 98 -176 89 207
5133 207 -160 43 -157 -70 166 65 -157 -29 33 16 -9 -41 -6 -38 -87 87 -126 27 -215 -111 -187 84 259
5156 259 154 -185 -76 33 -109 -168 192 -96 -69 -91 138 -24 -231 -133 -7 -155 -193 -178 41 52 47 227 -29
5179b9o9J32k37M2L87l10J85j40o5J93k51J25l16J75O8j91M8L12J14m12L49l80
5201b70L65m03K77O1M1j23K9J55k76J36n0kK19P8m93K52LO5k60M13l31n1R8n9
5225a26K08j02j1J44k82J05J27l22K73k10J57k5J39j50K34m45K72j92N6M19k37
5246C2P9L8j10j80K00k02L91k65k20K55j04J91j20L5k07K42j40n0qK05K5j51K29
5269A65j08r6K20j48j7n9m3Q4JO9j82J66k29K08M2n5J69l49K99P0j70j7J6l8K02
5294B00j61L1Kl08J52j37Q2K36n2o6r5QO7N9K79r1l16k4N6j29L10l20M39j06O1
$$ plain form
5179 -29 -98 34 -203 -161 226 -84 101 -39 -104 89 -162 -37 -353 -178 -110 -301 -253 59 173 -239 110 -270
5201 -270 95 -308 -31 30 71 -52 -23 132 -144 -8 -58 -60 159 237 -256 -4 -1 64 -196 217 -114 -165 -67 -126
5225 -126 82 -20 -31 113 -169 -64 63 -259 14 -196 -39 -64 75 -75 159 -286 -14 -206 -150 269 32
5246 32 111 149 39 -141 59 -143 248 -17 -237 18 -86 105 -15 20 -187 55 -85 -135 -143 62 87 -64 165
5269 165 57 -39 181 33 16 -43 -86 -2 -1 68 -114 52 -177 31 73 18 187 -162 137 207 37 20 36 -2 200
5294 200 39 70 72 -236 -84 -221 -139 97 45 -21 -116 -108 -41 18 297 206 -110 -134 -78 -207 103 -217 222 116 177
$$ [...]
8191f4
##END NTUPLES=NMR FID
##END=
