##TITLE=1H_89-2021
 CDCl3, 8 sc, 
 1.9.2021
##JCAMPDX= 6.0         $$ Bruker NMR JCAMP-DX V2.0
##DATA TYPE= NMR FID
##DATA CLASS= NTUPLES
##ORIGIN= UXNMR, Bruker Analytische Messtechnik GmbH
##OWNER= root
$$ XWIN-NMR		Version 3.5
$$ Wed Sep  1 11:39:03 2021 Russian Standard Time (UT+4h)  she@DPX200
##.OBSERVE FREQUENCY= 200.1312
##.OBSERVE NUCLEUS= ^1H
##.DELAY= (6, 6)
##.ACQUISITION MODE= SIMULTANEOUS
##.ACQUISITION SCHEME= undefined
##.AVERAGES= 8
##.DIGITISER RES= 18
##SPECTROMETER/DATA SYSTEM= spect
##.PULSE SEQUENCE= zg30
##.SOLVENT NAME= CD2Cl2
##.SHIFT REFERENCE= (INTERNAL, CD2Cl2, 0, 15.7039)
##AUDIT TRAIL= $$ (NUMBER, WHEN, WHO, WHERE, WHAT)
$$ ##TITLE= Audit trail, XWIN-NMR		Version 3.5
$$ ##JCAMPDX= 5.01
$$ ##ORIGIN= Bruker BioSpin GmbH
$$ ##OWNER= she
$$ F:/spectra/data/she/nmr/H-F/1/audita.txt
$$ ##AUDIT TRAIL=  $$ (NUMBER, WHEN, WHO, WHERE, WHAT)
(   1,<2021-09-01 11:37:43.43 +0400>,<she>,<DPX200>,
      <created by zg, POWCHK disabled, PULCHK disabled
       configuration hash MD5:
       00 E9 B6 7A A2 85 ED C7 34 08 36 98 17 FE 4E 26
       data hash MD5: 16K
       8E 92 63 F1 33 01 A1 E8 8D BB A2 E3 E5 58 C2 27>)
$$ ##END=
$$ 
$$ hash MD5
$$ 4D 14 29 B9 F9 81 B2 C3 4D 7B 3B C5 2D E3 4E EC
##$RELAX= 
##$RELAX= 
##$RELAX= 
##$RELAX= 
##$RELAX= 
##$RELAX= 
$$ Bruker specific parameters
$$ --------------------------
##$DU= <F:/spectra>
##$EXPNO= 1
##$NAME= <H-F>
##$PROCNO= 1
##$TYPE= <nmr>
##$USER= <she>
##$AMP= (0..31)
100 100 100 100 100 100 100 100 100 100 100 100 100 100 100 100 100 100 
100 100 100 100 100 100 100 100 100 100 100 100 100 100 
##$AQSEQ= 0
##$AQ_mod= 1
##$AUNM= <au_zg>
##$AUTOPOS= <>
##$BF1= 200.13
##$BF2= 200.13
##$BF3= 200.13
##$BF4= 200.13
##$BF5= 200.13
##$BF6= 200.13
##$BF7= 200.13
##$BF8= 200.13
##$BYTORDA= 1
##$CFDGTYP= 0
##$CFRGTYP= 5
##$CHEMSTR= <none>
##$CNST= (0..31)
1 1 145 1 1 1 1 1 1 1 1 1 1 1 1 1 1 1 1 1 1 1 1 1 1 1 1 1 1 1 1 1 
##$CPDPRG= <>
##$CPDPRG1= <>
##$CPDPRG2= <>
##$CPDPRG3= <>
##$CPDPRG4= <mlev>
##$CPDPRG5= <mlev>
##$CPDPRG6= <mlev>
##$CPDPRG7= <mlev>
##$CPDPRG8= <mlev>
##$CPDPRGB= <>
##$CPDPRGT= <>
##$D= (0..31)
0 1.2 0 0 0 0 0 0 0 0.06 0 0.03 0 0 0 0 0.0002 0 0 0 0 0 0 0 0 0 0 0 0 
0 0 0 
##$DATE= 1630481863
##$DBL= (0..7)
120 120 120 120 120 120 120 120 
##$DBP= (0..7)
150 150 150 150 150 150 150 150 
##$DBP07= 0
##$DBPNAM0= <>
##$DBPNAM1= <>
##$DBPNAM2= <>
##$DBPNAM3= <>
##$DBPNAM4= <>
##$DBPNAM5= <>
##$DBPNAM6= <>
##$DBPNAM7= <>
##$DBPOAL= (0..7)
0.5 0.5 0.5 0.5 0.5 0.5 0.5 0.5 
##$DBPOFFS= (0..7)
0 0 0 0 0 0 0 0 
##$DE= 6
##$DECBNUC= <off>
##$DECIM= 32
##$DECNUC= <off>
##$DECSTAT= 4
##$DIGMOD= 1
##$DIGTYP= 9
##$DL= (0..7)
0 120 120 120 120 120 120 120 
##$DP= (0..7)
150 150 150 150 150 150 150 150 
##$DP07= 0
##$DPNAME0= <>
##$DPNAME1= <>
##$DPNAME2= <>
##$DPNAME3= <>
##$DPNAME4= <>
##$DPNAME5= <>
##$DPNAME6= <>
##$DPNAME7= <>
##$DPOAL= (0..7)
0.5 0.5 0.5 0.5 0.5 0.5 0.5 0.5 
##$DPOFFS= (0..7)
0 0 0 0 0 0 0 0 
##$DQDMODE= 0
##$DR= 18
##$DS= 0
##$DSLIST= <SSSSSSSSSSSSSSS>
$$ [...]
##$SUBNAM2= <"">
##$SUBNAM3= <"">
##$SUBNAM4= <"">
##$SUBNAM5= <"">
##$SUBNAM6= <"">
##$SUBNAM7= <"">
##$SUBNAM8= <"">
##$SUBNAM9= <"">
##$SW= 20.0189188712717
##$SWIBOX= (0..15)
0 0 2 0 0 0 0 0 0 0 0 0 0 0 0 0 
##$SW_h= 4006.41025641026
##$TD= 16384
##$TD0= 1
##$TE= 0
##$TE2= 300
##$TE3= 300
##$TEG= 300
##$TL= (0..7)
0 120 120 120 120 120 120 120 
##$TP= (0..7)
150 150 150 150 150 150 150 150 
##$TP07= 0
##$TPNAME0= <>
##$TPNAME1= <>
##$TPNAME2= <>
##$TPNAME3= <>
##$TPNAME4= <>
##$TPNAME5= <>
##$TPNAME6= <>
##$TPNAME7= <>
##$TPOAL= (0..7)
0.5 0.5 0.5 0.5 0.5 0.5 0.5 0.5 
##$TPOFFS= (0..7)
0 0 0 0 0 0 0 0 
##$TUNHIN= 0
##$TUNHOUT= 0
##$TUNXOUT= 0
##$USERA1= <user>
##$USERA2= <user>
##$USERA3= <user>
##$USERA4= <user>
##$USERA5= <user>
##$V9= 5
##$VALIST= <valist>
##$VCLIST= <CCCCCCCCCCCCCCC>
##$VD= 0
##$VDLIST= <DDDDDDDDDDDDDDD>
##$VPLIST= <PPPPPPPPPPPPPPP>
##$VTLIST= <TTTTTTTTTTTTTTT>
##$WBST= 1024
##$WBSW= 4
##$XGAIN= (0..3)
0 0 0 0 
##$XL= 0
##$YL= 0
##$YMAX_a= 169187
##$YMIN_a= -182566
##$ZGOPTNS= <>
##$ZL1= 120
##$ZL2= 120
##$ZL3= 120
##$ZL4= 120
##$ABSF1= 10
##$ABSF2= 0
##$ABSG= 5
##$ABSL= 3
##$ALPHA= 0
##$AQORDER= 0
##$ASSFAC= 0
##$ASSFACI= 0
##$ASSFACX= 0
##$ASSWID= 0
##$AUNMP= <proc_1d>
##$AZFE= 0.1
##$AZFW= 0.1
##$BCFW= 1
##$BC_mod= 2
##$BYTORDP= 1
##$COROFFS= 0
##$CY= 11.3945322036743
##$DATMOD= 1
##$DC= 2
##$DFILT= <>
##$DTYPP= 0
##$F1P= 2.36226072786647
##$F2P= -0.459571619588291
##$FCOR= 0.5
##$FTSIZE= 0
##$FT_mod= 4
##$GAMMA= 1
##$GB= 0.15
##$INTBC= 1
##$INTSCL= 1
##$ISEN= 128
##$LB= 0.24
##$LEV0= 0
##$LPBIN= 0
##$MAXI= 10000
##$MC2= 0
##$MEAN= 0
##$ME_mod= 0
##$MI= 1.114404
##$NCOEF= 0
##$NC_proc= 0
##$NLEV= 6
##$NOISF1= 3.799351
##$NOISF2= 2.8
##$NSP= 1
##$NTH_PI= 0
##$NZP= 0
##$OFFSET= 15.70392
##$PC= 1
##$PHC0= -13358.79
##$PHC1= 11.00097
##$PH_mod= 1
##$PKNL= yes
##$PPARMOD= 0
##$PSCAL= 0
##$PSIGN= 0
##$REVERSE= no
##$SF= 200.130013532006
##$SI= 16384
##$SIGF1= 3
##$SIGF2= 2
##$SINO= 400
##$SIOLD= 16384
##$SREGLST= <1H.CDCl3>
##$SSB= 0
##$STSI= 0
##$STSR= 0
##$SW_p= 3612.71676300578
##$SYMM= 0
##$S_DEV= 0
##$TDeff= 0
##$TDoff= 0
##$TI= <>
##$TILT= no
##$TM1= 0
##$TM2= 0
##$TOPLEV= 0
##$USERP1= <user>
##$USERP2= <user>
##$USERP3= <user>
##$USERP4= <user>
##$USERP5= <user>
##$WDW= 1
##$XDIM= 8192
##$YMAX_p= 0
##$YMIN_p= 0
$$ End of Bruker specific parameters
$$ ---------------------------------
##NTUPLES= NMR FID
##VAR_NAME=  TIME,          FID/REAL,        FID/IMAG
##SYMBOL=    X,             R,               I
##VAR_TYPE=  INDEPENDENT,   DEPENDENT,       DEPENDENT
##VAR_FORM=  AFFN,          ASDF,            ASDF
##VAR_DIM=   8192,          8192,            8192
##UNITS=     SECONDS,       ARBITRARY UNITS, ARBITRARY UNITS
##FACTOR=    0.0002496,     1,               1
##FIRST=     0,             0,               0
##LAST=      2.0444736,     0,               0
##MIN=       0,             -182566,         0
##MAX=       2.0444736,     169187,          0
$$ Real data points
##PAGE= N=1
##DATA TABLE= (X++(R..R)), XYDATA
$$ [...]
2299a309K544k161K28K569m019K963K81l143L713k056m93J736j143J52j25O86
2315D23p86K04J606k966K151L68k921M545k878p54L094l441J813L45j936J733
2331F00j097O03n50l90J163j595K211j181o80K152k712K269k03j831L074k583
2347g50R37J064k589K326r01o11J649k043P51K38q4N92j635J791j326L74J364
2364A147k754K625j076q86K651l104J323O70k356L168k054k68J535j684J913r46
2380i6J87p3l65J661j963J176L57k540L376j965q59K332k810K035M7j909J799
2397C90j297J018J14j059J214j192J138o4p72J732k596J948N03k303K725k276
2413g77K29J705k341J950r46m82J345j534J610p94o01J591j538J226m41o35J108
$$ y = [-1309, 1235, -926, -698, 1871, -2148, 815, 1096, -2047, 1666, -390, -883, 853, -290, -138, -263, 423, -363, -159, 1447, -1519, 632, 1000, -1921, 2624, -254, -1008, 2086, -1355, 458, 803, -1133, 600, -497, 106, -444, -834, 329, -1266, 945, -236, -916, 1236, -1476, 793, 590, -1241, 1833, -750, 187, 1251, -1338, 988, 87, -524, 1125, -918, -167, 71, -13, 579, -1056, 735, -591, -217, 1147, -1607, 1018, -58, -944, 1707, -1397, -74, 596, -1760, 1408, -646, -914, 621, -1063, 850, -96, 91, 18, -347, 1314, -649, 527, 884, -1656, 1720, -245, -1104, 1228, -1582, 453, 500, -1409, 390, -907, 111, 225, -834, 380, -812, 326, 262, -510, 1222, -1374, 574, 1077, -1226, 1499, -777, -548, 1157, -1184, 766, -180, -662, 683, -851, 759, -35, -636, 955, -583, 643, 202, -433, 675]
2430F75k034K504j449r79K634k769J496N75k386K474j006q2J175j396J221p16
2446f3K94P78j745J924j695N46J068j893J637j631PK120k821J489O2j325K342
2463A094j798M74N11j227J763j110O36m84o90K021j707Q72O2j783K491j413K50
2480c8J050k398K312p41p20J877k292J345k1p93J531j956R72k65l99J345j996
2497a187J170N07j658K343k170J147M39j495K159j606oJ888k272J366m94l87R79
2514G23j248J207r75J58R86k093K367j140q32K199k345J180M18j803K110j492
2530e80P39J28j175J557j346O18R9r84J592j295O21N94j959K604j345l5J217j804
2548g54J504m96p53J271j554J217J8j124J662j716Q28K50j096J291j410J074k35
$$ y = [675, -1359, 1145, -304, -1283, 1351, -1418, 78, 653, -1733, 741, -265, -347, 828, -568, 653, -63, 231, 1009, -736, 1188, -507, 39, 1107, -786, 851, -780, -773, 1347, -1474, 15, 77, -1248, 1094, -704, -230, 281, -946, 817, -293, 343, -141, -831, 1190, -517, 355, 417, -1366, 1125, -288, -38, 1012, -1386, 926, 185, -535, 1342, -950, 395, 374, -419, 1112, -844, 128, -137, -536, 809, -1187, -17, 490, -1168, 1175, -995, 152, 591, -904, 1255, -351, -357, 1531, -741, 625, 131, -256, 723, -525, 682, -293, -135, 851, -1242, 1125, -15, -847, 1352, -993, 187, 605, -1198, 912, -580, 159, 287, -888, 669, -677, -59, 40, -944, 648, -647, -26, 568, -1391, 1213, -132, -167, 1050, -754, 750, 254, -499, 772, -782, 435, 453, -671, 991, -725, 103, 353, -743, 548, -862, 212, -23]
2565b3p09J564j649R10Q43j843K003j679K8J969j978J129k57q09J200r62N78p55
2583d40L49Q01j505J602j065o80K091k015J009K47j700K099j025j20O03j168J301
2600C84p61L35K22j384J978j203M85P97j901J670m48o20J494j810J512p10l83
2617c43J180j774J325k83r37K076k080O53Q42j428J309p12j79L82l52R71j519
2634h69J269L1j268K152j916j75K254k511J511J53j533J435l07j14k09L3L06p98
2652e56J501j357m82K257k620J352N87k182K241p48o97J460j578J176o69M13K68
2669C66j120J494j231L76J041j887J517m60n39J403j472Q54k09k94J027j728J267
2686D05q7j395K254k013O09J002j771J377n17o4K16j8O37j174Q57J65j623K745
$$ y = [-23, -732, 832, -817, 93, 936, -907, 1096, -583, -555, 1414, -564, 565, 308, -501, 699, -263, 315, -440, -91, 710, -795, 807, -258, -938, 1153, -862, 147, 394, -1306, 793, -232, -352, 251, -917, 384, -377, -42, 180, -1204, 774, -429, 56, 853, -1048, 622, 174, -446, 1048, -762, 750, 40, -343, 837, -937, 388, 105, -832, 1244, -836, -183, 659, -769, 540, -172, -351, 31, -321, 650, -869, 400, 431, -837, 1315, -601, -776, 1478, -1033, 478, 631, -902, 533, 226, 112, -97, -64, 242, -556, 945, -412, -894, 1363, -1257, 95, 682, -1500, 741, -7, -704, 756, -822, 354, -315, 98, 366, -754, 740, -491, -115, 926, -961, 556, 96, -443, 960, -512, 342, 133, -161, 866, -862, 405, 318, -1077, 1177, -836, -227, 775, -996, 381, -136, -200, 16, -2, 635, -539, 318, 483, -1140, 1605]
2704A605k061j05K051k654J577N90j939J591n81k45L53q2L31j323J606j010m65
2721g61J796k012J375K83k402K479p48j003K001j638Q44j03k25L58r88J293n69
2738b0j26J188j923J320q9r97J584j405M82J29q31J750j529N69M04j304J504j119
2756d13mJ074j443J011k51k87L48l85R25q96K55N20j519K153j202m91J952k248
2774i01J134O17j526J181m86n49R87l68k15l94P66o75j20J547k325J391P33k078
2792a281K073q66p11J485j642J001K76j039J058q17R96o90n6Q35j357J464l60
2809C69r65J393j215O54Q9r70J270j305R17L95j660J764q17o78J359j395J022
2826B27l44qJ95m47J040j030N01M15j325J734j000n73K001k191R71L37j307J666
$$ y = [1605, -456, -561, 1490, -1164, 413, 1003, -936, 655, 74, -171, 182, 100, 431, -892, 714, -296, -761, 1035, -977, 398, 681, -1721, 758, 10, -993, 1008, -630, 214, 111, -114, 244, -744, 549, -20, -146, 1042, -881, 439, 350, -647, 937, -468, 14, 143, -688, 1062, -467, 102, 506, -798, 706, -413, -417, 657, -786, 225, -26, -313, 35, -350, 575, -321, -66, 454, -1065, 1088, -114, -605, 1347, -901, 233, 850, -676, 505, 19, -530, 457, 89, -126, -520, 246, -429, -549, 998, -1327, 64, 797, -1281, 792, -74, -785, 700, -942, 59, 335, -704, 354, -463, 533, -157, -213, 622, -735, 729, 369, -596, 797, -418, 236, 325, -645, 625, -680, 237, 632, -1028, 736, -81, -759, 600, -795, 227, -117, -125, 70, -377, 663, -367, 134, 549, -776, 958, -42, -615, 1386, -805, 166, 503, -804, 862]
2844H62q74j55Q04q15L94k65L04j1p67J285j240O58L03j781K025j397nJ414j805
2863a066J136L58j015R08m44K04P6n26J037p32N44l80o13J321j594J023L05j278
2881g36J483j278L59P82j510J385p22k62J156j181Q96k57m24O26m78N24p46K8
2899c55P77j510J635m15r27J972j967Q50N89j649J739q53q2P75q42M85l66K44
2917A00nq83J241r60J40Q07j232J326n96n97J468j471R15k28p76J545j144M58
2935A08J70q13J171r44O05j21n94J297j459O12K78j131J555j169K67J021j711
2952h58R79n9o46J088j087N61Q8m33Q22q25L37K5J3N60j405J305k66p82J285j183
2972d81N08O35j368J579p43p16J344j185M54k01j9N0k42P81p44L8R33j381J329
$$ y = [862, -12, -167, 637, -178, 216, -49, 255, 244, -523, 762, -478, 180, 483, -1298, 727, -670, -675, 739, -1066, 70, 428, -587, 321, -123, 81, 157, -369, 668, -64, 480, 100, -513, 808, -786, 237, 542, -736, 747, -531, -172, 610, -900, 485, -237, -499, 657, -524, 372, 115, -309, 317, -161, 363, -383, -355, 422, -1088, 547, 132, -795, 1177, -790, 60, 649, -1000, 739, -114, -196, 579, -263, 222, -144, 100, 95, -788, 453, -507, -367, 440, -792, 534, -62, -659, 809, -662, 253, 25, -751, 794, -350, 108, 278, -535, 636, -308, 297, 176, -418, 879, -580, 32, 310, -821, 734, -435, -168, 853, -858, 121, 62, -584, 504, -583, -22, 66, -367, 455, -370, -33, -8, 5, 565, -840, 465, 199, -583, 702, -481, 27, 662, -706, 873, 130, -586, 758, -427, 27, -174, -193, -143, -385, 396, -348, -310, 623, -758, 571]
2991E71p13n36J518j428P65J79j150J363q60K99L01n54O05o71M35M57q99N39o70
3010d49M19M72j107J047p65QR27j378J153n22j86J087j106M25Q2o67R87q80L20
3029a33L16l61N86n67O20j01r78J352j071L75N60j211J227m80l41O93q41L02j5
3048f8k56P03p03M99n87J15R14j413J213n50n06J427j644Q38J12o41R58m85J45
3067G1J80m73N71l46J18M90j161J338q28k16P43q96N11k55q6O45r52Q41m13l71
3087d89J235j266O18M02j000J111r67L32K35k74M74m78K63J78o03Q37p84L17N51
3106F92j681J224k83k16J107j084L01o3k04M66n91Q04q06M3N37r96Q96op43J338
3126G35j298L19Q12j159Q54n65P13n3p06N88m63K96K76q25Q80m18k35O46p66K86
$$ y = [571, -142, -678, 840, -588, 177, 356, -794, 569, -291, 8, 309, -245, 360, -311, 124, 581, -318, 221, -449, -30, 442, -665, 382, -383, -375, 552, -826, 327, -195, -381, 706, -400, 25, 107, -560, 427, -453, -133, 183, -178, 408, -159, 461, 360, -618, 734, -337, 38, 598, -613, 614, 134, -207, 486, -355, -53, -68, -324, 379, -324, 175, -412, -297, 617, -796, 417, -133, -639, 788, -856, -18, 94, -547, 411, -74, 71, 251, -222, 349, 3, 121, 611, -550, 788, -40, -256, 487, -409, 102, -153, -239, 406, -546, 295, -118, -489, 746, -520, 98, 500, -500, 611, -356, -24, 211, -63, 411, -67, 196, 374, -229, 608, -176, 141, 692, -989, 235, -48, -264, 843, -241, 60, -3, -207, 259, -332, 472, -334, -291, 246, -750, 146, 140, -603, 735, -563, -244, 568, -591, 263, -302, 411, 358, -348, 240, -223, 73, 349, -476, 404, -14, -249, 397, -369, -83]
3146h3j9j41O73j125O36Q1l91R27j071N73J43q85J211o33k47O53o23Q55o35J66
3166F5j35p8J030j444M69O22r75J109q44l17J071r79L11O15q89M37k34M40l56
3185h2j18L17p75R44o9j068J487r86K14J023j519P31j63P0L99n93L51k35L23O24
3205H75j376P94k15l93J224j317L34J56n24P43r30Q08l65k25J372j604R02J4j150
3224h77J731r31l47P53m97N03N5m82j48l8J035r52J45M42j224J567m60q10J107
3243E72j153M79N65q50L25l69N58j85k49M22p79J016J3r35Q89m97j39J114r13
3262a16L19j44k09P60q79L46l15L02L82p14P80p22k61J057j033M45J30m81O13
3281B60j42R6j14p10J066q80M59N42j485J439o56k45Q12r27O06l3J41j33l14O87
$$ y = [-83, -102, -243, 430, -695, -59, 22, -369, 558, -513, 60, 203, -682, 529, -104, -351, 302, -321, 534, -101, 65, -70, -148, 882, -562, -93, 529, -446, 663, -181, -498, 573, -406, -95, 520, -369, 68, -166, 274, -82, -200, 117, -658, 286, 217, -851, 636, -350, -136, 887, -632, 99, -64, 6, 405, -188, 163, -72, 251, 875, -501, 293, 78, -315, 909, -408, -74, 82, -442, 301, -629, 179, -186, -411, 961, -643, 259, 273, -877, 854, -77, -424, 329, -168, 335, 390, -92, -240, -278, 757, -195, -50, 392, -832, 735, 275, -535, 572, -581, -102, 463, -387, -62, -431, 127, -58, -307, 115, -664, 352, 365, -570, 319, -178, -317, 797, -116, 203, 59, -150, 610, -269, 77, -238, 64, 446, -268, 512, -210, -471, 586, -447, -2, 128, -353, 260, 118, 214, 100, -610, 456, -424, 35, 577, -908, 531, -125, -370, 442, -485, 121, 88, 229, 96, -218, 469]
3301D69p60N64J36j054J219n97p44J454j177J45N52n77N52k84l3K71j98L02p49
3320e09N09L3o91J381j136J09R32j192J005m18l30N81l51L46j84k00O66r52Q29
3339D28L8q23Q05o50J07J47l93N34k47J0K28p59J169p76Q9O54j244J064k55n24
3359c98J013p42M82k90k18L04l47N42m60l9M87n37M72l31m74J177j153M50O87
3378F25j364Q98j18l72M63m43O49m32K75%o41R24o03j86J016j383J064j47l88
3397a63O68q20L58M73m60L71q00M17K44p43J007q69R6J93m31P88o28K91J67o23
3417d64J080r91J05Q33j326R72J28q16J089r99L43L62m94N69p65P51k54m75R89
3436F37j192O35L12j195J100q38N21K81q25Q12n64J25L39m85L74k52J15N42n22
$$ y = [469, -291, 273, 409, -645, 574, -23, -767, 687, -490, -345, 207, -370, 182, -102, -135, 136, -62, 240, -509, 0, 33, -658, 723, -413, -304, 628, -564, 441, 23, -307, 274, -77, 269, 85, -115, 551, -401, 428, 466, -357, 448, -202, -95, 52, -341, 193, -54, -44, 184, -575, 594, -182, -93, 561, -683, 381, 126, -398, 615, -127, 355, 65, -153, 151, -196, 346, -114, -153, 334, -203, 269, -62, -536, 641, -512, -62, 625, -739, 159, 41, -331, 132, -311, 338, -94, 181, 181, -460, 464, -139, -325, 691, -692, 372, 225, -163, 505, -315, 43, 516, 56, 427, -373, 44, 288, -455, 552, -317, -221, -28, -459, 329, -299, -8, 159, -464, 616, -375, -270, 563, -763, 209, 337, -479, 610, -389, -46, 316, -178, 391, -374, 377, 123, -352, 637, -555, 80, 392, -803, 297, -541, -20, 261, -564, 248, -316, -191, 148, -337, 37, -215, -100, 442, -80]
3455h0O11m85m22J241j304N78J48o00P24p26K90O96j086Q59r08J89O54o66P55
3474D68n25k4M87p80O42o61J84M81q31R19l18l61P18j186J190j39p27J012q94
3493c45M97J67m13M48m98J75K83n78P32r61N89L74j191J249q23J71O74j129P97
3512B18k52J18J24m11L69jn67P67n19N89n32Q7M35o60M14J58n84N87p64L16L77
3533B69p88Q54n73K29L9l41O37l42oK12l20K65j60r4L53o10Q16n98J8O80r95O08
3555A53m7l46N21o54M79K89p13N59l79M8K23k8M19p52O8M80q06J029p79j04R80
3576F40j135R26n55l06Q40q57N82O5m79M62k96O67n10m50O80n22M55j48m63Q55
3596D51m06J7K10m80O83n93J90K92q04O17k50j65N21q15R48n74p7L06n06M84J09
$$ y = [-80, 531, 46, -376, 865, -439, 139, 287, -313, 411, -315, -25, 671, -415, 444, -464, -275, 379, -287, 468, -57, -81, 406, -374, 268, -393, -209, 272, -559, 360, 42, -319, 399, -787, 403, 264, -463, 549, -345, 152, 319, -94, 354, -144, 31, 314, -264, 468, -493, 96, 470, -721, 528, -295, -124, 550, -579, 218, -34, 84, 208, -203, 166, 165, -402, 365, -154, 435, -97, -10, 425, -235, 179, 337, -247, 340, -424, -108, 269, -519, 335, -238, -9, 30, -311, 326, -16, -22, 190, -130, 135, -25, -119, 234, -376, 440, -158, -140, 540, -455, 153, 106, -240, 281, -373, 106, 395, -318, 241, -138, -90, 133, 105, 524, -228, -160, 320, -486, 543, -236, -340, 640, -495, 431, -124, -430, 410, -447, 135, 200, -279, 183, -113, 554, 44, -406, 274, -248, 207, 59, -404, 451, 45, 62, 272, -208, 475, -118, 72, 364, -440, 177, -73, -238, 283, -532, 416, -158, -235, 71, -435, 49, 158]
3617A58l02O92q18M88k2l14O88n91j44M44l41N47k64j08K99q93P39n18L04L16
3637C60q67O52o29J91N25p71P22K01j045R55m63K27J84m35L96m65P49k53n99M13
3657D8k85J44M41o69P26k99k10K23m94O01l89L21J63q03P55m04J50N92j070M70
3677A1J86l71L67l25K28j89j05L65l50K83j29k77R70q37L0N92r01Q92m16n7R9
3698F6j03P3l38K49J73l25Q06o84m12J006q42K76J02p36P97k71J78j66j91L10
3718c2J7J23J43n44O33o07M32N14r47M11l66J07N08l59J03n26L72L51q10Q82p37
3739c32j47R32j033P61p6n28O06l14K99l38J03L82m25M11j19l44P30q01l10J183
3759F40r20N03k11l10N29m45N42m95PK09n07P05l45j82Q26j225N30M25p53O95
$$ y = [158, -144, 548, -270, 218, 196, -118, 570, -21, -165, 279, -62, 485, 221, 113, 412, -481, 258, -260, 44, 360, -507, 145, -484, -293, 232, -539, 183, 384, -661, 294, -169, 58, 242, -193, 203, -262, 487, 234, -365, 48, -237, -93, 348, -321, 405, 106, -104, 119, -375, 226, -163, 158, 321, -482, 273, -131, 19, 611, -459, 11, 197, -174, 193, -132, 96, -93, -198, 167, -183, 100, -29, -306, 664, -173, -143, 449, -452, 440, 24, -33, 66, -37, 36, -302, -53, 120, -205, 601, -83, -495, 511, -331, -55, 47, -689, 108, -163, 15, -151, -342, -32, -15, 108, 251, -293, 340, -267, 165, 679, -268, 143, -223, -116, 392, 33, 136, -390, -18, 333, -477, 405, -332, -479, 453, -580, 181, 105, -423, 183, -131, 168, -170, -67, 315, -110, 301, 182, -162, 568, -233, -543, 640, -280, 223, 12, -298, 231, -214, 328, -167, -160, 49, -458, 247, -98, -280, 546, -679, -149, 276, -477, 218]
3779B18k02n2K70j3j50m78M23L28n60M97l50j98O91q93O96j75l38P97o25k21L55
3800B0j16M36o68N32n57j73O72p79P09K6n16N61j19M9P9m55N54n36M47N1m75O47
3822C89l91k36R33j054O35M9l71K44l83K26O6Q3j65m68Q74m28m57O06m82J94L12
3843A76l55M42l37q9L26j31J06m97M82L33n27L43n13j52Q64j106J134m20m30O85
3863C34p29N03j35n35Q09n71K86K24o56R47o41N5K10m91Q81n44k7L26m51O00l96
3884aq4K18l37N93n54K23L13q35Q40j66m38L64m16L19J23n3J09o38P43n43k0O87
3906D47o80J2K82m70M22J24k03M33p75N92l16J24K74m13M33l12j92N36n78O89
3926D29l28o3K2j54J48J99o30L56j1p5L51o97O52l32M19O9o84N07l40j00J45j38
$$ y = [218, 16, -36, 234, 221, 71, -407, 16, 344, -216, 281, -69, -267, 424, -469, 227, 52, -286, 511, -114, -335, 20, -96, 340, -328, 204, -353, -526, 146, -633, 76, 102, -414, 147, 28, 77, 156, -299, 255, -281, 166, 217, -258, 389, -2, -238, 695, -359, 276, 325, -46, 198, -185, 41, 107, 190, 25, -443, 431, 3, -454, 152, -330, -136, 176, -179, 263, -74, -163, 163, 32, 138, -359, 123, 456, -71, 272, -241, -393, 471, -635, 499, 79, -351, 334, -395, 108, -27, -562, 247, -324, -38, 186, -470, 477, -164, -109, 101, -390, 491, -53, -80, 246, -205, 395, -1, -85, 133, -204, 389, -165, 58, 371, -464, 376, 210, -228, 136, -280, 39, 162, 109, 218, -420, 323, -220, -240, 447, -233, -221, 61, -409, 13, 137, -66, 367, -408, 184, -132, -8, 266, -147, 286, -26, -218, 318, -260, 429, 101, 38, 60, -94, 54, 253, -377, -21, -32, -107, 244, -453, 199, -133, 286, 355, -329, 178, -162, -262, -117, -255]
3948b55N49k35J07J79m80N02l25l13P07o97L60R9n82P97n73q3J59m09Q19n15N7
3969a32j34P4P49q72J76N45p72N05l57M04K91p01M63m20K27L93m48J94j34j23
3989g2N87p67K67m3p7L42m08J99J08n82N63l27K58P2m39O15o53N18J40o38N47
4010B10m14O8L51n43N20j88k83O63q24O51Pn35R97q96K81O7l98O56n52q6J36P7
4032c5j87P5qK0J0N33l43m39N38m27P60p77R5O21q87N76j34k00O12p30N80j33
4054A20m06P35q07K13K49k48K69k74L95k66m75N43j05K79p4o12O65k95j28M24
4074B02n00N60J4k64K66o19N43q5j55K90m66N91j28n43O69m49J55K60p14N93m43
4095b23O1M66p71O09k95p0K97k66J11o4l7O35p29L47Mq3K77n49M34j45k46N29
$$ y = [-255, 294, 59, 166, 345, -135, 367, 42, -271, 436, -261, 99, 198, -384, 413, -160, -243, -84, -493, 326, -189, -132, -266, -192, 557, -315, -139, 406, -366, 139, -218, 186, 477, -224, 239, -181, 46, 439, -9, 185, 51, -72, 515, -252, 15, -28, -105, 237, -171, 28, 136, -446, 117, -210, 48, 120, -319, 296, -357, 161, 301, -337, 210, -204, -136, 215, -328, 192, 4, -279, 384, -440, 211, 218, -317, 680, -216, 65, 132, -266, 390, -162, -248, -112, -35, -222, -147, -155, -135, -125, 408, 65, -374, 164, -263, 497, -280, -185, 436, -451, 125, -9, -209, 403, -327, 253, 120, -286, 449, -358, -145, 104, -144, 125, -149, 246, -20, -495, 48, -57, 222, 148, -464, 201, -94, -222, 202, -298, 262, 276, 12, 278, -341, 202, 117, -38, 252, -214, 377, 249, -294, 375, -74, 81, 341, -373, 220, -223, -162, 304, -467, 142, -153, -223, 74, -192, -81, -145, -182, 453, -276, 71, 75, -8, 269, -280, 154, 9, -237, 292]
4117B92n59L95pj31K13m38K89Q5k89M37m11J29j3k84M46j25l02K94m62M88k23
4138a76j7N60p59N16p2k80N83n19K49O1n62P27n84K98Q4j01L30m18K99p3q78P03
4160b9p3k6N9j31J76J08l96J79k50M95M5j79L32n98N50l06k87N64l30N0J43N0
4182A46j6k28L82l35n49Q26m28o8M58n82N03k40j28K93o09N95j94m7K57l60M19
4203I5m9l15L61n31P10p6m68Q06p39K34N9k16N38n56J68K03n21P41o21J78M87
4224D88p10M06m27J55L56m51M0K38l02L83n37N19k30j03L58m45N27j23m71P44
4244D15k34l44M64n66M44m32J66J15j09O02o15J30p0m07P22l31k74N54n14L5J68
4265h1j54N44q04O75k06o0L07m88K93J77j90L50m55K84p7m45O23k23J8o9j30J80
$$ y = [292, -267, 128, 121, -10, 203, -235, 54, 139, -150, 287, -124, 5, -8, -292, 154, 29, -273, 21, -441, 47, -176, -193, 367, -392, 124, 52, -228, 355, -164, 85, 146, -416, 311, -273, 25, 109, 8, 338, -80, 219, 146, -732, -29, -102, -128, -69, -200, -24, 84, -312, -133, -383, 112, 157, -22, 310, -288, 262, -44, -331, 233, -97, -47, 96, 146, 130, -98, 284, -51, -600, 226, -202, -270, 188, -394, 109, -131, -259, 34, -575, 20, -174, -221, 36, -324, 95, 46, -269, 92, -439, 271, 195, -273, 533, -206, 28, 87, -129, 409, -147, 21, 224, -297, 444, -177, 1, 488, -222, 184, -243, -88, 268, -183, -143, 95, -207, 176, -361, 158, -72, -175, 183, -262, 265, 142, -329, 415, 181, -163, 301, -265, 179, -253, -87, 28, -81, 521, -94, 36, -34, -441, 281, -50, -324, 230, -284, -249, -81, -235, 309, -495, 180, -26, -86, 221, -267, 26, 203, 13, 363, -92, 192, 115, -330, 293, 70, 88, 19, -111, 69]
4287F9j21J45n9m02P22l82m85P29o07K60K24q3J47k64K14k89K46J00k82J48K4
4308E4k01N08k43j48K91l88M48j53l8N9l61K08P8N6R2p58O48l84q8N21j73J15
4330A43J82k10J03l08J17j02J09P7j69rL44m29K90j10nK28m80L92j46j29J40l84
4352c56M63j79N1L50n08M58l27k27N55n01M02K18m79J08r7J29K32m41M07o13M77
4373A22n7k05M05l82j23N08m80N19l48j28K07j7rk69J12J58j48L55j30k16L69
4394B43l03mJ49l96N46k92JK15l87O52n43J96R9n25N06k32lL13l96K55J84k96
4416a8J04l64N98o01K07M77k64j5l28J81K90m77J21K65n12N72l17J56j49K09J75
4437C10m08j5M06p11N64Q9n72P20o85M53k2l22M89n03M09k40L1J20l62N23k2l39
$$ y = [69, -52, 93, 34, -368, 354, -28, -513, 216, -391, -131, 93, 10, 157, -107, 107, -182, 64, 164, -118, 30, 54, -147, 361, 118, -30, 261, -127, 321, 168, 130, 189, -172, 36, 114, 170, 262, -496, 152, -232, -320, 201, 28, 143, 325, 115, 218, -90, 27, -75, 34, 111, -58, -67, 277, -152, 138, 28, 23, 251, -229, 163, 17, -112, 28, -356, 107, -72, -21, 329, -179, 279, -48, -275, 280, -221, 181, 399, -80, 28, -69, 60, 292, -149, 258, -355, 122, 65, -140, 265, -117, -240, 268, -212, 307, -41, -169, 38, 21, 12, -257, -145, 13, -135, 220, 90, -126, 243, -60, -64, 85, -311, 235, -57, -56, 159, -228, 424, -119, 77, 176, -349, 157, -75, -78, 235, -161, 94, 278, -18, 86, -278, 320, -281, -74, 403, 139, 124, -204, -23, 267, -210, -89, 176, -336, 236, -81, 75, -74, 135, 310, -98, -113, 293, -418, 146, 235, -337, 383, -302, 151, 129, -193, 296, -207, 202, -38, -7, 113, -249, 274, 252, -87]
4459h7O42p05M0J35l46N43k53j63K40k78N05l08l3J9j7N16l85k97L21j91M02m04
4481a04J01L76n70L07m20J83L87o26N26k01k95P70o87K61K28l09K45j42k37J57
4501e0k86N44m79L53Lk10L70j77j84J96j08O2m8j80K67%P6j25k25L86o34O19j88
4524a8j29K20m21N53k23j35L38k42K05j62k73M86l23k39Q70q67O17l7p7Q8k38
4545gQ9j23R9P8k20j1J46m00M65o57P55j07n47N57k93J79J88k33N2k73J46J69
4567E2k15M56n56P9M15p25P79k44j42M57o49N27k58k46P38n31k87L98l16M58n36
4588c46N22j10k40L25k46K79j93l43N62k77l73O28n8J76m10r2L65l86M15j43l09
4609b54L72m77J10M35n27P39o37L97m24P7K10r5K5qj77M22l08J37K94n57M69k04
$$ y = [-87, 555, -150, -110, 25, -321, 222, -31, -194, 46, -232, 273, -35, -68, -49, -66, 450, 65, -232, 89, -102, 300, -104, -3, 373, -197, 110, -310, -127, 260, -366, 160, -41, -336, 434, -253, 8, 236, -73, 172, 30, -207, -50, -336, 208, -271, 82, 85, -125, 245, 68, -116, 80, -28, 34, -14, -194, 73, 73, 149, 24, -201, 185, -449, 170, -18, -147, 73, -348, 205, -18, -153, 185, -57, 148, -14, -287, 199, -124, -363, 507, -360, 257, 220, 143, 231, -7, 82, -41, 58, 136, -84, -95, 51, -349, 116, -541, 214, 107, -440, 117, -176, 3, 191, -42, 10, -263, -117, 52, -163, 293, -263, -184, 231, -494, 285, 41, -101, 356, -293, 234, -24, -270, 468, -63, -350, 48, -268, 190, -346, 176, 66, -174, 151, -95, 184, -9, -352, 210, -67, -440, 188, 130, 306, -104, -196, 169, -217, 198, 55, -254, 118, -359, -249, 186, -341, 398, -239, 158, -266, -189, 21, -74, -49, -57, -234, 188, -120, 17, 311, -246, 223, 19]
4631A9p8M35m10K18l88J59L25l75R4J65l33N15l86K62p3k24J44l14K25J36k78
4652a62M53o67M52k49j7M62l30m3J93m00L35O9k02J25m7K00l01P9K22n47P67k96
4674I6q2J63l51L96j05l16L40m43M96r6j27J29k70K0L42m88M41k02j21L03l04
4695a79K70L1j68P3l06N48ll81M60n93L24J30k41K29j84J85J69m06J96k71K16
4716I9q7p3J74j32j14O4k94M63l19J87K98q14Q12P6l91J66q8J44k86Q2O8j61L74
4739B48m15J2M13o19M98o7j79J86l83J07L42k47J82k92P2J59k19M67l38k1K48
4760A54k50K90k20Q0R3k49J98j8J48J23o38O18k72n7L25m47K50J06m59J40J14
4781B9m21N11l71M03m04K62J26l73K19m57P56J42m02j09J74j06K31j49M05l26
$$ y = [19, -59, 376, -34, 184, -204, -45, 280, -95, -1, 164, -169, 346, -40, 222, 149, -75, 69, -245, -20, 116, -162, 291, -376, 76, -173, -190, 272, -58, -101, 92, -308, 27, 96, -106, 19, -28, 172, -129, -50, 172, -375, 392, 96, 14, 177, -174, 222, 117, -199, 141, -302, 194, 98, -29, 100, -170, -150, 192, -296, 145, -57, -178, 125, -179, 91, 122, -46, 27, -279, 269, 266, -115, 345, -248, 76, 206, -35, 194, 10, 195, 364, -42, 154, -117, 99, 12, -61, 113, -19, -133, -69, -363, 100, -219, -32, 266, -548, 264, 340, -51, 115, 27, 171, -115, -33, 35, -126, 248, -167, -155, 258, -361, 137, 70, -109, 77, -306, -199, 143, -104, 78, -214, -142, 17, -202, 265, -73, -94, 154, -96, 194, -26, 54, 147, -102, 96, 78, 226, 349, -289, 329, 57, 0, 325, -122, 128, 234, -225, -85, 29, -392, 119, -252, 151, -253, 9, 135, -238, -19, -476, 280, 422, 20, -89, 85, -21, 210, 61, 466, 140]
4801A40j23K77l65J96j62k47M08m45L40j9k19K74k21J92J95l69J97k1J6Qm29N21
4823A44k4j32J10m69N18J65m38K86k87L25j97N3N04o38J94j6m11P59o98M17r4
4844G1n31P00K8m36L11k35K01j97J35K73n79L07J71k93M27n67J02K99l63J33o4
4865a07L61L5n23O71m84K39j15k96O34n90J74j24m66J095n64k46M28l71L04l95
4885c40L18O0k18N36k87m68M60k86M76j74m21Q21l45l05M20k94K40k18L58l87
4905e4j4L82p59M72K13n56N45l82J57K61l98L60l71K04J08l63K79n36J93M12j04
4926D9K32j74j81J79n4j67K33l75L44j23J3L24m06N68o70L32r5k39K62j43J42
4947E1j97k99M01J47Jk77k48N46q3N8J89n37O19q6l65M97n06j1L81m73M10l23
$$ y = [140, 17, 294, -71, 125, -37, -284, 124, -321, 19, 0, -219, 55, -166, 26, 221, -148, 49, 28, 44, 52, -377, 144, 120, -12, 98, -371, 147, 312, -126, 160, -127, 198, 1, 54, 558, -80, 114, 98, -313, 446, -252, 165, 71, -460, 240, 268, -168, 143, -92, 109, -88, 47, 320, -259, 48, 219, -74, 353, -214, -112, 187, -176, -43, -107, 254, 289, -234, 437, -47, 192, 77, -219, 415, -175, -1, -125, -591, 504, -60, -306, 122, -249, 55, -340, -22, 38, -180, 356, 69, -399, 61, -225, 251, 77, -344, 477, 132, -173, 247, -47, 193, -25, 333, -54, -68, 314, -445, 27, 240, -316, 229, -153, 4, 265, -133, 227, -144, 60, 168, -195, 84, -452, -259, 153, 49, 281, 107, -74, 105, 51, -116, 117, -258, 86, -37, -24, 300, -106, 462, -208, 124, 29, -210, 52, -91, 51, -146, -445, -44, 103, 104, -173, -421, 125, 42, 100, 289, -248, 371, 285, -80, 417, -89, -100, 281, -192, 218, -105]
4969a05P1L15n63M86l87K98N1o65Q13k58k46N41p03L55n4K4J00J56J43n03m8K58
4991G9l18M29k34p6M41n14L22p5j27L07l88L81k5n38M69l14K94j5k52K86l4n5
5013D3K5l53K86k51P9L74l51L66k17j67K98l32K56%k06M24k86o8N02m64P2m7j18
5036a35K16m27O53l87RL19o54M88l59J41M90o21M36l6k08L03o70M08K16j35K26
5057B73m42J13o3j0J40k72J60o6j94N11R8m10L79m87N52m55Q5N18n13j23J14l14
5079d06P01m72K9Q6q9L62m75L68kk74N61m87Q5Mk21K26j94J43J57k19L56l44K31
5102A26o7q8J43l91N71n41l7J69l5J33N0n13M84Kk40M14l09L94k30j78L35l42
5124a50J52n8k65N59m40O1M41m37M63p26J12K49l50M81n4j30M70p16L30J20q5
$$ y = [-105, -34, 281, -282, 204, -183, 115, 166, -499, 314, 56, -190, 351, -352, 3, -51, -27, 73, 229, 372, -131, -179, 79, -239, 190, -44, -120, 321, -193, 129, 54, -73, 234, -154, 227, 202, -336, 133, -181, 113, 98, -154, 132, 98, 43, 68, -285, 1, -250, -171, 203, -148, 218, 1, -166, 132, -200, 56, 56, -150, 274, -12, -80, 422, -42, 30, -17, -135, 81, -346, 307, -80, -71, 248, -406, 82, -277, -136, 354, -267, 169, 133, -75, 228, -442, -34, 182, 47, 273, -169, -56, -119, -129, 11, -261, -101, -167, -361, 150, 248, -162, 217, -270, 282, -173, -88, 430, -83, -206, -92, -406, 295, -177, -148, -62, -151, 211, -264, 104, 102, -172, 389, -98, -13, -9, -230, -4, -198, -55, 102, -117, 239, -105, 126, 59, -29, 114, -277, 294, -247, -284, -115, -150, -17, 33, -480, 4, 6, -234, 180, -129, 265, 35, -143, 192, -150, 2, -56, -321, 238, -202, -141, 300, -137, 326, -400, -288, -39, -389, 92, 38, -92, 378, -338, -8, 112, 27]
5145B7J94o89L79J73l49L50k3j16J29j68L33l32K55k5j77L18l21l15N79l16L05
5166B11k45J50j26j00L36m09J05K55m40J71Ok62J22J03J66K3k76K15l3j8L11l22
5188e7N18n57L63L9n61M68j37r7K11m16L29q5NP4j72K23k76K55o9l58J50m6J74
5211b2L20n21M0M12m70M20m54M55m84N2L37r2N8R8l79M14k02k55N27m45K58j18
5233e1n6J38j6pl26J66L91p23O79j36r7K66l99j27N17m35L71j79k60N02l62K64
5255A20m01L38l0j40J90O6k68L72n74L94J58m62L46l48J42R2j57L52l70K17K01
5276B38l81M67m09J42J10l27j30M64k26K26l55L39j72J84J77q18O32L7q2R2m23
5297b15K49rk3qo5l8p0K63l0l74M51K7l21K40l82M29J26l52J15n2M6kk61L30j05
$$ y = [27, 221, -468, -89, 84, -265, 85, 62, -54, 75, -93, 240, -92, 163, 138, -39, 279, -42, -357, 222, -94, 211, -34, 116, -10, -110, 226, -183, -78, 177, -263, -92, -86, -348, -226, -123, 43, 66, -210, 5, -28, -46, 265, -57, 461, -96, 267, 306, -255, 213, 76, -21, 190, -226, 103, 18, 23, 97, -75, 148, -128, 127, 58, -300, -150, -196, -22, 298, -223, -183, 229, -241, 179, -275, 180, -304, -252, 85, -7, 51, 149, -230, 184, -18, -273, 254, -191, 67, -51, -107, 31, 15, 8, -318, -152, 239, -484, 195, 59, -38, 228, -171, -298, 219, -216, 155, -24, -284, 218, -144, 120, -281, 57, 27, -113, 77, 143, -125, 247, -327, 67, 225, -237, 109, -239, -97, -5, -162, 190, -180, 37, 238, -143, 324, -85, 57, 167, -160, -290, 174, -52, 174, -181, 158, -14, 170, 347, -471, 161, 198, 116, 208, -215, 34, 25, 2, -6, -71, -109, -179, 84, 54, -320, 131, 158, -163, 77, -305, 124, 250, -102, 13, -39, 7, 5, -256, 74, -31]
5322c1J73R2m94M24j7k13M51j90l46N18m95L92j94q1j68RM68m34N67j11o43L88
5344F5k75O9N45n11J26j01mlK0M34n24J76L45o67L62J2j71L20k36k68K59o8P5
5367b0j84J21N2M1K35l77J43J36k66K93m53K99J77l09J17J42K0k67K9K49k14j7
5389e3L13m59K66p2j59O15o23K27m2k93L95j29J30l09L00R5r4R0J6n28L96N6k61
5412a23M3j68M08m0l7j36j20L39l6J17m1k35K03j15j62M71o61M69j93o1Q8j24
5434a14M8J11j74L13m10L39l0l17K53m74M11J73m47M69j86J1K27n80M97J91m02
5455i1K38k44K19o2j87O57p93J57J69m62M93k67L43R4m55M00k98K24J10k30J94
5476B09k88q3O60p02K88R5j5K4k39K93m92J53K94m44M52J4o57M22k01L14l2k72
$$ y = [-31, 142, 234, -260, 164, 147, -66, 385, 195, -151, 367, -128, 264, 70, -11, -179, -170, 298, -136, 431, 320, -323, 65, -210, -141, 404, -107, 19, -82, -86, -89, -69, 365, -159, 17, 362, -305, 57, 69, -102, 218, -18, -286, -27, -95, -20, -204, -83, -31, 10, 245, -132, 11, 147, -119, 174, -279, 20, 197, -112, 5, 147, 167, -100, -71, 178, -36, -53, 260, -199, 67, -5, -164, 451, -172, 55, 13, -280, 115, -14, 116, -193, 107, 202, 108, 198, 214, -314, 82, 138, -123, -80, -248, 160, 120, 83, -53, -173, 166, 130, 247, 206, -29, 174, 59, -103, 368, -293, 176, -17, -78, 10, -114, -66, 45, -129, 184, -226, 113, 83, -234, 19, -455, -44, 129, -318, 151, -35, -24, 203, -377, 120, 311, -91, 147, -97, 122, 60, -127, 530, -263, -106, 63, -399, 94, -173, 170, 264, -191, 209, -89, 135, 245, 15, 209, -79, -162, 498, -204, 84, 179, 164, 188, -51, 242, -250, -97, 197, -247, 205, 219, -438, -16, -217, 97, 65, -207]
5498b07K54j95M9J63l13L64o6j43L12n77L27oj4R2j86r5L00l4J95j32L9j88K03
5521A42K35n67L04Q9n47L14r4K06j26j42O8j49M44Rl90J31K47j86J5l42N26k89
5543a02L89O6n15L14p1j49M39p33M51j16j40M60n91N41k02k72K95n5k70L78n15
5564c98O79m85K4K79k20P20o99k8K22j78O04m03j06O5l84N74l26K2qJ35r4o8k99
5587c72M77k15J42l6k28K72j90jn2%L28k22J74K09l67J97k14J46K41k69J72l29
5609a37p1M31k09L29l89r1O9k77M63m9k14N10l64K71j61l10K75m28K00K44l02
5630b10J18n1Q0J08n10P69j86j20J7j64l0o8K39P2p1K22l09j25M72n75N83Jo69
5653d07N85l38M22k93m6J42m9p3m2j40K75k31L86k59l98P82n06J41R7m35L70k75
$$ y = [-207, 47, -148, -99, 64, -249, 115, 49, -94, 218, -359, -32, -38, -52, 40, -146, -241, 59, 25, 220, 88, 127, -61, 142, 377, -190, 114, 203, -344, -30, -124, 82, -44, -186, -118, -267, 177, 186, -204, -73, 174, -12, 3, -339, 187, -102, 287, 353, -162, 152, 81, -68, 371, -362, 89, -27, -167, 293, -298, 243, 41, -231, 64, 9, -261, 117, -398, 281, -204, -180, 99, -121, 599, -100, -128, 94, -84, 520, 117, 11, 76, -308, 266, -60, -38, -46, 89, -5, -73, -372, 105, -110, 32, -4, -232, 40, -150, -151, -203, -203, 125, -97, 77, 286, -81, 116, -98, 48, 289, 20, 192, -137, -208, 223, 14, 343, -46, -137, -68, -345, 118, 69, -145, 365, 1, 272, 111, -199, 76, -352, -152, 92, -210, -92, -143, -63, 45, -465, 304, 118, -2, 15, -149, -179, -247, -8, 64, -7, 215, -94, -219, 253, -322, 261, 262, -407, 178, -160, 262, -31, -77, 65, 16, -57, -99, -239, 36, -195, 191, -68, -466, 316, -190, -49, 48, -387, -17, -292]
5675b92J06M40o66N17M4m34K23K04j55J2n8L55m97K80m4k11N61o11P6N16n04J85
5697D7m2kL5k22L79l36j8M25n93N38j12j46L32k48K81k96j1J81j20j35K30k31
5719f4L56o42L08K26n16J55L2R9J32p4J58m17L35K23l25K07l91L08l8l03K42J0
5741B1J4J79l20l3J56o2M84o10M7J88l20Q38m57k79L42j38J36j52k56N61n86M96
5763B49m07K27J96m91L07m3p1J36j65P7J51k57L01j35J52l24o8M19m3r6j37j48
5785a70L10k04j1pp2J10m9J38r8j44J81Q2l15M76l34L15k22K5J63k94L22k41J16
5808G7Rm54O71l03k62M08j72J10p4pL57o39M11j54l87P36l67j69M64n08N66m48
5830a35l15O42k43L8j32J86L9k58L76k92l1L26m63L72J79m66M40L6n73J89m7M13
$$ y = [-292, -186, 254, -412, 105, 149, -285, -62, 142, -13, -1, -59, 296, -201, 79, 35, -176, 385, -226, -150, 366, -138, 47, 5, 3, 38, -184, 195, -141, -159, 266, -327, 211, 99, -47, 285, 37, 318, 22, 11, 192, 72, -63, 167, -64, 292, -350, -42, 184, -332, -177, -145, -46, 86, 12, 170, -247, 88, 311, -14, 193, -198, 110, 72, -231, 11, 21, 35, 214, -106, -139, 17, -45, 439, -171, -124, 64, -256, 582, 125, -154, 188, 50, 186, 34, -222, 339, -247, 249, -158, 69, 265, -226, 81, 38, -33, 103, -62, 15, 166, -91, 210, 75, 227, -97, -165, 254, 211, 115, -22, -170, 140, -64, -75, -82, -154, -44, -93, 45, -53, -197, -16, 66, -249, 227, -107, 208, -14, 11, 174, -120, 202, -39, 77, 86, -368, 303, 0, -262, 146, -26, 84, 10, 3, 360, -279, 132, -22, -409, 327, -40, -209, 255, -253, 313, -135, -450, 192, -51, -13, -145, 41, 80, -178, 198, -94, -125, 201, -262, 110, 289, -177, 263, 299, -274, -85, -132, 281]
5852B81k67J05Q0l05M10k89j91J99n2J32j17j70K40j58J08K05m91L62n15N73j67
5873b7J95l1k77J61J49q2M8k05J99j03j68K53j00J00K54o48L89j36m0L80p40O79
5895B50l03k05M83m30K11m8j90O21m14K66k10l27M61k85L1M85q02N27k49J87j15
5916e6J18K17l27k4K39k81m6j08J71L35k34K89k98J2Q6k56M61q1l27K25k89J15
5938e9J32k51K44rO2J99m05K89l05J12j77K96R9l73K79n4m06N24l46p1J59k78
5960c39K63j65J17K46m69K16J9j63M01l54K84j46k5K34j07J26k12M3L3m0k38M17
5982A41k96L73j14p3J06l70L08k71K24ml85N55m13q0M71l30K53J5m11J40j72N54
6004B21oj75M20n54K92k91k74L69r9k64O46n02M16l51k13M00K5J71m20L8L90n11
$$ y = [281, 14, 119, 199, -106, 304, 15, -176, 23, -29, 103, -14, -184, 56, -102, 6, 211, -280, 82, -433, 140, -27, 168, 137, -140, 21, 170, 88, 136, -69, 130, 27, -141, 112, 12, 112, 366, -282, 107, -29, -69, 311, -429, 250, -53, -258, 225, -205, 6, -42, -232, 389, -25, 241, 31, -296, 165, -120, -89, 396, -406, 121, -128, 59, -56, 62, 279, -48, -72, 167, -114, -160, -268, -97, 238, 4, 293, -5, 7, 93, -163, 298, 217, -110, 115, -174, -59, 73, -178, 66, 57, 119, 318, -87, 202, -103, 9, -168, 128, 227, -146, 133, 79, -327, 197, -149, -220, -61, -339, -76, -241, -124, 122, -347, -131, -112, -275, 126, -228, 56, -90, -115, 119, 12, 138, -74, -31, 2, -38, -276, 141, -155, 218, 104, 31, 137, -233, 75, -196, 28, 24, -361, 194, -219, -299, 172, -158, 95, 110, -301, -161, -333, 221, 215, 40, 460, -94, 198, -93, -367, 2, -97, -361, 285, -217, 199, -152, -365, 35, 60, 231, -189, -151, 239, -272]
6026b72N44l10J7L79m56J96O7m80M51r9L3J7j60J51k23J88j16P6Q9k11j98M14
6048I7m27K78n0K0J87l03M19n59L52J47l64O2K86m72M86k05K22r2m65M38j22k
6070f7L69l95L08m64J64K59k73O0P9J22L8k71J29p8r6L10k84J24k90J20L23n22
6092c35M09q5k03L16l44L41M0k35K00k36K41j18k38L13Q4m07M52m34L98j09j53
6113a03J97j12J08k15R5L00o11N58k36r7J75l68M02J1j35K36l23J86Lj29K32j19
6135E5l1J04j91J41r1N8J38k51K63n3k17K51n90K56K79p1J83k88L26l03o1L26
6157B33l03J28k5j44L47n51L80k80j54M17r2j05N8o6K67l51K81K59k33J71k14
6178B3M4M3k40O9Q1m3K16o21M31k69R1K81k55P6J64k35J81k2k90L46PNm02J65
$$ y = [-272, 272, -38, -21, 358, -98, 98, 165, -315, 136, 37, 70, 87, -73, 78, -145, 43, -73, 3, 92, -119, -317, 97, -330, -52, -102, -82, 105, -198, 221, -338, 14, 161, -203, -141, 145, -327, 159, -46, 176, 84, -381, 57, -65, -67, 302, -93, 215, -249, -85, 174, -99, -39, 40, 162, 200, -71, 58, -20, -116, 194, -90, 34, -256, -136, 187, -335, 74, -11, -214, 102, -242, 99, 139, -96, 104, -132, 109, -9, -247, 66, 150, -257, 195, -239, 159, 50, -103, 94, -18, 90, -125, -30, 270, -341, 217, -19, -116, 59, -309, 93, 104, -31, 205, -118, 68, 71, -58, 174, 55, 24, 128, -63, 78, -13, 45, 183, -68, 195, 142, -75, 176, -414, -158, 121, 50, 233, -55, 271, -32, -93, 233, -70, 58, 33, -111, 236, -315, 65, -215, -369, 48, -44, -149, -91, -157, 110, -241, 40, 299, 66, 237, 23, 67, 110, -130, -61, 20, -23, 193, -428, 3, -266, -175, 106, -149, -73, 91, -144, 37, 15, -275, 71, 78, 83, -319, -154]
6202a54J12k30K36oN32l59j53K26j15l07M98j59r4J60k54L35p03L10Q2j93L25
6223H9l8k38P8L52l9j06J1o5q3L08o01O21j91J21P0j38l09K24mm8k88K41L09o49
6247c73L53L66n89K92n3kk04o8L20l73L39J5l77N14j92K32j00l03L28k4J33j02
6269A32k44L32j12l7Q9l75J89j76R6J76n8J21Q3l12M00m34J29K89l60L18k96o
6291e6Q0k26M10j88l05M97m72N51j79J86l58K0J27j63j9L84l68R1R7l78L85l00
6313a84M21j76k48L53l27p5K78o9P4j12K9J91k83M35n56M93k57j75M68n25L12
6334F7K09l20J88pk96N20n61L10j31k01L20o56N91r6M5O9k23J15n5K15k90j12
6356b99L33J88n20M77l46M6L91k41j51K44j09j97K74q2lj90L63l63L86l58R7O0
$$ y = [-154, -42, -272, -36, -42, 490, 131, -22, 204, 89, -218, 280, 121, 27, 187, -67, 268, -435, -125, -43, -236, 89, 51, -187, -109, 243, 204, 98, 109, 44, -39, 269, -332, 289, 98, 219, 289, 151, -158, 66, 62, 14, -274, -33, 276, -373, -20, 346, -243, 49, -4, -6, -210, -278, 42, -331, 8, 23, -354, 160, -32, 200, 100, -203, 125, 101, 234, 132, -112, 220, 108, 71, 160, -215, -26, -202, -106, 70, 12, 133, 216, -96, 304, -130, -1, 288, -72, 246, -50, -56, 24, -202, 208, 20, -285, 212, -260, 291, 112, 298, -60, -40, 87, -76, -95, 289, -79, 12, 109, -269, 116, -184, 237, 61, -187, 166, -161, -236, 42, -27, 47, -65, -36, 155, -128, 307, -249, 244, -13, -188, 280, -245, 67, 276, -44, 144, 137, -159, 361, -200, 110, -21, -222, 98, -558, 33, -63, -18, 51, -172, -57, -112, 103, -187, -299, 34, 222, -298, 179, -167, -121, 270, 29, -122, 122, 13, -184, 90, 8, 5, -185, 178, -185, 201, -157, -60, 0]
6378@k18M2K79l33M59r9m30L63j70L1q6K12L8k90M00j74l2L64m35K22j69j75L98
6401A97n03N92l36R1K85n64M16m25J53O25o51KR7k5M27m64K59k3l26J56j55K16
6423D4K99m93K41L1j80L19m94J30L40l4L5j33K53m37M8J50m36K95k49K24K79n37
6445c05L88O3k89K80l41K26lK12K7j78O1P0o08M57l00L40K10m75M03j93J5R6m07
6468b51L50r0j03m7l53M82j26j12K81l6P6k8j94K24j47J58j13p8L03l17J22J81
6490A82n73P22k55O5J27n18K15Qr4M98l68J70n4l38J77j87M90l75j02J94k72L36
6512D8n1j92L36k76K75K7k41L01k09M2j36L5J52j92k0K84l10N45n57J09Q9l15
6534b56O01n47L3K70L3Q2k28j8j3q0Q5K47j12M8k0p4m3J1O5mR4n1k85K59k74J04
$$ y = [0, -218, -176, 103, -230, 229, 130, -300, 63, -107, -76, -162, 50, 88, -202, 198, 24, -8, 356, -79, 143, -26, -201, 197, -306, 286, -50, 41, 326, -238, 178, -247, -94, 531, -120, -118, -21, -46, 381, -83, 176, 153, -173, -17, -172, 44, 343, -150, 91, 122, -58, 261, -233, -103, 237, 203, 238, 105, 358, -79, -31, 119, -317, -22, -271, -47, 232, -305, 83, 146, -143, 137, -204, 22, 19, 231, 258, 80, 141, 211, -397, 60, -240, 100, 310, -165, 238, 45, 60, 156, -251, 99, 9, -94, -141, -494, -12, -138, -250, 31, -5, 71, 43, -151, 73, -74, 84, -29, -107, 196, -121, 1, 182, -391, 331, 76, 141, 268, -250, -35, -27, -121, 377, 9, 179, 125, -213, -36, -223, 267, -108, -210, -16, -288, 48, -3, -195, 141, -135, 140, 167, -74, 227, 18, 60, -76, -41, 111, -81, -101, 183, -127, 418, -139, -30, 59, -256, 345, -202, -169, 101, 134, 216, -12, -30, -43, -123, -38, 209, 97, 145, 125, 51, 8, 19, 84, 80, 174, 123, -162, 97, -177, -73]
6560g3L21n29N16j46P4J0m58L68Q1m34L07j34J11k9p8p3K56j53R9k00M05j84k34
6583a77K99m38L06K58o6J43l43J56r1K41k03l45N17l6m86M13KP2n0o7j30r8L30
6606B07l30J39J95m34L4K93l67J60M5k35K98n6K88k03r1P5m7K24m62K26K5n7J74
6629A01k9k97L81j88j0J95j18pmo9K41j95j07K28j09K22l70K03l28q8L20k78L94
6652H8q5j40K45L0k08n0O8J69m89L83o2Q9J72l38J97k2j04J85l84L29j60q6J76
6675Cj91K26K08m51K70J6r4J99l69M45j49o2J67r4j67K38K0m0j09J32rl30K87
6698A46K6k60K86m92N74l02l30L18Q0K43p21M69N3j18J20r4k0P3k08Om0J81M10
6721D00l83M5o8n3J28n3Q2N5j64K45l88J52O5j57O7o8p0J92j20L08k82p5L00l67
$$ y = [-73, 248, -281, 235, 89, 163, 173, -285, 83, 164, -270, 37, -97, 14, -15, -93, -166, 90, -63, 36, -164, 241, 57, -177, 122, -316, -10, 248, 182, 325, -18, 138, 47, 288, 85, -260, 257, 221, -265, 148, 150, 222, 172, 105, -25, -123, 207, -123, 16, 211, -223, -189, 104, -263, -103, -58, -293, 5, -51, 237, 34, -57, 18, -29, 195, -267, -41, -16, -73, 101, 72, -225, 156, -32, -42, 153, 35, 28, 24, -45, 196, 1, -106, 122, 13, 235, -135, 68, -260, -348, -28, -306, 88, 3, -137, 108, 138, -70, -120, -52, 117, -372, 11, -51, 38, 210, -128, 69, 47, -57, 128, -256, 73, -87, -173, 3, -188, 38, 246, -205, 65, 81, -13, 186, -183, 262, 113, 51, 218, 124, -43, 195, 215, 175, 66, 198, 189, -141, 146, 172, -88, 198, -294, 280, -22, -352, -34, 46, 289, -432, 37, 90, -28, 92, -2, -22, 51, -157, -151, -191, -10, 400, 17, 62, -6, -59, 69, 16, 98, 153, -11, 234, -154, -2, 63, -94, -27, -95, -165, 27, -93, 215, -67, -142, 158, -209]
6745b09K92J66n02L28l43M13j27o8J58J7J4k84j25L57j14MJ28k40N3M2o6K08l3
6768F9J59l93j16M44m12M74j88l04M72k57K60p1l8J28l67K87o9k1J3l27K76K72
6790B91l65K17l57L46l05j22J99J1L48q7l06L59m01L76j31l74N13k17j52P8j37
6811b16J60K2J23j74j06m2M5K26N7o2J7j69LM84o16N18q3m22L00K8j39j20J69
6834CR9l29K01M14m54K07l12M20j60k91J67p4M1J42k44K00j28M3L36m53J8K67
6856A13j26J14l63R9N46n14L82m23P1J76N9R9k38k3j45r7N98k87J4j43j33M73
6878B52Ll26J69p5j30o5K21K2j99M07j25k07K60q0k61J04O8K40j62k10J56j01
6900c9L14k17J15J05o76M68q0j42J84O4k45J57N1J04m41L93o1j71Q9j16N6J8j54
$$ y = [-209, 83, 249, -253, 75, -268, 145, 18, -50, 108, 125, 139, -145, -270, 87, -27, -23, 105, -135, -82, -40, -106, 102, 69, 228, -165, -281, 163, -249, 225, 37, -267, 205, -52, 208, 137, 99, 227, -140, 147, 78, 57, 70, -257, 19, 291, -74, 143, -214, 132, -173, -295, -96, -85, 263, 176, -130, 229, -172, 204, 73, -301, 212, -5, -157, -79, -216, -56, -34, 89, -85, -191, -233, -188, 38, 95, 33, 50, -119, -116, 368, -248, 270, 187, -235, 65, 93, -46, -166, 3, 102, -227, -26, 388, -66, 141, -171, 249, 89, -202, -35, -109, -68, 74, -170, 30, -98, -55, 281, -172, -154, 113, -13, 101, -262, -163, 383, -131, 251, -172, -101, 75, 134, 233, -5, -28, -173, -270, 328, 41, 55, -88, -221, 252, 255, -71, 98, 23, -107, -172, 49, 71, -128, 279, 154, -53, 207, 127, -134, -30, 38, 278, 116, -94, 62, -39, 275, 58, 173, 278, -398, 70, -10, -152, 32, 96, -149, 8, 59, 163, -278, 115, 54, -117, -28, -144, -88, -70, -224]
6923b24K65l24M07Kl46K39J52K5k70K41k10j67m5L52q4m0j42j0M39k63k02O6J2
6946a27J67J29q6j20m05O30k08k50N6M2N01p17M05r0Pk2Lj09K90j05R9q3Pj70
6970a56J35k06L19Q5j86k07L55K17m5j44l90K03K82k66M65l71q5K85k02K24n63
6991b51j1M85l39K02k8q6R3j74K51k66Q9L45j84l7r6Q3j52K89r5n1l69M44j53
7014a1K23j30J69M2n68J97J33N8j12K60n16L81m9Ko5q0M25m82J44lK64k97j2K07
7038A80l83q2K65O6j16q5J29L34n73M11k21KJ57N3j33p9j81L66j04k42M45n95
7060c86K75M6J06r4j66L59o4o5J41l52K86j93lK75l34K32r2Q8L8j32J09J66j84
7083E6K24j68k74K50j6K78n97M15m09j11L67k16J10J30l91M48P6l47K93n4K53
$$ y = [-224, 41, -283, 124, 126, -220, 19, 171, 196, -74, 167, -43, -210, -255, 97, 13, -27, -169, -179, 260, -3, -205, -139, -127, 40, 169, 83, -37, -442, 188, -20, -270, -214, -172, 329, -388, 17, -73, -66, -88, -85, -194, 96, -9, 90, 7, 14, -156, -21, -227, 92, 177, -9, -216, 139, 356, 311, 167, -223, -20, 262, -4, 461, 90, 5, 290, 88, 312, -251, -262, 223, -116, 86, 58, -28, 65, -109, 142, -124, -35, 310, 126, 89, -7, 76, -76, 213, 118, 67, -302, 142, -11, 212, 82, 251, 293, -275, -78, 55, 113, 1, 261, -255, 126, 77, 79, 14, -66, 359, -123, 21, 18, 282, -15, -27, 180, -203, -285, -20, 46, -70, -155, -26, 308, -265, 146, -75, -73, 84, 137, 4, -75, -256, 110, 6, -236, 209, -386, -111, -65, 41, -53, -219, 140, 76, 11, 152, -200, 86, -107, -110, 165, -169, 63, -29, 59, 97, -35, 74, 240, 56, 280, 112, -162, 88, 72, 350, -247, 168, -241, -352, 15, -201, -91, 39, -352, 96, 172, -175, 118, 64, 317]
7104C17l57r9R1j24K11j96k60L80n4l6M33m44M22m89N64l04j42J39j15j02L37
7125A72n00M38j38l72N00J6o7K5J8k1j22j53K44r5J06q4P5Q0m6l6J12k31RkJ79
7150A07k78o2L60j42M5l6j03J24N2k70J07L5N04m91J26r7J2J17j86K41l75L4K53
7173G7k77J35K79n42L03l8L50l14l15L48k0J29J96j29P4k99j45M50l47M86o55
7194b54n8O19m47J68l1Mj73K1J64P8P5J16m98L54j34k81M03j98O1j7j92N59j48
7217A91k89K65p8K08m73P4K22j30M65o28K50lk18K64j89Q3o5m9K50k16J40l5k42
7240b03K60J71n01N28l93J26J37J9k48J82k88J62k30M54l74J90L74l75J78K4m65
7261b72M34p6L1k65M0L1j6J88j94N8O2M6M5j21j70K45Ok8J9k6J18k91K65n4r1
$$ y = [317, -40, -139, -48, -172, 39, -157, -417, -37, -91, -127, 306, -138, 284, -205, 359, 55, -87, 52, -63, -165, 172, -328, 110, -28, -400, 100, 116, 49, 74, 92, 71, -51, -204, 40, -55, 51, -33, 42, 122, 76, 40, 152, -79, -70, -72, 107, -171, -233, 127, -15, 30, -6, -109, 15, 67, -203, -96, -61, 443, -48, 78, -19, -7, 110, -76, 165, -210, -176, 77, -200, -65, 214, -328, -25, -63, 287, -27, -342, 6, -14, 115, 311, 182, 256, -43, -188, 262, -85, 401, -254, -312, 307, -140, 28, -3, 1, -172, -151, 13, 91, 166, 282, -216, 138, 4, -277, 126, -72, -11, -28, -220, 339, 191, -98, 167, 89, 297, -176, -102, 120, -10, 455, -173, 77, 74, -144, 120, -69, 14, -51, -100, 150, -66, 74, 39, -203, 57, 228, -273, 255, -138, -12, 125, 144, -104, 78, -210, -48, -278, 176, -198, -8, 366, -9, 169, 193, -272, 162, 86, 117, -148, -108, -77, -93, 95, -99, -41, 21, 67, 112, -9, -179, 66, 72, 44, 63, 37, 155, -136, 129, 75, -16]
7286a6m6m3L24k64o0J65j35%P5l8J06p5j9M1Q8o6j14p7K78k94J00R2j30M68k42
7311A18j67L28l59J55J2J49q8l77N95m70Q7Q7l33K38J39j40J50p4j52k9p6P4j35
7334b68J03L44l93K08k01L61O6k32L46n76RM83n64N26k25nl2L2P9M1m6J40l95
7357a99M86l23k8K68m11K32k02K3O37q36M16l0j93M76j55l76L43k48L82k26m4
7378hM93o84k3L5J69K75j77r2j19n8K33k18J98R9j31M1j68J17J15j20O6r3L49
7401B99l25m2L61m38k32N57k33K35l59K02j66J7K09j28j13J27j61M61k95p0K80
7422A86m14J49M00n63N75n54K13M9k96J67K20nl9k28J15j70K70K7q2J73j59K8
7444F2l3j34l3L6P6O7j8j70j28L8M80l02K20l1l93N01m45K0J93k22K11j49K83
$$ y = [-16, -62, -105, 219, -45, -105, 60, -75, -75, 0, -38, 68, -7, -26, 15, 103, 37, -77, -154, 124, -170, -70, 22, -108, 360, 118, -49, 279, -80, 75, 87, 236, 148, -229, 366, -104, -17, 70, -263, -25, 114, -26, 124, 50, -102, -131, -207, -133, -268, -165, 179, -214, -6, -207, 154, 220, -12, 334, -242, -233, 250, -314, 212, -13, -18, -50, -18, 61, 102, 56, 196, -199, 287, -36, -64, 204, -207, 25, -177, -154, 483, -353, 63, 33, -160, 316, 161, -215, 128, -120, 262, 36, -8, 485, -199, -222, -187, -18, 257, 80, -12, -131, -189, 44, -174, 24, 123, -8, 33, -135, -18, 97, -23, 43, -50, 299, -26, -68, 293, -145, -377, 180, -53, 182, -177, 25, -141, -124, 85, -43, -156, -29, -190, 271, -24, -94, 186, -228, -79, 321, -242, 333, -221, -8, 41, -255, -88, 132, 127, 88, -140, -25, -195, 75, 102, 20, 193, 34, 62, 29, -105, -138, -102, -26, 41, 23, -147, -275, -237, 243, -59, 161, 130, -263, 238, -207, -187, 6, -216, -5, -154, 129]
7467A29Ol05J59j61K7N4q1K10on5K27l10K70J24m68L48m35M85p6j80K15l29J84
7490C2j23m1K52l75J85J17l2J22k10j42M75n14O18l61K70n05j36N60j71j95L47
7511A73k28J09J25l27J40j74M22J02k78K76l89LJ44j61K95l33J21r9k9J94j59
7532g3j7J67l26L27p1r2J43k83L73k24K17L6m45N5K27N8rj60J90l1p3j13l3M3
7556a14J34p9Q5O3O6l0n01N76k1n6J10j49J07j32k4M9m84L89N2l55N10j27j11
7579d2L7j64L10j28N2R8n33M31N0J14k06j30L77k53J30J78o54L76n4L33l81L6
7601b3n3k58K21K20K7o5l74KL54p3J16p8q6K84k11j39J20mJ53j96L53k94j67J79
7625H%k7L13m00L14l66M20j44l04N35n56K43L21m65L40j33j52K19l06L57j94p8
$$ y = [129, 135, -170, -11, -172, -145, -91, -172, 38, 32, -23, 204, -106, 164, 288, -180, 168, -267, 218, 142, -38, 177, -152, 32, -91, -132, 120, -255, -70, 47, 15, 137, -73, -215, 260, -254, 364, 3, 273, -232, -368, 192, 21, -174, 173, -55, 54, 179, -148, -8, -182, 240, 342, 64, 340, -49, -46, 98, -63, 232, -101, 20, -79, -108, 86, -73, -90, 77, -249, 78, 7, -85, 58, -225, 148, -76, 141, 177, -268, -213, 14, 72, 63, -97, 93, 62, -11, -124, -157, -114, 20, -59, 26, 89, 155, 125, -376, 200, 179, 123, 233, 84, 191, 59, 35, 84, -400, -11, 41, -314, 196, 69, -42, -5, -169, 141, 13, 65, 163, -370, 61, 111, 225, 19, -111, 266, 13, 143, 321, -333, 43, -11, 322, -59, -23, -76, -334, -113, 107, 134, 69, -305, -303, 51, -22, 94, 16, -70, 214, 3, -136, -16, -20, 133, -63, 290, -4, -171, 8, 8, -19, 294, -106, 208, -158, 262, 118, -186, 349, -207, 36, 357, -108, 232, 99, -53, 166, -140, 217, 23, -55]
7647e5P8Mj8K6P8J4k89L44l26J10Q5k60R1J36o8M5L5r1K00j03j1L4l63J75J86
7672E7N0j52N4lK3P6K3j37J19l22K57N1j86J55j72J62K1l16J74j06J74K92k83
7695A1K2j19K00M5k12L5M9j50K19k58J26J61j96K45J7Q8j88k59K71l60O6K97k8
7718H2M1j38j1j41N4L51k70K64k72J59Kk14L75j37l56N5K24K53k07j14R0j90o0
7741a60K04j70K97R8l74J51J28k15j2K7R4k76J56j13K03P9k71J64N7k32L26J51
7763C12l73R3j20J75l23K73k0j64K30k40PM24m27J89O6o4M12n55J44j45j83J96
7785i3l19L00J85m4K92n75L50K18k96N2N5k56K17J14m01L08k82M62k96j05M3j4
7807h5J61o1K4j32P3K75j48j54l4j10J64k87M14q8J12P1k89J60j12k94N35j59
$$ y = [-55, 23, 27, 9, 35, 113, 127, -162, 182, -144, -34, 51, -209, -118, 18, -50, -5, 30, -61, 139, 36, 25, 59, -304, -129, 57, 107, -45, 9, 6, 29, 105, 128, -9, 110, -212, 45, 96, -90, 65, -107, 55, 76, -240, -66, -172, 2, 294, 11, 33, -86, 114, 159, -53, -18, 31, -119, 100, -158, -32, 129, -67, 178, 195, 283, 95, -164, 107, -253, -187, 110, 82, 123, -15, -26, -167, -113, 238, -32, 232, -40, 119, 121, -93, 282, 145, -211, -156, 68, 321, 114, 0, 90, -100, -160, 44, -126, 171, 269, -105, 46, 174, -41, -53, -26, 68, -208, -52, -165, 38, 117, -154, 10, 67, -165, 161, 312, -61, 32, -88, 87, -236, 37, 17, -147, 83, -157, -150, 274, -153, 36, 102, 38, 450, -105, 39, -106, -289, -93, -412, -112, 73, 29, 321, -254, 96, 314, 18, 70, 125, -131, 86, 200, -201, 107, -175, 287, -9, -114, -71, -85, 76, 15, 39, -93, -20, 255, 107, -47, -81, -191, -27, -314, 100, 12, 124, 195, -94, 66, -46, -340, 195, 36]
7829C6k62L61l45J76J64k2o4j87L28r3k85L51m79O6K00j75J46j26J24Kj18L40
7851A38j04J35L02o15M57k79J36j79O6p6j43P5L17n72M12j09o4L16k56J03j43
7872h3k52L81o5Kqj02q7K07K70j55k24K75k28J5K33j51j67J83k20L98m32L01j57
7895f6k03K46J06k8j3k11Q9k23L36P1k15M76l54Oj48K35j63K11k54J80LP1r5j66
7919a09J90l51L55N8j79L72l18Q7o5k85M42k04o7Q3J60J58m67J77M1n07O30k11
7941a0J45j33n43N34k5j71K85L0J51k29O2J67j58k1k96L31j7j85K75j11j49L1
7963c7R7r8O0k82M09n24K43J0N7J35k2m4L88k86r0Lm1L07k39R1l57K84j2o7L49
7988C34m00p4K57n40M50N4j26J09j69J69o3n1O2j0R0j97K92p0j72L1k35O54j44
$$ y = [36, -226, 135, -210, -34, 130, 108, 44, -143, 185, 92, -193, 158, -321, -255, -55, -230, -84, -210, -86, -84, -202, 138, 34, 169, 471, -144, 313, 34, 170, -9, 57, -19, -162, -87, 230, -342, 70, -39, -103, 213, -43, 60, -83, -335, 46, -19, -17, -25, -127, -214, -7, 263, 108, -116, 159, -69, -54, 179, 28, -139, 44, -176, 222, -210, 91, -66, -269, -23, 83, 55, 42, -169, -80, -303, 33, 104, -111, 365, 11, 17, -131, 104, -59, 152, -102, 78, 81, 152, 57, -109, 81, -270, 85, 143, -36, 336, 18, 105, 40, -245, 197, -7, -74, 9, 169, 327, -140, 37, 78, -429, 201, -10, 135, 2, -541, -7, -32, -203, 82, 112, 263, 34, 96, 263, 105, 84, -212, 119, 102, -83, 192, 81, -68, -37, 60, -38, 22, -260, 149, -375, -132, -122, -65, 70, 48, 4, 392, 106, 16, 19, -22, 285, 46, 137, -220, 64, 52, -15, 334, -66, -140, 117, -423, 27, 81, -45, 64, -105, 64, 1, -50, 12, 2, 92, -105, 187, 117, -55, -24, -259, 395, 251]
8011B51l44j84K68J97k5r2m57K74j02J62j34J19J8P5J49nj58o6k20K87j3l27M11
8034H4j9j1m0l2J81j59Q7K04k70J19k24M2L0j6R4k16L62j65rk04O6J70j88K5K22
8059A33jl66M44l32N9P9j82L02j42J54l79mK81k16K04k36P8K71l12K29km19P77
8082D20k67p8L73p05K26k00L6J25k10M40j41k73L72M3j03K68j58J1j92l8K77m60
8104b34L62r1m2K07m13K51j93K05j8J07l4k6k08J41j79M04k95l7L12m19nK42l13
8127b76L30m37M27K52j26j82j61K76j47j97L58j57r9J87p9K61m26l2K56j39J90
8148G9m84M88j76j61K02J8K26kl44L88k67k92N22l44K14j44J0M8l26K20J11L4
8170B0J27j19nJ96n0j40p9nJ41k91L29Q3k20J05j51J37l1j04N46n79L9
$$ y = [251, -93, -277, -9, 188, 163, 71, -386, -112, -214, -52, -186, -67, -49, 26, 175, 170, 12, -54, -274, 13, 0, -327, 84, 65, 54, 14, -18, 163, 4, 91, 295, 25, 144, -80, -38, -8, -24, 70, -146, 216, 51, 42, -162, -96, 74, -114, -89, 133, 132, -234, 210, -122, -63, 16, -166, 136, -6, 148, -231, -235, 46, -170, 34, -202, -124, 147, -165, 64, 62, -357, 420, 153, 75, 448, -257, -31, -231, -195, -70, -280, 160, 19, -254, 118, 161, 58, 326, 168, 179, -13, -51, 226, -234, 128, 37, -5, 202, -211, 40, -153, 52, 34, 141, 107, 81, -127, 14, -165, 239, -56, -93, 219, -200, -205, 37, -276, 54, -383, 44, 296, 170, -12, -173, 103, -44, -241, 117, -40, -139, 48, -31, 230, -196, -228, 28, -111, 79, -405, 83, -93, -254, -52, -34, 192, 190, -154, 234, -33, -325, 197, -147, 67, -77, -67, -19, -345, -125, -14, 20, 147, 28, 23, 219, 169, 29, -50, -55, 86, -205, 124, 207, -13, 92, -59, 78, 47, -57, 489, -90, -51]
8191e1
$$ Imaginary data points
##PAGE= N=2
##DATA TABLE= (X++(I..I)), XYDATA
0@%%%%%%%%%%%%Qj6J6j6J6k4L2l5M3n0N8p2Q4r5J10j28J49j70J94k20K47k80L18
35A69l57L99m47N00n57O19o88P63q43R32j030J134j250J379j519J672j840K028
53A064k239K475k743L048l400L812m299M888n614O535p746R408j1835J5699k2731
68a3678L9248j39557o8579L51753k33922j4191J63829j83124M557J67636q1814
79g842m5895R1645o1536r637J58246j20489o6360J05447l3673L1423k2030l5500
91a6201N5784q5003P2142M5742j41563N2798K8019k0257M7961n7724j8053M1413
103E058P637k1928M513L883n1509O1211J6368n2886L6721o7655O1052O9880j51931
116g9586R3700L9399j25805J23059K441r5363O3614J626l1535M0517o820p1886
$$ y = [0, 0, 0, 0, 0, 0, 0, 0, 0, 0, 0, 0, 0, 8, -8, 8, -8, 8, -16, 16, -19, 24, -26, 32, -40, 44, -51, 59, -69, 80, -90, 104, -116, 131, -149, 169, -188, 211, -236, 264, -293, 326, -362, 401, -442, 490, -540, 594, -656, 723, -796, 876, -964, 1064, -1175, 1300, -1443, 1605, -1795, 2017, -2282, 2606, -3008, 3527, -4219, 5189, -6646, 9053, -13678, 25570, -113987, -182566, 169187, -64735, -78926, 84903, -98221, -93664, 73972, -7842, -53737, 37908, -23628, -33265, 124981, 4492, -61868, 43579, 9906, 41329, 19299, -16201, 39583, -45420, 26722, 72464, -69099, -16301, 11718, -8539, 39422, -18302, -36355, 5058, 12695, -9233, -4720, -837, -52346, 8865, 25233, -27653, 9068, -58587, 2465, 72345, -79586, 14114, 53513, -72292, 50767, 53208, -42155, 21459, 23085, -8450, 32067, 25247, -46639]
128d6639N8674L3844r9370O5048K475o7910P7858m3491J4337L0237r4034J03130
140C4159j166r9119J03393k1227n8681P1995j3618n1226N3080O655q1751Q3058
152B5552J4180j22325J18823J942j09140J09781j9202m6460N1571k5772J1796
163A0746p91o440Q805k0845K4451j8843q038K4482k8981K245N243J4759j9597
176a2804k3317O2021m3583n865N8480o5892L5330J6753m6396O0685l5289k0442
188b0319N2259l1070k088J1835j0825m249J4036j38l0445M2383k5410k7786Q0951
201D9134o8464j1285P3515p1666K5710K5554n1783L3912k774j1515J0073k233
213a822l870q834L1417k0618j0831L3709l2743K4697J433k8541M2287l5440P229
$$ y = [-46639, 12035, 45879, -53491, 11557, 14032, -53878, 23980, -19511, -5174, 25063, -68971, 34159, 32993, -66126, 37267, 16040, -42641, 29354, 15736, -35490, 17590, 24245, -57506, 25552, 39732, -82593, 36230, 38172, -70968, 38813, 19611, -26849, 24722, -1050, 10746, 9955, 3515, 12320, -8525, 15926, -2917, -10955, 13527, -15454, -13209, -7966, 6793, -12804, -36121, 25900, -17683, -23548, 34932, -30960, 4370, 21123, -25273, 35412, 123, -20319, 31940, 870, -1218, 10617, -208, -4457, 9579, 9441, -21004, 21379, -4031, -31817, 49134, -19330, -30615, 42900, -28766, -3056, 22498, -29285, 4627, 1853, -9662, 411, -1822, -5692, -14526, 16891, -3727, -14558, 19151, -13592, 11105, 12538, -16003, 26284, -9156, -1927]
226a927K9973m5742K6771m251j4049K3725k4285R687j466m401J0678j7137J9596
239G172j4832k341K4285k9167K0766o708j1145L1210l5367J9311P536l1382L7683
252A7021k0510l327K0439k5879J9582l957m616O999j0365J7800j8726Q815J0381
265A3657k9918L2079j6943q954K7414l5796K0968K207k2782K7075k0627P218O332
278A930j3880J8640j6564J1413K186j3153K4119k2320J1339R551k3856K8483j8386
291d98p36J7521k6177K1365j0078q448J8182k2779J5976o670r138J8732k2196
304a4944J5730l316j1207K2393k1781J4403K486j5480K5084j9473R018Q321j9592
317h358K4009j6203K616J1288k1341K0281j3396j423J3250k3144J9505j0305o485
$$ y = [-1927, 28046, -17696, 9075, 4824, -9225, 14500, -9785, -98, -1564, -5965, 4713, -12424, 7172, -7660, -10001, 14284, -14883, 5883, -825, -11970, 19240, -16127, 3184, 10720, -20662, 17021, -3489, -6816, 13623, -12256, 7326, 3369, -1247, 5752, -4613, 13187, -5539, 3276, 13657, -16261, 15818, -1125, -10079, 17335, -18461, 2507, 4714, -18068, 9007, -11620, -4402, 1930, -11950, 6690, -9874, 1539, 3725, -9428, 14691, -7629, 3710, 13261, -10595, 17888, -498, -1234, 16287, -9890, 11475, 1397, -7051, 11131, -11648, 4328, -2342, -11480, 7252, -14944, 786, -2530, -13737, 8656, -13125, 1278, 3764, -11716, 13368, -6105, 2913, 11234, -8358, 15651, -552, 2064, 13352, -7989, 12292, -1104, -2527, 10723, -12421, 7084, -3221, -9706]
330i706J7551k3412J7338m838r386K0108k1353J5407M19j2762K3093k0042J0952
343C369N583j7016K2715j7181N548Q272j8343K0404j5759J501J1279k1606J9458
356H224j1902l697J5257k2087J7861p146o910J8207k0873J5887k828j0143K0990
369A0840j9849J2295L365j4831K0796j6447P011N336j4944J8153j5574N572O221
382G944j8367K1665j6041K97J4862k3859J9819p272q523J7999j8493J1171j181
395B1o184J2135j5211J5157o871o508K0343k3642J5556K452j9332K6494j8776
408d366J006J4320j9241J4515p367n64P216j2872J4375j1353K716Q176j8024K1450
422I987j2174n146J9403k1552J3936k596r616J8197k0029J0584L464j4863J7588
$$ y = [-9706, 7845, -15567, 1771, -3067, -12453, 7655, -13698, 1709, 2128, -10634, 12459, -7583, 3369, 8952, -8064, 14651, -2530, 3018, 11290, -7053, 13351, -2408, -907, 10372, -11234, 8224, -3678, -7375, 7882, -14205, 3656, -3490, -10400, 7807, -13066, 2821, -7, -10150, 10840, -9009, 3286, 6651, -8180, 12616, -3831, 3180, 8516, -6428, 11725, -3849, 1723, 7944, -10423, 11242, -4799, -4502, 10360, -13499, 6320, -952, -9475, 8524, -9969, 1202, 21, -6163, 5972, -9239, 5918, -953, -7461, 12882, -10760, 4796, 7248, -12084, 14410, -4366, -3360, 10960, -8281, 6234, -1133, -1697, 5519, -7353, 7022, -4331, -1615, 6561, -11463, 9987, -2187, -7333, 12070, -9482, 4454, 1858, -7758, 10439, -9590, 994, 4458, -10405, 7183]
435G183j4435N910O236j5667J6647p669M96L905n629J3365j6091R836N422j9030
449i521K4590j8646q28K1274l2530K0247N125k5433K0355n346n157N563k127l24
463b758l139J3764j6375N687J8461l5754K7201P529l4314L2385j2370q588K2647
476A4376k2288P611N769r470O648o20L166j2527J0931O726j7714J5794j3113K136
490b575J6105k8080J9593j899k0787K7168j3871r27N121j3273K1305q207o178
503f505J0050p189R126m087K757K82q302J0455o562J0718j0647j7298L7476k3659
517c385q226K9372l5628J6520J3721k6804K3760r324j5256K5463j012j8291M534
530d556J4779j9444J0162J0921l4215L0455n157k6797N0480l5733j7441N4341
$$ y = [7183, -7252, -1342, 4894, -10773, 5874, -1795, -1299, 2606, -3023, 10342, -5749, 4087, 9509, -9521, 15069, -3577, -4405, 16869, -15661, 4586, 9711, -15722, 4633, -713, -5870, -307, -2434, -2758, -5897, 7867, -8508, -2821, 15640, -20114, 7087, 14616, -19698, 12687, 317, -8271, 14376, -7912, -301, 5468, -4002, 2646, 2026, 5192, -7335, 3596, 10322, -7392, 8402, -4711, -2575, 13530, -14550, 5043, 3144, -17643, 9525, -4346, -5273, -152, -13425, 7880, -327, -6505, 3545, -3644, 5482, 1395, 4152, 4434, -3868, 6587, 25, 10743, 96, -17202, 20274, -3385, -11611, 17761, -17867, -1347, 12374, -14430, 9330, 6, -15250, 10213, 9201, -9090, -4556, 10223, -9221, 941, 11862, -22353, 8102, 2945, -23852, 26628, -9105, -26546, 27795]
542B7795l2316m597K5528k1328K800J6565r363j0982J9606j2050j5664L9142k7801
555b665j9332L7144k0686j209P387j0424J1301j3926J3487N284k1758K2508r774
568b663k109K1785k5357L054J9270j2107r751J6399J746k6964K5197L475k8229
581a6254L0001j8288m556L3010m1189J5022K2282l8365K2090N993k1312J4184
593B618j935j0210J1461K284k3150K1162J1782m1532L4882Q191l9487L7905r644
606D327j3918K9424k6634Q424J4421k3229J1754L557j0338k39L612j784k247N073
620B203j6936J6425Q094l4574L4346l39l3404L8434r559j5054K0075j3573N782
633A920L470o630J106l232J0210j0961j239J4314j3990j162R893M609j5214j143
$$ y = [27795, -4521, -9118, 16410, -4918, -2118, 14447, 5084, -5898, 13708, 1658, -14006, 25136, -2665, -21997, 15147, -5539, -6748, 639, -9785, 1516, -12410, 1077, 6361, -15397, 7111, -2663, -4772, 17013, -8344, -5290, 13980, 1873, -7878, 8521, 10267, -16697, 8500, 11975, -16254, 13747, -4541, -9097, 23913, -17276, -2254, 20028, -18337, 3753, 9746, -11566, 2618, 683, -9527, 1934, 4218, -18932, 2230, 14012, -27520, 7362, 15553, -23934, 13971, 4327, -9591, 19833, -6801, 1623, 16044, -7185, 4569, 8126, -2212, -2451, 1161, -623, -2870, 2203, -14733, 1692, 9786, -24788, 9558, 9219, -24185, 14249, 4690, -10364, 9711, -3862, 1920, 5390, -1240, -134, -3366, 6844, -4117, -5356, 8958, -5032, -6194, 3699, 8308, -6906, -8049]
647h049K7906k9015L506K8701m1493K1217J5181l8979L1471k150k9541K8525J402
660H682k2261J0315J1753j8696Q406J2576k5223K0993n13k2399L7008k2381j4436
673a6176L7443k7485K054J6229k2019J1311M854j0735K887O795p856n288K1428
686A3442j5214q830K2942j6915M904N209j3280J4177j2052M101R718j9834J4898
699C266m924o083J7850j7101J392J1719p456K49L479K427j1190J0018O450j7585
713g489J4998q598m751K1274k4734P663R816k0996K0065n123j1919J4296r538
726e036K778P295o749n880Q316P020j6474J3294J26j9683K7479j0199j1343K0750
740A1694k1084Q657J2764j8713P686j573J77L845l057J832p779P719Q50m892P554
$$ y = [-8049, 19857, -9158, -5652, 23049, -18444, 2773, 17954, -21025, 10446, 8296, -21245, 7280, 8682, -13579, -3264, 8489, -10207, -1801, 10775, -14448, 6545, 6032, -16367, 20641, -1740, -16176, 21267, -6218, -4164, 12065, -9954, 1357, 6211, -4524, -1637, 5158, -2698, -7986, 13442, -1772, -10602, 12340, -4575, 329, 5538, -7742, 6435, -5617, -1516, 8202, -11632, 3266, -1658, -7741, 10109, -6992, -5600, 6119, -1337, -1088, 2391, 4818, -6372, 3646, 10096, -7489, 7509, -1089, -5840, 15434, -9300, -1637, 8179, -12817, 7248, 2125, -9794, 4502, -5036, -2258, 5037, -1712, -7592, 724, 7744, -8730, 4564, 4690, -14993, 12486, 2287, -9056, 11694, -9390, -733, 12031, -6682, 1004, -569, -392, 3453, 396, 2228, -5551, 2168, 3018, -1874, 5680]
755E680j4286Q499O457j2766J2450j2092J025J3045j4341J0411m972q300J6475
768G285p952J245m46n118Q851l068L119n532j338Q018q067R889n971r264J6544
783H195j1070M854L501j6238J5174m039l943R222j2574N445K111j097J414n748
797d793O535n385N391M725j5421J3890l873n562J4818j5044L592N051p568J0250
811F606q836J220L832o514R311p463O80L234o099R031p630J680L293r364J2873
826E854p524l228R723j1780R400q59o070Q259q244P144o49n538R302q907M727
841A610K332o503P535p654M338R13p122J0896j0857K922O639j2486J0840m116
855g13l841P612p391O452l521q91O630r550R159l007m710R490r434N705m25n131
$$ y = [5680, -8606, -107, 6350, -6416, 6034, -6058, -5033, 8012, -6329, 4082, -890, -9190, 7285, -667, 578, 132, -4986, 3865, 797, 3916, -1616, -2954, 5064, -3003, 6886, 915, -8349, 8195, -2875, 1979, 5480, -10758, 4416, 377, -3566, 5656, -6918, -1473, 638, -459, 955, -4793, 1742, -3643, 1748, 6473, -8948, 4942, 1069, -4493, 10325, -4719, -1127, 3924, -3644, 6606, -2230, -1010, 2822, -3692, 5619, -1844, -1164, 2070, -4029, 5002, -2628, -948, 2345, -7019, 5854, -1670, -4898, 4825, -6955, 2445, 1586, -4484, 3775, -4469, 2675, 2026, -3512, 5790, -3117, 1610, 3942, -2561, 4974, -2680, 1658, 2571, -4551, 6345, -4512, -1590, 5049, -7437, 3403, -713, -4554, 3058, -4333, 2119, -1402, -2293, 4337, -5213, 3946, 939, -3771, 5719, -3715, 1990, 1565, -3566]
871c566Q586r147N989Q57q293J1325q166J676N195q980Q134n009P85M143q667
886e138R450o090q04P121j0414Q004k349l234P350q658P281k759l740J0101j0703
901d582O022K018p724R856p418K082K875o460P882o569J955K753p285R260p131
916b466R67N544r254R114n529j752Q185j0299P522r22n349Q111o807L770m16l629
932c210O533p361O496j195n311J0159j0167M906L939j0106R879n321m89N648q371
947c971P498m227q98M903p393P351m624j534P389r689O913k005l078P222q555
962d698O738j354n165R506r069N415J554q534J1585p014o14O388p572N342k632
977a24L59J045l753O296p593M846K474j1871J4566p139o033J4646j2760M026N048
$$ y = [-3566, 5020, -4127, 1862, 2719, -5574, 5751, -2415, -739, 4456, -4524, 3610, -1399, -614, 3529, -5138, 4312, -1778, -2582, 4539, -5875, 2129, -220, -3454, 3896, -4762, 2519, -240, -3980, 6121, -4582, 1440, 3458, -4266, 5590, -1828, 254, 3129, -3331, 4551, -2018, -63, 2690, -4595, 4665, -2466, -1499, 4045, -5209, 3905, -1624, -3376, 4809, -5490, 2032, 1110, -4239, 3872, -2935, 835, 419, -3210, 3323, -4038, 2458, 1263, -4048, 6111, -4056, 850, 4789, -5317, 4562, -759, -1248, 4400, -3971, 3527, -700, -1598, 3305, -4088, 3263, -1361, -2895, 4494, -5195, 1718, -287, -3365, 3857, -4698, 2040, 686, -4479, 5027, -4042, 1373, 2927, -5607, 5978, -1036, -1650, 4738, -2834, 2508, -124, 235, 1280, -2473, 3823, -3770, 1076, 3550, -8321, 6245, -894, -6927, 7719, -5041, -1015, 4033]
992D033r071P698k700j432J453L64J145o258R581n086m792J2431j2169N377M968
1007E542j2747J3410n501n403J1186q257K398O81k175L393n474M778k795n40L694
1022B190p863Q769m069m360R820q744M760L21m790J0630j0982M532N617j0751
1036d920R613m163k762Q011r144L530K429l303j336K008M029j0634Q366K412j2941
1051h805J5930q530n228J8040j8597M122J2402j7095O999N315p913J814L094k461
1065i13k590Q626q922P05J3389j8907R388R420j9476J4493j073r185J1324q419
1079b140J356M447o301J811N6K173m970J324N329p748N527j701r29N775j0180
1094f171R695l45r299J2823r146K128O006j2694J1542k349q205R980l310k143
$$ y = [4033, -5038, 2660, -40, -1472, -19, 345, 1490, -4768, 4813, -273, -5065, 7366, -4803, 574, 5542, -7205, 6205, 704, -4699, 6487, -1770, 628, 1309, -866, 2527, -2947, 1831, -964, -1504, 2190, -5673, 3096, -973, -5333, 4487, -4257, 503, 824, -3966, 6664, -4318, 214, 5831, -4920, 4693, 530, -2232, 5779, -3365, 165, 2594, -709, -2045, -37, 3992, -6642, 1724, 4136, -8805, 7125, -1405, -6633, 11407, -7190, -3068, 9334, -7761, -762, 4553, -3360, -1546, 1548, -913, -3503, 5123, -3799, -3094, 10295, -8612, 776, 10196, -9280, 5213, 4140, -5045, 6279, -2140, -784, 3663, -2638, -827, -771, 1402, -3568, -2244, 3085, -4663, 864, -837, -1766, 4009, -6171, 3524, 3179, -6120, 6703, -2443, -315, 5691, -7003, 4539, 2190, -6015, 3965, 655, -1488]
1108a488J576P24n22q01L045o243P510j446j1228J8124j0277p835J9403j7081
1122f539L186J0971j7687J1751K982j3097R589L992r855K075J1157j2187J181
1135b481J2917j7490R501N787j8672J9033n715j3053J8632r447l606P584n718
1148b728K005J5N23j536J833O79n680J0081n192n493J1223q033L610J022o687
1163d358R742r078L353O730j3409R770j732n052J1027j0069n28Q633m215l524
1177b710M574P41j0129J1021K032j5127J4782o902n707J9970j8718J19J4349j4661
1191f366P980L712j0571M543K917j254L07J474p815M174J0303j5377O518M179
1205D724j5040J7936m349j0998J2737j0034M142Q747j1908J616K227J164K05r94
$$ y = [-1488, 88, 812, 290, -511, 2534, -3709, 3801, 2355, -8873, 9251, -1026, -8861, 10542, -6539, -3353, 7618, -10069, 1682, 4664, -8433, 1156, 5148, -4707, -2632, 8525, -3662, -2481, 10436, -7054, 2447, 8234, -10438, 8595, 2880, -10173, 8459, -988, -4594, 2990, -2728, -723, -708, -185, -1721, 112, 791, -4889, 5192, 0, -5493, 5730, -2303, 1307, 2329, -4358, 5384, -3694, -341, 6389, -7020, 2750, 1018, -4034, 6993, -3076, -3604, 5029, 814, -2710, 1864, 2605, -7524, 3497, 5529, -9598, 5184, -1718, -7425, 12545, -6173, -6054, 8295, -6366, 1614, 5326, -5245, -702, 2215, 961, 1268, 2742, -5073, -899, 9404, -5973, 545, 4724, -10316, 7620, 3271, -7727, 5010, -5024, -882, 7865, -4043, -2427, -200, 964, 1169, 175]
1219A75Q0n271P018L75l419L350r675Q842L357q547P531q626K473R841j1251O537
1235B790k414o698J2337l982l295P57j222L226Q63K70p214L540M044p489J0457
1250E970p681p278J6469r872J506O177j3989J0144K336o884N339l462m77K969
1264A267K644m341k516P062o621M999K468j2448J1737l759n032J1714j1638J801
1278b663O082p174N998k520k697K861k91K336m467L775j452k963Q019o925K039
1293d2K418o533Q462m972j065O207r254P508n73n066P191o566K018K728l484K309
1309A286k561J830j521J73L823q261O327j059m345R834r456J696O238r190Q750
1324C564j615n669O296k648J698p85l96l06k228O987n900j007N778q364P060n67
$$ y = [175, 255, -5016, 2002, 2377, -1042, 2308, -7367, 1475, 4832, -3715, 3816, -4810, -2337, 7504, -3747, 2790, 376, -6322, 6015, 2033, -1262, -505, -1727, 1499, 2362, 2632, -4582, -1042, 3002, -4487, 5970, -1711, -8989, 7480, -2392, -886, 5291, -8698, 1446, 3782, -3102, 2237, -1225, -1702, 1267, 3911, -430, -2946, 4116, -2505, 2494, 4962, -7486, 4251, 492, -4540, 7174, -4464, -2663, 3419, -3755, 2243, -277, -2974, -113, -404, 1932, -2535, 1240, -212, -3175, 4844, -2081, -42, 2376, -4157, 4305, -667, -1732, 4475, -4779, 2729, 2156, -2910, 4281, -2285, -267, 2461, -1023, 1286, -1275, 555, -966, -793, 3030, -5231, 1096, 37, -4308, 5526, -3930, -2234, 4004, -5186, 3564, 1949, -3720, 2576, -72, 1626, 841, 445, 139, -2089, 4898, -1002, -2009, 3769, -4595, 2465, 1898]
1340A898n887O282n550M115J102n527N906m937J683M410o257L274j382N8K222
1355A410k773L186n340L820L119p274P696m476k122Q127o968L319n52k961N547
1370C758m830K309n07m055N684l788P41L84k944M472m369L812l10n499Q827n396
1386a711L90N234p026N077p22j485L217m867M143k027j137M273n885L502j72k322
1402a518L832m774L488j278k316O412p235K948K941o312O198k965r69K759l741
1417b530M265l666J655K629n846N870k375j010M024m497L816j818j003M057o415
1432b844N254j370l757O079n613J424J796l532M126l886K041J127l839N633m390
1447a751J203K397m311M878l346O80K325n407O340l194k002N818o369L518J002
$$ y = [1898, -3989, 2293, -3257, 858, 1960, -3567, 2339, -2598, -915, 3495, -2762, 512, -870, -812, 1410, -1363, 1823, -3517, 303, 3422, -3852, 3844, -632, -2754, 5373, -1595, 1724, 1172, -1789, 3758, -1072, 1237, 730, -3325, 2359, -1429, -688, -304, -3248, 1224, -3145, 667, 357, -5142, 3685, -1711, -1321, 3913, -3113, 1964, 1242, -243, 2974, -1893, 2250, 223, -914, 3359, -2526, 976, 804, -1518, 2314, -2460, 1028, -250, -2566, 3846, -3389, -441, 2500, -3812, 2386, -579, -1548, 1211, -2530, 1735, -1931, -276, 2353, -3493, 2377, 2, -1008, 3016, -1481, 2335, 517, -486, 3571, -2844, 2410, 1040, -2717, 3362, -2251, -827, 969, -2563, 1563, -2323, -282, 845, -2994, 2639, -1751, -548, 1849, -2462, 2416, -930, -250, 2075, -3332, 3008, -186, -2188, 3630, -2739, 779, 1781]
1462A781l726L569k731K478j224j129L889o195N051j49n079O675m879O75K790
1477A796m502M420l286N17K779n046N319l446j46M273n424L981j078j492L491
1492B156l777L733j532j723M650n260L450n89k799N269n825K740J723n846O084
1507B454l442o80L499m392K805o67K98l03j617M798n661K329L832p497O689j465
1523I80l880P118n932J327L292m310K671j000R05j239m55K976m823L596o05l694
1539c073O495o227J576L831o510M928j235k046L629l806L429j459q09L517m430
1554b190M349j883j465M548m286J713K95j435K464m193M461j804l602O668o396
1569b756K429K986p397O830j709m008N398k430p01R46J264j256j225M147n438
$$ y = [1781, -1945, 1624, -1107, 1371, 147, -982, 2907, -3288, 1763, 1614, -3465, 3210, -1669, -994, 1796, -2706, 1714, -1572, -1055, 1724, -3322, 1997, -1449, -1595, 2678, -2746, 1235, 157, -1335, 2156, -1621, 2112, 580, -1143, 3507, -1753, 1697, 1108, -1691, 3578, -2247, 493, 2216, -3630, 2454, -988, -1668, 1831, -2561, 244, -423, -125, -428, -2045, 2753, -2908, -579, 3253, -4244, 2445, 980, -2900, 4218, -1714, -387, 2905, -1405, 1266, 266, 1171, -68, -523, 2453, -2370, 1226, 621, -3073, 3422, -2805, -1229, 2602, -3908, 1020, -215, -2261, 1368, -2438, 991, -468, -1277, 2240, -2190, 2159, 276, -1189, 3359, -927, 786, 1081, -354, 2110, -2083, 2378, 574, -3028, 3640, -2756, -327, 2659, -4738, 2092, 383, -3625, 1773, -657, -1358, -412, 852, -404, -1629, 2518, -2920]
1584b920L523K874q722R048k423n722R281o277l19M882n173L054J85j936O01J311
1600A267o23l429N463k650l631P747o737R75M430p391O073j072l922N874l647
1615a273Q17O58q73K546l334K914m27k110L196l131K708m19k640L277l256K917
1631A570j571k032N862p188K600M540q484O324o92m532N916l451p01L106q10k189
1647a732J397L537p518N039L408r308Q568k220n732J0598p593q97P355o964J536
1662e26L148l201k67J573J09l047L629k327k268P605p537J706M899p755O020r14
1678H47l643N841m942K218K111m367L381j589P06Q9j256K074k618J942o90r04
1694h00K541m700M172K7m201N862n202J445L969p017N934r37m901O636k650j741
$$ y = [-2920, 603, 3477, -5245, 3803, 1380, -4342, 4939, -1338, -1657, 3225, -1948, 1106, 1291, -645, -44, 1267, 644, -2785, 2678, 28, -3603, 4144, -2593, -1618, 2812, -4579, 1494, 422, -3500, 2374, -1273, -456, 202, -671, 1875, -1459, 1455, 1028, -1082, 2114, -1017, 1691, 1272, -1368, 1909, -1347, 1570, -1, -2033, 3829, -3359, -759, 3781, -4703, 1621, 929, -3603, 2313, -1138, -1839, 1267, 457, -1732, -335, 3202, -4316, 723, 4131, -5177, 3391, 1171, -4561, 6037, -1556, -2453, 4902, -2062, -526, 2622, -579, -846, 727, 836, -2211, 1418, -909, -3177, 4428, -3109, -1403, 3496, -4259, 1761, 847, -2796, 3045, -1897, 321, 2432, -1935, 1446, -143, 563, 652, -604, 1470, -1148, 794, 104, -800, 1741, -2959, 1213, 1240, -2961, 2901, -2301, -856, 3113, -3904, 2030, 1093, -3808, 2828, 178, -1563]
1710a563K541r99p30J027J236m392L935J447p476Q901l267n884J0571p089n96
1725b338O798p440L278J903l898K108R03k170l63L259k445k055N828n820J659
1740g93L860p177N814j218m024O194m045P70K002l061L482k014K24J044j710J767
1756A115j453J592p46j597L017l740K957j49m039O394m766K18M522o690L982P39
1772A356l867M475k724q06K292q92L3k91J497k899K192K044o118O015j968l143
1788b804P662o689K71N500o482L781J048m925L354J35j219l02R89j498r82N105
1804B944n038O18L676n702N147l48l726M541l476J950J443l753L193k019P88J613
1820A851l184J798r59O12M84j420K143l471L064O99m176N275l885n20N016n607
$$ y = [-1563, 978, -21, -751, 276, 1512, -2880, 1055, 2502, -4974, 3927, 660, -5224, 5347, -1742, -2338, 4460, -2980, 298, 2201, -1697, 411, 1314, -856, -1219, 2040, -405, -2460, 3368, -2452, -793, 3067, -4110, 1704, 486, -3538, 2656, -1389, -619, 1383, -1678, 1804, -210, 14, 1058, -652, 1115, -338, 1254, 508, -1089, 1928, -1812, 1145, 996, -3043, 3351, -1415, -1197, 3325, -3365, 617, 1356, -2511, 1964, -760, -1566, 726, -166, -133, -424, 1073, -1826, 366, 2410, -3708, 2307, 339, -2804, 4858, -1831, -1560, 3940, -2542, 1239, 2287, -2638, 716, 851, -368, -670, 319, -1179, -2161, 2944, -2094, -1476, 2200, -3502, 1645, 1297, -2429, 2112, -1364, 586, 2029, -1724, 1469, -550, 238, 1851, -1333, 465, -494, 118, 602, -818, 1325, -2146, 918, 1617, -2559, 2716, -1169, -1689, 3327, -2280]
1836b280L038K28l590M391k284m58J053j089J313o67J282j732L5L109m099L637
1852A887o10l901O003l824K24K720m798L244j31k024K406k804J461k10k52Q28
1868B19k019K464j303M56J917m215M098j055k308M822m873J337K585l887L432
1883A670j827r64J910j249J363j842J112Q83k290L364k759K37J877l261L320k299
1899g55p85L339m316L058J73l659M353k625R86J194k078J803q91J650o77j411
1915f41K573k770J912O23l237L422k554nK775m305L051j199j334L311l358J727
1931iK9r86J865j722J827j449m74L230l847K193m00k529M452l381J101J284k953
1948a769L384k209J85J561k565K829j163m62J682k478J869j157J42J258l451L536
$$ y = [-2280, 758, 986, -2604, 1787, -497, -955, 98, -991, 322, -345, 937, -795, -760, 2349, -1750, 1887, 1277, -2624, 3379, -445, -221, 2499, -2299, 945, 814, -1210, 1196, -1608, -147, -357, -609, 219, -1800, 664, -639, -183, 1734, -2481, 1617, 562, -1746, 3076, -1797, -460, 2125, -1762, 1670, -157, -1121, 789, -460, 903, -939, 173, 1056, -1234, 2130, -629, -392, 1485, -1776, 1544, -755, -1540, 1799, -2517, 541, 714, -2945, 1408, -1217, -231, 963, -1115, 688, -203, 1447, 770, -641, 1932, -838, 1074, 1697, -1540, 1882, -672, -677, 2098, -2207, 844, -355, -1689, 1622, -1736, -9, 20, -966, 899, -823, 1004, -445, -919, 2311, -1536, 657, 257, -2272, 2180, -1201, -100, 1184, -1769, 1615, -594, -409, 1152, -1413, 1416, 253, -209, 1473, -1005, 864, -293, -151, 1107, -2344, 1192]
1964A192j652q15L073m042K094P44k300L375k737P54J073j913K477j689K88P82
1980G04j836K976k390P41O75k429L551k425l24K521l891L301k19k554L015k190
1996g74J096L40j609J685k098K029p62j437K809l182K114O92k703K961k175P29
2012b85J910k956K698j535q1K321k854K224j611o46K496k894K148j257q16K452
2028A314k680J841j073o27K443k622K366r86k020M240l496R72J493l010L204p13
2044F46j076J215j358J524j281J040j96k208M034k924o2K427m050L424j44k693
2060a682K895k558R65J019j484J080j712J878k35r75K147k914J863J165l215L695
2076A932k763O4K567k555J963j549j49K125k577K173j802n32K762k963J590k9
$$ y = [1192, -460, -1275, 1798, -2244, -150, 594, -1706, 1669, -1068, -314, 759, -1154, 1323, -366, -78, 704, -1132, 1844, -546, 195, 870, -1559, 1992, -433, -757, 1764, -2127, 1174, 955, -1599, 1416, -774, 322, 662, -947, 738, -1360, 669, -93, -1530, 1279, -1903, 211, 903, -1800, 1161, -1014, -285, 1625, -1331, 1367, -168, -249, 2072, -782, 1442, -169, -815, 1681, -1213, 935, -322, -1138, 1314, -1366, 475, -598, -1225, 1218, -1404, 962, -24, -2044, 2196, -1300, -328, 1165, -1845, 1359, 646, -430, 785, -573, 951, -330, 710, 514, -1694, 2340, -584, -646, 1781, -2269, 1155, 1011, -1682, 1213, -1345, -380, 639, -845, 235, -1477, 401, 166, -809, 1338, -1576, 287, 1452, -1763, 1932, -831, -767, 1800, -755, 1208, -341, -490, 1635, -942, 1231, -571, -1103, 1659, -1304, 286, 257]
2092B57j693K309j317O60o60p29K338k713K698j399j992M755l871Q88K805m841
2108b505L139J60j658J572j281O51J17Q27q99j555L467l204N65L189n417M032
2124A200j20l392M447k836o52K702j970P47p74J115p93j91K251l439J751P41k764
2141a977M025k467m59K414k295J873j130n71J987k514K381r84j390K771k905J418
2157A77L71j925J946r84J27J85n23J692k966K940r78k243M269l521O96K798m199
2174b138L124K18k847K805q73m04K24O48r88n93K769l417R84K876n352M341n5
2191A322m176N304k863j131L146k720O73J062p54l18L11J183l115K735N68l271
2207b044M009k256p87K859l207K331m01j497K259k138J785l14j510K368k426J137
$$ y = [257, -1436, 873, -444, 216, -444, -1173, 1165, -1548, 1150, -249, -2241, 2514, -1357, -469, 2336, -2505, 634, 794, -864, 708, -573, 78, 195, 1022, 123, -1432, 2035, -1169, -604, 2585, -2832, 1200, 1080, -2312, 2135, -701, -1353, 1349, -621, 126, -648, 467, -326, -517, 1734, -1705, 46, 787, -1977, 2048, -419, -878, 1536, -759, 1114, -16, -587, 1400, -1114, 1267, 283, -1107, 1664, -1241, 177, 548, -1377, 569, -415, -288, -103, -626, 1066, -1900, 1040, 62, -2181, 2088, -1433, -737, 2061, -2138, 986, 1204, -1643, 1162, 289, -115, 109, 757, -231, -824, 1945, -1472, -488, 2388, -2964, 1377, 1322, -2854, 2450, -413, -1544, 1602, -1118, -445, 617, -137, -455, -144, 1039, -2076, 659, 1227, -2044, 1965, -291, -1078, 1781, -1426, 905, 504, -993, 1266, -872, 913, 599, -911, 1457, -969, 168]
2223A68R59k309J779j048L47j05k36J334k676K604o44k443M536l315Q3L433m241
2240a774K394Q67k890K410q84l41M84K78n75o40K385k845N27K931m600L234K24
2257A185l654M653k617o28K547k799J192K31o05N55p05J025j318J105J78k081
2273a736L635k873M58K713l703K652n5k322K979k363P89O05k150K589k094L65
2289e11J179j778J749j222L32K22p27J375j563J581P2k421L636k613j32K939m029
2306a911K450O67l049K912r59p90R08k44J28p13J976k035O0K584l777K450K65
2323I22l156M061k164q15K469l027K109k60p75Q69r25J239j092M70R71k015K387
2340A268j066l91J859l063K354l89j470K555k797Q02J386k531K311j379k18J360
$$ y = [168, 1127, -1182, 597, -451, -104, -209, -445, 889, -1787, 817, 173, -2270, 2266, -1049, -966, 2467, -1774, 620, 1487, -1403, 1007, 123, -218, 266, 544, -31, -671, 1714, -1131, -604, 2327, -2273, 961, 1185, -2469, 2184, -433, -1061, 1486, -1313, -121, 110, -495, 60, -645, 380, -938, 167, 345, -1736, 1899, -974, -516, 2197, -1506, 1146, 1091, -1231, 1748, -615, 174, 779, -1371, 1218, -876, -511, 668, -1110, 639, -583, -251, -29, -756, 619, -944, 637, 709, -1712, 1924, -689, -821, 2118, -1911, 539, 1206, -1843, 1069, 110, -680, 228, -16, 112, -601, 1375, -660, -600, 1984, -1793, 657, 922, -2234, 1827, -337, -1152, 1317, -1710, 399, 139, -636, 233, -692, 547, -545, -75, 896, -1119, 1268, 202, -189, 1670, -1393, 961, 572, -898, 1657, -1140, -338, 1048, -1483, 828, -551, -769, 591]
2356E91j260J171j242N26N12j433K645k584P48J068k157K611j831n35K489k590
2372a271K037j6k135K495j483N26J047j570Q44p22J011p60n65J777l067K481L69
2389I98l049L271k218L6K398k751J462l58m90J746j486M73n8K7J205j867J318
2406F57r81j1J997k865J593j95j380K962k421M21J057j997K336j494MR96j939
2423a260J984r10k82Q01j275J597j330N43O37k544L412j411j005K759k775J402
2439C43O99j913K026j308J47M68o48J203j698P63K79j385K071j823N38N25j721
2456a434K615j806KJ674k357K144l06j679K165j402Q06k22n03R10j532J668n17
2473B26o59J373j742J337M47k009K048j996R14J331k526K362j557j00J516j854
$$ y = [591, -669, 502, -740, -214, 298, -1135, 1510, -1074, -326, 742, -1415, 1196, -635, -1170, 1319, -1271, 766, 750, -1385, 1110, -373, 153, 1200, -370, 474, -248, 763, 3, -562, 1215, -1852, 629, 998, -2051, 1220, -998, -962, 1436, -1315, 147, -211, -701, 1045, -441, 32, -26, 1, 1206, -661, 657, -324, -335, 1662, -1203, 390, 195, -1185, 1777, -644, -223, 834, -1163, 1173, -321, -317, 679, -1260, 724, -186, -468, 333, -942, 655, -675, -132, 505, -2039, 1373, -38, -1043, 1716, -1059, 343, 1042, -871, 1155, -153, -6, 462, -186, 1017, -681, 82, 361, -1024, 1047, -776, -238, 287, -1434, 1181, -625, -623, 1051, -1306, 838, 532, -1147, 1018, -384, 422, 200, -303, 607, -925, 743, 226, -433, 940, -802, 535, 982, -1027, 1021, -975, -61, 1270, -1256, 1106, -451, -551, 965, -889]
2489h89J203q26j66J076j032J172q18k84J513j878J617o43o46K071k099R89N07
2506H67j902K454j640K13O63j832J817j065M18K65j223J763j546M67J190k622
2522a713K651j352k80K010k578J618p2j244J846j386O65k6j034J778j581J281
2538E83k01j022J598j453Q65M86j684J926j262J25P41j757J704j099PJ376j886
2555i53J046m70o38J802j548R28Rn99J260j217J083r04l87K143k344J291j08j504
2573a110K606j711k65J474j729J226l93n01N59o85J049q63L52M81j787K362j286
2590b21p07K061k662J697Q27j956J688j086N27K61r72J373j459J104J18j487J942
2607A048j660N87J116j983J308q17J65R48j429J124r31K27J097j983J733n81q06
$$ y = [-889, 314, -512, -678, 398, -634, 538, -280, -564, 949, -929, 688, 45, -601, 1470, -629, 360, 867, -1035, 1419, -221, -8, 655, -1177, 640, -425, -7, 258, -965, 798, -748, -281, 909, -1713, 938, -414, -694, 1316, -1262, 356, 284, -960, 886, -500, 165, 139, -895, 883, -698, 583, 382, -640, 958, -495, 370, 856, -828, 1098, -164, -39, 702, -1055, 649, -450, -443, 933, -953, 93, -377, -1015, 787, -761, 167, 176, -423, 837, -380, 703, -201, -588, 1555, -789, 502, 394, -1110, 1496, -215, -480, 994, -735, 491, 98, -403, 156, -529, 520, -343, 9, 490, -1297, 1065, -221, -928, 1133, -1529, 168, 995, -961, 727, -359, 168, 429, -543, 830, -629, 475, 593, -894, 1048, -612, -25, 1091, -892, 416, -401, -236, 712, -717, 407, -524, -297, 800, -1183, 550, -31, -837]
2624h37J905j697Q28J7p66R49p29Q24o83j12J636k478J601L10k209K555j429l28
2642f43K067k412J376q0q18L27K0M32q51N82M23k012K613j564m63K612k629Q60
2660a60Q95k027K120q30j04M61m04N96r40R26m4j107J909j863P1J535j997J534
2678E71m11p03J181j501J532p75k26J026k036J987o09r76J754j378N58O21j004
2695c89N96k72L82m31j08J070k023J609K94k151K758j693k65K110k341J026M47
2712F19j168P47l21K19o14P51J91j597K089j303m40K270k513J108P69j790J813
2729H30q33k01P05o78N41o19M81N5q37J838j802N13O34j360J462p06n32J258j322
2748e73J124o42m38J251j523J010J33j376J805r59P0P67j105N53k44L86k53M1
$$ y = [-837, 1068, -629, 199, 216, -550, 399, -330, 494, -189, -301, 1335, -1143, 458, 768, -1441, 1114, -315, -643, 1424, -988, 388, 308, -510, -183, -163, 269, -582, 0, 423, -1589, 1024, -540, -1003, 1609, -1020, -160, 735, -1292, 828, -2, -106, 355, -49, 547, -393, 533, 489, -618, 1291, -572, -501, 1034, -963, 571, 160, -543, 638, -863, 669, -106, -332, 694, -1342, 645, 36, -940, 814, -564, -6, 615, -389, 207, -65, 317, -114, -222, 848, -1175, 434, 728, -1423, 1335, -358, -623, 1487, -854, 172, 619, -549, 198, -123, 96, -518, 233, 424, -1173, 916, -387, -827, 1443, -1070, 38, 807, -983, 830, -3, -204, 501, -177, 364, -255, 226, 281, -556, 1282, -520, -7, 627, -733, 729, 23, -509, 749, -573, 551, -91, -529, 722, -801, 209, 342, -1034, 771, -188, -118, 649, -456, 97, -147, 239, -14, 27]
2766B7Q73j551J039K93j881K235j243n23K024k392R69O94j274R67o97K84j14M5
2784b25M75q95J456j299l77K236k501J086J127k290K046m05j037J150q58N46k85
2801e0K26L47j105J420j014L3R43j662J454l95p39J200j424R83l35o36J373j523
2819i04J035M24j273J426j072j34J084r98P22m51L58j30m83J067j408O50Q91k071
2837a267K257j141o89J909j753O88M11j095J275q20K70q9L0O41j090P09k39p58
2855g51J398j298P51O56j786J776r17j80J353j326P00j24l98O89o59K93l98J77
2873d4L09q45J092o01n00J115j702J153J15r49J633j415O08N35j186J369p54j03
2891a70O83q90P59m54J71L12p89J045j074L26J002j975J732p03o45J592j622M41
$$ y = [27, 900, -651, 388, 681, -1200, 1035, -208, -731, 1293, -1099, -130, 564, -710, 257, -440, -156, -270, -225, 250, -645, 811, -488, -865, 1371, -1130, -44, 1083, -1207, 839, 434, -603, 547, -311, 235, -50, 176, 523, -582, 838, -176, -143, 800, -862, 592, 197, -542, 658, -766, 217, -118, -754, 619, -904, 131, 555, -718, 708, -364, -498, 586, -412, 310, -141, 217, 87, -396, 671, -737, -87, 804, -1267, 990, -151, -840, 1069, -684, 4, 415, -680, 595, -225, 45, -44, -14, 627, -463, 246, 7, -751, 647, -651, 100, 756, -1030, 746, -171, -351, 1002, -324, 376, 252, -146, 543, -116, 177, -221, -44, 265, -580, 512, -89, -589, 526, -1176, -23, 92, -857, 776, -639, -31, 504, -682, 687, -67, -170, 513, -377, 382, -72, 99, 411, -378, 667, -407, -81, 921, -1054, 678, -25, -670, 922, -700, -259]
2909b59P65j276J191n67j96K49p9O20j005P35j30o78J455j231K76Q98j613J508
2927F63m76o06J387j711J006k11n42R74q43O63m43k96P78q62P90k89l76J257j653
2946g90J028K4j147J463j057K85Q36j417J391q72k43R27p68P37n40J56L49o52
2964b90Q09r56J57J073j358R25P1j001J199j337R30J66j112J155o02J0K27n40
2982d74R30o97L91M3o88J149j384J047L78j394J271m71o03J407j721J240k44n59
3000c79J021j026P19l67k51P76q48N63j61n43J091j131L71N52r92J121p12J9P32
3019E55j348J185l73m83Q99q39O46k49j66L55m61Q79o15j63P53j397J421l86q04
3038e91J349j442P94K60j171J110o30j33R97r43P82o83K6M53o11J227j184M28
$$ y = [-259, 506, -770, 421, -146, -342, -93, -172, 448, -557, 178, 48, -630, 825, -406, -130, 768, -845, 663, 187, -419, 968, -743, 263, 52, -490, 484, -359, 304, -139, -435, 343, -519, 271, -18, -394, 863, -790, 238, 262, -885, 578, -479, -194, 642, -775, 616, -256, -499, 428, -340, 397, -143, 13, 362, -290, 519, -437, -280, 793, -565, 360, 431, -570, 629, -708, 222, 388, -724, 431, -171, -161, 66, -474, 456, -241, 150, 193, -495, 654, -730, 317, 695, -699, 572, 101, -502, 905, -816, 424, 180, -379, 642, -384, 335, -32, -283, 493, -355, 208, 47, -496, 595, -536, -165, 387, -605, 516, -196, -177, 555, -793, 392, 19, -464, 435, -404, 242, -7, -173, 182, -279, 600, -15, -178, 575, -822, 599, 213, -591, 758, -684, 110, 370, -801, 309, -321, -454, 543, -400, 382, -301, -275, 178, -433, 794, -390, 38]
3056C8M87j255J328m96o54J221r07L27M95q36N25o58M84J03q26J431j345O39K64
3075C65r72O34l97L06L36r19J143q68L14K96j049J254n40l99J178j020O42N0o19
3094b65P33n00K60k56j69P30q58M40j46o93J847j704L95Q10j436J104m33l71Q78
3113C66p03O26n06K1L63o63R90m97p5M74j446J343L1q10J490j278J91K37m18Q76
3133F12r71M06L2n26J120j419O17N85j189J172q38k6Q72p74N59m57J42L61o96
3152d18J161p43l70J240j428J142j15r38J058m94MM6l46M28l45L48k70p10J401
3171F51j162M65L83j407J394k63m93J288j330L51R1M3K69q22J026n53L40L61j476
3190h44J546n06o63J231j045R0N01m78N88n15J54K79p23Q73j013L68M34q88J192
$$ y = [38, 525, -730, 598, 102, -552, 669, -238, 89, 584, -252, 273, -385, 99, 202, -624, 807, -538, 101, 365, -607, 27, -370, -64, 272, -647, 496, -372, -58, 238, -811, 443, -97, -496, 682, -338, 304, 354, -265, 468, -32, 228, -28, -197, 533, -325, 115, -31, -724, 1123, -581, -186, 624, -812, 292, -141, -512, 366, -337, 289, -217, -196, 167, -496, 494, -3, -78, 396, -1050, 293, 324, -486, 1004, -274, -83, 154, -264, 612, -359, 47, 79, -447, 673, -746, -129, 456, -733, 439, -399, -425, 447, -327, 232, -225, -83, 278, -418, 743, 0, -370, 870, -558, 584, 469, -469, 589, 95, 99, 145, -201, 227, -118, 230, -40, -750, 651, -511, -46, 337, -1070, 324, 61, -432, 856, -474, -123, -32, 11, 280, -542, 484, -69, 271, 632, -844, 702, 196, -467, 764, -281, -191, 310, -168, 420, -95, 59, 338, -385, 488, -525, -157, 277, -611, 581]
3209E81o42m57P60p48P03k56n9M62p17R44p19j85R13j271J190q5j240J210m17
3228c3J00L39o94M88m81O93Op38Q56r82L87Q11j814J334j74l63R80j170J57L80
3248H2K3N5m2J74l82j05J022j256P12K3o20J341j091p9N54p95Q44n29mJ34o72
3269f11J202j018L23M11j080J014q2o48R65r25R07k58n21P04o64P39m63m39J025
3288E81r70N22N47j257R61m86k84R29n78K92k29j81L73m83P35j052L90R01j454
3307g43J296p26n83J388r73K41K29k90J28q4M17m20O1N22r91P96o8q09J376j059
3327b92R3O21r50P99l7m76M73n57M20l66k2P23q07N38k71l36Q75r42Q59m84k80
3348d19J082q43O54j75o88J197j013J42M27q20O82k83n1L76k37J93k74K05j15
$$ y = [581, -61, -518, 242, -506, 197, -59, -118, 344, -373, 571, -148, -333, 580, -691, 499, 414, -826, 384, -33, 67, 406, -288, 200, -281, 412, 418, -320, 536, -446, -59, 752, -1062, 272, 98, -265, 715, -455, -298, 82, 105, 160, 118, 292, -90, -195, 827, -429, 283, 306, -314, 1027, -64, -143, 411, -384, 460, -69, -73, 61, -611, 591, -427, -104, 307, -773, 241, 159, -489, 476, -449, 458, 200, -321, 383, -281, 458, -5, -444, 581, -389, 133, 680, -577, 384, -102, -386, 543, -35, 257, 28, -153, 220, -263, 472, -580, -190, 711, -743, 553, -173, -756, 632, -341, -100, 129, -161, -33, -117, 300, -120, -59, 463, -528, 268, 200, -609, 767, -292, -199, 422, -528, 271, 234, -242, 231, -326, 94, -272, -294, 429, -378, 160, -111, -447, 428, -514, 345, -139, -419, 663, -180, 474, 299, -389, 808, -205, -63, 364, -456, 226, -57, -108, 268, 31, 224, -50, 155, 40]
3367D0m41R11p41j97P64j096R33k03n27J213j001L23M31o48O96n92N62l08k07
3386h8L89p80O68J24o95Q56n44m2J051j480P24k18j36M76o47N43l94q8P26j199
3406g54R45l04j26L29n07P02j94m05P61q26O75L13j040J055p58L27K60p91N17
3425A79J9l30P00n99K71m43Q9M58o65N21p2l36O72j058O64Q2q70J264p31K97K46
3446C58q18P32k21l06O53n87P01o72K72K71p46Q72r17L96M26r38R76n85m16Q81
3466C32n67M17l91k74Q68p43M91q8l18P53p30K63l4k13P00r15N44P7l92P45m81
3487D4j73M65o06N12j22k33L72m83N94n27K62K37m13L29q7o15P63q96Q00p1p44
3508e92R22p00J72O74q16M74MJ90j27k00M21n37Q3N29o51O47p42j08Q94j045Q12
$$ y = [40, -401, 510, -231, -428, 336, -760, 173, -30, -557, 656, -345, -22, 409, -239, 457, -135, 427, 119, -88, 301, -479, 189, 313, -382, 474, -70, -112, 939, -541, 183, -35, -171, 305, -342, 201, -193, -281, 445, -754, 191, -113, -239, 90, -417, 285, 91, -314, 447, -379, 296, 609, -431, 624, -134, 193, 453, -338, 179, 198, -132, 568, -31, 240, -203, -114, 344, -321, 200, 128, -208, 464, -594, 70, 152, -718, 546, -185, 112, 358, -460, 272, 51, -255, 398, -189, 512, -160, 112, 383, -363, 509, -408, -12, 414, -524, 452, -133, -549, 332, -235, 182, -209, -483, 385, -358, 133, 45, -273, 480, -250, 13, -21, -234, 466, -449, 95, 172, -220, 525, 44, -129, 336, -270, 242, 120, -113, 259, -224, 370, -157, 105, 342, -71, 258, 171, -444, 319, -577, 223, 152, -592, 330, -370, -198, 476, -340, 134, 138, 328, 201, 1, 422, -115, -32, 497, -154, 493, -249, -357, 537, -508, 304]
3529C04j20n59Q00j001P82j88n07P72p16M85j09j00P00p51J60L34m49N87m77K83
3549B30J35o13P64q12K25M70r22N57k20M7O25n74l2P9l43N73m71M76r9m36Q51
3570E10j229O16N66r95J041k96l38O89r75N65l15J85L27m75M62j76o8L71o74O43
3590D34m85l06Q73j126Q09L2l23L02m70J80K11m51K88m49M00J38k86N05o03J48
3610a79L08m12O59m17j41N37m37M24n13J23L48p04P07k54n19P99p51O32q9p48
3630f27P41l10J75j71k30O20n19M45k38l09J104r79K98N38q75N48j38j74N06o00
3650a95J93j95qM97q21Q73j76q06J126q84L80K68n99K86o6M26M7o03O45p72N21
3671A37J08n85O76n98K57J32m08M41j22j11L84o93P17l87p7Q06n73J11l16n94
$$ y = [304, 184, -375, 425, -576, 206, 18, -489, 283, -433, 52, -57, -157, 543, -208, -48, 286, -163, 424, -53, 230, 365, -248, 516, -296, -71, 399, -523, 34, -186, -139, 486, -88, -120, -41, -384, 189, -282, 194, 95, -341, 510, -719, -103, 463, -532, 509, 213, -125, 564, -411, 154, -161, 24, 351, -124, 338, 162, 94, 465, -209, 434, -51, -357, 516, -610, 199, 231, -92, 210, -260, -80, 131, -320, -32, -481, -81, 57, -229, 276, -327, -179, 129, -283, 376, -41, -182, 355, -82, 342, -171, -48, 300, -404, 303, 49, -470, 329, -422, 210, 121, -627, 114, -196, -21, -192, -422, 198, -321, 124, -114, -423, 681, -298, 0, 538, -337, 211, 73, -101, 405, -195, -2, -197, -205, 292, -529, 344, 168, -638, 488, -396, -16, 252, -347, -61, -127, 299, 346, -257, 388, -384, 137, 245, -340, 336, -262, -5, 127, -281, 160, 38, -73, 311, -382, 335, -52, -129, 677, 104, 215, -101, -695]
3691f95R11m34K0L70q07P88j64R8J77n64L74l59L70K17j046J131m26q9O23j043
3711e48N42L5j78N25o46L62r0p9M87p97P43j79m44Q78j234L92M52n73M00j71J05
3732a8Q6k59L32l44l8O01j038J176o12K4L16k88L98J77q29K14J96j17K40l68P38
3753E87q50O05j11p70Q42o48L63J63m82M95l75J79M6m25M51l14M26J3o09Q59l25
3774A20l86P98q50N66m4m42P06o24J70n8K4K66m36K69J16o78R58m14k40M92p17
3795d04J030o57k20K29j50M99l91J25O5o71J142p85j10Q29r81N97j11l15L36Q3
3815A40K8l13%L10l24M01K2q00R45o84j17O35o40N85j54k28M12o62N32l34M48
3836B02l1m00N76o2m45P03q20PM13n13O28m75L95L9k65K92n03L60k31l38P02o80
$$ y = [-695, 216, -218, -198, 172, -635, 153, -11, 87, 264, -300, 74, -285, 85, 302, -744, 387, -39, -128, 495, -548, -6, 29, -149, 376, -270, 92, 2, -77, 410, -387, 356, 177, -267, 611, -623, -231, 221, -352, 48, -123, -18, 68, -191, 141, -203, -241, 360, -678, 498, -114, -90, 226, -62, 336, 513, -316, -102, 94, -23, 217, -151, 587, -263, 342, 231, -539, 303, -345, 18, 181, -301, 194, -181, -2, 44, -381, 70, -244, 182, 195, -414, 445, 120, -266, 532, -318, 248, 204, -238, 468, -156, 14, -44, -20, 246, -190, 79, 195, -483, 475, 61, -179, 313, -404, 626, -31, -251, -22, -172, 327, -64, 61, 126, -545, 597, -188, -298, 531, -450, 147, 36, -279, 57, 140, 168, -145, -145, 165, -159, 242, 264, -536, 409, -275, -392, 243, -397, 188, 34, -194, 218, -444, 88, -246, 202, 171, -229, 347, 285, -160, 543, -277, -270, 143, -370, 258, -217, 178, 217, -48, 244, -259, 101, -130, -468, 234, -446]
3858d46N79K86q69Q89o56j2O19n42M81k67m39P21m98M11k90k61Q05o98N32l70
3878b5k88N55l02J69j42j64L05l39K54K40p60O13l80J91N55p01L68k51k40M70
3898A28p5j67L3N5J12l26M80l94l76J091r38O03K15o34K88j33n6L88l89L87m02
3919a10L0K32m10M90k51j78L40n77O90p3n06O58j012P07k20J11L88o73M15N2k36
3940a33L69j82K07Lp78P90n78N00n3j17J64n58L75K23p53R03m39l09M30o11Q14
3961B67k29n27Q31p11K31K08o22R28p32O85l76k95R81r56K81L79o64P16p46L49
3981bM15q86M14k10L18J56m18M58o7l13N20n61L65n54O2O59o13K87M5l21M32l68
4003a82J08L74n46O93o13J91Mj47L80l00Q6L51n74K91Nk95O77q44N58m42J47K94
$$ y = [-446, 133, 419, -450, 439, -217, -229, 390, -152, 329, 62, -377, 344, -154, 257, -33, -294, 511, -187, 345, -25, -313, 242, -60, 109, -33, -197, 108, -231, 23, 263, -497, 116, -264, -73, 482, -219, 149, -102, -342, 128, 53, -114, -81, -26, 86, -240, 240, -154, -530, 561, -377, 226, 441, -193, 95, -38, -94, 294, -95, 292, -110, -80, 152, -258, 232, -19, -197, 143, -434, 256, 183, -323, 335, -677, 30, -190, -79, 309, -364, 51, 103, -133, 236, 54, 261, 264, -514, 276, -302, 198, 145, 28, 192, -366, 9, 232, -521, 382, -57, -366, 64, -547, 267, 38, -489, 342, -369, -138, 70, -552, 376, -356, 329, -47, -342, 639, -317, -36, 343, -321, 395, -351, -2, 413, -473, -59, -269, 49, 205, -213, 245, 178, -135, 385, -176, 189, -365, -303, 356, -257, 30, 75, -246, 186, -182, -74, 300, -246, 447, -166, 25, 29, -118, 262, -38, 48, 399, -175, 116, 121, -174, 503, -341, 217, -225, -78, 216]
4025B16m57L07j69l80O83n44L08K06m73N67o52M97j54r2N41k06l01N24p83P07
4045C45j52l9j57l53N14l69L4J32j53P7P8o0L71m52J02Q2k76L77m13M21l9l48
4067b78M60k68k7L02p64Q51m16j7K28j05K10l26j49L72q8p1p0k4M07o62O75n89
4089c49j50Q74n09K89j15k45L75j01j06R0k23N03r23N76k8P9K36k49M2K89o48
4110b93M04j09m8M16n55K81l80k0K92m39N04j65j30N30p69N05j65J10L66n37K30
4131B8j8j81K74j53j63N88o34L78m8l4J96q43P26j56l98Q84o94K18rk12L35m36
4153c52N74k22l27M93k54J9K10n42O45j67m7J15l72L61l02l8J85j92P00n41J9
4174c5L80n44L18j92k46N05m15M10j8l45L94m74L02j56k79O91o11O39m18j28N45
$$ y = [216, -241, 66, -103, -483, 200, -344, -36, 170, -303, 264, -388, 109, -45, -137, 404, 198, -103, 421, -362, 345, 193, 154, -3, -356, 158, -211, -177, -45, -198, -121, -43, -103, 268, -184, -82, 0, -276, 101, -312, 109, 70, -278, 182, -86, -113, 189, -575, 276, -140, -157, 71, -34, 176, -150, -299, 73, -15, -86, -156, -180, 227, -435, 240, -349, -499, 375, -134, 155, 40, -205, 170, 69, -37, 53, -170, 333, -590, -14, -42, 37, 273, 24, 66, 355, -293, 111, 2, -46, 370, -185, 96, -284, -304, -12, -451, 53, -112, -242, 288, -481, 24, -141, -31, 335, -202, 28, 10, -171, 103, -50, -213, 375, -259, 119, 71, 37, 233, -610, 116, -40, -438, 446, -248, -30, -39, -251, 84, -352, 222, 0, -327, 166, -88, -69, 141, -401, 244, 77, 30, 145, -227, 134, -168, -206, -21, -213, 487, -54, -35, 345, -199, 119, -73, -319, 186, -229, 181, 163, -182, 212, -262, 40, -116, -395, 296, -315, 324, -94, -222, 323]
4195C23l67q9L66n36L35K33ooo01P89n48j69O69n31K78j21l50M12j36J7L0R7j01
4218a2m35L61J88k23K85j87N0M0m04N72j26k02K36j82K81k11k53O5m6M00k84M0
4240d7K28o11O21j64j39J63n24M90k26L8L33j97J97J2m74M37l21p7N15m97M25
4261A82j36o3K42l73K60j32l6J43m08P11l26m1L77n42N77l32j81J83jj97J24j93
4283a62L69m72M35l09R7L00q05P54l27j51K36lj04M25m99L31k13N8K35l66J82
4304A1Qj47L21k25K50j89l90P42o33J61J26L5k79J14o1J04k97M87o90L82K41l74
4326c03P81n86j73P49m89K37o5m00N75m11L13k73Q3r0j91J27O8k58L85k41L53
4347A91M6m39L55k46l9M39n98K69j30m3N44o09M40k01J44L79o44M26r3l45M44
$$ y = [323, -44, -133, 233, -303, 32, 265, 259, 253, -348, 441, -107, -276, 393, -138, 140, 19, -331, 81, -55, -38, -8, 89, -12, -447, -86, 102, -121, 164, -23, 27, 67, -337, 235, 109, -93, 143, -39, 242, 31, -222, -157, -203, 197, -87, -47, 181, -430, 191, 27, -112, 51, -473, 17, -209, -171, 162, -35, 162, 174, -300, 137, -184, -261, 254, -243, 182, 46, -17, 225, -148, 112, -20, -56, 87, -321, 390, 64, 23, 400, -142, 435, 103, -78, 105, 104, -93, 31, -162, 207, -265, 170, -139, -42, 258, -547, 207, -120, -271, -35, -38, -142, 283, -216, 115, -98, -40, 195, -171, 11, 19, -128, 193, -32, 218, 29, -361, 381, -252, -91, 35, 70, -209, -95, -156, -52, -349, 138, -552, -170, 71, -303, 478, -108, -281, 468, -21, 216, 151, -249, 326, -85, 228, -45, 38, -52, -243, -116, -48, -306, 79, -162, 191, 237, -202, 153, -93, -132, 307, -291, -22, -152, -195, 349, -260, 180, -21, 123, 502, -142, 284, 191, -154, 290]
4368B90l85K03k56P9L56p04L76J66k47M45m52N3K17p90R04k66j9M3l32M89k24
4389e4K67K0l82L71k07N5M33p96M43J91n67M38n86N84j69L8K44o25L91J13k85
4410h3K85k38j80M25o04P56m61J0k53Q4L91j79J52J91p22N85J66p09M59j29M2
4431a2L5J6P4j37L13K8m11K75m73M74L3m87M40l50R8M44n53J01j18q0P8k27M83
4454D4q4P5k7k30M89j96l51O21n75L95k33j27O38p16L63l04J04M05m42J45j3j94
4476b13N32m15PJ86k08K87k41k41M42l18K28l84L56M18o98M23k16l3K92j89j74
4497a59M3NP4J40r5J96m24L80n35N17M1l88N79n69K04K12m47N44l91J53nl85K51
4520e9O9k92L48k24K95k41k10P22p27L91j29j04L87n17K58j19o3N61m04P3P4k61
$$ y = [290, -95, 108, -148, -69, 287, -417, -41, 125, -122, 323, -129, -76, 141, -649, 255, -11, -30, 13, -319, 170, -54, 213, 233, -149, 222, 15, 70, 503, -293, 150, 341, -226, 212, -374, 210, 41, 79, 323, -302, 89, 202, -83, 202, -36, -216, 209, -395, 361, -100, -90, -343, -259, 132, -47, 105, 296, -426, 159, 325, -384, 75, -54, -12, 23, 39, 113, -24, 289, 317, -94, 181, -292, 182, 215, -272, 168, -182, -84, 360, -193, -92, -210, -290, -212, -439, 44, -40, 35, 8, -222, 267, 71, -280, 341, -234, 161, -72, -199, 439, -277, 86, -218, -114, 291, -151, -6, -19, -213, 319, -96, -89, 97, -111, 176, -65, -306, 136, -182, 46, -338, 18, 436, -262, 161, -55, -88, 204, 15, -159, -116, -111, -37, 103, 8, 204, -220, 160, -375, 142, 183, -205, 374, -195, 9, 221, -226, 318, -73, 80, 75, -310, -59, 10, -282, 66, -158, 137, -104, -314, 408, -319, 72, -57, -161, 226, -291, -33, -152, -215, 346, -58, 15, 89, -172]
4542a72N18m92j41K90m0K10j86k02J47Q6L11k30J40J9k80j00M16m35K16m89N88
4563A74K95o83K71r1J24k06r9N17l89O7k3m56P04l75m5K23k09L04j74l6N38o64
4585b33Q9J10k16N16m05PJ37l26N09k75K46q8j38J90k69K96m8m56O48o49R2L76
4607A13l92M03k46J25j42j26J27J37k06J68m00O17j57k92L52l68M24j84k7L56
4627B82k64J13j56k42P19l38j55K22p7K74m43K49n8n61O23j40j88K15n12M98j00
4648c9j07K34k42K21k63K79J06k85J79O7m35O87m45q2J86k83L48j3j11j77k4N28
4670C29m39k8K35n12M50Pm14O12k80J24J1l37K03k59M91l01j7L71p77Q48k38m64
4692c85Q88o16Q5L37o38K69o6K30J51m94O07j65n7j78q9L86l72k51Q02p15L69
$$ y = [-172, 346, -146, -287, 3, -37, 173, -13, -215, -68, 18, 329, 99, 239, 258, -22, -122, 294, -141, 75, -414, 174, 469, -214, 57, -34, 90, -116, -215, 302, -87, -20, -43, -499, 205, -170, -215, 8, -201, 103, -71, -107, 431, -233, -144, -34, -250, 266, -139, -132, 5, -321, 188, -87, 159, 71, -67, 123, -146, 150, 102, -354, 294, -355, -263, 113, -279, 124, -122, 3, -139, -265, -138, -1, -207, -39, -439, 178, 21, -271, 81, -287, 137, -47, -74, 282, 18, 131, -25, -267, 452, 114, -41, 181, 104, 378, -65, 184, 126, -435, 188, 48, -140, 75, -437, 61, -39, -146, 88, -154, 67, -196, 83, 189, -96, 83, 150, -285, 402, -43, -125, 61, -222, 126, 113, 2, -175, -199, 329, -110, -138, 97, -415, 35, 42, -372, 240, -40, 84, 95, -242, -39, -298, 193, -108, -125, 246, -531, 317, 79, -385, 503, -113, -28, 309, -329, -60, -126, 104, 255, -239, 368, 203, 146, -32, -121, 265, -107, -358, 444, -271, 98]
4713I8j26k21M77n59L97j42m4M08l24J78J02l28M14m68K21K25m43L04l24J33L2
4734A0j60L75k71K79l42m47R38n25j42L13l67J99L63n00K27j37J64J05m4J25m39
4755b76N39p0l97N49m55l1L67m05K24J08n2j46j7L40o39L56N9k38L83j97k81O32
4777C53p19M06o6k7K2nj6J20k07M16m71L26J22m42L41ol52M12j69J10J06k14R1
4800A31j82K34l90K64o8r8K33M0m02N27l05j20L54l08K43j42O1L5k04M23n16K74
4822H4J61n73M53l52K67K96n27O65l35k09K62r2k05L9J1J83l72M44l20M9O32o90
4844a29k6M15p48N72j61j14K40l33L46k5J19k11P8L69n71J80K15l94L93l60j11
4865b56M26k00J90k08l15N07l32J63q1K0L67o16J16Q5r4K73j16K10n3N7K88o75
$$ y = [98, -28, -249, 228, -331, 66, -76, -120, 288, -36, 142, 244, -84, 330, -138, 83, 308, -135, 169, -155, -22, 10, -150, 225, -46, 233, -109, -556, 382, -143, -285, 28, -339, -140, 223, -277, -50, -187, -23, 82, 38, 163, -276, 263, 193, -204, 345, -110, -141, 226, -179, 45, 153, 101, -45, -62, 278, -361, -5, 54, -184, 199, 2, -279, 353, -366, 40, -26, -53, -31, -36, -52, 68, -139, 277, -194, 132, 254, -188, 153, 147, -205, 207, 38, 148, 254, 40, 131, -51, 183, -207, 57, -11, -109, 124, 164, -238, 289, -16, -136, 218, -90, 153, 11, 72, 107, -97, 326, -190, 84, 245, -328, 125, -227, 40, 336, -191, 474, 139, -70, 192, 100, -105, -66, -55, 128, -244, 200, -120, -71, 561, -129, -155, 260, -488, 84, -77, -191, 49, -284, 62, 37, 156, -55, 23, 392, -179, 1, 216, -178, 215, -145, -256, 170, -30, 160, -48, -363, 144, -188, -25, -106, -86, 281, -335, -219, -134, -228, 45, -71, 139, 86, 143, 431, -244]
4887b44K60K43p18R03n36j53O27m76J46Ql72M23l51L62p9j13j0q0R8J90j53M94
4909D69m81P2J03n37M30m8k6L57o35M97l4j09K24m54L97l21K40K0k27L35m20J7
4931a31K88m25N40j51k55L56m96L38j14l10L53k16L05j9l66L92J7j70K68m07J42
4952f1k2K42k8n69M43M4k17N28p34N36l03k4L77k23l5p3p3K98k51mN7o8J43m03
4976d20L56J45m75Q29m61l3J67k60M15l51j65M67l77L09j6j82L93n91J97J99m9
4997I7J78l38K75k44j72J69j82L28j71j43K88j21j66M88n46K23p1m5L02k91J86
5018D4j72M5M22o47P04m17J17N0o13P00k29l15M58l45K94M4l07J45r1K72q9j89
5040a19J79k12K29O8l22L57k68L0J94l05K71l23K06K98l34J40m7k37M94m59L36
$$ y = [-244, 16, 259, -459, 444, -92, -245, 382, -94, 52, 60, -312, 111, -240, 122, 43, -70, -80, -160, -62, 128, -25, 469, -12, 60, 163, -374, 56, 8, -18, 339, -296, 201, 167, 58, 282, -172, 225, -96, 144, 164, -63, 272, -148, -131, 157, -268, 272, 121, -134, 222, -274, 64, -50, -360, -7, -223, 82, 63, -303, 89, 106, -64, 204, -203, -61, -83, 159, 131, -438, 5, 49, -168, 360, -374, 162, -141, -165, 212, -11, -46, -119, -192, 106, -145, -149, -92, -160, -17, -420, -64, 81, -394, 435, -26, -59, 108, -152, 263, -88, -253, 214, -163, 146, 130, -52, 341, -250, -53, 146, 97, 275, -63, 212, -32, -204, -35, -217, 111, -60, -203, 85, -36, -202, 286, -260, -37, -108, -153, 149, -142, 44, -128, -83, 339, -308, 396, -21, 96, 146, -467, 233, 4, -311, 147, -198, 96, 140, -167, -22, -113, 159, 70, -119, 60, -152, 77, 145, -177, 180, -88, -58, 136, -169, 102, -221, -15, 283, -51, 89, 42, -195, 299, -160, 176]
5061A76m0j37R6j85J72J4l69M63l53N12j61n49M82j79k60M36m35M03j2j03J00
5082G1k47J86m3j80M01k14M95n21j2L78n20J86K33m98M34j97k7k7r0K63k81J88
5104b2N6j08L07k83NM04o21N58l45N4K55m96J11M44k50L02m13K33r5k78M28o94
$$ y = [176, 136, -1, 95, -90, 82, 96, -273, 190, -163, 349, 188, -361, 121, -58, -318, 118, -317, 86, 74, -29, 71, -176, 10, -33, -213, 188, -26, 469, -52, -64, 314, -206, -20, 213, -285, 149, -48, -75, -102, -192, 71, -210, -22, 34, -74, 233, -50, -45, 359, -262, 296, -49, 5, 260, -236, -125, 319, 69, 371, -42, 191, 96, -182, 246, -448]
$$ [...]
8191G6
##END NTUPLES=NMR FID
##END=
