##TITLE=1H_88-2024
 CDCl3
 8 sc, 
 7.10.2024
##JCAMPDX= 6.0         $$ Bruker NMR JCAMP-DX V2.0
##DATA TYPE= NMR FID
##DATA CLASS= NTUPLES
##ORIGIN= UXNMR, Bruker Analytische Messtechnik GmbH
##OWNER= root
$$ XWIN-NMR		Version 3.5
$$ Mon Oct  7 14:01:21 2024 Russian Standard Time (UT+4h)  she@DPX200
##.OBSERVE FREQUENCY= 200.1318
##.OBSERVE NUCLEUS= ^1H
##.DELAY= (6, 6)
##.ACQUISITION MODE= SIMULTANEOUS
##.ACQUISITION SCHEME= undefined
##.AVERAGES= 8
##.DIGITISER RES= 18
##SPECTROMETER/DATA SYSTEM= spect
##.PULSE SEQUENCE= zg30
##.SOLVENT NAME= CDCl3
##.SHIFT REFERENCE= (INTERNAL, CDCl3, 0, 15.7039)
##AUDIT TRAIL= $$ (NUMBER, WHEN, WHO, WHERE, WHAT)
$$ ##TITLE= Audit trail, XWIN-NMR		Version 3.5
$$ ##JCAMPDX= 5.01
$$ ##ORIGIN= Bruker BioSpin GmbH
$$ ##OWNER= she
$$ F:/spectra/data/she/nmr/H-F/1/audita.txt
$$ ##AUDIT TRAIL=  $$ (NUMBER, WHEN, WHO, WHERE, WHAT)
(   1,<2024-10-07 13:59:59.73 +0400>,<she>,<DPX200>,
      <created by zg, POWCHK disabled, PULCHK disabled
       configuration hash MD5:
       00 E9 B6 7A A2 85 ED C7 34 08 36 98 17 FE 4E 26
       data hash MD5: 16K
       5B 49 1B 54 4E 97 91 F3 9F 48 F2 84 FD B1 D8 3B>)
$$ ##END=
$$ 
$$ hash MD5
$$ 59 14 0A F8 67 FD 87 F1 41 8F AD CE 8B 56 F4 32
##$RELAX= 
##$RELAX= 
##$RELAX= 
##$RELAX= 
##$RELAX= 
##$RELAX= 
$$ Bruker specific parameters
$$ --------------------------
##$DU= <F:/spectra>
##$EXPNO= 1
##$NAME= <H-F>
##$PROCNO= 1
##$TYPE= <nmr>
##$USER= <she>
##$AMP= (0..31)
100 100 100 100 100 100 100 100 100 100 100 100 100 100 100 100 100 100 
100 100 100 100 100 100 100 100 100 100 100 100 100 100 
##$AQSEQ= 0
##$AQ_mod= 1
##$AUNM= <au_zg>
##$AUTOPOS= <>
##$BF1= 200.13
##$BF2= 200.13
##$BF3= 200.13
##$BF4= 200.13
##$BF5= 200.13
##$BF6= 200.13
##$BF7= 200.13
##$BF8= 200.13
##$BYTORDA= 1
##$CFDGTYP= 0
##$CFRGTYP= 5
##$CHEMSTR= <none>
##$CNST= (0..31)
1 1 145 1 1 1 1 1 1 1 1 1 1 1 1 1 1 1 1 1 1 1 1 1 1 1 1 1 1 1 1 1 
##$CPDPRG= <>
##$CPDPRG1= <>
##$CPDPRG2= <>
##$CPDPRG3= <>
##$CPDPRG4= <mlev>
##$CPDPRG5= <mlev>
##$CPDPRG6= <mlev>
##$CPDPRG7= <mlev>
##$CPDPRG8= <mlev>
##$CPDPRGB= <>
##$CPDPRGT= <>
##$D= (0..31)
0 1.2 0 0 0 0 0 0 0 0.06 0 0.03 0 0 0 0 0.0002 0 0 0 0 0 0 0 0 0 0 0 0 
0 0 0 
##$DATE= 1728295199
##$DBL= (0..7)
120 120 120 120 120 120 120 120 
##$DBP= (0..7)
150 150 150 150 150 150 150 150 
##$DBP07= 0
##$DBPNAM0= <>
##$DBPNAM1= <>
##$DBPNAM2= <>
##$DBPNAM3= <>
##$DBPNAM4= <>
##$DBPNAM5= <>
##$DBPNAM6= <>
##$DBPNAM7= <>
##$DBPOAL= (0..7)
0.5 0.5 0.5 0.5 0.5 0.5 0.5 0.5 
##$DBPOFFS= (0..7)
0 0 0 0 0 0 0 0 
##$DE= 6
##$DECBNUC= <off>
##$DECIM= 24
##$DECNUC= <off>
##$DECSTAT= 4
##$DIGMOD= 1
##$DIGTYP= 9
##$DL= (0..7)
0 120 120 120 120 120 120 120 
##$DP= (0..7)
150 150 150 150 150 150 150 150 
##$DP07= 0
##$DPNAME0= <>
##$DPNAME1= <>
##$DPNAME2= <>
##$DPNAME3= <>
##$DPNAME4= <>
##$DPNAME5= <>
##$DPNAME6= <>
##$DPNAME7= <>
##$DPOAL= (0..7)
0.5 0.5 0.5 0.5 0.5 0.5 0.5 0.5 
##$DPOFFS= (0..7)
0 0 0 0 0 0 0 0 
##$DQDMODE= 0
##$DR= 18
##$DS= 0
##$DSLIST= <SSSSSSSSSSSSSSS>
$$ [...]
##$SUBNAM2= <"">
##$SUBNAM3= <"">
##$SUBNAM4= <"">
##$SUBNAM5= <"">
##$SUBNAM6= <"">
##$SUBNAM7= <"">
##$SUBNAM8= <"">
##$SUBNAM9= <"">
##$SW= 24.0689170037331
##$SWIBOX= (0..15)
0 0 2 0 0 0 0 0 0 0 0 0 0 0 0 0 
##$SW_h= 4816.95568400771
##$TD= 16384
##$TD0= 1
##$TE= 0
##$TE2= 300
##$TE3= 300
##$TEG= 300
##$TL= (0..7)
0 120 120 120 120 120 120 120 
##$TP= (0..7)
150 150 150 150 150 150 150 150 
##$TP07= 0
##$TPNAME0= <>
##$TPNAME1= <>
##$TPNAME2= <>
##$TPNAME3= <>
##$TPNAME4= <>
##$TPNAME5= <>
##$TPNAME6= <>
##$TPNAME7= <>
##$TPOAL= (0..7)
0.5 0.5 0.5 0.5 0.5 0.5 0.5 0.5 
##$TPOFFS= (0..7)
0 0 0 0 0 0 0 0 
##$TUNHIN= 0
##$TUNHOUT= 0
##$TUNXOUT= 0
##$USERA1= <user>
##$USERA2= <user>
##$USERA3= <user>
##$USERA4= <user>
##$USERA5= <user>
##$V9= 5
##$VALIST= <valist>
##$VCLIST= <CCCCCCCCCCCCCCC>
##$VD= 0
##$VDLIST= <DDDDDDDDDDDDDDD>
##$VPLIST= <PPPPPPPPPPPPPPP>
##$VTLIST= <TTTTTTTTTTTTTTT>
##$WBST= 1024
##$WBSW= 4
##$XGAIN= (0..3)
0 0 0 0 
##$XL= 0
##$YL= 0
##$YMAX_a= 581019
##$YMIN_a= -569407
##$ZGOPTNS= <>
##$ZL1= 120
##$ZL2= 120
##$ZL3= 120
##$ZL4= 120
##$ABSF1= 10
##$ABSF2= 0
##$ABSG= 5
##$ABSL= 3
##$ALPHA= 0
##$AQORDER= 0
##$ASSFAC= 0
##$ASSFACI= 0
##$ASSFACX= 0
##$ASSWID= 0
##$AUNMP= <proc_1d>
##$AZFE= 0.1
##$AZFW= 0.1
##$BCFW= 1
##$BC_mod= 2
##$BYTORDP= 1
##$COROFFS= 0
##$CY= 11.3945322036743
##$DATMOD= 1
##$DC= 2
##$DFILT= <>
##$DTYPP= 0
##$F1P= 15.6554695791079
##$F2P= 12.8336369535428
##$FCOR= 0.5
##$FTSIZE= 0
##$FT_mod= 4
##$GAMMA= 1
##$GB= 0.15
##$INTBC= 1
##$INTSCL= 1
##$ISEN= 128
##$LB= 0.24
##$LEV0= 0
##$LPBIN= 0
##$MAXI= 10000
##$MC2= 0
##$MEAN= 0
##$ME_mod= 0
##$MI= 1.114404
##$NCOEF= 0
##$NC_proc= 0
##$NLEV= 6
##$NOISF1= 3.799351
##$NOISF2= 2.8
##$NSP= 1
##$NTH_PI= 0
##$NZP= 0
##$OFFSET= 15.70392
##$PC= 1
##$PHC0= -26344.99
##$PHC1= 14.18747
##$PH_mod= 1
##$PKNL= yes
##$PPARMOD= 0
##$PSCAL= 0
##$PSIGN= 0
##$REVERSE= no
##$SF= 200.130013532006
##$SI= 16384
##$SIGF1= 3
##$SIGF2= 2
##$SINO= 400
##$SIOLD= 16384
##$SREGLST= <1H.CDCl3>
##$SSB= 0
##$STSI= 0
##$STSR= 0
##$SW_p= 3612.71676300578
##$SYMM= 0
##$S_DEV= 0
##$TDeff= 0
##$TDoff= 0
##$TI= <>
##$TILT= no
##$TM1= 0
##$TM2= 0
##$TOPLEV= 0
##$USERP1= <user>
##$USERP2= <user>
##$USERP3= <user>
##$USERP4= <user>
##$USERP5= <user>
##$WDW= 1
##$XDIM= 8192
##$YMAX_p= 0
##$YMIN_p= 0
$$ End of Bruker specific parameters
$$ ---------------------------------
##NTUPLES= NMR FID
##VAR_NAME=  TIME,          FID/REAL,        FID/IMAG
##SYMBOL=    X,             R,               I
##VAR_TYPE=  INDEPENDENT,   DEPENDENT,       DEPENDENT
##VAR_FORM=  AFFN,          ASDF,            ASDF
##VAR_DIM=   8192,          8192,            8192
##UNITS=     SECONDS,       ARBITRARY UNITS, ARBITRARY UNITS
##FACTOR=    0.0002076,     1,               1
##FIRST=     0,             0,               0
##LAST=      1.7004516,     0,               0
##MIN=       0,             -569407,         0
##MAX=       1.7004516,     581019,          0
$$ Real data points
##PAGE= N=1
##DATA TABLE= (X++(R..R)), XYDATA
$$ [...]
$$ plain form
2239 -142 -2264 -194 -1271 -956 965 -1055 -857 -291 -818 1486 1048 1061 2898 503 -85 -180 -320 161
2257 161 -27 -510 -811 -2972 -1098 -64 111 1386 447 -66 1689 -79 504 2173 -317 344 -589
2274 -589 -2388 -746 -1205 -9 1516 -328 -286 325 -39 1936 1345 1381 561 -2199 -758 -644 -1173 -249
2292 -249 -950 -844 -141 -1637 716 1764 712 2676 909 -1116 297 -922 48 852 -1696 -1192 -1028
2309 -1028 -1126 715 715 1024 1193 108 1078 52 -518 908 -562 -189 -597 -2912 -914 238 -476 1526
2327 1526 499 -904 284 289 1829 1559 -789 129 -903 -942 -641 -401 438 312 -239 716 -376 -565
2345 -565 1743 1005 1277 305 -1537 -536 -118 -389 836 -1530 -863 19 -1120 605 770 -279 1324
2362 1324 170 -643 69 246 641 696 113 -276 -2102 -253 729 -203 1558 -313 -1321 722 -227 -399
$$ packed form
2239a42k122K070j077L15J921k020J98N66n27K304m38J3J837k395n88r5j40M81
2257A61j88m83l01k161J874J034J75J275r39n13J755j768N83J669k490O61r33
2274e89j799J642m59J196J525j844M2O11l64J975n91L6q20k760J441J14n29R24
2292b49p01J06P03j496K353J048j052J964j767k025J413j219R70Q04k548N04J64
2309a028r8J841%L09J69j085R70j026n70J426j470L73m08k315J998J152p14K002
2327A526j027j403J188NJ540k70k348R18j032l9L01K40Q39j26n51R55j092j89
2345e65K308p38K72r72j842J001M18k71J225k366O67Q82j139J725J65j049J603
2362A324j154q13P12J77L95N5n83l89j826J849R82r32J761j871j008K043r49j72
$$ plain form
2380 -399 1634 -661 -279 101 -1424 -269 -347 -49 630 -598 -693 -779 -600 1355 1326 583 880 -604 28
2399 28 694 33 466 -570 -791 -275 -1821 -265 1002 -48 1014 431 -767 729 190 611 1874
2416 1874 -1131 -1655 -535 -1047 142 372 376 731 -331 1069 558 25 1732 791 -58 211 -2707 -627
2434 -627 256 -1048 928 -12 -1881 673 378 689 1857 103 278 383 -709 -681 -235 76 -215 -562
2452 -562 215 -1428 -290 1914 567 1100 662 -1922 552 640 -765 1120 -338 -2319 167 -367 -767
2469 -767 906 514 1129 750 -296 277 425 869 612 -19 -745 -2257 -186 867 -840 663 135 -2073
2487 -2073 1111 703 -828 2233 190 -1091 1020 -731 -1380 887 842 -433 -274 -448 -1267 -224 1358
2504 1358 214 283 633 -1617 517 1844 -1221 700 744 -2112 271 125 -1398 644 385 -191 735
$$ packed form
2380c99K033k295L82L80j525J155p8K98O79j228r5q6J79J955k9p43K97j484O32
2399B8O66o61M33j036k21N16j546J556J267j050J062n83j198J496n39M21J263
2416A874l005n24J120n12J189K30ML55j062J400n11n33J707r41q49K69k918K080
2434f27Q83j304J976r40j869K554k95L11J168j754J75J05j092K8M46L11k91l47
2452e62P77j643J138K204j347N33m38k584K474Q8j405J885j458j981K486n34m00
2469g67J673l92O15l79j046N73J48M44k57o31p26j512K071J053j707J503n28k208
2487b073L184m08j531L061k043j281K111j751o49K267m5j275J59j74q19J043J582
2504A358j144O9L50k250K134J327l065J921M4k856K383j46j523K042k59n76R26
$$ plain form
2521 735 -774 -439 1173 1468 554 89 -365 -1346 -542 1304 -1207 -246 557 -1631 40 1221 -961
2538 -961 1582 1057 -744 1309 -709 -1518 1578 -88 -1290 125 -1692 -1380 664 1058 265 704 1276
2555 1276 -630 118 1399 -1151 265 866 -2208 -323 -314 -2096 1435 1252 -641 1267 -116 -830 2000
2572 2000 996 -45 338 -380 -1303 -637 272 -634 -196 791 -1016 -21 1556 -1157 1475 2237 -1480
2589 -1480 194 39 -2233 904 730 -1278 -379 -333 -883 981 891 421 670 592 -442 -358 640 -714 45
2608 45 1156 -1568 -1221 254 -1236 1204 1097 -1443 358 467 -1350 1720 751 -1084 379 52 -1086
2625 -1086 64 104 -136 302 417 -508 -797 669 -428 798 1678 -1337 -473 692 -1522 680 1095
2642 1095 -1114 111 6 -1075 889 221 -674 1263 73 -965 -50 -77 -365 251 661 -1252 -1253 171
$$ packed form
2521G35j509L35J612K95r14m65m54r81Q04J846k511R61Q03k188J671J181k182
2538i61K543n25j801K053k018q09L096j666j202J415j817L12K044L94p93M39N72
2555A276j906P48J281k550J416O01l074J885Rj782L531j83j893J908j383p14K830
2572B000j004j041L83p18r23O66R09r06M38R87j807R95J577k713K632P62l717
2589a480J674j55k272L137j74k008Q99M6n50J864r0m70K49p8j034Q4R98j354P59
2608D5J111k724L47J475j490K440j07k540J801J09j817L070r69j835J463l27j138
2625a086J150M0k40M38J15r25k89J466j097J226Q80l015Q64J165k214K202M15
2642A095k209J225j05j081J964o68q95J937j190j038R15k7k88O16M10j913jJ424
$$ plain form
2660 171 -831 468 1175 -1188 -182 983 -990 811 1240 -875 1060 16 -1420 298 -478 -335
2676 -335 1486 -192 -1405 260 534 -293 1122 963 -1059 -218 770 -1104 238 597 -1442 363 234
2693 234 -2057 1421 1280 -541 1818 508 -1127 -11 203 -111 668 -344 -927 -632 -264 -432 555
2710 555 951 -157 386 906 -1033 649 769 -1117 575 -330 -2254 419 43 -950 1736 44 -591
2727 -591 877 151 247 982 194 -516 -356 -425 -968 -337 738 -934 255 499 -1255 765 1145 -485
2745 -485 907 -98 -1249 566 -439 -486 656 -541 -867 113 -443 -68 726 776 21 420 221 -635
2763 -635 -118 912 -549 672 149 -1853 599 379 -583 1217 -353 -1158 845 -322 -556 1362 51
2780 51 -437 218 -316 -774 396 313 -407 -151 -345 -948 193 933 -650 820 299 -1405 701 -128 -912
$$ packed form
2660A71j002J299P07k363J006J165j973J801M29k115J935j044j436J718p76J43
2676c35J821j678j213J665K74q27J415j59k022Q41R88j874J342L59k039J805j29
2693B34k291L478j41j821K359j310j635J116K14l14P79j012n83K95L68j68R87
2710E55L96j108N43N20j939J682J20j886J692r05j924K673l76r93K686j692o35
2727e91J468p26R6P35p88p10J60o9n43O31J075j672J189K44j754K020L80j630
2745d85J392j005j151J815j005m7J142j197l26R80n56L75P94N0p55L99j99q56
2763f35N17J030j461J221n23k002K452k20r62J800j570q05K003j167k34J918j311
2780E1m88O55n34m58J170q3p20K56j94o03J141P40j583J470n21j704K106q29p84
$$ plain form
2799 -912 1099 -224 -852 373 -730 -371 1091 192 158 495 -268 -258 470 806 -107 -258 -234 -1182 -340
2818 -340 384 -723 799 20 -1031 905 -84 -267 1963 255 -501 314 -958 -486 238 -564 -207 -95
2836 -95 -344 -600 217 1053 247 356 538 -1090 371 226 -1059 1075 134 -1193 367 -390 -830 1149
2854 1149 241 275 540 -605 29 336 9 126 -434 -246 -467 -186 1046 -218 537 558 -908 444 432
2873 432 -551 1319 -32 -893 119 -922 -740 714 -222 23 502 -683 176 69 133 556 -117 -139 -483
2892 -483 -282 197 -315 310 347 -696 249 -3 -425 876 182 -523 200 -668 -323 680 -332 125 172
2911 172 -508 -328 -319 276 443 -24 330 -589 -438 312 -432 630 463 -670 283 -8 -645 516 -102 -448
2931 -448 550 -929 -383 199 113 345 429 -157 -37 -670 498 271 -278 273 -517 -397 233 -636 469 672
$$ packed form
2799i12K011j323o28J225j103L59J462q99l4L37p63J0P28L36r13j51K4r48Q42
2818c40P24j107J522p79j051J936r89j83K230j708p56Q15j272M72P24q02L57J12
2836i5k49k56Q17Q36q06J09J82j628J461j45j285K134r41j327J560p57m40J979
2854A149r08L4K65j145O34L07l27J17n60J88k21K81J232j264P55K1j466J352j2
2873D32r83J870j351q61J012j041J82J454r36K45M79j185Q59j07O4M23o73k2l44
2892d83K01M79n12O25L7j043R45k52m22J301o94p05P23q68L45J003j012M57M7
2911A72o80J80RN95J67m67L54r19J51P50p44J062j67j133R53k91o37J161o18l46
2931d48R98j479N46N82q6K32Q4n86J20o33J168k27n49N51p90J20O30q69J105K03
$$ plain form
2951 672 -150 626 -251 -652 603 -241 497 111 -769 18 -277 199 512 76 -223 133 -353 493 140 -73
2971 -73 21 -830 -302 28 -753 317 362 -504 523 -114 -343 917 466 418 404 -195 -79 -227 -223 98 -260
2992 -260 -49 -39 -442 327 -62 78 790 -144 -116 -108 -780 626 383 -334 477 -477 -119 102 -230 738 537
3013 537 -254 137 -441 -130 240 -105 346 -368 -586 134 -488 152 742 -528 195 -65 -652 760 -40
3032 -40 -76 960 -238 -360 159 -59 -307 675 78 19 -795 -359 -133 -28 707 -246 -492 410 -531 97
3052 97 458 -378 567 116 -390 61 -84 -399 381 -168 -252 27 -373 197 179 411 -51 -437 281 205 -57
3073 -57 459 16 -213 198 -807 77 696 -63 533 396 -620 124 56 -225 579 -524 -617 -155 -262 52
3093 52 -8 675 119 -154 552 -101 115 948 -507 -54 316 -1136 -314 -93 -176 800 274 -394 410 96
$$ packed form
2951F72q22P76q77m01J255q44P38l86q80P87k95M76L13m36k99L56m86Q46l53k13
2971g3R4q51N28L30p81J070M5q66J027o37k29J260m51m8j4n99J16j48ML21l58
2992b60K11J0m03P69l89J40P12r34K8Qo72J406k43p17Q11r54L58K21l32R68k01
3013E37p91L91n78L11L70l45M51p14k18P20o22O40N90j270P23k60n87J412q00
3032d0l6J036j198j22N19k18k48R82n97n9q14M36K26J05P35r53k46R02r41O28
3052I7L61q36R45m51n06M51j45l15P80n49q4K79m00N70j8K32m62l86P18p6k62
3073e7N16m43k29M11j005Q84O19p59N96j37j016P44o8k81Q04j103r3M62j07L14
3093E2o0O83n56k73P06o53K16Q33j455M53L70j452Q22K21q3R76n26o68Q04l14
$$ plain form
3113 96 475 627 210 -211 -412 -152 -245 -172 255 -331 -205 415 -477 -119 1064 -491 533 357 -756 76
3133 76 -96 -272 240 328 -327 48 -121 45 336 140 113 -162 281 -82 -269 685 -226 -389 71 -961 -226
3154 -226 873 -335 904 223 -1146 9 379 -148 412 458 -293 130 46 -140 126 336 -15 -421 449
3173 449 -438 -436 763 -236 -275 518 -641 -533 535 -365 378 143 -685 309 191 -301 385 378 -170 -184 -146
3194 -146 -347 -266 331 47 -532 115 -753 -122 910 -316 -511 744 -641 67 728 -632 323 343 -514
3213 -514 283 -149 -583 -43 355 -124 -383 158 -146 -201 1054 456 -285 643 -28 -482 625 -636 -324
3232 -324 454 -803 -91 105 -426 216 702 184 439 150 -171 -125 80 -262 -409 -226 -154 -187 556 40 121
3253 121 897 -255 -118 515 -647 17 523 -473 -496 45 -943 31 694 -33 -5 34 164 -218 427 -118
$$ packed form
3113I6L79J52m17m21k01K60r3P3M27n86J26O20q92L58J183j555J024j76j113Q32
3133G6j72j76N12Q8o55L75j69J66K91j96k7k75M43l63j87R54r11j63M60j032P35
3154b26J099j208J239o81j369J155L70n27N60M6p51M23q4j86K66K10l51m06Q70
3173D49q87KJ199r99l9P93j159J08J068r00P43k35q28R94j18m92O86pn48j4L8
3194a46k01Q1N97k84n79O47q68O31J032j226j95J255j385P08O61j360R55K0q57
3213e14P97m32m34N40L98m79k59N41l04n5J255n98p41R28o71m54J107j261L12
3232c24P78j257P12J96n31O42M86n18K55k89l21M6K05l42j47J83P2l3P43n16Q1
3253A21P76j152J37O33j162O64N06r96k3N41r88R74O63p27K8L9J30l82O45n45
$$ plain form
3273 -118 -416 94 -380 -496 645 -34 -291 1015 -363 -189 507 -640 -38 925 -239 -43 119 -358
3291 -358 -3 493 -228 -147 123 -157 -397 340 210 -253 561 24 -634 389 -158 -157 782 -205 -402 246 -563
3312 -563 157 480 -272 43 -125 -390 103 40 364 220 172 -170 -413 335 -54 -212 396 -169 -743 267
3332 267 174 -300 607 211 27 245 -391 289 451 -503 -184 235 -357 -245 -139 -14 113 173 56 -553 533
3353 533 137 -204 327 -255 -370 205 -181 -167 377 28 -22 28 -385 507 194 293 377 -196 88 -418 -294 370
3375 370 -146 388 270 -371 282 241 89 422 -230 -41 538 -358 -45 38 -169 -68 220 -350 47 244 112
3396 112 402 190 -115 -222 -378 384 -43 -102 28 -286 -124 -334 6 612 -195 60 246 -395 -209 474
3416 474 -200 247 -463 -113 -234 12 -114 293 188 -11 -292 -109 497 -40 497 -332 -373 577 -424 -115
$$ packed form
3273a18k98N10m74j16J141o79k57J306j378J74O96j147O02R63j164J96J62m77
3291c58L55M96p21Q1K70k80k40P37j30m63Q14n37o58J023n47JR39r87j97O48q09
3312e63P20L23p52L15j68k65M93o3L24j44m8l42k43P48l89j58O08n65n74J010
3332B67r3m74R07l96j84K18o36O80J62r54L19M19n92J12J06J25J27O0j17o09J086
3353E33l96l41N31n82j15N75l86J4N44l49n0N0m13Q92l13R9Q4n73K84n06J24O64
3375C70n16N34j18o41O53m1j52L33o52J89N79q96L13Q3k07J01K88n70L97J97j32
3396A12K90k12l05j07j56P62m27n9J30l14J62k10L40O06q07K55J86o41J86O83
3416D74o74M47p10L50j21K46j26M07j05j99k81J83O06n37N37q29m1R50j001L09
$$ plain form
3436 -115 131 -222 -66 244 -318 149 346 395 373 -105 84 -179 -155 235 244 -298 208 -337 -306 128 63 293
3458 293 176 -242 11 -390 -278 491 127 414 114 -444 -188 -83 65 163 -81 -99 168 -289 341 218 -19
3479 -19 334 -118 -81 97 -33 148 35 -255 32 -322 -219 82 -101 1 91 -157 144 -34 53 268 -245
3500 -245 -63 -441 -89 147 2 169 486 -84 -38 300 49 58 120 -99 159 -416 -118 82 -296 253 253 -108
3522 -108 -116 -77 -130 352 -291 386 -117 -589 119 -103 404 367 -296 -325 -121 -553 350 -160 -72 118 -293 -4
3544 -4 98 -132 150 -86 -125 -287 -296 -32 172 -35 91 238 97 -66 -10 296 241 -311 247 -323 -302 88 -182
3567 -182 31 148 -4 -127 -457 -520 362 -117 3 105 -383 -32 -41 -26 482 -19 -187 146 -245 151 492
3588 492 -207 308 -297 -317 -186 8 84 272 -74 76 -165 89 25 -25 -276 173 -144 117 -42 7 391 -127
$$ packed form
3436a15K46l53J56L10n62M67J97M9k2m78J89k63K4L90Rn42N06n45L1M34o5K30
3458B93j17m18K53m01J12P69l64K87l00n58K56J05J48R8k44j8K67m57O30j23k37
3479a9L53m52L7J78j30J81j13k90K87l54J03L01j83J02R0k48L01j78Q7K15n13
3500b45J82l78L52K36j45J67L17n70M6L38k51RO2k19K58n75K98K00l78N49%l61
3522a08qL9n3M82o43O77n03m72P08k22N07l7o63k9K04m32R03n10Q8J90m11K89
3544dJ02k30K82k36l9j62rK64K04k07J26J47j41j63N6L06n5n52N58n70K1L90k70
3567a82K13J17j52j23l30o3Q82m79J20J02m88L51rJ5N08n01j68L33l91L96L41
3588D92o99N15o05k0J31J94P6J88l46J50k41K54o4n0k51M49l17K61j59M9L84n18
$$ plain form
3610 -127 -12 289 -200 -21 67 -302 308 -334 -200 224 -354 308 30 -162 342 -173 67 374 95 -64
3630 -64 357 -12 -20 -387 80 286 11 331 -158 -47 298 229 63 216 -119 -204 159 -318 107 283 -103 366
3652 366 232 17 213 -37 180 -216 -291 150 -36 64 166 -255 211 176 -268 186 24 -90 317 -272 98
3673 98 -52 -249 -111 112 84 310 -234 -225 101 22 241 -194 286 189 -4 207 137 -14 268 -250 -650 195
3695 195 -86 -245 -95 218 252 65 22 43 -223 -78 147 -86 -132 -429 -29 73 67 -108 300 -640 145 450
3717 450 -146 380 -71 -152 -127 109 -148 365 10 357 -20 -38 -118 -335 115 13 221 -90 -42 -110 50 -9
3739 -9 148 174 -325 159 -249 -410 219 69 -137 153 -394 165 567 -109 38 -26 -255 139 205 -155 -20 109
3761 109 -19 -201 21 399 31 300 185 -129 -65 -299 -359 122 -248 -99 131 -114 223 167 409 73 156
$$ packed form
3610a27J15L01m89J79Q8l69O10o42J34M24n78O62k78j92N04n15K40L07k79j59
3630f4M21l69ql67M67K06k75L20m89J11L45o9j66J53l35q5L63m77M25J76l86M69
3652C66j34k15J96k50K17l96p5M41j86J00J02m21M66l5m44M54j62j14M07n89L70
3673I8j50j97J38K23k8K26n44RL26p9K19m35M80r7j93K11p0j51K82n18m00Q45
3695A95k81j59J50L13L4j87m3K1k66J45K25k33m6k97M00J02oj75M08r40P85L05
3717D50n96N26m51q1K5K36k57N13l55L47l77j8q0k17M50j02K08l11M8o8J60n9
3739iJ57K6m99M84m08j61O29j50k06K90n47N59M02o76J47o4k29L94O6l60J35J29
3761A09j28j82K22L78l68K69j15l14O4k34o0M81l70J49K30k45L37n6K42l36Q3
$$ plain form
3782 156 -276 -744 -45 159 -180 -141 159 -360 -83 196 -187 320 70 -263 252 -299 15 162 -324 -264 60
3803 60 -484 -279 20 -207 199 246 -25 -27 -13 66 88 157 -40 -256 313 -178 -189 258 132 -345 68 79 -449
3826 -449 206 143 165 64 -184 -409 1 -246 210 344 186 -352 -367 108 9 471 -24 -543 340 269 -541 12
3848 12 13 -212 252 -217 -436 328 -14 134 44 142 153 -176 -38 -199 -117 88 -621 157 141 -302 179 -32 -273
3871 -273 36 -197 -306 431 154 50 130 -4 -17 278 116 -205 165 -41 -273 -35 39 -106 221 98 -317
3892 -317 236 262 -403 390 71 -28 303 227 -807 -38 -183 -409 182 -364 259 84 -13 99 -54 186 -316
3913 -316 198 132 -144 -74 37 -363 119 79 -189 163 61 -542 254 -174 -448 -143 -26 -109 33 -182 -196 -13
3935 -13 216 -38 364 466 -294 143 308 -283 6 -18 -245 22 301 -254 42 204 122 162 -171 -41 206
$$ packed form
3782A56m32m68O99K04l39L9L00n19K77K79l83N07k50l33N15n51L14J47m86O0L24
3803F0n44K05K99k27M06M7k71kJ4P9K2O9j97k16N69m91j1M47j26m77M13J1n28
3826d49O55o3K2j01k48k25M10k47M56J34j58n38j5M75r9M62m95n19Q83p1q10N53
3848A2Jk25M64m69k19P64l42J48r0R8J1l29J38j61Q2K05p09P78j6m43M81k11k41
3871b73L09k33j09P37k77j04Q0j34j3K95j62l21L70k06k32K38P4j45L27j23m15
3892c17N53K6o65P93l19r9L31p6j034P69j45k26N91n46O23j75r7J12j53K40n02
3913c16N14o6k76P0J11m00M82m0k68L52j02o03P96m28k74L05J17q3J42k15j4J83
3935a3K29k54M02J02p60M37J65n91K89k4k27K67K79n55K96J62q2M0l33J30K47
$$ plain form
3956 206 -51 -130 61 136 47 -118 -215 122 141 224 -172 222 -181 -32 51 215 -243 -287 176 -370 -112 -244 -501
3979 -501 -37 -1 -59 -44 -26 143 62 2 -94 -380 136 48 -36 262 -310 232 -119 153 301 399 -294 64 10 139
4003 139 231 223 472 238 32 42 156 135 173 221 -96 369 37 297 -31 32 -18 336 -330 189 -256 -346 -227
4026 -227 -340 369 -59 -253 165 -11 -66 121 72 -135 9 -125 -3 -11 -122 22 -252 -12 -43 -97 165 -12
4048 -12 -124 377 10 -34 113 -36 191 -10 -37 241 59 173 142 -170 -76 27 -230 197 -167 -63 -42 14
4070 14 329 39 -342 53 -233 72 103 39 -125 116 -150 67 -44 24 -54 -17 -29 -22 -73 -122 -9 -59 39 8 40
4095 40 165 -99 -74 -94 -407 215 -133 16 119 38 49 226 278 20 -316 -2 6 -33 194 -159 176 251 -276
4118 -276 -165 240 -590 71 60 50 163 -199 -83 20 -24 -22 -130 -26 180 -321 -40 360 -32 -163 264 -271
$$ packed form
3956B06k57p9J91P5q9j65r7L37J9Q3l96L94m03J49Q3J64m58m4M63n46K58j32k57
3979e01M64L6n8J5J8J69q1o0r6k86N16q8q4K98n72N42l51K72J48R8o93L58n4J29
4003A39R2qK49k34k06J0J14k1L8M8l17M65l32K60l28O3n0L54o66N19m45r0J19
4026b27j13P09m28j94M18j76n5J87m9k07J44j34J22qj11J44k74K40l1n4K62j77
4048a2j12N01l67m4J47j49K27k01k7K78j82J14l1l12R4J03k57M27l64J04K1N6
4070A4L15k90l81L95k86L05L1o4j64K41k66K17j11O8p8L7j2Pn1m9J13n0R8l1L2
4095D0J25k64K5k0l13O22l48J49J03q1J1J77N2k58l36L14Ql9K27l53L35P5n27
4118b76J11M05q30O61j1j0J13l62J16J03m4Kj08J04K06n01K81M00l92j31M27n35
$$ plain form
4140 -271 -8 117 27 208 -8 -218 47 -26 70 -98 185 198 71 -131 -103 -284 276 -153 -195 94 -402 -177
4162 -177 -10 -181 143 -36 196 31 -126 -31 156 -170 -31 -288 -90 -253 -61 298 306 -49 -91 -59 -18 -128
4184 -128 118 246 157 -255 -167 227 62 -164 6 37 -137 92 -288 104 35 152 -159 6 -44 -363 36 433
4206 433 -196 75 261 -189 25 188 207 117 40 75 168 -92 77 -111 76 -313 146 76 387 -67 244 421
4228 421 -207 -46 149 -60 104 -61 147 206 283 7 -206 14 -249 -181 -46 0 -114 319 -241 -18 27 -118
4250 -118 -146 -95 -306 271 -153 67 25 -120 -54 29 104 -67 41 -193 308 52 -166 53 331 62 -121 56
4272 56 67 303 206 -97 66 109 101 -228 -68 205 25 161 -164 -529 -58 -150 -75 -19 271 257 -207 9 -18 235
4296 235 248 -158 -149 -42 -85 -434 14 -122 -21 -57 150 345 -243 288 130 -263 244 111 -416 163 -45 -93
$$ packed form
4140b71K63J25r0J81k16k10K65p3R6j68K83J3j27k02K8j81N60m29m2K89m96K25
4162a77J67j71L24j79K32j65j57R5J87l26J39k57J98j63J92L59Ql55m2L2M1j10
4184a28K46J28q9m12Q8L94j65k26J70L1j74K29l80L92o9J17l11J65n0l19L99L97
4206D33o29K71J86m50K14J63J9r0p7L5R3k60J69j88J87l89M59p0L11m54L11J77
4228D21o28J61J95k09J64j65K08N9P7k76k13K20k63O8J35M6j14M33n60K23M5j45
4250a18k8N1k11N77m24K20m2j45O6Q3P5j71J08k34N01k56k18K19K78k69j83J77
4272E6J1K36r7l03J63M3ql29J60K73j80J36l25l65M71r2P5N6K90j4m64K16k7K53
4296B35J3m06RJ07m3l49M48j36J01l6K07J95n88N31j58l93N07j33n27N79k08m8
$$ plain form
4318 -93 -80 -184 -260 -171 -154 124 147 -158 -101 -65 -9 135 -114 92 -25 -24 -72 -149 -105 -10 -97 120 -198 -75 29
4343 29 151 -50 1 -228 76 271 -102 51 203 -25 8 66 366 33 -137 -99 22 -39 26 -38 -50 423 -496
4366 -496 44 66 -93 -189 100 -267 54 -92 279 -90 130 126 -48 -120 -141 -180 188 9 -337 259 -96 76
4388 76 58 28 369 355 -72 340 -8 -143 112 -30 44 165 18 10 17 -33 162 -91 -294 -92 -152 102 -44 46
4412 46 146 -90 153 -3 -220 255 -10 -22 213 -74 -220 194 -5 114 144 23 76 -49 268 33 -355
4433 -355 203 212 -118 -38 89 339 -102 -18 262 104 -222 -216 -141 -7 56 101 -287 130 66 13 -326 159 -148 -114
4457 -114 87 -62 60 -17 47 -146 237 -103 47 292 -343 222 83 -193 -229 -110 -127 83 -130 151 -140
4478 -140 -156 231 -176 500 4 -249 67 3 -151 223 -77 -125 92 20 -81 140 50 -144 -190 -319 28 -42
$$ packed form
4318i3J3j04p6Q9J7K78K3l05N7L6N6J44k49K06j17Jm8p7M4R5q7K17l18J23J04
4343B9J22k01N1k29L04J95l73J53J52k28L3N8L00l33j70L8J21o1O5o4j2M73r19
4366d96N40K2j59r6K89l67L21j46L71l69K20mj74p2k1l9L68j79l46N96l55J72
4388G6j8l0L41j4m27M12l48j35K55j42P4J21j47qPn0J95k53k03K02o0K54j46R0
4412D6J00k36K43j56k17M75k65j2K35k87j46M14j99J19L0j21N3j25L17k35l88
4433c55N58Rl30Q0J27K50m41Q4K80j58l26OP5J34O3M5l88M17o4n3l39M85l07L4
4457a14K01j49J22p7O4j93L83l40J50K45o35N65j39k76l6J19j7K10k13K81k91
4478a40j6L87m07O76m96k53L16o4j54L74l00m8K17p2j01K21r0j94m6j29L47p0
$$ plain form
4500 -42 -170 -106 -174 -88 -52 -143 -44 -12 404 159 -62 196 71 -8 211 184 39 45 -195 336 117 -47 -347 12
4524 12 -52 73 -180 493 336 -247 -237 -38 -457 174 37 137 144 -224 11 -16 67 269 38 -390 -153 -488
4546 -488 -271 -15 -462 154 -117 263 172 89 14 71 -52 227 158 198 76 -396 -239 235 -82 315 128 49
4568 49 30 -228 55 -46 -229 -66 176 -223 -136 -229 160 41 -65 221 67 120 362 -178 -106 -23 0 70 106
4591 106 15 164 72 3 475 -103 227 228 -211 -283 -125 -162 173 -86 107 1 -19 281 -217 191 652 4 138
4614 138 7 -296 37 -94 -342 74 71 278 39 -11 -94 -258 65 -61 -301 -119 223 265 227 -14 -1 -1 -95
4637 -95 291 364 -225 283 193 -191 179 25 137 144 113 -123 3 -70 123 -236 147 -183 -498 97 -349 -150
4659 -150 -5 -113 -299 385 -191 417 420 219 -69 -326 -503 39 -44 -189 366 -424 -35 -291 209 197 66
$$ packed form
4500d2j28O4o8Q6L6r1R9L2M16k45k21K58j25p9K19k7j45Ok40N31k19j64l00L59
4524A2o4J25k53O73j57n83J0J99m19O31j37J00Pl68K35k7Q3K02k31m28K37l35
4546d88K17K56m47O16k71L80r1q3p5N7j23K79o9M0j22m72J57M74l17L97j87p9
4568D9j9k58K83j01j83J63K42l99Q7r3L89j19j06K86j54N3K42n40P2Q3K3P0L6
4591A06r1J49r2o9M72n78L30Jm39p2J58l7L35k59J93j06k0L00m98M08M61o48J34
4614A38j31l03L33j31k48M16lK07k39n0q3j64L23j26k40J82L42M2l8k41J3%r4
4637i5L86P3n89N08r0l84L70j54J12Pl1k36J26p3J93l59L83l30l15N95m46J99
4659a50J45j08j86O84n76O08Lk01k88k57j77N42q3j45N55p90L89k56N00j2j31
$$ plain form
4680 66 405 99 135 450 -401 151 230 -307 62 272 -687 117 412 -22 -111 -78 -168 28 15 -38 -51 -103 65
4703 65 -78 72 3 -193 266 -100 190 236 -119 -330 371 -509 -279 -60 -259 -143 392 21 61 161 -143
4724 -143 109 120 220 -154 247 -305 -312 -80 -139 -136 -9 -222 -188 369 -263 -176 460 -271 384 449 51 -177 -7
4747 -7 58 67 50 49 -109 29 185 24 149 -2 -69 -85 134 -330 146 227 -55 334 -174 -235 235 -22 176 -69
4771 -69 -101 -92 88 -268 -250 -77 -85 -35 -223 120 -129 45 130 -45 -61 224 61 32 -59 -35 527 -81 -103 -16 -173
4796 -173 -59 129 -417 -55 -13 -203 326 -209 214 -71 -71 -39 -96 2 -128 -380 157 -124 -282 128 -249 -72
4818 -72 353 -377 106 140 -216 169 -24 -142 205 -323 -220 107 -318 83 244 111 -107 39 414 127 -70
4839 -70 413 -256 -56 143 220 152 288 -313 37 35 34 153 -44 377 26 -218 202 -194 111 20 -131 128 197
$$ packed form
4680F6L39l06L6L15q51N52P9n37L69K10r59Q04K95m34q9L3r0J96j3n3j3n2J68
4703F5j43J50o9j96M59l66K90M6l55k11P01q80K30K19j99J16N35l71M0J00l04
4724a43K52J1J00l74M01n52pK32n9LJ27k13L4N57o32Q7O36p31O55O5l98k28J70
4747gO5Rj7jj58J38J56j61J25j51o7j6K19m64M76Q1k82L89n08o1M70k57J98k45
4771f9l2RJ80l56J8J73qN0j88L43k49J74Q5j75j6K85j63k9r1K4N62o08k2Q7j57
4796a73J14J88n46L62M2j90N29n35M23k85%L2n7R8j30k52N37k81j58M10l77J77
4818g2M25p30M83L4l56L85j93j18L47n28J03L27m25M01J61j33k18J46L75k87j97
4839g0M83o69K00J99P7o8J36o01L50kjJ19j97M21l51k44M20l96L05r1j51K59O9
$$ plain form
4862 197 -403 125 74 8 13 -79 -101 519 -395 41 -97 -108 -81 -516 35 25 -287 147 87 34 173 86 206 181
4886 181 -187 -59 -101 -402 208 264 -79 272 -76 -242 119 -318 186 324 -139 209 -261 -36 9 -65 -34 230
4908 230 -2 48 109 -171 292 -229 463 265 -139 330 40 -192 38 -263 -96 249 -444 208 229 -234 -38
4929 -38 -390 -109 217 22 -57 -58 -259 26 -194 -183 -271 180 342 81 -250 198 146 75 249 -83 58 123 -318
4952 -318 -47 -49 232 147 -123 381 -80 -130 141 -183 92 287 -198 -113 -40 -188 62 -173 -244 -287 -227 -87 -16
4975 -16 -190 2 0 -215 190 12 17 306 -122 -244 -306 -218 17 -138 -63 419 -538 211 -34 -101 109 78 -143
4998 -143 -234 -229 22 67 39 194 -224 -78 355 -18 198 327 -100 127 55 -213 141 -80 -3 -102 261 -82 74
5021 74 -214 4 -172 127 208 -592 -4 189 -285 134 -215 -75 75 -268 265 -60 -190 48 -251 -114 261
$$ packed form
4862A97o00N28n1o6Nr2k2O20r14M36j38j1K7m35N51j0l12M34o0n3J39q7J20k5
4886A81l68J28m2l01O10N6l43L51l48j66L61m37N04J38m63L48m70K25M5p4L1K64
4908B30k32N0O1k80M63n21O92j98m04M69k90k32K30l01J67L45o93O52K1m63J96
4929c8l52K81L26j95p9jk01K85k20J1q8M51J62k61l31M48n2p1J74l32J41O5m41
4952c18K71kK81q5k70N04m61n0K71l24K75J95m85Q5P3j48K50k35p1m3O0J40P1
4975a6j74J92kk15M05j78NK89m28j22o2Q8K35j55P5M82r57P49k45o7K10l1k21
4998a43r1NK51M5k8J55m18J46M33l73K16J29m27K27p2k68L54k21P7r9L63l43J56
5021G4k88K18j76K99Q1q00N88J93m74M19l49J40J50l43N33l25j30K38k99J37L75
$$ plain form
5042 261 -70 -252 74 -176 72 51 -190 460 -201 87 340 -305 214 134 4 155 -189 -197 300 -369 22
5063 22 72 -96 -69 2 48 120 -443 -64 143 -32 73 -169 -86 16 -207 307 16 -438 342 -195 -157 50 -406
5086 -406 -89 -78 23 475 109 -10 238 -168 113 286 -385 -262 -146 14 35 -264 -321 373 184 365 -159
5107 -159 -5 120 89 69 98 -312 -140 -194 -296 102 -220 64 471 -403 33 -3 -19 253 279 159 269 -222
5129 -222 -191 -13 -64 -166 235 31 -107 -200 224 385 -142 133 -139 -600 -127 -324 95 -147 42 493 213
5150 213 125 260 70 199 333 122 240 41 -167 108 64 -236 -79 -222 48 103 -232 140 -114 44 130
5171 130 -75 -48 -43 -391 4 3 -71 275 139 -20 -37 -349 -90 -89 16 68 124 60 -4 -163 276 153 264 34
5195 34 -218 -80 50 -652 115 -72 79 50 -67 82 155 -150 -47 269 -99 226 -271 -395 129 147 -125
$$ packed form
5042B61l31j82L26k50K48k1k41O50o61K88K53o45N19q0j30J51l44qM97o69L91
5063B2N0j68K7P1M6P2n63L79K07j75J05k42Q3J02k23N14k91m54P80n37L8K07m56
5086d06L17J1J01M52l66j19K48m06K81J73o71J23J16J60K1k99n7O94j89J81n24
5107a59J54J25l1k0K9m10J72n4j02L98l22K84M07q74M36l6j6K72K6j20J10m91
5129b22L1J78n1j02M01k04j38r3M24J61n27K75k72m61M73j97M19k42J89M51k80
5150B13q8J35j90J29J34k11J18j99k08K75m4l00J57j43K70N5l35L72k54J58Q6
5171A30k05K7Nl48L95jp4L46j36j59j7l12K59JJ05N2N6o4o4j59M39j23J11k30
5195C4k52J38J30p02P67j87J51k9j17J49P3l05J03L16l68L25m97j24N24J8k72
$$ plain form
5216 -125 -8 -275 -176 -59 271 328 47 2 237 -231 306 -159 -284 517 -80 -111 -34 -288 513 -45 -85 3
5238 3 -100 40 -308 8 237 -177 -37 -208 -87 120 12 231 -11 -67 -62 370 -140 2 103 -427 -268 268
5260 268 -327 133 -383 71 240 -133 -270 1 -77 -181 -294 92 6 -89 314 240 -289 626 -50 -125 142 -173
5282 -173 206 355 -343 -283 208 -349 164 73 -103 73 -95 -57 -214 -17 -31 -43 236 -63 -329 -103 -54 124
5304 124 214 -549 -157 355 -735 -311 343 -272 -262 -28 -266 -50 201 260 171 -90 210 -345 142 -83 -79 87
5326 87 -398 -561 -143 69 -426 472 -221 -206 60 -239 117 226 -372 -173 133 -185 219 -270 183 60 52
5347 52 348 12 80 108 -510 247 52 -126 178 -268 -494 325 -197 -284 -64 -262 267 232 102 30 -23 54 89
5370 89 -193 -79 203 -38 37 -414 65 143 -329 319 -57 -11 349 -36 -93 133 -259 92 -20 118 101 -199
$$ packed form
5216a25J17k67R9J17L30N7k81m5K35m68N37m65j25Q01n97l1P7k54Q01n58m0Q8
5238Cj03J40l48L16K29m14J40j71J21K07j08K19k42n6NM32n10J42J01n30J59N36
5260B68n95M60n16M54J69l73j37K71p8j04j13L86q6r5M03p4n29R15o76p5K67l15
5282a73L79J49o98O0M91n57N13r1j76J76j68L8j57J97j4j2K79k99k66K26M9J78
5304A24R0p63L92N12j090M24O54o15J0K34k38K16K51N9q9k61L00n55M87k25MJ66
5326H7m85j63M18K12m95Q98o93J5K66k99L56J09n98J99L06l18M04m89M53j23q
5347E2K96l36O8K8o18P57j95j78L04m46k26Q19n22q7K20j98N29l5j30p2n3P7L5
5370H9k82J14K82k41P5m51M79P8m72O48l76M6L60l85n7K26l92L51j12J38j7l00
$$ plain form
5392 -199 164 417 -141 -99 28 -371 108 -321 -93 282 -537 41 129 131 153 41 23 146 102 18 60 -328 124
5415 124 -145 -6 175 249 -55 96 203 -152 139 -24 -47 72 82 324 -463 188 -35 93 107 9 -131 472
5437 472 -280 -225 431 -78 106 -1 -33 202 48 206 246 37 390 -130 -132 183 -185 37 293 -255 66 9
5459 9 -20 466 -100 -135 44 -258 -231 -75 -72 120 -317 69 -65 91 109 -101 -185 19 110 -21 -107 -412 61 -20
5483 -20 -251 32 -105 -270 407 49 228 252 -90 333 56 16 312 -286 -61 -49 -321 347 346 -19 328 46
5505 46 -165 40 -37 461 167 -309 10 -198 123 -16 -292 -66 -2 -356 -234 -126 -41 139 51 93 -246 -357
5527 -357 -141 -176 -184 379 -372 245 408 66 419 286 78 140 -203 -75 47 -162 86 19 -317 61 -62 -156
5549 -156 -13 -57 221 281 -395 270 -86 115 94 -323 -198 87 -230 251 212 134 17 123 151 -34 -101 169
$$ packed form
5392a99L63K53n58M2J27l99M79m29K28L75q19N78Q8KK2j12j8J23m4q4M2l88M52
5415A24k69J39J81P4l04J51J07l55K91j63k3J19J0K42p87O51k23J28J4r8j40O03
5437D72p52N5O56n09J84j07l2K35j54J58M0k09L53n20kL15l68K22K56n48L21n7
5459Ik9M86n66l5J79l02K7J56LJ92m37L86j34J56J8k10q4K04R1j31q6l05M73q1
5483b0k31K83j37j65O77l58J79K4l42M23k77m0K96n98K25J2k72O68jl65L47k82
5505D6k11K05p7M98k94m76L19k08L21j39k76K26O4l54J22J08Q5J80q8M2l39j11
5527c57K16l5qN63p51O17J63l42L53j33k08O2l43J28J22k09K48o7l36L78j23r4
5549a56J43m4K78O0o76O65l56K01k1m17J25K85l17M81l9p8j17J06K8j85o7K70
$$ plain form
5571 169 -28 -161 132 -473 -273 56 134 282 -224 -220 -406 -371 34 210 -35 166 59 136 320 -302 212 -111
5593 -111 -295 62 -78 -468 224 -215 -144 207 -278 -141 -84 -119 287 -58 -133 117 -207 41 188 -5 172
5614 172 -9 31 104 147 227 62 -127 458 -312 -9 294 -275 2 231 -647 299 -245 -315 326 -233 142 -52
5636 -52 -388 235 182 -197 -32 -35 168 131 -87 -301 88 280 79 -363 77 72 -331 55 -2 -761 216 -353 -120
5659 -120 378 -148 -111 81 -216 -4 -93 -235 -153 32 224 -143 -77 185 -300 160 214 -461 334 212 -390 317
5681 317 145 -279 130 -177 -347 276 -285 246 104 -108 574 23 -151 133 -10 -272 66 -410 161 -124
5701 -124 219 243 -332 316 -96 -42 125 -87 -2 562 51 -235 476 -77 -8 339 -76 -122 240 -139 285 207
5723 207 -112 -189 -86 235 -155 -187 219 -234 132 -62 -250 649 59 -343 47 -422 236 74 126 366 -15
$$ packed form
5571A69j97j33K93o05K00L29P8J48n06Mj86L5M05J76k45K01j07P7J84o22N14l23
5593a11j84L57j40l90O92m39P1L51m85J37N7l5M06l45p5K50l24K48J47j93J77
5614A72j81M0P3M3Q0j65j89N85p70L03L03n69K77K29q78R46n44p0O41n59L75j94
5636e2l36O23n3l79J65lK03l7k18k14L89J92k01m42M40nm03L86n7p59R77n69K33
5659a20M98n26L7J92k97K12q9j42Q2J85J92l67O6K62m85M60N4o75P95j22o02P07
5681C17j72m24M09l07j70O23n61N31j42k12O82n51j74K84j43k62L38m76N71k85
5701a24L43K4n75O48m12N4J67k12Q5N64n11k86P11n53O9L47m15m6L62l79M24p8
5723B07l19p7J03L21l90l2M06m53L66j94j88Q99n90m02L90m69O58j62N2K40l81
$$ plain form
5744 -15 -126 220 27 157 -241 -121 506 45 -41 -62 114 -15 -132 -205 -90 -254 -28 479 36 -11 251 -421
5766 -421 -27 -100 -253 459 15 -91 -37 -185 33 16 169 -324 -163 42 198 -440 -258 -159 302 410 -330
5787 -330 -304 445 -7 -27 -176 -160 186 -108 116 43 53 -203 -114 -377 162 18 55 147 125 287 -29 -275 200
5810 200 -162 -171 122 -440 348 55 -181 328 132 -272 143 -305 -219 100 -516 -85 45 -207 343 -182 -1
5831 -1 154 -126 410 -94 -167 130 -295 130 214 -342 430 108 -66 193 -26 -222 189 -234 -131 180 -240
5852 -240 -165 118 -127 204 -58 72 -2 -52 54 85 -83 117 -231 4 -59 -64 82 -436 -252 306 128 -100
5874 -100 340 50 132 190 -253 -99 93 -238 30 111 -47 24 58 304 -107 93 256 229 309 -158 -242 161 -4
5897 -4 -317 67 -164 -27 133 -95 100 84 64 -28 -5 -53 -36 -240 -134 -104 -110 211 -475 -45 218 -121 357 497
$$ packed form
5744a5j11L46j93J30l98J20O27m61q6k1J76j29j17p3J15j64K26N07m43m7K62o72
5766d21L94p3j53P12m44j06N4j48K18j7J53m93J61K05J56o38J82R9M61J08p40
5787c30K6P49m52k0j49J6L46k94K24p3J0k56Q9k63N39j44L7R2k2J62l16k46M75
5810B00l62rK93n62P88k93k36N09j96m04M15m48Q6L19o16M31J30k52N50n25J81
5831aJ55k80N36n04p3K97m25M25Q4n56P72l22j74K59k19j96M11m23J03L11m20
5852b40P5K83k45L31k62J30p4n0J06L1j68K00l48K35o3nJ46n18J84N58j78k28
5874a00M40k90Q2N8m43J54J92l31K68Q1j58P1L4K46m11K00J63k7Q0m67q4M03j65
5897dl13L84k31J37J60k28J95j6k0r2K3m8J7k04J06L0oL21o86M30K63l39M78J40
$$ plain form
5921 497 -174 149 -102 -346 179 -318 161 35 -237 5 -45 -280 431 139 -95 -182 99 -210 36 -103 417
5942 417 -170 254 -126 -537 461 207 -539 434 -234 68 341 27 -52 272 -84 93 -41 12 443 329 220
5963 220 143 -27 -184 -302 -3 286 -389 -26 141 -206 141 67 -20 410 -159 -142 232 -45 -151 -175 -232 220
5985 220 -446 -301 78 -37 339 -197 -119 -67 -262 114 455 -251 141 210 -122 168 203 115 365 -307 262 193
6007 193 -137 -65 44 -262 70 -236 162 111 153 405 -19 -33 169 -128 -90 -96 -470 373 -23 -327 144 -131
6029 -131 48 452 -120 8 19 -48 10 -143 52 -80 -76 -32 101 -411 355 -48 164 591 -431 182 -243 -460
6051 -460 125 -153 -34 49 -434 69 104 -146 57 296 12 295 131 -83 48 69 201 -344 -213 312 -411
6072 -411 37 175 -261 161 -5 -47 471 57 -155 -90 -300 -130 -63 -378 -167 -114 -58 137 -336 153 69 -173
$$ packed form
5921D97o71L23k51k44N25m97M79j26k72K42n0k35P11k92k34q7K81l09K46j39N20
5942D17n87M24l80m11R98k54p46R73o68L02K73l14p9L24l56J77j34N3M31j14j09
5963B20p7j70j57j18K99K89o75L63J67l47L47p4q7M30n69J7L74k77j06k4n7M52
5985B20o66J45L79j15L76n36P8N2j95L76L41p06L92O9l32K90L5q8K50o72N69o9
6007A93l30P2J09l06L32l06L98n1M2K52m24j4K02k97L8ol74Q43l96l04M71k75
6029a31J79M04n72J28J1o7N8j53J95j32MM4J33n12P66m03K12M27j022O13m25k17
6051d60N85k78J19Q3m83N03L5k50K03K39k84K83j64k14J31K1J32n45J31N25p23
6072d11M48J38m36M22j66m2N18m14k12O5k10J70O7l15K11N3N6J95m73M89q4k42
$$ plain form
6094 -173 290 -389 -182 201 -378 137 -9 -135 38 -132 46 385 -61 19 361 -627 66 -25 -17 169 -279
6115 -279 135 -187 -366 177 213 188 36 -585 108 225 -233 140 312 -154 -149 192 48 388 118 106 -134 -441
6137 -441 -158 23 182 142 -296 165 -18 -231 178 -195 65 400 -741 8 -270 -220 -61 144 -406 -33
6157 -33 82 -273 156 178 428 88 -484 278 -151 100 169 -126 187 -42 -52 194 19 159 402 -286 110
6178 110 -56 -58 -46 87 -157 -18 123 95 104 -101 -47 140 -149 238 -121 147 90 -86 402 -56 -150 379 -418
6201 -418 237 304 -288 231 -198 -115 239 -125 219 -127 -422 260 -189 -180 133 -120 143 -188 -389 99 141 -172
6223 -172 309 -127 -268 131 -353 169 -14 -125 106 -60 -112 192 -100 61 -47 -308 205 -194 37 267
6243 267 105 200 17 -114 112 -106 -242 184 -586 81 -146 -338 147 123 -93 283 -7 -203 -44 -54 -154
$$ packed form
6094a73M63o79K07L83n79N15j46j26J73j70J78L39m46Q0L42r88O93r1QJ86m48
6115b79M14l22j79N43L6k5j52o21O93J17m58L73J72m66NL41j44L40k70j2k40l07
6137d41K83J81J59m0m38M61j83k13M09l73K60L35j141P49k78N0J59K05n50L73
6157c3J15l55M29K2K50l40n72P62m29K51O9k95L13k29j0K46j75J40K43o88L96
6178A10j66kJ2J33k44J39J41k8Rk05N4J87k89L87l59K68n7j76M88m58r4N29p97
6201d18O55O7n92N19m29Q3L54l64L44l46k95O82m49RL13k53K63l31k01M88M2l13
6223a72M81m36j41L99m84N22j83j11K31j66n2L04k92J61j08k61N13l99K31K30
6243B67j62R5j83j31K26k18j36M26p70O67k27j92M85k4k16L76k90j96J59j0j00
$$ plain form
6264 -154 -132 170 -82 -195 237 137 -159 -242 -37 -271 253 44 -196 514 -107 79 0 -303 39 201 65
6285 65 236 -219 164 265 -213 362 22 -88 306 -258 -32 317 -252 -96 79 -12 120 -262 -21 -52 -520
6306 -520 157 384 -68 225 -23 -138 43 -6 226 340 -426 327 -119 138 506 -339 238 72 -321 -20
6326 -20 -221 -73 521 206 -141 439 290 339 177 -135 160 38 179 111 -420 79 180 -17 320 26 -87
6347 -87 139 -333 275 -198 -456 240 53 -280 90 -399 383 -80 -111 104 29 242 83 98 160 -29 -20 313
6369 313 10 -9 -33 -327 77 71 -247 42 -1 -249 257 13 -427 232 -224 -26 -129 -281 150 50 80 -234
6391 -234 -334 143 -1 110 97 -271 -17 330 -328 -10 184 -248 52 10 -76 -297 -313 92 -112 -120 201 -136
6413 -136 -347 390 12 307 86 -177 366 -116 -57 55 -87 105 141 114 149 14 -176 -74 -193 -41 320
$$ packed form
6264a54K2L02k52j13M32j00k96q3K05k34N24k09k40P10o21J86p9l03L42J62j36
6285F5J71m55L83J01m78N75l40j10L94n64K26L49n69J56J75r1J32l82K41l1m68
6306e20O77K27m52K93k48j15J81m9K32J14p66P53m46K57L68q45N77j66l93L01
6326b0k01J48N94l15l47N80j49M9j62l12K95j22J41o8n31M99J01j97L37k94j13
6347h7K26m72O08m73k58O96j87l33L70m89P82m63l1K15p5K13j59J5O2j89RL33
6369C13l03j9k4k94M04ol18K89m3k48N06k44m40O59m56J98j03j52M31j00L0l14
6391b34j00M77j44J11j3l68K54L47o58L18J94m32L00m2q6k21j6M05k04qL21l37
6413a36k11P37l78K95k21k63N43m82N9J12j42J92L6k7L5j35j90J02j19J52L61
$$ plain form
6434 320 -35 4 -212 97 236 -334 123 283 -108 197 -108 29 166 81 77 175 -142 219 -130 -411 441 -216
6456 -216 189 138 -85 220 -40 -318 399 -58 -36 5 -432 -104 241 -206 74 -69 -143 86 -90 199 173 -89
6478 -89 -213 76 -160 176 30 -131 -322 -315 -178 -198 -65 251 91 -107 169 27 286 -22 15 235 -73 -144
6500 -144 364 -148 -86 -217 -84 66 -253 170 336 -49 -118 289 -552 85 -366 -173 243 -278 -125 -71 -264
6521 -264 -65 -43 -141 295 2 -96 521 -299 329 -7 88 -61 -120 -186 -101 -402 230 -35 163 174 -394 51 364
6544 364 33 -436 -33 -307 -67 -101 0 321 -222 35 205 -54 102 299 -328 405 -21 -266 -2 -186
6564 -186 210 -145 231 245 -7 79 116 -122 251 131 -147 166 -1 -39 363 -78 191 -43 -311 16 173
6585 173 -117 153 -152 214 -179 -323 83 -259 -115 107 -298 -129 84 -196 246 97 -108 171 10 -103
$$ packed form
6434C20l55L9k16L09J39n70M57J60l91L05l05J37J37q5mR8l17L61l49k81Q52o57
6456b16M05n1k23L05k60k78P17m57K2M1m37L28L45m47K80j43p4K29j76K89k6k62
6478h9j24K89k36L36j46j61j91PJ37k0J33L16j60j98K76j42K59l08L7K20l08p1
6500a44N08n12O2j31J33J50l19M23J66l85o9M07q41O37m51J93M16n21J53N4j93
6521b64J99K2r8M36k93r8O17q20O28l36R5j49n9o6Q5l01O32k65J98J1n68M45L13
6544C64l31m69M03k74K40l4J01L21n43K57J70k59J56J97o27P33m26k45K64j84
6564a86L96l55L76J4k52Q6L7k38L73j20k78L13j67l8M02m41K69k34k68L27J57
6585A73k90K70l05L66l93j44M06l42J44K22m05J69K13k80M42j49k05K79j61j13
$$ plain form
6605 -103 37 -182 -54 -391 -286 297 -128 249 343 -142 18 305 -114 446 -102 -26 -70 -420 14 -81 -299
6626 -299 50 -219 37 79 -57 98 158 -154 325 -66 -382 299 -306 -321 409 -420 297 271 -16 271 -81
6647 -81 181 -69 -186 111 -517 -81 76 -38 40 236 -94 342 -42 -178 201 -78 -24 256 61 -397 282
6668 282 -672 339 118 -311 318 -120 97 -43 -7 187 50 43 -195 -71 -25 -156 -198 57 2 141 358 0
6690 0 14 515 -222 200 73 64 -118 -70 212 184 50 398 158 -198 -168 -31 -69 35 -237 115 179 -417 43
6713 43 -57 126 208 -101 -81 43 -168 14 -346 122 -124 19 46 404 -124 21 38 -41 367 -291 -92 -13
6735 -13 -219 101 70 -16 188 -130 156 385 82 -67 376 -133 302 -188 166 -38 -285 -220 -135 -286 207 -250
6757 -250 25 54 -275 -73 13 -71 175 -348 -244 482 -308 363 132 -31 283 207 -363 442 -166 -123 286 -30
$$ packed form
6605a03J40k19J28l37J05N83m25L77R4m85J60K87m19N60n48P6m4l50M34r5k18
6626b99L49k69K56M2j36J55O0l12M79l91l16O81o05j5P30q29P17k6k87K87l52
6647h1K62k50j17K97o28M36J57j14P8J96l30M36l84j36L79k79N4K80j95m58O79
6668B82r54J011k21m29O29m38K17j40L6J94j37pk38J24M6j31m2K55n5J39K17l58
6690@J4N01p37M22j27rj82M8K82k8j34L48k40l56L0J37l8J04k72L52O4n96M60
6713D3j00J83Q2l09K0J24k11J82l60M68k46J43K7L58n28J45J7p9M08o58J99P9
6735a3k06L20l1q6K04l18K86K29l03j49M43n09M35m90L54k04k47O5Q5j51M93m57
6757b50K75K9l29K02Q6q4K46n23J04P26p90O71k31j63L14p6n70Q05o08M3M09l16
$$ plain form
6779 -30 -96 -61 15 -154 -120 -15 -83 -332 273 92 -77 423 -373 -116 412 -231 -1 -96 -19 59 15 -271 413
6802 413 329 156 -217 -43 179 -340 -230 148 -280 -14 -129 -299 247 -24 63 265 26 277 -38 -194 99
6823 99 92 -262 38 -65 41 247 -265 -103 322 -107 359 -201 -54 330 -33 244 257 -83 5 43 188 45
6845 45 -3 240 197 -122 126 -167 -368 -25 32 -77 125 -427 393 -237 375 463 -242 -137 144 3 -65 -19
6867 -19 -212 440 34 204 340 -244 -20 19 -304 211 -108 34 64 -194 545 388 2 419 -138 175 6
6888 6 -21 278 136 4 -43 92 -188 236 -239 52 61 -308 230 252 -176 37 -120 19 115 -330 213 -481 -94
6911 -94 -40 14 -67 322 -12 -137 -138 -327 184 36 -167 254 70 256 48 -105 99 -31 91 114 -6 53 63
6934 63 -37 -32 -18 156 300 -90 10 48 -7 360 -12 170 144 -122 17 421 97 -108 -33 -181 689 29 54
$$ packed form
6779c0o6L5P6j69L4J05o8k49O05j81j69N00p96K57N28o43K30r5P7P8m4k86O84
6802D13q4j73l73J74K22n19J10L78m28K66j15j70N46k71Q7K02k39K51l15j56K93
6823I9pl54L00j03J06K06n12J62M25m29M66n60J47L84l63K77J3l40Q8L8J45j43
6845D5m8K43m3l19K48k93k01L43N7j09K02n52Q20o30O12Q8p05J05K81j41o8M6
6867a9j93O52m06J70J36n84K24L9l23N15l19J42L0k58P39j57l86M17n57L13j69
6888Fk7K99j42j32m7J35k80M24m75K91Rl69N38K2m28K13j57J39R6m45N43o94L87
6911i4N4N4q1L89l34j25jj89N11j48k03M21j84J86k08j53K04j30J22K3j20N9J0
6934F3j00NJ4J74J44l90J00L8n5L67l72J82k6k66J39M04l24k05P5j48Q70o60K5
$$ plain form
6957 54 503 -103 142 24 -3 -68 -476 6 99 -135 123 128 -299 313 161 -119 141 -161 -23 287 -451 -156
6979 -156 -69 -14 164 -8 -98 190 -3 307 -194 37 200 -259 -216 34 -277 253 -117 -20 -93 -63 -6 107 161
7002 161 28 102 21 213 -81 -338 -52 79 267 112 -168 135 59 -2 121 -101 261 235 -123 -42 -181 59
7024 59 -38 61 -42 -194 -164 169 -210 46 217 -187 -188 234 40 52 -50 -78 171 -176 -182 631 -153 361 96
7047 96 -42 110 -166 -97 90 -160 -170 97 -158 335 73 203 65 68 149 239 -152 350 -351 -18 -69 -2 106
7070 106 437 14 135 -63 -160 212 -169 71 80 58 96 141 94 298 296 -28 304 -54 156 -88 -254 218 111
7093 111 -273 361 -247 9 214 -195 119 48 168 -31 -35 -20 -147 -232 60 -230 -71 93 -322 496 -9 -421
7115 -421 271 -406 -384 156 42 -53 60 -218 106 198 -170 54 21 -37 146 -207 36 -180 -2 113 -208 305
$$ packed form
6957E4M49o06K45j18k7o5m08M82R3k34K58Nm27O12j52k80K60l02J38L10p38K95
6979a56Q7N5J78j72r0K88j93L10n01K31J63m59M3K50l11N30l70R7p3L0N7J13N4
7002A61j33P4q1J92k94k57K86J31J88j55k80L03p6o1J23k22L62k6l58Q1j39K40
7024E9r7R9j03j52L0L33l79K56J71m04jM22j94J2j02k8K49l47oQ13p84N14k65
7047I6j38J52k76O9J87k50j0K67k55M93k62J30j38LQ1R0l91N02p01L33n1O7J08
7070A06L31m23J21j98r7L72l81K40Rk2L8M5m7K04kl24L32l58K10k44j66M72j07
7093A11l84O34o08K56K05m09L14p1J20j99mJ5j27q5K92k90J59J64m15Q18n05m12
7115d21O92o77K2N40j14r5J13k78L24R2l68K24l3n8J83l53K43k16J78J15l21N13
$$ plain form
7137 305 -117 -227 635 466 -27 -78 -169 -307 478 60 34 -58 -1 117 51 250 189 19 29 26 -22 84 -170 83
7161 83 85 -260 51 437 -414 15 -316 -142 297 296 119 124 -151 72 186 -91 187 -164 330 -87 -27 44 -37
7184 -37 -201 135 -155 -63 269 -373 241 64 -240 -178 -128 277 254 -297 143 313 -125 154 -396 -6 62 8
7206 8 77 -89 150 213 114 77 238 -198 -164 66 -90 344 -170 -330 -118 117 -42 300 -316 180 71 -54
7228 -54 -47 -339 -90 -25 -39 290 -91 -104 237 -74 -107 356 170 103 168 -422 65 60 13 394 -389 -71 -16 -365
7252 -365 119 10 250 36 220 119 272 -118 95 -23 -175 290 -24 -117 197 -152 364 1 -42 526 -119
7273 -119 -129 -34 -239 -7 -169 -196 112 -177 23 264 61 199 104 -120 191 -70 -286 45 -275 -221 144 -16
7295 -16 14 344 252 295 96 75 205 -151 -79 30 8 -16 -534 109 315 281 155 -145 -3 177 -409 -79 56
$$ packed form
7137C05m22j10Q62j69m93n1r1j38P85m18k6r2N7J18o6J99o1j70J0lm8J06k54K53
7161H3Kl45L11L86q51M29l31J74M39jj77Nk75K23J14k77K78l51M94m17O0P1q1
7184c7j64L36k90R2L32o42O14j77l04O2N0M05k3n51M40J70m38K79n50L90O8n4
7206HO9j66K39O3r9l7J61m36L4K30j56M34n14j60K12K35j59L42o16M96j09j25
7228e4Pk92K49O5j4L29l81j3L41l11l3M63j86o7O5n90M87nm7L81p83L18N5l49
7252c65M84j09K40k14J84j01J53l90K13j18j52M65l14r3L14l49N16l63m3N68o45
7273a19j0R5k05K32j62k7L08k89K00K41k03J38r5k24L11k61k16L31l20N4L65j60
7295a6L0L30r2M3j99k1J30l56P2J09k2k4n18O43K06l4j26l00J42J80n86L30J35
$$ plain form
7318 56 -232 130 267 -142 156 -235 -85 -3 163 48 -115 -115 201 -234 4 -34 -343 34 -19 -399 299 197
7340 197 -341 130 -257 129 -288 -21 115 -157 -35 -43 60 -85 69 37 350 310 173 58 22 141 232 -402
7362 -402 47 -12 -154 498 116 88 501 133 204 67 -216 135 -64 -421 -146 28 9 -295 -175 278 -77
7383 -77 11 118 -146 155 -63 -94 230 -148 138 362 -37 57 251 -153 139 61 -265 256 140 -237 -24 31
7405 31 225 15 -168 142 -3 -17 412 94 136 180 -60 370 -218 -115 193 -169 158 66 -206 53 -125 -285
7427 -285 301 203 46 -55 -120 246 66 -39 115 -167 -241 455 -202 268 -263 -203 189 -82 -124 226 43 165
7449 165 -36 -273 -19 -258 -149 295 -78 110 89 -110 65 10 -80 172 -474 -58 181 -208 391 82 216
7470 216 50 -109 32 31 -359 -146 -315 -156 95 -254 136 272 -41 282 -188 124 -212 -179 140 76 -266
$$ packed form
7318E6k88L62J37m09K98l91J50Q2J66j15j63%L16m35K38l8l09L77n3l80O98j02
7340A97n38M71l87L86m17K67J36k72J22qJ03j45J54l2L13m0j37j15l6J19R1o34
7362d02M49n9j42O52l82k8M13l68P1j37k83L51j99l57K75J74j9l04J20M53l55
7383g7Q8J07k64L01k18l1L24l78K86K24l99R4J94m04K92p8l26N21j16l77K13N5
7405C1J94k10j83L10j45j4M29l18M2M4k40M30n88J03L08l62L27r2k72K59j78j60
7427b85N86r8j57j01o5L66j80j05J54k82p4O96o57M70n31O0L92k71m2L50j83J22
7449A65k01k37K54k39J09M44l73J88k1j99J75n5r0K52o46M16K39l89N99l09J34
7470B16j66j59J41jl90K13j69J59K51l49L90J36l13L23m70L12l36L3L19o4l42
$$ plain form
7491 -266 -9 179 -164 377 -132 374 70 -254 202 119 -296 189 -101 -203 -126 -175 -74 252 -389 30 -81
7512 -81 -166 4 -326 155 247 72 191 -51 -75 202 -227 -84 182 -87 -124 456 -50 1 -60 -383 271 -80
7534 -80 256 108 -14 46 240 318 23 69 45 12 -37 217 -544 -207 34 104 118 27 18 91 -178 -327 -39 -343
7558 -343 -177 166 -228 -75 84 -387 -17 -236 -87 -42 101 157 -21 -21 307 -139 160 -317 -73 51 -100
7579 -100 106 257 -306 -129 217 53 165 -16 -90 -13 -153 -361 -178 -16 245 103 2 -92 -59 129 -96
7600 -96 -113 148 45 -77 84 -248 176 7 -130 -81 45 -242 -11 202 25 -60 -274 132 141 -8 114 279
7622 279 56 34 -139 260 354 -42 -35 -97 -465 134 37 -264 -220 -139 135 271 62 463 -104 -47 -105 -77 62 -6
7646 -6 -311 -6 184 60 136 -383 -21 227 78 335 -2 -220 35 -245 -218 357 -68 -122 -89 -568 363 231
$$ packed form
7491b66K57J88l43N41n09N06l04l24M56q3m15M85k90j02P7m9J01L26o41M19j11
7512h1q5J70l30M81R2j75J19k42k4K77m29J43K66k69l7N80n06N1o1l23O54l51
7534h0L36j48j22O0J94P8k95M6k4l3m9K54p61L37K41P0J4r1rP3k69j49K88l04
7558c43J66L43l94J53J59m71L70k19J49M5J43N6j78%L28m46K99m77K44J24j51
7579a00K06J51n63J77L46j64J12j81p4P7j40k08J83J62K61j42j01r4L3J88k25
7600i6j7K61j03j22J61l32M24j69j37M9J26k87K31K13j77q5k14M06Rj49J22J65
7622B79k23k2j73L99R4l96Po2l68N99r7l01M4Q1K74J36k09M01n67N7n8K8J39o8
7646fl05L05J90j24P6n19L62K48j49K57l37k18K55k80K7N75m25n4L3m79R31j32
$$ plain form
7668 231 237 91 412 33 -153 -99 -504 -309 88 246 -201 -113 -271 27 179 -91 -100 337 98 231 -136 -290
7690 -290 32 -150 -76 -44 140 191 292 -40 214 169 -288 165 -206 -20 -107 -320 -104 91 -41 445 220 -20
7712 -20 4 -286 147 33 -4 43 -40 130 -73 145 185 6 129 163 76 114 84 -100 644 68 -618 39 345
7735 345 98 -33 -94 -118 141 -10 82 57 -75 132 -217 170 -44 19 256 -87 -56 14 -379 361 287 -185 -35
7758 -35 405 -319 236 81 236 284 -116 145 -18 -196 -32 -183 -27 247 47 -87 -317 -69 147 -206 97
7779 97 193 -260 377 46 46 315 167 14 -11 -48 215 16 293 55 175 3 -212 56 221 472 -77 155
7801 155 19 -113 405 -73 -59 324 -224 259 -72 -114 134 32 -92 148 -160 13 -140 -316 80 53 -23
7822 -23 -41 -112 247 13 45 417 61 80 -186 -62 -411 234 -110 170 -127 -208 233 -101 251 222 -73 -116 137
$$ packed form
7668B31Oj46L21l79j86N4m05J95L97J58m47Q8j58K98J52k70rM37k39J33l67j54
7690b90L22j82P4L2J84N1J01l32K54m5m57M53l71J86q7k13K16J95j32M86k25k40
7712b0K4k90M33j14l7M7q3J70k03K18M0j79J23L4q7L8l0j84P44n76o86O57L06
7735C45k47j31o1k4K59j51R2k5j32K07l49L87k14O3K37l43L1P0l93P40p4m72J50
7758c5M40p24N55j55J55M8m00K61j63j78J64j51J56K74k00j34k30K48K16l53L03
7779I7R6m53O37l31%K69j48j53k5l7K63j99K77k38J20j72k15K68J65K51n49K32
7801A55j36j32N18m78J4L83n48M83l31m2K48j02j24K40l08J73j53j76L96k7p6
7822b3j8p1L59k34L2L72l56J9k66J24l49O45l44K80k97q1M41l34L52k9k95m3K53
$$ plain form
7845 137 274 352 -157 -108 310 -240 -98 22 123 289 -189 -162 146 -150 108 60 -418 -158 -216 65 182 -36
7867 -36 164 66 -100 -54 517 -95 134 -77 208 -87 -11 106 -199 174 -369 -3 -63 123 204 -77 259 85
7889 85 457 -127 -176 305 -113 -197 111 -82 111 -167 234 21 -278 -38 55 -230 -25 -228 99 23 -16 203
7911 203 -201 -133 139 -135 11 207 -289 39 103 356 220 -38 15 -61 -187 -100 -100 -393 -104 -181 82 185 -32
7934 -32 -220 236 -187 239 0 8 288 -78 -107 -152 -211 41 57 4 77 -1 -338 26 -13 216 286 9 73 20 -49
7959 -49 63 86 23 357 123 -194 42 -28 18 76 128 146 11 58 85 90 -344 16 57 159 266 -19 -276 -357 -187
7984 -187 246 -244 237 -40 -69 319 115 -119 -215 156 323 -182 57 -143 -6 226 -324 -454 288 155 -108
8005 -108 370 -200 263 -213 -214 52 70 143 71 -231 91 -10 74 -8 -12 61 98 -118 228 -270 -217 -108 -194 31
$$ packed form
7845A37J37P8n09M9M18n50J42J20J01J66m78K7L08k96K58m8m78K60n8K81J17k18
7867c6K00r8j66M6N71o12K29k11K85k95P6J17l05L73n43L66o0J86Q1k81L36j74
7889H5L72n84m9M81m18q4L08j93J93k78M01k13k99K40R3k85K05k03L27p6l9K19
7911B03m04O8K72k74J46J96m96L28O4K53j36k58N3p6j26Q7%k93K89p7K63J03k17
7934c2j88M56m23M26k39QK80l66k9m5n9K52J6n3P3p8l37L64l9K29P0k77O4n3o9
7959d9J12K3o3L34k34l17K36p0M6N8N2J8j35M7K7Nm34L60M1J02J07k85k57q1J70
7984a87M33m90M81k77k9L88k04k34r6L71J67n05K39k00J37K32n50j30P42j33k63
8005a08M78n70M63m76jK66J8P3p2l02L22j01Q4q2mP3L7k16L46m98N3J09q6K25
$$ plain form
8029 31 189 -136 251 285 -29 89 -72 -83 344 250 -153 6 -328 66 -319 -389 -182 -104 358 13 -144 164
8051 164 -316 -33 105 -109 -140 -187 -244 -245 -215 -39 -187 17 132 -12 162 149 246 -159 405 -153 184 234 -121
8074 -121 -25 43 52 254 97 -117 114 -65 -77 -137 -201 54 16 248 -126 -275 272 -49 224 -110 86 34 181
8097 181 -11 -18 73 19 336 -249 -349 100 188 98 -199 -80 177 -271 -197 113 7 155 -273 -18 -230 -36
8119 -36 -289 -142 50 -57 394 -104 359 55 37 187 -106 -52 167 4 -222 -89 59 -38 325 -200 116
8140 116 72 -141 185 -18 -133 50 -11 45 139 -42 49 -38 110 -104 -107 -170 43 -226 -187 -27 325 10 229
8163 229 15 -94 248 -134 150 44 90 38 16 -77 88 242 3 -36 417 -51 199 -151 -206 -204 -247 41 151
8186 151 48 -62 -37 -90 -16
$$ packed form
8029C1J58l25L87L4l14J18j61j1M27r4m03J59l34L94l85p0K07P8M62l45j57L08
8051A64m80K83J38k14l1m7n7jL0J76j48K04J15j44J74j3R7m05N64n58L37N0l55
8074a21R6O8RK02j57k14K31j79j2o0o4K55l8K32l74j49N47l21K73l34J96n2J47
8097A81j92pR1n4L17n85j00M49Q8r0k97J19K57m48P4L10j06J48m28K55k12J94
8119c6k53J47J92j07M51m98M63l04j8J50k93N4K19j63k26J33J48r7L63n25L16
8140A16m4k13L26k03j15J83o1N6R4j81R1q7J48k14lo3K13k69L9J60L52l15K19
8163B29k14j09L42l82K84j06M6n2k2r3J65J54k39l9M53m68K50l50n5Km3K88J10
8186A51j03j10K5n3P4
8191a6
$$ Imaginary data points
##PAGE= N=2
##DATA TABLE= (X++(I..I)), XYDATA
$$ plain form
0 0 0 0 0 -8 16 -16 16 -16 32 -40 49 -59 73 -89 112 -137 162 -190 222 -261 308 -360 415 -477 547 -627
26 -627 714 -810 917 -1033 1164 -1306 1461 -1635 1824 -2030 2255 -2505 2777 -3075 3407 -3771
42 -3771 4172 -4620 5120 -5681 6317 -7043 7879 -8853 10009 -11405 13129 -15316 18195
55 18195 -22168 28017 -37472 55200 -99382 413401 479805 -569407 417133 365965 -485617
66 -485617 133600 299435 -483545 -44039 125125 -389642 -8317 199628 -288476 124949
76 124949 373596 -188329 -9242 311830 -117906 -56447 165692 -108004 -154032 -77776 -79957
87 -79957 52656 -57888 -40738 174320 -16513 -30882 218644 19030 -25348 153746 -68246
98 -68246 -97635 62097 -182821 -126139 161895 -123248 -149637 196234 -88095 -123410 325716
$$ packed form
0@%%%qK4l2L2l2M8p2Q9j08J32j62K01k49K99l52M12m83N69o68P75q92J024j174
26f27J341j524J727j950K197k470K767l096L459l854M285m760N282n852O482p178
42c771P943q792R740j0801J1998j3360J4922j6732J8862k1414K4534k8445L3511
55A8195m0363N0185o5489R2672j54582N12783O6404j049212R86540n1168q51582
66d85617O19217J65835p82980M39506J69164n14767L81325K07945m88104M13425
76A24949K48647n61925J79087L21072m29736O1459K22139k73696m6028P6256k181
87g9957J32613j10544J7150K15058j90833j4369K49526j99614m4378J79094k21992
98f8246k9389J59732k44918N6682K88034k85143k6389L45871k84329l5315M49126
$$ plain form
109 325716 24417 -134126 252406 -67579 -167819 260594 -116004 -232830 247012 -113426
119 -113426 -260668 242103 -54362 -217644 317283 79904 -233429 200824 73037 -208735
129 -208735 213479 90696 -293868 83742 64009 -266841 88987 99484 -204226 90286
139 90286 115030 -133544 69855 91039 -46298 92824 32042 -99692 -736 -20215 -55709
150 -55709 34168 -15578 -64516 9246 -9308 8301 93370 10295 13694 100755 -52552 -39871
162 -39871 100687 -91521 -69834 108407 -120341 -112105 91897 -89677 -31925 174150 -36129
173 -36129 -40162 126843 -36301 -7584 149220 -55340 -89766 89582 -76244 -119950 103089
184 103089 -42019 -109839 147547 8793 -123821 116353 44249 -47959 126874 -4842
$$ packed form
109C25716l01299j58543L86532l19985j00240M28413l76598j16826M79842l60438
119a13426j47242N02771k96465j63282N34927k37379l13333M34253j27787k81772
129b08735M22214j22783l84564L77610j9733l30850L55828J0497l03710K94512
139I0286K4744k48574K03399K1184j37337J39122o0782j31734R8956j9479l5494
150e5709Q9877m9746m8938P3762j8554J7609Q5069q3075L399Q7061j53307J2681
162c9871J40558j92208K1687J78241k28748Q236K04002j81574N7752K06075k10279
173c6129m033J67005j63144K8717J56804k04560l4426J79348j65826m3706K23039
184A03089j45108o7820K57386j38754j32614K40174p2104r2208J74833j31716
$$ plain form
194 -4842 -113344 40661 -31758 -70896 58483 -38918 -97382 45494 22247 -52452 53071
205 53071 79961 -2830 33187 42197 -31391 -5671 8614 -10121 7857 -59397 -71072 9202
217 9202 -16997 -913 50994 2367 16980 21815 -9712 60724 21504 -55785 28542 -3274
229 -3274 -103497 -17835 18973 -51651 5635 58821 -20016 -6104 59026 13255 48618 75965
241 75965 -58711 -30591 42438 -81026 -37293 53539 -74924 -52445 51339 -23634 -18849
252 -18849 54664 29220 30455 42768 -15309 -29491 20044 526 -30258 8628 -28666 -76700
264 -76700 7513 30013 -11449 25858 32275 14306 19495 2985 15692 15407 -11113 -1503 -28329
277 -28329 -50013 -26883 -26686 9884 26938 -21745 6095 37386 2486 26694 60131 14485
$$ packed form
194d842j08502J54005p2419l9138J29379r7401n8464J42876k3247p4699J05523
205E3071K6890q2791L6017R010p3588K5720J4285j8735J7978o7254j1675Q0274
217I202k6199J6084N1907m8627J4613M835l1527P0436l9220p7289Q4327l1816
229c274j00223Q5662L6808p0624N7286N3186p8837J3912O5130m5771L5363K7347
241G5965j34676K8120P3029j23464M3733R0832j28463K2479J03784p4973M785
252a8849P3513k5444J235J2313n8077j4182M9535j9518l0784L8886l7294m8034
264g6700Q4213K2500m1462L7307O417j7969N189j6510J2707k85k6520R610k6826
277b8329k1684K3130J97L6570J7054m8683K7840L1291l4900K4208L3437m5646
$$ plain form
289 14485 -21574 -2277 -12719 -46273 -11580 -3149 -41340 -143 26 -36852 32825 40559 4721
302 4721 60216 27711 -35811 7677 8440 -19931 -2849 -17646 -45764 -29811 -2038 -5042 3929
315 3929 37765 18777 6987 33484 568 -6790 27347 451 -17125 -25333 -48588 -22220 -1521
328 -1521 1841 14647 2420 10293 20333 14045 38134 23262 -4932 12014 -14528 -44768 -23607
341 -23607 -14967 -12456 -8453 -9218 -6889 -4246 19600 32220 31514 36468 -3334 -12684 18440 -20865
355 -20865 -23118 16859 -26523 -38801 -4771 -13030 -2079 17827 19877 26587 13257 -2825 1407
368 1407 12767 10452 -11930 -6071 -14137 -50165 -13988 17309 -7469 7184 13869 2152 16413
381 16413 8226 14456 28501 2153 -5867 -9888 -26163 -22504 -16870 4086 6445 -25100 -9516
$$ packed form
289A4485l6059J9297j0442l3554L4693Q431l8191M1197J69l6878O9677P734l5838
302D721N5495l2505o3522M3488P63k8371J7082j4797k8118J5953K7773l004Q971
315C929L3836j8988j1790K6497l2916p358L4137k6896j7576q208k3255K6368K0699
328a521L362J2806j2227P873J0040o288K4089j4872k8194J6946k6542l0240K1161
341b3607Q640K511M003p65K329K643K3846J2620p06M954l9802r350L1124l9305
355b0865k253L9977m3382j2278L4030q259J0951J9906K050O710j3330j6082M232
368A407J1360k315k2382N859q066l6028L6177L1297k4778J4653O685j1717J4261
381A6413q187O230J4045k6348q020m021j6275L659N634K0956K359l1545J5584
$$ plain form
394 -9516 12878 7973 23045 28172 21438 7173 -11684 2455 133 -17420 -4716 -10338 -18636
407 -18636 -20238 -27634 10119 23174 -1603 24427 23271 -10132 4526 17793 11849 -121 -16851
420 -16851 -15234 -21901 -24835 -5735 4664 11715 -210 -3747 26063 11061 783 36599 16303
433 16303 -15503 -11654 -21123 -17294 -13661 -14136 3968 -7966 -19527 5495 19737 24352 19603 18560
447 18560 21225 -11172 -17314 7027 -8565 -17286 -11010 -17090 -16298 -18833 4307 30610 12602 13989
461 13989 21890 2188 4295 5287 4089 5665 -23123 -25987 -14006 -27109 -9596 11648 5703 7026
475 7026 4501 10531 16383 12551 22651 10103 -8663 -7364 -22472 -18219 -2314 -11191 -224 -937
489 -937 -13512 7250 11443 13284 29493 13418 -1471 -5299 -11147 -5129 -11990 -11641 -3296 -23922
$$ packed form
394i516K2394m905J5072N127o734j4265j8857J4139k322j7553J2704n622q298
407a8636j602p396L7753J3055k4777K6030j156l3403J4658J3267n944j1970j6730
420a6851J617o667k934J9100J0399P051j1925l537K9810j5002j0278L5816k0296
433A6303l1806L849r469L829L633m75J8104j1934j1561K5022J4242M615m749j043
447A8560K665l2397o142K4341j5592q721O276o080P92k535K3140K6303j8008J387
461A3989P901j9702K107R92j198J576k8788k864J1981j3103J7513K1244n945J323
475G026k525O030N852l832J0100j2548j8766J299j5108M253J5905q877J0967p13
489i37j2575K0762M193J841J6209j6075j4889l828n848O018o861L49Q345k0626
$$ plain form
503 -23922 -18520 2819 1922 14534 23337 20259 16792 -305 3878 13067 1912 -1039 -13160 -19726
517 -19726 -18989 -29223 223 17588 -11536 4070 19998 -1709 6811 17994 15528 9976 -12190
530 -12190 -12326 -8550 -23940 -14375 6500 4404 -13485 -9497 20007 11372 4798 34907 19172 -6110
544 -6110 -2387 -9645 -2563 -8616 -24227 847 -8542 -35433 -2365 14838 5018 15514 21311 14075
558 14075 -1790 -4021 13449 7934 -8764 -15475 -14176 -13040 -22639 -2378 19500 -1283 6879
571 6879 20578 1948 13114 12992 2404 22953 -8223 -38029 -5432 -12495 -27252 4615 5402
584 5402 -16421 -6112 12840 13595 15069 20056 9132 9353 3887 -23913 -3791 10483 -25115 -5640
598 -5640 8151 -28781 -8320 17417 9743 21284 8090 -1528 14292 -6221 -9907 14472 -7207
$$ packed form
503b3922N402K1339q97J2612Q803l078l467j7097M183R189j1155k951j2121o566
517a9726P37j0234K9446J7365k9124J5606J5928k1707Q520J1183k466n552k2166
530a2190j36L776j5390R565K0875k096j7889L988K9504q635o574L0109j5735k5282
544f110L723p258P082o053j5611K5074r389k6891L3068J7203r820J0496N797p236
558A4075j5865k231J7470n515j6698o711J299J136r599K0261K1878k0783Q162
571F879J3699j8630J1166j22j0588K0549l1176k9806L2597p063j4757L1867P87
584E402k1823J0309J8952P55J474M987j0924K21n466k7800K0122J4274l5598J9475
598e640J3791l6932K0461K5737p674J1541j3194r618J5820k0513l686K4379k1679
$$ plain form
611 -7207 -27683 -8062 -6842 -22828 -2906 17706 3290 12441 17487 -7966 14932 21831 -8380
624 -8380 18233 6559 -42691 -8060 4190 -22507 2730 4907 -13227 2987 5290 3927 15959
637 15959 9522 4096 11356 -2477 -22877 -3812 7034 -12750 468 -1769 -29944 2394 15417
650 15417 -4478 26145 9906 -18718 25001 8561 -22254 21272 7406 -28632 2746 -1672
662 -1672 -33189 -3236 18819 -4842 692 12244 -10322 5611 25543 -1182 9226 8458 -31675
675 -31675 -4536 6413 -27590 591 7848 -18387 5750 7184 -2370 24244 17080 5886 20509
688 20509 -1915 -26063 1893 9343 -22549 -12574 933 -29812 -11459 21740 979 9257 18738
701 18738 -3961 16214 9776 -20519 11320 9546 -23450 -6573 -7260 -20419 606 13949 13981
$$ packed form
611g207k0476J9621J220j5986J9922K0612j4416R151N046k5453K2898O899l0211
624h380K6613j1674m9250L4631J2250k6697K5237K177j8134J6214K303j363J2032
637A5959o437n426P260j3833k0400J9065J0846j9784J3218k237k8175L2338J3023
650A5417j9895L0623j6239k8624M3719j6440l0815M3526j3866l6038L1378m418
662a672l1517K9953K2055k3661N534J1552k2566J5933J9932k6725J0408p68m0133
675c1675K7139J0949l4003K8181P257k6235K4137J434r554K6614p164j1194J4623
688B0509k2424k4148K7956P450l1892R975J3507l0745J8353L3199k0761Q278R481
701A8738k2699K0175o438l0295L1839j774l2996J6877o87j3159K1025J3343L2
$$ plain form
714 13981 9009 -4495 2079 21153 7411 -12692 9140 1498 -39304 -8629 9371 -30208 -2585
727 -2585 24650 -7284 4281 8799 -3651 27388 17209 -12313 10113 -862 -32106 -3967
739 -3967 16644 -13746 -18392 10408 1251 -11157 11593 13871 8447 8111 -6307 4843 276 -26634
753 -26634 5963 17289 -21760 -10785 1590 -10775 6513 13732 6786 8301 -4599 -4197 13834
766 13834 5130 -13216 781 10943 -17616 -16521 7404 -9411 -2025 21415 -3983 -5227 6840
779 6840 -6073 17697 22063 -13997 -4639 4541 -14983 -6531 3464 -7680 -8978 1309 -2704 -6639
793 -6639 6701 6733 7872 23721 -526 -14549 11865 425 -7225 10539 -7502 -18090 -6862
806 -6862 -7394 5480 6709 -3694 7287 8029 -2956 1532 7578 2223 -3509 1393 -4648 -18751
$$ packed form
714A3981m972j3504O574J9074j3742k0103K1832p642m0802L0675J8000l9579K7623
727b585K7235l1934J1565M518j2450L1039j0179k9522K2426j0975l1244K8139
739c967K0611l0390m646K8800r157j2408K2750K278n424l36j4418J1150m567k6910
753b6634L2597J1326l9049J0975J2375j2365J7288P219o946J515j2900M02J8031
766A3834q704j8346J3997J0162k8559J095K3925j6815P386K3440k5398j244J2067
779F840j2913K3770M366l6060R358R180j9524Q452R995j1144j298J0287m013l935
793f639J3340L2J139J5849k4247j4023K6414j1440p650J7764j8041j0588J1228
806f862n32J2874J229j0403J0981P42j0985M488O046n355n732M902o041j4103
$$ plain form
820 -18751 -7815 205 2423 13070 -4809 -8268 14867 3721 5727 22191 -2128 -10441 2421
833 2421 -5548 -8984 -7858 -7323 112 -2132 -8220 -5967 3896 11590 10184 14357 3147 -12767 4253
848 4253 8179 -3905 2032 -10350 -13995 2334 -8526 -4212 12540 594 4017 13079 -1523
861 -1523 -3750 6691 6837 566 -3360 -8626 -17992 -5748 6209 -3831 3179 4815 -7998 6766
875 6766 11602 3331 11080 1376 -3678 3237 -12589 -11652 2156 -4159 -3358 277 -5772 -5639 3667
890 3667 15889 12823 3183 85 -4330 2663 3191 -8429 814 -3295 -16444 1326 -715 -10643
904 -10643 7126 10827 6676 4929 -7126 544 11163 2998 782 -1745 -11060 -12873 -1730 6645
918 6645 -3850 -3914 7366 -373 768 5162 563 12607 6199 -7852 3244 -7471 -16436 5242
$$ packed form
820a8751J0936Q020K218J0647j7879l459K3135j1146K006J6464k4319q313J2862
833B421p969l436J126N35P435k244o088K253R863P694j406M173j1210j5914J7020
848D253L926j2084N937j2382l645J6329j0860M314J6752j1946L423R062j4602
861a523k227J0441J46o271l926n266r366J2244J1957j0040P010J636j2813J4764
875F766M836q271P749r704n054O915j5826R37J3808o315Q01L635o049J33R306
890C667J2222l066r640l098m415O993N28j1620R243m109j3149J7770k041r928
904a0643J7769L701m151j747j2055P670J0619q165k216k527r315j813J1143Q375
918F645j0495o4J1280p739J141M394m599J2044o408j4051J1096j0715q965K1678
$$ plain form
932 5242 6338 -6943 -8193 -4321 986 1685 7563 12111 2386 -391 993 1791 2934 -6517 -2467
947 -2467 5030 -11436 -10745 -1179 -5564 5191 10043 3061 4627 -4493 -67 14538 5613 -2998 -5105
962 -5105 -7473 -5897 -6778 -2144 761 -3491 3783 4759 -151 3926 3281 12069 13689 -7592 -8540 -3790
978 -3790 -8755 372 644 -6993 -5041 -6323 2345 10632 3828 6654 9051 3791 -378 -5458 -1408
993 -1408 -1558 -5893 254 -7460 -13416 -2020 1638 8485 11357 68 2495 3390 -659 7104 1903
1008 1903 -4200 -3445 -10037 -6344 -3166 -5890 2769 5824 4128 2639 -1811 4747 7605 5755 7240
1023 7240 -5929 -11509 -4067 -6298 837 1146 -9463 -510 1734 -2118 5084 4695 6361 7685 -143
1038 -143 -1095 -3978 -5317 3034 1498 -2150 -7633 -10991 2025 4654 1508 8219 2459 -652 1945
$$ packed form
932E242J096j3281j250L872N307O99N878M548r725k777J384P98J143r451M050
947b467P497j6466O91R566m385J0755M852o982J566r120M426J4605q925q611k107
962e105k368J576q81M634K905m252P274R76m910M077o45Q788J620k1281r48M750
978c790m965R127K72p637J952j282Q668Q287o804K826K397n260m169n080M050
993a408j50m335O147p714n956J1396L658O847K872j1289K427Q95m049P763n201
1008A903o103P55o592L693L178k724Q659L055j696j489m450O558K858j850J485
1023G240j3169n580P442k231P135L09j0609Q953K244l852P202l89J666J324p828
1038a43r52k883j339Q351j536l648n483l358J3016K629l146O711n760l111K597
$$ plain form
1053 1945 557 4988 -262 -4652 3702 -6256 -13197 -3032 -306 2193 3057 -151 3400 -1458 848
1068 848 13376 8618 302 -1695 -2889 -2382 -7295 -2701 3040 -7716 -5008 607 -3581 2404 4610
1083 4610 6735 12042 -2327 -6314 2820 -1762 -873 927 -4481 -7184 -9808 -409 7005 1569 4001
1098 4001 7461 4042 3243 -1574 2929 5819 -5097 -3570 -4989 -13610 -7868 -885 5134 4199 -5841
1113 -5841 3491 8231 -74 9076 10097 -1381 -1811 -4651 -4849 -4598 -7379 -154 2383 -3096 -3686 132
1129 132 7211 6299 5169 11392 -1840 -9384 2060 -1989 -3615 79 -8098 -4905 -2290 -5342 6000
1144 6000 7164 3069 7092 4224 -127 -2421 548 5048 -2600 -5761 -4820 -10736 -3707 4144 2548
1159 2548 4238 562 1030 5511 1642 6138 5665 -3007 393 -5043 -10188 -2433 -4232 -511 4153
$$ packed form
1053A945j388M431n250m390Q354r958o941J0165K726K499Q64l208L551m858K306
1068H48J2528m758q316j997j194N07m913M594N741j0756K708N615m188N985K206
1083D610K125N307j4369l987R134m582Q89J800n408k703k624R399P414n436K432
1098D001L460l419p99m817M503K890j0916J527j419q621N742O983O019r35j0040
1113e841R332M740q305R150J021j1478m30k840j98K51k781P225K537n479n90L818
1129A32P079r12j130O223j3232p544J1444m049j626L694q177L193K615l052J1342
1144F000J164m095M023k868m351k294K969M500p648l161R41n916P029P851j596
1159B548J690l676M68M481l869M496m73q672L400n436n145P755j799L721M664
$$ plain form
1174 4153 -6066 -2829 4074 878 6653 10154 2692 -3919 -2176 2156 -4425 -2401 4021 -5107 -4881
1189 -4881 -810 -4367 5638 5085 113 10809 499 -9744 4715 3225 -4306 12 -2312 -7371
1203 -7371 -8799 -2799 4465 1702 1013 2687 2888 3298 -877 6133 10354 -3569 -3279 1021 -8245 -5799
1219 -5799 -1102 1077 2350 -8638 -2897 7914 -2928 2675 12911 856 -3551 -363 -2344 -2024
1233 -2024 -1652 -1310 -1044 -2166 -6235 -4232 10186 5913 -2717 11669 4165 -11141 5232 4999 -5729
1248 -5729 1466 -4161 -8428 -2284 -6812 -100 8646 1431 -948 3683 3082 -904 3054 7486 -1434
1263 -1434 -4392 -3186 -7569 -391 169 -4213 7184 291 -8732 6750 4983 -319 7031 2336 -1742
1278 -1742 -3247 -6565 1138 2072 -4687 -1133 -508 -4010 -3815 3593 7681 831 999 2227 -2347 -206
$$ packed form
1174D153j0219L237O903l196N775L501p462o611J743M332o581K024O422r128K26
1189d881M071l557J0005n53m972J0696j0310j0243J4459j490p531M318k324n059
1203g371j428O000P264k763o89J674K01M10m175P010M221j3923K90M300r266K446
1219e799M697K179J273j0988N741J0811j0842N603J0236j2055m407L188j981L20
1233b024L72L42K66j122m069K003J4418m273q630J4386p504j5306J6373k33j0728
1248e729P195n627m267O144m528O712Q746p215k379M631o01l986L958M432q920
1263a434k958J206m383P178N60m382J1397o893r023J5482j767n302P350m695m078
1278a742j505l318P703R34o759L554O25l502J95P408M088o850J68J228m574K141
$$ plain form
1294 -206 -945 1429 6646 -7525 -6970 6208 -7210 -3844 12370 -579 -3263 3340 -2313 947
1308 947 5488 162 1279 2290 -6534 -8194 4498 840 -8248 6023 3131 -12637 2804 7631
1322 7631 -2279 7775 4284 -3872 2624 -3379 -3041 5492 -1639 -6128 -1832 -2117 -5117 -1142 8151
1337 8151 4039 -1882 3936 545 -1805 3310 2009 1187 -4120 -8445 -1121 -3774 -3882 6204 1053
1352 1053 -404 4099 -636 3731 5762 191 4582 -842 -9611 -4324 -1522 -3472 -1052 2762 -1697
1367 -1697 -5768 5130 6896 -146 8758 4166 -6209 1498 -2817 -7427 2866 -2935 -5873 833
1381 833 -3941 -4313 4768 8487 3447 2117 4704 -1657 -3956 6455 410 -5825 8 -6448 -6457 1351
1397 1351 -1849 1821 5321 728 318 657 2220 2028 792 5135 -2353 -9931 -895 -603 -2667 3228
$$ packed form
1294b06p39K374N217j4171N55J3178j3418L366J6214j2949k684O603n653L260
1308I47M541n326J117J011q824j660J2692l658r088J4271k892j5768J5441M827
1322G631r910J0054l491q156O496o003L38Q533p131m489M296k85l000L975R293
1337H151m112n921N818l391k350N115j301q22n307m325P324k653j08J0086n151
1352A053j457M503m735M367K031n571M391n424q769N287K802j950K420L814m459
1367a697m071J0898J766p042Q904m592j0375P707m315m610J0293n801k938O706
1381H33m774l72R081L719n040j330K587o361k299J0411o045o235N833o456rP808
1397A351l200L670L500m593m10L39J563j92j236M343p488p578R036K92k064N895
$$ plain form
1413 3228 597 -1274 -842 240 5539 3371 2270 3401 -1306 -1475 -3675 -4600 3219 -673 -4841 827
1429 827 -4198 -4290 4490 5205 4362 822 -1263 1561 -442 1165 1666 -1603 -998 -5647 -4572 2050 -3588
1446 -3588 -92 7808 -863 -2324 1417 189 4240 3531 593 -801 -5394 -4281 -1072 965 1176
1461 1176 -3584 608 2826 -4396 2883 7324 100 3118 1308 -3637 -1899 -2956 532 2723 -4592
1476 -4592 -4328 -1865 -1150 2626 3325 4779 2060 -2009 1966 1273 -1380 1437 -1598 -1263 -2543 -8502
1492 -8502 -1331 2256 -750 4984 2567 -2220 1130 2334 5073 3215 -2408 -1491 -3839 -4782 -1523
1507 -1523 -2042 853 418 -1455 2422 -358 33 6326 4257 3245 -723 -5466 -395 -1564 -2335 2897
1523 2897 -4000 -5660 671 -1052 2168 4744 1928 2611 1505 -535 -1672 -1419 2530 -1280 -3329
$$ packed form
1413C228k631j871M32J082N299k168j101J131m707j69k200r25P819l892m168N668
1429H27n025r2Q780P15q43l540k085K824k003J607N01l269O05m649J075O622n638
1446c588L496P900q671j461L741j228M051p09k938j394m593J113L209K037K11
1461A176m760M192K218p222P279M441p224L018j810m945J738j057L488K191p315
1476d592K64K463P15L776O99J454k719m069L975o93k653K817l035L35j280n959
1492h502P171L587l006N734k417m787L350J204K739j858n623R17k348r43L259
1507a523n19K895m35j873L877k780L91O293k069j012l968m743N071j169p71N232
1523B897o897j660O331j723L220K576k816O83j106k040j137K53L949l810k049
$$ plain form
1538 -3329 -373 -6826 -2448 5599 1707 3506 2346 -2965 3012 3333 15 2440 -692 -3233 -2806
1553 -2806 -3300 -1868 -2639 444 3736 -1715 -1282 313 -22 6414 4212 -685 963 -3938 -2877 2325
1569 2325 -2 -496 -2258 -2461 1429 -2017 159 5192 1483 1936 865 -2376 -646 -1452 898 3232
1585 3232 -3899 -5240 -2417 -797 2046 1124 2577 2774 -3003 2553 5160 -1197 1766 1766 -1377 -2307
1601 -2307 -5653 -2724 480 -1345 1610 229 -2716 160 2207 6583 4612 -1575 533 -1078 -3911
1616 -3911 58 -1925 -2452 -1120 -4265 -569 214 -1192 5126 5786 2914 876 -2793 831 1142 -1162
1632 -1162 1101 -4033 -6550 -1279 -926 1736 2398 319 3961 1671 -288 1975 595 1080 301 -3874
1648 -3874 -3456 -5727 -4355 2613 1141 514 1177 -1015 3562 4182 2834 4306 -328 -2449 -1235 -3487
$$ packed form
1538c329K956o453M378Q047l892J799j160n311N977L21l318K425l132k541M27
1553b806m94J432p71L083L292n451M33J595l35O436k202m897J648m901J061N202
1569B325k327m94j762k03L890l446K176N033l709M53j071l241J730q06K350K334
1585C232p131j341K823J620K843r22J453J97n777N556K607o357K963%l143r30
1601b307l346K929L204j825K955j381k945K876K047M376j971o187K108j611k833
1616c911L969j983n27J332l145L696P83j406O318O60k872k038l669L624L11k304
1632a162K263n134k517N271L53K662O62k079L642k290j959K263j380M85p79m175
1648c874M18k271J372O968j472o27O63k192M577O20j348J472m634k121J214k252
$$ plain form
1664 -3487 -2347 -1943 -1710 1750 -2009 -2966 1266 1060 4492 4071 -20 109 -3551 -1601 2909 -1556
1680 -1556 -2389 -1147 -2791 -92 115 1241 4097 1329 2767 2339 -2798 -195 1231 558 1151 -4064
1696 -4064 -4755 -1800 -1852 2266 1349 -656 852 -947 931 3460 112 2125 1269 -1306 -516 -3323
1712 -3323 -1978 2410 299 206 -767 -2965 333 1088 3601 3984 -2540 -1149 1131 -1107 685 -191
1728 -191 -1345 -915 -3585 -1400 184 -2495 2548 3848 1207 238 -1925 2079 3329 811 1556 -2174
1744 -2174 -5447 -1238 -555 581 601 -2659 1945 1992 -1947 2571 3259 1431 1810 -860 -2153 -4274 -3326
1761 -3326 2052 -368 -2154 -1975 -2654 2864 2878 1999 5441 543 -1852 2819 -745 -2034 810 -1611
1777 -1611 -1175 -2352 -4280 -674 1520 2899 3136 1158 536 -1553 1130 4123 -1311 -1359 -1307 -4836 -1243
$$ packed form
1664c487J140M04K33L460l759r57M232k06L432m21m091J29l660J950M510m465
1680a556q33J242j644K699K07J126K856k768J438m28n137K603J426o73N93n215
1696d064o91K955n2M118r17k005J508j799J878K529l348K013q56k575P90k807
1712c323J345M388k111r3r73k198L298P55K513L83o524J391K280k238J792q76
1728a91j154M30k670K185J584k679N043J300k641r69k163M004J250k518P45l730
1744b174l273M209O83J136K0l260M604M7l939M518O88j828L79k670j293k121R48
1761c326N378k420j786J79o79N518J4q79L442m898k395M671l564j289K844k421
1777a611M36j177j928L606K194J379K37j978o22k089K683K993n434m8N2l529L593
$$ plain form
1794 -1243 -638 -1557 3324 294 73 3975 -585 362 3321 2338 1462 -2560 -4072 -1138 -1962 -408 1489
1811 1489 -1038 -1881 -1329 3235 2148 -691 4096 1777 -3027 533 -1671 -2925 2834 -795 -1276 321
1827 321 -4525 -296 4772 1091 1440 1052 -966 -505 1078 2190 -929 -831 127 -3668 -1445 -400 -1528
1844 -1528 3339 787 -1902 2122 -2391 -542 6485 543 -1525 1432 -3588 -2332 1627 -344 -437
1859 -437 -420 -1029 -556 957 1041 707 4053 2395 -3107 1263 -453 -3784 3037 966 -4603 -1333 -3636
1876 -3636 -716 4064 -988 1513 3711 -1847 -66 3623 -196 -670 1686 -405 -4387 -2459 -600
1891 -600 -1839 2706 1796 -2756 1737 298 -895 6363 1333 -3524 1154 -2377 -3196 319 -1405 410
1907 410 373 -1818 1029 1032 537 3671 3455 739 -1563 -1249 -1564 -1366 1545 -1748 -3219 760 -2863 -1316
$$ packed form
1794a243O05r19M881l030k21L902m560R47K959r83q76m022j512K934q24J554J897
1811A489k527q43N52M564j087k839M787k319m804L560k204j254N759l629m81J597
1827C21m846M229N068l681L49l88k018M61J583J112l119R8R58l795K223J045j128
1844a528M867k552k689M024m513J849P027n942k068K957n020J256L959j971r3
1859d37J7o09M73J513Q4l34L346j658n502M370j716l331O821k071n569L270k303
1876c636K920M780n052K501K198n558J781L689l819m74K356k091l982J928J859
1891f00j239M545r10m552M493j439j193P258n030m857M678l531q19L515j724J815
1907D10l7k191K847Lm95L134k16k716k302L14l15J98K911l293j471L979l623J547
$$ plain form
1925 -1316 5907 -179 -835 4767 -1181 -1248 2029 -1599 417 1103 -3084 -2131 -1398 -1910 600 3403 1427
1942 1427 -2474 745 1503 -527 2449 1313 -1030 231 -3300 -1406 1850 -3057 845 3845 -3305
1957 -3305 -1452 1965 -261 2619 2333 -423 339 -2153 -1870 1065 1334 -2170 -1950 986 -2194 -2692
1973 -2692 3894 1728 -429 2954 -702 -389 1536 -1941 2891 2131 -5555 -1159 41 -3627 676
1988 676 2600 -658 -468 27 1083 1886 2071 988 672 617 -3805 -2609 1962 -2456 -1586 2607 -3020
2005 -3020 -1954 2194 235 3474 3011 -1602 1497 -85 -3249 1196 298 -2361 -1399 -1046 -1920 -1004
2021 -1004 1830 2375 2002 1931 -1002 93 2190 -1589 1054 1235 -5151 -1997 -656 -3766 1622 1955
2037 1955 -1161 2701 161 -945 3777 1628 300 1495 -1085 -3571 -1585 302 -1422 455 1653
$$ packed form
1925a316P223o086o56N602n948o7L277l628K016O86m187R53P33n12K510K803j976
1942A427l901L219P58k030K976j136k343J261l531J894L256m907L902L000p150
1957c305J853L417k226K880k86k756P62k492K83K935K69l504K20K936l180m98
1973b692O586k166k157L383l656L13J925l477M832p60p686M396J200l668M303
1988F76J924l258J90M95J056Q03J85j083l16n5m422J196M571m418Q70M193n627
2005c020J066M148j959L239m63m613L099j582l164M445q98k659R62L53q74R16
2021a004K834N45l73p1k933J095K097l779K643J81o386L154J341l110N388L33
2037A955l116L862k540j106M722k149j328J195k580k486J986J887j724J877J198
$$ plain form
2052 1653 -3052 235 3142 -994 2819 4204 -2672 82 414 -4150 684 282 -2475 367 -952
2067 -952 -2463 1250 2039 1516 2300 1695 -817 -1053 1526 -326 -224 743 -3304 -1982 -102 -2845 2103
2084 2103 2502 -1719 2273 920 -2108 3111 1507 -724 1460 -1891 -3353 -294 -495 -559 1013 769
2100 769 -1484 64 1927 296 2076 3015 -1895 25 749 -4028 808 1477 -3221 228 -407 -3238
2116 -3238 1221 1345 1017 2258 573 -364 254 -163 98 512 460 -2866 -2145 131 -1776 602 3041
2133 3041 -360 1297 1208 -1536 2693 1701 -1284 1494 -1145 -4233 -467 -1302 -795 771 -447 -344
2149 -344 -49 533 1371 2809 2512 -761 -322 563 -2775 -664 1473 -2286 -751 38 -2209 1040 1450
2166 1450 996 3415 -26 -1212 597 -744 -657 394 -827 -1844 -2622 -828 -215 622 2166 574
$$ packed form
2052A653m705L287K907m136L813J385o876K754L32m564M834m02k757K842j319
2067i52j511L713P89n23P84o05k512k36K579j852J02R67m047J322J880k743M948
2084B103L99m221L992j353l028N219j604k231K184l351j462L059k01o4J572k44
2100G69k253J548J863j631J780R39m910J920P24m777M836O69m698L449o35k831
2116c238M459J24l28J241j685r37O18m17K61M14n2l326P21K276j907K378K439
2133C041l401J657q9k744M229r92k985K778k639l088L766q35N07J566j218J03
2149c44K95N82Q38J438k97l273M39Q85l338K111K137l759J535P89k247L249M10
2166A450m54K419l441j186J809j341Q7J051j221j017p78J794O13Q37J544j592
$$ plain form
2182 574 1011 1593 -876 1180 1857 -1032 739 -1155 -3863 -545 -658 -641 2140 26 -708 1017 704
2199 704 1261 1527 1210 -14 -1230 -513 -1667 -1185 861 -688 -244 506 -1956 857 2413 527 2095
2216 2095 775 -1726 261 -302 -49 1144 -1163 -1157 -1079 -928 164 4 1289 1288 -78 535 114 -369 1538
2235 1538 186 -548 -1027 -2710 -159 97 -869 1615 165 -356 739 326 1528 1774 255 1270 -331
2252 -331 -2077 -607 -641 -144 -152 -1331 -835 -1709 -455 1942 778 1641 699 -681 955 127 -452 1349
2270 1349 -905 -1541 -233 -1915 -511 560 242 2043 382 -686 456 -21 922 347 -1154 -887
2286 -887 -2569 -1715 312 -892 144 575 -111 1047 166 1199 2316 339 624 60 -2712 -737 -438
2303 -438 -708 637 -1145 -1256 116 403 1422 1963 976 848 -620 -297 -618 -1168 290 -587 -1174 -463
$$ packed form
2182E74M37N82k469K056O77k889J771j894k708L318j13J7K781k114p34J725l13
2199G04N57K66l17j224j216P17j154M82K046j549M44P50k462K813J556j886J568
2216B095j320k501J987n63K53J193k307OP8J51J092j60J285jj366O13m21m83J907
2235A538j352p34m79j683K551K56r66K484j450n21J095m13J202K46j519J015j601
2252c31j746J470l4M97qj179M96q74J254K397j164Q63r42j380J636q28n79J801
2270A349k254o36J308j682J404J071l18J801j661j068J142m77R43n75j501K67
2286h87j682Q54K027j204J036M31o86J158q81J033J117j977K85n64k772J975K99
2303d38k70J345j782j11J372K87J019N41r87j28j468L23l21n50J458q77n87P11
$$ plain form
2321 -463 -2105 -366 1993 453 1349 1141 -1543 482 707 707 853 -1377 -1111 -534 -1052 198 435 552
2339 552 1006 -378 227 26 -528 1477 815 -763 -984 -2082 -930 234 2 693 -587 -1056 1010
2356 1010 203 928 1928 -276 605 104 -1169 -310 368 -28 206 -908 -953 -1215 -453 1488 95 357
2374 357 392 -1444 451 919 -440 1409 -117 -1464 425 -1071 -779 798 417 575 -166 -1165 265
2391 265 367 1403 1095 -308 -523 -943 -612 613 -452 -570 -209 -663 516 -299 249 1828 700 231
2409 231 546 -1298 53 406 -256 762 -1257 -1622 494 -26 162 1224 529 311 17 843 630 -470
2427 -470 779 126 -1330 -806 -2022 -848 1383 -708 242 1125 -1598 794 1768 219 856 -226 -953
2444 -953 -63 -644 -427 2 146 -292 -464 687 80 241 2418 786 -781 281 -1833 -529 1325
$$ packed form
2321d63j642J739K359j540Q96k08k684K025K25%J46k230K66N77n18J250K37J17
2339E52M54j384O05k01n54K005o62j578k21j098J152J164k32O91j280m69K066
2356A010q07P25J000k204Q81n01j273Q59O78l96K34j114m5k62P62J941j393K62
2374C57L5j836J895M68j359J849j526j347J889j496K92J577l81J58p41r99J430
2391B65J02J036l08j403k15m20L31J225j065j18L61m54J179q15N48J579j128m69
2409B31L15j844J351L53o62J018k019l65K116n20J88J062o95k18k94Q26k13j100
2427d70J249o53j456N24j216J174K231k091R50Q83k723K392R74j549O37j082p27
2444i53Q90n81K17M29J44m38j72J151o07J61K177j632j567J062k114J304J854
$$ plain form
2461 1325 -938 -210 -196 -1915 688 1288 89 1258 606 384 301 -220 -136 202 128 153 -593 -1163 -1552 -246
2481 -246 2023 -351 -253 570 -1248 557 1650 -1020 824 679 -1939 335 -110 -1189 1007 1150 -412
2498 -412 -278 -231 -218 31 1765 232 -670 21 -1389 -246 1991 -938 -732 1011 -1861 -404 1173
2515 1173 -1135 990 1538 -116 633 -350 -277 1170 603 -287 -944 -950 -994 -463 1206 -126 -797 1007 -443
2534 -443 13 1920 -353 693 1258 -1509 -315 -292 -1980 1020 637 -1534 -185 -309 -658 1574 1763
2551 1763 259 150 497 -558 -844 1357 -1046 -1092 924 -1526 -823 1258 -783 1277 2257 -840 487
2568 487 699 -1288 1269 605 -1633 -710 -740 -1197 -82 824 210 -88 1287 -145 -13 1755 -196 229
2586 229 1698 -1988 -1816 818 -1751 316 1647 -1834 -277 699 -488 1164 1029 -53 267 120
$$ packed form
2461A325k263P28J4j719K603O00j199J169o52k22q3n21Q4L38p4K5p46n70l89J306
2481b46K269k374R8Q23j818J805J093k670J844j45k618K274m45j079K196J43j562
2498d12J34M7J3K49J734j533r02O91j410J143K237k929K06J743k872J457J577
2515A173k308K125N48j654P49r83P3J447n67q90o57om4N31J669j332o71J804j450
2534d43M56J907k273J046N65k767J194K3j688L000l83k171J349j24l49K232J89
2551A763j504j09L47j055k86K201k403m6K016k450P03K081k041K060R80l097J327
2568D87K12j987K557o64k238R23l0m57J115R06o14k98J375j432J32J768j951M25
2586B29J469l686J72K634k569K067J331l481J557R76j187J652j35j082L20j47
$$ plain form
2602 120 -636 -772 203 -398 -505 1008 -776 -1380 1231 66 867 1910 -1697 -41 962 -1167 410
2619 410 1185 -1903 -328 189 -882 96 588 421 11 48 -235 -694 766 107 42 1323 -1249 -1512 1521
2638 1521 -704 -432 1558 -1674 -364 853 -1049 832 1109 -735 1197 331 -992 36 471 -225
2654 -225 -263 116 -1006 -1229 1036 306 139 1521 -1103 -644 1372 -710 -67 1159 -1640 -309 234
2671 234 -1584 257 540 -65 1206 232 -1036 244 561 33 404 692 -1370 -1092 756 -935 -1028 1184
2689 1184 -1181 -29 1459 -843 882 1908 -545 769 404 -1680 125 294 -395 -99 -578 -801
2705 -801 -440 155 809 648 1204 -220 -406 843 -735 -394 913 -1231 -611 269 -1656 756 1499 -197
2723 -197 1213 699 -1216 441 1035 -267 530 -121 -933 -957 -129 -624 -241 818 -34 -724 902 -470
$$ packed form
2602A20p56j36R75o01j07J513j784o04K611j165Q01J043l607J656J003k129J577
2619D10P75l088J575N17j071R78M92j67m10L7k83m59J460o59o5J281k572k63L033
2638A521k225K72J990l232J310J217j902J881K77j844J932q66j323J028M35o96
2654b25l8L79j122k23K265p30j67J382k624M59K016k082O43J226k799J331N43
2671B34j818J841K83o05J271r74j268J280L17n28L71K88k062K78J848j691r3K212
2689A184k365J152J488k302J725J026k453J314l65k084J805J69o89K96m79k23
2705h01L61N95O54j61N56j424j86J249j578L41J307k144O20Q80j925K412P43j696
2723a97J410n14j915J657N94j302P97o51q12k4Q28m95L83J059q52o90J626j372
$$ plain form
2741 -470 195 1791 -622 24 -130 -1978 179 573 -898 534 -24 -1055 890 233 232 952 523 -328
2759 -328 -320 143 -614 68 675 -218 -313 520 -1183 410 1937 -475 623 451 -1306 795 248 -748 1056
2778 1056 -262 -741 491 -354 -765 560 444 -86 -224 299 -680 301 1063 -312 -89 623 -1163 312
2796 312 985 -1029 465 -228 -1206 660 -89 -222 1156 173 80 488 -501 -534 327 164 -710 -657 -141 -590
2816 -590 -85 905 -264 346 534 -907 865 565 -861 1026 393 -1696 288 -448 -880 639 237
2833 237 -490 135 -351 -29 292 1036 334 10 42 -989 -413 822 -852 218 468 -964 544 114
2851 114 -196 1072 291 -553 217 -544 -601 231 110 -254 -271 -380 -35 353 988 155 134 448 -358 -301 764
2872 764 -770 228 354 -1598 200 102 -372 1063 45 -75 213 -578 63 580 260 404 -151 -301 -300
$$ packed form
2741d70O65J596k413O46j54j848K157L94j471J432n58j031J945o57jP20m29q51
2759c28QM63p57O82O07q93r5Q33j703J593J527k412J098j72j757K101n47r96J804
2778A056j318m79J232q45m11J325j16n30j38N23r79R81P62j375K23P12j786J475
2796C12O73k014J494o93r78J866p49j33J378r83r3M08r89l3Q61j63q74N3N16m49
2816e90N05R90j169O10J88j441J772l00j426J887o33k089J984p36m32J519m02
2833B37p27O25m86L22L21P44p02l24L2j031N76J235j674J070K50j432J508m30
2851A14l10J268p81q44P70p61n7Q32j21l64j7j09L45L88O35q33k1L14q06N7J065
2872G64j534R98J26j952J798r8m74J435j018j20K88p91O41N17l20J44n55j50J
$$ plain form
2891 -300 -145 667 294 354 489 -792 122 474 -738 388 341 -949 233 -382 -592 1011 -289 79
2909 79 428 -528 -204 300 -54 384 -173 108 -196 -287 648 193 215 467 -783 -218 -29 -889 422 354 -490
2930 -490 376 -578 -589 664 201 429 10 -656 -130 -464 125 625 -713 95 -135 -907 710 114 212 631
2950 631 -240 89 -148 -389 389 190 -408 -170 -678 -12 486 11 607 343 -223 218 31 -6 -46 -452 -31
2971 -31 -787 -897 390 -336 229 1209 -626 346 -52 -628 482 15 196 93 -801 -509 -109 -532 563
2990 563 -206 19 266 -247 310 551 -197 458 -295 -502 448 -456 195 31 -690 -176 -328 -394 318 62
3010 62 238 313 -103 -63 -68 -445 573 -251 -266 65 -724 -243 145 -169 816 -250 -493 271 -236 -120 140
3031 140 -627 50 -234 -153 81 -337 146 268 -473 -97 -416 86 368 -99 445 -92 -855 513 213 -128
$$ packed form
2891c00J55Q12l73O0J35j281R14L52j212J126m7j290J182o15k10J603j300L68
2909G9L49r56L24N04l54M38n57K81l04r1R35m55K2K52j250N65J89q60J311o8q44
2930d90Q66r54j1J253m63K28m19o66N26l34N89N00j338Q08k30p72J617n96R8M19
2950F31q71L29k37k41P78j99n98K38n08O66M98m75N96k64n66M41j87l7m0m06M21
2971c1p56j10J287p26N65R80j835R72l98n76J110m67J81j03q94K92M00m23J095
2990E63p69K25K47n13N57K41p48O55p53k07R50r04O51j64p21N14j52o6P12k56
3010F2J76P5m16M0nl77J018q24j5L31p89M81L88l14R85j066k43P64n07J16K60
3031A40p67O77k84Q1K34m18M83J22p41L76l19N02K82m67N44n37p63J368l00l41
$$ plain form
3051 -128 889 -253 -18 12 -694 -351 242 -321 405 0 -397 172 -64 594 324 7 -26 -751 -252 528
3071 528 -347 657 163 -456 190 -122 154 677 -75 361 387 -877 46 181 -349 258 -272 -401 289 -104
3091 -104 332 167 315 -160 -320 173 22 -601 686 -208 -739 355 -924 -474 840 -244 470 415 -742
3110 -742 -58 522 -170 302 -8 -277 -482 89 379 -157 340 -3 -497 235 293 -209 1124 -245 -662 61
3130 61 -858 -402 588 -35 293 11 -552 262 200 -86 388 -189 -247 -58 149 -402 -575 493 243 -425 648
3151 648 -433 -393 1251 13 -30 982 -906 -359 835 -237 157 373 -730 -306 -44 77 -73 59
3169 59 -111 -708 275 -70 -421 699 362 -801 655 -443 -621 803 -118 -92 180 -832 18 355 -342
3188 -342 253 -144 190 189 -23 -130 -225 430 -99 -797 -156 -729 -170 851 154 -422 619 -303 33 741
$$ packed form
3051a28J017j142K35L0p06L43N93n63P26m05l97N69k36O58k70l17l3p25M99P80
3071E28q75J004m94o19O46l12K76N23p52M36K6j264R23J35n30O07n30j29O90l93
3091a04M36j65J48m75j60M93j51o23J287q94n31J094j279M50J314j084P14n5j157
3110g42O84N80o92M72l10k69k05N71K90n36M97l43m94P32N8n02J333j369m17P23
3130F1r19M56R90o23L28k82n63Q14o2k86M74n77n8J89K07n51j73J068k50o68J073
3151F48j081M0J644j238m3J012j888N47J194j072L94K16j103M24K62J21j50J32
3169E9j70n97R83l45l51J120l37j163J456j098j78J424r21K6K72j012Q50L37o97
3188c42N95l97L34jk12j07r5O55n29o98O41n73N59J021o97n76J041r22L36P08
$$ plain form
3208 741 -397 -268 567 -584 -322 -82 -603 3 483 -181 -10 79 500 -171 432 307 -1012 79 222
3227 222 -777 517 -37 -594 691 -567 -441 796 159 -219 438 -322 -206 -265 -267 123 171 -18 -433 25
3247 25 285 -214 568 -13 -401 419 107 -617 267 -143 -285 866 -543 -552 703 -537 152 736 8 -410
3267 -410 -134 -195 249 315 94 -551 78 7 -509 640 60 121 540 100 -446 707 -64 -103 844 -334 -772
3288 -772 98 -363 -36 557 49 31 -154 4 102 19 312 -421 66 300 -686 163 295 -270 825 -67 -523
3309 -523 542 -152 -75 785 -408 -341 -266 -155 -203 200 -200 -91 -280 211 -361 28 103 -467 320 61 -732
3330 -732 686 303 -138 886 -280 -372 348 -270 -60 539 119 28 225 -325 179 2 490 113 -116 493
3350 493 -289 -114 521 -446 -97 83 -809 315 189 -367 531 -387 -4 403 9 246 392 14 223 -114
$$ packed form
3208G41j138J29Q35j151K62K40n21O06M80o64J71Q9M21o71O03j25j319J091J43
3227B22r99J294n54n57J285j258J26J237o37l78O57p60J16n9kL90M8j89m15M58
3247B5K60m99P82n81l88Q20l12p24Q84m10j42J151j409rJ255j240O89N84p28m18
3267d10K76o1M44O6k21o45O29p1n16J149n80O1M19m40n46J153p71l9R47j178m38
3288g72Q70m61L27N93n08j8j85J58R8q3K93p33M87K34r86Q49J32n65J095q92m56
3309e23J065o94P7Q60j193O7P5J11m8M03m00J09j89M91n72L89P5n70P87k59p93
3330g32J418l83m41J024j166r2P20o18K10N99m20r1J97n50N04j77M88l77k29O09
3350D93p82J75O35r67L49J80q92J124j26n56Q98r18L83M07l94K37J46l78K09l37
$$ plain form
3370 -114 -373 -394 -24 504 453 156 271 -231 26 264 -158 256 73 -527 124 62 -316 620 -52 -136 279
3391 279 -160 124 114 217 83 -31 -55 -110 -151 43 -197 14 -23 -193 117 239 -12 206 -20 -491 30 -389
3413 -389 -384 212 -222 42 268 -152 143 266 356 447 -99 -326 -330 -308 118 219 -207 90 -291 -306 -56 -149 348
3436 348 -205 -35 -29 -215 -302 430 -269 121 76 -266 445 -203 132 417 -303 -36 -41 68 139 -397 32 3 -259
3459 -259 -301 56 -131 222 27 95 -41 -602 210 67 -25 227 -289 -69 40 -430 -27 195 -199 330 -245
3480 -245 -4 535 141 -23 -8 -410 48 -207 132 334 283 -217 -81 -509 137 124 -197 258 18 -11 -85 -465
3502 -465 317 71 -69 569 -68 19 -6 -104 161 207 -242 29 -417 44 -18 230 261 175 -44 219 65 -192
3524 -192 118 -22 -32 -246 -234 103 242 -238 125 -279 -12 183 -282 231 85 65 238 -190 -77 605 -327
$$ packed form
3370a14k59k1L70N28n1k97J15n02K57K38m22M14j83o00O51o2l78R36o72q4M15
3391B79m39K84j0J03j34j14k4n5m1J94k40K11l7j70L10J22k51K18k26m71N21m19
3413c89NN96m34K64K26m20K95J23R0R1n46k27mK2M26J01m26K97l81j5K50r3M97
3436C48n53J70Oj86q7P32o99L90m5l42P11o48L35K85p20K67nJ09P1n36M29k9k62
3459b59m2L57j87L53j95O8j36n61Q12j43r2K52n16K20J09m70M03K22l94N29n75
3480b45K41N39l94j64J5m02M58k55L39K02n1n00J36m28O46j3l21M55k40k9p4l80
3502d65P82k46j40O38o37Q7k5r8K65M6m49K71m46M61o2K48L1q6k19K63j54k57
3524a92L10j40j0k14J2L37J39m80L63m04K67J95m65N13j46k0J73m28J13O82r32
$$ plain form
3545 -327 145 234 -160 114 -48 -4 344 25 55 -37 -64 169 255 -181 381 -645 -151 115 -296 424 384 21
3567 21 194 -294 -157 -133 267 692 -203 -39 -180 204 -131 84 185 -219 259 70 254 36 -352 94 -260
3588 -260 321 5 -123 151 189 -213 192 -239 -281 -3 -173 -25 90 -243 -54 -102 -23 296 -28 103 -53
3609 -53 -383 -24 -406 -174 237 -323 197 -26 225 288 70 -11 265 -243 94 -228 -36 33 -19 -64 66 -381
3631 -381 -24 142 -329 424 -41 330 230 -455 320 130 -25 230 -222 -254 128 -145 216 253 -34 -149 -399
3652 -399 -222 -147 138 -368 177 -233 142 -107 179 278 19 -273 170 -365 179 -106 7 307 6 -371 233
3673 233 -306 168 416 -61 -6 -77 -101 119 -154 277 195 -167 180 -366 0 426 -130 283 -35 -181 62
3694 62 98 7 397 58 -212 27 -201 -103 146 -173 -81 236 -28 289 0 95 -145 -123 78 -424 218 261 -341
$$ packed form
3545c27M72Q9l94K74j62M4L48l19L0r2k7K33Q6m36N62j026M94K66m11P20m0l63
3567B1J73m88J37K4M00M25q95J64j41L84l35K15J01m04M78j89J84k18l88M46l54
3588b60N81l16j28K74L8m02M05m31m2K78j70J48J15l33J89m8P9L19l24J31j56
3609e3l30L59l82K32M11n60N20k23K51O3k18q1K76n08L37l22J92O9n2m5J30m47
3631c81L57J66m71P53m65L71j00o85P75j90j55K55m52l2L82k73L61L7k87j15k50
3652c99J77P5K85n06N45m10L75k49K86R9k59k92M43n35N44k85J13L00l01l77O04
3673B33n39M74K48m77N5p1k4K20k73M31q2l62L47n46L66M26n56M13l18j46K43
3694F2L6r1L90l39k70K39k28R8K49l19R2L17k64L17k89R5k40K2K01n02O42M3o02
$$ plain form
3717 -341 253 -82 -571 173 17 -493 249 -231 71 -82 -151 29 152 -38 -44 183 -301 3 61 -33 -123 89
3739 89 -74 -143 -228 100 -151 248 -94 -169 109 181 -67 395 -122 -44 139 -344 -198 40 -158 209 137 15
3761 15 22 240 252 95 335 -107 -442 -54 138 -124 110 -15 -556 67 -281 -197 328 287 259 -28 -530 -127
3783 -127 31 11 -118 -63 -6 -313 -174 49 -139 7 157 -293 -17 -348 -321 259 -82 -235 109 -252 -95
3804 -95 241 -4 135 297 -157 91 -97 185 14 -177 -28 -172 72 -118 -373 153 205 -161 396 148 -429
3825 -429 118 -53 -376 270 -369 -470 98 62 207 80 196 -27 -110 64 -315 188 -94 -358 118 227 -349
3846 -349 -140 318 -497 378 -107 -417 116 302 33 306 -112 -73 -65 85 -152 440 0 17 -143 341 -212
3867 -212 33 259 -222 -58 316 43 146 395 -54 173 215 -339 168 -89 -368 281 -259 -207 -27 238 -306
$$ packed form
3717c41N94l35m89P44j56n10P42m80L02j53o9J80J23j90oK27m84L04N8r4r0K12
3739H9j63o9q5L28k51L99l42p5K78P2k48M62n17P8J83m83J46K38j98L67p2j22
3761A5PK18J2j57K40m42l35L88J92k62K34j25n41O23l48Q4N25m1k8k87n02M03
3783a27J58k0j29N5N7l07J39K23j88J46J50m50K76l31K7N80l41j53L44l61J57
3804i5L36k45J39J62m54K48j88K82j71j91J49j44K44j90k55N26N2l66N57k48n77
3825d29N47j71l23O46o39j01N68l6J45j27J16k23q3J74l79N03k82k64M76J09n76
3846c49K09M58q15Q75m85l10N33J86k69K73m18L9QJ50k37N92m40J7j60M84n53
3867b12K45K26m81J64L74k73J03K49m49K27M2n54N07k57k79O49n40N2J80K65n44
$$ plain form
3888 -306 159 385 58 237 467 -244 -61 113 -423 60 130 -465 38 230 -58 407 -189 -374 194 476
3908 476 -8 267 -34 -471 -450 206 342 243 235 -45 1 -211 112 8 291 -175 -16 -1 -151 32 -30 78
3930 78 310 -5 -80 159 255 34 178 30 -453 -319 -45 -145 -300 45 -337 -175 249 -259 -33 -325 27
3951 27 30 156 -147 -64 -57 97 477 204 -374 -566 -251 -1 -41 -13 86 -66 49 18 -257 138 -235 -97 28
3974 28 -97 -116 -20 -145 240 69 -53 -46 72 159 224 -69 10 -319 -339 317 205 333 246 12 -95 -135 -430 -33
3998 -33 -70 -172 60 -436 36 -109 202 130 -184 43 -72 -287 60 64 89 11 -355 206 396 -239 516 -195
4020 -195 -33 288 -314 -127 107 139 87 120 58 -48 -72 -92 112 -75 -146 53 353 183 192 -202 48 -102 -82
4043 -82 -83 -266 -5 102 61 284 207 142 174 65 157 69 -310 170 222 -345 59 -12 300 60 -40 313 18 -159
$$ packed form
3888c06M65K26l27J79K30p11J83J74n36M83P0n95N03J92k88M65n96j85N68K82
3908D76m84K75l01m37K1O56J36r9qk80M6k12L23j04K83m66J59J5j50J83o2J08
3930G8K32l15p5K39R6k21J44j48m83J34K74j00j55L45l82J62M24n08K26k92L52
3951B7LJ26l03Q3PJ54L80k73n78j92L15K50m0K8R9j52J15l1k75L95l73J38J25
3974B8j25j9R6j25L85j71j22PJ18Q7O5k93P9l29k0O56j12J28q7k34j07m0k95L97
3998c3l7j02K32m96M72j45L11p2l14K27j15k15L47MK5p8l66N61J90o35P55p11
4020a95J62L21o02J87K34L2n2L3o2j06k4k0K04j87p1J99L00j70Rl94K50j50K0
4043h2jj83K61J07m1K23p7o5L2j09R2q8l79M80N2n67M04p1L12k40j00L53k95j77
$$ plain form
4067 -159 38 -33 -500 -241 -200 141 80 -270 197 211 31 -166 261 -125 -103 97 -1 -61 134 -95 -206 -205 90
4090 90 -279 -19 120 -36 89 -226 -229 173 -251 51 -282 -274 69 349 -231 49 -89 8 249 -556 -67 -360
4112 -360 -127 90 291 300 363 125 134 -48 -165 298 -298 36 298 -183 -14 24 -37 -127 -189 -145 71 -454 86
4135 86 -143 -41 205 -236 249 -78 -77 136 -148 -169 -342 73 -91 148 -8 -89 254 -143 136 191 -130 42
4157 42 -300 -14 49 -218 401 -11 47 72 79 0 -27 -303 -181 32 -199 24 99 127 102 -103 71 222 134 -46
4181 -46 -228 -53 261 124 -213 -146 -196 127 -40 69 74 -164 102 24 -462 191 68 -25 44 -141 -80 -119 -151 270
4205 270 68 -186 -211 111 -39 104 49 235 70 -91 -28 -339 23 89 -343 124 151 -106 100 -227 -104 256
4227 256 163 -159 168 106 239 225 -174 75 -193 47 -40 122 -35 106 67 -19 135 63 167 77 -22 -336 261
$$ packed form
4067a59J97p1m67K59M1L41o1l50M67J4j80j97M27l86K2K00r8o0J95k29j11JK95
4090I0l69K60J39j56J25l15lM02m24L02l33QL43K80n80K80j38R7K41q05M89k93
4112c60K33K17K01RO3k38Rj82j17M63n96L34K62m81J69L8o1r0o2M4K16n25N40
4135H6k29J02K46m41M85l27JK13k84k1j73M15j64K39j56q1L43l97K79N5l21J72
4157D2l42K86O3k67O19m12N8K5Pp9k7k76J22K13k31K23P5K8k5k05J74J51q8j80
4181d6j82J75L14j37l37O7n0L23j67J09Nk38K66p8m86O53j23r3O9j85O1l9l2M21
4205B70k02k54k5L22j50J43n5J86j65j61O3l11L62O6m32M67K7k57K06l27J23L60
4227B56r3l22L27o2J33j4l99K49k68K40q7J62j57J41l9q6J54p2J04r0r9l14N97
$$ plain form
4250 261 81 38 -133 42 -226 -151 0 -203 405 -190 109 203 -389 33 69 -17 -147 -212 -34 195 80 127
4272 127 34 -5 -25 -46 -297 -83 -169 375 122 -423 176 -56 51 -165 147 -31 13 14 -126 -216 -31 314 262
4295 262 -215 -280 -327 -94 -194 55 209 -212 -191 246 -187 85 -85 48 -24 -221 -109 -12 166 151 19 -121
4317 -121 241 4 -194 15 140 279 36 -27 -355 -91 280 42 -96 -143 127 102 251 -7 -124 8 160
4338 160 -64 -4 -273 26 249 -7 284 196 -88 425 -67 -87 225 -201 185 -150 83 59 -242 57 -220
4359 -220 -80 -46 -141 -96 93 -131 157 257 -99 285 194 -77 75 -52 421 206 -344 3 3 -607 -90 96
4381 96 -81 -97 211 -31 -334 16 234 1 136 228 106 62 -216 -195 183 22 44 -76 79 -68 189 -18
4403 -18 281 -238 -121 154 -17 49 11 111 -69 -28 -157 219 -83 238 384 -223 45 175 -156 43 86 -15
$$ packed form
4250B61j80m3j71J75k68P5J51k03O08n95K99R4n92M22L6q6j30o5J78K29j15M7
4272A27r3l9k0k1k51K14q6N44k53n45N99k32J07k16L12j78M4Jj40r0J85L45n2
4295B62m77o5m7K33j00K49J54m21K1M37m33K72j70J33p2j97J12R7J78j5j32j40
4317a21L62k37j98K09J25J39k43o3l28K64L71k38j38m7K70k5J49k58j17J32J52
4338A60k24O0k69K99K23k56K91q8k84N13m92k0L12m26L86l35K33k4l01K99k77
4359b20J40L4r5M5J89k24K88J00l56L84r1k71J52j27M73k15n50L47%o10N17J86
4381I6j77j6L08k42l03L50K18k33J35R2j22m4k78K1L78j61K2j20J55j47K57k07
4403a8K99n19J17K75j71O6l8J00j80M1j29L76l02L21J46o07K68J30l31J99M3j01
$$ plain form
4425 -15 117 -275 25 -292 84 219 241 240 137 -273 35 144 -45 137 -285 -112 24 -81 44 364 267 383
4447 383 163 -129 91 -283 37 189 259 469 -113 27 145 -33 121 10 -125 107 193 -304 49 217 339
4468 339 209 -107 213 23 -331 204 76 -16 -48 -42 305 -15 178 278 -137 281 183 -391 95 -25 -114 95
4490 95 -110 -88 452 -97 39 228 -45 39 -175 82 80 110 119 -81 -190 45 129 168 -4 95 67 102 -217 121
4514 121 92 -135 -8 -100 -102 213 77 270 -41 -256 21 -168 -91 -267 -50 143 -151 -360 -25 -155 181 357
4536 357 -58 432 126 -146 241 -82 -26 46 -165 176 132 -43 -91 -35 -429 -35 -86 173 63 -267 390 -154
4558 -154 78 -23 -141 60 203 -335 306 28 -332 22 64 -376 269 91 -36 404 -145 124 193 124 162
4579 162 -200 -195 -122 -193 250 -24 -38 -46 -133 78 31 80 192 184 83 11 -69 -124 147 -111 -51 -74 105 -152 -126 198
$$ packed form
4425a5J32l92L00l17L76J35K2jj03m10L08J09j89J82m22J73J36j05J25L20r7J16
4447C83k20k92K20l74L20J52P0K10n82J40J18j78J54j11j35K32Q6m97L53J68J22
4468C39j30l16L20j90l54N35j28r2l2OL47l20J93J00m15M18r8n74M86j20q9K09
4490I5k05K2N40n49J36J89k73Q4k14K57kL0Rk00j09K35Q4L9j72R9k8L5l19L38
4514A21k9k27J27r2kL15j36J93l11k15K77j89P7j76K17J93k94k09L35j30L36J76
4536C57m15M90l06k72L87l23N6P2k11L41m4j75m8N6l94L94n1K59j10l30O57n44
4558a54K32j01j18K01J43n38O41k78l60L54M2m40O45j78j27M40n49K69O9o9L8
4579A62l62NP3p1M43k74j4qq7K11m7M9J12qj01p2q0n5K71k58O0k3J79k57K6L24
$$ plain form
4605 198 84 -175 80 -12 -146 203 -141 -131 138 -177 185 47 -279 -62 30 -109 61 -155 -121 21 91 -136
4627 -136 -92 -220 -121 357 0 516 -77 -75 -106 35 112 -177 32 177 -252 53 482 17 -10 17 -32 147 125
4650 125 -124 148 -133 208 -442 310 132 -359 106 158 -110 277 40 -180 69 221 -135 -94 -351 222 85
4671 85 189 207 130 38 299 250 -109 -81 339 -245 146 72 -82 121 83 -138 -97 119 -194 119 326 -294 -292 336
4695 336 -343 65 178 -8 151 58 -29 -221 -186 169 90 209 186 -334 73 -126 -198 -12 -338 -630 171 -91
4717 -91 -68 138 -70 267 -112 -340 83 132 -156 326 -281 25 -46 -140 283 -152 312 121 -669 158 37 -299
4739 -299 216 -226 -429 53 -465 85 89 -179 -16 148 -123 11 -88 19 -1 61 214 -110 -215 346 -94 -121
4761 -121 138 -359 244 177 168 250 -322 -154 150 -392 -320 73 -57 36 -88 -364 -161 -183 -7 -47 174 -3 -196
$$ packed form
4605A98j14k59K55r2j34L49l44J0K69l15L62j38l26K17R2j39J70k16L4J42P0k27
4627a36M4j28R9M78l57N16n93Kl1J41P7k89K09J45m29L05M29m65k7K7m9J79k2
4650A25k49K72k81L41o50P52j78m91M65N2k68L87k37k20K49J52l56M1k57N73j37
4671H5J04J8p7r2K61m9l59K8M20n84L91p4j54K03l8k21M1K16l13L13K07o20KO28
4695C36o79M08J13j86J59r3q7j92L5L55p9J19k3n20M07j99p2J86l26k92Q01k62
4717i1K3K06k08L37l79k28M23M9k88M82o07L06p1r4M23m35M64j91p90Q27j21l36
4739b99N15m42k03M82n18N50Mk68J63J64k71J34r9J07k0O2J53l24j05N61m40k7
4761a21K59m97O03o7rQ2n72J68L04n42P2L93j30R3j24k76K03k2J76m0K21j77j93
$$ plain form
4784 -196 -66 34 98 66 262 -363 144 -247 56 53 176 82 444 -72 -163 173 -72 216 205 51 256 -133
4806 -133 -82 80 -308 -61 -407 114 -91 -94 210 -103 -235 53 -139 94 284 122 71 123 64 128 -57 -25 -89
4829 -89 76 256 5 -438 -71 58 -86 28 -91 -404 -371 -171 402 30 -290 341 -278 59 430 -46 13
4850 13 63 -274 -110 22 3 -93 -144 48 274 -175 183 -82 14 377 -156 -233 -182 -245 -175 56 -307 313 10
4873 10 -223 71 -63 -9 -10 -65 400 294 -44 288 -216 120 -121 -219 191 -370 179 234 207 68 247 -159 135
4896 135 125 73 126 -251 89 -185 -382 -175 51 -43 91 -353 -29 128 -116 85 -80 -60 11 146 -70 14
4918 14 -159 10 -175 206 92 -209 -29 238 32 410 53 126 43 16 46 -78 -285 261 -13 -162 176 56
4940 56 -299 27 6 91 -191 196 226 -52 -356 213 -295 -107 70 -239 430 -445 -42 64 14 114 307 -5
$$ packed form
4784a96J30J00O4l2J96o25N07l91L03lJ23r4L62n16r1L36k45K88j1j54K05l89
4806a33N1J62l88K47l46N21k05lL04l13j32K88j92K33J90j62n1N2n9O4j85L2o4
4829h9J65J80k51m43L67J29j44J14j19l13L3K00N73l72l20O31o19L37L71m76N9
4850A3N0l37J64J32j9r6n1J92K26m49L58k65R6L63n33p7N1o3P0K31l63O20l03
4873A0k33K94j34N4jn5M65j06l38L32n04L36k41r8M10n61N49N5k7j39J79m06K94
4896A35j0n2N3l77L40k74j97K07K26r4J34m44L24J57k44K01j65K0P1J35k16Q4
4918A4j73J69j85L81j14l01J80K67k06L78l57P3q3k7L0j24k07N46k74j49L38j20
4940E6l55L26k1Q5k82L87L0k78l04N69n08J88J77l09O69q75M03J06n0J00J93l12
$$ plain form
4962 -5 174 1 212 -62 -378 -251 -546 -46 146 132 294 57 -101 247 -79 -371 74 -40 -659 230 -247
4983 -247 50 -82 -331 186 131 -414 160 135 245 306 5 130 25 -214 -39 27 -257 252 91 65 114 228
5005 228 242 -160 333 144 -184 119 356 -206 104 121 20 292 -33 -15 370 125 149 4 -148 177 -266
5026 -266 13 -34 180 394 -31 -74 138 -70 163 -76 78 175 84 29 266 -190 2 103 -304 -48 291 -60
5048 -60 138 -30 108 -171 -388 -134 302 -406 160 87 39 179 -301 -45 206 3 225 -170 -331 282 -105
5069 -105 -131 -50 -170 -97 97 -169 351 -2 -89 -175 136 12 33 -125 -161 -16 106 271 -206 114 106 -97 -201
$$ packed form
4962eJ79j73K11k74l16J27k95N00J92j4J62k37j58L48l26k92M45j14o19Q89m77
4983b47K97j32k49N17n5n45N74k5J10O1l01J25j05k39J75O6k84N09j61k6M9J14
5005B28J4m02M93j89l28L03K37n62L10J7j01K72l25J8L85k45K4j45j52L25m43
5026b66K79m7K14K14m25m3K12k08K33k39J54R7r1n5K37m56J92J01m07K56L39l51
5048f0J98j68J38k79k17K54M36p08N66p3m8J40m80K56K51k03K22l95j61O13l87
5069a05k6Q1j20P3J94k66N20l53q7q6L11j24K1j58l6J45J22J65m77L20qk03j04
$$ [...]
8191A57
##END NTUPLES=NMR FID
##END=
