##TITLE=1H_88-2021
 CDCl3, 8 sc, 
 1.9.2021
##JCAMPDX= 6.0         $$ Bruker NMR JCAMP-DX V2.0
##DATA TYPE= NMR FID
##DATA CLASS= NTUPLES
##ORIGIN= UXNMR, Bruker Analytische Messtechnik GmbH
##OWNER= root
$$ XWIN-NMR		Version 3.5
$$ Wed Sep  1 11:30:44 2021 Russian Standard Time (UT+4h)  she@DPX200
##.OBSERVE FREQUENCY= 200.1312
##.OBSERVE NUCLEUS= ^1H
##.DELAY= (6, 6)
##.ACQUISITION MODE= SIMULTANEOUS
##.ACQUISITION SCHEME= undefined
##.AVERAGES= 8
##.DIGITISER RES= 18
##SPECTROMETER/DATA SYSTEM= spect
##.PULSE SEQUENCE= zg30
##.SOLVENT NAME= CD2Cl2
##.SHIFT REFERENCE= (INTERNAL, CD2Cl2, 0, 15.7039)
##AUDIT TRAIL= $$ (NUMBER, WHEN, WHO, WHERE, WHAT)
$$ ##TITLE= Audit trail, XWIN-NMR		Version 3.5
$$ ##JCAMPDX= 5.01
$$ ##ORIGIN= Bruker BioSpin GmbH
$$ ##OWNER= she
$$ F:/spectra/data/she/nmr/H-F/1/audita.txt
$$ ##AUDIT TRAIL=  $$ (NUMBER, WHEN, WHO, WHERE, WHAT)
(   1,<2021-09-01 11:29:05.82 +0400>,<she>,<DPX200>,
      <created by zg, POWCHK disabled, PULCHK disabled
       configuration hash MD5:
       00 E9 B6 7A A2 85 ED C7 34 08 36 98 17 FE 4E 26
       data hash MD5: 16K
       A3 44 B2 ED B5 6E 03 7F 0D CE 46 30 39 B3 EF 41>)
$$ ##END=
$$ 
$$ hash MD5
$$ B8 11 82 31 2D A4 73 50 DF FD 7B 05 20 53 D2 65
##$RELAX= 
##$RELAX= 
##$RELAX= 
##$RELAX= 
##$RELAX= 
##$RELAX= 
$$ Bruker specific parameters
$$ --------------------------
##$DU= <F:/spectra>
##$EXPNO= 1
##$NAME= <H-F>
##$PROCNO= 1
##$TYPE= <nmr>
##$USER= <she>
##$AMP= (0..31)
100 100 100 100 100 100 100 100 100 100 100 100 100 100 100 100 100 100 
100 100 100 100 100 100 100 100 100 100 100 100 100 100 
##$AQSEQ= 0
##$AQ_mod= 1
##$AUNM= <au_zg>
##$AUTOPOS= <>
##$BF1= 200.13
##$BF2= 200.13
##$BF3= 200.13
##$BF4= 200.13
##$BF5= 200.13
##$BF6= 200.13
##$BF7= 200.13
##$BF8= 200.13
##$BYTORDA= 1
##$CFDGTYP= 0
##$CFRGTYP= 5
##$CHEMSTR= <none>
##$CNST= (0..31)
1 1 145 1 1 1 1 1 1 1 1 1 1 1 1 1 1 1 1 1 1 1 1 1 1 1 1 1 1 1 1 1 
##$CPDPRG= <>
##$CPDPRG1= <>
##$CPDPRG2= <>
##$CPDPRG3= <>
##$CPDPRG4= <mlev>
##$CPDPRG5= <mlev>
##$CPDPRG6= <mlev>
##$CPDPRG7= <mlev>
##$CPDPRG8= <mlev>
##$CPDPRGB= <>
##$CPDPRGT= <>
##$D= (0..31)
0 1.2 0 0 0 0 0 0 0 0.06 0 0.03 0 0 0 0 0.0002 0 0 0 0 0 0 0 0 0 0 0 0 
0 0 0 
##$DATE= 1630481345
##$DBL= (0..7)
120 120 120 120 120 120 120 120 
##$DBP= (0..7)
150 150 150 150 150 150 150 150 
##$DBP07= 0
##$DBPNAM0= <>
##$DBPNAM1= <>
##$DBPNAM2= <>
##$DBPNAM3= <>
##$DBPNAM4= <>
##$DBPNAM5= <>
##$DBPNAM6= <>
##$DBPNAM7= <>
##$DBPOAL= (0..7)
0.5 0.5 0.5 0.5 0.5 0.5 0.5 0.5 
##$DBPOFFS= (0..7)
0 0 0 0 0 0 0 0 
##$DE= 6
##$DECBNUC= <off>
##$DECIM= 32
##$DECNUC= <off>
##$DECSTAT= 4
##$DIGMOD= 1
##$DIGTYP= 9
##$DL= (0..7)
0 120 120 120 120 120 120 120 
##$DP= (0..7)
150 150 150 150 150 150 150 150 
##$DP07= 0
##$DPNAME0= <>
##$DPNAME1= <>
##$DPNAME2= <>
##$DPNAME3= <>
##$DPNAME4= <>
##$DPNAME5= <>
##$DPNAME6= <>
##$DPNAME7= <>
##$DPOAL= (0..7)
0.5 0.5 0.5 0.5 0.5 0.5 0.5 0.5 
##$DPOFFS= (0..7)
0 0 0 0 0 0 0 0 
##$DQDMODE= 0
##$DR= 18
##$DS= 0
##$DSLIST= <SSSSSSSSSSSSSSS>
$$ [...]
##$SUBNAM2= <"">
##$SUBNAM3= <"">
##$SUBNAM4= <"">
##$SUBNAM5= <"">
##$SUBNAM6= <"">
##$SUBNAM7= <"">
##$SUBNAM8= <"">
##$SUBNAM9= <"">
##$SW= 20.0189188712717
##$SWIBOX= (0..15)
0 0 2 0 0 0 0 0 0 0 0 0 0 0 0 0 
##$SW_h= 4006.41025641026
##$TD= 16384
##$TD0= 1
##$TE= 0
##$TE2= 300
##$TE3= 300
##$TEG= 300
##$TL= (0..7)
0 120 120 120 120 120 120 120 
##$TP= (0..7)
150 150 150 150 150 150 150 150 
##$TP07= 0
##$TPNAME0= <>
##$TPNAME1= <>
##$TPNAME2= <>
##$TPNAME3= <>
##$TPNAME4= <>
##$TPNAME5= <>
##$TPNAME6= <>
##$TPNAME7= <>
##$TPOAL= (0..7)
0.5 0.5 0.5 0.5 0.5 0.5 0.5 0.5 
##$TPOFFS= (0..7)
0 0 0 0 0 0 0 0 
##$TUNHIN= 0
##$TUNHOUT= 0
##$TUNXOUT= 0
##$USERA1= <user>
##$USERA2= <user>
##$USERA3= <user>
##$USERA4= <user>
##$USERA5= <user>
##$V9= 5
##$VALIST= <valist>
##$VCLIST= <CCCCCCCCCCCCCCC>
##$VD= 0
##$VDLIST= <DDDDDDDDDDDDDDD>
##$VPLIST= <PPPPPPPPPPPPPPP>
##$VTLIST= <TTTTTTTTTTTTTTT>
##$WBST= 1024
##$WBSW= 4
##$XGAIN= (0..3)
0 0 0 0 
##$XL= 0
##$YL= 0
##$YMAX_a= 283131
##$YMIN_a= -322590
##$ZGOPTNS= <>
##$ZL1= 120
##$ZL2= 120
##$ZL3= 120
##$ZL4= 120
##$ABSF1= 10
##$ABSF2= 0
##$ABSG= 5
##$ABSL= 3
##$ALPHA= 0
##$AQORDER= 0
##$ASSFAC= 0
##$ASSFACI= 0
##$ASSFACX= 0
##$ASSWID= 0
##$AUNMP= <proc_1d>
##$AZFE= 0.1
##$AZFW= 0.1
##$BCFW= 1
##$BC_mod= 2
##$BYTORDP= 1
##$COROFFS= 0
##$CY= 11.3945322036743
##$DATMOD= 1
##$DC= 2
##$DFILT= <>
##$DTYPP= 0
##$F1P= 2.36226072786647
##$F2P= -0.459571619588291
##$FCOR= 0.5
##$FTSIZE= 0
##$FT_mod= 4
##$GAMMA= 1
##$GB= 0.15
##$INTBC= 1
##$INTSCL= 1
##$ISEN= 128
##$LB= 0.24
##$LEV0= 0
##$LPBIN= 0
##$MAXI= 10000
##$MC2= 0
##$MEAN= 0
##$ME_mod= 0
##$MI= 1.114404
##$NCOEF= 0
##$NC_proc= 0
##$NLEV= 6
##$NOISF1= 3.799351
##$NOISF2= 2.8
##$NSP= 1
##$NTH_PI= 0
##$NZP= 0
##$OFFSET= 15.70392
##$PC= 1
##$PHC0= -13359.02
##$PHC1= 11.80097
##$PH_mod= 1
##$PKNL= yes
##$PPARMOD= 0
##$PSCAL= 0
##$PSIGN= 0
##$REVERSE= no
##$SF= 200.130013532006
##$SI= 16384
##$SIGF1= 3
##$SIGF2= 2
##$SINO= 400
##$SIOLD= 16384
##$SREGLST= <1H.CDCl3>
##$SSB= 0
##$STSI= 0
##$STSR= 0
##$SW_p= 3612.71676300578
##$SYMM= 0
##$S_DEV= 0
##$TDeff= 0
##$TDoff= 0
##$TI= <>
##$TILT= no
##$TM1= 0
##$TM2= 0
##$TOPLEV= 0
##$USERP1= <user>
##$USERP2= <user>
##$USERP3= <user>
##$USERP4= <user>
##$USERP5= <user>
##$WDW= 1
##$XDIM= 8192
##$YMAX_p= 0
##$YMIN_p= 0
$$ End of Bruker specific parameters
$$ ---------------------------------
##NTUPLES= NMR FID
##VAR_NAME=  TIME,          FID/REAL,        FID/IMAG
##SYMBOL=    X,             R,               I
##VAR_TYPE=  INDEPENDENT,   DEPENDENT,       DEPENDENT
##VAR_FORM=  AFFN,          ASDF,            ASDF
##VAR_DIM=   8192,          8192,            8192
##UNITS=     SECONDS,       ARBITRARY UNITS, ARBITRARY UNITS
##FACTOR=    0.0002496,     1,               1
##FIRST=     0,             0,               0
##LAST=      2.0444736,     0,               0
##MIN=       0,             -322590,         0
##MAX=       2.0444736,     283131,          0
$$ Real data points
##PAGE= N=1
##DATA TABLE= (X++(R..R)), XYDATA
0 0 0 0 0 0 0 0 0 0 0 8 -8 8 -8 16 -16 24 -24 32 -40 48 -56 69 -81 96 -113 131 -153 177 -207 237 -271 308
32 308 -352 399 -451 508 -572 642 -717 801 -892 991 -1102 1221 -1349 1492 -1646 1816 -2000
49 -2000 2204 -2428 2674 -2945 3249 -3588 3968 -4399 4891 -5460 6126 -6918 7879 -9072
63 -9072 10600 -12635 15499 -19845 27305 -43650 156966 -172853 -105592 283131 -180329 25146
75 25146 151506 -214444 -110348 120356 -98684 -31978 40670 -191703 -56302 162440 -59262
86 -59262 -65685 -7901 3294 73373 -4300 41243 22963 -110662 111456 104832 -73596 5456
98 5456 -9404 7712 95258 -15285 -57576 30154 15550 -5961 66045 -24319 -75931 40869
110 40869 -2260 26558 -5782 -153175 71195 45037 -148425 75730 -10471 -144027 95964
121 95964 31263 -78904 46265 -2821 -31167 109321 18226 -79929 89466 32838 -49528
132 -49528 77239 -16439 -25573 25916 -49100 64871 -22302 -110256 99894 -15415 -90169
143 -90169 89911 -23179 -67507 87489 -11502 -65460 97537 -19475 -96026 125212 -20709
154 -20709 -120627 112557 -23899 -94596 66927 -20376 -32623 20956 -13789 6690 11443 15634
166 15634 7220 9495 32129 585 12563 34108 3093 -24675 14014 41229 -52979 -12294
178 -12294 35534 -67406 9871 15202 -63218 26572 -23695 -29953 56196 -36961 -24606 41938
190 41938 -13227 -879 29263 -18349 -8045 44513 -22281 -3839 57077 -63259 6452 79111
202 79111 -69134 11400 44903 -53751 35101 19758 -36570 19206 2984 -16608 11951 6137
214 6137 -34250 -4074 18476 -29989 1593 -6789 -24886 25096 -21854 246 23537 -37051
226 -37051 24710 20049 -18693 23682 -3738 2549 20245 -2623 2135 417 6553 -5410 1783
239 1783 9052 -22117 7999 1945 -8681 13212 -22238 10662 8732 -24292 24863 -12936 -15315
252 -15315 22189 -20605 964 4664 -18732 3014 1368 -3307 -10189 8056 2238 -13296 25218
265 25218 -7031 -4459 28537 -15313 17318 15419 -16629 24393 -1341 -2945 11672 -11496 3308
278 3308 -6163 -4173 -3777 -14064 1928 -17561 -2179 -906 -21698 11440 -10956 -5567 15715
291 15715 -14617 13493 6494 -2816 21124 -3217 11689 9530 -538 16178 -5532 7681 2884
304 2884 -8074 10212 -13843 -1089 -2146 -17887 5400 -16775 -7498 320 -19024 7747 -8822
317 -8822 -4599 10456 -9646 13487 2555 2012 16807 -3692 16324 5367 940 16638 -7761
330 -7761 9901 1817 -9062 9598 -14689 -902 -3371 -16610 4741 -16682 -4048 -898 -16121
343 -16121 7965 -10004 -1478 8003 -9624 13741 -411 3830 15045 -4264 16650 3586 2104
356 2104 14978 -7656 10387 -441 -7093 8431 -14808 1321 -4748 -14098 5033 -16934 -2154
369 -2154 -1201 -14604 7129 -9263 -553 5630 -6939 11460 -2373 5604 9278 -4253 16826
382 16826 -3233 4067 14645 -11516 14024 931 -7822 12933 -10814 662 1177 -10299 415
395 415 -8683 139 -8938 -5848 5512 -16497 7515 -370 -12861 18044 -10922 1121 15744
408 15744 -12187 10920 5389 -1836 8647 -1503 6475 -1837 1953 2508 -7952 9230 -10448
421 -10448 -2968 10041 -17205 6699 308 -8714 10611 -10679 6463 4512 -10757 12074 -5491
434 -5491 -574 5231 -10071 6996 -4022 -6827 2562 -2363 -2904 -8616 9500 -2689 -8543 18258
448 18258 -11452 6317 18034 -19356 22751 6858 -21180 26499 -455 -16178 12864 -3141
460 -3141 -10502 5779 -1941 -18631 10707 -1103 -24593 26437 -9428 -26627 34948 -11623 -10887
473 -10887 21893 -19012 7289 12272 -15464 7244 2609 -10050 3628 12366 -8407 -7438 14646
486 14646 -3423 8832 4560 -15040 23203 -2741 -9071 25510 -18623 -6645 13152 -9771
498 -9771 4715 -15256 -14183 11031 -8613 -8341 -1976 -5619 -2514 6558 6377 -3338 5891 -6192
512 -6192 14097 29253 -31106 6464 28104 -29516 20911 7532 -35035 20750 -5209 -13679
524 -13679 25969 -21364 -21196 33615 2993 -21831 21957 -4433 -15180 37679 -17903 -14043 31498
537 31498 -45292 7512 41613 -62819 -2511 30943 -37172 9382 16804 -31915 9519 26603
549 26603 -17708 14616 26465 -31805 20505 42369 -29012 2767 16507 -8990 3725 -7258
561 -7258 1968 -12968 -19321 18562 -14883 -14377 9098 -23400 9728 19636 -29782 1030 29226
574 29226 -19822 -6688 37421 -21303 -14684 36442 -20519 3357 18614 -35691 29789 11903
586 11903 -38280 36505 3869 -27270 32252 -202 -14931 23067 -11676 -14531 30334 -22731
598 -22731 -29265 40153 -28639 -33988 39612 -27624 -16549 24206 -25607 12875 12880 -21003 26473
611 26473 7656 -11970 24440 9258 -6275 12520 -1094 -4616 21154 -20716 -18151 34608
623 34608 -31058 -20227 39295 -34482 -15096 29466 -18727 976 8788 -11656 9020 8805 -2336
636 -2336 -3114 6732 4544 -10213 4033 9404 -13141 -15104 22108 4302 -35893 24501 10433
649 10433 -35993 37836 1128 -33041 42384 -10717 -19886 42994 -20286 -24518 36436 -8231
661 -8231 -25547 22479 -9982 -20166 26076 -16839 -9389 25927 -31807 10593 30700 -37576
673 -37576 13360 18879 -24108 19205 3116 -19849 14434 1157 -15206 12029 2171 -24193
685 -24193 13551 12668 -19721 9338 2506 -4521 13007 -6803 8376 1919 -11928 19695 -5056
698 -5056 -8035 10251 -16551 4423 10474 -20638 -2445 8697 -11840 -2885 14345 -13573 -7679
711 -7679 20022 -8673 5021 9040 -18837 20557 6239 -15161 18929 -11265 -6599 20697 -11127
724 -11127 -2700 5652 -13980 4582 14262 -16110 -9267 18165 -11847 -1364 20598 -25200 651
737 651 19230 -17953 12071 -22 -21341 16810 3721 -8347 3178 -4775 -1455 6851 5007
750 5007 -6595 -1236 2047 189 13648 -7017 -8184 10867 -5227 8507 2523 -16184 8867
763 8867 -1843 -626 9721 -15775 -3218 7295 -902 1479 -5006 -5588 -243 7641 -510 -7235
777 -7235 3671 -6436 6384 11371 -13445 4212 1244 -2442 15809 -8937 -4389 7438 -5819
790 -5819 8453 1860 -9861 -346 3858 1947 -2458 1914 -7901 -2661 13492 -9600 -1738 4889
804 4889 -12103 10307 2927 -9163 4451 -4896 3321 4256 -4313 1188 -3378 3842 3252 -1307 1724
819 1724 -3840 5781 1290 -1053 5670 -9516 4496 5836 -8121 6014 -4709 -4216 5716 -4888
833 -4888 891 -3847 -2417 3304 -4630 3365 -1824 -2654 5103 -1570 4205 -868 165 4965 -5477
848 -5477 7442 -354 -6731 8261 -5417 -843 4185 -6380 1884 -1862 760 703 -3794 5176 -4231
863 -4231 1250 5188 -5548 3783 -1426 -712 3235 -5129 4305 -3861 -2220 6068 -7601 2928 1146
878 1146 -4713 5410 -2071 1393 494 -1208 5418 -4317 3262 1501 -5094 6541 -3063 -851 2057
893 2057 -4169 3706 -3829 194 1926 -6844 5905 -2522 -2954 5760 -5511 2572 1086 -2638 3308
908 3308 -3467 2840 -255 -1797 3732 -4609 3469 509 -3687 5380 -4993 2661 2425 -5457 6563
923 6563 -2803 -1039 5720 -4525 2118 -280 -1026 853 -2599 2638 -4703 918 2675 -7289 6048
938 6048 -2805 -4505 7471 -5601 1395 2312 -3770 4562 -2263 1406 1671 -2228 4385 -2626 2697
953 2697 1149 -3741 5712 -2750 621 1924 -3606 4421 -4046 130 2598 -6982 4581 -3496 -2580
968 -2580 5127 -8246 2754 3417 -6207 3955 727 -1234 604 2264 481 -2165 5994 -4829
982 -4829 499 8750 -11643 5615 5841 -12748 9276 43 -7265 7693 -3318 -2156 4636 -1959
996 -1959 -3375 4013 1645 -8643 6244 982 -10546 9020 -4472 -5148 9253 -10232 2672
1009 2672 6598 -9875 5561 3148 -2771 2930 1616 2359 -142 2731 -71 418 3082 -6635 3561
1024 3561 1205 -8339 4163 -3877 -1628 964 -7406 7232 -3276 -5194 9662 -5694 1013 4997
1038 4997 -5450 5906 1444 -6036 4184 4137 -7598 131 9824 -11453 802 11088 -14309
1051 -14309 8395 5075 -14854 17281 -1063 -13122 17902 -3498 -10619 11688 -2105 -9582
1063 -9582 6573 -2405 -10062 9995 -6817 -10778 17242 -10887 -7504 18437 -11527 -114 12035
1076 12035 -7961 6767 3156 -4612 7470 1401 -4256 1874 3346 -4598 -1742 2905 -4753 427
1090 427 -2676 -1589 6573 -10183 2588 7425 -10521 7014 -118 -5669 9656 -8267 -682 8652
1104 8652 -10579 -341 6462 -5502 -1826 4419 -2892 840 6264 -8173 7701 8427 -15373 14248
1118 14248 6007 -17783 16282 -2234 -12454 15257 -11142 -7461 13880 -13102 -8054 14393
1130 14393 -9456 -10845 16612 -6371 -8563 18361 -9995 -731 17062 -15548 7412 12844 -17339
1143 -17339 8352 6594 -10449 4531 620 -5417 2151 412 -4402 2984 124 -7920 8163 1424
1157 1424 -7901 5806 -2789 1372 3031 -6427 7028 -5129 -4332 11649 -8989 -1564 5015 -8822
1171 -8822 8476 3592 -11769 5646 7522 -8155 5267 9025 -15664 4671 13057 -14604 7767
1184 7767 676 -16578 18170 -1597 -14981 12617 -7565 -5086 14090 -6140 -6808 5773 -1818
1197 -1818 2054 9236 -11562 -4423 15737 -8609 892 9293 -18823 6506 10452 -11112 6419
1210 6419 -4969 -7973 14141 748 -6777 862 -8 1228 6118 696 -7854 1192 2126 3031 4823
1225 4823 -12145 -849 6564 -4123 7024 -7278 -9365 9940 -3310 2348 3552 -12635 3186
1238 3186 8939 -1657 -729 -1645 -3246 5737 7931 -7152 -511 3363 -6825 12580 1080 -15147
1252 -15147 8796 -1733 -2112 10423 -12534 -4266 8316 -4043 1540 1994 -8435 -808 8950
1265 8950 -1944 -3343 4189 -7064 5156 9342 -10911 4697 1696 -7556 12133 -2175 -7163
1278 -7163 5582 -3462 1232 4091 -4443 -2423 2298 1236 -2354 3041 -2453 -3920 6117 -2661
1292 -2661 -8 1478 -6015 5157 -1096 -3090 5273 -6649 1313 4402 -4374 4704 -124 -2648
1306 -2648 3921 1491 -253 518 1519 -3425 1417 4088 -6326 2339 -1032 -6358 8175 -4633
1320 -4633 -4423 5993 -7029 2465 5160 -5694 954 1855 -242 1687 2845 -2826 -3034 6658 -2083
1335 -2083 -1658 4045 -7008 2455 3953 -3730 2611 -3429 883 4163 -2474 3427 -2353 -2019 5691
1350 5691 -1059 -942 -962 -966 -878 176 1853 -6996 -90 3197 -5666 4625 -1150 -4798 6253 -388
1366 -388 1993 2034 -1985 4050 417 2584 1463 -3351 1829 348 279 -1131 -2343 230 -4159 2441
1382 2441 -154 -6592 3993 -1969 -1935 5106 -3536 699 1941 134 2532 -2059 2027 -90 -657
1397 -657 3527 -2150 460 393 -465 2154 -2081 2718 -860 -2055 5591 -3826 -84 3105 -4476 2127
1413 2127 26 -2302 -305 -1947 892 -2800 -119 1478 -4075 2790 156 -1054 2902 -846 2796
1428 2796 -88 953 3923 -3458 3506 1076 -3663 3745 -2257 -1442 701 -2598 201 -2157 59
1443 59 -235 -2610 2961 -1928 118 1834 -1495 2958 -1345 863 2071 -3874 4265 -1162 -3192 4166
1459 4166 -3308 -930 1974 -2063 61 -226 1314 -1449 845 3175 -4365 3197 1668 -3527 4028
1474 4028 -1558 -892 1912 -2012 1733 -1955 -273 1578 -3223 1779 -1526 -1774 2223 -2276 983
1489 983 -578 -918 1296 -2120 2570 -1208 -1279 2818 -1841 2281 -61 -1630 4346 -2901 1748 2853
1505 2853 -3883 3060 249 -1915 2449 -1088 -1390 -28 1236 -2943 -1205 2891 -5906 1054 3263
1520 3263 -6974 3691 510 -4341 5584 -2238 -1458 4235 -1037 202 1854 1085 -1496 2193 2230
1535 2230 -3033 3653 -926 -2230 5443 -4490 -608 3799 -4787 1420 464 -2395 562 -2026 566
1550 566 -1221 -830 801 -2190 2224 -715 -1570 2858 -745 557 285 1627 837 -2594 4808 -1166
1566 -1166 -2342 5573 -4803 778 3761 -6267 2931 1764 -5158 2602 1705 -3710 93 3126 -3430
1581 -3430 52 3709 -6297 3467 2516 -8109 6841 -242 -6983 7465 -2460 -3190 5009 -2920
1595 -2920 -148 3673 -1825 -732 5203 -1055 -2931 6643 -2377 -2796 6329 -4936 -146 3380 -6520
1610 -6520 3195 45 -5035 2420 -847 -1531 -145 249 636 -1778 1720 286 -414 1408 -514 2142
1626 2142 -512 141 1227 -1761 3524 -2418 -1139 5703 -6263 1162 5306 -6974 3022 1900 -5590
1641 -5590 3910 374 -5077 3157 1605 -6378 3142 3048 -8709 4789 2859 -8824 7581 -1324
1655 -1324 -5825 9697 -3967 -3213 8148 -4095 -1537 5980 -1878 -2585 4108 -1397 -2151 4200 -4440
1670 -4440 -1522 5436 -6276 1226 3385 -6305 3648 819 -2523 3257 -2808 635 3034 -1977 307
1685 307 839 185 30 636 -148 -1529 1300 -1564 854 677 -4102 3586 -775 -2072 4096 -4235 1335
1702 1335 3645 -5451 4428 1100 -5406 5037 991 -3919 2793 716 -3763 3906 1026 -6555 5285
1717 5285 -365 -7070 8545 -3168 -6447 8776 -4702 -2295 6491 -5747 512 4844 -3832 758
1731 758 4444 -3241 -131 5713 -3573 -118 4831 -4925 2857 2304 -5778 4449 -1090 -3829 4221
1746 4221 -2453 -1008 1109 -2312 901 -594 -749 423 -603 -306 28 1546 -1687 960 1052 -2432
1762 -2432 3962 -1269 -1882 5341 -3687 1424 4595 -5151 2632 1527 -3076 3248 -970 -2996 1943
1777 1943 -19 -2790 1009 -441 -4791 3643 145 -4478 5234 -3110 -1823 7637 -5023 -22 5542
1792 5542 -4583 3199 3771 -4107 723 2596 -1770 2 1790 -4620 -380 4150 -4659 861 1391
1807 1391 -4719 4425 222 -1688 2364 -2447 2201 1938 -1840 1558 -1516 -159 2079 -1058 -1387
1822 -1387 -242 61 -948 1600 104 -3585 3669 81 -1476 4464 -3371 298 4205 -3082 1865
1837 1865 -108 -3036 2267 -520 -1569 149 -1050 -1057 1201 819 -3235 1421 969 -2340 4394 -1208
1853 -1208 -2123 4840 -2159 1013 2314 -3699 1673 330 -1162 879 -1711 -550 513 640 -772
1868 -772 -64 930 -1535 2825 411 -2614 3561 -2183 -226 3723 -4357 197 1398 -2845 1194 -921
1884 -921 -1579 250 650 619 -769 1228 -190 439 2243 -1102 1242 235 -705 2571 -2737 -21 457
1901 457 -3615 2447 -765 -2946 1406 -1654 -124 1420 -233 -633 282 2050 -743 936 1204 -2488
1917 -2488 2477 -633 -1696 1870 -3112 844 1133 -2705 1292 -1604 -530 2049 -1140 299 263 664
1933 664 872 517 1412 -1578 1079 1291 -2190 1968 -1525 -1691 1773 -2201 654 -520 -1530 1575
1949 1575 -1196 898 493 -1183 1610 -133 307 489 -409 742 -1170 1484 -343 -1557 1921 -2049
1965 -2049 608 1432 -2477 1773 -414 -541 2108 -1681 795 356 -401 1420 -1102 5 -804 -160
1981 -160 496 -1365 821 -1577 -367 2430 -2244 1222 833 -2034 3197 286 -614 1550 -850 898
1997 898 650 222 -559 -1208 1407 -1370 166 26 -2648 1533 -570 -844 710 -2561 1253 704 -611
2014 -611 1555 -1353 720 980 -627 1433 -1329 354 802 -400 1123 -1435 403 795 -596 809
2030 809 -1484 695 402 -828 1823 -2340 -607 2316 -2552 1339 428 -2780 1790 163 -1371 -80
2046 -80 416 -431 -14 2183 -2051 -231 2605 -2378 1961 816 -3183 3134 -105 -1161 1776 -1947
2062 -1947 2 792 -199 -716 -639 693 -843 1080 -314 -2697 2133 -443 -323 1879 -2398 591
2078 591 1166 -822 1095 -1786 484 544 -83 1490 -2132 504 1319 -1130 1735 -395 -986 800 794
2095 794 680 -1600 821 -197 -724 2584 -3057 -294 2727 -3102 2043 706 -3956 1825 580 -1142
2111 -1142 1022 -469 -1293 1125 1772 -2517 892 1410 -3383 3774 443 -3649 3795 -1217 -1130 3339
2127 3339 -2310 -841 2038 -963 -525 802 -306 -1869 2040 -37 -2333 2071 -1408 -839 2356
2142 2356 -2598 161 777 -1273 1523 -781 303 -97 -575 1869 -1114 -43 1073 -1570 1147 274
2158 274 -782 571 229 192 -788 1301 -923 -1172 3010 -2737 34 2291 -4018 2047 947 -3502
2174 -3502 2602 -305 -2259 2512 -307 -1982 1485 935 -2736 2037 1095 -3603 3727 12 -3031
2189 -3031 4629 -2363 -1887 4091 -2775 -316 2362 -1866 -173 1300 -1300 -1310 1894 -1084 -1787 2657
2205 2657 -2554 -841 2591 -2467 871 612 -1551 1516 -536 338 421 -948 1474 -1217 311 1215
2221 1215 -1496 1253 494 -820 198 423 -237 -977 1529 -969 -1085 2880 -3033 240 2563 -4091
2237 -4091 2238 1058 -3412 2489 -29 -1879 1880 -414 -1491 1354 817 -2311 1725 1164 -2707
2252 -2707 3154 240 -2333 3971 -1931 -576 2904 -3184 829 1317 -2607 775 217 -1521 -28
2267 -28 650 -1447 -356 1723 -1958 723 1541 -2714 2363 207 -1677 2363 -1132 63 1464 -1087
2283 -1087 1014 -96 -9 391 -1025 905 -529 -535 728 -153 22 -390 812 -670 -401 1872 -2384
2300 -2384 394 1930 -3561 1984 341 -2943 2535 -931 -2004 2204 -659 -1088 1624 375 -1233
2315 -1233 1654 673 -2196 2844 -519 -1794 3234 -2412 -1000 2567 -2711 530 549 -2103 1176 37
2331 37 -586 245 -34 -254 27 1136 -1367 376 1014 -1461 1754 -836 -1062 1560 -1809 725 769 -2493
2349 -2493 1546 -174 -570 1548 -976 65 652 663 33 155 771 -945 1051 4 -2068 1209 -1479
2366 -1479 -187 1374 -2689 741 55 -928 2387 -1416 -622 1536 -809 771 780 -280 -750 1168 502
2383 502 -1425 1678 -1174 -1265 2838 -1929 -840 1262 -2186 1659 360 -1335 1110 -539 515 828
2399 828 -448 -260 -292 795 -399 2 -176 -1858 1534 -560 -1118 1606 -1767 877 1719 -997 1445
2416 1445 -545 105 1705 -499 563 -315 -544 741 -423 118 -1097 -23 -407 -583 1539 -1796
2432 -1796 -300 1701 -1754 1738 872 -2255 1896 157 198 786 -714 -3 -268 503 -203 -591 312
2449 312 -889 736 99 -1180 1041 -1080 1037 1225 -1772 1498 -59 -683 1969 -1136 -645 -5
2465 -5 -543 226 -612 100 -1071 -519 1093 -652 887 -455 -436 1888 -607 1012 134 -1101 1986 -414
2483 -414 -183 705 -1472 663 195 -695 -182 -760 629 -278 223 180 -867 1212 -369 -34 500 -1359
2501 -1359 957 38 -677 1392 -1696 108 1061 -1162 668 -199 -351 468 191 193 -568 798 -143 -528
2519 -528 1837 -1491 37 958 -1516 1110 -600 -1360 845 -769 85 -188 -529 439 -674 358 -93
2536 -93 -108 1158 -825 1001 -282 -721 1665 -620 376 463 -1032 1122 -440 -59 205 -1111 1245
2553 1245 -182 -87 758 -939 1002 34 -683 411 -839 513 -158 225 -60 -1442 1422 -368 -697
2570 -697 1309 -1958 766 1295 -1278 970 137 -297 1054 254 -147 -170 652 -84 -393 945 -1729 638
2588 638 1055 -1634 1253 -667 -1394 1475 -754 -278 195 -714 612 121 165 -845 19 843 -864 937
2606 937 -106 -1124 1477 -590 81 481 -1002 590 -286 309 145 -875 1144 -633 -229 591 -1703
2623 -1703 412 369 -924 565 -418 -328 -123 459 -167 -980 1236 -1131 -90 1668 -1879 855 919 -1690
2641 -1690 1507 -92 -983 1313 68 -438 285 458 -981 442 1067 -1868 869 632 -1833 1551
2657 1551 -332 -1287 1679 -746 -270 921 -853 31 91 357 -535 16 829 -729 975 48 -926 1113
2675 1113 -387 225 714 -506 436 -397 325 -119 -825 1067 -942 140 1158 -1476 595 106 -999
2692 -999 877 -107 -370 -120 240 -399 -219 1062 -1203 340 1606 -1784 1407 454 -1932 1995 25
2709 25 -1005 1531 -241 -593 1075 -109 -833 701 589 -1384 1259 177 -1875 2237 -984 -1288
2725 -1288 1951 -1591 107 1025 -1026 18 72 -205 -137 256 295 -537 1133 69 -626 1106 -592 506
2743 506 644 -437 889 -498 209 580 -893 1183 -775 16 974 -1365 478 146 -825 870 -341
2760 -341 -294 65 99 -181 -370 685 -1287 168 1239 -1966 1234 3 -1447 1951 -423 -529 1680
2777 1680 -952 -327 976 -432 -727 693 38 -957 1264 -559 -1793 2049 -1135 -654 1471 -1698
2793 -1698 -53 991 -1144 599 18 -313 215 485 193 -551 686 -236 -206 971 -828 93 510 -761
2811 -761 882 -670 140 43 -790 1030 -723 -590 802 -1230 457 196 -832 439 -6 -160 117
2828 117 -14 -403 -227 738 -1118 145 1496 -1430 1173 760 -1333 1423 -438 -676 1236 -910 -61
2845 -61 340 -110 -99 289 165 -813 433 -91 -923 1494 -1132 -327 1249 -1252 539 348 -1016 1268
2863 1268 -484 -334 481 -335 231 -142 238 -296 34 759 -752 819 322 -559 959 -629 88 732
2881 732 -833 914 -305 -319 564 -1154 44 -78 -1080 310 -660 -135 170 -78 -86 -327 608 -388 445
2900 445 1060 -1017 935 296 -1192 1675 -711 -482 1082 -794 -124 217 -368 -57 31 146 -512 482
2918 482 37 -938 1184 -872 205 1119 -1212 785 309 -809 808 -541 -98 527 -581 390 -118
2935 -118 15 166 -87 408 -269 641 241 -95 900 -1013 344 708 -1025 978 -779 -983 977 -897
2953 -897 142 68 -925 311 -150 -183 91 88 20 -231 870 -495 -98 1101 -863 676 217 -971 1148
2972 1148 -379 -142 877 -921 261 118 -560 344 -251 -28 -213 354 -225 -653 703 -925 -15 910
2990 910 -1297 604 -99 -725 1257 -675 -88 497 -440 743 46 169 21 -102 583 -93 334 23
3008 23 -352 687 -501 117 110 -884 670 -366 -483 890 -898 227 291 -344 650 -336 -24 45 -452
3027 -452 373 -359 186 24 266 347 -1005 723 47 -728 1135 -655 -192 871 -692 668 145 -358
3045 -358 403 -15 37 -510 254 -414 -284 613 -689 -164 376 -1006 726 274 -793 915 -252 265
3063 265 653 -448 172 -137 328 427 -109 336 -578 200 438 -645 339 -315 -8 73 -629 710 -161 -272
3083 -272 433 -796 451 -389 -379 850 -559 -98 527 -397 698 -196 96 -70 -86 494 -618 644
3101 644 -241 -491 1198 -776 377 631 -1032 550 15 -560 448 -300 -133 367 241 -276 -448 618
3119 618 -493 184 628 -1075 688 144 -704 902 -352 -397 510 63 191 -16 -51 -96 231 827 -687
3138 -687 163 158 -548 713 -260 -789 384 -212 205 27 -292 82 -379 715 -564 -370 745 -781 480
3157 480 460 -948 539 220 -50 252 40 -425 -72 841 -283 -449 902 -1094 458 576 -1599 607
3175 607 -48 -731 743 -299 -422 16 181 127 -383 390 -667 525 748 -1182 683 0 -613 1326
3193 1326 -402 -296 811 -424 249 12 57 -245 459 678 -741 78 162 -831 1188 -360 -811 497
3211 497 -53 248 58 -181 -245 -308 1251 -671 -455 580 -789 642 749 -1230 313 304 -38 523 -423
3230 -423 -548 81 934 -238 -504 416 -904 1050 764 -1586 411 -65 -427 1483 -499 -891 321
3247 321 -58 36 -27 3 -1043 741 838 -712 459 -36 -371 1617 -527 -517 236 -286 453 433 -285 -400
3267 -400 -166 799 -166 -17 -326 -918 1039 -78 -469 403 -837 256 278 -281 -291 -650 898 -14 -230
3286 -230 622 -1288 398 746 -755 789 -248 -754 990 -303 -471 -142 351 99 150 599 -940 605
3304 605 884 -1143 1055 -200 -1071 988 -291 -32 5 -434 -151 197 342 -681 288 345 -893 891
3322 891 -151 -778 1056 -593 -178 442 -567 260 14 28 -4 -544 490 -271 -98 113 -487 536 -232
3341 -232 -210 165 -664 173 -19 -117 426 -546 759 -144 -374 865 -417 214 378 -622 568 -124 -245
3360 -245 574 -66 -145 -194 243 37 -9 654 -831 561 461 -976 773 -295 -459 702 -853 -220 286
3379 286 -536 520 -86 -145 -320 299 283 -651 749 -382 -770 1132 -661 194 543 -689 313 -215
3397 -215 16 158 -353 181 103 209 449 -234 443 -285 -193 343 -456 292 14 -302 131 -638 393 -32
3417 -32 -56 509 -657 261 420 -558 586 -47 -197 203 -144 9 -51 292 -247 -103 706 -902 35 219
3437 219 -732 860 -175 -468 424 -730 277 225 -145 255 -161 91 80 -280 364 -312 686 -102 -166 751
3457 751 -585 318 61 -665 584 -358 46 645 -644 205 56 -43 146 -508 241 116 68 -239 -616 321
3477 321 -523 117 290 -795 488 -137 -425 837 -828 181 217 -368 716 -249 -161 420 -502 132 65
3496 65 -56 60 -107 409 -446 262 -110 -777 446 -434 -181 559 -920 264 378 -553 352 -457 -374 74
3516 74 -235 440 -532 435 -205 -68 863 -610 377 355 -551 512 -280 -111 381 -556 417 -219 90 164
3536 164 -422 138 -197 -407 409 -423 485 145 -147 399 -372 521 115 -208 645 -586 359 129 -539 495
3556 495 -179 -152 270 -455 62 -71 63 -81 28 379 -524 78 188 -530 403 -311 -245 684 -558 255
3576 255 67 -583 526 -170 -83 40 -18 546 -299 330 -150 -174 608 -239 371 52 -523 505 -70 73
3596 73 205 -463 326 107 105 185 -678 264 -186 58 316 -425 442 7 -212 315 -216 358 201 95 638
3617 638 -486 266 -211 -229 728 -403 19 379 -252 290 -119 -649 306 198 89 -275 153 215 -312 585
3637 585 -370 -267 619 -902 100 441 -859 435 -5 192 271 -21 72 -127 321 -288 -383 575 -652
3656 -652 310 374 -671 499 155 -194 257 -268 -155 -259 -99 -63 -593 279 -422 28 535 -477 231 134
3676 134 -493 324 -304 -11 -35 317 363 -369 199 170 -354 1091 -420 -17 704 -573 437 78 -148 254
3696 254 -91 -320 -175 -200 -267 -439 399 -632 -552 898 -660 398 343 -819 427 216 -41 161 -98
3715 -98 -65 84 462 -143 -200 501 -454 479 191 -906 467 -99 4 588 -423 -87 -45 226 -248 -548
3735 -548 153 -380 -79 444 -662 54 484 -375 387 -330 -162 83 -173 189 -480 80 -353 -13 726 -733
3755 -733 236 612 -741 512 228 -547 469 286 -33 54 -25 -79 -342 677 -452 -25 405 -612 577
3774 577 49 -758 710 -287 -223 466 -154 -227 39 513 -119 -175 699 -747 213 376 -697 706 -42 -283
3794 -283 575 -485 -100 355 -172 -154 -274 44 -504 -42 723 -774 75 321 -543 591 -243 -314 68 33
3814 33 397 -261 453 147 -36 815 -661 -172 575 -645 363 7 -465 372 -301 -26 -189 66 -192
3833 -192 -325 466 -538 -78 307 -635 491 189 -722 799 -191 -20 371 -255 -77 333 371 49 -37 519
3853 519 -403 545 506 -819 606 -281 -23 434 -389 -25 -59 -113 279 14 149 -124 -96 272 -515 233 -38
3874 -38 -329 408 -184 120 242 -81 306 -234 22 -57 -72 374 -378 138 353 -661 732 112 -271 347
3894 347 -424 117 55 7 79 48 143 -376 64 290 -728 261 -71 -627 554 -379 10 287 110 150 294
3915 294 -19 3 -137 382 -88 89 255 -183 726 -93 -228 313 -364 208 -331 -422 356 -281 68 -26 -359
3936 -359 641 -321 312 69 -427 172 -51 -4 189 -287 55 -203 437 250 -565 558 90 16 289 -566
3956 -566 287 -105 -291 345 -303 77 -239 42 84 -196 536 -481 36 513 -277 363 33 -202 515 -365
3976 -365 53 157 -714 53 42 -236 92 -170 148 -384 63 163 -630 444 -247 -198 62 -522 111 -208
3996 -208 -56 132 -284 186 41 -276 355 -416 -9 230 -198 -87 -141 -48 -23 -302 137 -351 131 250 -136
4017 -136 615 -344 -20 211 -545 343 -18 -139 601 -467 36 -112 -510 -168 -231 -84 -76 65 116 -205 339
4038 339 -24 -284 658 -172 -106 382 -281 299 -54 94 243 -392 153 132 -22 179 -180 279 -183 -4 152
4059 152 -459 294 54 -385 69 -305 -76 -314 -311 391 -222 117 348 -407 307 -92 -54 -71 -171 38 -186
4080 -186 235 294 -327 386 -430 -111 275 -346 75 -94 -215 489 -375 38 218 -321 129 -157 -189 -98 -155
4101 -155 203 -213 -130 122 -78 504 -311 91 301 -176 345 -83 -46 135 -241 46 -67 101 86 -221 299
4122 299 -187 -120 247 -599 37 -87 -116 275 -110 -188 -162 -277 328 -271 199 141 -251 418 -226 -171 286 -5
4144 -5 78 -91 -91 124 -199 226 -363 366 305 -782 283 -358 -237 267 -386 204 250 -303 24 26 94 -183 -13
4167 -13 117 -375 273 -168 -153 497 -132 82 347 -528 239 86 -237 289 159 265 18 108 -7 -413 177
4188 177 -98 -175 459 -484 276 133 -649 107 -396 146 163 -129 183 -393 368 -60 -294 732 -118 146
4208 146 462 -116 195 -173 -286 317 -29 180 -261 177 90 -288 307 -217 -322 289 -522 154 8 -291
4228 -291 243 -218 -92 178 66 53 -149 -28 -9 -497 338 -409 235 385 -541 203 -220 -388 193 79 72
4249 72 -18 409 -199 -73 447 -387 -95 840 -581 138 56 -522 457 -74 -364 114 -84 -120 112 68 -70
4270 -70 -401 157 -635 141 224 -672 227 85 -98 531 -65 67 -112 -51 -150 -352 191 -152 -167 440 -435 24
4292 24 185 -655 590 -346 -4 54 -66 179 278 480 -232 -149 666 -599 190 534 -588 176 383 -108
4312 -108 222 129 -130 -197 177 -69 -100 364 -175 -336 398 -484 39 180 -533 157 -248 10 255 102 -141
4333 -141 -120 205 230 -324 621 -234 212 351 -574 224 -51 -84 203 -107 318 -197 40 138 -270 107 -437
4354 -437 -142 541 -581 150 298 -546 629 -127 -221 143 -135 38 -33 358 -110 16 761 -454 -52 114
4374 114 -343 521 267 -82 265 -153 28 76 -92 -338 -303 354 -298 -31 296 -802 254 127 -239 431
4394 431 -281 -122 459 18 -88 -106 208 289 1 362 -330 149 450 -123 61 -122 -78 493 -129 140 -379
4415 -379 -32 -51 -153 283 -338 -275 155 -493 81 -7 -634 209 -151 272 -104 -308 154 201 471 -10 -245
4436 -245 137 33 304 82 -646 212 -112 122 439 -494 -46 18 -332 188 -422 -182 -102 227 156 -328 94
4457 94 -212 -263 45 -309 133 35 -368 545 -11 -85 44 -230 173 -103 -21 208 -163 577 12 -188 -67 11
4479 11 312 -168 -36 -60 -337 456 -74 -78 217 -581 -254 150 -322 280 -94 -332 442 -204 180 33 -12 -14
4501 -14 -302 314 -257 122 119 -374 399 -28 -203 263 -437 274 59 -359 102 -124 -53 -28 -423 -38 -221 140
4523 140 87 -92 329 1 293 238 -274 320 -94 188 482 -53 496 -337 133 37 -397 345 -248 -173 370
4544 370 -354 222 -209 -82 -81 -267 275 -124 -237 363 -215 -54 6 -286 212 -112 25 156 -19 7 50 -49
4566 -49 87 -354 181 146 313 154 -206 207 79 38 -188 -243 -15 -139 -193 214 -530 104 64 -182 56 -267
4588 -267 -74 -41 -205 61 -10 -78 65 11 240 -276 118 355 10 274 92 -19 300 -297 427 -101 -206
4609 -206 314 -200 66 -119 -130 169 -106 239 -275 105 -10 -710 117 8 -112 466 -295 -99 621 -151
4629 -151 225 -197 -188 41 -305 290 -83 224 233 -419 172 -96 -305 207 -407 54 148 -81 79 -354 96 -9
4651 -9 -348 214 -169 284 88 -167 203 -231 -265 231 -236 318 139 370 190 -142 485 -336 18 379 -315
4672 -315 286 -236 -316 291 -360 17 336 -205 146 -226 10 -172 13 462 -251 350 243 -254 558 -361
4692 -361 -6 313 -567 121 -237 -196 163 -41 391 -227 215 195 -334 419 -191 -75 381 -495 148 217 -351
4713 -351 266 -62 193 -5 185 336 -148 355 -101 -113 516 -186 -6 249 -418 263 -99 -97 -27 -7 393 -238
4735 -238 294 -16 -237 230 -218 -145 350 -732 -63 179 -364 148 -155 -128 -187 -198 22 -237 280 90 -358
4756 -358 575 -119 -135 279 -416 198 139 -65 84 -430 15 -261 64 -19 -328 363 -393 -254 635 -281 5
4777 5 285 -44 374 38 308 -66 -157 263 -365 164 -55 -352 558 -112 -119 284 -289 477 241 -324 310 -383
4799 -383 293 149 8 81 -326 559 -513 -202 236 -280 -46 240 -274 288 -180 71 257 -174 323 -485
4819 -485 190 67 -261 395 -87 -271 385 -251 208 130 144 -66 -162 273 -57 365 172 -298 291 -282 -214
4840 -214 494 -353 96 444 -577 462 -106 -62 -84 -272 295 -54 130 140 23 407 -580 231 197 -522 510
4861 510 -333 -79 205 -299 184 128 -183 7 -196 324 -142 -154 485 -470 58 48 -276 139 106 -108 15
4882 15 -50 56 -339 149 149 -542 521 -287 19 328 -716 66 -137 12 237 -152 -204 -14 127 106 -360
4903 -360 391 -184 -56 217 -335 -5 338 -359 178 -330 -79 80 -201 379 41 172 -218 -172 360 -159
4923 -159 -86 392 -253 469 205 -285 96 -98 198 -154 -31 241 -499 298 -79 -273 269 -258 193 16
4943 16 -328 204 -296 94 168 33 81 -198 252 173 -295 383 -195 -39 314 -466 101 258 -310 460 -146
4964 -146 63 -4 93 216 107 180 -210 -182 543 -363 -147 44 -545 506 -305 -151 173 -154 173 -118 -263
4985 -263 -106 -224 208 -122 382 343 -630 296 -30 -46 215 -331 92 -149 6 382 -316 467 -195 -175 317
5006 317 -246 128 139 -433 254 -143 -52 -121 -13 98 -212 469 95 -289 305 -137 -52 699 -373 264 23
5027 23 -93 275 -190 -19 28 -135 128 181 138 -315 89 82 -607 72 269 -259 398 -144 13 299 -224 148
5049 148 41 -35 35 -140 285 -109 -69 353 -79 397 -70 -76 229 -87 406 -92 -346 501 -595 53 -201
5070 -201 -377 71 -250 49 219 -260 287 -350 -257 253 -323 183 62 201 200 -83 543 -187 166 454 -55
5091 -55 194 197 -140 217 -208 198 191 -190 171 -342 26 -229 -219 168 -345 -106 -38 -44 363 -303 39 271 -110
5114 -110 366 -56 271 84 -102 274 -85 12 79 7 50 78 -185 305 -154 167 -30 -60 139 111 139 -336 -435
5137 -435 113 -350 17 -68 -458 448 46 52 178 -155 28 -32 467 194 -258 510 -290 73 215 -463 173
5158 173 -223 -68 288 -292 -33 159 -376 120 -224 145 -282 -272 375 -560 245 -41 -278 368 -175 13
5178 13 85 2 58 -189 74 109 -158 -35 -117 109 265 -203 180 -116 -117 137 -316 59 26 -288 292 -355 209
5201 209 -26 -261 -57 -172 8 -59 -190 222 -270 -105 307 -355 109 -130 -217 113 159 107 -51 173 537
5222 537 68 262 -310 -71 396 -89 39 -75 -139 333 -402 -7 -77 -261 37 -302 184 135 -272 385 -336
5243 -336 -136 26 -393 9 -18 2 171 5 345 -12 19 60 -346 287 256 -365 414 -372 338 109 -146 253
5265 253 -163 -4 48 -417 395 -275 -155 -153 -205 318 -229 132 202 -197 19 123 0 180 -231 233 -192 -3
5287 -3 354 -139 333 -295 150 629 -81 -31 311 -317 -47 -183 233 -279 -81 -150 -294 325 57 -666 528
5308 528 -122 -134 332 -109 251 -60 44 197 -258 382 8 332 22 -285 281 -6 -124 421 -377 138
5328 138 101 -304 -34 -141 -106 -95 -175 76 -356 -34 162 -279 319 65 10 186 -233 154 183 106 328 -210
5350 -210 377 -241 34 124 -452 308 -91 -267 518 -344 -74 317 -407 284 -111 -73 146 -100 105 17 372
5371 372 106 -254 313 -166 -78 82 -320 218 -106 -133 461 40 40 -144 143 114 -143 143 -41 -161 246 -291
5393 -291 92 94 -385 180 17 58 114 -42 183 -322 26 -48 -250 109 -291 -13 170 -308 158 115 -104 285
5415 285 -84 354 -322 175 156 -170 284 -260 -269 238 -237 78 161 -247 316 -154 -75 16 -162 285 -261 -80
5437 -80 157 179 310 -159 36 297 -392 265 186 -164 247 -165 25 -77 53 195 -2 -42 -74 -127 148 -367
5459 -367 351 -169 -116 218 -231 6 -29 -119 45 -290 211 236 -307 322 -143 -205 256 -164 239 351 -146 -6
5481 -6 -124 231 -322 10 155 -306 225 -382 -446 339 -352 229 25 -294 397 -51 25 -163 -121 231 -233 45
5503 45 -51 -234 139 -156 180 360 -225 246 14 13 93 -161 95 91 84 315 -209 -63 65 -287 109 -133 161
5526 161 -8 -167 452 20 44 -9 -293 66 -110 168 48 -109 394 -28 -63 238 -267 167 165 -27 232 -211
5548 -211 262 -105 156 79 27 133 -204 -84 364 -578 134 115 -278 299 -67 28 3 -268 200 -82 56 55
5570 55 117 486 -202 96 255 -197 327 -62 -395 31 -110 335 -105 -247 451 -320 -99 105 -200 -99 -209
5591 -209 113 -145 160 408 -324 18 89 -77 320 -83 139 339 -62 317 -124 -422 525 -222 192 305
5611 305 -134 95 -271 249 -86 47 -5 -370 35 -18 -160 57 -281 66 128 -390 174 -251 -33 283 -239
5632 -239 252 95 135 319 -147 270 -66 -53 29 57 379 58 87 455 -250 107 -161 115 190 -139 30 -167
5654 -167 -250 297 -292 -40 43 -342 -92 -68 -18 131 -236 165 152 113 135 -220 197 -35 -77 -97 -138 345 253 -90
5678 -90 164 -334 -40 70 -261 212 -126 87 17 31 417 -379 78 -8 -351 150 -329 -100 24 -233 254
5699 254 -127 14 187 15 455 239 -124 162 -356 345 -223 -113 -138 -108 94 97 -224 -106 -123 -30 -110 -96 426
5722 426 -191 85 -52 -366 202 -161 21 135 -161 15 181 66 118 -127 205 -156 117 115 -127 402 -61
5743 -61 -306 363 -323 236 -115 -343 70 -141 235 180 -288 113 -301 134 1 -393 95 -105 -233 241 -35
5764 -35 123 72 10 50 -271 265 -126 108 402 -288 425 50 -31 249 -174 289 207 -238 -49 143 -17 24
5786 24 -142 134 -415 -20 -87 -266 81 -164 -98 154 -610 362 58 -27 501 -53 393 -141 -166 387 -244 186
5808 186 -245 -24 260 -400 324 -145 -219 188 -387 203 -10 -22 116 -227 210 37 -183 217 -232 -281 246
5829 246 -300 75 185 -109 -113 33 100 -160 32 362 -338 482 -128 -247 454 -236 193 184 -465 246 113 199
5851 199 -176 -57 24 -302 259 -213 -400 387 -184 -59 87 -184 235 135 -185 285 -286 85 53 -111 404
5872 404 -268 -3 -18 -42 483 -185 -17 27 -336 -113 -244 -168 -158 -250 215 -198 223 58 -319 300 -431 -107
5894 -107 142 -340 172 162 282 179 -531 66 -136 -54 8 -327 297 9 -190 203 -95 -4 192 -76 -18 -91
5916 -91 85 -312 -285 414 -113 -5 40 -352 320 61 -1 408 -197 284 -58 -40 258 -309 49 -8 -134 319
5938 319 -118 220 -6 -64 128 -172 23 64 -150 79 -41 48 130 -69 117 -156 -45 -64 -225 516 -156 21
5960 21 395 5 421 -175 42 166 -195 -252 130 30 126 -305 333 -131 -60 356 -246 92 216 -204 167
5981 167 -147 -114 73 -391 130 -265 80 -73 -244 109 -457 -162 176 -189 92 -268 -102 84 -287 301
6001 301 27 -24 218 23 -20 -141 2 320 -201 191 169 -176 91 87 65 -90 -231 53 -544 76 -72 -169
6023 -169 209 -243 249 544 -286 303 194 -91 -19 -155 186 -125 -12 141 -47 256 61 -60 108 -406
6043 -406 -73 39 -427 234 -374 -83 148 -155 106 -286 263 110 -318 300 -53 -130 322 -312 328 -44
6063 -44 -255 33 -376 590 -102 -77 158 -435 284 -64 -126 168 -347 170 -33 -127 -217 -131 26 -345 -126 371
6085 371 -66 -58 302 -383 200 -144 4 357 -203 -19 108 -87 369 -185 -75 -99 243 45 -203 104 -141
6106 -141 -76 91 -218 79 -276 -415 9 -412 14 226 -226 208 189 146 -32 -443 -77 -225 -105 281 -96
6127 -96 156 -25 -172 284 -203 57 -22 136 110 -283 124 50 -206 325 -154 52 52 -454 110 -61 -254 64
6149 64 -173 86 -164 133 242 -267 496 -111 15 358 -442 327 225 -11 203 -180 184 189 -118 136 -270
6170 -270 448 81 -71 218 -397 99 91 -182 327 -450 126 -29 -139 401 43 -111 131 -213 249 -79 49
6191 49 368 -365 321 20 -105 218 -219 70 -65 137 102 -335 328 -59 -76 94 -325 18 -32 -164 121
6212 121 -365 88 149 -153 52 -9 119 41 -373 269 38 -58 125 -31 90 34 -226 15 -302 76 -93 -205
6234 -205 254 -505 42 180 -43 240 -467 -10 8 -170 256 36 -7 191 -209 377 -214 175 9 -3 515
6255 515 73 133 384 -291 163 -90 -102 140 -378 275 -113 -4 317 -145 297 173 -343 150 -284 160 100
6276 100 -328 129 -203 -80 62 -154 113 -436 48 227 -149 382 -18 -201 106 -381 222 101 -196 298
6296 298 -157 253 194 -78 89 -91 159 -86 -228 371 -416 -175 77 -365 126 -279 -12 -124 -144 103 -278
6317 -278 -150 154 -155 111 -88 205 268 -383 96 37 -252 345 -345 238 135 -268 249 71 219 -38 -151
6338 -151 162 -123 239 83 -587 253 -64 -93 29 -169 205 23 -251 152 -177 459 -164 6 455 -120
6358 -120 12 -126 -222 231 -462 163 428 -46 236 -240 -28 -354 -42 182 -327 193 -3 -477 256 -347
6378 -347 -37 49 -299 -3 -25 125 28 -54 259 -95 292 381 -425 269 -33 -99 266 -51 93 -242 -356 179
6400 179 -305 125 84 -115 319 -126 334 67 -74 411 -291 26 327 -329 283 -124 -44 -10 -262 91 -60
6421 -60 -135 190 -219 390 159 -217 341 -439 204 21 -142 72 -23 -16 -229 -162 232 -280 525 174 -189 493
6443 493 -150 -200 63 -296 278 -214 -416 262 -203 -28 -164 97 179 -335 280 -151 -186 259 -415 348 161
6464 161 -213 343 -193 -36 -107 -154 348 -219 202 272 -350 414 -65 -239 72 -182 13 -7 -107 38 -133
6485 -133 259 -214 227 277 -205 4 -15 -165 195 83 94 -19 -267 189 -257 -167 61 -380 -10 -540 62
6506 62 49 -135 93 -114 54 207 -250 309 -88 363 -3 -139 97 -192 -165 226 -204 22 -164 -127 -3
6527 -3 -546 247 24 -340 366 -193 -5 -249 -163 200 -366 302 257 -27 280 -59 58 230 -245 229 170 -163
6549 -163 94 53 164 25 34 64 16 348 185 139 349 -349 4 70 -219 -15 -86 151 123 -223 199 6 69
6572 69 174 -165 244 -296 -223 -47 -386 201 -89 140 366 -271 19 -7 -15 333 -173 134 71 60 -112 -162 -91
6595 -91 -141 -127 227 -82 49 -89 -167 355 -515 -4 2 -407 59 -112 89 50 -59 321 -108 -300 96 1 -48
6618 -48 153 -67 264 -249 169 -88 -224 129 -203 -207 18 -106 362 -146 -119 108 -15 207 -241 -205 309 -71
6640 -71 -91 -189 -80 279 -77 192 4 69 124 -79 416 -231 31 219 -148 237 85 -126 135 -388 174 114
6662 114 160 325 -49 184 -322 -1 414 -203 10 134 -512 386 -210 6 439 -352 314 141 -170 40
6682 40 -349 169 -160 -125 106 317 296 -211 -326 43 -189 -29 -22 -224 198 37 104 337 -209 212 -242 -45
6704 -45 125 -431 236 -47 -29 40 -232 -14 99 17 178 -267 -16 118 136 176 -218 294 -218 -252 448 -73
6726 -73 -97 -132 -239 -175 173 -17 -161 91 158 -277 7 122 -158 80 -192 135 -1 -280 61 80 96 199
6748 199 -112 185 -150 -59 318 -69 515 6 -117 243 -162 -58 102 -309 257 -137 122 -236 213 304 -258
6769 -258 -62 -137 116 236 -115 -170 223 -159 187 189 -31 340 -335 128 117 -180 -31 -91 119 -17 -277 89
6791 89 -259 -19 40 -260 363 -394 -65 -54 -277 -48 -78 13 -39 -36 549 -248 -198 -110 -127 68 -303 -93 -65 48
6815 48 98 121 -432 332 -232 406 42 -337 124 -187 86 116 -318 159 -141 59 105 74 182 178 11 93 -193
6838 -193 68 -71 77 223 -408 434 -7 -198 299 0 -4 22 -46 241 -85 -235 -20 -393 274 -348 23
6859 23 -73 -156 184 44 -255 -55 -170 325 -145 -52 131 -249 119 -334 -352 -25 -405 283 204 -117 289 -141
6881 -141 164 -65 -38 33 -222 403 -190 -353 446 -70 102 6 -153 231 -300 34 261 -160 106 -154 255
6902 255 -132 -67 330 -296 46 215 -395 243 -109 -85 484 -215 -38 277 -338 3 -497 229 281 -97 31
6923 31 -270 -1 -49 31 190 -192 -75 131 -383 373 -94 224 232 -78 238 -164 82 -281 -57 269 -394 180
6945 180 335 -121 27 52 -45 38 -1 206 -62 -108 351 -186 -26 117 -320 305 -176 -43 233 -443 -170 62
6967 62 58 -67 20 164 8 172 186 -165 213 -206 144 542 -208 274 -92 -27 442 23 -153 -200 136 209 -459
6990 -459 284 272 -253 460 -112 -90 -20 -405 24 50 8 178 -216 115 -267 54 164 -170 182 228 32 359
7012 359 -326 14 -182 -326 131 -54 121 -195 -376 270 -118 227 75 -230 174 -349 77 -49 -442 127
7032 127 80 0 -67 -122 17 37 -91 294 -97 310 117 -288 288 -442 183 39 -350 284 152 87 -189 -21
7054 -21 430 -328 281 164 -146 292 -146 -118 -169 -12 241 85 143 87 -145 408 -200 -94 89 8 548 35
7076 35 121 202 -131 8 14 -321 181 -231 -77 -164 -84 42 -189 -2 -253 -66 164 -80 -242 -46 -58 259 -225
7099 -225 -159 -7 -223 17 -200 117 142 -164 251 -120 167 224 -309 379 -214 -178 362 -244 166 163 -161 289
7121 289 -210 129 -178 -49 205 -233 -58 65 -212 236 7 2 178 -357 20 -227 211 -49 -291 361 -227
7142 -227 16 490 -28 -8 138 -234 133 -34 205 -34 -208 158 156 248 116 -273 606 -339 -171 211 -97
7163 -97 425 -335 -137 166 -174 167 195 -217 -38 91 148 -37 61 217 -153 -65 80 -341 308 -320 20 153
7185 153 -102 207 -175 11 190 -364 44 -468 -312 96 -141 12 4 -99 -9 -15 203 -123 -158 13 -206 219
7207 219 -153 110 502 -189 336 66 -238 72 -205 136 158 -42 -79 -468 52 -227 -154 247 -201 -30 297
7228 297 -242 196 -88 -28 198 -261 196 5 -263 104 -251 139 -47 39 221 -14 -36 24 -165 390 -139
7249 -139 294 84 -351 222 -175 58 -87 -308 130 -41 171 -25 -167 139 -93 -110 253 -276 290 51
7269 51 -55 65 -356 284 -22 22 294 -278 150 147 -207 162 11 -133 -17 -220 33 44 415 -173 -115 341
7291 341 -195 35 242 -305 292 84 -161 194 36 230 -244 -1 153 -219 353 23 -234 209 -239 102
7311 102 -145 -82 132 -117 207 -75 -106 20 -314 -122 74 -142 379 -210 -128 240 -386 232 -99 -183 141
7332 141 33 386 244 -67 510 -312 269 -135 72 -47 -369 38 -80 -125 -6 -247 -168 65 163 156 -97 -228
7354 -228 170 -80 281 -372 -50 242 -280 423 -74 -12 233 -183 256 -211 -153 71 -76 -10 -341 98 258
7375 258 -281 191 161 -171 230 -244 -41 -9 -373 169 -183 -51 -78 -257 113 -337 89 122 -3 100 239
7396 239 -171 74 -148 271 -272 139 143 -356 307 -118 -75 311 -108 19 123 -75 369 -60 13 3 55 231
7418 231 49 39 15 66 -24 -350 -63 50 -254 -80 33 -72 311 -148 -217 209 70 139 36 -40 57 202 213
7441 213 -17 362 -9 -121 153 49 -5 -132 -177 79 -197 37 20 -143 124 -161 31 -71 -477 208 76
7462 76 -193 -50 -424 218 -38 -80 352 -216 -226 8 -378 355 -147 109 108 -102 -5 -32 -40 -149 -171 121 -127
7485 -127 27 75 -13 280 -249 -167 163 -184 116 159 -213 120 -177 -90 -124 102 109 -101 -25 21 103 -14 -166 222
7509 222 232 -147 -12 -262 -6 212 -111 145 -125 -98 100 -319 154 139 269 111 -87 468 2 50 193
7530 193 -198 298 -142 -101 285 -102 316 -7 -210 249 -291 122 72 -213 1 -166 -217 4 -266 204 -232
7551 -232 280 135 -213 89 -38 130 110 -48 25 -153 -137 460 -103 -26 106 98 223 -601 -14 72 -12 211 -31
7574 -31 49 -236 -22 219 188 198 -323 -161 225 66 32 7 -257 209 -155 -166 190 -259 213 -84 -140 72 -231
7597 -231 154 19 121 81 -193 -12 -217 -305 222 62 208 -120 -308 214 -315 1 -91 -201 330 -259 -148
7618 -148 258 -3 162 70 194 32 -214 89 34 -216 71 -163 356 -135 -6 355 58 172 -29 2 259
7639 259 -177 -11 100 -164 441 -117 138 53 -192 255 29 51 100 71 250 -248 -278 35 -127 32 -54 70
7661 70 61 -276 -95 -56 -132 173 -361 382 -1 -72 231 -19 242 -7 -331 141 -222 -404 110 -118 -68 -161 88
7684 88 -82 -49 -33 174 40 82 -258 -106 -139 -46 125 8 -131 -279 -50 269 -246 -70 -134 -218 293 51 88
7707 88 158 -152 434 -207 -125 43 -170 31 -228 -202 14 -114 204 -101 66 295 16 341 -57 -64 -50 170
7729 170 161 345 -98 -86 -62 -91 -136 -5 174 -241 -33 -192 -9 249 -22 30 174 -130 124 -100 -36 -58 -120
7752 -120 335 70 53 138 -203 89 100 -12 376 -25 179 -231 183 80 -84 367 -155 -83 62 -201 -79
7773 -79 164 -237 -119 -110 57 -134 -241 0 17 -30 -32 -81 21 -157 -74 333 -116 2 -150 -174 47 25 -58 27
7797 27 17 158 49 -15 -133 -204 161 -159 -20 81 -127 237 -75 -81 229 -465 32 171 -17 83 34 96 -6
7820 -6 -1 -14 -238 105 50 -210 285 -66 32 -50 -108 414 -183 245 94 -104 70 -286 -2 59 -278 234 166 212
7844 212 530 -322 355 -154 -46 356 178 -83 3 22 274 6 50 83 -221 309 -54 -14 224 -2 110 -165
7866 -165 325 -146 -22 145 -243 -129 -23 -314 260 -81 -41 -14 -298 299 34 51 453 -184 106 -26 -131
7887 -131 190 -99 156 -49 -130 -10 -154 133 -105 -38 119 -342 198 70 -95 65 68 51 68 67 64 -206 -37
7910 -37 266 21 76 -222 82 57 -179 178 96 -328 93 -373 163 97 -33 280 -212 -80 -43 -57 352 29
7932 29 189 -193 -303 -21 -333 -4 -89 -188 210 62 157 270 71 338 236 -38 -76 -144 68 168 33 344
7954 344 77 409 120 -390 301 -125 146 -160 -31 -195 -206 -64 -173 192 -108 -225 -93 -73 -302 178 106
7975 106 -11 154 -282 466 -28 -8 300 -258 295 -49 -9 257 82 236 42 -128 182 -32 -4 -14 -36 35
7997 35 7 -318 24 -75 122 -31 3 143 -409 -22 -231 -341 -117 -236 74 -114 3 296 -468 -173 30
8018 30 -7 235 -2 67 -258 -250 204 -407 219 102 33 339 5 164 -48 -92 -31 -6 -213 -74 -63 10 -299 -52
8042 -52 98 -145 135 15 18 455 -82 182 60 152 196 -387 381 250 -93 -39 -418 114 -90 -228 77 -152
8064 -152 -179 70 -442 76 -108 1 121 -214 199 211 332 140 346 -59 -257 181 117 -330 -74 12 65 16
8086 16 2 34 23 -61 85 -253 134 178 -263 -172 78 10 -17 -199 168 -26 -23 -70 100 547 -277 207 7 -279
8110 -279 109 86 185 17 -208 193 118 -134 -42 -244 186 65 155 248 -135 50 120 18 186 -105 -121 225 -110
8133 -110 193 -255 113 -69 -46 269 -82 -154 304 -283 -97 37 -77 -157 51 238 -182 -120 -105 -130 266 29
8155 29 260 111 61 119 -61 17 240 -36 264 -122 -24 254 -160 105 -141 -67 134 -191 126 67 -347 194
8177 194 60 -90 55 -393 105 183 -16 246 -59 370 -7 -162 139 -370
8191c70
$$ Imaginary data points
##PAGE= N=2
##DATA TABLE= (X++(I..I)), XYDATA
0 0 0 0 0 0 0 0 0 0 0 0 2 -8 8 -8 8 -16 16 -24 24 -32 40 -46 54 -64 72 -84 97 -112 130 -148 166 -189 216
33 216 -243 274 -306 345 -384 428 -476 530 -586 647 -718 794 -875 965 -1064 1170 -1289
50 -1289 1418 -1564 1726 -1906 2109 -2340 2604 -2911 3270 -3703 4227 -4884 5729 -6857 8442
65 8442 -10822 14768 -22385 42075 -188948 -322590 276945 -99170 -151644 155815 -176277
76 -176277 -179511 162982 -26876 -91733 79543 -76983 -44787 222065 7998 -96595 60449
87 60449 42597 74581 22276 -15836 43867 -79253 52758 127233 -111796 -47135 32735 -14207
99 -14207 59463 -20136 -90128 17434 31784 -28973 16919 -16907 -95114 29143 29061 -32372
111 -32372 3916 -111379 24729 119288 -130667 22926 89524 -122321 81543 109922 -85808
122 -85808 33987 56444 -31429 73400 39340 -101454 39007 63252 -90187 24083 7134
133 7134 -78569 28010 -31668 6302 22761 -112438 66697 56135 -112072 67811 36884
144 36884 -88349 67205 32303 -85883 57998 28977 -114562 75340 44505 -146124 77713
155 77713 51688 -120915 65501 37426 -50612 40870 10741 5352 24794 9877 9204 -1553
167 -1553 18332 -4211 -13978 13971 -15024 -36720 -9071 24206 -43662 -46485 44494 -40623 -22384
180 -22384 50574 -50131 11524 30260 -34729 57727 1608 -39244 55505 7971 -16772 28665
192 28665 -6283 -18679 36281 -2838 -31971 47892 -29668 -35647 85347 -46755 -40414 68803
204 68803 -47214 -3932 39801 -50040 1078 15055 -25461 1756 5926 -27011 -10986 28624
216 28624 -16059 -9493 19426 -17687 25189 8542 -13849 37553 -18654 5273 40103 -26467
228 -26467 9738 9103 -13907 17245 -7871 -9725 -1372 -1872 -3068 -9067 7832 -16905 -4140 14439
242 14439 -15623 8958 -8844 -6079 21824 -24399 10123 7375 -28001 23777 -6382 -12635 17686
255 17686 -13948 3473 11583 -1303 -1078 6508 13950 -9896 16839 10144 -17703 27095 -6122
268 -6122 -7714 20951 -25731 4884 4383 -23394 6502 -14089 -8865 -1148 -12017 960 -11486
281 -11486 2646 -1455 -4678 14823 -11479 11432 12872 -8093 24629 -1740 4143 19974 -8514
294 -8514 15391 757 -5523 10389 -12209 3663 -7199 -11310 2413 -18572 272 -8994 -13889
307 -13889 5849 -16854 3774 585 -9960 15168 -6858 9248 11920 -4567 20163 -14
319 -14 7189 13916 -5743 14373 -2899 522 7431 -14014 6610 -9760 -9236 3112 -19776 1899
333 1899 -9287 -12730 5548 -15596 4826 -360 -6630 13905 -7036 10658 9012 -2792 19230
346 19230 -2140 9495 10931 -5377 15390 -5370 1600 6067 -13093 6984 -10826 -7276 1636
359 1636 -17909 2723 -10261 -9135 4766 -15078 6074 -2882 -5811 13172 -8049 9358 7364
372 7364 -2197 16165 -1662 9275 7603 -2127 12406 -6421 5973 2078 -10994 11834 -13108
385 -13108 -3261 5999 -19083 6109 -6851 -11383 5944 -11796 -592 -1880 -2239 1976 -5872 11620
399 11620 -5106 2073 15284 -11828 15810 4677 -9023 21364 -7791 -62 12389 -9676
411 -9676 4659 -2344 -2729 -700 -7206 2620 -9711 2365 -1814 -11052 13754 -10119 -1870 11804
425 11804 -11438 9310 -1717 -3568 11795 -12872 5828 2649 -9816 7923 -8277 1288 3661
438 3661 -9211 6165 1143 -14 -1289 7033 8263 -9985 15842 1512 -8319 22086 -15963
451 -15963 1523 17151 -29236 11364 9046 -28183 6865 2151 -15069 2385 2361 -14102 4208
464 4208 12367 -20772 15620 13529 -31462 29442 10311 -26648 24983 -6407 -7696 20629 -15402
477 -15402 -640 9768 -9347 2561 11671 -4493 -10761 14711 3049 -4392 8178 -16413 8954
490 8954 7675 -24017 15486 -9609 -23030 17561 -9345 -6484 -3242 -14537 16451 2353 -8675
503 -8675 7428 3545 5130 10012 9600 -2060 2838 3262 1779 21748 -23864 -17227 34930 -24949
517 -24949 -6689 21954 -37847 8468 16251 -23163 19892 -4520 -26094 31447 13695 -29885
529 -29885 10577 10674 -24121 22956 -1016 -36190 29435 -19440 -20236 51552 -41677 -23742 56148
542 56148 -21363 -5970 35169 -20309 2454 37221 -10345 -4295 28280 -23826 -5179 41435
554 41435 -33043 -24549 21659 -16773 -8523 -5262 -8820 -3206 -17519 17040 3350 -20214 18358
567 18358 -3633 1709 29215 -18710 -6759 34252 -7998 -17888 32302 -5593 -30146 35237
579 35237 -3714 -20730 27737 -24850 5267 31622 -41885 15739 23946 -39930 17488 11591
591 11591 -30515 11473 -1910 -26207 19129 -5451 -38550 32678 1798 -44206 42261 4774
603 4774 -30134 38826 -4446 -1440 31222 -17647 13643 19849 -21264 12496 10170 -19066 212
616 212 -399 -15643 7054 -10687 -28993 27163 -7701 -35625 40951 -8729 -29859 41242 -3876
629 -3876 -11939 20292 -8060 4143 12043 -6299 -4810 2896 4430 -9618 -1484 9050 -9710
642 -9710 -12279 16371 13623 -30330 9963 30435 -35077 17142 24590 -43278 25748 12479 -39284
655 -39284 31528 -3296 -40252 31015 5598 -35507 16602 7999 -25443 21908 3166 -22157
667 -22157 28438 -11437 -10509 39943 -28403 -8620 34698 -24869 2650 14943 -24760 7667
679 7667 10487 -16801 5490 9931 -19075 5756 22273 -18815 386 14484 -9685 9539 -2160
692 -2160 -4534 7658 -15112 9179 3027 -20088 9300 -7650 -5864 15577 -15856 -6277 16255
705 16255 -4061 -4462 15665 -2751 -11097 21851 1229 -8754 14063 -15032 5996 16495 -23703
718 -23703 8771 1194 -17973 19106 -5516 -14138 10384 -8176 -1147 14888 -11000 -13790 18890
731 18890 -349 -12608 19975 -13283 -12819 27569 -12850 -3561 12474 -21126 11860 13256 -14861
744 -14861 2569 1015 -1399 7279 3369 -6503 -3737 6085 -413 6419 -2570 -14353 11509 290
758 290 -3005 6312 -17273 3471 7865 -8639 8153 -9702 -7752 13564 -325 -1805 -2062 -3725
772 -3725 3912 7144 1899 -8488 3480 1800 563 12931 -11461 -3946 10201 -5945 9988
785 9988 -3521 -12876 10631 -3114 85 4630 -11893 -917 5409 834 -3654 -1013 -1663 -4129
799 -4129 12697 -3602 -9426 10780 -7486 3733 10224 -12514 3116 1716 -1058 7036 -5246
812 -5246 -20 493 1233 5763 -3631 362 -1522 2026 4164 -5561 3377 -5461 -2662 9306 -10117
827 -10117 358 1786 -8549 6850 -1961 -2429 1746 -3421 6267 -824 1101 3470 -3832 6244
841 6244 813 -178 1652 -3788 4583 -4084 363 3586 -10231 5527 -19 -6595 6542 -5031
855 -5031 -849 2549 -1834 3159 -3565 3113 672 -3108 7027 -4725 -398 2992 -4262 3933 -3613
870 -3613 96 1684 -5523 6765 -3834 -2080 6325 -5465 4133 1746 -2513 3435 -2527 3890
884 3890 -1670 -1822 4805 -6479 2801 715 -5927 3878 -4275 1174 553 -3482 4702 -4796 2859
899 2859 3415 -6153 6537 -2119 -1504 4914 -4180 2789 -861 -574 2887 -3985 3962 -2031 -430 4486
915 4486 -5321 4344 -951 -2106 6101 -5995 2811 1493 -5926 6153 -3477 -2256 2480 -3298 1215
930 1215 -2577 1194 -689 -2191 5523 -5517 2103 3706 -7061 7610 -978 -3307 6152 -3759
944 -3759 3054 1480 -2389 3651 -2855 2374 -272 -1643 3016 -5243 2789 127 -4306 3168 -4300
959 -4300 1744 -190 -4278 5149 -5405 934 2966 -5515 6624 -3173 -1497 7907 -5718 2377
973 2377 3878 -2498 1389 1116 851 -2500 3149 -290 -4973 8690 -7422 -3128 11228 -12291 1974
988 1974 7483 -11046 5313 1326 -6067 4956 -769 -4160 2139 3073 -7192 998 6536 -10770
1002 -10770 4977 4331 -9567 9944 -2414 -3514 11951 -7225 1144 7767 -4710 2006 1565
1015 1565 -264 -1102 -747 118 -3419 1417 -5317 -1705 4605 -8952 1886 2202 -4563 4997 -4370
1030 -4370 3969 4225 -8048 9677 -222 -4872 8002 -4592 1134 4203 -6877 1854 4858 -6044
1044 -6044 -2986 9643 -5690 -6232 14116 -8971 -2245 13547 -15144 7178 8777 -19099 11308
1057 11308 4464 -17395 8501 2730 -12380 4270 3537 -9831 6468 3391 -12523 14912 2076
1070 2076 -14334 19477 -1582 -9718 16431 -5629 -1681 7228 -7902 2941 1754 -7529 -417
1083 -417 2403 -4148 -4038 4147 -2891 -1921 2307 -2762 6321 -3895 -3465 11794 -8269 339 7285
1098 7285 -9102 7147 -1791 -6862 10809 -6140 -4424 9963 -2930 -3494 6009 611 -1636 6545
1112 6545 -4019 -890 11198 -13711 1940 13016 -21089 5469 8130 -20112 10490 -876
1124 -876 -14688 14861 -4363 -11771 16039 247 -12981 15442 4496 -13671 16527 862
1136 862 -11593 18075 -8661 -6136 17542 -16472 -2413 13096 -13026 -347 4766 -6627 894
1149 894 2535 -3240 1156 2997 -5965 4247 6331 -9739 3389 2857 -3715 5037 -6097 2236
1163 2236 2181 -8318 10861 -2830 -8001 10065 -4829 2721 8071 -11284 1981 10403 -7192
1176 -7192 -1545 9637 -11235 -3779 16788 -12045 -4199 10011 -15990 9879 9095 -20722 9599
1189 9599 3591 -10470 13836 -1098 -10908 7442 2647 -2072 6427 -6490 -8573 15454 -2187
1202 -2187 -9437 11623 -12094 -2051 17837 -11918 -703 4081 -9393 12269 4457 -11357 1320
1215 1320 3145 688 3086 -287 -7851 -310 5836 -1087 2012 -8668 -4817 11140 -3566 489
1229 489 -675 -10462 11316 3319 -5015 5836 -8590 812 12878 -3244 -4152 58 -887 3932
1243 3932 6193 -6807 -5674 6677 -4700 3721 5345 -17471 4430 7216 -8474 8316 -6620
1256 -6620 -9102 12710 -1066 -3156 3906 -5471 -558 9631 646 -6698 4360 -1476 -371 10492
1270 10492 -9518 -2753 8039 -8751 6352 2928 -12162 5634 945 -2786 4977 -3826 -2904
1283 -2904 3117 2117 -2604 163 616 -4821 5026 853 -4320 3924 -4202 2395 3642 -5513 5211
1298 5211 -2139 -2164 7628 -3990 1438 2796 -4425 3148 1673 -2118 -965 339 -1979 -1528 3827
1313 3827 -5319 -2191 3729 -6629 5366 1639 -8258 7286 -1594 -1333 8351 -4794 -1029 4896
1327 4896 -810 621 1393 -1776 -3534 5064 722 -5959 4293 -3626 -1654 7110 -4525 64 317
1342 317 -1467 5557 -2786 -119 242 -3864 4928 -507 -4068 -75 -1343 129 -508 1559 -3541 -1590
1358 -1590 6954 -2942 1534 4120 -5346 5963 3173 -1944 2501 -3181 1928 1235 -2297 698 -4351
1373 -4351 -344 842 -2275 -974 -3034 788 -1323 398 3197 -5525 3210 3637 -3561 5520 -983
1388 -983 -1759 4269 -852 1394 -1060 -485 1672 -2327 2639 -1209 -2408 1930 -1538 1268 -1512 -175
1404 -175 1244 -4074 3763 -1104 -4497 4444 -3602 -577 2237 -3456 625 -650 1101 482 -966
1419 -966 3683 -1594 1958 3512 -2098 2993 282 675 1420 -2068 2787 -3118 -1129 2866 -5626 1148
1435 1148 -271 -4144 2242 -1482 -255 238 -622 2132 -1406 2434 903 -1623 3326 -1417 1374
1450 1374 556 -2090 2522 -3464 874 1795 -5474 3289 -353 -3097 3388 -1153 -153 755 805 39
1466 39 -895 3309 -2747 -215 4209 -4668 1475 1165 -3731 2369 -2030 -53 134 -2393 2794 -2242
1482 -2242 501 1262 -2832 2723 -636 -488 1733 -1442 2018 -540 646 1457 -2303 3467 -516 -502
1498 -502 2053 -2820 2988 -863 -2186 4027 -3901 152 2064 -3649 1361 -681 -2082 565 384
1513 384 -1450 -2303 3528 -2362 -1770 6545 -4681 848 5313 -5230 4201 1375 -3480 4755 205
1528 205 -1655 2103 391 -1296 -151 2121 -3572 275 1313 -4668 3474 -1818 -4301 4904 -3560
1543 -3560 -1300 2991 -3098 985 231 3 1140 -987 2080 -787 1517 1990 -1905 3006 479 -904
1559 -904 1459 -239 823 -2655 1995 1113 -5382 4194 -1650 -3731 5224 -5056 -664 4549 -5338
1574 -5338 887 3520 -3198 -776 3352 -1562 -2152 4316 -3457 -836 5957 -7098 2458 5283 -8287
1589 -8287 5487 2703 -6215 5477 -156 -2720 4254 -928 -2290 3356 133 -4858 3942 172
1603 172 -6598 5101 -1914 -4612 5093 -5018 -415 3716 -5406 2186 2101 -1933 1282 638 1480 -705
1619 -705 899 1977 -1028 1196 -471 721 847 -1625 1408 -1453 920 173 -3813 4923 -3151 -3498
1635 -3498 6988 -5552 -1241 5183 -5783 1366 2600 -5174 1755 3304 -4927 693 5858 -6759
1649 -6759 686 7984 -8025 2998 5506 -8283 7220 1786 -7382 7446 -1018 -5266 5684
1662 5684 -1156 -4715 3112 403 -3911 2799 -1128 -4248 5659 -3005 -3003 6633 -4743 640 4532
1677 4532 -4295 2687 4 -2142 4177 -2158 -868 1379 -761 -35 21 340 -1476 867 331 -427
1693 -427 1802 -3301 1410 2649 -4007 3766 -1180 -2170 5739 -4198 494 4027 -6210 2916 3247
1708 3247 -5613 889 2167 -3720 1092 2709 -6014 1636 4128 -7829 5050 2699 -9244 8015
1722 8015 1001 -6242 7391 -2458 -2785 6757 -2524 -1623 4665 -2108 -2429 4693 -1794 -4100 5248
1737 5248 -3501 -2197 5046 -5905 921 2945 -5657 3537 99 -3178 2971 -1207 340 1060 -743
1752 -743 1131 80 -113 464 1350 -520 -548 2523 -1917 1652 1193 -4123 4441 -1068 -2821 5461 -4759
1769 -4759 -1215 3931 -4609 977 951 -4134 1461 872 -2487 451 1490 -3177 1772 3858 -5020 3705
1785 3705 2045 -4180 7624 -1999 -4374 6736 -3592 -1100 4643 -5034 -1293 3127 -1756 -1564
1799 -1564 1726 -2461 -1930 5161 -2571 -1840 3966 -3664 2187 3172 -3755 2213 -804 -337 2983 -2881
1815 -2881 359 288 -1588 2383 -921 -1540 68 681 59 445 1442 -2785 2208 2851 -3592 3075 -996
1832 -996 -2931 4814 -3071 -1541 1887 -4188 1590 962 -2627 192 99 -410 1091 1467 -1740 197
1848 197 3406 -2095 2281 1198 -4090 3997 -500 -2327 2845 -3551 -89 2063 -2551 866 -514
1863 -514 -851 1237 535 -79 -800 1009 -412 995 1354 -3391 1756 643 -2999 3541 -2664 -1927 3301
1880 3301 -2504 449 1194 -1547 1315 1079 967 -259 663 1250 -718 2022 -1301 -1332 779 -1830 1644
1897 1644 -1351 -2364 2101 -2946 958 1496 -3526 2344 800 -654 2060 -138 -114 569 1466 -470
1913 -470 -662 1589 -2380 901 1352 -3466 1442 -1205 -1094 2557 -2293 799 695 -1117 2858 -285
1929 -285 -571 1054 9 875 -313 604 -1421 -598 1691 -2731 333 11 -2349 2381 -878 -866 1528
1946 1528 -1570 1964 523 -334 1562 -1123 1020 496 -649 462 -1224 434 -566 73 631 -2589
1962 -2589 1257 -126 -908 2573 -2372 68 1449 -1312 1683 -895 -749 1068 -1387 883 -701
1977 -701 -1193 205 -424 1095 -654 227 323 -987 3194 -772 -589 2677 -2366 1962 1646 -2443 1123
1994 1123 -312 -442 679 -1395 -564 -1684 733 -256 -1159 868 -1873 1163 1552 -1468 1510 -1206
2010 -1206 145 2169 -1212 1149 -340 -335 2112 -1128 526 -473 -658 1696 -1281 16 -792 -752 1357
2027 1357 -871 -40 -809 -473 1440 -1652 1043 -660 -1964 3343 -1566 -790 1983 -2368 1550 1622
2043 1622 -1896 449 478 170 -82 1635 -756 -1588 3410 -1283 -581 2348 -3569 1296 1663 -2991 1206
2060 1206 -839 -1140 1771 -686 -583 -467 749 24 -89 615 -2292 1929 1284 -1820 1931 -1294 -689
2077 -689 2500 -988 536 -395 -263 1646 -600 789 -921 -652 2531 -1330 377 171 -1707 1275
2093 1275 607 -214 -1593 -40 1181 -1668 2334 -1560 -2403 3891 -2010 -577 2642 -3564 1111 2466
2109 2466 -1994 631 254 -914 1051 1779 -2037 -1059 2808 -2431 966 2599 -4764 2192 1528 -3168
2125 -3168 3085 -1168 -2390 2625 -781 -1407 512 -35 -1349 976 1363 -2787 1162 735 -2026 2775
2141 2775 -981 -1077 2273 -1325 848 433 -649 999 -833 1344 -425 -1394 1678 -1306 345 593
2157 593 -1503 530 -87 -128 -409 471 -140 -1791 2524 -731 -2008 3446 -2464 -210 3217 -3447 1415
2174 1415 2006 -2997 1505 1123 -2120 735 1720 -1964 516 2645 -3114 1612 2399 -4405 3307 514
2190 514 -4062 4161 -1110 -2575 3239 -1341 -1461 1711 -531 -1091 1266 337 -2472 2158 -179 -1948
2206 -1948 3189 -1193 -744 2310 -1587 910 484 -963 1109 -846 1032 -229 -1030 1525 -1226 0
2222 0 1193 -1680 69 240 -464 -761 751 0 -2011 2178 -938 -1786 3466 -2829 -391 3163 -3443
2239 -3443 1042 1770 -2612 1642 1026 -1623 1138 1264 -1325 276 1997 -2683 1369 1720 -3508 2693
2255 2693 -87 -3111 3339 -1942 -1610 2376 -2107 -351 1389 -1199 -100 911 -80 -520 1749 -677
2271 -677 -799 2801 -1886 789 2157 -2752 1717 728 -1952 1913 -1127 -180 671 -1129 825 -584
2287 -584 199 496 -1003 817 -365 -185 -43 -157 57 -1383 1453 -911 -1378 2631 -2491 98 2550
2304 2550 -3398 1578 1408 -2293 2140 519 -1271 1143 754 -1182 646 1547 -2310 868 1185 -3303
2320 -3303 1985 -512 -2685 2779 -1677 -1030 1943 -1785 732 1246 -942 493 325 152 -193 1145
2336 1145 -245 -632 1440 -646 305 536 -1998 1835 -304 -859 2070 -2306 816 1356 -1223 1393
2352 1393 -397 -617 1153 68 -320 -461 188 -614 -74 760 -2335 516 298 -1275 1854 -1601 -416
2369 -416 2114 -1306 1808 456 -1421 2311 -225 -183 1048 -704 -770 471 703 -1720 16 380 -1801
2386 -1801 2326 -365 -2235 2381 -1010 440 1769 -2124 527 476 -541 873 -843 -398 -93 336
2402 336 -51 -811 442 -1207 1041 1108 -1459 1685 -328 -119 2428 -1158 271 517 -1127 1367 -850
2419 -850 -696 138 -1237 603 -314 -589 -247 -521 526 -643 1048 -110 -1048 2354 -902 12 1682
2436 1682 -1953 1232 992 -884 905 -984 -379 119 8 28 -766 624 -29 162 981 -1283 501
2453 501 -119 -352 1658 -2120 -110 671 -1884 1433 -511 -1433 521 -557 269 -82 -225 219 -169
2470 -169 1423 -63 153 826 -979 1594 -131 -700 1019 -1638 1042 106 -1512 725 -1225 184
2486 184 1025 -881 66 -85 447 463 -218 619 -989 861 740 -1089 913 -1312 80 1114 -1349
2503 -1349 1120 -698 -830 1745 -966 284 304 -761 690 508 12 -422 342 456 -1080 899 -685
2520 -685 -1334 1419 -1482 114 938 -1682 1219 -130 -597 574 -604 662 -23 43 279 -320 858
2537 858 -273 -345 607 -1245 866 -349 -840 897 -1132 694 92 -654 607 -932 221 206 -1130
2554 -1130 655 -774 295 1043 -1120 105 -102 5 203 -136 334 -972 643 770 -1512 1475 -770
2571 -770 -203 2057 -1511 -16 929 -886 738 -34 -813 -237 252 238 -802 835 -964 -714 1724
2588 1724 -1484 207 579 -1709 1730 19 -873 998 -330 454 505 143 -335 -448 954 -673 176
2605 176 771 -1310 1050 237 -689 797 -752 142 387 -545 361 -981 856 153 -909 1248 -1276
2622 -1276 -129 1417 -861 387 267 -542 589 61 125 -706 957 46 -922 1680 -1359 -698 2121
2639 2121 -1866 621 838 -1747 989 416 -1005 244 296 -755 -105 1074 -1024 -354 1500 -1938
2655 -1938 623 952 -2140 1460 61 -1129 1326 -449 -342 445 382 -166 -156 675 -769 132 1011 -1265
2673 -1265 1124 -62 -643 1272 -646 7 -51 -268 318 -665 263 -194 -1179 1383 -976 -103 950 -1279
2691 -1279 766 741 -567 114 337 254 -423 802 -197 -727 1809 -1198 -301 1629 -2056 972 1374 -2101
2709 -2101 1182 413 -1068 677 3 -1116 -26 1022 -1462 26 832 -2021 1161 718 -2115 1737
2725 1737 -214 -890 1797 -967 -268 736 -144 -40 150 563 -598 313 584 -1219 751 -243 -674
2742 -674 750 -819 146 7 -554 826 -790 43 -233 -832 1212 -763 -254 689 -980 626 282
2759 282 -753 75 -1 157 -150 414 -225 -412 1766 -1222 -86 1432 -1670 1145 842 -1802 1444
2776 1444 -172 -1085 1235 -211 -1090 467 392 -1123 247 435 -2178 1098 371 -1934 1765 -758
2792 -758 -839 1955 -907 110 767 -604 509 209 105 -667 99 218 -594 661 -460 -702 1035 -796
2810 -796 407 247 -582 768 -503 458 274 -1144 1171 -711 -311 1120 -1221 11 619 -554 -107
2827 -107 131 -281 -183 719 -311 -751 1591 -768 39 1590 -1714 600 708 -1477 995 -306 -1140
2844 -1140 646 -475 -70 -7 -23 -686 284 616 -946 889 -21 -1030 2020 -829 -139 1368 -1210
2861 -1210 690 272 -805 551 -160 -258 376 -189 -61 28 755 -491 73 664 -1116 788 -35 -749
2879 -749 785 -1032 220 164 -1425 543 -648 -281 483 -685 290 103 -159 606 -29 415 -177 690
2897 690 167 -389 1220 -715 33 1030 -1465 862 266 -1655 1102 -341 -642 615 -503 -10 387
2914 387 356 -125 77 419 -723 670 284 -879 1075 -863 -179 961 -1173 555 77 -604 848
2931 848 -336 92 190 -88 538 -138 53 -101 43 100 -914 406 -512 -889 717 -999 -20 322 -1175
2950 -1175 1081 -224 -495 713 -567 342 189 -55 380 139 347 -115 269 444 -767 907 -655
2967 -655 -166 661 -1535 456 137 -865 794 -524 -174 899 -691 149 -163 -247 -75 -219 245 -813
2985 -813 -107 -25 -768 1084 -727 163 863 -1213 828 -203 -644 1069 -183 102 271 -450 445 -199
3003 -199 230 -80 -439 97 -784 278 -114 -661 804 -735 321 451 -622 849 -358 -176 617 -674
3021 -674 585 -117 -163 533 -326 53 26 -23 322 -213 469 -327 -322 750 -990 697 229 -643 950 -615
3041 -615 -378 538 -910 400 -90 -634 0 -277 98 -329 584 -1 -329 1058 -602 61 676 -766
3059 -766 847 130 -503 792 -262 14 278 -100 277 -447 290 -243 -362 660 -631 148 313 -410
3077 -410 459 -523 264 38 -407 333 -560 -175 230 -561 860 -88 -622 691 -250 272 405 -181 105
3096 105 69 151 -155 275 319 -925 945 -115 -710 984 -1052 -383 668 -866 271 -9 -355 255
3114 255 176 166 -336 630 -148 -465 776 -853 -159 1009 -932 756 100 -535 844 -80 -52 49 -302
3133 -302 189 -472 346 -306 -659 630 -554 347 225 -737 674 -173 -166 346 -340 211 -63 266 212 -850
3153 -850 1097 -264 -216 980 -835 284 756 -421 387 -158 -301 166 625 120 -734 828 -425 -426
3171 -426 953 -1121 -111 1009 -1105 432 158 -763 349 50 -299 -14 438 -250 29 1237 -914
3188 -914 339 1058 -877 617 156 -1083 933 -264 -262 233 -372 -240 47 197 -477 -118 836 -675
3206 -675 296 311 -1148 533 393 -33 393 -537 224 121 606 -63 -873 691 -184 -63 1042 -1303 45
3225 45 894 -414 746 -245 -579 90 791 -178 -893 597 -568 36 1223 -1609 -170 1141 -791
3242 -791 1006 -245 -1076 689 394 195 -110 2 -430 224 1151 -811 -238 550 -801 1240 -31 -1230
3260 -1230 729 -10 -105 585 -806 -252 -119 662 -95 -640 258 -664 684 341 -1037 298 -61 179
3278 179 662 -439 -180 5 701 298 -520 280 -771 58 1281 -960 248 544 -530 822 -206
3295 -206 -445 -80 12 400 -308 584 -839 -427 1187 -1052 92 803 -1129 1075 381 -1141 645 -82
3313 -82 -80 210 310 -546 18 785 -290 434 632 -841 957 70 -731 823 -480 -109 255 -510 168
3332 168 -183 -25 78 -216 570 -193 187 273 -333 402 -151 -133 433 -144 490 -134 242 -14 -535 676
3352 676 -109 -356 863 -752 470 327 -390 506 -178 118 246 -312 223 -100 440 -335 -102 900 -1135
3371 -1135 456 283 -1005 758 105 -504 1047 -373 183 647 -202 89 98 435 -475 513 156 -960
3389 -960 835 -94 -593 869 -755 -132 497 -460 197 -66 106 93 -389 306 -318 243 147 -476 271 -433
3409 -433 -62 491 -362 226 -143 192 405 -375 842 -166 -226 990 -722 50 202 -759 415 14 -93
3428 -93 105 -83 64 -526 466 -102 -435 855 -796 457 483 -623 597 -15 -178 618 -485 112 40
3447 40 -405 364 -292 94 -138 73 295 -565 381 -132 -14 979 -807 220 131 -647 587 -569 -105
3466 -105 185 -451 219 -202 -192 212 -217 136 171 141 237 -451 579 -167 92 382 -657 676 -168 -416
3486 -416 676 -376 197 422 -686 457 -419 10 272 -42 266 -277 405 -128 -259 440 -569 247
3504 247 462 -735 780 -312 8 624 -462 239 57 -744 444 -131 -26 6 25 223 -78 686 -219
3523 -219 -189 507 -549 123 -14 -673 638 -426 -112 239 -553 242 -142 -34 78 -504 151 -116 -146 262
3543 262 -205 469 -18 58 424 -632 535 -170 -108 510 -653 135 233 -429 468 -238 -7 187 -350 187
3563 187 -314 281 -150 75 648 -718 292 404 -544 741 -348 -596 831 -691 134 65 -185 439
3581 439 -123 363 -83 48 -57 -348 614 53 -162 473 -682 261 163 -489 580 -492 7 191 -522
3600 -522 20 -244 -216 389 -271 309 -164 -22 542 -423 134 -251 -94 389 -408 692 -426 -276 494 -285
3620 -285 137 -43 -516 652 -180 -260 160 -179 -164 224 -156 -65 -104 143 -63 481 -137 -561 1044 -320
3640 -320 -135 639 -645 136 365 -537 291 -246 84 168 172 3 -506 438 -257 -457 901 -774 -230 486
3660 486 -402 298 46 -137 -21 27 151 -212 3 38 -549 625 -100 -127 825 -210 431 56 -207 383
3680 383 34 249 -428 64 335 -619 253 35 -529 805 -479 -174 473 -527 435 236 -194 -64 -20
3699 -20 83 -181 287 -291 -531 687 -535 -13 749 -832 343 452 -370 281 -293 -60 16 -47 -78 -493
3719 -493 329 -244 -427 841 -946 -38 568 -489 331 -85 -131 354 -138 -7 -400 70 180 -58 434
3738 434 -244 -294 654 -596 370 80 -590 182 149 505 -396 -94 350 -333 619 -61 -388 676 -362 36
3758 36 462 -958 454 247 -108 59 -57 -81 -56 238 -178 -258 741 -129 109 899 -1024 219 310 -374
3778 -374 388 41 -236 282 69 83 -276 237 -226 -260 683 -888 397 844 -650 733 -539 -426 576
3797 576 -56 80 -103 166 90 -80 435 -524 -71 442 -491 235 -130 -246 371 13 149 -248 -134 189
3817 189 -530 464 22 -386 787 -713 -3 368 -670 297 48 -417 -18 48 -70 -19 371 102 -364 634
3837 634 -413 -150 472 -634 330 414 -121 388 -27 -113 105 183 168 -176 61 -212 -22 381 -742 191
3857 191 174 -513 400 -270 -79 92 -543 68 -75 -332 -333 -212 268 -296 -169 290 -276 288 16 -60 334
3878 334 -290 71 183 -164 256 -338 196 158 -432 411 -625 -18 574 -810 255 91 -387 314 -39
3897 -39 4 -296 203 -112 -114 288 -637 -149 677 -499 484 133 -418 694 39 -140 241 -90 186 -57 -65
3918 -65 -166 -167 601 -714 263 140 -332 378 -251 185 248 -689 266 95 128 243 -525 72 -27 39 453 -477
3940 -477 69 83 -33 287 -345 404 198 -1 237 -621 94 -156 -177 293 -314 88 234 -301 312 -244 -449
3961 -449 160 -227 369 -83 -48 95 -186 399 -385 88 446 -402 398 116 -328 406 -248 258 420 -525
3981 -525 317 -57 132 -131 -222 113 -266 199 166 -713 268 -158 -227 259 -477 320 -216 -178 418 -123 84
4002 84 35 -345 481 -262 99 -294 -162 237 -415 226 -269 -44 315 -326 28 -75 -447 358 -49 -183 275
4023 275 -373 385 -185 -262 337 -189 29 -26 9 58 -81 616 -285 33 610 -451 463 207 -133 629 -379
4044 -379 -42 232 -239 412 -80 -105 26 -86 61 -430 245 138 -400 414 -603 82 40 -502 384 -72
4064 -72 388 717 -361 199 25 -352 382 -215 247 -90 -314 45 -269 150 -72 -123 237 -319 498 -40
4084 -40 -480 65 -389 58 254 -271 176 -7 -362 258 -319 -61 30 -78 103 -239 85 4 296 373 -289
4105 -289 379 65 -282 482 -335 125 40 -516 21 -102 -377 82 -94 -181 -187 65 38 -376 383 -290 -44 148
4127 148 -285 -17 208 -193 137 -10 162 139 114 187 -311 298 85 -15 774 -77 -50 253 -307 -133 -169 -232
4149 -232 -78 82 201 -782 -95 354 -514 365 -166 -298 387 -326 70 64 -170 25 96 383 -336 44 421
4170 421 -475 332 120 -658 446 -288 -206 46 -195 180 151 -120 -123 -118 533 -83 69 -214 -90 378 -419 8
4192 8 111 -309 263 281 116 7 -372 475 167 158 200 -171 581 -270 -288 560 -368 104 239 -263 181 -156
4214 -156 -14 216 -21 77 -161 79 -10 -326 520 -365 -338 749 -203 -65 375 -110 267 -209 73 -254 246
4235 246 373 -507 526 -96 -506 613 -551 93 224 -533 -209 213 -57 11 -127 87 -195 165 -108
4254 -108 -596 756 -294 31 291 -524 265 79 -362 269 79 70 -67 212 228 -215 144 8 -106 324
4274 324 -432 -56 279 -335 335 -347 -291 -252 29 -57 -160 478 69 -434 310 -369 -273 453 -418 207 70
4295 70 -282 -55 113 -137 87 -12 93 -382 526 -99 -166 357 -661 109 470 -476 251 0 -265 77 -4
4316 -4 181 -103 -269 -164 -503 621 -224 -26 414 -380 311 108 -73 172 -17 49 -7 -84 247 -670 286
4337 286 109 -193 529 -425 -142 332 -649 390 -324 -182 3 -206 153 -108 210 -108 -314 536 -286 -480
4357 -480 564 -699 361 191 -195 184 -27 209 172 -68 78 -369 342 -298 -196 275 -394 288 596
4376 596 -584 87 -126 -240 373 -42 -129 -31 212 -22 -390 227 -241 -54 660 -342 165 -6 -457 362
4396 362 -90 -204 -332 -271 671 -261 485 -264 -530 632 -152 -247 203 -323 388 183 32 -346 -158 235
4416 235 -199 300 -79 -453 584 28 -146 464 -343 418 329 -238 -164 -150 -247 21 -74 237 -171 35 178
4437 178 44 394 -610 28 147 -363 403 -278 -271 -17 -143 64 -126 -9 176 -8 370 -6 84 306 -182
4458 -182 646 -96 -265 399 -73 -76 139 5 -69 -362 140 183 -422 176 -191 21 135 -451 62 -8 -181 40
4480 40 -178 85 -119 71 168 -229 163 -452 -132 518 -330 146 241 -112 243 62 275 93 -143 -98 -80 107
4502 107 120 -140 64 -190 33 436 -597 134 -195 -179 284 -350 29 -326 -139 90 -439 80 -228 -169 236
4523 236 83 256 -107 311 483 -86 89 114 -361 325 -1 77 -180 -198 634 -128 97 245 -301 283 123
4544 123 -29 8 4 193 -4 223 99 -243 424 53 30 465 -539 194 221 112 254 -107 39 10 -106 425
4566 425 -238 -111 185 -357 225 -273 93 230 -390 351 -1 -201 110 -141 144 -109 113 353 -49 163
4586 163 84 -210 511 -104 563 -52 -121 487 -89 248 -70 -345 526 -638 35 211 -194 180 -248 -102
4606 -102 7 -307 -90 -75 -174 -72 -52 335 -292 -58 -41 -186 186 -70 -188 331 -430 262 248 -126 320 -194
4628 -194 272 211 -136 -210 -174 171 24 -62 199 -305 94 413 -628 117 -123 -348 134 -409 53 -71 -95
4649 -95 -179 -360 140 102 -233 361 -125 396 280 -62 488 -399 -60 -80 -262 -97 -140 -25 -19 -41 377 -394 -323
4672 -323 7 -270 117 16 -188 197 -151 -15 78 -205 47 30 39 -172 -139 455 -289 196 379 -265 449 -341
4694 -341 214 216 -314 250 -227 -23 191 -333 155 -217 -78 380 -378 410 -230 -88 166 16 26 185 -229
4715 -229 68 -170 230 -10 123 322 -244 819 155 -250 324 -407 -89 304 -402 146 -117 15 73 19
4735 19 271 -430 -79 69 -613 393 -139 -107 257 -364 15 -205 -21 60 73 172 -93 238 477 -291 223
4756 223 278 -151 602 -253 196 356 -270 393 -189 -85 280 8 178 -272 -214 125 -186 577 -100 -119 373
4777 373 -387 39 95 -196 275 24 83 134 36 311 -132 568 37 -430 680 -296 137 388 -267 361 -103
4798 -103 -243 136 34 -106 -502 272 74 -492 250 -377 -464 473 -361 197 124 -493 302 -351 -146 -49 150
4819 150 249 -596 484 63 -150 592 -105 -17 197 -211 315 175 20 -15 -185 -212 -436 -60 156 -323 749
4840 749 20 -340 326 -321 207 177 -27 111 -308 208 40 -19 77 -325 395 -87 -365 592 -273 296 191
4861 191 -355 267 -167 138 69 -287 -72 -169 117 66 -309 516 -132 -287 363 -307 295 -194 5 223 -113
4882 -113 61 51 -93 481 -293 179 -107 -200 383 -180 -15 57 -320 -109 47 -100 185 243 22 -284 358
4903 358 -5 -354 474 -56 -200 252 -407 143 79 -219 221 -93 130 59 -210 261 -22 -53 68 -299 348
4924 348 -246 140 102 -265 358 -111 -5 374 -363 297 -197 83 230 -282 151 54 39 291 -343 164 0
4945 0 -260 -63 -119 87 -404 87 345 -777 361 -23 -101 208 -245 15 145 -198 284 217 -308 130 -18
4966 -18 136 -60 -7 -6 -286 386 -250 -16 282 -145 266 196 -331 376 -332 39 44 -67 490 -374 222 42
4988 42 -147 135 -188 63 146 -356 346 -35 67 397 -168 117 -179 -119 165 -471 126 314 -287 423 -260
5009 -260 156 30 -143 295 -126 70 -227 -67 133 -56 115 62 -106 215 -360 206 -125 -581 233 -93
5029 -93 -68 197 -304 263 104 118 -90 -279 290 -144 94 232 -360 340 296 -81 248 -221 43 182 -14
5050 -14 465 -20 -20 192 -65 -73 -322 42 161 8 27 -458 -128 346 -515 112 -223 237 90 -243 470 -366
5072 -366 -9 106 -282 384 178 -181 451 190 128 -87 -45 99 -186 227 -68 -367 141 -521 -276 96 -171
5093 -171 153 -149 -148 -52 -122 212 -341 -140 180 -148 212 -72 -2 267 -289 400 -191 -320 203 -219 344 -39
5115 -39 76 181 -131 -117 -35 -149 195 12 156 110 -465 262 -151 -35 262 -169 133 8 134 259 -339
5136 -339 -66 -37 -319 233 -316 153 -31 -287 330 -139 -63 58 -116 323 -272 248 409 24 184 -284 -119
5157 -119 166 -256 198 51 -190 208 -93 -32 -189 -105 7 -108 24 182 -169 326 -285 205 167 72 154 -41
5179 -41 253 155 -302 312 -57 154 110 -126 428 -165 -45 324 -228 162 52 -11 155 -254 71 -85 -108 -148
5201 -148 40 265 -100 4 119 -304 269 253 -424 478 69 -3 261 -236 73 63 211 130 -122 166 -207
5222 -207 213 20 -289 45 -92 -72 228 -55 188 18 -251 81 -6 335 -204 116 609 -194 222 397 -280
5243 -280 349 33 66 254 24 112 -182 267 51 -151 77 -352 209 -55 -468 390 -19 -184 123 -332 78
5264 78 -332 -62 70 -164 40 -105 156 482 -319 127 49 -307 331 -431 155 471 -139 159 88 87 366 -483
5286 -483 347 72 -2 27 -146 267 -152 -43 314 -76 104 146 -128 229 -52 162 -261 -84 80 -376 150
5307 150 233 -318 380 -264 -84 295 -181 -1 -102 15 8 -132 156 -161 -197 432 -342 180 -22 -315 365
5328 365 -461 -9 77 -146 219 -78 73 133 28 293 -297 349 121 -88 464 -266 -17 23 -212 294 -183
5349 -183 -271 98 -176 348 -156 65 352 -517 -43 -177 -360 411 -149 29 222 -56 244 -67 175 -131
5369 -131 314 316 -521 386 199 -298 378 -272 74 152 -376 86 15 -58 -32 -43 69 -231 -32 103 -125 115
5391 115 196 -225 222 -293 201 68 -170 167 -267 43 -91 9 225 -318 304 146 -228 596 -253 -55
5411 -55 -30 -96 112 -125 120 -160 188 72 -23 125 75 -556 181 87 -172 408 -101 -8 -93 79 129 -21 115
5434 115 -76 -112 115 -438 712 -56 -51 356 -490 -91 381 -130 -168 85 -201 266 -317 174 151 -108 12
5455 12 -160 220 -218 -146 430 -503 103 -154 -68 278 -52 119 -89 -69 71 -546 412 112 -139 72 152 103
5477 103 131 -241 -285 20 21 -97 -185 259 89 241 106 12 353 -203 -173 301 -397 20 127 -366 61 -23 314
5500 314 -15 -261 26 -205 156 326 -260 227 -281 -86 171 -45 365 -78 -102 7 -363 70 -198 -79
5520 -79 72 -292 356 -141 14 187 -63 258 -259 63 93 -202 32 33 -57 216 -221 352 244 -283 344 98
5542 98 248 105 -357 361 141 -110 102 -95 24 -401 27 -160 -326 424 -127 -172 388 -381 99 256 -334
5563 -334 687 274 15 81 -222 194 -178 106 217 -145 176 -363 75 414 -298 271 -256 -82 186 -170
5583 -170 -2 62 -149 88 -133 10 -35 -89 79 -33 132 135 -16 91 -303 265 174 -43 367 -11 32 -45 -335
5606 -335 461 -17 -365 474 -510 220 110 -37 136 -297 416 -120 27 120 -273 350 93 -19 686 -424
5626 -424 1 322 -149 273 -76 63 187 14 -26 -101 125 -83 -270 87 -309 -11 87 -27 100 -356 -217
5647 -217 108 -146 184 73 -82 137 -134 353 64 -108 341 -235 16 288 -94 -7 -226 185 106 256 110
5668 110 -165 133 153 -132 214 -155 -147 203 -183 306 -307 -232 -32 -242 124 -73 78 97 -215 277 175 83
5690 83 102 -156 186 254 -242 265 -29 -217 -192 48 408 -112 43 -6 -404 223 -151 -6 292 -474 69 11
5712 11 -347 364 -384 72 -94 139 -70 -308 240 128 78 261 -425 80 70 -299 118 109 168 192 -176 234
5734 234 -167 196 189 -221 224 -4 -81 156 -403 256 84 -330 196 -304 11 115 -80 34 -319 65 -374
5755 -374 32 369 -251 3 78 -167 278 16 -10 34 93 487 -58 245 185 -62 183 -229 -42 81 -342 400
5777 400 -161 -137 112 -220 106 -43 -139 73 -332 -24 -163 41 379 -387 216 291 -249 540 -93 97 305
5798 305 -90 -57 131 2 -137 -40 353 -81 -105 183 -237 150 -176 -142 58 -442 132 129 -91 331 -299 289
5820 289 -9 -178 182 -330 384 175 -133 172 -96 55 16 -68 135 78 -30 91 -184 290 -16 82 466
5841 466 -386 390 -163 -145 490 62 -144 113 -302 -70 -1 250 -125 6 218 -233 425 -41 -553 439 -50
5862 -50 -103 266 -211 331 -72 47 -108 -278 301 -147 -84 -76 -286 51 -248 117 354 111 180 -37 -555 374
5884 374 -87 258 -317 -370 335 -199 166 141 -265 172 -63 -134 75 -313 280 43 134 -32 -49 434 -369 177
5906 177 552 -368 206 -195 -310 198 -258 194 -243 -165 160 -236 108 12 -403 53 -69 18 46 -261 219
5927 219 -300 54 121 -228 501 -180 -76 101 -319 -141 -451 -22 113 -537 221 -383 -166 129 -100 -104 5
5948 5 129 115 -330 219 136 -168 276 -470 249 17 -107 235 -360 -312 285 -270 157 32 -54 64 -126 349
5970 349 39 124 -85 -501 422 -170 -112 43 -345 -56 -211 -281 339 25 7 -2 -196 -30 -190 115 132 -275
5992 -275 183 -109 -157 129 -40 260 137 -37 117 113 51 -146 43 317 -71 310 27 -100 91 -334 181
6013 181 -130 -87 442 -192 110 -43 -74 253 -127 45 155 -369 506 -546 -95 57 -163 203 56 -117
6033 -117 24 -158 126 -305 4 -142 -259 400 -93 76 211 -169 151 107 -154 52 -238 61 203 107 12
6054 12 -64 264 158 -311 375 -47 148 62 -101 -98 -8 80 -43 -40 189 -454 -11 301 -208 60 30 -33 224 -222
6078 -222 -75 53 -259 129 -33 -135 -21 30 563 -86 389 96 -417 398 -209 114 200 -392 211 196 -207
6099 -207 -88 -176 72 25 -21 217 -154 268 70 -12 145 -411 58 -66 -189 175 -431 202 -63 -175 262
6120 262 -312 165 231 -309 352 -21 -114 213 -184 119 153 -96 -90 -426 231 -52 -149 293 -192 158 -52 -162
6142 -162 6 -593 190 -135 -194 254 -3 275 292 147 394 -313 244 200 -100 327 -233 -72 287 -188 87
6163 87 -209 19 311 -278 139 -78 -231 143 -45 67 0 -220 343 -3 332 180 17 132 -198 212 -100
6184 -100 -395 497 -150 318 -42 -363 341 -142 -9 303 -386 109 -86 -83 -27 -152 187 -172 279 333 -201
6205 -201 64 -28 -174 487 -664 200 44 9 -97 -205 -1 74 -25 269 3 259 -158 -331 384 -121 -206
6226 -206 170 -335 290 -52 -16 191 -116 61 27 121 301 -271 135 55 -128 429 -438 479 23 -191 334
6247 334 168 -258 -188 227 207 -186 263 -31 -427 615 -239 -73 16 -482 -12 -60 -94 176 -154 294 -211
6268 -211 -221 -29 -251 168 148 135 75 -268 -59 -66 13 184 -242 249 69 28 251 -428 171 60 -305 483 -159
6291 -159 -223 243 -450 126 -209 -53 244 -121 72 -62 -139 -55 -206 383 -263 -78 505 -422 297 -17 -33
6312 -33 250 -159 -252 28 -477 116 -16 101 138 -208 256 -198 28 43 -255 589 -98 70 22 -120 263 -145
6334 -145 -239 234 -61 230 113 -43 334 -315 -15 -25 -76 351 49 204 70 101 190 -135 -84 182 -302 373
6356 373 -343 -27 258 -47 241 -27 -207 151 -146 118 -34 -111 55 -47 226 -381 -338 56 -505 437 284
6377 284 -431 214 -322 -150 462 -62 211 29 140 -32 -280 295 -279 65 43 -392 341 -116 19 73 -195
6398 -195 18 -262 124 205 -81 70 195 -383 185 -156 -62 30 215 239 -276 2 16 -201 323 -239 59 -10
6420 -10 -422 203 -321 -139 149 -387 399 190 -245 481 -81 -154 -142 10 95 -68 99 -97 -29 166 -147 213
6442 213 33 -233 309 -65 -25 203 -225 253 -118 -104 66 -411 168 -342 353 -57 -49 387 -215 197 200 -64
6464 -64 60 -98 -202 11 -30 289 -362 -87 214 -148 75 47 -116 122 34 47 240 -371 248 -197 -116 -131
6486 -131 -351 402 -325 -25 127 -250 55 117 -411 128 -228 -159 -114 -105 -15 -255 72 -180 134 212 -244 187
6508 187 -187 6 289 -353 262 170 -264 90 -108 131 74 -212 82 -175 -295 77 -164 217 58 -306 344
6529 344 -259 304 -30 103 114 77 339 -41 -128 143 -80 57 137 -445 186 -288 -49 71 -527 -3 32 26
6551 26 105 -210 52 -135 162 154 -260 379 -73 -277 332 -305 -49 72 -150 47 -302 -239 37 122 94 -153
6573 -153 58 182 -239 268 -504 -154 -331 -182 280 -201 325 45 -257 99 -54 -105 161 -264 210 -22
6593 -22 -211 183 -263 84 -258 -259 130 -297 254 -162 -199 244 -508 170 -122 -120 412 -122 188 252 -340 21
6615 21 -108 38 169 24 29 -34 85 227 -61 90 -46 45 265 -399 172 -51 -322 184 63 233 144 -50
6637 -50 127 -212 55 58 -98 175 -62 -217 317 -157 32 -285 87 -89 -86 29 -77 51 91 -146 -104 135
6659 135 -266 303 -92 177 -180 -202 380 -147 300 -64 -155 352 -286 78 6 -221 408 -282 180 67 -209
6680 -209 140 -127 -68 155 114 95 -186 -95 83 -272 262 -78 -89 238 -410 2 -33 -174 113 -97 164 226
6702 226 -83 401 -196 -22 123 -165 184 -164 228 235 -304 193 -115 27 -120 30 310 -427 -140 -27 -157
6723 -157 14 -154 -249 131 -283 77 -54 -216 52 -195 140 -122 -188 -25 -177 56 -182 -413 157 -184 -99
6744 -99 72 -229 128 -105 -143 101 -208 161 -63 189 57 -461 108 -98 -166 282 -174 220 -80 -316 210
6765 210 -286 193 -61 -251 10 -231 35 186 -102 97 -11 -110 168 -265 194 -229 25 -65 -178 216 -108
6786 -108 44 154 -335 135 -53 -77 207 -192 94 24 4 306 -179 254 354 142 215 -85 -171 118 -94 171
6808 171 115 -15 247 -266 248 190 -152 37 -119 107 -100 -32 -72 -348 299 -111 -457 324 -264 104 21 -173
6830 -173 47 -78 -65 9 160 157 -105 252 -21 -117 13 -271 -83 194 -76 148 -28 50 161 -330 18 138
6852 138 -51 134 -228 86 -52 -66 159 -201 -133 83 -24 251 35 -9 387 19 118 106 34 20 -99 398
6874 398 -30 61 392 -298 254 -16 -253 131 -257 120 -74 -26 -98 -407 86 -170 -391 50 -328 149 10
6895 10 -168 -10 151 89 -45 -310 109 -100 225 45 -111 558 -259 146 232 -370 -19 -167 53 -7 -369
6916 -369 208 7 47 -19 -83 121 -189 19 303 -376 6 -184 -327 216 -214 104 95 -382 281 -117 118 168
6938 168 66 82 -243 87 56 -38 179 -54 189 133 -149 259 153 -78 196 -187 297 -237 -11 397 -290
6959 -290 168 144 -32 -189 -192 110 68 147 -86 -210 235 -222 -14 401 -272 -59 403 -22 97 -149 4 393
6981 393 -140 315 -86 -100 -153 -289 91 123 43 278 -105 28 66 -212 163 -282 73 145 -182 167 252 311 218
7004 218 -330 -1 -338 -39 258 -239 97 -211 -52 113 -93 146 -275 -353 71 -201 -17 115 13 234
7024 234 -138 354 0 -262 190 -342 65 240 6 58 -102 136 1 75 254 -18 -22 -195 -72 370 -175
7045 -175 -108 100 -227 109 -90 -64 227 -425 198 -136 55 127 -194 196 -72 -44 215 259 -106 69 -65 314
7067 314 -318 33 110 -97 476 -301 -39 313 -444 294 -547 -288 794 -256 -37 101 122 33 -209 121
7087 121 -79 -250 -50 -100 145 -5 -262 392 -252 54 -246 -91 102 29 197 55 -216 252 -68 210 128
7108 128 -116 -70 -227 -48 104 -170 -76 -168 -87 118 -302 18 32 -139 321 -429 40 1 -140 -66 142 141 109
7131 109 65 336 -2 224 -196 -290 -8 -317 -74 129 -135 245 -276 -389 -8 -54 60 101 -136 105 130 18
7153 18 147 2 307 -270 138 145 -4 84 -26 -120 -147 -88 189 -171 39 3 -186 211 66 -155 29 -174 12
7176 12 -80 -41 1 192 -62 -342 -340 178 -290 5 -34 -103 331 -281 56 -170 -257 267 -352 -99 -71 -89 154 114
7200 114 220 60 126 401 -85 174 69 -375 278 -72 23 332 -221 2 140 17 173 -61 77 -58 -160
7221 -160 -213 -321 266 101 -119 179 9 193 160 -162 9 -294 -70 85 -186 458 -13 -24 269 -164 193
7242 193 -7 -206 18 -75 74 79 216 -16 -119 231 -128 123 337 -278 227 60 -150 414 -236 82 395
7263 395 -62 32 -197 256 -60 -142 50 -205 -30 -34 -412 356 -144 -364 -30 -51 255 -56 -359 -133 -205 -113
7285 -113 261 9 241 92 -113 -1 -276 123 -107 202 310 -238 101 -69 49 134 162 172 -107 361 -76
7306 -76 -122 115 -304 -162 12 91 210 155 -109 292 -11 153 -182 -19 6 -72 157 -156 -195 232 1 -19 178
7329 178 -14 83 -96 75 159 79 367 -15 -204 3 -176 490 -99 41 157 -315 319 -276 -63 306 -121
7350 -121 182 293 27 -106 -291 66 77 -197 248 -362 31 75 -208 121 -110 -18 24 -127 243 95 -60
7371 -60 109 -74 232 29 -205 16 -287 157 67 -199 120 -277 34 72 -77 267 -71 40 -27 -208 337
7392 337 -20 -94 55 -344 106 13 219 36 -92 403 221 64 56 -81 163 75 27 7 201 109 11 -246 359
7415 359 -182 -53 195 -15 107 47 84 -20 -67 68 10 68 -1 -186 74 -76 44 -70 -289 66 26 296
7437 296 -54 -105 335 -21 -78 159 -335 -95 -207 13 -45 -255 35 -63 36 271 -200 345 53 -365 221 93
7459 93 -160 75 -91 165 -205 64 85 -309 -181 -104 91 -108 -316 233 -17 163 187 -169 222 -43 -95 153
7481 153 -80 -74 250 172 33 -307 133 14 -173 296 -27 257 355 -69 44 -27 -51 79 -49 233 -122 -122 114
7504 114 -114 345 -89 -9 210 -143 47 88 -64 506 -23 -109 98 -151 151 68 46 142 -68 377 -227 90
7526 90 117 -119 184 15 41 36 -202 25 25 91 146 -123 131 -208 -174 289 -345 -147 158 -127 322 -155 -147 117
7550 117 67 124 30 124 116 -62 97 -135 -234 -53 -128 425 -225 -123 61 -171 63 119 -121 235 -52 136 -189
7573 -189 -100 235 -358 40 99 237 231 -166 125 92 -58 -86 -29 374 204 -216 111 6 -196 83 -48 100
7595 100 -48 275 73 -8 206 -312 64 122 -306 296 -177 90 141 -183 49 -274 -218 -235 -4 181 -44 -357
7617 -357 107 -159 210 245 -302 76 0 174 189 -298 205 -196 -228 75 -401 278 -152 47 116 -236 282 -221
7639 -221 -231 -112 11 -141 125 -13 46 -160 97 198 -21 88 -289 258 138 -34 -93 -199 138 182 -115
7660 -115 194 134 107 263 -202 453 25 -32 -50 -98 203 -251 25 306 -53 -89 171 -187 35 -139 318 26
7682 26 -106 -66 -134 257 208 58 139 -71 -10 123 -175 30 -159 107 135 -273 164 -220 -17 558 -174 135
7704 135 -79 23 152 -270 39 38 49 22 -61 209 104 -141 239 -51 163 -96 20 135 -62 119 118 -354
7726 -354 -69 -312 -45 277 -241 -127 -199 -355 68 -122 229 83 -41 -28 -204 305 -271 -132 279 -129 61
7747 61 88 -195 380 41 38 -4 -322 -48 -39 242 194 -197 14 -310 -30 -21 -65 243 -289 17 60 -169 88 -91
7771 -91 -44 61 -213 59 137 -281 -115 -161 -4 -133 157 347 -239 16 176 40 -23 -298 234 317 -226 152
7793 152 55 -244 -68 -386 -68 59 131 111 234 107 -227 30 -49 -191 399 -263 -377 202 -308 -6 114
7814 114 -513 181 66 -188 183 -34 75 -13 -5 135 -286 309 -18 -107 318 -228 118 -212 -24 215 -53
7835 -53 222 159 -72 143 -105 286 129 57 255 -106 -26 -183 -40 152 -31 -37 -86 24 258 -149 152 49
7857 49 -115 59 -185 -101 276 -168 -37 114 -352 -46 26 197 125 73 198 -45 54 -22 -326 110 -177 -118 24
7880 24 -131 80 -189 263 93 -205 -99 115 147 -34 61 261 -185 -44 141 -153 -183 131 116 415 -14 -45
7902 -45 51 -67 384 14 11 -40 -39 317 -160 57 -47 232 147 -187 -114 71 225 104 140 -59 -128 34 45 -179
7926 -179 176 106 -226 320 -171 -24 83 -53 253 -75 -40 7 -158 -215 -132 -39 369 -100 255 207 -82 141
7948 141 40 58 -204 -90 182 -53 -94 182 -241 199 -139 -14 230 -12 259 49 -183 -22 -160 297 238
7969 238 -125 344 -214 -95 0 -208 216 -15 9 126 -263 55 -30 -54 19 15 175 -11 -8 128 -100 108 -34
7992 -34 72 141 -80 -17 189 57 237 93 70 29 -71 -56 73 -36 82 -289 83 -394 108 182 -237 -30
8014 -30 10 -53 -33 138 113 -119 29 29 -201 -5 -185 -132 69 -202 58 -43 -175 309 92 101 134 -171 227 -67
8038 -67 13 42 -55 213 -162 186 -177 0 102 61 101 -5 -248 307 -276 -213 264 -182 210 -166 104 259
8060 259 -105 234 302 -72 194 -89 -52 -225 150 94 -88 137 2 -202 41 -158 -193 251 -268 237 -85
8081 -85 -40 -189 192 252 -89 -47 174 -173 278 -130 17 132 -263 -158 -22 -335 142 -19 -74 -241 -31 256
8103 256 166 81 -57 -167 414 200 103 126 -150 105 -142 83 101 -145 -71 27 -41 79 -472 446 88 102 429
8126 429 -218 -84 26 -45 -16 3 -20 154 -114 -3 -288 152 -71 -212 248 -210 97 283 -354 199 -14
8147 -14 45 142 154 145 123 54 50 -95 286 -21 99 180 -61 144 -197 69 292 -351 35 122 -269 342 -103 112
8171 112 -4 -161 166 53 25 86 13 76 -300 -111 298 2 -60 -200 -214 50 20 241 -40 -14
8191a4
##END NTUPLES=NMR FID
##END=
