##TITLE=1H_87-2023
 CDCl3
 8 sc, 
 5.10.2023
##JCAMPDX= 6.0         $$ Bruker NMR JCAMP-DX V2.0
##DATA TYPE= NMR FID
##DATA CLASS= NTUPLES
##ORIGIN= UXNMR, Bruker Analytische Messtechnik GmbH
##OWNER= root
$$ XWIN-NMR		Version 3.5
$$ Thu Oct  5 13:56:59 2023 Russian Standard Time (UT+4h)  she@DPX200
##.OBSERVE FREQUENCY= 200.13135
##.OBSERVE NUCLEUS= ^1H
##.DELAY= (6, 6)
##.ACQUISITION MODE= SIMULTANEOUS
##.ACQUISITION SCHEME= undefined
##.AVERAGES= 8
##.DIGITISER RES= 18
##SPECTROMETER/DATA SYSTEM= spect
##.PULSE SEQUENCE= zg30
##.SOLVENT NAME= D2O
##.SHIFT REFERENCE= (INTERNAL, D2O, 0, 15.7039)
##AUDIT TRAIL= $$ (NUMBER, WHEN, WHO, WHERE, WHAT)
$$ ##TITLE= Audit trail, XWIN-NMR		Version 3.5
$$ ##JCAMPDX= 5.01
$$ ##ORIGIN= Bruker BioSpin GmbH
$$ ##OWNER= she
$$ F:/spectra/data/she/nmr/H-F/1/audita.txt
$$ ##AUDIT TRAIL=  $$ (NUMBER, WHEN, WHO, WHERE, WHAT)
(   1,<2023-10-05 13:56:01.46 +0400>,<she>,<DPX200>,
      <created by zg, POWCHK disabled, PULCHK disabled
       configuration hash MD5:
       00 E9 B6 7A A2 85 ED C7 34 08 36 98 17 FE 4E 26
       data hash MD5: 16K
       14 D2 67 7E 59 6F 93 2F 01 1B 4D D7 6A F7 EC E8>)
$$ ##END=
$$ 
$$ hash MD5
$$ 7B 78 75 C9 BD 03 74 62 E2 F9 8B F7 E8 6D 9B B8
##$RELAX= 
##$RELAX= 
##$RELAX= 
##$RELAX= 
##$RELAX= 
##$RELAX= 
$$ Bruker specific parameters
$$ --------------------------
##$DU= <F:/spectra>
##$EXPNO= 1
##$NAME= <H-F>
##$PROCNO= 1
##$TYPE= <nmr>
##$USER= <she>
##$AMP= (0..31)
100 100 100 100 100 100 100 100 100 100 100 100 100 100 100 100 100 100 
100 100 100 100 100 100 100 100 100 100 100 100 100 100 
##$AQSEQ= 0
##$AQ_mod= 1
##$AUNM= <au_zg>
##$AUTOPOS= <>
##$BF1= 200.13
##$BF2= 200.13
##$BF3= 200.13
##$BF4= 200.13
##$BF5= 200.13
##$BF6= 200.13
##$BF7= 200.13
##$BF8= 200.13
##$BYTORDA= 1
##$CFDGTYP= 0
##$CFRGTYP= 5
##$CHEMSTR= <none>
##$CNST= (0..31)
1 1 145 1 1 1 1 1 1 1 1 1 1 1 1 1 1 1 1 1 1 1 1 1 1 1 1 1 1 1 1 1 
##$CPDPRG= <>
##$CPDPRG1= <>
##$CPDPRG2= <>
##$CPDPRG3= <>
##$CPDPRG4= <mlev>
##$CPDPRG5= <mlev>
##$CPDPRG6= <mlev>
##$CPDPRG7= <mlev>
##$CPDPRG8= <mlev>
##$CPDPRGB= <>
##$CPDPRGT= <>
##$D= (0..31)
0 1.2 0 0 0 0 0 0 0 0.06 0 0.03 0 0 0 0 0.0002 0 0 0 0 0 0 0 0 0 0 0 0 
0 0 0 
##$DATE= 1696499760
##$DBL= (0..7)
120 120 120 120 120 120 120 120 
##$DBP= (0..7)
150 150 150 150 150 150 150 150 
##$DBP07= 0
##$DBPNAM0= <>
##$DBPNAM1= <>
##$DBPNAM2= <>
##$DBPNAM3= <>
##$DBPNAM4= <>
##$DBPNAM5= <>
##$DBPNAM6= <>
##$DBPNAM7= <>
##$DBPOAL= (0..7)
0.5 0.5 0.5 0.5 0.5 0.5 0.5 0.5 
##$DBPOFFS= (0..7)
0 0 0 0 0 0 0 0 
##$DE= 6
##$DECBNUC= <off>
##$DECIM= 32
##$DECNUC= <off>
##$DECSTAT= 4
##$DIGMOD= 1
##$DIGTYP= 9
##$DL= (0..7)
0 120 120 120 120 120 120 120 
##$DP= (0..7)
150 150 150 150 150 150 150 150 
##$DP07= 0
##$DPNAME0= <>
##$DPNAME1= <>
##$DPNAME2= <>
##$DPNAME3= <>
##$DPNAME4= <>
##$DPNAME5= <>
##$DPNAME6= <>
##$DPNAME7= <>
##$DPOAL= (0..7)
0.5 0.5 0.5 0.5 0.5 0.5 0.5 0.5 
##$DPOFFS= (0..7)
0 0 0 0 0 0 0 0 
##$DQDMODE= 0
##$DR= 18
##$DS= 0
##$DSLIST= <SSSSSSSSSSSSSSS>
##$DSPFIRM= 0
$$ [...]
##$SUBNAM2= <"">
##$SUBNAM3= <"">
##$SUBNAM4= <"">
##$SUBNAM5= <"">
##$SUBNAM6= <"">
##$SUBNAM7= <"">
##$SUBNAM8= <"">
##$SUBNAM9= <"">
##$SW= 18.05172834244
##$SWIBOX= (0..15)
0 0 2 0 0 0 0 0 0 0 0 0 0 0 0 0 
##$SW_h= 3612.71676300578
##$TD= 16384
##$TD0= 1
##$TE= 0
##$TE2= 300
##$TE3= 300
##$TEG= 300
##$TL= (0..7)
0 120 120 120 120 120 120 120 
##$TP= (0..7)
150 150 150 150 150 150 150 150 
##$TP07= 0
##$TPNAME0= <>
##$TPNAME1= <>
##$TPNAME2= <>
##$TPNAME3= <>
##$TPNAME4= <>
##$TPNAME5= <>
##$TPNAME6= <>
##$TPNAME7= <>
##$TPOAL= (0..7)
0.5 0.5 0.5 0.5 0.5 0.5 0.5 0.5 
##$TPOFFS= (0..7)
0 0 0 0 0 0 0 0 
##$TUNHIN= 0
##$TUNHOUT= 0
##$TUNXOUT= 0
##$USERA1= <user>
##$USERA2= <user>
##$USERA3= <user>
##$USERA4= <user>
##$USERA5= <user>
##$V9= 5
##$VALIST= <valist>
##$VCLIST= <CCCCCCCCCCCCCCC>
##$VD= 0
##$VDLIST= <DDDDDDDDDDDDDDD>
##$VPLIST= <PPPPPPPPPPPPPPP>
##$VTLIST= <TTTTTTTTTTTTTTT>
##$WBST= 1024
##$WBSW= 4
##$XGAIN= (0..3)
0 0 0 0 
##$XL= 0
##$YL= 0
##$YMAX_a= 136615
##$YMIN_a= -181406
##$ZGOPTNS= <>
##$ZL1= 120
##$ZL2= 120
##$ZL3= 120
##$ZL4= 120
##$ABSF1= 10
##$ABSF2= 0
##$ABSG= 5
##$ABSL= 3
##$ALPHA= 0
##$AQORDER= 0
##$ASSFAC= 0
##$ASSFACI= 0
##$ASSFACX= 0
##$ASSWID= 0
##$AUNMP= <proc_1d>
##$AZFE= 0.1
##$AZFW= 0.1
##$BCFW= 1
##$BC_mod= 2
##$BYTORDP= 1
##$COROFFS= 0
##$CY= 11.3945322036743
##$DATMOD= 1
##$DC= 2
##$DFILT= <>
##$DTYPP= 0
##$F1P= 15.7292609196834
##$F2P= 12.9074282941183
##$FCOR= 0.5
##$FTSIZE= 0
##$FT_mod= 4
##$GAMMA= 1
##$GB= 0.15
##$INTBC= 1
##$INTSCL= 1
##$ISEN= 128
##$LB= 0.24
##$LEV0= 0
##$LPBIN= 0
##$MAXI= 10000
##$MC2= 0
##$MEAN= 0
##$ME_mod= 0
##$MI= 1.114404
##$NCOEF= 0
##$NC_proc= 0
##$NLEV= 6
##$NOISF1= 3.799351
##$NOISF2= 2.8
##$NSP= 1
##$NTH_PI= 0
##$NZP= 0
##$OFFSET= 15.70392
##$PC= 1
##$PHC0= -22071.02
##$PHC1= 12.85271
##$PH_mod= 1
##$PKNL= yes
##$PPARMOD= 0
##$PSCAL= 0
##$PSIGN= 0
##$REVERSE= no
##$SF= 200.130013532006
##$SI= 16384
##$SIGF1= 3
##$SIGF2= 2
##$SINO= 400
##$SIOLD= 16384
##$SREGLST= <1H.CDCl3>
##$SSB= 0
##$STSI= 0
##$STSR= 0
##$SW_p= 3612.71676300578
##$SYMM= 0
##$S_DEV= 0
##$TDeff= 0
##$TDoff= 0
##$TI= <>
##$TILT= no
##$TM1= 0
##$TM2= 0
##$TOPLEV= 0
##$USERP1= <user>
##$USERP2= <user>
##$USERP3= <user>
##$USERP4= <user>
##$USERP5= <user>
##$WDW= 1
##$XDIM= 8192
##$YMAX_p= 0
##$YMIN_p= 0
$$ End of Bruker specific parameters
$$ ---------------------------------
##NTUPLES= NMR FID
##VAR_NAME=  TIME,          FID/REAL,        FID/IMAG
##SYMBOL=    X,             R,               I
##VAR_TYPE=  INDEPENDENT,   DEPENDENT,       DEPENDENT
##VAR_FORM=  AFFN,          ASDF,            ASDF
##VAR_DIM=   8192,          8192,            8192
##UNITS=     SECONDS,       ARBITRARY UNITS, ARBITRARY UNITS
##FACTOR=    0.0002768,     1,               1
##FIRST=     0,             0,               0
##LAST=      2.2672688,     0,               0
##MIN=       0,             -181406,         0
##MAX=       2.2672688,     136615,          0
$$ Real data points
##PAGE= N=1
##DATA TABLE= (X++(R..R)), XYDATA
0@%%%%%%%%%%%%%%%%Lj1J6j6J6j6J6j9K7l2L2l6M4n0N7o5P3q2R1j00J12j27J42
39G5j57J72j91K12k31K54k80L08l39L73m10M50m97N49o08O75p50Q38r43J066j214
60f48J401j638J947k373K987l931N541q723J6989p1066j21892L17599n9452k16404
74a39663J93371M0887j90825R0109J42736j67354o5102J99710o8761j38645J69919
85F6382p880j46939J03379K9141q0851M1025K2918m3437k1141N4554K5161r0738
97d8426K6308O9727q1899R517O2685o0815m515N6642j9919n4370M3085P0379r7470
110b9071k3465J29886q1595n3285J32238p5681p1324J27292k4827r4956O2856
121a932M5585p4309p937Q3368n3724m8011J02342l9929n8634R8110l6431n5027
$$ plain form
0 0 0 0 0 0 0 0 0 0 0 0 0 0 0 0 0 0 3 -8 8 -8 8 -8 8 -11 16 -16 16 -20 24 -26 31 -34 39 -43 48 -52 60 -67 75
39 75 -82 90 -101 111 -120 134 -146 162 -177 196 -214 236 -261 288 -320 355 -395 443 -500 566 -648
60 -648 753 -885 1062 -1311 1676 -2255 3286 -5437 11552 -59514 -181406 136193 76741 -139663
74 -139663 53708 94595 -96230 -6121 136615 -30739 -95841 103869 35108 -103537 66382
85 66382 58502 -88437 14942 44083 -36768 4257 27175 -16262 -37403 17151 42312 -48426
97 -48426 -22118 47609 -34290 -24773 37912 -22903 -27418 29224 9305 -45065 -1980 68399 -29071
110 -29071 -52536 77350 -4245 -57530 74708 -973 -72297 54995 30168 -64788 -1932
121 -1932 43653 -30656 -38593 44775 -8949 -56960 45382 5453 -53181 44929 8498 -46529
133d6529P7171j1864l1014J9648r553O238O162Q32r001k0023L4289L33k9473K4831
147A2047j4775k207K5995l4369J3278J2386l3294L1182j0227k5328M2956k5946
159h302j8389M0084j8288r638J5879l071j475o54J7934j6900j4941N1945l0500
172C684l2064O5345l3409k7902N8519l6642k0022M7611k0514k2573J7986J2567
184A2586j7609j1164L3191k2463k0936N4082l1589k8091N6652k8353j9898L9470
196A5878j8954p754J1609m42M403j4620J6169N590l0364L1138N535l4459K4539
209H268K733j3342P807n934R161j3179m403L1703l5656n306M4699l9281n585L8345
223B0030k7403o847K1542l089j2364k2K4742k0186j6794M6116k6180k5248N2507
$$ plain form
133 -46529 30642 18778 -12236 7412 -2141 4097 10259 11091 2090 -17933 16356 16689 -12784 12047
147 12047 -2728 -4935 21060 -13309 -31 12355 -20939 10243 16 -25312 17644 -8302
159 -8302 -26691 13393 -4895 -14533 1346 -1725 -3200 -3854 14080 -2820 -17761 34184 3684
172 3684 -28380 36965 3556 -24346 34173 -2469 -22491 25120 4606 -17967 19 12586
184 12586 -5023 -16187 17004 -5459 -26395 27687 -3902 -31993 24659 -3694 -23592 15878
196 15878 -3076 -10830 779 337 4740 -9880 6289 11879 -18485 12653 18188 -16271 8268
209 8268 11001 -2341 5466 -468 8693 -4486 -8889 22814 -12842 -18148 26551 -12730 -18315 20030
223 20030 -7373 -14220 7322 4233 -8131 -8153 16589 -3597 -20391 25725 -455 -25703 26804
236B6804k5400k2364M0281j6603j3231J6527l53n407r656J8782j106k8726L1349
249A0897j206l2819L3107m553k2526K2255o345l077K370m179J4451j6728J418
262f935K4583k9436O909K2817k6767Q803J0621j2862O013l447O917l551j3543
275i878K5904j4309j7550L4196j9787j2999K8749j8392m595J3546p267M21n378
288g339R204K216k1115K3690k61k5631K9431n948j9486K5646q845p266J0379n290
302f15O663q757J365J4729k2616J0495J3147k6889J6551N856j9917J4420l413
315A019l756N453j0385J2695o544r880K2516j7813l849K3767k1415K675J4224
328H707j3981O815n78n95N851j2827J4369j180j8720K4907q836j6459K4780j2091
$$ plain form
236 26804 1404 -20960 19321 2718 -10513 6014 5661 254 -9402 9380 8274 -20452 10897
249 10897 9691 -23128 9979 5426 -17100 5155 -1190 -4267 -1897 -6076 8375 -8353 -6935
262 -6935 17648 -11788 -4879 17938 -8829 -26 10595 -2267 3746 299 7216 3665 -9878
275 -9878 16026 1717 -15833 18363 -1424 -14423 14326 -4066 -8661 4885 -2382 -1961 -7339
288 -7339 1865 4081 -17034 6656 6395 -19236 10195 4247 -15239 10407 1562 -5704 4675 -615
302 -615 6048 -2709 -1344 13385 -9231 1264 14411 -12478 4073 9929 -9988 4432 1019
315 1019 -2737 2716 -7669 5026 -1518 -11398 11118 -6695 -10544 13223 -8192 -5517 8707
328 8707 -5274 1541 963 368 6219 -6608 7761 6581 -12139 12768 3932 -12527 12253 162
342A62p744J4484r984K462p62j325Q073j5781J0883P750k3638J8748L342k1274
356a4604J9900l466r901J2563p223L974r27m871J4774j4156M80J8081k1074O947
370D97J2155j9405J0743J712r112Q293q501N558P03j3245J7720q848j0873K2224
384I621j4678l796J6335j3953M433M687o806Q128q383N220O858j7326J5228O63
398F231j6549J9021o338r379J5436r821J132M784q285J0194q191j303J2523j6941
412g486O797Q157j7737J2810m93j1420J2832o888O99N640j0874J2364l152p745
426f496J5886j2246M94J3955j6521O402N090j1474J0857o039k844Q155j1840Q424
440A803Q16j2455J5619p767o148J5665j3285K086Q422j1959R696k070o219J0832
$$ plain form
342 162 -7582 6902 -3082 -620 -1382 -2707 5366 -10415 468 8218 -15420 3328 6670 -14604
356 -14604 5296 1830 -8071 4492 -2731 1243 316 -4555 10219 -3937 -3457 14624 -6450 497
370 497 12652 -6753 3990 5702 -3410 4883 -3618 1940 2643 -10602 7118 -1730 -12603 9621
384 9621 -5057 -8853 7482 -6471 -2038 2649 -4157 3971 -4412 808 7666 -9660 5568 6231
398 6231 -10318 8703 2365 -7014 8422 -1399 -267 4517 -3768 6426 -1765 -3068 9455 -7486
412 -7486 -689 7468 -10269 2541 2048 -9372 3460 -3428 -2729 2911 -7963 4401 1249 -6496
426 -6496 9390 -2856 -2362 11593 -4928 1474 6564 -4910 5947 -92 -2936 5219 -6621 1803
440 1803 2619 -9836 5783 -1984 -8132 7533 -5752 -3666 4756 -7203 2493 423 -5796 5036
454E036j0282N397N837j4364J2915n27r762J4521q877j723J1268j0944O050j1
468D534p419J1771j0197j132J1026j5912P335M877j5001J1843k576o371R425q083
482e880M559J998r004J3711p067n476J5235j3260K422J0857j4701P309K882p292
496c707Q754p974K344O671j1830J1083k025j1182J6237p792m997J1388j0746L586
510a90L206p858R084p637p77J0920j4117P465O155j4766J2424N44q465J0001o602
525f13K368L637q532R801o447n046J4457j3643j7J1361j4135O329L450j0001Q818
540A787m387l76N513j0215R499n62j0171J4097p588m475J2863j0965L106N515
554C641r013R330l792k609R758j1309N859O453j2985J0089j210q391J1185p287
$$ plain form
454 5036 -5246 151 5988 -8376 4539 4012 -5750 8771 -106 -1829 9439 -1505 4545 4534
468 4534 -2885 8886 -1311 -2443 8583 -7329 6 4883 -10118 1725 -851 -7222 2203 -5880
482 -5880 -1321 677 -8327 5384 -1683 -7159 8076 -5184 -2762 8095 -6606 703 3585 -3707
496 -3707 5047 -2927 -583 6088 -5742 5341 3316 -7866 8371 579 -4418 6970 -3776 -190
510 -190 3016 -4842 4242 -3395 -4172 6748 -7369 96 6251 -8515 3909 4453 -4012 5989 -613
525 -613 1755 5392 -3140 6661 214 -4832 9625 -4018 -4035 7326 -6809 -480 2970 -7031 1787
540 1787 -2600 -2976 2537 -7678 1821 1259 -8912 5185 -2403 -6878 5985 -4980 -1874 3641
554 3641 -5372 3958 166 -2443 7315 -3994 1865 8318 -4667 5422 4212 -4179 7006 -281
568b81o96M755q738Q507l152p299J2248r818q4J0907j3061N773M357r302R329
583C445m018k158P247r207P159J389j0120J2218n395n022J2048j0176J670O469
597E549r646P775k207m903R291r334K740N693j2158R229n92q848J1200p032j198
612d441P957r862O757P91p328J1327p048j412R915j0913N699L663r790R409l425
627A299l568Q385r250M216L260r819J0385m296o174J1777q885L07P292j0025O358
642A262j6n454P893p226K189N508j0472R095m97q977J2568n976l108R662r259
657b808L961L240p531P892m706j921P874j0350M830L396j0443R683l340n605R883
672D055q554J814N475r206Q088j768n924J0579p494L46P166r096O691M20o585
$$ plain form
568 -281 -977 3778 -4960 3547 395 -6904 5344 -4474 -4558 6349 -6712 -939 3418 -5884 3445
583 3445 -573 -2731 4516 -4691 2468 3857 -6263 5955 560 -4462 7586 -2590 -920 5549
597 5549 -4097 3678 1471 -3432 5859 -3475 -735 4958 -7200 2029 1437 -7411 3789 -3243 -4441
612 -4441 3516 -6346 411 1202 -6126 5201 -1847 -3259 6656 -4257 1442 5105 -4685 4724 1299
627 1299 -2269 6116 -3134 1082 4342 -5477 4908 612 -5562 6215 -2670 -2363 4929 -5096 1262
642 1262 1246 -4208 3685 -3541 -1352 4156 -6316 2779 2282 -6695 5873 -103 -3211 6451 -2808
657 -2808 1153 4393 -3138 4754 48 -1873 6001 -4349 481 3877 -6566 3117 -223 -5828 4055
672 4055 -4499 -2685 2790 -6416 1672 -96 -6020 4559 -2935 -2589 4577 -4519 2172 2592 -3993
687c993R112n846N34O300j0023P529J162r458J0971n479m204J0014r077J720M274
702C536p567O242l095k548O968q475M338L048r905J0466k781o554J1334p717J97
717b513P322q990N621J306o000Q082n702M70N761r029O383J41p418R654o054k176
733c142Q090r312M267K619q471R085l973m397R496q085K131N005q152O986j389
748G58l738P315p223L584L951r605R459j966p240J1508p281j822Q404q724L332
763G12J832n758O344n248L97M902q944O752L61q540J0645m802m373R813p611K151
779a367M323p328P270k062l637Q206p492K433M871q638O882r41n361P771o534
794a604J272M825r187P383j033p549J0466n886l289R054q089K406K955n795N910
$$ plain form
687 -3993 5119 -727 -193 6107 -3916 3613 4775 -4683 6288 809 -3395 6619 -2458 -738 3536
702 3536 -4031 2211 -884 -3432 3536 -4939 -601 2447 -7458 3008 227 -6327 5007 -2710 -2513
717 -2513 4809 -4181 1440 2746 -3254 4828 -874 -404 5357 -3672 2711 2852 -4566 5088 -966 -3142
733 -3142 4948 -4364 -97 2522 -5949 3136 -837 -5234 4262 -3823 -1692 3313 -4839 2147 758
748 758 -2980 4335 -2888 696 4647 -4958 4501 2535 -4705 6803 -478 -2300 6104 -2620 712
763 712 2544 -3214 3130 -2118 -1721 3181 -5763 989 1350 -7190 3455 -1347 -5720 4093 -3518 -1367
779 -1367 2956 -4372 2898 836 -2801 5405 -2087 346 5217 -3421 3461 2520 -2841 4930 -1604
794 -1604 -332 4493 -4694 2689 1656 -5893 4573 -1313 -4602 4452 -3637 -1231 1724 -4071 1839
809A839l752k2N468q743O616J879r321J0866l210n725R944o623N2N530p047M974
825B725j509l589P118p574J917M731r222O984k43o890Q686n346p91O268p704N250
841H11R64o854Q859m503k373P823p342K968L110o449O415k983j979O745q349M691
857A554K888r489R149k099o900R335n791j039N244o639M116p70l732O897o601
872c877K017N373r102P085O25p255R467m348k532P511p394L790K213o550P011
887D034l344k585O631p239K698L127p112O752l021l428P777p514J922M644q784
902e442O819n09o089Q273m708j192N910o283M010J79m078P151n731J185N917r367
918c955O508J624q757Q951l420m346P910o505J000L280n972N230k791j831O088
$$ plain form
809 1839 -1913 -1935 3533 -5210 1406 3285 -6036 4830 1620 -4105 5839 -784 -732 4798 -2249 2725
825 2725 1216 -2373 4745 -2829 -912 3819 -5403 1581 1338 -5552 3134 -2212 -3003 3265 -4439 811
841 811 1775 -5079 3780 -723 -3096 4727 -2615 353 3463 -2986 3429 446 -1533 5212 -3137 1554
857 1554 4442 -5047 4102 2003 -4897 4438 -1353 -2392 2852 -3787 329 -441 -4173 2724 -3877
872 -3877 -1860 3513 -5589 1496 2121 -5134 4333 -15 -2547 4964 -2430 1360 3573 -2977 4034
887 4034 690 -1895 4736 -2503 195 3322 -3790 2962 -59 -3487 4290 -3224 -1302 3342 -5442
902 -5442 1377 868 -5221 3052 -1656 -2848 3062 -3221 789 968 -3110 4041 -1690 -505 5412 -3955
918 -3955 2553 4177 -4580 4371 951 -3395 4515 -1990 -990 2290 -3682 1548 -1243 -3074 3014
933C014p200L461L404q241P968j756n253Q862o226J35O180p663M942J058o002
948c317P342l907j025N159o358L972M30m741O595n222m72O175q905M460K758r125
964f181Q373k203n295Q070n153J78M077m979M367j670j561N873p071L786L615
979D226q678P901q61o979R517n488j867O748o936K771J881n068N354l503q41M551
995B728o547M644K53n895P739m224k347P626p869L229M045q064O775m09m943P378
1011D119m415k42M104n017M067j488k221N321o430K404L883r215P381j83p693
1026e625R086m014l767P632o035J003L166m611M115k558p9M217o429N126R71o712
1042d514Q533l527l690Q621p042Q97N508p750M731O56n272N938l623l50L234n132
$$ plain form
933 3014 -4186 -725 2679 -5562 2406 650 -4603 4259 -1967 -1832 4348 -3315 1627 2685 -3317
948 -3317 4025 118 -907 4252 -2106 1866 2296 -2445 4150 -1072 -1544 4631 -4274 186 2944 -6181
964 -6181 2192 -11 -5306 2764 -2389 -2211 1866 -3113 1254 -416 -1977 3896 -3175 611 4226
979 4226 -4452 3449 2588 -4391 5126 -362 -2229 4519 -2417 354 2235 -2833 2521 -982 -1823 2728
995 2728 -3819 825 1078 -4817 2922 -1302 -3649 3977 -3892 -663 3382 -4682 2093 1684 -3259 4119
1011 4119 -296 -538 3566 -1451 2616 1128 -1093 4228 -2202 202 4085 -5130 2251 2068 -5625
1026 -5625 3461 -553 -4320 3312 -2723 -1720 1446 -3165 950 -1608 -1687 2530 -3899 1227 2198 -4514
1042 -4514 4019 492 -3198 5423 -1619 -722 4786 -2964 1767 2423 -2849 3089 -534 -884 2350 -2782
1058b782M020j245l144O321o224J510N271r042O307J522p914Q301j933m653P434
1073C749m563J52L274l891L444k311r6M021o596M674J314p573P930k381n485Q512
1089D174n577j499O283p031L185J475m510M812l184K45L272n378M941o25m039
1104c456P271n203m31O739q100M038L250p927O899j026m579O336m253m7K831m304
1120a962L697k255j324M866o803L672K782q317P617p80o325Q236l908k266O253
1135C183n248J874J937l775M338k913L40L650n956M895j35n393P395m220k386
1150b414P196p394J936M170p470N101l49m055N000l589M15K712m695M717j825
1165e44k242N979o017K192M176p493N836O91o021P108l105k461N585m693J718
$$ plain form
1058 -2782 1238 -7 -3151 3170 -3054 -1544 3727 -5315 992 2514 -5400 2901 968 -3685 3749
1073 3749 -814 -662 2612 -1279 2165 -146 -242 3779 -2817 1857 3171 -4402 3528 1147 -4338 4174
1089 4174 -1403 -2902 3381 -3650 -465 1010 -3500 1312 -1872 -1627 1645 -3733 1208 583 -3456
1104 -3456 3815 -1388 -1819 4920 -3180 858 4108 -3819 3080 2054 -2525 3811 -442 -489 2342 -1962
1120 -1962 1735 -520 -1844 3022 -3781 -109 2673 -5644 1973 1193 -5132 3104 -804 -3070 3183
1135 3183 -2065 -191 1746 -2029 2309 -604 -264 3386 -2570 2325 2190 -3203 4192 -28 -2414
1150 -2414 4782 -2612 -676 3494 -3976 1125 776 -3279 1721 -1868 -1453 1259 -3436 1281 -544
1165 -544 -2786 3193 -2824 -632 3544 -3949 1887 2578 -3443 3665 560 -1901 3684 -1009 709
1180G09J671m160M281l020n52L989o120L870R95o134O883k904l462P265n610L85
1196a914M575n885L774L66l427M944l552P26K907m989M719r66l377O157m890j3
1212h45N139p027L691J727o192O006k337k703N032m804J698J700m367M626k553
1227a209j270N047n834L267K449o594O353q83m469O759m226l32M401n242L022
1242A239M45l417M758l891N96L129n692M276m6m761N963l532j569N119n791K376
1258g98K468n246N025j514k527M916m340J615K326m249M471j852j904N470n386
1273a525J699L187o033M795m61m497N806l632o76L745m666K683L10l355M508l674
1289a786L23L597n590L849Q51n323O417k737j965N501m843J763K546n022M410
$$ plain form
1180 709 2380 -1780 2501 -519 -1071 2918 -3202 668 1663 -4471 2412 -492 -3954 3311 -2299 -1914
1196 -1914 2661 -3224 550 916 -2511 2433 -1119 -393 2514 -2475 2244 1278 -2099 4058 -832 -845
1212 -845 4294 -2733 958 2685 -3507 2499 162 -2541 2491 -2313 -615 1085 -3282 1344 -1209
1227 -1209 -2479 2568 -3266 1 2450 -4144 2209 1326 -3143 3616 -610 -942 3459 -1783 1239
1242 1239 1684 -1733 3025 -866 -270 2859 -2833 1443 1397 -3364 2599 -933 -2502 2617 -3174 -798
1258 -798 1670 -3576 1449 -65 -2592 2324 -2016 -401 1925 -2324 2147 295 -1609 3861 -1525
1273 -1525 174 3361 -2672 2123 1662 -2835 2971 -661 -1337 2408 -2258 425 735 -2620 1888 -1786
1289 -1786 -1463 2134 -3456 393 1244 -4079 2338 -399 -2364 3137 -1706 57 2603 -2419 1991
1304A991j180k171M528m346J385K709n083M180r07l289N164m587P12L154n649
1319c389L798M31m202N003k874j000M125m494K628J100l626M591k477p98M298
1334C114m933K751J652n141N208j743k591M945m306Q73K584m642L589j070k301
1349b011M209m091J043K604n055L984k12l631N080l273k01L994m887K979R90l755
1365b233M568k621p59M048m334K052J237l882M147k095j528M092m447J819J822
1380A886n119M400r53k834M673l728M34K825m208L057n7k705M454l554N02L296
1396B369m478L196N46l751M780k624r57L928m364J962J360m113M094j659j868
1411a579M066m496J680J715m271L971j404k022M252m096J315K376m407L706l59
$$ plain form
1304 1991 811 -1360 3168 -1178 207 2916 -2167 2013 1106 -2183 2981 -1606 -894 2260 -3389
1319 -3389 409 840 -3362 1641 -1233 -2233 1892 -2602 26 1126 -2500 2091 -386 -1184 3114
1334 3114 -1819 932 2584 -2557 2651 908 -1683 3262 -1044 -171 2413 -2229 1360 290 -2011
1349 -2011 2198 -1893 -850 1754 -3301 683 471 -3160 1920 -1353 -1554 2440 -2447 532 1522 -2233
1365 -2233 2335 -286 -1045 3003 -1331 721 1958 -1924 2223 128 -1400 2692 -1755 64 1886
1380 1886 -3233 1167 214 -2620 2053 -1675 -1241 1584 -2624 433 376 -2329 2125 -1429 -927 2369
1396 2369 -2109 1087 1633 -2118 2662 38 -919 3009 -1355 607 1967 -2146 1948 289 -1579
1411 -1579 2487 -2009 -329 1386 -2885 1086 -318 -2340 1912 -2184 -869 1507 -2900 806 447
1426D47k864M681k962pL137m108K893L61l142M210k815m88L365m398K656P92m217
1443b459M426k106j781M175m232J486J740m050L805j169j862L869l594J203K289
1458A740m172L680n83k596M599l518L39L055m241L074K9l139M340k918n55L107
1474B241l935K209P30l398L814k590p75L275l938K091J484m021M084j296k114
1489b139M336l535R35K051l445L177n72k239M075l218O00K531m255L071k79k818
1505a724L986k816n55L248m364K399P01l422L669j860j206L426l665K014J091
1520I22l626L957j529j422L853l660J685J868l895L717j107k293M273l341K12
1535c86K764l777K528k59k366L553l111K09K624m107K641J42l088M060k332p65
$$ plain form
1426 447 -2417 2264 -698 -705 2432 -1676 1217 1578 -1564 2646 -169 -657 2708 -1690 966 1758 -2459
1443 -2459 1967 -139 -1920 2255 -1977 -491 1249 -2801 1004 -165 -2027 1842 -1752 -549 1740
1458 1740 -2432 1248 665 -1931 2668 -850 -511 2544 -1697 1377 1406 -1733 2607 -311 -866 2241
1474 2241 -1694 515 1245 -2153 1661 -929 -1704 1571 -2367 -276 1208 -2813 1271 -25 -2139
1489 -2139 2197 -1338 -403 1648 -1797 1380 808 -1431 2644 -574 26 2557 -1698 1373 1094 -1724
1505 -1724 2262 -554 -1109 2139 -2225 174 875 -2547 1122 -738 -1944 1482 -2183 -169 922
1520 922 -2704 1253 -276 -1698 2155 -1505 180 2048 -1847 1870 763 -1530 2743 -598 -386
1535 -386 2378 -1399 1129 870 -1496 2057 -1054 -845 1779 -2328 313 455 -2633 1427 -905 -1670
1551a670L315l840K025J462l380L649j777j179L762l425J667J325l554L388j131
1566F37j593L241k965N34K110l854L004k84k867L642k592k96K731l548K419K10
1582E29k847L703k463p0K858l677K462N52l164M123j840j214L487l504J469J346
1598A750l238L087j038j761L240l178J139J577l788L120p75k353L782k932R1K770
1614A493l716K287M20k557L420k234j44K707l247K252Q26l077L455j724r14L301
1630B548l682J617J408l417L017j098j698L151k880O70J500l246K964j054j705
1645a905L326l126R00K006l377K871p5k708L893k238m23K885k965J684O43k508
1661a117L098j991n79K812l652J961Q68l307L375j369j700L267l198Q40J546k892
$$ plain form
1551 -1670 1645 -2195 -170 1292 -2088 1561 -216 -1395 2367 -1058 609 1934 -1620 1768 637
1566 637 -956 2285 -680 -146 1964 -1890 1114 830 -2037 1605 -987 -1283 1448 -2100 319 529
1582 529 -2318 1385 -1078 -1148 1710 -1967 495 1047 -2117 2006 166 -1048 2439 -1065 404 1750
1598 1750 -1488 1599 561 -1200 2040 -1138 1 1578 -2210 910 135 -2218 1564 -1368 -1277 1493
1614 1493 -2223 64 484 -2073 1347 -887 -1031 1676 -1571 681 1507 -1570 1885 161 -753 2548
1630 2548 -1134 483 1891 -1526 1491 393 -1305 1846 -1034 -364 1136 -2110 854 -200 -1905
1645 -1905 1421 -1705 -805 1201 -2176 695 620 -2088 1805 -433 -856 2029 -936 748 1391 -1117
1661 -1117 1981 -10 -589 2223 -1429 532 1400 -1907 1468 99 -1601 1666 -1532 -692 854 -2038
1677b038K513n98j724L070k480N17J808k970K775k17k063L500k671K52K488l215
1693a053J786O75k683L196j818j081K711k841J338O07k492K742j874m97K775l340
1709a849J330J640l514K990l91j987L401k413J90K000k751K245l58j650L333k595
1725c79M23K027l250K473j45k689L267k016o72K774l327J363J085k928K667j127
1741d54r93K533k703J398Q89k558K964j261j448L486l001R07K040l267K494m6
1757I80k307L185j899r1J903k776K160n46j893K772k107k68K362l339J986P17
1773H39k971L037j364j102L038k907J199J021k178K646j187q26K505k720J405
1788D35J151k937K820r28j643L186k453m3K286l261J841K49k105K572j800k69
$$ plain form
1677 -2038 475 -123 -1847 1223 -1257 -740 1068 -1902 873 656 -1407 2093 -578 -326 2162 -1053
1693 -1053 733 1408 -1275 1921 103 -978 1733 -1108 230 837 -1655 1087 -787 -1284 1491 -1849
1709 -1849 -519 1121 -2393 597 206 -1781 1620 -793 -603 1397 -1354 891 533 -1117 2216 -379
1725 -379 44 2071 -1179 1294 1149 -1540 1727 -289 -961 1813 -1514 -151 934 -1994 673 -454
1741 -454 -1447 1086 -1617 -219 670 -1888 1076 -185 -1633 1853 -1148 -241 1799 -1468 1026 980
1757 980 -1327 1858 -41 -132 1771 -1005 1155 609 -1284 1488 -619 -887 1475 -1864 122 839
1773 839 -2132 905 -459 -1561 1477 -1430 -231 790 -1388 1258 71 -755 1750 -970 435
1788 435 1586 -1351 1469 541 -1102 2084 -369 -412 1874 -1387 454 703 -1402 1170 -630 -899
1804h99J816k409J569Q1k118L196k177j60K662l259J643J382l038K809n90j572
1820a064K842k276Q11R95k197K245j161p57K478k895Q61J482l332K611l27k257
1836a941L261k075n82K308k801J930K68k147K607j471j63K155k686K120J81k274
1852a310L031j752p19K844k812R30J531l056K204l82j480K271j944K97J006k115
1868a456K179q18j354K869k727L75K301l299K189M58k429K771j243p08K468k330
1884g54J301P20k033K206j577k57K185k823J573N68k767K826j048j666K868k418
1900a096M08J867k926J902j65j462K476j950N98J331k373K093n74j481L242k480
1916e90J33K337l057J789P22k393K318r51q72J797j956Q32O19j995K134j374m70
$$ plain form
1804 -899 917 -1492 77 158 -1960 1236 -941 -1101 1561 -1698 -55 1327 -1711 1098 508 -1064
1820 -1064 1778 -498 313 1308 -889 1356 195 -562 1916 -979 -118 1364 -1968 643 316 -1941
1836 -1941 1320 -755 -1337 971 -1830 100 368 -1779 828 -643 -806 1349 -1337 783 964 -1310
1852 -1310 1721 -31 -750 2094 -718 212 1743 -1313 891 509 -971 1300 -644 -347 659 -1456
1868 -1456 723 -95 -1449 1420 -1307 -932 1369 -1930 259 717 -1712 1059 -184 -892 1576 -754
1884 -754 547 1267 -766 1440 -137 -394 1791 -1032 541 1109 -1658 1168 120 -1546 1322 -1096
1900 -1096 -688 1179 -1747 155 -10 -1472 1004 -946 -348 983 -1390 703 129 -1352 1890 -590
1916 -590 -457 1880 -1177 612 1334 -1059 1259 308 -564 1233 -723 109 728 -1267 867 -507 -977
1933i77K229k758J243J092k866K664m45j775K883k034PJ972k516J829J08j582
1949i26K210j672N11J471k517J733R3k191L052j882p36K521k728R68J136k558
1965a515K091q94r39K108j955Q63Q69k135K329r77j215L000k687R97J516k714
1981a258K094O5j837K655j832l04J771k224J502j38j399K221k063M7J929k849
1997a620J650N69k331K576j146j055K553k280N17J568k253K011m79j076K093j936
2013f39R70R66k293K504j116j563K968k266J91J885k928J484N57k032K378j504
2029d38l31J346j850J226J89j810K447j478m45K384k792J565Q24k368K652q04
2045C17j414K593j717L32J431k329J659l34j229K225k012L22J256k309K002o18
$$ plain form
1933 -977 1252 -1506 -263 829 -2037 627 182 -1593 1290 -744 -737 1235 -1281 548 656 -926
1949 -926 1284 -388 123 1594 -923 810 903 -1288 1764 -118 -854 1667 -1061 -93 1043 -1515
1965 -1515 576 -318 -1257 851 -1104 -241 628 -1507 822 -155 -1370 1630 -1057 -60 1456 -1258
1981 -1258 836 901 -936 1719 -113 -417 1354 -870 632 494 -905 1316 -747 -700 1229 -1620
1997 -1620 30 599 -1732 844 -302 -1357 1196 -1084 -567 1001 -1252 759 280 -796 1297 -639
2013 -639 331 1297 -996 1508 392 -1171 1797 -469 -278 1607 -1321 163 720 -1312 1066 -438
2029 -438 -769 577 -1273 -47 142 -1668 779 -699 -1144 1240 -1552 13 837 -1531 1121 317
2045 317 -1097 1496 -221 111 1542 -787 872 538 -691 1534 -478 -156 1100 -1209 793 175
2061A75j660K755k234nJ929k569J590M82j993K225q44n31J718j851J169K68j441
2078h17K243j455n64K193k527J178J160k562K132m48j554K178j609J69J254k144
2094a173J423k93j211K098j813K73J404k169J818J98k135K849j673l12K144k213
2110g85R47Q60j736J792p80q18J879j992J013M95k080K139r89j173K509k158L61
2127e16J533k459J539Q5j572K217j436J47J400k030J759l71j150K205j776J05
2143c20J920k440J322N90k110K187r45j011K250k083N84Q60j985J741n13j000
2159i53J908k104R70P37k132K189o57j140K435j938K4J700j977J541K19j508J903
2176A217j038o31J529j717J334n1j561J981j343l72J928k288R01J042k483K187
$$ plain form
2061 175 -1485 1270 -964 -969 960 -1609 -19 463 -1530 695 -149 -680 1038 -813 356 624 -817
2078 -817 1426 -29 -593 1600 -927 251 1411 -1151 981 533 -1021 1157 -452 -283 971 -1173
2094 -1173 250 -43 -1254 844 -969 -696 708 -1461 357 555 -1580 1269 -404 -716 1428 -785
2110 -785 162 1022 -714 1078 298 -520 1359 -633 380 875 -1205 934 -55 -1228 1281 -877 -516
2127 -516 1017 -1442 97 182 -1390 827 -609 -462 938 -1092 667 296 -854 1351 -425 -320
2143 -320 1600 -840 482 1072 -1038 1149 204 -807 1443 -640 -56 804 -1181 560 47 -953
2159 -953 955 -1149 -179 558 -1574 615 -42 -1182 1253 -685 -661 1039 -938 603 822 -686 1217
2176 1217 179 -452 1077 -640 694 643 -918 1063 -280 -652 1276 -1012 -111 931 -1552 635
2192F35q36q78K043j945O06P74j631J654m33q58K020j814M03J093j821J816l53
2209D75j261K223j682r6J849k383J348K85j807J861j045m81J448j791J262J04
2225C09j513J837j138o52K160k237J130R30k180K214m93j340K112j572M51Q84
2241I02j842J766l34j004J791j621J29J355k161J348L4j380K084j669j09J624
2257I13k125J278M78j719J794p90p43J761j821R60P58j885J961p35p51J964j826
2274e28M03J545k302J647k19j168J676j262j05J308j834J111nj452J854j435J96
2291e70J386k057J373L40j938K074q27n44J717j686Q51Q27j781J782q75o25J555
2308A002j475O68J017k099J782n58r45J732j555P6J123j941J458l27j184J903
$$ plain form
2192 635 -201 -1079 964 -981 -375 399 -1232 422 -11 -869 1151 -663 -260 833 -988 828 475
2209 475 -786 1437 -245 -341 1508 -875 473 758 -1049 812 -233 -714 734 -1057 205 309
2225 309 -1204 633 -505 -1157 1003 -1234 -104 826 -1354 860 367 -973 1139 -433 18 902
2241 902 -940 826 492 -512 1279 -342 -213 1142 -1019 329 363 -1017 1067 -602 -711 913
2257 913 -1212 66 544 -1175 619 -171 -914 847 -974 -14 744 -1141 820 85 -666 1298 -528
2274 -528 -125 1420 -882 765 546 -622 1054 -208 -313 995 -839 272 267 -1185 669 -766 -570
2291 -570 816 -1241 132 472 -1466 608 -219 -763 954 -732 119 946 -835 947 72 -553 1002
2308 1002 -473 195 1212 -887 895 337 -608 1124 -431 -355 768 -1173 285 -42 -1226 677
2324F77j168j32J374j895J350n5j273K216j458P4J561k108R70Q35j719J742o35
2341C56p87J673j636M53R38j954J603o36o14J579j721M58J003k054J654m41j046
2358a172J959j549K21J313j695J005L50j249J481o58j47J229j445P36J78j314
2374g57J823j093m79J827k147Q50P29k017K044r81o94J664j503L15R49j660J554
2391D24m13r83J654j336N56P91j661J326Q5j263K008j241o4J287j775R18K62j409
2409h34J698r12m48J332j714Q56L88j535J785r36m67J643j656M41P95j599J321
2426A58k53n04J458j333K29J115j595J181N5j112J961j561q5J407j748J055j9
2443D09j278J710j082m44J368j411P23M56j424J306o62l81J355j506P39N12j249
$$ plain form
2324 677 -491 -623 751 -1144 206 151 -1122 1094 -364 -290 1271 -837 133 968 -751 991 356
2341 356 -431 1242 -394 59 997 -957 646 10 -604 975 -746 -288 715 -1339 315 -126 -1172
2358 -1172 787 -762 -541 772 -923 82 432 -817 664 6 -141 1088 -357 379 557 -757
2374 -757 1066 -27 -506 1321 -826 24 753 -1264 780 -201 -895 769 -734 -419 530 -1130 424
2391 424 11 -972 682 -654 -98 693 -968 358 443 -820 1188 -53 -117 1170 -605 313 575 -834
2409 -834 864 -48 -496 836 -878 -22 366 -1169 616 -320 -787 856 -800 -359 436 -1163 158
2426 158 -95 -599 859 -474 -245 870 -725 456 511 -601 1360 -201 -286 1121 -627 428 409
2443 409 -869 841 -241 -685 683 -728 -5 451 -973 333 -329 -710 645 -861 -122 390 -859
2460h59J596o44q28J577j191L43Q23j386J263l50r03J562j234O6J032j357J040
2477E50p2j175J392j142k48J381j653R60L56j396J368l87q74J532j157L45Q84
2494F64j474J413n17n85J732j576M48R35j751J409k66j060J598j193l8J016j590
2511h35J120j07j167J558r97N4R27j354Q41L01j391J655p03p47J632j389N31P59
2529F88j528J420l11q25J497j452O56O73j496J308m05n46J230j261J49Q67j602
2546i38J208k5j033J416j077j76J301j328P27K85j128J300o97k17J186j534J005
2563B75M23j415J508o02m12J260j312M21L54j328J407m95o19J078r44M59O82j747
2581a007J475m70j032J490p79j72J080j376Q09L89j064R91l13j28Q44j036N90
$$ plain form
2460 -859 737 93 -735 842 -349 -6 817 -569 694 344 -559 1003 -231 -165 867 -490 550
2477 550 478 -697 695 -447 -695 686 -967 -7 349 -1047 321 -66 -940 592 -565 -220 664
2494 664 -810 603 86 -499 1233 -343 105 1040 -711 698 432 -628 970 -223 -261 755 -835
2511 -835 285 178 -989 569 -428 -374 553 -801 40 341 -1050 605 -98 -845 787 -602 -71 688
2529 688 -840 580 269 -556 941 -511 145 818 -678 630 225 -321 909 -352 -203 664 -938
2546 -938 270 245 -788 628 -449 -625 676 -652 75 360 -768 532 -165 -382 804 -730 275
2563 275 698 -717 791 189 -223 1037 -275 146 500 -828 579 84 -535 543 -401 58 740 -1007
2581 -1007 468 -2 -1034 456 -323 -495 585 -791 18 407 -657 334 21 -107 737 -299 291
2598B91M78j265J261p61k85J160j291M44M48j337J336n22q93J336j100M08R23
2615F31j658J148j36o23J447j357L50R64j364Q90J17q82J266p13j05R64j116N12
2633C35J53j043J292r23j94J266j399O10K95j225J132m20p24J342j009K85Q41
2650F14j303Q00r0o90J193r70K68P42j045R58k15p28J268q42j06J043j304O10
2668B03K26j145J293o95n50J246j182N90L76j182J113o50j49J050j259N14O27
2685D26j209J087p5p47J311j021K35Q94j314O57M1o40J082q45J77P19j311Q82
2703C49k70p23J257r02j98Q14j084P89K29j119J141m46m27Q83q33M28O77j297
2721g32J291l60n49J137j207L95Q69j196R76m93o01J202q87j3O99q01M14K8p11
$$ plain form
2598 291 769 -496 765 4 -281 879 -412 32 480 -857 479 -43 -936 400 -700 -292 631
2615 631 -1027 121 -15 -638 809 -548 -198 766 -598 292 409 -473 793 80 -25 939 -177 335
2633 335 488 -555 737 -186 -380 886 -513 97 392 -833 299 -121 -845 497 -512 -227 614
2650 614 -689 111 21 -669 524 -446 -178 564 -481 477 262 -466 802 -40 -146 897 -407 203
2668 203 429 -716 577 -118 -668 578 -604 -14 362 -820 293 -357 -506 544 -715 -201 426
2685 426 -783 304 229 -518 793 -228 7 901 -413 244 285 -355 727 -118 59 778 -533 349
2703 349 79 -644 613 -289 -487 327 -757 32 261 -858 283 -163 -590 293 -540 -112 565 -732
2721 -732 559 199 -350 787 -420 -25 844 -352 624 131 -470 732 -155 -168 531 -270 144 172 -539
2740e39P77n42j33Q29j163O95M60j099J119n95l08J299j096K65N70r40Q96l41
2758A54m22R61r40K97M40r17R56j82r52J225p94p9P23j140O55J88q86J094m47
2777f6l71P08o93O05j35o54J156p51j30J055j041L90M96j088R85k16n36J034p75
2796b7n7O25j039R16k03n31J001j004J65M25j032R09Lr92J223p88P9P26q91K63
2816b29M66n27O18m92j23P95r00P10J74r56R92n68m14J181j056J70O57j121J016
2835C93k94n94R67p59J7N23q56N27lm12Q71q18K43P34j183O70L44o33P98m65l44
2856b74R36r29N64K92r88Q85m55l63P00q78O41J21q09J030l94m50P60j036N60
2875h7N15j263R90k41n24J009o20L80L56r47Q15j93o11J076o51j57Q61j108O13
$$ plain form
2740 -539 238 -304 -437 392 -771 -76 384 -715 404 -191 -499 800 -296 -31 539 -401 495 154
2758 154 -268 693 -247 50 490 -427 529 347 -605 620 -174 -253 470 -670 -15 173 -713 381 -66
2777 -66 -437 271 -422 183 48 -606 550 -201 -331 724 -317 73 569 -519 466 250 -286 748 -27
2796 -27 -84 541 -498 418 215 -316 685 -319 -154 271 -761 148 151 -841 382 -406 -327 399 -492 -229
2816 -229 237 -290 328 -164 -287 508 -392 318 492 -464 528 -40 -454 727 -329 -159 498 -623 393
2835 393 99 -495 472 -287 -270 253 -603 -76 -79 -491 380 -438 -195 539 -644 26 370 -263 535 70 -274
2856 -274 662 -267 297 589 -399 486 31 -332 368 -510 131 252 -557 473 79 -371 389 -647 -87
2875 -87 428 -835 155 -86 -610 399 -221 159 515 -432 383 190 -421 655 4 -153 708 -400 213
2894B13L45r72P68m26j21O43r16L75K42q16R39m12l73J081r79L40K52q94J039
2913C28j28p91J243n96k41P53p98N76k12k74O60n75j02O94j068P12J28j001J388
2932F96r27n2R32j227M01L43q20J003l03n40Q42p08K72M25q08R84m44l35Q15o54
2952a05K61M31p68O47l63o39J251p96j27O29q43N56L2p94R83n62j14N35p17L80
2972a23K30p33P64k70l54Q04p28K18M59q69R24N3m95O52m65J56L50r51Q58l16
2992A64n50O24l17j6O83j070O26J6o03Q15o72K9M58p44L81L04m95Q25o48QP93
3013F11r02L83K64q68P39j38l27P93p62K42L79q49P51k30m63Q12p17J3P01j017
3033e85O35K23q02R84p28n3O09q42O20K98p31O44k99KN58p14K25L43n14O98n46
$$ plain form
2894 213 558 -414 354 -72 -193 450 -466 -91 151 -665 274 -138 -511 570 -409 -69 183 -711 328
2913 328 200 -591 652 56 -185 568 -230 346 134 -140 520 -55 -157 537 -531 181 309 -692 696
2932 696 -231 -283 649 -578 -177 166 -654 349 46 -494 348 -360 -88 337 -471 513 69 -266 549 -105
2952 -105 156 587 -181 466 103 -536 715 -81 -208 421 -422 134 166 -628 355 -207 -321 214 -503 -123
2972 -123 107 -626 138 -132 -486 318 -410 -192 267 -602 322 375 -120 532 67 223 573 -378 480 164
2992 164 -386 238 -79 -95 588 -482 144 160 -443 372 -300 -271 187 -557 -176 128 -367 458 -190 -182 611
3013 611 -291 92 356 -512 227 89 -238 555 -207 35 414 -435 316 86 -377 435 -282 -269 432 -585
3033 -585 50 273 -529 455 -273 -326 283 -559 61 359 -372 272 -27 -25 533 -181 44 387 -127 571 25
3054B5J86K97r42M84M23j052O91k15m96J065p37q3N32o16M95k46j45P27o84L52
3074F1K55q25P78J24q35Q32j82j31L71q82M31M54o18M19l17m6O18q09M50J43p98
3095e07O30l20j55P26p62J64M14p67O22P8n82Q45m78M7L04m91N99j37p16Q60k70
3116A04l2M15p48L79L82r55Q34m20k94Q70p86M3N33p59O18k11m04P03o09L55Q3
3137A01m96P70k75l00N15m93N5N39o89P33j43p13P30k88k2M77p44L34N35r41P69
3158D54n19l27Q77p76K99J04o51P27k87k37P46o37J56K97n50N02j43l93Q42n32
3178d8m3O13r81N47L37q96R90p87J99M60r09M96J31n97R21o99pO61p46K48M23
3199C13o89O89l03l95P34p85L86M18p93P04j12l95P02n40lL00m46L30O6p57R10
$$ plain form
3054 25 211 508 -434 50 473 -579 112 -103 -599 466 -271 -354 178 -438 57 -189 -334 393 -291 61
3074 61 316 -509 269 393 -442 390 208 77 448 -434 -3 451 -167 252 -65 -111 507 -302 148 291 -507
3095 -507 123 -197 -352 374 -388 -224 190 -577 45 123 -459 386 -92 -45 259 -232 367 230 -486 374 104
3116 104 72 487 -261 118 500 -455 379 -41 -335 535 -251 -208 325 -434 184 -27 -431 272 -337 18 101
3137 101 -395 375 100 -200 315 -178 -123 416 -273 460 317 -396 334 46 24 501 -243 91 626 -315 454
3158 454 -65 -392 485 -291 8 112 -539 188 -99 -336 410 -227 -71 226 -324 178 35 -358 484 -48
3178 -48 -91 522 -459 88 425 -471 519 -268 -69 391 -518 -22 109 -488 433 -266 -273 388 -358 -110 313
3199 313 -376 313 10 -385 349 -436 -50 368 -425 279 167 -228 474 -66 -69 231 -215 115 181 -576 334
3220C34n72K21L57p08N56r5o97R95m94nM49p21M08J78q01R07k79l09M75n63K38
3241a26M82o98O92p9l90N77n45J31L69n92M67j26n25R03n70l3M96p65M15r6m42
3262d55P65m91j7O02p44M71J36n58O75l18l68R12r61M86J70o18O84j75m28N81
3282C49o66J89N63p45P24k40o59P12p47L30M97p95N36R3n70P09o13K70K36o28
3302d55N16K71p06O22j20k70N68n22J0L39n86P35l43k69N98n53J11K21m87M05
3322H5o5k98O56n91l2M52o72N79J0n08N46n08L78L89o75K94K51o83P87k82k3L49
3344D39n88L35J25o50O65n36q7P04o59L97j80j50M33l84k4M65p87K42O49m25K23
3365B07k73k52P96n23N7J49m52N79j08m82P73l64m09N84n24L71Rn37P84p02K25
$$ plain form
3220 334 -238 -17 340 -368 188 93 -604 391 -103 -108 341 -380 28 206 -595 312 33 -276 199 -364 -126
3241 -126 356 -342 350 271 -119 458 -87 44 413 -179 288 162 -363 540 -30 -63 433 -332 83 -13 -455
3262 -455 310 -181 -198 404 -340 131 267 -291 384 66 -302 610 -351 135 305 -313 371 196 -232 349
3282 349 -317 -128 435 -310 414 174 -485 227 -520 -190 307 -488 48 141 -429 280 -333 -63 173 -455
3302 -455 61 332 -374 248 128 -142 426 -96 -86 253 -333 402 59 -210 388 -165 -54 167 -320 85
3322 85 20 -278 378 -213 -245 207 -465 114 124 -384 162 -346 32 421 -254 40 291 -392 395 113 90 439
3344 439 -149 186 311 -339 326 -210 -297 407 -252 145 -35 -185 248 -136 -160 305 -482 -240 409 -16 207
3365 207 -66 -318 478 -45 12 161 -291 288 180 -302 471 107 -302 282 -242 129 138 -399 385 -317 -92
3386i2L13m51K81o7l01O40m61j94M88k30NJ96l88L92m9n29Q39l11n9M07o74L43
3408I8N0l03N75k85N8K48r71P86k49l56N39m3l29M80m44M9J66m98O50k79l5L63
3430B70o67K56L83m10M76l09l11Q78o27N0L34n47N32k27k57N26l93M7M3m22N48
3451A73O7n65N63m00j74P21q42M53K47q08P68k06k23O17o26L65J06l43K85k30
3471e2p3P24q85K68L14n32M54k07k08N17l83m1L98m80L67Mq18R71m26n8L88n25
3493b83L21P7m36O03l89M5L86o08M72l1m60M88o6k46M67k85QL10n62J58j55l7
3515b23O37p29J67L58p00O02o5l24N19n52K87K74m82L89ln46O46j97l7M23p23
3536b79M39J03m15L50k51L8K54m68K40K28o31L76J64l86L85l24m6N07n64K97N0
$$ plain form
3386 -92 221 -230 51 -16 -317 323 -138 -332 156 -74 -69 127 -261 131 82 -447 392 81 22 429 -245 98
3408 98 148 -155 420 135 193 441 -530 256 7 -349 190 147 -182 298 -146 -97 69 -429 221 -58 -93 270
3430 270 -397 -141 242 -168 308 -1 -312 566 -61 -11 323 -224 308 81 -176 350 -43 4 47 -375 173
3451 173 240 -325 238 -162 -336 385 -457 -4 243 -565 203 -3 -226 391 -235 130 236 -107 178 -52
3471 -52 -125 599 -286 -18 296 -236 218 11 -197 320 -63 -104 294 -186 181 185 -633 338 -88 -146 242 -283
3493 -283 38 115 -321 282 -107 -62 324 -284 188 157 -303 185 119 -127 340 55 63 373 -189 -31 -186 -223
3515 -223 414 -315 -148 210 -490 112 47 -277 242 -310 -23 251 -231 158 155 -391 255 58 21 444 -279
3536 -279 160 263 -152 198 -53 -15 239 -229 11 239 -392 -16 148 -238 147 -177 -223 284 -280 17 67
3557F7k82M10m38K23L65l93J36k9l53P36l31j75M52n27K30J99l85N43k71l78N43
3578C42l96o7N12o53M51j60l13M51j88r7L83n14N51k03l27N74l76j08L70k89M2
3599a5J93m61O14k51m20P02n07J98J99m98L50o3l10O01n43L23J37n65K84j17p7
3620b26M29n34K74L27n57L89k4k14N16k40j03L19m57K75r9l03L95k11J7J01j72
3641i8K09J62m07L29k19k58L08k76J90J07k57K85j17q3L34l89J71K51n20N77l15
3662a6J17K05l54nM41n63J76K23l84K24j92N3K97m72K48L7k57M39k04k49M70l19
3684h5n1L99n68N44l55J21L20n68L28K18m86L93j74j31M37m18j36L92o05M72j8
3705B9k20M29k90j24L04m29L40l2m38L88j6j39L68l71J72K08l00L42j29k53M42
$$ plain form
3557 67 -215 195 -243 -20 345 -48 88 59 -294 442 111 -64 388 -139 91 290 -95 448 177 -201 342
3578 342 -54 -121 391 -262 189 29 -284 167 -21 -118 265 -249 302 99 -228 346 -30 -138 232 -57 -15
3599 -15 178 -283 331 80 -340 362 -145 53 252 -246 104 41 -269 332 -211 112 249 -316 -32 -149 -226
3620 -226 203 -331 -57 270 -287 102 78 -136 380 140 37 356 -101 174 75 -228 167 -44 -27 74 -98
3641 -98 111 273 -134 195 -24 -282 26 -250 -60 47 -210 75 -42 -125 209 -180 -9 242 -278 299 -16
3662 -16 101 306 -48 -53 388 -175 1 224 -160 64 -128 -75 222 -250 -2 35 -222 217 13 -236 234 -85
3684 -85 -136 263 -305 239 -116 5 325 -243 85 303 -183 210 36 -95 342 -76 -212 180 -425 47 29
3705 29 -191 238 -52 -176 128 -301 39 7 -431 -43 -59 -198 170 -201 -29 179 -121 221 92 -161 281
3726B81k59q0L35m65K84m6k66M41l37J74L53p48N61k73k78N99l77K6K26l12J84
3747B3J70n33M42l23R5L17n09N01j24m07O46j67j67K57l65J94J60l77M35j16j96
3768d4K47k34J25J16m27J19J1k01M99j93j36L91l98Q1O7k26M79n75L45K90m66
3789a30P7j0k05M09k56Q0L44k12j09K09l24K84j24l59M50l09J58P6k72K74l4l19
3811c02M46l15K65J37m92K40L8j19K46k67J68P5j76K15m8k43L41k02Q5J81n73
3832c00L25p2j02L05k54k24M28l62K44K08m50M63l61j13O47m91Q5L56k75j6M1
3853H2k37N17n34J01K84k82M4L81o66N57l42J22K64n13J81K60m66N33k87j66K33
3874F6j66j10J18j15L39m15j28O99n04L09N9k96K44j6j80K26k00J31J20k32J73
$$ plain form
3726 281 22 -58 277 -188 96 50 -216 225 -112 62 415 -333 228 -45 -323 276 -101 -75 151 -161 23
3747 23 193 -340 102 -221 -126 191 -318 183 59 -348 298 131 -36 221 -144 50 210 -167 268 152 -44
3768 -44 203 -31 94 210 -217 -98 -87 -288 211 18 -118 273 -125 -44 23 -203 276 -299 46 336 -130
3789 -130 -53 -63 -268 141 -115 -35 309 97 -12 197 -127 157 33 -326 124 -185 -27 49 -223 51 17 -302
3811 -302 144 -171 94 231 -261 -21 17 -102 144 -123 45 120 -56 159 111 -132 209 7 92 273 -300
3832 -300 25 -47 -149 156 -98 -322 106 -256 -12 196 -254 209 -152 -265 382 -109 -24 332 57 41 82
3853 82 -155 362 -172 -71 213 -69 -25 356 -310 247 -95 27 291 -222 -41 219 -247 286 -1 -167 66
3874 66 -100 -210 -92 -207 132 -283 -411 288 -216 93 152 -144 100 84 -96 130 -70 61 181 -51 122
3895A22Q7m94M92j61k01L11m15K23L13m66K16Q2l55M08j53J63k50n2K60j41q6
3916i7J33n9j43L43l63K32j38j64M42k66K46j10j73K81O4l78L11pk65L93m27N7
3938h8J03k25L50k38pO4l7r1J88l51L64n9k05N23l08P5M47n21K15nl42L34k25
3961c9J79J92m48J89N3j32O5j84K16r9j14L8J65l07K02K35l42K78k93J48J91j74
3983A9J21Mk00K87l70J30R9k06K18N3k67N09m30p9M06n29L36J6m77M83k02O1K14
4006A96o10O40k82j62L78l32p3L53j90K28j14l22L84j52K1K73m98J80K10l71L14
4027G1n5k61L91j78l7L66l99M51l23j89N53o21J59K14m36L10r7k8K87m2j54K2
4049DoK21m1j94K11l23K90p2k07K73J96m33K54J5m62K41l3Q3m4K8q1n6j42K57
$$ plain form
3895 122 209 -285 207 46 -155 156 -259 -36 277 -189 27 109 -246 162 9 172 -78 -130 130 -11 -97
3916 -97 36 -23 -166 177 -186 46 -92 -256 186 -80 166 56 -117 164 228 -150 161 154 -111 282 -145 -88
3938 -88 15 -210 140 -98 -105 -41 -78 -169 19 -332 32 -27 -232 291 -17 58 505 -16 199 194 -148 186 -39
3961 -39 140 332 -116 73 126 -6 59 -125 91 -8 -122 -84 81 -226 -24 211 -131 147 -146 2 193 19
3983 19 140 144 -56 231 -139 -9 90 -116 102 155 -112 397 -33 -112 294 -235 101 117 -360 123 -79 -18 196
4006 196 -414 226 -56 -218 160 -172 -245 108 -82 146 32 -290 94 -58 -37 236 -262 -82 128 -243 71
4027 71 16 -245 146 -32 -69 297 -102 349 26 -163 390 -231 -72 142 -294 16 -81 -109 178 136 -18 4
4049 4 -2 219 178 -16 195 -128 162 90 -117 156 352 -81 173 188 -274 -33 -66 17 -27 1 -80 -136 -278 -21
4073b1p6r9J99j00J42j4m11M62j37j47N19m17J63K57m49L54l62j8K82l16J75J21
4095A07m34N79l67j22M80l54K04j18k35K65K4j69M18m63J75Ll41M68n5l93N66
4116B38k6k40J25j81Q7m8j41L32j99k08L35l16K0L83k77J50o5k16L73j93M4J21
4138I8k83K64p4j17K05j09K2J22j54J81L9k36J34r8l4K07m69J93L24l34L17k01
4160cO1K25n29K29J79l70M26j76j53K05j87nK92k11J82j23k49L74j55K09o6j67
4182a2K38j72n0J88n78L81L84n38K58R6m63L99k52nJ89j94K00k37J51J77q8r5
4204b3J65k42J86j3k08K06j40j19K67j26J74M9k82L56j27j73L78l70J11K32l68
4225f7M7N7k32J48j87kL62l58L18N3k51J64o1J26Q9m64L78Qk72K75l54j1M58m40
$$ plain form
4073 -21 -97 -196 3 -97 45 31 -380 82 -55 -202 317 -100 63 320 -129 225 -137 -155 127 -189 -14 107
4095 107 -327 252 -115 -237 243 -111 93 -25 -260 5 29 -140 278 -185 -10 -7 -348 120 65 -328 238
4116 238 212 -28 97 -84 3 -45 -186 146 -53 -261 74 -242 -222 161 -116 34 -31 -247 126 -67 -23 98
4138 98 -185 79 5 -112 93 -16 6 128 -26 155 194 -42 92 -6 -40 167 -302 -109 215 -119 198 -3
4160 -3 58 283 -246 -17 162 -208 218 42 -111 94 -93 -98 194 -17 165 42 -207 167 12 221 155 -12
4182 -12 226 54 4 192 -386 -5 379 -159 99 195 -268 131 -121 -126 63 -131 69 -168 -17 160 72 -23
4204 -23 142 -100 86 73 -135 71 -69 -188 79 -47 127 176 -106 250 123 -50 328 -42 69 301 -67
4225 -67 -20 37 -195 -47 -234 -236 126 -232 86 139 -112 52 -9 117 206 -258 120 128 -144 131 -223 -234 224 -216
4249b16L46M6j70p7P1r1K63j97L5p5j48M22j24k30M9J00k53L30m05M99k04k13
4271b42L41j64N4K35m45K85l9p0K25l17L8K74k53oK58m33L25J50m70L60k32J76
4293E0Q4l34L24j10j09J01m4q4J78pj9J06l76M26j8k19L26l43K14j01j56J98j60
4316g3k7L49k68R5R2k43R5q3j39L98l92N5M93n49J67k5k3L43k06m1L10n49K16
4339eJ26j78J51j99K01J8j17R2r3k39L57j20n9K56k76R5kk29K93k75M8L58l68
4362a65J43J75m35M84k21l49L94j10p4N67m71k7J96l98N06l11R0K27j79NJ13j35
4384B5R0j30p9K83m06J65K36l41K63l5j35Q3l53K89L2j56K41j78j87O27n68R4
4406a40K54l13J11J05j29J87r5oK49l21L9j6q8L25j03j39J15m08M68J69l34K32
$$ plain form
4249 -216 130 176 6 -71 0 -91 172 -25 10 -65 -213 209 85 -145 -96 4 -249 81 -324 175 -29 -242
4271 -242 99 -65 -11 224 -221 64 25 -45 180 -137 -99 175 -78 -84 174 -259 66 216 -254 106 -126 50
4293 50 134 -200 124 14 -95 6 -38 -122 56 49 30 136 -240 186 168 -51 275 -68 146 45 -111 87 -73
4316 -73 -100 249 -19 76 168 -75 20 -63 -202 196 -196 -141 352 -197 -30 -55 -78 265 59 18 328 -221 -5
4339 -5 121 -57 94 -105 96 114 -3 89 -4 -243 114 -6 -65 191 -85 10 8 -221 72 -203 -155 203 -165
4362 -165 -22 153 -282 202 -19 -368 26 -84 -158 409 -62 -89 107 -291 215 -96 -6 221 42 47 160 25
4384 25 115 -15 -94 189 -217 -52 184 -157 106 71 -64 19 -334 -45 -13 -169 72 -106 -293 334 -234 -140
4406 -140 114 -199 -88 17 -112 75 -20 -26 223 -98 -59 -75 -163 162 59 -80 35 -373 95 264 -70 162
4428A62k15j41K96m38L32J34j46K44k57q5M15m48NL55m20L09j09L1J70m04K84
4449G4q1k48K05L20m70L82l07J1K80l53L65P4m27J94j16J60Rk8o4L02m32K57j26
4472a9OL45m84J75J43j99K24j97j42K56%j67L84l46J87j25j36K12l08N9K08k70
4494a94L44M0m73K69M0q3J23M9k3N0k74K33KN0k10L2JJ65m29M98k21j88M95m32
4518a36J7L12l97K95o8k34L50k11k37L63j17r7K91j96K23k28K04l0l05K58J15
4539A72k55J73j11k17L22j78O3R2j82L16k26l08L06n8L1J18l27K62J67l65K85
4560H0k20j11M84m33J00L06l91L87l64R9K50k62J6J09m35M84q3j27L36l62R8J07
4582F8k22K12k2k66L21k54J51O0k70K18P8l82K98l3NK27k33L5N5r9L05l79N4J77
$$ plain form
4428 162 -53 -194 102 -336 -4 130 -16 228 -29 -114 301 -147 -142 213 -207 102 -7 24 194 -210 74
4449 74 -7 -255 -50 270 -200 182 -125 -114 166 -187 178 252 -175 19 -97 63 72 44 -20 282 -150 107 -19
4472 -19 -13 332 -152 23 166 -33 191 -6 -148 108 108 -59 325 -21 166 41 -95 117 -191 -132 76 -194
4494 -194 150 190 -283 -14 26 -57 66 115 92 142 -132 101 103 153 -57 -25 -24 141 -288 210 -11 -199 296 -136
4518 -136 -119 193 -204 91 23 -211 139 -72 -309 54 -63 -160 131 -65 158 -70 134 104 -201 57 172
4539 172 -83 90 -21 -238 84 -94 -31 61 -121 195 -31 -339 -33 -91 -60 58 -269 -7 160 -205 80
4560 80 -140 -251 233 -200 -100 206 -185 202 -162 -63 187 -75 -59 50 -385 99 16 -111 225 -137 -39 68
4582 68 -154 58 36 -230 91 -163 -12 48 -222 -4 74 -308 -10 -43 -38 189 -44 -9 46 -53 252 -127 -73 104
4606A04j89J91K7l13K74L2k16J69k21J35K32l48J56l6j34J73j07n3P1j2K3J6R
4629a7RRj37J92j29J74N4m84N88l52n3O8p9J85J12j39K62n54K04J77k70P0J06
4652dk03L44Pl98L67l47J84K33l66J55J88k11L71k76j8J98k94k3J27j09J56k6
4674E5q8K45l03N9J53k55K22k49OL44k80Q6P9k07L00l64J86K33l40m5L44k09J42
4697A14q9q1L13m09J19J00k83J80J4L9L28n45M8M34n09L87n6l16K09K42l40L64
4719B63k86K7Or9K17k32JJ30m4J1J6j08J96Ko5j0p9J34J68m80M12k23j02L67j14
4744A08j14J46m49M80q7k83K71j1Q9o5j46l5J68j71N3j20J13R8k78N2L47l41M10
4767B35j40j19rj45L65l04j0J90n8p4K08l17n2K80j40K99o5k54K04l80J33K03
$$ plain form
4606 104 -85 106 133 -180 94 126 -90 79 -142 -7 225 -123 33 -3 -137 36 -71 -124 -53 -65 -42 -26 -17
4629 -17 -8 1 -136 56 -73 101 155 -329 259 -93 -146 -78 -157 28 140 1 263 -291 -87 90 -180 -110 -4
4652 -4 -207 137 144 -254 113 -234 -50 183 -183 -28 160 -51 320 44 26 224 -70 -93 34 -75 81 55
4674 55 -33 212 -91 -32 121 -134 88 -161 -155 189 -91 -5 74 -133 167 -197 -11 222 -118 -163 181 -28 114
4697 114 25 -56 257 -152 -33 67 -216 -36 -22 17 345 -200 -152 282 -227 160 104 -212 -3 239 -101 263
4719 263 -23 4 10 -89 128 -104 -103 27 -17 -6 10 -98 98 100 35 25 -54 80 248 -232 180 -43 -145 222 108
4744 108 -6 140 -309 171 84 -199 72 61 150 85 -61 -96 72 -99 -46 -166 -53 45 -233 -181 166 -175 235
4767 235 95 -24 -33 -178 187 -117 -127 63 5 -69 139 -178 -230 50 -90 209 144 -110 94 -286 -153 50
4789E0j43k9J22RO0q3LJ25j69J00k7r7J14P2k6o2j74J78K16l38P1P0j49K82j79
4814dJ6J88j15k4k95N7M24l61L6K84m13K71l9p7J35o5N7p0j31R7J2k45L46o7M7
4839F4m3o0J87P9m47J10R9k08N91k78k6m6K1N1n6j88J64pj46K37k56J7J27J3J35
4864A34j62j4J68k41J71j07L4K30k92j57J80K5j1J07k08K02j70N1j0j02J82J2
4886B2l4K46j69mQ6j30j19K50m22M67k16k30L23q1j50O9L2J12K01k89N5L3j51
4909i9J40l75M81L1k31J6J71r4l%K8N1k06J54q5p9J41p4j03K47j86J44l3q9oP7
4935A8J24j69j93J83j17J95K33k30j96L42l74K17K1l43L50r0o5R4N7J50o8m59
4957c20L70J32j40J11k13J44L2j63J92j94k27L35k44O0K46n2j3j09O0K74l69P
$$ plain form
4789 50 -93 -122 0 9 69 -14 -11 114 -55 45 18 -79 35 107 81 19 -155 23 239 -99 -28 42 -107 175 -4
4814 -4 12 200 85 61 -234 -177 247 -114 -78 206 -207 64 25 -52 83 18 75 5 -126 -29 -17 -262 84 17 64
4839 64 21 -39 148 227 -220 -110 -11 -219 372 94 68 22 43 94 38 -150 14 7 -139 98 -158 -141 -14 -1 134
4864 134 -28 -42 126 -115 56 -51 -17 213 -79 -236 -56 -31 -42 65 -143 59 -111 -60 -70 -172 10 22
4886 22 -12 234 65 61 147 17 -102 148 -274 193 -23 -253 70 -11 -161 -92 -60 52 253 -36 19 52 -99
4909 -99 41 -334 147 178 -53 -37 134 40 37 37 65 116 -90 64 -21 -100 41 -33 -136 111 -75 69 36 -53 -59 18
4935 18 142 -27 -220 -37 -154 41 274 44 -152 190 -184 33 54 -289 61 -29 -94 0 57 207 139 -320
4957 -320 50 182 42 153 -60 84 116 -47 145 -49 -276 59 -185 -125 121 69 56 -53 7 281 -88 -81
4979h1K21o4kj34j18M04j69k08J96n0l0J60k98N25k85j11K23j91q6L55m42J51
5001c4N9k25J81k43K43M4j55J24p3k4J08k62O0K89j56J47Qj32J00J7j27P9j71
5024a43J8J07RK99l09N9J29q9k73K25j64N7M9p8K15q6k01L90k44p6L27k50P4j69
5048a24O7J02k3K9L31m75L7J27r0k7j36L19r0k03P7J2K6J33k04j6K81k17lK20
5072A53k07J82p4L6N3j94j1J65k26R8j2l1K1k8N4J56k39O7p0J44J00l35J54J86
5096A42k13J40j02n7K21kj10l4k38K65J0j30K93l08J05J35j55J1J57k59J44N0
5118F5j75L10k32Q0Oj91L36j76j76K68Nk12J33l83J88R8J13j93P5rM0q7J94j33
5142e6R1mk02L13j62m6L34k33p8N9j43K6K99l54K04l3l4J42j49j39L50l52K0K62
$$ plain form
4979 -81 140 76 74 -60 -178 226 57 -151 45 -5 -35 125 -173 352 67 -44 179 -12 -98 257 -185 -34
5001 -34 25 -200 -19 -262 -19 25 -130 -6 -79 -103 5 -257 -197 92 -64 83 91 -41 59 76 -51 28 -143
5024 -143 -125 -18 -9 290 -19 40 169 80 -193 32 -132 -75 -26 -104 111 25 -176 214 -30 -106 221 -29 45 -124
5048 -124 -57 45 22 51 382 -93 -56 71 -19 -46 -182 137 47 -156 -79 -67 -41 92 -112 -128 153 -64 -67 153
5072 153 -54 128 54 90 143 -51 -62 103 -123 -25 -37 -68 -47 -75 -21 135 -104 -37 -107 37 137 -198 -44 142
5096 142 -71 69 -33 -90 131 129 19 -15 -253 12 22 -108 185 -123 -18 117 -38 -27 130 -129 15 65
5118 65 -110 200 -32 48 54 -137 199 23 -153 115 120 -92 41 -342 -154 -56 57 -136 -61 -70 -30 -117 77 -56
5142 -56 35 31 -171 142 -20 -66 268 35 -43 16 -127 -101 198 -156 48 15 -19 123 -26 -165 185 -167 -147 115
5166A15j60p0J43j35L01q5N9pj81R3j54L0J97j99J99R1l91O9J8R3J08k26N7N9
5190B4j29K17K9k82L52l30J51j3j53J52pq3O8j7J27J06k82K7K11l97L11j93K9
5213h2K00j18O4J26l99K88M0k00K29m3l05K07k55M23j05l05L60k73J22Qj45K13
5235E0Rk53M19m37K49N4j64K5K10m27K94Q0n5oj13PJ83j60O8n6j38L53j50P0j46
5260c4k75N24j60n0K7p1k2o0j4j8K04j87L63l17N4k5r2K15J33q8j26o1oL91l99
5285i4K4J23k59L86k64m8L37l89K50J54j81j23O4k9K87k38jJ08j85M3o9R1K38
5308B25l33j6J00O2l6l1q8L26k52N8J64O0j69j07j66K21q9r3L34k40J76r9q2O1
5332a4O5k40L70l21J52k6j75J90Oj67L62j13j86J73j65J51rk35J54j31q1L77l43
$$ plain form
5166 115 -45 -115 28 -107 194 109 168 161 -20 73 -81 -51 146 -53 146 237 -154 -85 -67 26 134 -92 -35 24
5190 24 -105 112 141 -141 211 -119 32 19 -134 18 11 -72 -4 -21 106 212 -70 -43 168 -229 82 -111 -82
5213 -82 118 0 64 190 -209 79 119 -81 148 105 -200 7 -248 175 70 -235 125 -148 -26 -18 -163 50
5235 50 59 -194 225 -212 37 91 -73 -48 162 -265 29 109 54 48 -65 -58 125 -35 33 -23 -161 192 42 112 -34
5260 -34 -309 215 55 5 32 -39 -61 -121 -135 -153 51 -136 227 -90 -36 -61 -153 62 195 107 -19 -80 -86 305 -94
5285 -94 -70 53 -206 180 -84 -132 205 -184 66 220 39 -84 -20 -49 238 0 -1 107 -78 -35 -104 -13 225
5308 225 -108 -124 -24 38 2 -29 -117 209 -43 15 179 239 70 -37 -203 18 -71 -164 170 -70 106 7 -75 -14
5332 -14 51 -189 181 -140 12 -14 -189 1 7 -160 202 89 -97 76 -89 62 53 -182 -28 -159 -240 137 -206
5355b06K69N3l22J45J16j6j75J39k53L52k50K39O2l19K44k09J71P6p8J5J7j68
5377i8K59k74K2J94k22R6Mj78K82j78L5K4m8M8J83k61K79k26J11P4l11K88k9k77
5401b03J66l4j12J64L6LJ88l47J19Kj56J05J92j1j05K1jK06k49J58k08o5R9k35
5425b67J44L24l28K45j37Q9L8j78K10k7j25K2m3o8M82n44L37O5k41J55J04l02
5447d5P0r4O8Q1l30L56q8MK67l82R6K94l13j21O8j82K96n2j5Mj59K41o3j96K04
5472IJ06j60J71k43J33J18l87M10p5k38K62k48j43K21j44K20j42K41k3o0n2J15
5494I1k44L02R3m84K79k0o0R2r9O8P4M3o7n8k65K14L5j43K54m22K74J10q5q9M7
5519f0K65j88j09Q8J20k14J70j47n2M04k17j7Q4m69N39j86l8K3j58J51J41k99
$$ plain form
5355 -206 63 116 -206 -61 55 39 -136 3 -250 102 -148 91 153 -166 78 -131 40 116 38 53 70 -98
5377 -98 161 -113 -91 103 -119 -23 -19 -197 85 -93 -58 -34 -82 -34 149 -112 167 -59 52 126 -185 103 74 -203
5401 -203 -37 -71 -183 -19 17 20 208 -139 -20 -18 -174 -69 123 112 7 28 27 233 -16 142 -66 -131 -32 -267
5425 -267 -123 201 -127 118 -19 70 108 -70 140 113 -12 10 -33 -101 381 -163 174 239 -2 153 257 -45
5447 -45 25 -69 -1 80 -250 106 18 22 289 -93 3 297 -16 -137 -69 -251 45 -7 -22 -18 -177 64 1 -195 9
5472 9 115 -45 126 -117 16 134 -253 157 82 -156 106 -142 -285 -64 -208 12 -130 111 88 28 -24 91
5494 91 -153 149 242 -242 37 17 -43 49 -50 18 92 135 68 10 -255 -41 -6 -149 105 -317 -43 67 -18 -107 -60
5519 -60 205 17 -92 -4 116 -98 72 -75 -127 277 60 43 127 -342 197 11 -27 -4 -162 -11 130 -169
5541a69L50k35M2J33m01M25o1j59K03k0l16L43l18J96R9j47K1K0j54L19k85K01
5563H7n0m8K6q1p4L54j80j71J35j30O4J36p4J28l17K04J10j65L02q5l35L3J52
5586B1k95M29k74L49k88L8K73j24k56K36k50J18K76l79K57N7j85O6q4%K68l00
5608d7qO1J13j52p5qK78k83J18o4J08J66k21j47K68N9m29K62jL6l4k82M51l55
5632a86J72J44k04O4K82l09L04m95J60J90k67K36j98L3Rk7R1M26n32P7Pl6L37
5655B78l41J9k3o7J83J73l63K33k6J8Nk58J91R4k06L51l61J69p9q7J01J28m20
5678b88K65r6q9M02l35n9K52k85M07m30P3L20j73P1M8j33O0o7j21N95l98j75L00
5701A44j10m5L21l71K51j65k12L12k4j19J65l13L08J06j88Q5j85j00K59o5l4J15
$$ plain form
5541 -169 181 -54 -12 121 -280 145 84 -75 128 108 -208 135 -183 13 112 -35 -14 6 -148 171 -114 87
5563 87 37 -11 15 -66 -140 214 34 -137 -2 -132 -68 68 -6 122 -195 9 119 -46 256 171 -164 -131 21
5586 21 -274 155 -119 230 -58 -20 253 129 -127 109 -141 -23 253 -126 131 188 3 69 -15 -15 253 -47
5608 -47 -55 6 119 -33 -108 -116 162 -121 -3 -67 41 207 -14 -161 107 166 -263 -1 -2 34 0 -282 169 -186
5632 -186 -14 130 -74 -10 272 -37 267 -228 -68 122 -145 91 -107 -74 -65 -92 -1 425 -107 -30 -23 -59 278
5655 278 -63 -44 -67 -134 49 222 -141 92 66 84 89 -169 22 116 -90 261 -100 69 -10 -97 4 132 -288
5678 -288 -23 -119 -208 194 -141 -200 52 -233 174 -256 -183 137 -36 35 83 -50 10 -57 -178 417 19 -156 144
5701 144 34 -11 310 -61 190 25 -187 125 101 -18 147 -166 142 248 60 145 -40 -140 119 54 20 135
5723A35k74mN5Q4K47j47n7L0j83K32r1R4j53n1J79q2n8Q8j16QL87m76J31N3j44
5748a13j8J55n0J09k09J10O4q4K60j23k67L83q7q9r6l73N11p4r6J65m9j99J09
5771f1Q3j51J16K3M7k9j99M36k80r6L48m26J37K6j27K40r3j12K13k29J43L9j87
5794a39R9J88n3m5j82J09J19k9N8Lk36K40k03J49p1n6K50l40J35J51j74K11j34
5817E0k25J26J91o1Rm5j70L17l08Q2l8J36k36K45m3J9k2j0M4k20L99j12l48L78
5841A58o5l7k7k05J77j67J5J42j76J24J80q1j15M9J57M7j83N8j16j35K72k48N6
5864a20J78p9j76J94j15J34l1j29J50N9j25L27k79J05j56j18J44m4K75o9k31K65
5886A59L7l68K82l1q4J76j82Q8R2l11Q2k1OK5j67LM93m22K9J72j81J42J20j02
$$ plain form
5723 135 -139 -143 -88 -4 243 96 39 69 -114 118 27 121 -32 -83 96 14 -44 44 -72 -64 323 -153 -22 31 -113
5748 -113 -131 24 -26 83 -126 -16 48 -36 224 101 -166 217 130 41 -55 -428 83 9 -87 78 29 -170 -61
5771 -61 22 -129 -13 10 57 28 -171 265 -15 -111 237 -189 -52 -26 -153 87 -6 -118 95 -134 9 48 -139
5794 -139 -40 148 95 50 -132 -23 96 67 125 128 -108 132 -71 78 7 -49 201 -139 -4 147 -27 184 50
5817 50 -175 -49 142 81 90 45 -125 192 -116 -34 -72 64 -172 73 30 49 27 17 61 -159 240 128 -220 158
5841 158 93 56 29 -176 1 -166 -151 -9 -185 -61 119 38 -77 -28 129 176 -7 51 -65 -200 72 -176 -120
5864 -120 58 -21 -197 -3 -118 16 -15 -144 6 65 -60 267 -12 93 -63 -181 -37 -81 194 125 -106 159
5886 159 196 -172 110 79 -5 171 -11 77 169 -142 -60 -81 -75 -50 -217 -214 279 -143 -114 58 -123 19 139 37
5910C7j61J66N0L5j78K60j79j16K90m38K41P5j63K6M9j40L10j55M1M9p3P2mk21
5934a27J51Nn6j04K35P5p7j70R4j16Q1M3j06O7J63j10J12l2j97L27k21q1k25K50
5958a9J92j10m3N4p5J04j61J20l1P9J1j45j31Q2K81l27J49p4P0J53j96j18K67
5981A32l80K43J01j79K37k22J29J14l04N7Q9j53J83L9k66J45J0J02j1j43J99l82
6003b60J65R9j95K81j8L1Q2j89OON5L6J4j71J4o7J12k1l07M17Q2j75J26k9k38
6028a44K46o0p4P1P3j26N1j65K01M7k68L79k37N3J32m79N77k45k6m8l5M6J98j94
6052b7j29RJ04M8j46J66K50n03J59Q1j80L86l32Q1J17k15J56M0m7O2m2J31j56
6075A3R9k28k3J22M7J38Ok3r0k12N6j63J61J43m0J46k42j45L13l9k12K42j47L55
$$ plain form
5910 37 -124 42 92 127 -51 209 30 -86 204 -234 7 82 -81 -55 -6 -146 164 9 50 99 26 98 94 -127
5934 -127 24 29 -27 -131 104 179 102 -68 26 -90 -9 34 -72 -5 158 48 160 128 -69 258 37 -44 -269 -19
5958 -19 173 63 20 74 -1 103 -58 62 31 110 121 -24 -155 -73 208 -119 30 -44 26 179 -17 -135 132
5981 132 -248 -5 96 -83 154 -68 61 175 -129 -72 17 -136 47 86 -180 -35 -25 77 66 -77 122 -260
6003 -260 -95 4 -191 90 72 103 185 -4 2 8 63 99 113 -58 -44 -111 1 -20 -327 90 172 -3 123 94 -144
6028 -144 102 42 -32 39 112 -14 37 -128 73 120 -148 231 -6 47 179 -300 277 32 6 -42 -77 -31 167 -27
6052 -27 -156 -147 -43 5 -141 25 275 -228 -69 12 -168 218 -114 -33 84 -131 25 65 18 80 38 169 13
6075 13 112 -116 -139 -17 30 168 174 151 61 -151 -95 -258 -97 46 6 152 -90 -235 78 39 -173 69 -78 277
6099B77m05K05o2n6j15J15p9J93k45J87J08j95O6l1J04J7j45J14K58m54K40p3
6121B4n8K1J6L8J18l90J07J24j23J23J10k23K86j64k75J98j43K09J77l48J90n0
6143c3L5k5J9J79n9j22lkj40M08k29k9q7Q1J09o8k74K56k8r5J31J5j16K50k25
6168e2J64k61J36M1k95L95r3o2mN8j33L92k68J21j98K4K35l93J45J78j24Q7j08
6191a5m6K45r7k45L68k30k13L77k89J43o3r6L02k71J64J9p4O0Oj56K06j84q1K96
6215A26k06J18J34k61N9l0L0J55k63K49j00p2J43J38m35K01j06K30m6j47m9Q5
6237d7k55N52l10k7J44j8k0Q1j51J81k37L0J66j55J86J42l65JQ9j11J41l2J36
6260A21j43o6J67j62P6J49l06K13K19l35j5QO7O0L6r1R5k7j30k67M03n6k36J32
$$ plain form
6099 277 -128 77 15 -41 -156 -41 -120 73 -172 15 123 -72 -6 -37 67 84 -61 53 311 -143 97 24
6121 24 -34 -13 3 41 159 -231 -124 0 -123 0 110 -113 173 9 -266 -68 -211 -2 175 -173 17 -33
6143 -33 2 -23 -4 175 116 -6 -9 -11 -151 257 28 -1 -88 -7 102 34 -240 16 -12 -107 24 39 -77 173 -52
6168 -52 112 -149 -13 28 -267 128 35 -27 -31 27 -106 286 18 139 -59 -35 200 -193 -48 130 6 93 -15
6191 -15 -61 184 87 -158 210 -20 -233 144 -145 -2 -65 -161 141 -130 34 53 -21 39 45 -111 95 -89 -170 126
6215 126 -80 38 172 -89 -30 -60 -30 125 -138 111 11 -61 82 220 -215 -14 -120 110 64 -83 -132 -47
6237 -47 -302 250 -60 -87 57 39 19 100 -51 130 -107 -77 89 -66 120 262 -103 -102 -13 -124 17 -15 121
6260 121 -22 -88 79 -83 -7 142 -164 49 268 -67 -82 -74 -7 53 89 -2 93 66 -64 -331 72 16 -220 -88
6284h8J58l35K25J74k67K75j93j40J94j59M2J3R3K20l18K19M4k91J47K1r1J76
6306A19P4m22K18L8J56l0l80M44k62j88K99o3O2L0k30K70j21M9n4O8k84K32k60
6329b35K19m3j33K79K18n7n6l36J14o8j52L0K04J1K42j84k65L86j96N0lk0lj2
6353a0oK11k68o8J97p7j8j10q6L31j28P5J4j80J27lK33j72Q4j26K02l63J14J52
6377A25m01L27j78J46nk26K59k1j49L27j44L5J08j80j66L00p4j22J48k10K4J81
6399A04j18L22m62K19k32K3j5J90m3K96l35j09J93J7j30O4K44k70j67K78J8j27
6421d0J60k03m8J76p3R1J4j77K30k18R9K59k72R1k17J27L7l01K04L14l48J16N3
6444G4m7j63O6K3J99k34P7J41l11K58j66N3M14k28k35K02k44J89j52p2J17j41
$$ plain form
6284 -88 70 -265 -40 134 -133 142 -51 -191 3 -156 -114 -101 -8 212 -106 113 157 -134 13 34 -57 119
6306 119 193 -229 -11 27 183 153 -227 217 -45 -233 66 3 65 95 -135 135 14 63 9 77 -207 25 -235
6329 -235 -16 -59 -192 87 305 248 192 -144 -30 -98 -250 -220 -16 -5 237 53 -212 174 -22 28 25 5 2 -10
6353 -10 -16 195 -73 -141 56 -21 -39 -149 -235 96 -32 43 57 -123 4 1 234 62 146 20 222 -141 -27 125
6377 125 -276 51 -127 19 14 -212 47 26 -123 204 60 95 203 23 -143 157 83 -39 109 -101 -77 104
6399 104 -14 308 -154 65 -167 -144 -159 31 -12 284 -51 -160 33 50 -80 -16 228 -42 -209 69 87 -40
6421 -40 120 -83 -131 45 -28 63 77 -100 130 -88 11 270 -2 89 -128 -1 36 -265 -61 253 -95 21 74
6444 74 27 -136 -70 -47 152 -82 -5 136 -175 83 -83 -30 384 156 -79 123 -121 68 -84 -156 -39 -180
6466a80L10j34k8J76m4k23K23q2j8k8o2N3P2k18L09k52O8J65m0l0j01m8N5m1J4
6491h4O8j16J20j3j45J86P4m3o7k6J19k11L80j70k1k76M29q5k20J56j59k4J91
6514F3r2J01J3j08N2P6j90Q2k04L22j95m4R4p5j16K73k54J30K29PK7l50L01j80
6538c8Q1N7r1j34L0L0K5N1J32k81K45l35L39l14J22K40j04Q2k7j07J07k08J5J11
6562B8l1k3N2m9J4n7P5l0k34L78M3l56K32P9l14L69j67Pq5j53J39J7M1K53k92
6587f4N7No0J2J82j53R8j10P2rJ25p3L1j91J92J57l39J83q8J33pk64nJ96k50L41
6613A71k13r3M35r4P8k62j86j5K35M3N8k14J23p5R4m5p0r1N12m92N6L19m34K44
6637H4j20j77L08j92R4K93m87L48j15k85K72%O0P7n3Q5l84j05M82k14o2J49j89
$$ plain form
6466 -180 130 -4 -32 144 100 -123 100 18 0 -28 -90 -37 35 -183 126 -126 -58 107 67 37 -64 -112 -57 -98 -84
6491 -84 -16 -132 -12 -25 -170 16 90 47 -20 -46 73 -138 242 72 51 -225 204 119 -101 55 -104 -128 63
6514 63 -29 72 85 -23 29 105 -85 -3 -207 115 -80 -124 -30 -105 -221 52 -202 -72 157 164 191 -159 142 -38
6538 -38 43 100 9 -125 -95 -65 -40 11 143 -138 107 -228 111 -203 -81 159 55 137 110 3 110 -98 -83 28
6562 28 -3 -26 26 -23 -9 -66 9 -21 -255 123 166 -190 42 121 -193 176 9 16 -69 -222 -83 -66 -25 228 -64
6587 -64 -7 -2 -62 -50 132 -21 77 -33 39 30 155 82 113 -78 114 271 -68 115 27 160 153 -111 -116 80 -170 171
6613 171 -42 -135 300 206 284 22 -164 -179 56 99 157 -57 66 -9 85 40 -30 -121 391 -101 -45 274 -160 84
6637 84 -36 -213 95 -97 -3 290 -197 151 36 -249 23 23 83 160 107 192 -192 -297 185 -29 -91 58 -131
6660a31P3M6j88M82l12k8J89l90M23j59o9J80q5R1J9k25k2K80j06l8nJ09k91L4
6684a23L46j08j47J47j00N1K41l80R3Q8l16J69K02l64M07k40n0L18m04K46o1L5
6706E0L9j25RK05j92M9K4l9J7k4j33K75k67J7K17k15J10J57j12j9k4n6P5k2J84
6731B00l22k2M11l50mL85l54J92j50NN6j61J16J38j18q9J00k59L53Pj28J75k82
6754a01R7K55l54L11j15j11m7M5Q9k46J41j3K08j54J76j57k76N05m27j18K31M3
6776a8K9n5n5O4o5k6rL7R8K0R2n5p1L6J16j19O6k83L9L25j43L8J59m32J32L05
6802B25l06J7J08j96K85j73m4J40j63K07k19J32N6k50J45J13k83L17j55k6K64
6823A94j37j68L90o21L16O5q5J64j93L57j00l62J22J40j85K90k20m2K98l09J91
$$ plain form
6660 -131 -58 -12 -200 282 -30 -58 131 -259 164 5 -64 116 31 122 141 -84 -106 174 68 30 25 134 -157 -123
6684 -123 223 115 -32 115 15 66 307 -73 20 108 -208 -39 163 -201 206 -34 -84 234 -170 76 15 50
6706 50 89 -36 -27 178 -14 35 59 20 37 13 -120 155 -112 -95 122 -93 17 174 62 43 19 -37 38 16 200
6731 200 -122 -144 267 -83 -87 298 -56 136 -14 -9 47 -114 2 140 22 -67 33 -226 127 134 6 181 -101
6754 -101 -4 251 -103 208 93 -18 -65 -20 69 -177 -36 -49 159 5 181 24 -252 253 -174 -292 -61 -18
6776 -18 11 -44 -99 -35 -100 -126 -135 -98 0 20 112 57 -14 22 138 19 85 -198 -159 166 23 61 220 -212 -80 225
6802 225 -81 -64 44 -152 133 -40 -84 56 -107 100 -119 13 69 -181 -36 77 -206 111 -44 -70 194
6823 194 57 -111 279 -342 -26 39 -46 118 -75 282 182 -180 -58 82 -103 187 -33 -75 223 -86 105
6844A05p8j48J21N9j05J39k10K57O5k03J63K6l01K33Jq8K88l57r4J22j73L21k65
6867a22J50J07r4J01j14j69J38N3j5o6j21K00k2k46K52J08j57qp3J18p4J29k70
6890a95J39L8J53j08j98K59r6J92l34n3K02k6K5J98k70K2L18k81J84k33l4K04
6912A06j19M2j13j19J70j72K21J82k30k4J98l95K84j09K6K24J6l76K02o4K45p8
6934A17r7K18k16K86l18k75L10J98k60J79k91J93j03O5N5l7k26M49k76j39J29
6955c9lq8m0K36p9k4r3J66q7J50j54pj2r8K11Q9k06K76j76j46P0J90j72J36k32
6980a32J98j6p2p6N2r8J83O4l60M35l08L02l18J0Q3J21q6m2J70J2n3j72j3K80
7004A64l36J25R5l2j33N5O2j59Q7J31j13P8Rm94M71l3J17J06l63J68K03k29M6
$$ plain form
6844 105 27 -121 0 59 -46 93 -117 140 205 2 165 191 -110 123 124 36 324 -33 -127 -5 -178 143 -122
6867 -122 28 135 41 142 28 -141 -3 50 35 -31 -152 48 26 -220 32 140 -17 -25 -98 20 -54 75 -195
6890 -195 -56 -18 135 27 -171 88 -8 184 -150 -203 -1 -27 -2 196 -74 -52 266 -15 169 -64 -98 106
6912 106 -13 29 -84 -203 -33 -205 16 198 -32 -56 142 -253 31 -78 -52 172 188 -188 14 -50 195 117
6934 117 20 238 22 308 -10 -285 25 223 -37 142 -149 44 -59 6 61 24 -202 247 -29 -168 -39
6955 -39 -42 -130 -170 66 -13 -37 -130 36 -51 99 -55 -62 -74 -172 39 128 -78 198 22 -124 -54 136 -36 100 -132
6980 -132 66 50 -22 -98 -46 -144 39 103 -257 178 -130 172 -146 -136 -53 68 -18 -60 110 122 69 -103 -116 164
7004 164 -172 -47 48 16 -117 -62 0 -159 -72 59 -54 24 33 -461 10 -23 94 200 -163 5 208 -21 25
7027B5K7k48L93j65m4J6J1J82r0j42j32J36k3j48%K40j35o0J37R3l6K11j38n5
7051E5J9l44L09%k61M52l04J8K38k11L8Q8l9p8M7Q9L1r1N6J22m04L72j43k17K05
7076D7j67Q5J46n7K43m00O6J30k44P1n1pJ20L6j56L01k62J12K8j63J57J04j62
7099b3k5P8k0m1j09J17K27l73K42j41n2L40k88Q4j12m4J10R6l4N3k45M5K18k90
7123a87K95m6q5O0j96J63j38K16M3r3l2m5j3R2J9j01J51j02j10j2L7N2J33m1m2
7148A8j59q7J92J37p6%j07o0K11m09O16k55N0Q7j74J53Q7j90R9m3r9M5J03Q8j79
7173D8J9j47L1j01J21j4J77j41j07J52J49k20K04l15j0J39j15R8J27k92J0L00
7195A13kj80M3J3J5j5R6J14k95K07n5k19MM6K60k52J28K1q2P4J37j29Q7j85J25
$$ plain form
7027 25 52 -196 197 32 -12 4 15 197 107 -35 -167 -31 -54 -202 -202 38 -97 -157 -20 73 37 248 110 55
7051 55 74 -270 39 39 -222 230 -74 -56 182 -29 9 97 58 -20 27 116 147 56 112 234 -170 202 59 -158 47
7076 47 -120 -35 111 54 297 -103 -37 93 -151 -80 -131 -138 -18 18 -138 163 -99 13 41 -122 35 139 -23
7099 -23 -48 30 10 -31 -140 -23 204 -169 73 -68 -120 220 -68 16 -96 -140 -30 66 32 85 -160 -115 103 -187
7123 -187 108 62 -23 37 -159 4 -134 82 125 32 0 -45 -58 34 53 -48 103 1 -109 -121 -84 -32 101 60 18
7148 18 -141 -228 -36 101 25 25 -82 -142 69 -340 276 21 71 158 -16 137 224 34 133 90 -9 36 139 227 48
7173 48 67 -80 -49 -150 -29 -43 134 -7 -114 38 187 -33 171 -144 -154 -15 -130 -32 95 -197 -187 113
7195 113 111 -69 -26 -13 2 -13 83 197 -98 109 54 -165 -161 -115 145 -107 21 42 -40 34 171 42 129 -56 69
7220F9O4j26K6J18j73o8J12k24J59J03k04K87j81K5J31j76%M5q6K59m73K49J28
7243F4M3k17J05N6q3R2k39L03j98pK36j70R4k07J95J05k06J73l07J3K45l08n7
7266b75N08l12j05K30m9O9K9j31J79k81L27j33j58J31rk21J57M3p5J51L1r8J4
7289B2r2Q1J03l18L25l29J58R5p6P7k79K65J18j92J29j10NP4q2J1J4k6P1Q0k47
7314a23K95o1p9J04r9j34J89j92J91J26j88L34m96R3N2j80K87J56k72J12k91J26
7336e0J97j61jq5j17L36j17j67L54k91K04j16j12M7J77M5j77R8K7j71qM15n59
7359b32J52K64l00J5O0M5J25j06k72K84n1J36L9j60K51r8n25L27J04r2P0j38r0
7382a92J62n2p6J73j99M2L0J14KJ3K9l19L14J50k20o4K69k09P0K0j15P4j57Q6
$$ plain form
7220 69 133 7 33 151 -22 -90 22 -202 -43 60 -144 143 -38 -13 118 -58 -58 -13 -99 160 -313 -64 64
7243 64 107 -110 -5 51 -32 60 -179 124 -74 -81 155 -15 79 -128 67 172 -34 139 -168 -155 90 -218 -275
7266 -275 233 -79 -184 46 -3 66 95 -36 143 -138 189 56 -102 29 20 -201 -44 -1 -76 75 106 8 22
7289 22 -70 11 114 -204 121 -208 -50 45 -31 46 -233 32 150 -42 87 -23 -18 56 -26 -15 -1 -27 44 124 -123
7314 -123 172 111 32 136 37 -97 92 -100 91 217 29 363 -133 -40 12 -168 119 275 3 115 -176 -50
7336 -50 147 -14 -15 -100 -217 119 2 -165 189 -102 102 -14 -126 -79 98 143 -34 64 91 -80 -88 327 -232
7359 -232 -80 184 -116 -101 -41 4 129 23 -249 35 -16 120 159 -1 250 152 -373 -46 58 -34 36 -102 -192
7382 -192 -30 -82 -158 15 -184 -142 -112 2 4 17 46 -273 41 191 -29 -93 176 -33 37 57 -58 16 -141 -55
7406e5K03j30J82Q2l72K06j22M9M7j61K46j28k17L73j08o1r0L0K7K4r1J94j52
7429b4k74K42M2l9L2r2M7J87l04J81Mm2K33k71Q8J35k08J33j30j8L7j04J46O0
7453F1j92M5q2O4L63l83J30N3j6n1J19k40J03o8JK27k33K6J86k12J59O4j32J72
7477A64j59p0J58l8Pj4Mn8l4P5K2j0M9l5j68J63j22J01Lk42K55J4j05K87m64L53
7503A36J28m73K20J6l9J88k27j89K70k83M11mj29n1r2J64J62k52J22M4j22m2K41
7526A99k87MJ19K5j4l13K56j1j80K24K45k87m5K57j37J85k49J09j96P7K17j69
7548B9O0j21j04L86k14l6R2k32O5k1QL03k15j38L69l26j65K70k12K82j71rJ24
7571B4J14k66K48kpl12Q6K29j42m6K6J38K9kl26N16m22J93j8j16J07q5j3J25K5
$$ plain form
7406 -55 148 18 200 282 -90 116 -6 43 90 -71 175 47 -170 203 95 34 -56 -26 1 25 -66 128 -24
7429 -24 -298 -56 -14 -53 -21 -113 -66 121 -183 -2 2 -40 193 -78 10 145 -63 70 -60 -78 -41 -145 1 61
7453 61 -131 -86 -168 -104 259 -124 6 59 43 -8 111 -129 -26 -94 -93 134 -99 -73 113 -99 60 124 -8 164
7477 164 5 -65 93 55 62 48 52 -6 -40 35 57 47 96 61 -107 56 -66 35 38 -204 51 65 -40 247 -217 136
7503 136 264 -209 11 27 -12 176 -51 -240 30 -253 158 154 25 -26 -118 46 208 -44 78 122 0 -42 199
7526 199 -88 -84 35 60 46 -267 -11 -22 -202 22 267 -20 -65 192 55 240 -9 100 -96 -19 198 29
7548 29 89 -32 -136 250 36 0 92 -140 -75 -96 -88 215 0 -138 231 -95 -260 10 -202 80 -91 -100 24
7571 24 138 -128 120 118 111 -201 -115 114 -28 -74 -48 90 119 117 -209 307 -115 78 60 -56 51 -34 -47 78 103
7596A03j36K32j42m7J55j45J11k08RK93j82k63K17k49K57R9j21J08pr7R6j73J62
7619G2jj35K60l28k9M10l13J17q8k7J14Ol31L66N9K9k48p0K28o7p8K56k61O7J58
7644A66n29L86j13L9J15j76L9O0r5N0P8N7P9j24M3J67j15k16K60j25Jj16p7K94
7668A48k93Q0L05l73M0K07Qj33M3p9j9p3J14lj27P9J0JK4Ll7K73l15J52L6j03
7694c2q5J82j25K16j22K9K1j61L73l48l8K57j64P1n3j54K09k11K20k09J66p3K21
7717A90l75L39k65J08J06k38K93o4l30K74j59Q8O0J33n8j7j91p3K70k02J99k31
7739a43J86K3m6L2j3m9J18M8k46KO2P6p5O7M2K5l4j78R7j99K88k2q9J26P8j09
7765F7OQ6k24L7J85l10J27M3m2R3k01J66l3J17m31M42j36n6K15k34p2J30q2K47
$$ plain form
7596 103 -33 199 57 10 165 20 131 -77 -68 225 43 -220 -3 -252 5 104 -17 91 84 -13 83 -90 72
7619 72 71 -64 196 -132 -161 249 -64 53 -35 -62 52 58 -273 93 152 181 -67 -137 91 24 -54 202 -59 8 166
7644 166 -363 23 -90 -51 64 -112 -73 -13 -108 -58 20 77 156 32 75 242 127 -89 171 46 47 -69 -146 148
7668 148 -145 -65 240 -133 -93 114 122 -11 32 -47 -66 -139 -25 -28 -155 -76 -66 -65 -41 -38 -75 198 -117 35 71 -32
7694 -32 -117 65 -60 156 34 63 84 -77 296 -52 -90 167 3 74 21 -133 76 -135 85 -124 42 -31 190
7717 190 -185 154 -111 -3 103 -135 158 94 -236 38 -121 -33 27 160 102 85 -106 -179 91 -111 88 -143
7739 -143 43 66 20 52 39 -10 108 156 -90 -88 -26 50 -25 42 84 109 75 -103 -6 -205 83 61 -28 98 176 67
7765 67 73 159 -65 -28 157 -153 -26 17 -25 68 -133 33 0 117 -314 128 -8 -64 151 -83 -155 -25 -107 140
7789A40m79L38n4q2K86q8rM%j91J76j74K69j41L5Oj17J6k4q1J60M3L5o2r2P5J44
7816A33j31r5Pr1K20J3k49K28k60O2K03j82R4J05K2k64J43K39k9j29j00K02j75
7839c4j58J98j34J08j9J74n9m0J17l15n0N12l38J99r4p1J61k14j05J64K2P3P2
7862A69j48J92k9k17j22K99k03P2l2M6J10o6R5k21N3J90k04p3J19jN2K7l5L4j89
7887h2J62O8j43K0n3J2M5J0J7Q4j50P2lM3p6j14mj83K60J79j37j09J31J23j71
7912Aj4J02j70J32j28P6j01j0J86r2o0R7K4o9J17q5L6J15j14pj44L42j71j48J87
7937A02j37P0o2Q4o7Oj29J96j04R8N6k12J32n6O1L4j47J82j17j52Q3K28j11Lj03
7962f2K2K83j74k96K90j39J09Km1K52j17q1j14P7k2oj16J02J03j34Q1O0j57kJ59
$$ plain form
7789 140 -339 -1 -55 -137 149 61 52 56 56 -135 41 -133 136 -5 30 36 -81 -65 -89 -170 -10 33 68 6 -86 -11 133
7816 133 2 -93 -86 -177 43 56 -193 35 -225 -163 40 -142 -48 57 79 -185 -42 197 168 39 -61 141 -34
7839 -34 -192 6 -128 -20 -39 135 76 36 153 -162 -212 300 -38 161 67 -4 157 -57 -162 2 24 97 169
7862 169 21 213 184 -33 -155 144 -59 13 -19 27 137 71 166 -55 -2 188 -16 -89 30 29 81 108 73 107 -82
7887 -82 80 148 5 25 -28 -16 29 39 56 140 -10 62 59 102 26 -88 -92 -275 -15 164 27 -82 49 172 1
7912 1 -13 89 -81 51 -77 -1 -102 -112 74 -18 -78 19 43 -26 91 6 42 157 43 36 -108 234 63 -85 102
7937 102 -35 35 -27 57 -10 -4 -133 63 -41 57 113 -99 33 -23 38 72 -75 107 -10 -162 -79 149 38 41 -62
7962 -62 -40 243 69 -227 63 -76 33 35 -6 246 129 48 -66 11 -11 -17 -133 -31 72 -62 19 79 -78 -80 79
7987G9Rk19J20q5p2J69m2p8P4m6J8J54k8N6j47J25j29J72k44Q1m5R9Q7j13R0l20
8013b35K71J82j89k0jn2J37O2j33j6o0N9J38r7j68N5P6L8j49J26J6k0jO6n3p9
8039d7j11J32J69j64j20J02K9%o5M8MqJ12k7j13K07j71J4J83j44j48K97r0j17
8063b8J23j01K65j36j91J40j50j58J22m7K25k5j12N2o8J22p5o3pR4O5l0j74J80
8087B3J13j07j07J85j34J53j35Q8Oj15J6K3k10J37Q3j19M2O1J30k76J86M3j79
8110i3K21p8j33J19L04n09L62j05j40K97k05n1K8k54L53j56q5L35j69k5o7J30
8132G9k68K22r0J43k02K55r5k16K53j13j3J2O2j37K97j74N0j04k66M75m9o6Q1
8155A36k25J34J68k11n8N5k9J70j49o3K18k72J99j9j25J23l5l5L5l3p1j30P4K32
$$ plain form
7987 79 88 -131 -11 -96 -168 1 -41 -119 -45 -91 -73 81 53 109 -38 87 -42 130 -114 -33 -78 21 108 -5 85 -235
8013 -235 36 218 29 9 8 -44 93 155 22 6 -54 5 143 46 -122 -67 9 47 -102 24 40 20 19 85 32 -47
8039 -47 -158 -26 143 -21 -141 -39 -10 -10 -75 -27 -23 -31 81 54 -59 148 -23 -9 174 30 -118 179 89 -28
8063 -28 95 -6 259 123 -68 72 -78 -236 -114 -161 64 39 -73 -21 -89 33 -42 -105 -112 -18 47 17 -157 23
8087 23 136 29 -78 107 -27 126 -9 79 85 -30 -14 9 -201 -64 19 -100 -58 3 133 -143 43 86 -93
8110 -93 128 50 -83 36 340 -169 193 88 -52 245 40 -11 17 -237 116 -40 -125 210 41 16 -51 79
8132 79 -189 33 -57 86 -116 139 44 -172 81 -32 -45 -33 29 -108 189 15 65 -39 -305 170 121 55 136
8155 136 -89 45 213 2 -56 -1 -30 140 -9 -72 146 -126 73 54 -71 52 17 -18 17 -16 -87 -217 -143 89
8179H9J17k06K4m8L4R5R2k03J09j70Q6n5
$$ plain form
8179 89 206 0 24 -24 10 105 197 -6 103 -67 19 -36
8191c6
$$ Imaginary data points
##PAGE= N=2
##DATA TABLE= (X++(I..I)), XYDATA
0@%%%%%%%%%%%qJ6j6J6j6K4l2M0m8N6p2Q8j04J20j36J58j82K08k40K77l17L60
33A92m09M64n25N90o62P40q27R22j026J140j262J397j543J702j880K072k281K513
51A317k768L050l364L715m109M554n060N644o328P141q125R343j0896J2956j5840
66h770K0181k7539M3205j35162J39128J02996l09476J67460J04913j94399K6047
77g1416J90046j30733j00231J80950K910j88625J42378P1995j71336O2084Q6993
88G5015j09487K3397N1127m1820k0740L9814K4604p0614l120R3849o3869l7401
100c9245P7263m2945l0756O4830j4894n5097K4672O5522o3716n4237J25241k8446
112B8192j06581J23144r968j09587J16124J8461j20275N0073O8548o8196k9231
$$ plain form
0 0 0 0 0 0 0 0 0 0 0 0 0 -8 8 -8 8 -8 16 -16 24 -24 32 -40 48 -56 64 -72 86 -96 112 -128 149 -168 192
33 192 -217 247 -278 312 -350 390 -437 485 -541 599 -663 734 -809 893 -987 1085 -1196 1317
51 1317 -1451 1599 -1765 1950 -2159 2395 -2665 2979 -3349 3792 -4333 5010 -5886 7070 -8770
66 -8770 11411 -16128 27077 -108085 31043 134039 -175437 -7977 96936 -97463 -71416
77 -71416 118630 -12103 -112334 68616 71526 -117099 25279 97274 -74062 -11978 75015
88 75015 -34472 -11075 40052 -1768 -22508 17306 41910 -28704 -31824 62025 -1844 -39245
100 -39245 38018 -4927 -35683 29147 14253 -40844 -16172 49350 -14366 -68603 56638 28192
112 28192 -78389 44755 34787 -74800 41324 59785 -60490 -10417 58131 -10065 -39296
123c9296P7653k3494p6862Q5084P710r2969P8876R632q7693P0755J9648n8176
135b9132K4994M732n531J2153o170k100j2991K0936J4981l8353J7465R518j8736
148h234K8593k0163r240L2007l0256J2157J5963l8415L1854j359l7404L9530n779
161I254k8773K0249k041o436O06P375l163k1980L7973k153m9434N6552J138n4585
175c5418N6643o222m3550N0586n535l5618K2646J3818j5025j4635K4976k306l4373
188b4013M2941l703m9544N2070k764m3939M1267n001k4904J9574k524o07p377
201h524K191J5452k7182J3910K2646l8545J4594K0670k2519Q773J208R00J004
214D578j2323K6487j4759k4789M6519k0181k9501M4794j6407k3334K7837k856
$$ plain form
123 -39296 38357 14863 -61999 23085 30795 -62174 16702 26334 -61359 9396 29044 -29132
135 -29132 -4138 594 -4937 7216 1046 -1054 -14045 6891 21872 -16481 984 10502 -8234
148 -8234 20359 196 -9044 22963 -7293 4864 20827 -17588 14266 12907 -24497 15033 9254
161 9254 -19519 730 -1311 -7747 -7141 234 -2929 -24909 13064 10911 -38523 18029 19167 -35418
175 -35418 21225 15003 -28547 22039 16504 -19114 3532 17350 2325 -12310 12666 10360 -24013
188 -24013 18928 15225 -34319 17751 14987 -28952 12315 7314 -17590 1984 -540 -1147 -8524
201 -8524 -6333 9119 -18063 -4153 18493 -20052 -5458 15212 -7307 1466 2674 3574 4578
214 4578 -7745 18742 3983 -20806 25713 5532 -23969 20825 4418 -18916 8921 6065
226F065j4294K17J7481o228k6151L6618k502m2294M6041p69m2796M0179k27k8442
240a7102K1828K448q685l914R364R093k7679J6921J8089l8259K0686J5518l4019
253a5711J8716N351j5368Q401n707P601n225j1446K5535j7632j1527L2133k1567
266f446n921K2608j5390J778N154j727M816j3780J6358L294k7119K9043r70k8214
280a6516K9817n586j8372J9879n739m958J390M49P765j8734R563J4440l0599J7444
294B43J1569k9854K0408M182j9199J4321k375m62N75o281J5964j2890m171K3181
308A5211k2602K633K0155k3110P811Q832j2862Q749o204L520M538j6377J7662
321G956m279j7509K5196j2083j2297K1856j2662k022Q214o996P285p655L554J0294
$$ plain form
226 6065 -8229 -8012 9469 3241 -22910 13708 11206 -31088 14953 14184 -28612 11567 11340 -17102
240 -17102 4726 7174 -1511 -5425 3939 13032 -14647 2274 20363 -17896 2790 18308 -15711
253 -15711 3005 8356 -7012 1389 -4318 3283 -1942 -13388 12147 -5485 -17012 15121 -6446
266 -6446 -12367 10241 -5149 -3371 1783 56 4872 -8908 7450 10744 -16375 12668 11698 -16516
280 -16516 13301 7715 -10657 9222 3483 -1475 -85 364 8129 -10605 -1042 13398 -17201 243
294 243 11812 -18042 2366 6548 -12651 1670 -705 -1167 -592 -6873 9091 -3799 -7970 15211
308 15211 -7391 -4758 15397 -7713 98 8930 -3932 4817 -1387 2133 6671 -9706 7956
321 7956 3677 -13832 11364 -719 -13016 8840 -3822 -5844 2370 -4626 2659 -4996 -1442 8852
335H852k0796J5729P651k5541K1669J385j9307J8102m119o261O794n535P269q553
349b661j290J6254k1208N629J6464k5181J0846R474j8774J1912j089n470O737
362A643q661J0013l882j0518K0947j2904o266K1604j6608J057J3394j3319O800
375C300l54k737Q291j3351R253M093j9215J8665k944j6649J9261q314o547J1906
389D658r418M078o65m011J1813j3909M073J2763k0216J1881O114j7949J5139j744
403B607q400J0710p705M558J395q520J4196r189m494J6517j5768L019J0603j6444
417f915R449R77r180R780r407L377O019j4094J2730k295j0329J7867j0555l673
431f249J4673j2313N431L672r507J1070o968n73R067j4583R220L345j5072J5097
$$ plain form
335 8852 -11944 3785 11436 -14105 7564 8949 -10358 7744 3625 -2636 4158 -1377 5892 -2661
349 -2661 -3951 12303 -8905 -3276 13188 -11993 -1147 8327 -10447 1465 376 -5094 1643
362 1643 -7018 2995 -887 -11405 9542 -3362 -9628 11976 -4632 -3575 9819 -3500 3300
375 3300 2946 209 8500 -4851 4402 8495 -10720 7945 5001 -11648 7613 -701 -7248 4658
389 4658 -4760 -682 -1347 -5358 6455 -7454 -3381 9382 -10834 1047 7161 -10788 4351 2607
403 2607 -5793 4917 -2788 1770 3165 -5355 8841 -348 -4842 11675 -4093 -1074 9529 -6915
417 -6915 2534 3511 -5669 4111 -5296 -1919 4100 -9994 2736 441 -9888 7979 -2576 -6249
431 -6249 8424 -3889 1542 5214 -4293 6777 -191 -764 8303 -6280 2940 6285 -8787 6310
445F310n162q630J4220j0550J614O564j1785R447k965m792J1265j3198M006R436
459E780j5430J0547M31j0341J4251o401k260Q939r636R091l01r057J4769r491
473H91k571J3583j5258M685O945j3093Q684k973m169P584j0344O856K586j3590
487a0184J4879m840q490J6061j1612j436J1205j0489N802j047n430J0990r855
500d446K781P337j4618J2009K208j2987J3275m646m163R892r291M610N60q221
514e700J2168q941l045J2947j4828M164R189j3223P778J01m750Q763p377M146
528A392L041j0150J3808m798r251J5966r947k656J1050j1805M645K769p438P730
542D356p209J474P321j3335R314J534j2271J3429n129o421J1220r395K816L735
$$ plain form
445 6310 1148 -7482 6738 -3812 -2198 4366 -7419 2028 -937 -5729 5536 -7662 -3656 5780
459 5780 -9650 897 1328 -9013 5238 -1163 -3423 5516 -4120 4971 4670 -4387 10382 891
473 891 -1680 11903 -3355 1330 8275 -4818 3866 893 -3276 4308 -6036 820 3406 -10184
487 -10184 4695 -145 -8635 7426 -4186 -5622 5583 -4906 896 -151 -5581 5409 -4446
500 -4446 -1665 5672 -8946 3063 5271 -7716 5559 913 -3250 6642 -2649 1961 2521 -5700
514 -5700 6468 -2473 -5518 7429 -7399 -3235 5954 -7269 509 610 -4140 4623 -2754 1392
528 1392 4433 -5717 8091 3293 -5958 10008 61 -2595 8455 -3350 1295 4064 -3374 4356
542 4356 -2853 -1379 5942 -7393 1921 3455 -8816 4613 -516 -6937 4283 -5112 -2296 1439
556A439q666R736n286l174J2471j1885L203Q254j2046R608M43p737R370o353K250
571A627M637j1591J0069j848q749J3068q920l490J1234j0823M031L394q272Q593
585B960n046r02Q148j1456O937L454j1177J1574l581o635J1632q006J602N237
599D741q815Q224k465m774J0446r635K122P304j2106P899L09q437R975o717j412
614c341P203j0253P115M34q839J1224n871k663R986j0452M758M448q862R012l935
629c6k944Q965r685M585M005j0902J0552k201p399J1299p891l85O754q418O065
644B364j494m893Q940q531J676O817j2048Q319J772j0165J0737m372l339Q975
658D758q160M228K251o776R255n398k365R331r939M072M386j0354R138k781n760
$$ plain form
556 1439 -7227 2509 -2777 -5951 6520 -5365 -2162 6092 -5954 3654 4097 -3640 5730 -623 1627
571 1627 6264 -5327 4742 2894 -5855 7213 -1707 -5197 6037 -4786 -755 2639 -5633 2960
585 2960 -2086 -2988 5160 -6296 641 4095 -7082 4492 911 -5724 5908 -2098 -496 4741
599 4741 -4074 4150 1685 -3089 7357 -2278 -156 7148 -4958 2941 3250 -5187 4788 -1929 -3341
614 -3341 3862 -6391 724 1158 -7681 3543 -2328 -4991 4995 -5457 -699 3749 -5113 3899 -36
629 -36 -2980 5985 -3700 885 4890 -6012 4540 2339 -5060 6239 -1652 -2037 4717 -3701 2364
644 2364 870 -4023 4917 -3614 -1938 4879 -7169 1150 2922 -7243 3494 -878 -4217 4758
658 4758 -3402 826 3077 -3699 5556 158 -2207 7124 -2815 1257 5643 -4711 4427 1646 -4114
673d114R395q185J590N253r990P654r05p128J0038p098j97P082r126N904M44n855
689e238R123o882M86Q026j0829P034K711r753J0792l511n215R153o898J963L111
704D073o806O743l632k691P801r834M325M404j1246R263j197p698J0653o497j305
719c644P123q129N508L62n445Q579o650O49O993r465O647J207q383J0290n425
734B17k849Q516r143M146L084r583Q972k975m877Q686p352J460M089p248O311
749A454k459l057Q346q979L835N263j0717R052K00q207J0386m800k734P713o968
764a672L413R63m903P274o147K07O855j0845O253K331j0069R204k885m989Q163
779C153p028J902L946p716P653k340l983Q783p153J477N435q005O395q03m620
$$ plain form
673 -4114 5281 -2904 -1314 3939 -6051 1603 698 -6430 3608 -3490 -3687 3395 -5731 173 617 -5238
689 -5238 3885 -2997 -2511 5515 -5314 1720 4431 -5322 5470 1959 -3256 5897 -1001 962 4073
704 4073 -2733 4010 378 -2313 5488 -4346 -21 4383 -6863 2400 1203 -6495 4158 -2339 -3644
719 -3644 3479 -4650 858 1220 -4225 4354 -2296 -1647 5346 -4119 2528 3735 -4648 5642 217
734 217 -2632 5884 -3259 887 3971 -5612 3360 385 -4492 4194 -3158 -1698 2391 -4857 1454
749 1454 -1005 -4062 4284 -4695 -860 4403 -6314 2738 2938 -5269 5117 317 -2417 5296 -1672
764 -1672 1741 2704 -2199 5075 -1072 -865 5990 -4855 1398 3729 -6340 2864 -21 -5010 3153
779 3153 -3875 -1973 1973 -5743 1910 -430 -4413 4370 -2783 -1306 4129 -3876 2519 1716 -2904
794b904Q203p066J644N779j0067P277J004q822R395l684m078P565o570K206J427
809A309m962O743n777o7P097j0248N362M273j0613R158q85o263Q687n125M77M286
825C452o084O255k264l557Q115p450J082N897r444O031L50o570P831n408q68O265
841C633q483N098J562p627Q462l325l203P242o607K805K520o175P314m277j445
856b506P979q749L737N037j0133P945j77o421Q005m892l69M082o495N226j955
871C14m218Q070p589P81O595r930N928K063q030Q564l275k644P040o695L442K444
887B860o540P283l172k498P100p258K821L187p145O971k572l904Q271p821J622
902g95N366r032N812M33o209P163m103j208M708o126M800q49m378P902o243L68
$$ plain form
794 -2904 5299 -1767 -123 5656 -4411 2866 3870 -4952 4443 759 -3319 4246 -2324 -118 1309
809 1309 -3653 3090 -2687 -2754 4343 -5905 -543 3730 -6883 2275 1390 -4873 3814 -1311 -834 3452
825 3452 -2632 3623 1359 -2198 5917 -1533 -451 5446 -3998 2033 2383 -4187 3644 -1764 -2632 3633
841 3633 -4850 248 1810 -5817 2645 -680 -3883 3359 -3248 -443 2077 -4098 3216 -1061 -2506
856 -2506 5473 -3276 461 5498 -4635 3310 3133 -3288 4717 -175 -544 3538 -2957 2269 314
871 314 -3904 4166 -3423 -2642 3953 -5977 -49 2014 -6016 2548 -727 -3371 3669 -3026 416 2860
887 2860 -3680 3603 431 -2067 5033 -2225 596 3783 -3362 3609 1037 -2867 5404 -2417 -795
902 -795 4571 -4461 1351 1784 -4425 2738 -1365 -2573 2135 -3991 809 -40 -4418 3484 -2759 -2391
918b391P754r776N269L644q624P685j889m052O677n236J730K153n769O038l728
933e15k209O975p947K924M082q639O933r38n679Q382n743l34N904p590M808J035
949A449n557P037l722p56N324o460M492L59m958P784n370j192P574q882L495L868
965D485q939O947j130n212O399m417L97K422m560N178l094k025P283p668K850
980a084N424r606O995Q93p219Q258l491k474O302n771K743J193m481N784m306
995h40k56N069p137M447R88o815P642l704l442Q126p593J703M837q063N655J94
1011H11m782O210l460K73L113m677N294k035k645P093p228J887O034r758N898
1026B028K081q372P495j803m269N864m560J119J619m088M903m085r9N235p928
$$ plain form
918 -2391 5363 -4413 856 4500 -4124 3561 1672 -2380 4297 -939 791 2944 -2825 3213 -515
933 -515 -2724 4251 -3696 -772 3310 -5329 1604 666 -5013 3369 -2374 -2708 3196 -4394 414 1449
949 1449 -4108 2929 -793 -1549 3775 -2685 1807 2166 -2792 4992 -378 -1570 6004 -2878 617 4485
965 4485 -4454 2493 1363 -3849 2550 -1867 -1470 952 -3608 1570 -1524 -3549 3734 -3934 -1084
980 -1084 4340 -5266 1729 2622 -4597 3661 170 -2304 3998 -1773 970 2163 -2318 3466 -840
995 -840 -1096 3973 -3164 1283 2271 -4544 3098 -606 -4048 4078 -3515 -1812 3025 -5038 617 811
1011 811 -3971 2239 -1221 -948 2165 -2512 2782 747 -1898 5195 -2033 -146 5888 -3870 2028
1026 2028 4109 -4263 3232 1429 -2840 3024 -1536 -417 1202 -2886 2017 -2068 -2167 3068 -4860
1041d860M886K453q094Q382k282n108Q754n792j89N752o658M148O56m254N313
1056C107l438M06L050n686M985j807l770P604o717q1O790r222M282L453q252O307
1072A011l60m275N611l447R33J506l163N068l912k31O010p936M078L817q751P107
1088C066j59o434P882m321j699N448n567K458N05l685M661m224Q00L352o304N212
1104I91o21n137P792m836j617P719p924K799M417p271N303Q4l877N318l700J024
1120D64J530l722N054l611j471O387p596K402M852r107N954J083p051P185k836
1135d83k713N237m344J984P18k963M787l878M02M828p139N142J044o578P997l210
1151H31l439P295n988P97M217o025L890m93l162M621l956J159J703m932N050k248
$$ plain form
1041 -4860 26 2479 -5615 2767 485 -4623 4131 -1661 -1850 3902 -2756 1392 2048 -2206 3107
1056 3107 -331 75 3125 -2561 2424 617 -3153 4451 -2266 -2347 4443 -4779 -497 2956 -5296 1011
1072 1011 651 -3624 1987 -1460 -527 979 -2184 2884 -1028 -1259 4751 -3185 893 4710 -4041 3066
1088 3066 2907 -3527 4355 34 -1665 3783 -1784 674 1179 -2506 2155 -2069 -1269 2083 -4221 991
1104 991 370 -4767 3025 -1811 -3428 4291 -3633 -834 3583 -3688 1615 1699 -2178 3140 -560 464
1120 464 1994 -1728 3326 -285 -1756 4631 -2965 -563 4289 -4818 1136 2219 -4832 2353 -483
1135 -483 -3196 2041 -2303 -319 399 -2564 2223 -1655 -1253 3575 -3564 1578 2622 -3956 4041 831
1151 831 -2608 4687 -1301 -504 3713 -2312 1578 1085 -2077 2544 -1412 -253 1450 -3482 1568 -680
1167f80k927O833o072P06N606p750M270K319o374O375j993k477N114m270K392
1182A072N76l112M726l661k65M896p065L769K307p153O675j643m906O690m481
1197a575k36L882n057L329k89k928M826m145J169L334n595M808n26m265O900m523
1213h91p70N988o685L062K445n633M997j475k434M275m246J640J223m107M875
1228B264l354j392N465o385K395L595o939N417l24m479O065l530m03M063m600
1243b142L333p6k936N087m186N94L908o225M299O16n045N994l175j943N070n374
1259b201J858K352n169M459j533k314M594m440J694J976m603N003k098j969N464
1274C073n000J441L834o122M535M58m519N477k857j018L585m457K726P8l621N147
$$ plain form
1167 -680 -3607 3226 -2846 -2140 3466 -4284 -14 2305 -4069 2306 313 -2164 2950 -1320 1072
1182 1072 1648 -1464 3262 -399 -664 4232 -2833 936 3243 -3910 2765 1122 -3784 2906 -1575
1197 -1575 -1811 2071 -2986 343 54 -2874 1952 -2193 -1024 2310 -3285 1523 997 -3268 3632 -891
1213 -891 -1661 4327 -2358 704 3149 -2484 2513 1038 -1396 2879 -1367 273 1496 -2611 2264
1228 2264 -1090 -2482 2983 -3402 -1007 2588 -4351 1066 742 -3737 2328 -1202 -1605 2458 -2142
1243 -2142 1191 1115 -1821 3266 -920 -326 3582 -2643 1656 2272 -2773 3221 46 -1897 3173 -2201
1259 -2201 -343 2009 -3160 1299 -234 -2548 2046 -2394 -700 1276 -3327 1676 -422 -2391 3073
1274 3073 -1927 -486 3348 -2774 1761 2219 -2300 3177 320 -698 2887 -1570 1156 1234 -2387 2760
1290B760l898k39M055n738L127J625n375N278j895k629N259m417J372K499m772
1305b988M270j164k246N069m387J372K878m805M158o63l534N410l957l0L861n609
1321b365L183P97m509M752k682j036L717m540K551Q86l880M725k903j069N038
1336B665n265K555K212m978M750j127k907N068l861Q57K555m343L837j060k538
1351a580M531m165N89L462n558L752j65l729M864l171o03L772m808K592J232m053
1367c038M693k042j200L982l966J874J629l977M389j982j855M688m481J392K456
1382B562m893M072p66l149M486l472L01K582m200L193l25l190M733l660L58L349
1398A981m829L324P33l972M974k551j092M107m175K383J136l902M280j846j718
$$ plain form
1290 2760 -1138 -1377 2678 -3060 67 1692 -3683 1595 -300 -2929 2330 -2087 -715 1784 -2988
1305 -2988 1282 118 -2128 2941 -1446 -74 2804 -2001 2157 1494 -2040 3370 -587 -617 3244 -2365
1321 -2365 818 1615 -2894 1858 -824 -1860 1857 -2683 -132 754 -3126 1599 -1304 -2373 2665
1336 2665 -2600 -45 2167 -2811 1939 812 -2095 2973 -888 -31 2524 -1819 2018 958 -1580
1351 -1580 2951 -1214 -625 2837 -2721 1031 866 -2863 2001 -1170 -1773 1999 -2809 -217 1015 -3038
1367 -3038 1655 -387 -1587 2395 -1571 303 1932 -2045 2344 362 -1493 3195 -1286 106 2562
1382 2562 -2331 1741 975 -2174 2312 -1160 -859 1723 -2477 716 391 -2799 1934 -1726 -1368 1981
1398 1981 -2848 476 1209 -2763 2211 -340 -1432 2675 -1500 883 2019 -1883 2397 551 -1167
1413a167M244m350J562K016m543L716j142k433M326l867N46K877m915L766m38
1428A98l157M792l126k07L334m236L008N33l303M525l056k38L914m600K244J702
1444B327m267M265j676j987M122l921J223J642m058L458j080k218M106l802J010
1459h56K301m049L558p54k600M439l176J01L173m147L092L94l521M308k382n91
1475g10L484m158K223P06l433L971k220j415L874m321J796J589m029L684j214
1490a73j944L650l138N77K522l753L205o69k290M178l325O68K786m147L171J64
1506A482l137M267k636n81L439m115K184O55l511L692j975j234L373l675J244
1521e28J616l707L818j661j699L864l642J469J945l925L721o50k451L973k910
$$ plain form
1413 -1167 3077 -1273 289 2305 -2238 1478 336 -2097 2229 -1638 -1092 1785 -3130 636 198
1428 198 -2959 1833 -1293 -1500 1834 -2402 606 1139 -2164 2361 -695 -933 2981 -1619 625 2327
1444 2327 -1940 2325 649 -1338 2784 -1137 86 1728 -2330 1128 48 -2170 1936 -1866 -856
1459 -856 1445 -2604 954 200 -2400 2039 -1137 -1036 2137 -2010 1082 1476 -2045 2263 -119 -710
1475 -710 2774 -1384 839 1545 -1888 2083 -137 -1552 2322 -1999 -203 1386 -2643 1041 -173
1490 -173 -2117 1533 -1605 -1028 1494 -2259 946 277 -2013 2165 -1160 -492 2294 -1853 1318 1482
1506 1482 -1655 2612 -24 -605 2834 -1281 903 1558 -1953 1739 -236 -1470 1903 -1772 -528
1521 -528 1088 -2619 1199 -462 -2161 1703 -1939 -470 1475 -2450 1271 621 -1830 2143 -767
1536g67M43K555l590K539j15k426L814k802j11K819m236K431N89l253L809k370
1552f71j137L685l638J377J211l276L523j612j004L399l410J349J670l351L370
1567A485q98k041L788l105Q23K120l671K650l1k551L721k729k06K367l462K248
1583E08J07k879L811k585m28K858l741K207J075l295L494j294j393L349k991J300
1599A03J395l040K932r96j271L362l264Q82J922l600K935m93k477L372k393k56
1615h87K438l595K261J0k194L051k108m46L007l835K229R41l024L458j367j094
1631a155L267l289J763J435l480L006q03j795L457l061Q35J604l596L030r21j730
1647a433L490l172J71K538l826K533q2k371L004j675l37K406k807J969J29k075
$$ plain form
1536 -767 -324 2231 -1359 1180 1065 -1361 2453 -349 -460 2359 -1877 554 1143 -2110 1699 -671
1552 -671 -1808 1877 -1761 -384 827 -2449 1074 -538 -1542 1857 -1553 -204 1466 -1885 1485
1567 1485 587 -1454 2334 -771 52 2172 -1499 1151 1120 -1431 2290 -439 -645 1722 -1740 508
1583 508 615 -2264 1547 -1038 -1466 1392 -2349 -142 933 -2362 1132 -162 -1555 1794 -1197 103
1599 103 1498 -1542 1390 394 -877 2485 -779 103 2025 -1575 1360 867 -1610 1762 -631 -887
1615 -887 1551 -2044 217 227 -1967 1084 -1024 -1470 1537 -2298 -69 872 -2152 1306 -61 -1155
1631 -1155 2112 -1177 586 2021 -1459 1547 744 -1051 2406 -655 180 1784 -1812 1218 297 -1433
1647 -1433 2057 -1115 -944 1594 -2232 301 219 -2152 852 -823 -1160 1246 -1561 408 537 -1538
1663a538L268j930o28L154l485J720J520l832L353q38j948L365k898N81J560l297
1679a873K741r27j732K971k713O14J948l219K540j04k468L636k241o6K616l082
1695a359J650J071k798L197j480o57K355k821J507P58k793L152j691j279L276
1710B088l443J003J723l539K792n53j925K858k398O93J598k826K279k16j458L079
1726A755k628N94K264l513K380L88k699L385j556j281L188l064J357O96k546K254
1742I74j211q03K544k747J106Q51k996L200j327j690L612k715L38K183l178K413
1758E54K27k017K549j896N98J488k454K161m51j746L087k496j83K767l627J933
1774D94P54l022K659j143j151K655k551Q81O71k235K634j122q75K752k765J220
$$ plain form
1663 -1538 1730 -200 -828 2326 -1159 561 2081 -1751 1602 764 -1184 2181 -717 -136 1424 -1873
1679 -1873 868 -59 -1791 1180 -1533 -919 1029 -2190 350 246 -2222 1414 -827 -893 1723 -1359
1695 -1359 291 1362 -1436 1761 281 -376 1979 -842 665 1423 -1370 1782 91 -1188 2088
1710 2088 -1355 -352 1371 -2168 624 71 -1854 1004 -1394 -701 897 -1929 350 134 -1324 1755
1726 1755 -873 -279 1985 -1528 852 1240 -1459 1926 370 -911 2277 -787 570 1266 -1280 974
1742 974 -237 -1040 1504 -1243 -137 714 -2282 918 -409 -2099 1513 -1202 -864 1319 -1859 554
1758 554 781 -1236 1313 -583 15 1503 -951 1210 759 -987 2100 -396 -579 2188 -1439 494
1774 494 1248 -1774 885 -258 -1409 1246 -1305 -424 247 -1988 646 -476 -1351 1401 -1364 -144
1790a44J630l373L056m81k247L552k179k14K217k977J949L05k072K468j915Q7
1806c38J711k783K046j53k410L243j933q44K643k917J189J629l145K686n65j393
1822a334K619k114Q27J035k253K609r40j255K854k747N77J992l109K148J15k548
1838a524L031j902l24K056k616J396K96j991K280j502n2J980k927J878N40k330
1854a711K978j336j248L116k755R13J844k838J929j46j388K137k038O31J067k514
1870a359K442p58j724L013k772K03K255l206J693O72k347K476j174l87J939k121
1886a155J410K82j819K724j508p17K729k827J207J287l100K792o95j572K761k252
1902d53j4J605k410J710l86j411K472k068L49J563k679K113k27k177L268j865
$$ plain form
1790 -144 1486 -1887 1169 688 -1559 1993 -186 -400 1817 -1160 789 1094 -978 1490 -425 -338
1806 -338 1373 -1410 636 483 -1927 1316 -617 -1461 1182 -1735 -546 1083 -2062 624 59 -1334
1822 -1334 1285 -829 -2 1033 -1220 1389 449 -806 2048 -699 -122 1870 -1239 909 1024 -1524
1838 -1524 1507 -395 -719 1337 -1279 117 413 -1578 702 -800 -852 1128 -1799 79 619 -1711
1854 -1711 1267 -69 -1317 1799 -956 -43 1801 -1037 892 746 -642 1495 -543 88 1155 -1359
1870 -1359 1083 325 -1399 1614 -1158 -955 1300 -1906 -213 459 -1888 588 -586 -973 966 -1155
1886 -1155 255 537 -1282 1442 -66 -783 1946 -881 326 1613 -1487 1305 610 -962 1799 -453
1902 -453 -467 1138 -1272 438 52 -1359 1113 -955 -606 957 -1722 391 164 -2013 1255 -610
1918f10j21K226k601J371Q79k229K184p96p61K069k281J239M28k064K672j292
1934C13j427K949l114Q34J661k855K153k82j832K487j673o8J449k008J952o42
1950a03r04K206k023K41K162k807J694P17k541L039j626r10K596k529R82J039
1966A233k209J965q96q85J873k084Q48O89k353K834j074j547K729k338M95J931
1982A211k534J511N43j926K400j360l23J776k120J721J1j849K313j654k34K174
1998A660k794J440P78k639K495j104j171K402k193N12J253k136K002q64p42K078
2014I77k132R50J210k409K541n73j713K773j967N5K031k621J402N97k166K029
2030I84j072p1J451k243J439Qj794K264j515n47K287k740J295J137k578K330o29
$$ plain form
1918 -610 -731 1495 -1106 265 1144 -1085 1099 303 -458 1611 -670 569 997 -1067 1605 313
1934 313 -1114 1835 -1279 -445 1216 -1639 514 232 -1600 887 -786 -854 595 -1413 539 -103
1950 -103 -1007 1199 -824 -583 1579 -1228 466 1183 -1358 1681 55 -855 1741 -788 194 1233
1966 1233 -976 989 93 -792 1081 -1003 -155 534 -1819 1015 -59 -1606 1123 -1215 -720 1211
1982 1211 -1323 188 731 -1195 1205 -155 -478 1298 -822 899 910 -939 1374 -280 -514 1660
1998 1660 -1134 306 1084 -1555 940 -164 -1335 1067 -1126 -614 639 -1497 505 -359 -1101 977
2014 977 -1155 -205 1005 -1404 1137 564 -1149 1624 -343 -288 1743 -878 524 1121 -1045 984
2030 984 -88 -159 1292 -951 488 496 -1298 966 -549 -1096 1191 -1549 -254 883 -1695 635 6
2047Fj069K099j653N35Q71j689J919n30r81K045j905M37J205k426K149k89k176
2064a452K840j784l54J931k286R46P28j831J785j102l34J736k172J361N26k003
2080a465K492q73j216K561k222O03J307k102J790j79j395J976j519Q2J239k239
2096a160K086o54j371K064j905J90J689k614J807K78k062K383j147o80K117j886
2112h65P25R80j927J931q78n01J958j963J219N64k304K357q84j377K630k240L2
2129e43J764k598J743r8j540K115j432L7J468k191J597k57j475K558j725q0J843
2146A186k266J281O34k214K288p25j180K226j591N62J054k000J726r23o59J870
2162A269j936N86J141k360J708k61j453K398k039N8J810k296J582o2j385K221
$$ plain form
2047 6 -1063 1036 -617 -82 789 -900 1019 489 -492 1553 -352 85 1290 -1136 1013 724 -1452
2064 -1452 1388 -396 -750 1181 -1105 -159 569 -1262 523 -579 -913 823 -1349 12 538 -1465
2080 -1465 1027 154 -1062 1499 -723 -120 1187 -915 875 696 -699 1277 -242 -160 1079 -1160
2096 -1160 926 272 -1099 965 -940 -750 939 -1675 132 410 -1652 731 -416 -1096 1021 -865
2112 -865 -140 840 -1087 844 -34 -535 1423 -540 679 1243 -1061 1296 412 -965 1665 -575 -543
2129 -543 1221 -1377 366 268 -1272 843 -589 -552 916 -1275 322 65 -1410 1148 -577 -657 1186
2146 1186 -1080 201 835 -1379 909 184 -996 1230 -361 201 1255 -745 981 58 -601 1269
2162 1269 -667 -81 1060 -1300 408 147 -1306 1092 -947 -889 921 -1375 207 145 -1240 981
2178I81j311j88J600j645R42M26j749K229j303o85K196k249J064R36k291J743
2194F96n57j027J865j716M02O69j668J834o01j064K091j905P18J212k392K016
2210E73l23j470K472j364j99J678j964J026M32j610J904j182k83J564k074J195
2226C75K72j866J966q44q29K091k077N42J123k068J699j93j156J771j471M34R78
2243G47j729J627k92j217K152j617J22J711k391J531K97j839J904j062n15J685
2259A114k147J239K59j631J811j069m48J711j714M53P38j564J942o76j128K199
2275A089j724L38J387k037J364O1j130J839j224j03J168j718J451k48j341J940
2291A112j350j19J623k493J473L89k003J870p12r40J967j845P47P33j508J585
$$ plain form
2178 981 -330 -518 1082 -563 379 805 -944 1285 -18 -703 1493 -756 308 1244 -1047 696
2194 696 139 -888 977 -739 -337 332 -1336 498 -103 -1167 924 -981 -263 949 -1443 573
2210 573 250 -1220 1252 -112 -311 1367 -597 429 861 -749 1155 -27 -310 1254 -820 375
2226 375 647 -1219 747 -97 -926 1165 -912 -370 753 -1315 384 191 -965 806 -665 -231 747
2243 747 -982 645 353 -864 1288 -329 -207 1504 -887 644 941 -898 1006 -56 -571 1114
2259 1114 -1033 206 465 -1166 645 -424 -872 839 -875 -422 316 -1248 694 18 -1110 1089
2275 1089 -635 -297 1090 -947 417 478 -652 1187 -37 -140 1028 -690 761 513 -828 1112
2291 1112 -238 -357 1266 -1227 246 635 -1368 502 -210 -1150 817 -1028 -281 452 -1056 529
2307E29m41q48J824j630O36Q69j788J922n70j200J957j430L0J247j995J061K49
2324D22j149J529j192j08J385j992J260K34j675K045j123m49J745j701O90P60
2340F81j890J807n56p03J899j677O49P62j730J706o66r36J836j602L78J186k034
2357h90J441j48j614K017j203m05J515j827J033M71j332J417q51QJ165j525R04
2374A76L37j341J765q24o60J786j633L98J118j982J592k46j251J800j475L04Q04
2391F68j600J386l25j104J816j330J27R84j811J460m7j007J612j065k43J471j534
2408e42Q55L29j401J698q23n03J438j613O94P87j664J420n18r36J518j332K40
2425c53P86j338J270l28j101J688j189K6J263j596J005Jq93J795j180j74J371
$$ plain form
2307 529 88 -760 1064 -566 70 939 -849 1073 503 -697 1260 -170 -140 1107 -888 173 422
2324 422 -727 802 -390 -498 887 -1105 155 389 -1286 759 -364 -813 932 -769 -79 681
2340 681 -1209 598 42 -661 1238 -439 210 972 -758 948 282 -654 1182 -420 -42 1144 -890
2357 -890 551 403 -1211 806 -397 -802 713 -1114 -81 390 -942 475 -376 -368 797 -728 176
2374 176 513 -828 937 113 -547 1239 -394 4 1122 -860 732 486 -765 1035 -440 -136 668
2391 668 -932 454 129 -975 841 -489 -362 622 -1189 271 224 -783 829 -236 -479 992 -542
2408 -542 313 642 -759 939 116 -387 1051 -562 132 919 -745 675 157 -779 739 -593 -353
2425 -353 433 -905 365 37 -1064 624 -565 -539 724 -872 133 134 -759 1036 -144 -318 1053
2442A053j770J116L74j454J484o70n03J369j447N67M10j295J208o63j62J026j437
2459g94N39O47j636J552l73o69J489j340K32R57j421J109J47j002J369j136Q4
2476b46J018j245J027j42r79J424j002j87J076j537Q83K22j362J580o65o33J370
2493F02j186M08O06j417J250k95p10J477j188K81Q84j477J420j46j124J524r96
2510h7k24J367j839J265j88p11J279j097j56J010j432P10L82j193J272p35l63
2527g40J403j478O78P22j576J417m74l99J332j378L27Q73j073R61q2j035J585
$$ plain form
2442 1053 -717 399 773 -681 803 133 -370 999 -448 119 529 -766 442 -221 -383 643 -794
2459 -794 -255 392 -1244 308 -65 -734 755 -585 -353 604 -817 292 439 -563 806 -330 -246
2476 -246 772 -473 554 412 -567 857 -145 -332 744 -793 90 312 -1050 530 -135 -768 602
2493 602 -584 -176 430 -987 263 -32 -742 735 -453 -172 712 -765 655 509 -615 909 -87
2510 -87 -311 1056 -783 482 294 -417 862 -235 -391 619 -813 -103 279 -914 358 -377 -740
2527 -740 663 -815 -137 585 -991 426 -48 -447 885 -493 -166 707 -366 595 513 -522 1063
$$ [...]
8191G
##END NTUPLES=NMR FID
##END=
