##TITLE=1H_87-2021
 CDCl3, 8 sc, 
 31.8.2021
##JCAMPDX= 6.0         $$ Bruker NMR JCAMP-DX V2.0
##DATA TYPE= NMR FID
##DATA CLASS= NTUPLES
##ORIGIN= UXNMR, Bruker Analytische Messtechnik GmbH
##OWNER= root
$$ XWIN-NMR		Version 3.5
$$ Tue Aug 31 12:03:32 2021 Russian Standard Time (UT+4h)  she@DPX200
##.OBSERVE FREQUENCY= 200.131506
##.OBSERVE NUCLEUS= ^1H
##.DELAY= (6, 6)
##.ACQUISITION MODE= SIMULTANEOUS
##.ACQUISITION SCHEME= undefined
##.AVERAGES= 8
##.DIGITISER RES= 18
##SPECTROMETER/DATA SYSTEM= spect
##.PULSE SEQUENCE= zg30
##.SOLVENT NAME= CDCl3
##.SHIFT REFERENCE= (INTERNAL, CDCl3, 0, 15.7039)
##AUDIT TRAIL= $$ (NUMBER, WHEN, WHO, WHERE, WHAT)
$$ ##TITLE= Audit trail, XWIN-NMR		Version 3.5
$$ ##JCAMPDX= 5.01
$$ ##ORIGIN= Bruker BioSpin GmbH
$$ ##OWNER= she
$$ F:/spectra/data/she/nmr/H-F/1/audita.txt
$$ ##AUDIT TRAIL=  $$ (NUMBER, WHEN, WHO, WHERE, WHAT)
(   1,<2021-08-31 12:02:29.21 +0400>,<she>,<DPX200>,
      <created by zg, POWCHK disabled, PULCHK disabled
       configuration hash MD5:
       00 E9 B6 7A A2 85 ED C7 34 08 36 98 17 FE 4E 26
       data hash MD5: 16K
       1E D5 73 E1 01 E5 02 80 28 4C 56 70 A8 80 24 BE>)
$$ ##END=
$$ 
$$ hash MD5
$$ 86 E7 CB AF B9 72 81 81 D2 A3 8B 60 D8 68 5D 08
##$RELAX= 
##$RELAX= 
##$RELAX= 
##$RELAX= 
##$RELAX= 
##$RELAX= 
$$ Bruker specific parameters
$$ --------------------------
##$DU= <F:/spectra>
##$EXPNO= 1
##$NAME= <H-F>
##$PROCNO= 1
##$TYPE= <nmr>
##$USER= <she>
##$AMP= (0..31)
100 100 100 100 100 100 100 100 100 100 100 100 100 100 100 100 100 100 
100 100 100 100 100 100 100 100 100 100 100 100 100 100 
##$AQSEQ= 0
##$AQ_mod= 1
##$AUNM= <au_zg>
##$AUTOPOS= <>
##$BF1= 200.13
##$BF2= 200.13
##$BF3= 200.13
##$BF4= 200.13
##$BF5= 200.13
##$BF6= 200.13
##$BF7= 200.13
##$BF8= 200.13
##$BYTORDA= 1
##$CFDGTYP= 0
##$CFRGTYP= 5
##$CHEMSTR= <none>
##$CNST= (0..31)
1 1 145 1 1 1 1 1 1 1 1 1 1 1 1 1 1 1 1 1 1 1 1 1 1 1 1 1 1 1 1 1 
##$CPDPRG= <>
##$CPDPRG1= <>
##$CPDPRG2= <>
##$CPDPRG3= <>
##$CPDPRG4= <mlev>
##$CPDPRG5= <mlev>
##$CPDPRG6= <mlev>
##$CPDPRG7= <mlev>
##$CPDPRG8= <mlev>
##$CPDPRGB= <>
##$CPDPRGT= <>
##$D= (0..31)
0 1.2 0 0 0 0 0 0 0 0.06 0 0.03 0 0 0 0 0.0002 0 0 0 0 0 0 0 0 0 0 0 0 
0 0 0 
##$DATE= 1630396948
##$DBL= (0..7)
120 120 120 120 120 120 120 120 
##$DBP= (0..7)
150 150 150 150 150 150 150 150 
##$DBP07= 0
##$DBPNAM0= <>
##$DBPNAM1= <>
##$DBPNAM2= <>
##$DBPNAM3= <>
##$DBPNAM4= <>
##$DBPNAM5= <>
##$DBPNAM6= <>
##$DBPNAM7= <>
##$DBPOAL= (0..7)
0.5 0.5 0.5 0.5 0.5 0.5 0.5 0.5 
##$DBPOFFS= (0..7)
0 0 0 0 0 0 0 0 
##$DE= 6
##$DECBNUC= <off>
##$DECIM= 32
##$DECNUC= <off>
##$DECSTAT= 4
##$DIGMOD= 1
##$DIGTYP= 9
##$DL= (0..7)
0 120 120 120 120 120 120 120 
##$DP= (0..7)
150 150 150 150 150 150 150 150 
##$DP07= 0
##$DPNAME0= <>
##$DPNAME1= <>
##$DPNAME2= <>
##$DPNAME3= <>
##$DPNAME4= <>
##$DPNAME5= <>
##$DPNAME6= <>
##$DPNAME7= <>
##$DPOAL= (0..7)
0.5 0.5 0.5 0.5 0.5 0.5 0.5 0.5 
##$DPOFFS= (0..7)
0 0 0 0 0 0 0 0 
##$DQDMODE= 0
##$DR= 18
##$DS= 0
##$DSLIST= <SSSSSSSSSSSSSSS>
$$ [...]
##$SUBNAM2= <"">
##$SUBNAM3= <"">
##$SUBNAM4= <"">
##$SUBNAM5= <"">
##$SUBNAM6= <"">
##$SUBNAM7= <"">
##$SUBNAM8= <"">
##$SUBNAM9= <"">
##$SW= 20.0188882624521
##$SWIBOX= (0..15)
0 0 2 0 0 0 0 0 0 0 0 0 0 0 0 0 
##$SW_h= 4006.41025641026
##$TD= 16384
##$TD0= 1
##$TE= 0
##$TE2= 300
##$TE3= 300
##$TEG= 300
##$TL= (0..7)
0 120 120 120 120 120 120 120 
##$TP= (0..7)
150 150 150 150 150 150 150 150 
##$TP07= 0
##$TPNAME0= <>
##$TPNAME1= <>
##$TPNAME2= <>
##$TPNAME3= <>
##$TPNAME4= <>
##$TPNAME5= <>
##$TPNAME6= <>
##$TPNAME7= <>
##$TPOAL= (0..7)
0.5 0.5 0.5 0.5 0.5 0.5 0.5 0.5 
##$TPOFFS= (0..7)
0 0 0 0 0 0 0 0 
##$TUNHIN= 0
##$TUNHOUT= 0
##$TUNXOUT= 0
##$USERA1= <user>
##$USERA2= <user>
##$USERA3= <user>
##$USERA4= <user>
##$USERA5= <user>
##$V9= 5
##$VALIST= <valist>
##$VCLIST= <CCCCCCCCCCCCCCC>
##$VD= 0
##$VDLIST= <DDDDDDDDDDDDDDD>
##$VPLIST= <PPPPPPPPPPPPPPP>
##$VTLIST= <TTTTTTTTTTTTTTT>
##$WBST= 1024
##$WBSW= 4
##$XGAIN= (0..3)
0 0 0 0 
##$XL= 0
##$YL= 0
##$YMAX_a= 330973
##$YMIN_a= -397629
##$ZGOPTNS= <>
##$ZL1= 120
##$ZL2= 120
##$ZL3= 120
##$ZL4= 120
##$ABSF1= 10
##$ABSF2= 0
##$ABSG= 5
##$ABSL= 3
##$ALPHA= 0
##$AQORDER= 0
##$ASSFAC= 0
##$ASSFACI= 0
##$ASSFACX= 0
##$ASSWID= 0
##$AUNMP= <proc_1d>
##$AZFE= 0.1
##$AZFW= 0.1
##$BCFW= 1
##$BC_mod= 2
##$BYTORDP= 1
##$COROFFS= 0
##$CY= 11.3945322036743
##$DATMOD= 1
##$DC= 2
##$DFILT= <>
##$DTYPP= 0
##$F1P= 2.36226072786647
##$F2P= -0.459571619588291
##$FCOR= 0.5
##$FTSIZE= 0
##$FT_mod= 4
##$GAMMA= 1
##$GB= 0.15
##$INTBC= 1
##$INTSCL= 1
##$ISEN= 128
##$LB= 0.24
##$LEV0= 0
##$LPBIN= 0
##$MAXI= 10000
##$MC2= 0
##$MEAN= 0
##$ME_mod= 0
##$MI= 1.114404
##$NCOEF= 0
##$NC_proc= 0
##$NLEV= 6
##$NOISF1= 3.799351
##$NOISF2= 2.8
##$NSP= 1
##$NTH_PI= 0
##$NZP= 0
##$OFFSET= 15.70392
##$PC= 1
##$PHC0= -13362.18
##$PHC1= 15.20099
##$PH_mod= 1
##$PKNL= yes
##$PPARMOD= 0
##$PSCAL= 0
##$PSIGN= 0
##$REVERSE= no
##$SF= 200.130013532006
##$SI= 16384
##$SIGF1= 3
##$SIGF2= 2
##$SINO= 400
##$SIOLD= 16384
##$SREGLST= <1H.CDCl3>
##$SSB= 0
##$STSI= 0
##$STSR= 0
##$SW_p= 3612.71676300578
##$SYMM= 0
##$S_DEV= 0
##$TDeff= 0
##$TDoff= 0
##$TI= <>
##$TILT= no
##$TM1= 0
##$TM2= 0
##$TOPLEV= 0
##$USERP1= <user>
##$USERP2= <user>
##$USERP3= <user>
##$USERP4= <user>
##$USERP5= <user>
##$WDW= 1
##$XDIM= 8192
##$YMAX_p= 0
##$YMIN_p= 0
$$ End of Bruker specific parameters
$$ ---------------------------------
##NTUPLES= NMR FID
##VAR_NAME=  TIME,          FID/REAL,        FID/IMAG
##SYMBOL=    X,             R,               I
##VAR_TYPE=  INDEPENDENT,   DEPENDENT,       DEPENDENT
##VAR_FORM=  AFFN,          ASDF,            ASDF
##VAR_DIM=   8192,          8192,            8192
##UNITS=     SECONDS,       ARBITRARY UNITS, ARBITRARY UNITS
##FACTOR=    0.0002496,     1,               1
##FIRST=     0,             0,               0
##LAST=      2.0444736,     0,               0
##MIN=       0,             -397629,         0
##MAX=       2.0444736,     330973,          0
$$ Real data points
##PAGE= N=1
##DATA TABLE= (X++(R..R)), XYDATA
0 0 0 0 0 0 0 0 0 0 0 8 -8 8 -8 16 -16 24 -24 32 -40 49 -57 72 -82 97 -116 137 -159 184 -212 242 -280 320
32 320 -360 409 -464 522 -586 657 -736 822 -913 1015 -1127 1248 -1384 1527 -1687 1860 -2049
49 -2049 2259 -2487 2741 -3019 3329 -3679 4069 -4510 5020 -5606 6296 -7117 8115 -9361
63 -9361 10964 -13112 16161 -20839 29018 -47439 179955 -143891 -182756 330973 -87486 -82307
75 -82307 256682 -1184 -226677 77590 43120 -106176 85284 57532 -243574 -61902 111930
86 111930 -28066 -38229 -48843 -82328 12039 -59766 1024 113239 -99709 -129086 63383
97 63383 21025 9169 29001 -71183 -57928 45891 19524 -27637 25382 -14693 -104094 10397
109 10397 48136 -18960 17892 -93825 -87110 132473 -26168 -116994 110148 -26345 -142726
120 -142726 89913 61843 -74473 20016 13014 -75206 50096 99239 -79700 -30754 91004
131 91004 -47584 -19146 78844 -30904 1556 823 -71303 88218 35917 -127191 48473
142 48473 60350 -101770 23948 81840 -76716 -21917 90744 -58825 -49379 140872 -30910
153 -30910 -120037 132112 35745 -113956 77242 57904 -62140 21403 34521 -2791 12970
164 12970 16272 5362 -8240 22478 24443 -18279 9826 26515 -2182 -15991 3452 46554
176 46554 -12608 -40696 50013 -2762 -37316 43214 -17456 -21875 36535 -40599 -13840 46124
188 46124 -32581 -29029 21279 -11603 -22724 16185 -1112 -40190 20723 12725 -61335 38936
200 38936 37668 -84131 23124 50710 -59386 14903 31291 -42210 4724 19301 -19555 -6452
212 -6452 12807 -12825 -30443 16771 4516 -37622 7752 -7754 -26240 19195 -22097 -17182
224 -17182 24176 -30940 -7958 26063 -18036 -355 8018 -6530 10531 4794 7972 4488 2308
237 2308 20591 -2657 6695 24607 -9487 7742 11711 -5047 18593 -9222 -6079 22189 -20130
250 -20130 860 18360 -22887 4529 7043 -16482 7527 1618 -5323 -1634 602 12236 -9518
263 -9518 3443 18381 -17192 11685 17360 -16479 19258 6566 -13303 22135 84 -2922 14061
276 14061 -6036 6029 3794 -3578 8947 -8483 2598 4736 -12540 12284 -4361 -12586 13419
289 13419 -13713 -5161 9300 -18264 2044 -972 -16059 5877 -9961 -7408 2413 -15869 1665
302 1665 -4769 -14461 5610 -14175 -7222 5035 -16735 3320 -1122 -12943 9674 -7230 -2602
315 -2602 10746 -10407 7872 5664 -6687 15511 -1186 1426 15618 -4958 12204 9882 -3410
328 -3410 17735 1749 3795 17480 -4040 12117 10044 -3942 16924 -418 143 14125 -8645
341 -8645 6940 5890 -10402 10692 -4396 -6250 8256 -11672 1237 1017 -13671 6314 -8499
354 -8499 -9621 6402 -15100 -1457 940 -15235 4933 -7281 -9581 5413 -13693 -314 779
367 779 -14883 6644 -6415 -10577 8122 -12240 -2522 4059 -12094 4431 -3272 -6244 5822
380 5822 -9557 4256 3360 -10780 13308 -1674 -6260 17402 -6019 2147 15597 -5886 9451
393 9451 9905 212 10673 2039 9747 6384 -2835 16691 -1135 -2243 18349 -9574 3070 15059
407 15059 -13567 6575 8160 -9434 6301 -2093 -1967 2887 -7803 4316 -3715 -5858 6980
420 6980 -11944 -186 6149 -15502 3460 462 -9565 5190 -10003 -862 5203 -15398 4916
433 4916 818 -12719 9867 -6453 -7350 12348 -7513 -4887 7475 2079 -831 -3891 10342 37
447 37 -9335 17116 -6681 -9051 22774 -17741 -9402 27473 -19116 -13988 18286 -11819 -11469 6981
461 6981 -6025 -14163 1476 2769 -20622 4561 15425 -31489 1218 24500 -25214 2604 15036
474 15036 -20841 9387 9852 -12984 10779 5293 -9564 742 10142 5674 -9161 976 4383
487 4383 -4996 10586 -3580 -6467 16009 -12188 -3560 23032 -6532 368 6047 -7898 22101
500 22101 8697 -11185 17997 6667 -4383 15584 10969 1870 3488 3282 -4491 9611 19947
513 19947 -24619 -11167 30773 -23673 -13976 31223 -27336 -16999 20005 -25425 -1392 24498
525 24498 -29980 -16202 27201 -2237 -16810 20290 5165 -22120 23908 13043 -20694 35573
537 35573 4063 -41833 43580 22892 -42385 21849 15774 -33202 10113 14884 -23305 -5681
549 -5681 8731 -25093 -16053 24850 -16799 -38158 13245 -3135 -23431 2664 -6916 -4208 -5665
562 -5665 -16824 14864 1540 -15856 14329 -7340 -7984 26559 -8360 -16613 25410 5207 -23967
575 -23967 12525 25515 -20088 -4454 24850 -18379 2844 26584 -31833 7042 34381 -39460
587 -39460 1760 40405 -27278 -5474 28726 -16492 -2477 28987 -11675 -13464 35212 -3049
599 -3049 -30711 39251 15537 -37361 23053 13773 -22753 23378 2542 -17621 21478 -4271
611 -4271 -12709 20802 889 -11582 4003 -400 -2793 12207 -1975 -23265 13329 11853 -32549
624 -32549 13444 22675 -38825 -913 21136 -19895 3466 5757 -20657 2025 6883 -3988 -2436
637 -2436 -2969 1431 -4800 -5595 10260 7251 -13024 -14165 17142 7942 -24674 14494 10149 -36528
651 -36528 15792 17951 -33753 14780 10441 -39757 11834 25766 -25917 -7066 17047 -14494
663 -14494 -9011 24260 -6293 -15844 21978 -10727 -11726 40568 -8895 -23544 31622 -3028 -11788
676 -11788 29598 -2423 -15534 13914 2493 -7999 11266 8061 -20181 -5831 17954 -8738
688 -8738 -7180 8248 -13879 -4213 4164 -5736 8362 -7410 -12642 11135 -3707 1578 13467
701 13467 -13556 -2625 15164 -1535 1913 11159 504 -8723 6504 15595 -4268 1446 5248
714 5248 -13922 10019 11400 -14176 8105 -1312 -18253 14483 4158 -11650 5719 -7858 -10990
727 -10990 10607 6111 -10331 -5568 5672 -8166 -2372 19514 -10106 -13963 12930 -8422 -581
740 -581 17426 -13961 -8381 7688 -4240 3519 4111 -5613 -5422 -3238 6287 3134 -1468 -612 -10466
755 -10466 1893 8576 -3625 4358 -4303 -10131 8879 275 1128 6655 -13174 -1716 8867 -1947
769 -1947 5780 -1536 -8791 1773 2204 4963 1267 -4986 -1641 -4624 6128 8360 -6589 2026 -2212
784 -2212 -5330 14387 946 -5027 6581 -8075 1261 13318 -1948 -670 233 -2499 3409 3662
798 3662 5336 -4478 -5813 6986 -2911 1344 8457 -10688 -2440 4986 -4924 6318 -415 -7590
812 -7590 2269 -3690 1970 5240 -5617 -237 -1956 -1885 5169 -2304 886 -1749 -6557 7337 -717
827 -717 -3076 5722 -7429 -1423 5370 -4119 3154 -2043 -6208 4050 -4096 5 3341 -7397 112
842 112 115 -2724 3235 -3388 75 -144 -5651 6772 -422 -4812 6956 -4424 -1498 6714 -3077 2441
858 2441 1177 -2302 5189 -1784 1742 4571 -5052 3336 1629 -2836 4955 -2892 -830 2097 -5263
873 -5263 4500 -99 -4975 5624 -3737 -1478 5727 -3647 1682 1201 -3113 5062 -2088 -6 4685
888 4685 -5243 3153 2997 -3283 4676 -1510 -1100 2774 -4253 3285 16 -5131 5397 -3354 -3137 4767
904 4767 -5728 -240 1615 -4687 3131 -1934 -2057 3121 -3939 2639 1279 -3337 4738 -1819 -283
919 -283 4854 -4958 3106 1878 -5722 6074 -582 -4252 4153 -3420 -1124 1543 -3659 1222 -2891
934 -2891 -1396 1762 -5604 2396 746 -6279 5032 -1341 -3108 5676 -4119 473 3362 -4094 4214
949 4214 282 -2073 4536 -2736 1290 3119 -3983 3310 123 -1658 2973 -2997 2274 1143 -3822
964 -3822 5530 -2154 -1416 7134 -5748 1658 6750 -7155 3606 5148 -4842 3662 2127 -1734 903
979 903 881 844 -4270 2858 2471 -9520 5322 2546 -12134 6350 672 -10383 7063 -1546 -7352
994 -7352 6033 -739 -4230 2330 2463 -804 -1590 5867 -170 -3207 8259 -2548 -2161 10549 -6073
1009 -6073 -1227 9084 -7267 533 4131 -6035 2408 -344 -4434 1293 -2182 -1981 -2740 -1757 908
1024 908 -5122 -146 -150 -4667 3551 -4075 -3023 7833 -7400 -645 8334 -8411 2887 6241 -9272
1039 -9272 5453 5504 -8485 3028 6464 -4420 -2007 7631 -677 -6980 10041 -441 -10093 14268
1053 14268 -1629 -13490 16653 -689 -13651 14308 -12 -10402 9356 1333 -7651 5215
1065 5215 4116 -8665 1388 10321 -10015 -2697 13129 -9575 -1831 12305 -9564 868 8547
1078 8547 -10016 3616 6912 -6528 2001 2331 -1488 2049 -299 -170 321 944 -2045 -771 6294
1093 6294 -5164 -3982 7608 -7153 -751 8107 -12230 1626 8035 -13453 3374 8096 -11150
1106 -11150 1105 4968 -5601 2045 4519 -5507 -1799 8547 -4638 -6373 12829 -6189 -10929
1119 -10929 14824 -6494 -9671 15323 -10961 -10105 16653 -8398 -10920 12245 -3323 -11696 7408
1132 7408 4197 -10685 3761 7093 -12211 5911 11739 -14656 5517 12752 -12389 6067 10018
1145 10018 -8387 5945 4682 -4915 5834 2841 -3620 1154 3589 -889 -3159 3155 -726 -3284
1159 -3284 3408 -4771 -1025 4615 -8730 2661 5421 -10140 5402 2013 -9442 10563 983
1172 983 -11105 9048 3540 -8487 5429 7060 -8222 -2159 10239 -5347 -3519 12542 -10301
1185 -10301 -7826 16405 -7983 -7355 13003 -10288 -7256 10955 -4854 -3559 4688 -7292 -4349
1198 -4349 7495 1194 -7657 3012 1430 -9116 8387 6555 -11240 5505 1462 -9446 12462
1211 12462 3524 -10583 4091 264 -2322 6438 915 -2136 -2055 -994 2238 2853 2174 -4801 -2941
1226 -2941 3689 -1893 4730 3063 -10693 3703 2837 -6049 10393 -55 -11851 5297 1404 -1867
1240 -1867 6918 -2111 -6635 1617 3631 -529 1307 3322 -7990 -2360 10715 -4099 -893 6558
1254 6558 -11065 1013 11183 -6943 1299 4370 -8475 2090 6632 -1110 -1654 14 -1384 -2016
1268 -2016 5131 1557 -6554 3136 -642 -5777 7938 -1501 -6761 5376 -4962 -2834 7080 -4338
1282 -4338 -2725 1857 -3140 -296 854 619 -1279 -2137 2189 -1504 314 3659 -3983 1610 1855 -4296
1298 -4296 5512 632 -3789 5582 -3244 -2397 5888 -2796 -768 1990 -3650 -92 1074 95 -580 -2537
1314 -2537 848 -2716 790 5173 -5395 788 2741 -5884 6557 4798 -6032 4597 947 -3187
1328 -3187 6303 2955 -1661 -732 984 2690 -580 3716 1038 -6465 2608 2261 -1975 3621 -3260
1343 -3260 -3407 1651 -2641 3866 1015 -6238 3000 -381 -1758 5461 -679 -2654 63 1058 3269
1358 3269 -1139 1301 920 -5560 3720 2821 -3653 2205 -2860 -3544 2783 -2570 341 -836 -6650 1167
1374 1167 -232 -3040 1822 -3404 -3085 -814 -440 2167 -3220 -841 2209 -4521 3078 3685 -3959 1988
1390 1988 214 -1552 3672 -903 652 729 -3437 3501 765 -2415 2245 -1853 -536 826 -433
1405 -433 2238 -2539 -279 4028 -3687 1819 4045 -3934 2068 2112 -932 3556 -150 1634 2000 -1752
1421 -1752 4303 1291 -1806 3700 -111 -66 2294 -195 2513 -1313 -136 4002 -3323 1364 3759
1436 3759 -4598 1750 1693 -2913 1656 -1385 -1236 444 -3197 1147 -814 -3406 872 -2912 -1749 -41
1452 -41 -3299 751 -2931 -3451 2708 -4278 -1479 2865 -4822 -390 1808 -2902 1116 257 119 568
1468 568 -1370 3518 322 -2005 4366 -1116 -827 3333 -1535 1264 506 -1947 2440 -1964 -314 2283
1484 2283 -4348 1058 1697 -3602 2078 -203 -2141 1357 -1240 1466 504 -1072 1822 -1381 981
1499 981 2319 -2895 2828 719 -3262 4937 -533 -2315 4577 -2746 -1388 4116 -1341 -512 1165
1514 1165 892 -467 -853 4136 -942 -2257 5095 -2123 -585 5825 -3432 250 4538 -2847 1842
1529 1842 1788 -1530 1447 -351 446 804 -854 598 -2025 -365 1685 -3584 730 809 -4094 1726
1545 1726 -1320 -2398 2413 -3230 -482 1796 -3333 1653 -90 -2915 3357 -1373 -2381 2488 -710
1560 -710 -1629 -315 1335 -576 -3052 2928 -1758 -4050 5317 -3481 -4548 6906 -3770 -4440 6104
1575 6104 -2190 -3207 3757 -489 -1587 1965 1846 -2637 1285 4591 -4836 171 6408 -5276 360
1590 360 5326 -5308 1800 2977 -5111 2370 1880 -3564 889 1392 -245 -1019 1220 1503 -1323 1966
1606 1966 1263 -1259 4672 -694 -2112 5372 -1283 -74 3880 -2648 2128 2187 -3667 3499 1360 -3125
1622 -3125 2097 81 -922 301 -727 -1060 -436 1542 -2607 -2409 4594 -4043 -4178 6715 -4204
1637 -4204 -3107 6440 -5494 -1574 6227 -5127 -2506 5400 -2338 -4037 3624 1618 -5305 1443
1651 1443 3136 -6382 2549 3713 -8671 2957 4175 -8359 2354 3260 -5871 916 1293 -2414
1665 -2414 919 194 -1391 -806 2174 201 -2460 2439 265 -1659 3214 -553 783 3181 -4071
1680 -4071 2570 4285 -3856 2943 1629 -3043 3924 499 -1992 3245 -109 -2196 1485 2632 -1373
1695 -1373 -2044 2900 -1280 -1386 4688 -3762 -1480 5659 -5461 -272 6118 -5706 -1223 4193 -3341
1710 -3341 337 3034 -2846 -1788 2728 -303 -3803 3586 827 -6688 3764 2305 -6001 3887 161
1725 161 -5951 5185 219 -4007 3522 -85 -2702 1642 1398 -434 -850 820 -379 -309 2975 -2060
1741 -2060 -1344 3026 -2578 280 2385 -3250 1360 -38 -3060 3659 -1024 -3098 2800 -1460 -1288
1756 -1288 2245 -985 -1069 759 642 -929 681 3131 -2520 -383 4966 -3494 211 4655 -4424 1511
1772 1511 3298 -4386 2112 1895 -3357 823 832 -1858 -560 680 -428 -1934 1735 -532 -2956 3837
1788 3837 -633 -2982 4918 -1445 -2659 5211 -1170 -982 4006 -1321 -99 2059 458 -183 -63 1535
1804 1535 -565 -868 2538 -1244 -1122 1141 -2619 777 -165 -3095 1677 -1878 -1924 2801 -2747 -1161
1820 -1161 2374 -2926 -253 2111 -1294 -190 509 560 -797 217 2125 -2341 6 2530 -3490 1122
1836 1122 2185 -4363 1574 525 -3336 2353 -310 -2341 1121 -457 -626 155 -52 -39 -1484 1492
1852 1492 444 -1667 3140 -403 -1192 3509 -1039 109 2543 -1956 1678 1508 -1746 2162 109
1867 109 -1022 2269 -355 -169 505 -88 373 -1555 1146 501 -2318 2254 -402 -2524 2684 -1120
1883 -1120 -1432 2588 -1904 46 857 -1686 1152 -135 -766 1209 -823 545 332 -402 776 -1204
1899 -1204 720 909 -2209 2369 497 -2672 3017 -263 -1768 2396 -962 -832 723 -1322 311
1914 311 -917 -797 -77 -1995 90 -456 -1734 629 -2249 -1083 836 -2523 664 516 -3000 1889
1930 1889 351 -1694 2197 -159 -79 1559 57 1611 390 387 1910 -613 1419 1093 -1451 1553
1946 1553 -504 -692 1800 -1810 568 809 -2851 1344 136 -1857 1786 -899 -839 1009 -335 665
1962 665 32 291 1712 -1254 1292 1589 -1468 2540 -70 -1323 2351 -1323 -343 1581 -1870 349
1978 349 47 -1760 782 -703 -889 -45 -1371 575 -690 -386 1205 -1909 -29 1564 -1723 1675
1994 1675 711 -1540 2042 -314 262 1744 -1386 466 408 -1299 1636 -522 -1266 315 -1206 396
2010 396 -286 -1194 378 -2229 246 1108 -2816 926 -157 -2332 2121 -96 -1282 1481 -1353 182
2026 182 1441 -606 560 -140 90 673 -334 1608 -689 -1265 2308 -1584 -261 2366 -2869 525
2042 525 1771 -2090 1150 926 -1421 393 454 970 90 -297 1023 -875 681 2079 -1886 771 804
2059 804 -1423 2230 70 -823 1224 -1785 817 1976 -1418 789 -28 -1273 1566 -235 -67 349
2075 349 -1115 441 131 1049 953 -2145 1319 564 -1565 2847 -1028 -2107 2368 -1365 -801 2355 -2226
2092 -2226 -1471 827 -441 -331 -344 -105 -1878 -706 2153 -2375 -708 2335 -3885 467 3074 -3080
2108 -3080 462 1074 -2330 1801 1153 -1062 106 -202 -305 -116 797 776 -2064 555 431 -1516 2147
2125 2147 -397 -2021 2109 -946 -353 2126 -1698 258 744 -865 2044 -168 -1002 1059 -606 561
2141 561 613 -210 321 -574 1027 278 -942 2577 -1215 -1914 3610 -1134 -1096 3385 -2367 -590 2419
2158 2419 -1805 -150 1921 -708 -833 1104 1225 -2343 663 2156 -2726 971 2122 -3536 1484
2173 1484 1471 -3592 1842 810 -2788 1223 352 -1106 428 -180 -258 -821 698 -596 -1499 1650 -787
2190 -787 -2044 2130 -1405 -1186 2129 -2083 282 1542 -2410 708 440 -1289 1000 -382 -138 579
2206 579 -560 239 86 413 195 -892 1584 -423 -1222 2257 -1206 -813 2715 -2433 98 2741 -2607
2223 -2607 425 2210 -1748 438 1578 -753 -253 1392 742 -1812 1882 1165 -2951 2371 1403 -3545
2239 -3545 2832 1091 -3080 2620 413 -1867 1421 309 -1011 265 606 -278 -1266 1231 58 -1678
2255 -1678 1728 -690 -1434 2023 -1701 14 1527 -1699 1171 526 -1682 1877 -437 -897 1836 -600
2271 -600 -266 642 -212 11 -370 522 -352 -1164 1385 -1121 -1071 2117 -2137 -724 1812 -2595 420 1357
2289 1357 -2442 668 412 -1304 900 72 -292 -421 454 537 -898 1345 611 -2028 2357 -88 -1870
2306 -1870 2719 -805 -1584 2501 -1102 -462 1476 -808 -89 719 64 -86 -121 1002 -485 -510 2004
2323 2004 -1113 -60 1507 -1533 865 1169 -1109 1503 -239 -615 1564 -785 236 1240 -1435
2338 -1435 492 960 -434 550 -225 196 23 32 1122 -1526 36 1372 -2470 1227 1393 -3163 1072
2355 1072 467 -2233 1258 22 -1168 -78 -644 77 -410 -24 136 -1568 517 512 -676 1540 -925
2372 -925 -1190 1787 -860 710 1565 -2236 462 966 -806 1042 16 -1248 -426 -694 716 -631
2388 -631 -752 -47 -1842 426 919 -1443 822 -924 -1456 2405 -603 -354 1569 -1681 305 1662
2404 1662 -301 1003 -141 -142 1061 322 1646 -234 -564 1135 -924 789 1310 -1568 381 -71 -1186
2421 -1186 2257 -641 -1479 1036 -1547 131 1369 -613 -282 -365 216 545 161 1672 -597 -958 2079
2438 2079 -433 116 1760 -1462 218 825 -779 1163 -49 -1347 384 -1208 218 664 -1021 -351
2454 -351 -792 -303 576 -962 504 -501 -1767 1780 -341 -550 1453 -1269 -109 1179 -691 1288
2470 1288 -3 -1183 892 -512 238 658 -597 232 -713 247 898 -1287 624 -206 -1794 1554 -379
2487 -379 -1239 1491 -1358 -318 1513 -688 334 148 -629 924 162 463 395 -700 935 70 324
2504 324 1525 -1166 297 883 -1302 1616 642 -1293 924 -406 -191 1212 -549 227 -67 -516 890
2521 890 -596 51 356 -1132 612 232 -599 840 -1018 -48 832 -1173 907 -76 -1380 1389 -450
2538 -450 -560 731 -922 214 547 -165 429 -742 123 608 -644 862 -631 -1101 1305 -957 -256
2555 -256 1252 -1811 -108 773 -1179 833 -397 -1065 236 -307 249 -334 -356 422 -1262 303 1162
2572 1162 -1275 609 353 -1412 1705 180 -628 1367 -870 149 521 -277 518 -382 -296 880 -709
2589 -709 792 287 -1060 964 -245 -240 1248 -690 121 239 -599 1439 -469 -909 1603 -840 310
2606 310 1514 -1081 482 430 -351 527 -60 194 -525 -336 1370 -1024 54 1226 -1770 353 1436
2623 1436 -1875 812 341 -1732 698 454 -456 348 -259 -108 -802 479 592 -1446 671 592 -1706
2640 -1706 1284 58 -1609 1231 -329 -541 841 -699 -219 -84 -630 488 -690 329 12 -1265
2656 -1265 1031 -40 -940 970 -611 -3 435 -743 642 -420 -847 1142 -780 110 1312 -1424
2672 -1424 152 847 -846 769 154 -495 343 40 590 -458 283 991 -1499 764 1289 -1755 913
2689 913 713 -1651 1351 414 -1005 1047 214 -319 208 721 315 -736 960 381 -1040 1379 -81
2706 -81 -1580 1713 -511 -891 1348 -958 -481 414 -244 493 -375 -246 275 -572 433 193 -1026 616
2724 616 -652 -513 831 -949 15 57 -670 679 -587 -57 705 -1368 825 761 -1556 785 138 -1401
2742 -1401 621 -32 -207 -99 187 248 -688 877 291 -1552 999 529 -1783 1459 -147 -1952 1521
2759 1521 -291 -756 953 -298 -433 344 478 355 -572 753 -465 -877 1533 -490 -578 1493 -660
2776 -660 -113 1386 -965 224 475 -788 789 -88 146 351 -736 835 -209 -382 813 -813 111
2793 111 290 -450 553 -209 -355 1015 -767 34 601 -1460 655 45 -875 971 -247 -769 695
2810 695 -238 78 401 -63 78 -697 493 255 -886 1382 -717 -1321 1516 -843 -690 1472 -1274
2827 -1274 -642 1003 -597 -340 -194 -81 -365 -511 963 -721 -274 1050 -815 -84 1238 -993 225
2844 225 979 -721 534 -192 -189 674 -458 384 126 -925 535 -407 -270 520 -404 282 -88 -496 672
2863 672 -647 48 867 -958 801 455 -1002 1170 38 -491 1318 -76 -215 707 13 78 47 270
2881 270 176 -507 651 -123 -990 1050 -610 -837 1036 -1032 -284 737 -1299 263 165 -784 184 -97
2899 -97 -166 141 -445 384 -531 -73 644 -843 829 188 -1167 1166 -31 -725 1014 -775 -418 506
2917 506 -786 281 12 -430 346 -355 50 77 -439 189 -450 -113 549 -794 305 430 -1164 1167
2935 1167 92 -670 1138 -589 -296 1094 -519 141 430 -117 199 -285 253 -38 -357 699 -364
2952 -364 -194 1157 -812 94 979 -1214 600 572 -962 704 112 -491 356 -35 -86 32 -141 724 -385
2971 -385 321 285 -758 766 369 -643 990 -420 -181 1068 -808 467 587 -766 326 259 -546
2988 -546 565 -453 137 -289 -36 267 -596 180 264 -822 686 46 -1267 852 -455 -958 1135 -562
3006 -562 37 464 -991 309 56 -410 32 -263 158 -291 -105 811 -1146 -394 691 -1081 548 631
3024 631 -1196 661 206 -585 735 -232 -306 229 -215 417 -211 -329 73 -792 501 530 -576 830 -143
3043 -143 -508 999 -349 9 779 -752 630 253 -143 750 -200 -1 434 -232 868 -125 -253 525
3061 525 -417 283 278 -537 741 -138 -373 899 -694 -116 753 -898 453 441 -734 601 49 -505 409
3080 409 86 211 -510 121 841 -752 368 562 -1421 768 94 -1132 982 -255 -815 501 -262
3097 -262 -397 -6 -259 -94 -535 286 -35 -1135 578 -7 -902 930 -278 -353 813 -625 115 84 -470
3116 -470 489 -404 27 431 -845 483 390 -793 732 -68 -505 526 -70 -5 131 -148 396 -669 168
3135 168 692 -1199 540 609 -873 993 186 -877 635 321 -46 77 88 141 -364 665 595 -891 1003
3154 1003 -20 -1219 1360 -86 -564 854 -405 -578 919 -289 84 -113 39 -100 -302 715 -139
3171 -139 -900 976 -275 -537 1049 -574 -498 408 -368 76 60 -327 -78 -798 231 337 -1065 416
3189 416 -123 -780 950 -149 -328 416 -278 157 -27 -46 59 -715 480 179 -946 1080 -141 -882
3207 -882 1419 -142 -916 784 -471 -223 347 73 -333 -416 505 -133 -532 1340 -472 -884 1542 -152
3225 -152 -33 1325 -905 -595 671 56 448 -91 142 -451 -132 1113 -469 -439 1047 -1001 -326 1471
3243 1471 -792 -274 268 -558 270 188 157 -228 -837 981 241 -264 929 -653 -769 1128 -140 -264
3261 -264 390 -331 -214 92 784 -216 -753 498 -338 -554 1123 -496 -1217 870 -762 -356 659 -385
3279 -385 -734 78 -46 87 -238 493 -756 -666 1610 -463 -428 1026 -925 -192 632 -546 75 15 -434
3298 -434 49 -109 459 -252 -623 538 -437 128 1064 -931 -38 689 -872 653 361 -488 76 163 193
3317 193 281 -416 703 -349 -432 1073 -487 -21 649 -610 49 473 -121 -96 -120 272 27 -244 908
3336 908 -533 -580 1009 -752 -300 1225 -909 296 839 -853 238 181 69 -209 -215 811 -614 -407
3354 -407 925 -820 272 772 -1078 -106 463 -659 135 184 -502 -141 -263 326 -221 -612 344 -800
3372 -800 -138 558 -460 -11 206 -445 476 -28 -27 547 -773 420 44 -636 418 -529 -501 496 -415 -101
3392 -101 101 -381 56 -89 -216 159 -627 629 -318 -505 856 -504 -300 847 -588 229 1066 -697
3410 -697 495 272 -299 297 -194 74 59 31 527 -251 -33 422 -693 434 377 -745 743 252 -660
3429 -660 659 -140 -152 263 -507 39 -224 -165 87 -543 2 151 -499 604 -59 -419 755 -557 215
3448 215 662 -666 749 93 -563 807 -280 -310 505 -566 190 217 -591 291 -290 16 22 -535 359 -174
3468 -174 -533 964 -694 -504 407 -883 106 268 -789 183 148 -86 194 -464 356 -288 -161 718 -266
3487 -266 255 322 -534 649 -67 -389 619 -428 -220 557 -510 444 280 -363 561 137 -296 347 44
3506 44 558 285 -114 635 -58 50 502 -496 298 413 -566 630 -110 -188 761 -407 241 623 -550 274
3526 274 -274 -312 118 -344 232 -167 -563 457 -511 -73 778 -821 433 327 -357 585 -208 -576 620
3545 620 -214 -482 470 -250 434 -399 -82 488 -630 214 -69 -632 872 -273 -341 696 -537 -59 642
3564 642 -537 65 -105 -312 213 -384 5 112 -642 426 -366 -395 709 -470 -1 259 -556 359 4
3583 4 -34 549 -519 119 262 -667 310 201 -568 741 -198 2 325 -357 -27 -3 88 499 -475 301 301 -697
3605 -697 770 259 -613 762 -214 -344 834 -134 -245 -100 32 263 -410 215 -22 -790 586 -288 -491
3624 -491 793 -665 -474 586 -262 -44 -43 -621 190 -204 46 224 -960 269 89 -499 653 -335 -263
3643 -263 305 -412 240 12 -468 -22 -200 20 501 -521 197 -326 -727 625 -499 -371 404 -677 85
3662 85 385 -244 47 -368 -156 102 -276 519 41 -486 909 -346 -427 966 -514 -96 762 -239 239
3681 239 343 -40 -31 54 734 -185 -428 730 -628 -193 1229 -475 -223 727 -381 406 500 -163 412 -52
3701 -52 298 -103 -466 522 -630 -402 970 -488 -155 394 -758 -161 326 -234 120 -428 -107 -128 -470
3720 -470 681 -415 -663 635 -465 -145 435 -819 109 443 -83 -86 -121 123 -286 -130 1001 -593 -173
3739 -173 594 -592 -97 865 -965 -389 248 -434 38 375 -74 -303 80 480 -317 176 666 -1396 107
3758 107 1011 -1033 189 555 -799 231 587 -81 34 -297 98 -458 14 789 -760 15 649 -599
3776 -599 8 699 -516 93 -35 -74 452 -135 375 -395 -115 754 -410 -31 819 -680 -77 613 -811
3795 -811 132 292 -473 -193 443 147 -287 -121 710 -437 -173 683 -1016 292 543 -647 794 183
3813 183 -557 127 -95 -14 -62 -225 115 -649 -96 607 -941 -63 437 -804 400 32 -737 336 0
3832 0 -51 -104 -124 259 -557 206 558 -745 514 545 -534 335 151 -463 362 79 -83 154 -369 485 -526
3853 -526 -136 612 -782 315 548 -414 368 526 -618 276 298 -64 -29 13 491 -285 71 737 -741 306
3873 306 588 -815 612 264 -436 494 -15 -408 189 -88 218 -294 -191 174 -407 364 239 -520 601
3892 601 44 -638 841 -3 -291 441 -288 -115 -138 -408 527 -24 11 362 -510 139 0 -394 320 -381
3912 -381 -326 228 -412 195 57 -253 379 -588 -55 461 -432 283 378 -774 522 107 -445 441 -218 44
3932 44 -121 -13 501 -304 183 458 -863 624 573 -776 842 -143 -603 771 -292 126 393 -17 153
3951 153 29 304 198 -255 328 140 -403 861 138 -587 420 -524 37 275 -125 351 -169 -403 393
3970 393 -78 214 58 -492 229 -98 -47 161 -379 30 151 -374 587 -186 -40 366 -637 116 458 -537
3990 -537 450 124 -517 347 -52 -318 113 -416 176 -238 -63 223 -433 -57 189 -437 416 -149 -728 469
4010 469 -377 -119 265 -484 7 45 -361 283 -466 181 357 -387 255 -202 -9 177 -278 -256 444 -428 288
4031 288 91 -408 331 -85 -221 603 16 79 358 -98 411 -447 81 264 -379 619 191 -469 672 -260
4051 -260 -260 564 -499 298 321 -403 414 -92 -177 483 -329 -145 308 -417 419 181 164 126 -186 338 28 -596
4073 -596 723 -211 -334 580 -751 13 152 -326 167 102 -293 109 -363 77 -83 -367 382 -282 -313 368
4093 368 -482 -6 403 -486 136 -150 -141 454 -276 419 149 -543 405 -149 -238 696 -588 41 478 -540
4113 -540 334 46 -164 143 -380 355 304 -353 312 -285 -214 578 -401 -227 316 -533 130 127 -244 248 -93
4134 -93 40 545 -233 567 -256 -84 636 -463 60 486 -371 140 507 -670 -30 -69 -315 298 -51 114
4154 114 -129 46 410 -492 96 257 -527 446 311 -627 505 -1 -52 396 -151 151 -9 -160 485 -625
4174 -625 -213 352 -808 398 454 -669 74 113 -200 30 -374 3 -393 -129 556 -362 -171 608 -798
4193 -798 129 558 -361 213 160 -248 93 -225 306 -225 -111 355 -711 -90 689 -745 9 682 -783
4212 -783 453 156 -360 216 -34 -64 25 67 524 -409 -72 616 -883 463 397 -620 489 281 -254 468
4232 468 -63 57 34 -290 312 -297 184 675 -437 -90 391 -964 452 235 -345 332 76 -152 295
4251 295 -92 213 -273 248 253 -684 297 552 -822 758 146 -566 540 -160 -382 201 -138 244 -175 81
4271 81 572 -664 53 509 -672 395 -63 -857 494 117 -350 58 -274 101 -43 -107 364 -696 373
4290 373 249 -662 472 59 -538 340 -70 -175 483 -117 -174 -67 -93 371 -327 474 103 -860 519 469
4310 469 -315 606 -260 -253 317 -154 102 12 -102 381 -443 170 120 -628 451 144 -822 519 153 -360 329
4331 329 25 14 179 70 114 -353 589 345 -589 176 118 -925 924 140 -607 426 -483 -385 -28 -72 303
4352 303 -297 14 239 -480 353 -139 -792 389 -24 -403 605 -403 -509 135 -298 129 16 88 113 -336
4372 -336 276 43 -731 186 -339 -236 545 -347 -225 94 -194 332 289 -302 237 -756 122 390 -364 389
4392 389 -278 -508 579 16 -265 448 -154 -184 331 110 372 -521 188 172 -379 650 -193 -492 559 -315
4412 -315 23 666 -350 -51 133 -110 422 -39 152 -251 -149 506 57 -132 473 -748 11 552 -210
4431 -210 6 3 -485 226 -107 232 304 -770 -21 101 -341 805 -202 -336 304 -280 314 159 -268 -64
4451 -64 -248 345 358 -628 121 57 -481 598 138 -297 96 -513 -4 360 44 324 -282 -108 326 -275 308
4472 308 -187 -562 530 -151 -51 951 -614 13 612 -579 418 -178 -394 81 -509 1 73 -394 589
4491 589 -403 -98 361 -191 617 205 -522 343 219 -19 345 -433 291 -76 -587 205 30 -163 379 -254
4511 -254 155 338 -344 302 -230 -205 278 -319 353 79 -573 322 9 -312 789 -572 -153 78 -319 270
4531 270 113 -156 180 -418 -143 112 -477 420 -404 -371 604 -280 262 331 -485 154 -46 -437 507 -416 -6
4552 -6 404 -484 189 -15 -240 248 -349 72 213 -416 312 -91 -359 449 -453 -129 557 -421 485 160 -373
4573 -373 491 -364 -106 586 -301 590 -147 -322 312 -194 201 189 -166 390 -133 -239 500 -583 -189 519
4593 519 -561 353 223 -315 246 -125 296 180 -43 159 -21 81 677 -432 37 816 -618 246 228
4612 228 -546 256 -139 127 466 -295 115 125 -433 344 -343 9 189 -584 247 -71 -443 380 -100 -341
4632 -341 362 -285 -135 386 -444 245 -67 -324 487 -603 -48 197 -481 258 -409 -351 246 -353 61 232
4652 232 -128 415 -454 55 392 -682 447 507 -465 334 -293 -214 439 -363 -181 185 -174 283 -256 -170
4672 -170 328 -276 179 72 -550 424 -145 -314 464 -343 47 116 8 325 -96 97 268 -451 130 495
4692 495 -597 418 226 -458 650 -227 -249 277 -425 214 -14 -326 500 -261 121 487 -729 462 153
4711 153 -417 251 -57 -340 334 -109 -6 172 -307 445 -395 227 362 -450 134 145 -596 224 -238 -75
4731 -75 552 -167 140 -218 -220 230 -267 117 270 -340 425 -13 -591 395 -110 -272 430 -409 97 173 -101
4752 -101 383 -47 157 216 -237 382 12 -697 760 -35 -137 346 -348 -28 121 -358 -144 -475 54 320
4772 320 -466 310 420 -524 825 -7 -336 557 -384 1 55 -177 240 -309 79 18 -603 303 101 -722
4792 -722 808 -113 -348 687 -298 -146 348 -161 157 -232 55 419 -460 109 -27 -678 251 -150 -472
4811 -472 692 -288 -506 153 -342 125 81 -391 166 -413 314 147 -549 545 107 -491 804 -279 -187
4830 -187 270 -197 317 81 -126 222 -114 35 255 -499 231 -174 -350 586 -457 -139 137 -531 107 -14
4850 -14 -259 308 -21 176 242 -350 497 14 -358 615 -106 -430 398 -355 58 277 -133 242 -64 292 207
4871 207 -284 467 11 -585 890 -319 113 797 -615 76 71 -599 283 -163 -101 124 -226 239 34 -339
4891 -339 393 -548 -155 544 -343 108 -6 -529 296 -264 -204 158 -242 116 86 -319 404 -287 -676 623
4911 623 -357 234 338 -578 92 12 183 258 -212 208 39 -538 541 -192 -164 777 -754 11 551 -312
4931 -312 233 85 -37 268 -238 155 227 -289 797 -207 123 611 -410 114 421 -560 275 51 -345
4950 -345 559 -35 173 313 -186 305 -285 -163 546 -381 -160 244 -87 251 -212 -135 474 -393 231 181 -165
4971 -165 643 -90 -310 457 -284 -40 79 -335 271 -20 -316 432 -327 51 128 -464 274 -407 -365 639
4991 639 -320 -19 181 -576 38 118 -492 236 -188 -200 216 -129 153 -354 -375 541 -415 325 150 -415 426
5012 426 153 -544 296 -330 -307 27 -281 391 32 -325 -23 -246 -90 329 -182 519 80 -265 209 37
5032 37 -93 225 -489 196 277 -167 408 -408 -179 609 -184 103 155 -538 86 -199 -95 203 -221 274 -263
5053 -263 -71 506 -267 -250 423 -232 81 192 -542 232 68 -15 456 -327 81 -74 -467 440 134 -209 117
5074 117 -484 120 267 -257 398 -127 -355 378 -296 -130 177 -143 175 -278 -182 233 -425 -146 233 -330
5094 -330 510 -63 -200 205 -392 157 145 -49 261 -213 -689 523 -189 1 180 -309 225 65 -65 490
5114 490 -522 -245 363 -193 366 75 -272 367 30 295 385 -492 516 -59 -76 596 61 -86 445 -360
5134 -360 310 330 89 612 -394 242 288 -78 292 -98 -404 309 -331 174 254 -401 134 81 -307 396 -126
5155 -126 -89 72 -326 465 -163 -273 204 -62 -97 389 -390 64 -56 -653 303 -369 -193 -72 -595 154 -216
5176 -216 -522 403 -313 -251 223 -378 140 -215 -346 373 -77 -241 302 -262 14 0 -727 179 86 -278 308
5197 308 -46 -267 137 -240 200 -292 -118 289 -386 259 9 -602 505 88 -462 282 -195 77 167 -218
5217 -218 365 -262 22 -58 -142 275 391 -214 533 -96 -390 338 -190 -112 131 -382 239 60 -8 519 -167
5238 -167 19 164 -199 407 -119 -54 164 -339 33 244 -364 231 -25 -192 206 -303 -10 378 -349 212
5258 212 -269 -430 349 -192 -31 259 -382 22 -151 -373 209 -345 15 146 -447 427 -291 -467 529 -509
5278 -509 -75 127 -316 -43 -113 -525 179 -194 74 180 -610 575 -91 -481 478 -338 -109 278 -610 133
5298 133 66 -459 271 -55 -18 357 -141 92 56 -115 332 -239 -175 574 -429 289 211 -399 619 -165 -20
5319 -20 744 27 310 -77 -153 477 67 -89 309 -476 -22 389 -430 499 72 -22 340 -180 116 -120 -426
5340 -426 241 -320 -331 254 -247 -119 226 -522 275 -19 -413 112 -155 114 107 -228 330 -457 -331 214 -495
5361 -495 125 219 -589 254 156 -380 224 -301 -8 212 -128 368 -122 -440 480 -329 -5 183 -306 151 -75
5382 -75 -218 105 -360 221 168 -356 375 -69 -378 296 6 228 409 -284 542 56 -66 466 -106 142 105
5403 105 -102 405 -424 -207 327 -227 197 484 -389 403 53 -457 426 -325 -239 83 -470 102 -150 -75 431
5424 431 -443 251 394 -383 152 -28 -328 403 -225 -111 543 -362 316 -31 -466 423 -189 -80 397 -94
5444 -94 -52 19 -476 49 -262 -152 39 -292 98 -263 156 389 -169 -71 267 -340 -235 296 -601 345 -153
5465 -153 -137 268 -8 32 -54 123 325 -399 -82 184 -223 336 82 -163 674 -79 -370 308 -208 132 419
5486 419 -277 336 -101 -113 192 -81 139 1 -101 335 72 -80 197 -48 423 -46 -235 456 -220 -3
5506 -3 312 -323 54 401 -254 244 -1 -415 208 -290 -83 224 -22 182 -10 -35 533 -257 168 98 -319
5527 -319 274 -209 -417 277 -112 -145 187 -250 -50 93 82 238 -378 -1 -94 -610 54 68 -413 197 -112
5548 -112 -125 243 -85 248 54 -338 374 -210 -293 117 -210 -44 194 -312 166 -19 307 173 -509 -19 83
5569 83 -273 268 -212 12 196 -483 242 451 -209 552 -27 -217 458 56 263 -137 124 172 -288 -13 267
5590 267 -522 593 -103 -260 441 59 35 266 -492 92 196 -352 240 105 23 122 -44 233 111 -375 87
5611 87 0 126 484 -431 277 -90 -332 374 50 -43 269 -157 19 426 -98 104 -314 -140 642 -67 8
5632 8 68 -250 245 -285 -147 386 -568 113 19 -722 109 -32 -216 174 92 190 334 -510 329 -175 -94 490
5654 490 119 111 292 -216 371 -19 -212 419 -303 -129 191 -437 205 154 -276 65 -55 179 399 -349 177
5675 177 130 -220 536 -297 29 58 -141 194 229 -230 304 -364 58 196 -196 461 -126 -367 245 -275 118
5696 118 240 -576 272 367 -187 504 -366 60 104 -462 278 -397 -259 315 -447 -289 286 -345 69 -179 -379
5717 -379 257 -212 -89 267 -380 338 8 -385 153 -174 -223 53 -355 256 199 -308 48 -471 -70 219 -141
5738 -141 351 -213 -208 422 -326 -65 168 -547 76 246 -409 380 -82 -139 212 -188 260 210 -264 273 -157
5759 -157 -67 435 -459 174 217 -294 260 39 11 158 -237 262 152 -168 364 -13 -133 493 -323 52 215
5780 215 -270 368 -80 -212 414 -239 -39 454 -231 413 -212 -207 397 -405 -346 361 -339 73 -41 104 214
5801 214 -6 31 384 -253 338 -86 -75 305 -346 -333 -39 -265 358 -168 -315 270 -308 -345 57 -90 -8 -89
5823 -89 -364 95 -329 110 378 -548 217 45 -121 635 -525 -73 82 -238 295 20 23 764 -289 166
5843 166 450 -337 125 388 -224 220 3 4 321 -126 541 76 -31 462 -523 -167 233 -179 38 223 -341
5864 -341 372 103 -119 379 106 21 61 -109 470 -315 119 232 -306 274 253 -381 331 49 -360 48 -255
5885 -255 47 256 -20 333 -255 -258 -59 -339 318 45 -261 19 -18 -88 164 -514 175 246 -387 521 -105 -200
5907 -200 447 -99 117 168 -334 74 -15 -373 216 -159 131 106 -123 300 -252 -228 253 -264 138 440 -613
5928 -613 439 61 -373 466 -156 -108 345 -196 104 -103 -80 285 -207 319 -7 -308 212 15 -124 380
5948 380 -170 -52 207 -391 263 56 -113 337 24 203 466 -306 359 -1 -180 8 -162 -160 -2 -290 201
5969 201 -197 -278 536 -96 -120 132 -191 56 71 -369 444 71 66 -8 -160 383 -166 21 107 -206 -69 144
5991 144 -370 121 -99 -272 376 -155 -304 65 -305 306 -121 -181 151 -64 -32 210 -442 146 28 -332 591
6012 591 -97 -205 170 -278 279 268 -319 603 -292 -69 247 -365 281 103 -295 310 92 -408 311 -136
6032 -136 159 56 -24 260 -217 314 367 -202 203 -39 -263 547 -103 -517 297 -393 258 399 -66 171 -313
6053 -313 -83 149 -326 64 -194 -495 285 -317 -93 138 -325 27 60 -499 439 -304 -204 192 -313 -106
6073 -106 322 -267 114 114 85 68 -377 -32 -13 -538 413 -60 -46 256 -336 69 199 -284 207 115 -233 269
6095 269 -48 12 361 -82 279 -253 -52 210 -389 269 -30 -148 312 -63 -197 575 -207 185 159 -268 153
6116 153 -28 -354 338 105 142 268 -46 282 38 -269 378 -262 15 322 -663 213 118 -237 222 -201 -258
6137 -258 177 -307 199 -11 -131 243 -4 12 314 -217 387 85 -153 440 -54 78 325 -456 44 -157
6157 -157 -605 370 -476 -33 252 -212 104 317 -243 241 -25 -132 -217 -376 520 -15 -266 190 -208 -117 292
6178 292 -122 112 238 -317 79 -15 -237 293 -416 76 -47 -328 334 -93 34 147 -202 221 131 -498 62
6199 62 -250 35 459 -230 328 1 -130 185 26 44 424 -161 26 50 -261 291 -48 -126 182 -250 -44
6220 -44 252 -88 376 -188 79 621 -397 -30 254 -287 52 -230 -157 158 -202 -249 -45 -306 183 -299 -197
6241 -197 313 -354 -198 449 -169 114 -204 -210 226 -31 330 41 -285 314 55 -313 495 -269 12 264 -525
6262 -525 -95 -104 -266 216 -413 342 212 -145 315 -228 -24 194 -320 40 603 -265 183 182 -380 212 -103
6283 -103 11 400 -301 228 -15 -183 483 -299 -94 346 -442 132 80 75 417 -109 131 149 -79 211 -45
6304 -45 -286 389 -63 53 434 -341 269 100 -221 -1 -133 -51 324 -261 159 56 -286 81 -576 355 39
6325 39 -313 206 283 -454 175 -133 -132 24 -431 282 -123 -485 296 -63 -34 -38 -155 329 153 -460 280 -108
6347 -108 -361 338 -313 -110 -67 -176 153 53 20 219 -326 -8 -126 -109 186 217 -196 119 5 -91 136 -296
6369 -296 234 -344 -126 431 -374 18 226 -295 184 -25 -264 423 -230 263 175 -2 167 -271 125 103 -19
6390 -19 -18 50 -263 152 26 -156 197 -161 61 514 82 218 77 -19 140 -100 275 -74 -357 347 -131 -215
6412 -215 302 -182 -140 248 -192 306 -195 33 125 -212 158 234 -85 25 -59 15 191 -223 -138 296 -205 18
6434 18 -118 -82 139 -374 -286 -178 -331 256 75 -245 267 -196 -156 217 -221 55 -53 165 129 -178 184 215
6456 215 -87 92 218 -255 257 -52 35 253 98 86 -9 -104 313 -121 -30 217 -356 255 22 -290 315 -49
6478 -49 -241 278 -245 362 108 -274 255 89 -85 25 -217 275 -12 -29 443 33 -101 183 -139 258 108
6499 108 -26 352 99 204 -168 -255 147 200 -195 309 152 -309 272 -235 -119 99 -297 -136 -32 -105 -106 -325
6521 -325 267 -102 -43 275 166 -321 226 -395 -101 132 -153 83 -83 -174 268 -44 -54 123 -89 -25 -178
6542 -178 -171 60 -274 -241 236 -95 94 -195 210 83 12 70 208 -154 395 212 -257 233 -280 -143 294 -339
6564 -339 262 53 66 255 -170 86 169 9 183 27 -138 45 -132 -170 410 -123 218 102 -209 610 -261
6585 -261 122 234 -82 100 63 36 380 96 19 78 -452 152 202 -105 234 -261 146 239 -261 257 90 -302
6607 -302 209 -55 -255 126 -113 -42 -14 -316 -22 -189 103 31 -176 259 143 -493 172 -160 -275 288 -87
6628 -87 -262 234 -271 406 167 -202 44 -167 140 -42 -73 286 -306 -242 81 -168 325 158 -141 379 -9
6649 -9 151 96 -216 63 308 37 156 -105 -93 192 -362 329 -73 -151 247 -54 5 100 -289 -12 187 -333
6671 -333 172 -16 -95 216 46 169 426 72 113 -7 219 271 -488 -44 292 -23 -16 96 -143 509 -357 -77
6693 -77 328 -165 102 210 -308 133 -98 -217 52 -46 -101 14 -313 209 -334 102 127 -339 -81 -91 -130 132
6715 132 18 -73 -261 -289 123 194 -75 287 242 -247 173 -467 395 -115 -223 175 -259 257 120 -391 324
6736 324 -6 -291 128 -167 -159 410 -200 106 60 26 164 114 -259 259 -118 430 104 -273 354 -25 -68 -3
6758 -3 -250 155 -93 -336 93 85 107 -140 -222 -112 -25 -249 26 -177 -25 319 -124 363 -299 -259 23 -208 -110
6781 -110 136 -307 32 284 41 337 -41 32 112 -176 105 241 -374 240 -232 -64 301 -216 -167 276 -43
6802 -43 88 -288 12 86 -53 59 -149 -219 -154 4 -209 322 -446 18 109 -272 130 -8 -277 169 -244 183
6824 183 187 -220 192 154 -150 366 -43 97 98 -174 -10 -118 -4 145 -101 269 178 -279 267 -120 -141 200
6846 200 -78 45 115 -238 31 -34 23 128 16 53 -256 -165 292 -90 -45 516 -8 -217 358 -145 99 -94
6868 -94 -203 22 -184 70 -27 -284 154 48 -93 289 -40 -67 57 -53 -17 33 -88 173 -18 8 -105 -361
6890 -361 373 -123 -508 149 -180 -184 288 -42 -122 -134 -70 188 -157 -56 90 -321 146 -127 -223 360 -266 -65
6912 -65 217 -447 394 70 113 211 36 51 87 -20 215 58 -241 307 93 -97 232 -200 196 233 -129 -47
6934 -47 -108 -42 39 8 -62 56 -125 127 -161 -263 63 -132 65 186 -68 374 34 -169 -89 -260 -75 160
6956 160 -285 245 111 19 231 -214 -323 -35 -129 332 7 203 225 -225 15 239 -204 172 52 17 241
6977 241 -255 10 210 -83 -18 16 -316 96 -377 -32 -8 -182 236 -85 -131 165 90 41 101 -240 105 123 -48
7000 -48 194 -122 49 143 -28 1 -79 38 -80 -259 148 198 -133 18 -232 -3 270 -61 74 0 -150 336
7022 336 71 -227 205 -317 109 342 -477 113 202 -209 -28 -90 170 149 -134 172 67 -316 410 -235 -184
7043 -184 51 -258 168 119 -268 27 -34 -121 265 -234 129 112 -11 409 -9 -61 320 -80 62 199 -73 70
7065 70 -65 -71 166 -145 -121 -13 -312 -175 -473 178 126 -288 153 -112 178 254 -256 166 280 -120 103 50
7087 50 -240 169 -228 -86 126 -429 203 1 -390 173 -218 -239 284 -106 -114 -173 -147 175 -212 -8 97 -89
7109 -89 -204 -21 -206 226 -16 153 32 84 -49 196 -81 364 128 -157 207 -196 2 -20 -44 102 -100
7130 -100 -310 60 -210 -134 106 -63 377 -177 189 373 -126 68 97 -142 60 194 -233 437 110 102 162 -163
7152 -163 71 26 164 149 -24 43 355 -308 186 10 -247 280 -123 133 202 -97 -6 -239 -393 -132 -199 14
7174 14 259 -19 236 -156 -92 351 -195 189 281 -184 190 -69 -71 404 -272 -44 168 -165 82 24 -71 64
7196 64 55 -235 94 -183 109 -311 8 -129 27 27 52 -132 332 278 -217 119 -76 28 15 -284 233 247 -17
7219 -17 104 -208 46 54 -290 147 -293 -249 245 265 -148 204 -189 92 110 -108 3 -41 -8 80 39 59 -317 -247
7243 -247 99 -97 -33 37 -247 57 135 -311 100 -233 -38 337 -148 -30 129 -67 78 -182 -172 38 -59 99
7265 99 -163 -151 25 -134 -278 171 -453 129 119 -299 65 -64 62 219 -45 -177 -121 -111 52 -24 -84 -33 -158
7288 -158 95 -71 -72 -82 -102 -64 322 -24 -150 105 -200 147 93 -242 47 -335 212 -38 -339 149 46 -47
7310 -47 252 -341 -87 371 -329 -44 -175 -143 13 -140 -57 215 -92 206 -188 60 152 -143 -117 251 -30 61
7332 61 193 -273 136 -233 96 123 -47 6 -304 -591 45 -33 164 33 -125 -38 -63 73 131 -158 -215 206 -92
7355 -92 307 229 -86 117 -21 15 273 -130 104 37 73 -30 -95 -236 -171 -276 162 40 129 -7 39 132 221 -274
7379 -274 56 200 -78 391 -310 69 100 161 94 -171 44 518 -262 -105 -44 -365 73 -119 89 276 264 -127
7401 -127 -123 -59 184 -101 -175 207 247 -60 22 -52 347 385 -301 75 -91 -140 75 -240 71 -214 -188 82 84 -107
7425 -107 127 -213 -65 127 -265 243 247 -168 20 -178 -24 -379 -76 192 -125 -35 80 -145 91 221 -342
7446 -342 210 -7 -23 148 -298 120 128 39 36 -82 -52 72 -59 332 384 -411 147 23 -62 245 15 200 20
7469 20 290 -187 -33 -50 197 -332 -56 27 -142 320 270 -408 -117 -78 -317 126 -319 152 61 -137 71 -261
7491 -261 26 282 -171 3 79 -50 64 -118 91 314 -31 -10 -330 -158 182 -68 120 -135 -176 132 215
7512 215 -223 339 89 -47 -65 -356 17 124 -226 -202 301 -165 17 -110 -62 133 -6 362 98 117 67 -28
7534 -28 270 235 -166 -38 -275 -240 169 128 165 -95 -48 -122 57 37 -44 -19 -108 87 198 -45 43 89 216 -63
7558 -63 -3 37 -193 140 58 -57 179 21 -133 354 -271 116 63 -177 123 2 50 115 -72 -79 199 -106 78
7581 78 -17 127 447 -153 -11 76 -69 59 -294 215 271 -171 50 27 -39 73 -129 -29 206 18 108 -115
7603 -115 -176 -224 -362 -130 168 37 -141 39 -405 144 -54 -234 267 -193 -132 -83 32 186 -94 -78 144 6
7625 6 172 147 -283 116 -4 -129 136 -3 -90 152 43 178 9 -55 166 -117 0 -25 -271 141 -135 -157
7647 -157 149 -158 227 -19 -43 69 128 -8 14 -439 376 407 213 232 -5 -132 -13 -106 122 -52 -107 208
7669 208 -37 256 32 -29 -67 22 -38 58 -297 29 206 -108 -88 402 -39 203 128 -164 120 211 -123 59 5
7692 5 118 -168 -53 249 -11 160 25 13 70 -9 -76 76 36 86 -43 -313 19 194 36 -22 -29 166 -173 13
7716 13 206 -33 17 212 -11 82 194 -143 160 -242 -220 91 -86 -109 -173 92 -41 126 -212 150 -191 256
7738 256 -20 -71 369 -65 -223 49 -55 271 180 -211 -82 99 138 163 -85 42 138 -47 -26 -12 -186 -86
7760 -86 -90 -64 201 110 13 62 -35 126 65 49 72 48 25 -9 -15 97 27 90 -91 -11 -158 -4 183 110 128 2 -33
7787 -33 21 -39 36 -181 139 -264 99 330 -75 -63 -136 -286 11 -127 6 -25 -91 -3 -37 86 -73 48 -12 -17
7811 -17 -321 -19 -76 -267 -23 164 -24 84 -108 -26 289 340 135 66 -22 -92 -7 122 164 19 175 -309 266
7834 266 40 175 28 24 73 -80 -130 35 -27 -81 66 135 180 143 -59 240 224 -183 -112 -82 48 -74 -232 296
7858 296 404 -248 22 -347 -211 27 -110 -17 110 15 115 -65 147 -70 -73 61 22 -110 93 133 -69 258
7880 258 26 -489 7 161 -30 -78 5 88 1 -64 -31 -93 -257 342 -303 -121 -267 -144 -128 -40 -93 67 -4 227
7904 227 91 -145 65 -242 82 -42 -74 235 46 -212 -151 185 208 -204 -105 88 45 -58 -138 -7 23 226
7926 226 -172 54 -11 -22 156 -28 78 76 103 123 -7 -165 -45 113 212 51 28 -4 -90 8 34 -78 -216 201
7950 201 190 -189 30 -249 62 -43 -79 222 3 -27 -9 -110 119 -84 78 35 103 -130 -28 -9 -70 -124 -192
7973 -192 318 -68 127 100 34 35 -317 -66 27 -72 85 -247 -152 -142 -123 -104 -26 -225 -111 5 133 12 -213 23
7997 23 150 -298 254 367 -218 11 101 -56 54 -135 86 -121 -88 -170 -116 -52 215 -124 62 45 -183 -8
8019 -8 -90 -253 322 -65 37 51 -322 -1 3 -323 182 22 91 -44 -129 -6 -107 33 295 349 94 82 -23
8042 -23 -65 77 -17 37 151 -202 152 107 -64 -43 57 169 -266 -234 -49 -39 124 110 -196 -39 48 -28 32 -97
8066 -97 -142 168 153 -179 -139 -74 94 -318 57 -58 -223 244 -195 -78 161 -83 196 -3 8 8 9 15 -78 94
8090 94 52 117 -48 193 -104 -16 -17 -221 -237 164 -256 -205 -26 297 154 -165 -65 -50 -28 -143 28 60 13 81
8114 81 -68 -120 -41 296 428 136 59 64 8 217 -118 234 -29 122 162 -116 25 217 -63 375 40 11 -238
8137 -238 155 -210 -59 -45 -189 72 23 225 -31 -228 -63 -115 53 70 -293 -95 -114 -83 149 -41 159 -202
8159 -202 -92 192 -29 104 159 164 75 -287 -127 117 -44 -118 274 158 214 189 48 81 -274 271 48 -85 147
8182 147 62 -211 65 134 151 14 -181 354 -53
8191e3
$$ Imaginary data points
##PAGE= N=2
##DATA TABLE= (X++(I..I)), XYDATA
0 0 0 0 0 0 0 0 0 0 0 0 3 -8 8 -8 8 -16 16 -24 24 -32 40 -47 55 -64 72 -85 97 -113 129 -147 170 -191 217
33 217 -246 276 -310 347 -389 434 -483 537 -596 659 -729 804 -890 981 -1079 1188 -1309
50 -1309 1442 -1589 1753 -1937 2143 -2378 2645 -2956 3320 -3755 4285 -4947 5796 -6932 8524
65 8524 -10923 14905 -22661 43023 -199985 -397629 257756 -12982 -245536 141888 -11497
76 -11497 -319671 1908 90093 -138153 -22107 50254 -218999 -89560 169680 -7385 -91763
87 -91763 -15163 -51176 33671 20426 -12995 96560 -52396 -133118 99475 80401 -25626
98 -25626 12017 -47466 -49022 63200 40586 -38865 -4407 2924 -73991 12634 88340 -21950
110 -21950 -14723 -27895 -62163 129321 50433 -131191 85103 58701 -128828 82858 121211
121 121211 -79524 -6354 56788 -40067 30323 103378 -60029 -67483 98445 -5888 -56768
132 -56768 80084 -10484 -44363 30270 -44385 45307 68387 -118687 8281 106190 -79729
143 -79729 -10566 104605 -48983 -48250 96265 -8214 -69224 113311 21946 -136719 94775
154 94775 90791 -131020 33653 94047 -78727 -9168 50123 -17276 -7138 5144 -7351 -15053
166 -15053 2640 15727 -26842 -12797 18388 -15254 -24702 -5253 22937 -11190 -57725 24654
178 24654 14640 -60115 20554 3313 -49221 26280 -18050 -36704 44316 -18291 -44977 26614
190 26614 3507 -24363 12953 10576 -30389 7592 31998 -44360 10036 58239 -68409 -8597
202 -8597 76440 -49432 -17251 50680 -36944 -11967 31859 -17902 -13633 12268 -5895 -24148
214 -24148 12701 20150 -30816 2820 20035 -20408 20956 8592 -18442 35225 -1466 -11214
226 -11214 42969 -59 -4437 25312 1744 12288 13260 3372 8411 -860 13070 1547 -8660
239 -8660 18142 -9381 -10216 13241 -11843 2597 -3076 -20237 16879 -10467 -16132 22191 -16957
252 -16957 -8561 18072 -14219 3086 10543 -7687 2128 2453 9816 -1788 -5487 19738 -9649
265 -9649 -3694 23857 -16840 1421 14037 -22703 8680 4722 -19084 7527 -7578 -8339 3376
278 3376 -11756 772 -6565 -9450 5085 -14480 37 1791 -20887 7560 -4678 -15951 12010
291 12010 -12477 -7679 8765 -15253 3071 1796 -11263 8742 -6182 -139 9523 -9920 9634
304 9634 3165 -6165 16114 -2991 2703 15260 -6679 12467 9318 -3132 18926 767 4544
317 4544 17498 -4736 12052 8876 -5299 16095 -852 1179 13612 -8517 7419 4281 -10235
330 -10235 10497 -6664 -5930 7155 -14689 853 -1480 -15774 5492 -10549 -10229 5014 -17215
343 -17215 -2137 -1781 -17210 3661 -9476 -10070 4813 -14836 -102 245 -14410 7343 -6249
356 -6249 -7062 9445 -10706 2303 5048 -10409 9212 -2400 -3503 11143 -8684 5107 7258
369 7258 -10000 11992 924 -4249 14240 -3328 4708 9986 -3675 11648 2135 2157 14299 -5253
383 -5253 10859 11016 -8427 16765 4037 -5696 17514 -2762 -295 12152 -5070 3424 1471
396 1471 -1739 4704 -9705 4637 571 -15075 9278 -7609 -13549 11551 -14388 -8584 9302
409 9302 -14969 -3291 577 -9719 1484 -7723 -2407 1082 -10509 4650 -5536 -7550 10174
422 10174 -11648 -3104 8943 -10932 2981 -817 -5813 10195 -8917 9 11452 -10602 7541
435 7541 5517 -9385 13316 608 -8301 10390 2678 -2606 -2852 4339 3943 -12406 8438 2427
449 2427 -18502 15657 -5485 -21709 24195 -8211 -25112 20662 -2078 -16331 10306 627
461 627 -10365 3316 9954 -9088 698 23418 -16297 -5730 36203 -11745 -8058 28230 -11413
474 -11413 1671 21264 -11525 4726 11655 -9963 1681 11172 4938 -7809 -2115 10344 -2496
487 -2496 5374 4314 -9556 13877 578 -9657 24205 93 -9980 12580 -3896 11128 12746
500 12746 -18989 6533 9208 -14431 5062 5174 -10617 -7107 -3730 -7445 -3224 7834 -22145
513 -22145 -25317 25063 -10903 -30712 27865 -11545 -30588 27094 -6844 -12466 29478 -15424
525 -15424 -19637 33368 9253 -19453 14368 14773 -20460 11184 22703 -26144 9976 14458 -47395
538 -47395 17454 32499 -53891 -4590 25456 -38331 -6958 19301 -25424 -15890 10817 -14370
550 -14370 -17342 23293 -1333 -35779 16893 19934 -19424 8960 11287 -1526 8591 -3333 15870
563 15870 17835 -13562 13398 11211 -8888 24585 4476 -20092 21798 13841 -23041 6274 27560
576 27560 -15034 -15659 26580 -5887 -12547 28516 -17387 -11657 39966 -24367 -16999 47040 -16141
589 -16141 -22679 33692 -6316 -15080 26194 -4278 -22124 24438 6833 -36114 21247 25137 -43938
602 -43938 3925 27505 -29043 5724 12356 -27615 10105 4392 -22561 12559 2923 -21512 -122
615 -122 2611 -6682 3659 -1891 -21697 3685 18151 -26265 -2691 29310 -31127 -14154 33100
628 33100 -13855 -9340 13858 -16353 -758 14585 -4608 -2966 -384 1705 389 -3071 8750
641 8750 6386 -11401 -10665 14104 13289 -22191 1683 20496 -28765 2332 31851 -28275 -1357
654 -1357 26092 -30386 2941 37120 -20035 -14480 25005 -1898 -10610 24063 5395 -19816 18627
667 18627 6815 -17741 30991 4317 -35365 24589 11246 -24371 19564 2847 -26356 8899
679 8899 6980 -12997 2412 5664 -18291 -10149 19200 -3038 -15654 9270 -5628 -7071 12574
692 12574 -2231 3527 1829 -11591 13517 7666 -3914 13560 -6412 -7012 18453 1341 -5314
705 -5314 7603 -1646 -9597 2002 12204 -6741 -10737 4722 -10996 -420 13370 -16742 -4431
718 -4431 6000 -18442 7939 11244 -17097 484 504 -9997 10570 7991 -11100 -6670 7801
731 7801 15 -4752 15347 -3321 -19428 13886 3369 -8062 15902 -8543 -14947 13193 964
744 964 -1753 5272 -6378 -4252 1221 6389 4703 -4629 -1136 -4269 979 12574 -3162 -1690 1405
759 1405 -8568 8954 6861 -4962 5203 -8137 -4791 13516 -900 -1207 635 -8873 2957 6438
773 6438 1936 1277 -6226 -810 1356 4431 9062 -6720 -3793 4077 -4452 10424 4541 -11702 4359
788 4359 -1807 -3262 13198 -2819 -7689 1201 -2542 2268 2501 -345 -4597 -8486 5138 931 -5614
803 -5614 6479 -8619 -7816 8762 -3383 400 2589 -9431 1914 1762 -1333 6155 -5191 -3083
817 -3083 2408 -2156 4556 -738 -2847 971 -5473 4901 3569 -6945 3560 -2764 -4953 7869
831 7869 -2629 -1094 1773 -6601 4015 1208 -2975 5392 -4427 -1543 5389 -1873 3226 422 -1382
846 -1382 4011 -2811 4954 4652 -6419 5988 1369 -4316 8325 -883 -1623 4123 -3651 3177 602
861 602 -2446 4359 -4941 -1149 4233 -4773 2123 63 -4271 3727 -3422 904 3676 -6794 3754
876 3754 1211 -4792 6492 -1546 -1910 3988 -3505 3384 1186 -3384 4669 -3511 -1172 4610 -5232
891 -5232 945 282 -4878 3003 -3145 -1158 2159 -6991 2670 600 -6110 5153 -2382 -3190 5357
906 5357 -3085 1657 2101 -3165 3786 -1030 -265 4065 -3538 2507 1376 -3249 5105 -2951 -1347 4633
922 4633 -6273 1788 2816 -7158 2883 -378 -3819 3409 -2495 -238 808 -2380 3626 -2145 402
937 402 4838 -5005 3613 3867 -4904 5576 86 -2392 6281 -2742 1007 3788 -4164 3309 -31
952 -31 -2163 4226 -3119 3 2923 -3468 2420 -941 -976 3291 -3744 3110 1840 -4652 6335 -2251
968 -2251 -3619 8018 -5740 -2145 6500 -6201 -781 2837 -4153 -479 -101 -820 -3363 -824 3617
983 3617 -7808 -105 7035 -10860 1977 7737 -10230 4634 5449 -8236 5811 4149 -5164 3122
997 3122 3684 -327 -1798 3446 2328 -5320 4921 664 -7429 7558 -3006 -8116 8282 -5215
1011 -5215 -6230 5658 -5965 -1807 2116 -5840 710 20 -2850 185 -506 2185 -1593 -619 4214
1026 4214 -2115 3432 2016 -3578 8290 -818 -4185 10939 -3834 -2508 10405 -6401 821 9172
1040 9172 -7702 -101 8264 -3625 -3773 6392 1284 -7886 5507 4420 -11670 7669 5644 -16565
1054 -16565 10394 7618 -17606 9120 7125 -14022 6247 5827 -9195 2605 5993 -7177 -1826
1067 -1826 10049 -5665 -8126 12768 -3996 -8741 12967 -4500 -6552 11234 -7017 -2731 9893
1080 9893 -6889 -1994 4406 -3167 334 -21 -1986 23 -462 -1443 -2398 3393 -2378 -7082 6612
1095 6612 -1929 -5978 8946 -6577 -4623 12367 -9002 -2649 12430 -8932 -2834 9237 -4330
1108 -4330 -1149 5348 -4394 -3417 7229 -918 -8536 9082 519 -14108 11481 2706 -15174 12882
1122 12882 -481 -15005 15996 1358 -14881 12605 4349 -11814 7314 9636 -7861 1322
1134 1322 11774 -6762 147 15734 -9986 -2449 16879 -10043 -2802 13511 -9264 -1593 7488
1147 7488 -7371 1074 3106 -6317 -1564 2283 -1997 -4744 1090 766 -4661 1893 -1213 -3734 5695
1162 5695 -4718 -1966 8457 -7582 180 7999 -8892 5212 6774 -12388 4834 7881 -9817
1175 -9817 1462 7537 -7693 -5599 9132 -1816 -8969 9186 -3795 -13216 14470 -628 -14626
1188 -14626 11935 -2811 -11520 12802 269 -7907 6294 -2241 -4185 8661 3559 -7400 600
1201 600 5807 -5540 4384 9939 -11037 -125 8401 -8666 6992 8174 -13059 1378 6044
1214 6044 -3911 4552 894 -5230 -1209 56 2713 1814 -713 -4206 -3670 5314 826 -74 3406 -8826
1230 -8826 257 8194 -6206 4144 3855 -13065 3645 7188 -4498 3723 -687 -7374 2448 5318
1244 5318 -463 -1636 1792 -4237 -3357 10555 -842 -7171 6454 -5957 -3472 13122 -5057 -5684
1258 -5684 6497 -6534 -1036 7955 -2309 -3928 -317 -395 -1111 2383 1804 -7131 27 3379 -6116
1273 -6116 4750 2587 -9769 4034 722 -5305 7227 -1256 -5253 4421 -861 -452 2751 743
1287 743 -76 -1288 2421 1449 -848 3910 -2020 -1410 4467 -3789 2384 3363 -6084 3009 329 -4898
1303 -4898 5908 -427 -4137 3115 -2331 -570 2805 -147 95 -1657 1081 880 291 5294 -2482
1318 -2482 -2042 6207 -3583 2785 7204 -6856 692 4403 -4414 3798 2976 -4867 -1668 90 1628
1333 1628 -1195 -833 717 -6589 -2 4722 -3877 548 -1354 -4847 3194 -295 232 2226 -6424
1348 -6424 1074 3504 -2812 3669 79 -4651 820 1360 1802 -1197 -2086 762 -4621 478 4365 -5592
1364 -5592 -744 -346 -4713 3334 -508 -2429 1233 -4848 888 3793 -2887 2122 372 -2114 2867
1379 2867 1872 2894 -247 -1028 4448 -1065 1088 6014 -3605 -44 3382 -2189 3255 548 -1933
1394 -1933 1866 -2441 1720 3227 -3515 1349 898 -1504 2370 328 1467 -359 -1634 4537 -1303
1409 -1303 -844 5466 -3107 -388 4256 -2022 1379 766 -1186 1708 -2468 1160 2181 -4257 1200
1424 1200 120 -3305 1385 -1324 -692 -1126 -3038 2573 -2745 -2734 3394 -4528 -2333 2703 -4124 -505
1440 -505 -179 -3428 616 -2550 -583 908 -3729 782 -167 -2433 1844 -1577 562 584 -2765 3969
1456 3969 140 -2255 5448 -1415 -970 5413 -539 975 2583 -104 1433 -389 1773 1909 -3133
1471 -3133 2741 841 -2959 3050 -905 -1696 1502 -2272 1462 -130 -2383 3066 -2826 -1111 3833
1486 3833 -2779 688 2268 -2274 1805 762 472 2033 -1390 1730 738 -532 3066 -2025 220
1501 220 2758 -3888 2867 1737 -4441 3351 -436 -3427 4328 -213 -2343 1600 351 -515 -1018 2267
1517 2267 498 -3654 3514 298 -3441 4729 -2064 -3950 4459 -2465 -1851 2308 -2990 -564 -767
1532 -767 -1961 303 -2047 -673 -1398 -1987 1518 -2913 -1244 2246 -3505 555 1383 -2788 2479 -492
1548 -492 -1849 3367 -1847 42 2189 -2809 2362 1054 -3342 2564 650 -1984 248 1171 248 -2535
1564 -2535 1820 1503 -4239 3681 1275 -5821 6495 1378 -6195 6500 1455 -4510 4099 1734 -2161
1579 -2161 1861 2157 -1427 -27 4433 -2339 -2829 6955 -2822 -3562 6558 -3191 -2040 5205 -4198
1594 -4198 -53 4186 -3651 157 2546 -742 -733 624 1926 -1013 295 1973 -2034 2183 1139 -4031
1610 -4031 3674 53 -3652 2916 -2021 -1515 2711 -4524 158 2059 -4836 -82 731 -2811 -186
1625 -186 -552 -1540 -651 600 -1128 -2820 3881 -581 -5824 5963 15 -5879 6328 -1456 -4858
1640 -4858 7031 -2076 -4890 5943 -385 -4624 3143 3073 -4687 -339 4723 -4375 -767 6023 -6160
1655 -6160 -480 7781 -6622 -629 6435 -4909 -1 4459 -1722 880 1640 -553 498 2044 1607
1670 1607 -1863 1932 2300 -2669 2612 1378 -1586 2877 -2301 -382 4805 -3781 -443 3290 -4127
1685 -4127 1765 1867 -3889 1495 365 -2970 473 1747 -1712 -2860 1707 51 -3170 3166 -1419
1700 -1419 -4387 5151 -2270 -3861 6494 -3558 -4441 5632 -1680 -2111 3503 -2315 -2219 2648 701
1715 701 -3491 1719 2600 -5425 1165 5503 -5243 866 3666 -5914 3097 3652 -4820 2380 2031 -3319
1731 -3319 1845 1899 -768 -697 591 790 -853 1912 -533 -2532 2791 -775 -2077 3169 -2377 -1070
1747 -1070 2507 -3063 2301 1587 -3954 2622 813 -2454 2798 81 -1230 1406 755 -360 187 2609
1763 2609 -1355 -2031 4330 -1497 -3066 4615 -2846 -1943 4441 -3934 -1408 3486 -3635 -406 2242
1778 2242 -1685 -527 871 140 -947 975 1064 -2661 2559 2036 -3675 3823 1536 -4179 4362 598
1794 598 -3315 3104 -710 -2109 2125 -485 -1435 -772 -258 -551 -2050 833 -815 -3016 996 -1440
1810 -1440 -650 1400 -2809 793 893 -2665 3046 -240 -2308 3630 -1181 -1318 3294 -735 -725 1333
1826 1333 406 -174 -389 1679 -1263 -1573 2874 -1932 -949 3464 -3429 -413 3158 -3391 1027 1844
1842 1844 -2557 1486 1222 -431 1178 388 877 -268 1330 1830 -1430 2017 1261 -2050 2549 339
1858 339 -1994 2658 -1181 -746 2124 -2289 364 930 -2425 861 -218 -1360 381 -334 -326 -1146 -168
1875 -168 1282 -2282 1194 1328 -3412 1797 663 -2847 2094 -305 -1478 1782 -1048 220 698 -1285
1891 -1285 1194 -332 -470 1021 -603 580 -535 -583 1487 -1997 346 1424 -3400 1027 738 -3403
1907 -3403 1424 -147 -2429 956 -1251 -607 80 -1349 513 -1039 -139 1131 -1254 1004 236 -834
1923 -834 2621 -400 579 3195 -1423 1645 2536 -1192 2197 1415 -665 1930 -73 506 485 -888 948
1940 948 -775 -577 1238 -1849 272 211 -2080 1356 -1068 -1145 1585 -2167 468 1673 -2311 1186
1956 1186 723 -1366 1297 207 -83 654 -353 1170 -1204 -211 1646 -2382 479 889 -2868 1120
1972 1120 -280 -2392 1400 -1732 -916 918 -1768 116 513 -1091 561 -481 345 700 -590 1446
1988 1446 -490 -340 2656 -994 34 1734 -1983 1145 768 -1392 1313 -1122 -993 1187 -1777 742
2004 742 -72 -2125 413 -411 -488 374 -1306 724 -485 -489 2162 -1633 163 2143 -1688 1733 1926
2021 1926 -1781 1601 185 -578 2142 -479 -162 429 -431 667 -291 513 -39 -2104 2154 -2 -1489
2038 -1489 2367 -1706 -1146 3097 -1174 -213 1893 -1577 232 1076 205 351 -1305 950 -336 -393 2061
2055 2061 -1443 -811 1520 -1597 762 894 -2037 841 -585 -593 2043 -1297 -728 984 -1308 1026
2071 1026 401 -1104 182 -810 280 840 -358 309 -1778 -121 1712 -2072 819 52 -3191 2061
2087 2061 147 -2247 2024 -1262 -2372 1932 -3 -761 -56 55 -678 -499 2450 -780 -1360 2768
2103 2768 -1524 -817 4323 -1812 -1190 2486 -1738 659 1985 -1595 219 508 183 224 463 1015 -1488
2120 -1488 -296 1882 -1198 938 805 -2588 1503 739 -1319 2486 -1011 -929 1641 -934 1045 688
2136 688 -1727 842 246 -268 757 -452 41 -261 73 757 -1531 1074 -75 -2653 2534 156 -2682
2153 -2682 3117 -953 -2347 2726 -764 -1252 1597 -472 -1317 634 758 -1482 -722 2289 -2088 -1125
2169 -1125 2927 -2788 -599 2783 -3424 181 2444 -2976 223 1452 -1785 13 453 -551 -439
2184 -439 401 401 -1552 1229 704 -2079 1984 452 -2007 2455 -348 -921 2431 -1135 -111 1647 -1280
2201 -1280 395 546 -688 863 -99 -24 506 -230 404 -618 734 924 -1546 1654 249 -1843 2601
2218 2601 -947 -1599 3075 -1704 -979 2898 -1481 -752 1903 -416 -698 916 574 -1580 653 2086
2234 2086 -2865 332 2638 -3582 552 2432 -3432 822 1745 -2784 900 985 -1829 -86 271 -234
2250 -234 -1127 650 711 -1848 936 603 -2151 1486 -473 -1447 2034 -846 76 1359 -2066 888 725
2267 725 -1999 1374 -177 -931 665 -405 -502 -369 -62 328 -1298 981 -136 -1983 1829 -266 -1664
2284 -1664 2451 -1148 -866 2313 -1480 390 1948 -1263 1026 841 -447 389 392 573 -727 515 1458
2301 1458 -1736 1007 1437 -2564 1636 705 -2543 2212 438 -1655 1757 -310 -671 896 -123 69
2317 69 -184 642 411 -781 1828 -14 -1368 1841 -970 -301 1900 -1353 369 729 -1634 1086 -236
2334 -236 -1166 1179 -1262 -280 1271 -869 -11 142 -821 -51 -375 843 -1155 -1013 1571 -1657 -705
2351 -705 2203 -2530 -618 2021 -1815 790 879 -1478 126 67 361 512 -139 791 -696 -71 1567
2368 1567 -849 746 481 -1847 1552 115 -732 1569 -1750 -1088 1864 -1042 381 131 -1947 74
2384 74 60 306 249 -1013 446 -636 278 2137 -1029 326 881 -1114 2101 1142 -1115 1639 -506
2401 -506 18 2373 -197 -74 452 -497 992 45 177 -49 -1619 494 -294 -739 1087 -1568 -845 485
2419 485 -1231 1467 405 -2231 1050 -103 -798 1777 -440 -725 274 -137 715 -287 489 -248 -1678
2436 -1678 1859 18 -1404 1262 -1336 -1408 1669 -1240 173 316 -1880 156 -381 -597 598 -963
2452 -963 -681 -110 -54 710 -559 414 526 -1124 1682 1035 -1149 1498 -701 -923 1959 -494 -254 811
2470 811 -1424 570 571 -615 763 -1028 -293 10 -199 961 -1236 -239 960 -1274 1392 1149 -1888
2487 -1888 966 212 -928 1983 50 -252 768 -753 709 666 -189 651 -914 354 633 -513 828
2504 828 -986 -777 1301 -1217 393 1114 -1881 480 382 -864 1028 -309 -410 249 -285 530 -584
2521 -584 -656 610 -695 60 664 -1244 347 -303 -646 1143 -907 65 593 -1569 1088 636 -1550
2538 -1550 801 -213 -585 742 -175 24 -73 -407 772 -700 299 290 -1804 1442 144 -1211 1484
2555 1484 -963 -822 1646 -1025 193 863 -962 305 58 278 271 -594 877 -61 95 1714 -1041
2572 -1041 191 1567 -1194 927 951 -1193 830 -77 -468 1140 -273 127 180 -624 1080 -218 -220 539
2590 539 -1339 315 394 -683 531 -638 -567 1027 -667 655 97 -1712 1090 -352 -464 1349 -1247
2607 -1247 -776 1032 -311 161 -215 -527 -167 -625 1058 -245 -1031 1374 -1213 -750 1950 -1580 -296
2624 -296 1541 -1391 261 1017 -558 53 157 4 -7 -16 939 -1130 -135 1281 -1358 630 985 -1676
2642 -1676 701 584 -1133 1146 -363 -516 686 -363 480 -164 -106 729 -965 530 1081 -883 636
2659 636 228 -583 1136 -470 304 358 -736 1129 -38 -555 1353 -716 -430 1683 -711 -1 1046
2676 1046 -915 71 209 175 -83 -431 988 -975 -162 1740 -1447 69 1899 -1972 629 1446 -1505
2693 -1505 429 553 -860 71 64 70 -679 231 658 -1415 457 684 -2010 928 533 -1373 1117 -397
2711 -397 -1377 740 -690 -230 97 -760 388 -550 19 600 -1193 505 329 -816 772 -160 -407 507
2729 507 -718 152 131 -609 1139 -783 -359 1584 -1272 32 1249 -1397 272 808 -675 -165 91
2746 91 -42 -633 172 953 -1167 164 1632 -1737 1027 1214 -1879 1266 856 -1335 826 292 -458
2763 -458 638 -136 297 -482 316 595 -1223 906 374 -1295 1334 -209 -969 1391 -422 -754 1042
2780 1042 -663 399 -76 -558 484 -538 38 468 -858 483 -117 -859 751 -712 77 266 -1038
2797 -1038 547 -297 -485 1065 -919 56 935 -1227 567 622 -1292 650 -252 -427 397 -198 90 -325
2815 -325 408 435 -989 650 347 -1690 1082 182 -1560 1469 -239 -1298 1359 -96 -500 539 148
2832 148 51 -362 874 521 -880 1236 92 -660 1390 -479 -251 1309 -785 228 606 -960 553
2849 553 -389 -352 718 -486 343 19 -802 544 -109 -20 712 -444 335 -15 -305 982 -617 225 930
2868 930 -1357 930 896 -1078 818 308 -980 616 -146 -94 150 -364 94 -445 -80 172 -789 631
2886 631 32 -985 1323 -499 -795 845 -693 -390 976 -789 320 394 -261 403 -12 152 115 -164
2904 -164 840 -756 -257 905 -874 219 582 -1164 631 -142 -1104 757 -454 -284 438 -635 258
2921 258 475 -330 749 -418 371 278 -517 719 -270 -40 1058 -642 763 803 -1067 959 349 -888
2939 -888 1172 62 -568 669 -342 -17 292 -170 164 -725 641 179 -689 1066 -361 -1026 1099
2956 1099 -485 -421 1125 -1038 48 442 -723 527 28 -192 55 -164 402 -112 -147 553 -769 151
2974 151 608 -846 503 -252 -1138 979 -335 -594 558 -980 -295 565 -612 285 -164 -359 217 -529
2992 -529 271 -223 -695 523 -791 98 628 -794 708 351 -985 1075 103 -683 955 -490 -260
3009 -260 524 -123 -83 95 -110 446 -548 331 -147 -446 864 -893 -108 1348 -940 -99 914 -926
3027 -926 629 224 -736 332 9 60 511 -34 316 -234 5 751 -389 418 187 -783 949 -65 -764
3046 -764 686 -793 -80 712 -664 497 -358 -710 577 -132 89 156 -521 192 -106 -310 507 -564
3064 -564 -136 115 -517 892 -262 -723 877 -680 -219 698 -712 158 326 -712 48 73 -134 -186 -329
3083 -329 565 -343 -128 1136 -1329 93 922 -1136 634 610 -922 808 67 -596 440 37 101 -217
3101 -217 294 763 -731 349 446 -934 492 472 -809 831 110 -509 420 -281 483 106 -424 368 -466
3120 -466 -71 953 -536 238 496 -664 269 25 -116 257 -176 513 -219 -246 876 -734 -208 982
3138 982 -871 288 533 -1107 650 469 -268 153 141 -275 -424 115 426 -773 -139 521 -1327 747
3156 747 687 -1509 612 -52 -1101 939 208 -454 -71 -150 311 -357 333 152 -1400 506 469 -1000 1012
3175 1012 -55 -1134 876 -156 -412 65 -705 34 -345 247 535 -665 383 727 -804 687 427
3192 427 -809 614 105 -129 220 94 69 -107 129 960 -957 191 752 -1214 918 653 -1134 611
3210 611 85 -468 725 564 -48 -598 86 726 -750 883 29 -1342 1245 506 -975 1186 -12
3227 -12 -1142 919 45 -418 193 -135 -201 -269 667 -45 -1350 836 103 -891 1465 -335 -935 595 -216
3246 -216 198 578 -253 -117 -515 311 766 -599 112 -28 -1257 1185 39 -804 24 -497 -68 554 159
3265 159 -20 -951 96 306 -757 989 -48 -1349 959 155 -672 767 -367 -777 454 533 70
3282 70 -115 65 -168 -1028 1134 109 -943 876 -386 -594 1393 -315 -428 154 -352 301 289 83
3300 83 -200 -499 191 -44 -312 914 -412 -268 873 -402 64 843 -603 202 243 71 466 -322 214
3319 214 152 -588 795 -40 -859 461 -481 -66 578 -593 -417 224 -48 378 -393 348 -79 -701 1090
3338 1090 -329 -816 1199 -399 -762 813 -278 -202 187 -11 -344 -282 298 -286 -611 623 -237 -757
3356 -757 1208 -518 -234 923 -824 -23 394 -367 78 -61 -38 597 -271 456 -148 -608 497 -319 -299
3375 -299 454 -131 203 236 -709 304 -717 -42 382 -683 310 134 -604 767 69 -282 794 -309
3393 -309 283 313 -316 543 -119 372 390 -431 620 120 -812 722 -170 -627 834 -385 -130 676 -660
3412 -660 -219 -35 -71 -70 -511 295 103 -462 582 -534 -341 416 -776 237 239 -1112 272 90 -619 251
3432 251 -242 -290 287 -386 258 -31 -248 304 -621 291 -10 -555 437 -230 -200 259 -615 -60 155 -495 434
3453 434 -23 -455 680 -250 -85 563 -223 409 39 -166 377 -79 519 121 -769 696 -84 -551 859
3472 859 -331 -160 936 -335 16 391 -315 276 86 -68 246 -227 644 -84 -278 545 -641 237 561
3491 561 -568 531 421 -495 821 -226 -484 831 -316 -27 86 -356 278 -140 -69 432 -552 11
3509 11 -22 -214 508 -572 218 383 -756 522 204 -749 479 -350 -176 400 -603 -30 88 -168 67
3528 67 -21 -21 63 -821 188 -55 -649 611 -466 -263 474 -380 256 449 -430 253 48 -223 575 -114 23
3549 23 -41 -295 297 -436 -71 266 -702 414 176 -797 706 -214 -529 864 -557 28 385 -455 149
3568 149 -227 -50 508 -259 204 183 -401 807 26 -384 502 -179 14 624 -523 233 -193 -319 526 -437
3588 -437 198 416 -491 456 185 -418 257 -475 -206 479 -152 214 -392 -130 611 -925 320 554 -870
3607 -870 613 346 -520 551 -25 -568 266 -223 190 52 109 113 -890 358 111 -849 224 246 -883
3626 -883 611 -353 -341 195 -480 25 197 -60 420 -470 201 344 -566 546 -77 -562 817 -41 -50 315
3646 315 -938 15 -2 -183 488 -393 -183 298 -461 806 281 -749 672 -130 -410 566 -41 354 -78
3665 -78 -144 476 -54 215 39 -941 641 480 -898 709 -260 -966 768 -446 -401 313 -349 60 -130
3684 -130 212 125 -465 676 306 -465 793 -259 -748 938 -489 -333 397 -601 -24 -58 -42 59 -539
3703 -539 239 -202 -725 788 -384 -917 509 -218 -483 513 -388 -271 -97 54 361 -348 313 -76 -475
3722 -475 881 -96 -456 625 -519 -419 579 27 -251 168 -109 184 -249 400 -163 -847 768 55 -264
3741 -264 1069 -735 -596 773 -139 103 208 -64 -67 -46 632 -61 -180 811 -358 -577 1234 -279 -360
3760 -360 568 -372 -49 619 -158 7 -197 181 -50 -296 717 -458 -549 837 -199 -277 890 -391 -213
3779 -213 350 -303 -120 86 9 159 -42 651 -191 -665 705 -588 -370 635 -445 -369 461 -310 -31
3798 -31 -119 -99 -6 -188 627 -211 -264 726 -419 -281 876 -720 -143 709 -656 2 215 -39 -18 -16 280
3819 280 -157 -252 737 -694 -76 741 -659 68 569 -735 291 295 -196 64 113 79 -279 -176 670 -227
3839 -227 -490 659 -737 171 692 -644 319 581 -440 113 -53 28 34 -429 662 -266 -338 1149 -394
3858 -394 -122 879 -501 87 354 -218 366 170 296 61 -238 788 -369 -282 822 -536 -202 704
3876 704 -774 -42 217 -581 483 -154 -170 254 -491 354 -304 -109 410 -556 -172 423 -752 450 227
3895 227 -679 557 -445 -94 209 -250 100 0 -346 491 -679 -153 262 -429 426 217 -267 465 41
3914 41 -216 634 -421 354 -68 -252 525 -243 -176 1075 -484 48 592 -327 502 -42 -404 272 44 246
3934 246 -54 37 554 -525 31 475 -838 340 443 -700 637 165 -568 231 100 111 191 238 538 -390
3954 -390 40 335 -479 466 309 -505 455 -241 -196 500 -476 -173 99 -524 362 197 -157 123 -543 86
3974 86 386 -275 332 77 -315 331 -250 358 161 -809 297 -380 -357 300 -399 -290 575 -868 13 217
3994 217 -571 171 -202 45 21 -309 144 -410 -184 523 -457 473 343 -820 628 365 -691 574 -178
4013 -178 -249 344 -597 141 75 -193 646 -469 517 503 -363 293 52 -458 558 -111 19 426 -547 543
4033 543 251 -340 635 -51 -225 198 -219 158 213 -452 443 -292 -54 324 -371 11 16 -312 472 -242 -47
4054 -47 436 -256 370 381 -489 330 15 -100 213 -102 114 185 -311 367 -251 66 98 -466 393 195 -670
4075 -670 757 -96 -460 552 -515 -75 218 -218 174 -307 -176 86 -195 136 57 -578 544 -226 -448
4094 -448 708 -298 164 270 -251 362 -375 -118 638 -564 387 278 -513 415 -134 -259 454 -160 83
4113 83 385 -320 410 60 -225 531 -504 125 504 -525 424 64 -439 637 -372 -139 227 -260 111
4132 111 -15 -196 362 -414 452 172 -602 767 -175 -529 673 -380 -310 453 -414 100 89 -354 114 -168
4152 -168 421 239 -194 398 -185 -500 377 -317 26 401 -495 -120 263 -407 141 29 -47 63 -591 334
4172 334 -505 -391 557 -511 -54 519 -563 -92 156 -200 101 -372 28 224 -197 425 -180 -484 596
4191 596 -351 -244 647 -147 120 753 -184 -28 310 -358 -185 -286 333 -330 -195 608 -559 -176 786 -758
4211 -758 186 547 -358 147 277 -53 95 -183 299 -95 -319 825 -575 -149 636 -577 -72 414 -271
4230 -271 -5 221 -155 52 41 388 -3 -122 215 -285 122 657 -766 115 587 -648 302 290 -336 90
4250 90 94 210 31 -286 509 -119 -290 692 -775 -203 534 -973 -77 285 -228 75 -86 163 3 -243
4270 -243 326 -383 -320 500 -709 119 615 -666 133 484 -356 75 57 -94 -78 -74 293 -346 -267 487 -563
4291 -563 288 515 -625 545 401 -628 231 143 18 40 159 274 -86 75 385 -418 254 405 -470 320
4311 320 314 -551 223 45 -176 8 -228 117 -129 -229 282 -747 -300 532 -426 161 391 -823 205 553
4331 553 -412 192 -175 117 -468 70 412 -605 -19 280 -808 -70 459 -734 192 103 -692 246 -56
4350 -56 -107 -150 -28 310 -338 55 377 -945 484 137 -561 407 322 -408 447 -20 -119 140 -316 221 -460
4371 -460 -133 496 -520 81 115 -411 368 -153 -493 620 -112 217 314 -173 332 -115 172 596 -358 173
4391 173 164 -746 401 169 64 446 -313 94 316 -30 46 -198 96 357 -263 544 297 -819 359 199
4411 199 -276 422 -215 -522 422 -100 274 -36 -425 208 -414 554 289 -513 332 -214 -672 761 31 -649
4431 -649 329 -511 206 316 -189 163 -527 -234 496 -588 54 -33 -592 286 17 146 204 -663 194 -107
4451 -107 -246 465 -595 -140 252 -342 659 372 -715 310 -283 81 435 30 -118 116 -343 394 223
4470 223 296 162 -745 504 309 -243 554 -269 -311 521 -46 263 176 -374 35 -193 193 300 -282 108 139
4491 139 -361 645 -153 -126 177 -607 321 456 -341 230 -319 -361 536 -416 -43 221 -582 329 -71 -175
4511 -175 342 -428 -319 -121 -324 55 -237 -180 281 -506 21 337 -330 368 -217 -308 487 -177 85 75 -223
4532 -223 235 -152 -256 289 -360 38 205 -312 388 -2 -516 262 -401 -13 231 -537 399 -121 -208 377
4552 377 195 62 109 -170 152 -97 -248 475 -477 46 507 -82 546 424 -488 757 -613 147 517 -549
4572 -549 366 163 -305 586 -28 -49 548 -177 164 282 293 380 -300 318 32 -273 380 47 -251 475 -231
4593 -231 -367 472 -472 299 147 -408 -61 -170 305 204 -277 156 -192 -368 377 -230 -266 355 -447 -144
4613 -144 94 -574 298 -15 -123 236 -379 100 198 -364 369 -151 -29 275 -344 107 416 -444 506 -64
4633 -64 -205 343 -404 107 253 -275 351 -337 -42 509 -203 82 296 -335 296 -228 -197 414 -289 376 298
4654 298 -27 556 -189 -177 235 -243 98 371 -343 189 77 -213 491 -368 -60 210 -259 387 -176 -50
4674 -50 428 -508 262 454 -681 258 -129 -441 262 -420 184 232 -304 374 -330 -96 598 -482 119 445
4694 445 -754 357 -131 -668 502 -151 81 71 26 453 -274 -25 461 -646 -52 315 -563 4 18 -454
4714 -454 47 79 -18 451 -228 374 -126 -244 173 -374 104 726 -500 392 20 -684 348 79 -174 253
4734 253 -142 290 -41 -48 483 -249 54 366 -714 450 310 -464 465 -11 -187 178 -394 55 65 -82
4754 -82 464 -265 284 132 -648 175 146 -409 510 7 -443 199 -208 0 205 -222 356 -271 2 324 -263
4775 -263 233 154 -327 412 76 -372 305 -51 -78 91 -531 322 -170 120 478 -634 304 396 -587 151 68
4796 68 -548 302 -277 -32 146 -101 275 -92 -133 92 -731 125 256 -672 578 168 -319 330 -158 -128 19
4817 19 -272 -4 -110 36 255 -509 347 344 -674 622 47 -433 641 -268 -25 300 -149 143 -261 56
4837 56 233 -330 277 142 -756 528 -66 -284 609 -47 -104 780 -184 -230 -86 -117 444 -9 498 181 -432
4858 -432 429 -17 -472 717 -130 -330 595 -239 139 -60 -240 223 -430 158 177 -710 408 153 -430 659
4878 659 -293 -425 499 -497 279 134 -304 144 -356 -7 158 -365 142 -102 -509 705 -220 -274 257 -579
4898 -579 8 260 -317 465 -114 -52 54 -282 259 267 -508 660 -12 -449 625 -311 -46 221 -157 119
4918 119 -342 -141 221 -359 441 175 -716 454 -224 -97 705 -270 14 71 -371 232 -53 -77 396 -285
4938 -285 511 99 -186 443 -186 -602 489 -505 43 183 -594 3 -51 -251 293 -120 281 -53 -439 604
4958 604 10 -396 348 -277 -4 116 -316 396 -251 -203 123 -403 387 204 -492 405 0 -288 462 -169
4978 -169 58 225 -319 152 97 -273 296 -452 -90 489 -397 657 -192 -311 542 -213 -154 314 -558 103
4998 103 200 -278 99 -84 79 -12 -379 415 31 2 258 -518 408 505 -574 419 84 -294 143 13 103
5019 103 271 -321 231 269 -354 468 -151 -35 247 -72 468 7 -268 231 -415 65 499 -282 148 8
5039 8 -252 565 -80 -53 413 -263 -54 140 -89 237 93 -87 375 -424 275 32 -483 489 -206 -206 522 -365
5061 -365 -233 210 -273 390 -155 -334 329 -290 274 13 -272 80 -59 -8 274 -544 328 53 -629 212
5081 212 -25 -522 308 -62 -90 191 -438 250 -10 -231 603 -293 -48 382 -251 287 -85 231 397 -239
5101 -239 367 160 -355 447 -63 -243 492 -107 181 398 -507 165 89 -402 469 117 77 358 -296 501 -54
5122 -54 -97 297 -580 -163 442 -568 362 -170 -512 619 -125 -123 390 -180 -54 56 -519 505 -449 -36
5142 -36 70 -638 282 46 -310 545 -141 -294 205 -690 165 69 -295 222 -343 -374 243 -295 184 -209 -395
5163 -395 333 -285 -197 338 -432 151 135 -277 387 -148 199 294 -385 383 -9 -511 161 -105 -63 358 -13
5184 -13 404 -147 -36 547 -229 -29 424 -514 228 253 -178 208 -213 163 326 44 367 44 -111 429 -197
5205 -197 -132 466 -525 217 452 -101 386 151 -328 257 103 129 118 -303 123 -324 -72 357 -529 -224 53
5226 53 -759 393 92 -446 557 -184 -142 56 -165 30 -239 -170 266 -399 115 -155 -630 348 -464 -179
5246 -179 399 -473 -202 98 -369 160 -89 -291 63 -335 76 285 -601 160 -72 -368 282 -48 -303 230
5266 230 -213 273 27 -250 194 -545 122 397 -598 553 386 -477 306 -192 -66 182 -485 188 76 -319
5286 -319 99 -343 48 159 -495 484 114 -493 658 -574 -29 514 -130 -18 343 -202 281 169 -1
5305 -1 255 -104 390 -122 -270 442 -244 90 651 -289 293 261 -228 263 -320 209 424 -457 -37 186 -173
5326 -173 206 -312 -224 407 -325 204 86 -325 0 -234 -15 285 -298 15 -229 -530 425 -164 -544 233
5346 233 -168 -256 77 -437 -174 -91 128 126 -412 -38 -201 -391 190 -357 -44 411 -398 175 176 -199 391 -14
5368 -14 -95 375 -8 214 26 -314 266 -99 -134 492 -282 -31 395 -469 202 173 -100 508 -354 338 262 -369
5390 -369 74 -161 -154 231 -104 -271 318 -243 107 -234 -204 394 -208 70 225 -146 476 -232 -223 448 -422 -129
5412 -129 332 -278 376 -146 -300 106 -26 12 261 -341 100 183 -24 521 -135 80 309 -539 150 -142 -352
5433 -352 234 -351 65 314 -437 -22 -221 -511 742 -209 -277 589 -226 23 302 -581 134 92 78 210 -294
5454 -294 192 -18 -314 563 -185 -125 566 -280 -16 305 -327 439 57 -96 77 -379 199 58 -442 607
5474 607 -401 58 378 -205 229 -104 -244 644 -35 -250 290 -24 30 35 -254 168 84 -154 155 -384 229
5495 229 206 -138 145 158 -100 260 -208 -76 144 -187 268 -86 46 584 -231 -62 280 -303 165 0 -177
5516 -177 132 5 -367 -4 -265 209 -213 -206 288 -281 166 60 -432 204 17 -273 177 -112 25 425 -402
5537 -402 37 -215 -71 249 -243 48 168 -213 386 92 -184 364 -285 -28 -57 -613 337 6 -445 143
5557 143 180 12 391 -190 21 -105 -238 381 -335 -49 82 -243 399 189 -277 650 -376 61 469 -406
5577 -406 301 58 -418 432 -70 -81 47 -209 98 295 -147 182 -366 101 156 -389 279 204 -207 125 -294
5598 -294 -257 239 -588 -29 82 -212 451 -417 -197 41 -309 78 61 -429 180 -320 -95 328 -413 104 46
5619 46 -424 375 -94 -58 393 -427 93 295 -277 271 77 -110 403 -317 243 -54 -6 589 -280 85 362
5640 362 -34 -26 105 -649 191 336 -271 419 -163 119 -15 -144 208 -21 -304 186 -449 174 228 -134 368
5661 368 -90 -327 186 -153 -77 72 -298 187 232 -25 135 -208 -36 51 -334 295 -168 -231 295 -321 46
5682 46 261 -373 157 -184 -282 222 -196 33 207 -322 196 -28 -288 235 171 32 34 -290 339 35 -350 453
5704 453 -268 -5 367 -296 160 -107 -250 603 -95 -99 97 -551 195 23 -274 250 -251 -11 158 -282 253
5725 253 -202 -580 246 -17 -36 528 -66 102 174 -79 367 -205 129 500 -165 325 -12 -141 339 -230 -189
5746 -189 402 -165 105 131 -132 201 319 -30 168 -336 244 52 -245 470 -125 -39 264 -381 218 260 -257
5767 -257 16 284 88 369 -436 -55 -88 -264 120 -350 -279 177 -489 -184 87 -299 251 -119 -32 204 -298
5788 -298 149 34 -344 63 -240 -204 247 -135 68 144 -314 -57 -20 -238 110 -179 -7 392 -119 220 -239
5809 -239 -118 42 -114 -68 339 -375 262 74 -432 299 202 -176 -80 -173 651 -165 -151 252 -509 199 295 -319
5831 -319 178 -40 -144 400 -81 106 236 -387 258 13 -362 580 -44 -250 283 -132 367 -34 22 176
5851 176 -106 43 248 -230 278 -73 -326 298 -219 -289 160 -111 233 134 -240 79 -27 -187 87 -457 266
5872 266 115 -292 427 -227 -229 340 -405 68 176 -476 140 84 -219 234 -180 90 238 -218 231 -409 -229
5893 -229 454 -387 -99 227 -470 315 -288 -153 178 -336 296 180 -208 275 -205 -89 35 -316 298 228
5913 228 -178 252 134 -76 -52 -504 226 205 -27 770 -262 11 560 -197 146 547 -263 250 2 -118
5933 -118 394 -87 68 179 -196 303 -42 136 345 -431 12 138 -714 190 80 -221 236 -63 156 -14
5953 -14 -176 83 -159 -152 150 -328 54 257 -75 164 324 -35 35 -186 248 26 -208 119 -197 -385 230
5974 230 -230 -149 375 -618 167 -101 -300 521 35 45 257 -306 238 -1 -185 289 -302 64 97 -261 354
5995 354 149 -401 19 -196 61 185 -632 184 67 -173 150 -152 74 315 -214 173 -17 -245 243 -155
6015 -155 147 345 -254 122 188 -229 533 -343 127 315 -145 407 -11 -390 265 -234 -74 404 -13 391
6035 391 -20 -257 427 -177 366 187 -698 344 275 -419 326 184 -507 550 -428 145 94 -172 80 -168
6055 -168 -92 28 -241 108 86 -266 233 -170 -124 553 -295 -34 314 -456 359 155 52 408 -339 78 283
6076 283 -262 54 -283 -352 290 -327 184 -6 -339 280 -45 -50 372 -120 260 328 -281 263 93 -357 415
6097 415 35 132 92 -215 479 240 144 233 -77 127 411 -629 476 3 -157 531 151 -140 247 -221 388
6118 388 50 -61 94 -56 -48 179 -208 261 -15 -209 255 -141 103 201 -378 100 67 -402 304 -457 -90
6139 -90 367 -310 124 24 -303 64 -467 -242 -13 -114 155 -132 -170 373 -369 -222 339 -732 177 252 -287
6160 -287 421 -21 -92 248 -232 -76 -17 -249 227 -162 -166 427 -312 197 -24 -270 452 162 -118 411 68
6181 68 -47 -24 -303 149 170 53 306 -175 182 120 -194 208 -129 -260 146 -470 257 321 -196 305 53 -35
6203 -35 624 -403 29 197 -277 160 106 53 442 54 117 -11 -305 249 -271 -143 294 -401 34 -129 -107
6224 -107 124 -198 -332 136 -130 -81 95 -296 62 -74 29 63 -348 81 4 -536 245 -1 -174 453 -199
6245 -199 -23 -98 -327 9 -53 -42 392 -67 301 -48 -259 82 -225 34 403 -385 -33 334 -295 174 143
6266 143 -64 228 -52 -18 229 -362 61 -202 -275 622 6 114 304 -243 106 188 -317 45 -134 -76 83
6287 83 -255 153 33 -276 315 -123 102 456 -308 249 -234 -207 218 25 -256 244 -200 -17 -128 -65 116
6308 116 -247 58 -53 -457 176 446 -199 4 -132 -3 62 -184 397 -214 -302 452 -247 -21 345 -252 -81
6329 -81 181 -378 238 -132 -52 336 -142 27 95 -338 351 -523 116 391 -60 222 35 -251 277 38 -238
6350 -238 165 297 393 345 -365 221 -86 -206 449 -318 130 247 -40 -6 -112 -111 11 -243 -23 -221 -230 553
6372 553 -227 -319 288 -359 -2 285 -210 109 214 -198 203 -220 69 -27 -376 334 -28 65 255 -324 143
6393 143 258 -338 253 455 -314 78 24 -155 202 -206 370 -186 -124 381 -419 -185 142 -182 91 -182 -270
6414 -270 379 -162 0 213 -553 184 149 -265 226 -38 -16 292 -256 -53 284 -306 172 -354 44 361 -245
6435 -245 5 -146 -317 312 -336 -109 -42 -285 280 376 -279 27 219 33 28 -167 307 -106 256 265 -257 225
6457 225 -102 -239 356 228 -332 242 -320 -107 261 83 -33 -32 -47 375 -194 71 131 -35 -400 31 -85
6478 -85 201 -284 -265 108 -171 12 86 -285 277 -27 -42 132 -265 7 234 -551 258 32 -385 321 -577
6499 -577 -200 -209 -79 271 -45 -138 111 -396 171 19 -372 -37 -321 -160 35 -137 84 -162 -108 292 -257
6520 -257 -143 34 -336 211 275 -218 191 -259 -199 194 -482 -12 201 11 135 187 -138 368 -102 128 123 -243
6542 -243 399 -210 -4 175 -125 169 84 -153 322 -103 -139 243 -267 89 276 -416 513 -25 -141 233 -73
6563 -73 -152 44 -35 152 106 91 195 46 100 -82 -98 128 182 -181 173 -183 -101 9 -171 170 130 -274 52
6586 52 -205 -80 355 -221 -322 81 -175 275 -425 -86 64 -276 247 4 -287 248 -256 -53 226 -332
6606 -332 117 -254 -218 525 41 76 -26 -122 122 6 -162 -44 -78 37 -82 -286 72 78 -483 375 -21 22
6628 22 302 -68 -142 103 -59 25 161 -31 83 -136 66 -43 -194 319 -13 -166 411 -341 -88 248 -9
6649 -9 16 62 221 302 13 72 5 -330 45 -197 -156 38 -308 224 46 -260 225 83 -207 254 -328 20 148
6672 148 -230 294 50 -87 142 -97 -107 23 -279 -125 79 101 385 -133 30 -144 -377 93 -465 -308 259
6693 259 -339 -42 107 -275 2 -38 -122 -21 -49 -67 -4 -366 250 -54 -120 319 -342 -147 230 -293 86 -91
6715 -91 -53 440 -54 92 -37 -251 -7 14 -156 210 -212 -215 33 -202 73 26 -19 199 -49 -199 79 -212
6737 -212 1 49 -167 220 -183 -17 106 -10 33 30 -137 197 -70 -172 18 -390 18 60 -263 -34 -29 -51 173
6760 173 -124 79 -207 -215 153 -143 -160 45 -275 52 -232 -259 420 -192 -68 306 -300 -115 -120 -605 379 -231
6782 -231 -53 161 -66 -67 -72 -81 132 -173 38 130 -172 226 94 -180 261 -52 44 337 -71 -97 -25 86 272
6805 272 -200 -87 141 -312 129 62 -157 259 70 -337 89 -43 240 0 -118 -118 7 -61 56 -9 -20 156
6827 156 -194 156 14 46 448 66 -200 359 -118 208 54 120 -62 -122 -7 -33 -295 218 330 -63 197
6848 197 -33 91 121 145 391 -96 48 -10 -156 203 372 -183 419 99 -284 173 -315 -105 240 -25 107
6869 107 123 -212 -28 -183 109 126 -193 73 172 -217 448 -264 50 388 -182 97 276 -105 5 -264 -141
6890 -141 158 -254 228 122 -386 51 74 -196 -146 -277 11 -174 -415 110 -240 149 389 -143 -58 98 -87
6911 -87 169 -201 14 385 -268 -13 206 -139 239 75 6 85 -189 96 -26 -394 358 -72 -110 292 -239
6932 -239 86 263 -32 -88 -12 -83 -99 -237 -156 -7 -244 408 -157 -249 106 -184 -11 -34 -351 70 -242 -83
6954 -83 98 23 281 187 -197 12 35 -330 280 -70 171 208 23 105 -130 -77 2 123 -14 -72 -542 84 96
6977 96 -169 93 -259 -47 107 -187 16 -61 159 -117 -329 279 45 -33 162 -2 129 207 1 0 221 -63
6999 -63 123 204 6 218 19 -195 176 -371 88 -91 173 43 -18 82 54 -123 30 -29 29 102 -15 -29 24
7022 24 -37 416 -235 -46 434 -225 37 409 -431 -28 -17 -189 250 -90 118 10 -164 -83 -23 -173 559 -35
7044 -35 64 320 -114 276 12 -130 -10 63 106 247 -256 -7 94 116 362 -155 -9 3 -328 14 -42 -92 -133
7067 -133 -201 137 115 -221 26 106 -207 177 -225 -340 101 -188 275 183 -211 188 -97 -179 313 -127 207 -193
7089 -193 -110 313 15 -69 143 31 203 17 -223 21 -43 -294 308 72 73 -177 -258 248 125 56 369 -40
7111 -40 301 86 -54 49 57 -181 290 -112 -68 185 -63 158 -43 -173 160 -173 26 158 -114 191 -1
7132 -1 -61 -125 -266 101 3 -190 -45 -3 -73 183 -221 72 272 -196 -174 321 -5 125 -121 -22 -100 191 127 -196
7156 -196 79 311 -199 12 122 -269 129 5 -470 175 -70 -102 73 169 220 14 -91 409 115 -112 -113 -115
7178 -115 77 -78 55 52 192 -136 336 -319 97 -32 -46 182 -55 101 329 13 -122 161 254 160 124 287
7200 287 247 -312 -168 -94 -244 140 -79 123 364 -223 -329 85 -318 -250 2 160 314 -140 33 92 -408
7221 -408 129 -68 276 -16 -97 162 39 -210 374 207 37 73 153 175 145 24 91 14 130 209 -84 247 -87
7244 -87 -106 -36 -42 -31 164 -119 -29 373 -67 138 41 -202 369 -241 201 -23 67 26 143 -92 143 -316 33
7267 33 92 -406 382 -91 32 -16 -144 86 314 -356 -69 127 -364 149 -101 160 104 -48 264 266 24 -62
7289 -62 -18 36 170 52 331 174 40 422 31 -171 -82 -154 -32 -240 -37 -126 -10 317 114 -295 235 -125
7311 -125 -110 304 -147 -228 157 -229 -209 -39 19 8 -281 23 -4 -169 286 22 -172 118 13 -2 365 13
7333 13 95 22 -187 20 -6 61 227 -307 -236 -123 -105 155 30 63 423 100 27 159 -238 274 -217 -17 261
7356 261 -191 69 62 -467 269 -145 -148 162 13 229 82 43 66 99 -101 -15 -141 30 -204 -339 281 -157 127
7379 127 203 -277 -83 3 -31 2 85 23 95 -129 -36 -173 -118 234 49 -230 -3 -258 -148 125 -310 203 -285
7402 -285 -99 253 30 152 -18 -98 339 48 -204 118 -412 -99 116 -313 154 -202 -38 -23 -92 -74 -88 -243
7424 -243 56 -227 -118 235 -560 173 23 -283 -109 82 100 117 -128 -45 70 -120 -2 -60 -43 256 -245 199
7446 199 168 -238 -14 -59 132 119 7 -28 -44 -51 103 -275 -219 163 98 68 192 -116 133 408 141 200 108 -325
7470 -325 179 -339 164 155 53 378 77 109 3 -116 0 287 -74 201 201 -82 124 -52 186 148 3 177
7492 177 49 142 119 -83 93 55 -226 204 -127 -3 152 -309 66 230 -67 26 234 93 266 -241 155
7513 155 152 -57 221 134 -352 84 -177 -200 -90 -249 34 -58 174 144 -169 87 -285 -462 148 154 174 128 99 -133
7537 -133 -2 -130 236 -54 105 71 -198 168 68 -222 329 -241 -251 553 63 63 107 -254 190 113 23 164
7559 164 -154 -137 258 -284 285 95 -219 109 30 90 126 323 116 -103 -15 -23 -298 104 14 -218 117 13 -382
7582 -382 33 153 80 206 -326 -65 136 -31 112 -96 -132 -62 -294 74 188 -224 290 -275 84 31 -157
7603 -157 151 -82 4 13 -304 -127 276 -256 144 -69 41 85 -278 -53 -125 -57 -79 122 -33 138 -79 68
7625 68 181 -237 -7 -32 -163 155 -71 142 139 -10 51 145 -34 -58 80 -92 62 -54 75 163 -22 61 -61
7648 -61 -201 72 19 48 -63 -157 -67 -3 135 14 -261 -245 -219 -518 183 -25 -180 129 -32 -40 -71 -57 63 -25
7672 -25 18 298 -137 236 54 0 102 -131 2 22 -52 -32 1 -168 130 -144 212 120 -312 -386 -105 -317 16
7695 16 -109 259 -164 -87 -199 306 140 -106 132 -119 111 72 134 -335 53 -93 19 184 204 -305 -119 168
7717 168 -43 -35 -178 -80 -146 -90 -266 98 -78 131 48 152 162 -84 -161 -151 -23 30 16 -367 27 64 8 103 -193
7742 -193 -29 -83 35 191 -204 36 34 22 -28 -15 99 105 -65 127 154 178 76 -213 63 269 -127 -29 380 -211
7766 -211 105 -21 -26 -47 76 66 -12 -22 -166 48 -286 219 -71 -43 -13 -336 6 -264 -128 209 -149 196 150
7789 150 -105 -86 32 86 -4 -69 254 -4 -114 311 -119 -72 -36 -123 92 187 -165 -80 -222 -177 356 -12 -73 391
7813 391 117 62 204 109 -86 -67 -17 62 -247 223 151 -197 -26 -38 -60 180 -224 3 203 17 106 -230 17
7836 17 43 47 3 184 247 -36 -11 -159 37 -173 45 22 102 28 -111 -116 -255 126 122 41 -49 -166 -66 64 189
7861 189 1 29 8 -30 -28 178 -168 -5 -76 -62 -239 -37 -8 81 -69 69 45 83 60 -114 -226 -74 6 -208
7885 -208 82 34 -202 -109 109 48 -281 -29 -144 27 41 31 -231 115 -2 -42 -109 -397 -208 21 433 5
7907 5 231 92 35 66 24 -104 -188 357 84 73 -24 76 -26 -308 149 -76 -6 147 28 -31 174 -71 -68 -44
7931 -44 -386 16 -130 21 8 -30 -188 32 -11 121 -87 -81 5 -197 73 74 -182 -40 91 -171 -103 -176 31 108
7955 108 159 -21 -11 426 -40 -282 -183 47 -30 -16 29 -151 82 -50 97 3 -285 -24 -248 -44 138 -86
7977 -86 170 -242 -91 120 108 -306 -87 -25 23 133 -171 198 84 110 -62 20 7 265 9 -87 173 148 -123
8000 -123 -10 88 15 190 128 -136 -60 97 -78 -107 9 -123 1 48 -96 145 54 197 160 -21 89 -172 -64
8023 -64 97 -117 -335 73 -245 133 -27 -180 30 211 -219 80 -151 155 116 -353 -70 32 -2 42 -106
8044 -106 156 69 -106 188 -6 56 -48 166 58 -79 -410 113 147 82 58 -2 320 37 -268 176 -156 -141
8066 -141 189 -61 129 -152 149 265 -16 145 -40 42 136 -25 110 136 -193 26 288 159 -120 49 -111
8087 -111 -334 206 63 41 -334 -103 160 -125 77 -47 -76 123 -168 152 31 275 -76 30 243 204 -20
8108 -20 -21 -61 -350 254 -251 -22 159 -243 78 200 -101 54 74 113 0 45 -158 142 -255 24 51 -186 -199
8131 -199 -14 -108 57 169 61 239 145 86 -164 -129 88 -249 -185 -129 56 43 -124 108 266 356 -136 174 -55
8154 -55 9 -117 178 47 139 -176 179 -76 -49 -2 -6 -38 -311 416 76 50 15 -151 -205 211 -34 -127 -143 -166 -128
8179 -128 -118 37 20 -140 -11 209 -225 199 -49 60 70 -181
8191a81
##END NTUPLES=NMR FID
##END=
