##TITLE=1H_86-2023
 CDCl3
 8 sc, 
 4.10.2023
##JCAMPDX= 6.0         $$ Bruker NMR JCAMP-DX V2.0
##DATA TYPE= NMR FID
##DATA CLASS= NTUPLES
##ORIGIN= UXNMR, Bruker Analytische Messtechnik GmbH
##OWNER= root
$$ XWIN-NMR		Version 3.5
$$ Wed Oct  4 15:35:43 2023 Russian Standard Time (UT+4h)  she@DPX200
##.OBSERVE FREQUENCY= 200.13135
##.OBSERVE NUCLEUS= ^1H
##.DELAY= (6, 6)
##.ACQUISITION MODE= SIMULTANEOUS
##.ACQUISITION SCHEME= undefined
##.AVERAGES= 8
##.DIGITISER RES= 18
##SPECTROMETER/DATA SYSTEM= spect
##.PULSE SEQUENCE= zg30
##.SOLVENT NAME= D2O
##.SHIFT REFERENCE= (INTERNAL, D2O, 0, 15.7039)
##AUDIT TRAIL= $$ (NUMBER, WHEN, WHO, WHERE, WHAT)
$$ ##TITLE= Audit trail, XWIN-NMR		Version 3.5
$$ ##JCAMPDX= 5.01
$$ ##ORIGIN= Bruker BioSpin GmbH
$$ ##OWNER= she
$$ F:/spectra/data/she/nmr/H-F/1/audita.txt
$$ ##AUDIT TRAIL=  $$ (NUMBER, WHEN, WHO, WHERE, WHAT)
(   1,<2023-10-04 15:34:36.28 +0400>,<she>,<DPX200>,
      <created by zg, POWCHK disabled, PULCHK disabled
       configuration hash MD5:
       00 E9 B6 7A A2 85 ED C7 34 08 36 98 17 FE 4E 26
       data hash MD5: 16K
       AC CA 00 B5 28 C8 A3 C7 11 D5 0B F1 0A 9A F7 31>)
$$ ##END=
$$ 
$$ hash MD5
$$ 23 E4 2F 28 00 CB BD C3 8A BA 6E 57 3E 45 EB D4
##$RELAX= 
##$RELAX= 
##$RELAX= 
##$RELAX= 
##$RELAX= 
##$RELAX= 
$$ Bruker specific parameters
$$ --------------------------
##$DU= <F:/spectra>
##$EXPNO= 1
##$NAME= <H-F>
##$PROCNO= 1
##$TYPE= <nmr>
##$USER= <she>
##$AMP= (0..31)
100 100 100 100 100 100 100 100 100 100 100 100 100 100 100 100 100 100 
100 100 100 100 100 100 100 100 100 100 100 100 100 100 
##$AQSEQ= 0
##$AQ_mod= 1
##$AUNM= <au_zg>
##$AUTOPOS= <>
##$BF1= 200.13
##$BF2= 200.13
##$BF3= 200.13
##$BF4= 200.13
##$BF5= 200.13
##$BF6= 200.13
##$BF7= 200.13
##$BF8= 200.13
##$BYTORDA= 1
##$CFDGTYP= 0
##$CFRGTYP= 5
##$CHEMSTR= <none>
##$CNST= (0..31)
1 1 145 1 1 1 1 1 1 1 1 1 1 1 1 1 1 1 1 1 1 1 1 1 1 1 1 1 1 1 1 1 
##$CPDPRG= <>
##$CPDPRG1= <>
##$CPDPRG2= <>
##$CPDPRG3= <>
##$CPDPRG4= <mlev>
##$CPDPRG5= <mlev>
##$CPDPRG6= <mlev>
##$CPDPRG7= <mlev>
##$CPDPRG8= <mlev>
##$CPDPRGB= <>
##$CPDPRGT= <>
##$D= (0..31)
0 1.2 0 0 0 0 0 0 0 0.06 0 0.03 0 0 0 0 0.0002 0 0 0 0 0 0 0 0 0 0 0 0 
0 0 0 
##$DATE= 1696419275
##$DBL= (0..7)
120 120 120 120 120 120 120 120 
##$DBP= (0..7)
150 150 150 150 150 150 150 150 
##$DBP07= 0
##$DBPNAM0= <>
##$DBPNAM1= <>
##$DBPNAM2= <>
##$DBPNAM3= <>
##$DBPNAM4= <>
##$DBPNAM5= <>
##$DBPNAM6= <>
##$DBPNAM7= <>
##$DBPOAL= (0..7)
0.5 0.5 0.5 0.5 0.5 0.5 0.5 0.5 
##$DBPOFFS= (0..7)
0 0 0 0 0 0 0 0 
##$DE= 6
##$DECBNUC= <off>
##$DECIM= 32
##$DECNUC= <off>
##$DECSTAT= 4
##$DIGMOD= 1
##$DIGTYP= 9
##$DL= (0..7)
0 120 120 120 120 120 120 120 
##$DP= (0..7)
150 150 150 150 150 150 150 150 
##$DP07= 0
##$DPNAME0= <>
##$DPNAME1= <>
##$DPNAME2= <>
##$DPNAME3= <>
##$DPNAME4= <>
##$DPNAME5= <>
##$DPNAME6= <>
##$DPNAME7= <>
##$DPOAL= (0..7)
0.5 0.5 0.5 0.5 0.5 0.5 0.5 0.5 
##$DPOFFS= (0..7)
0 0 0 0 0 0 0 0 
##$DQDMODE= 0
##$DR= 18
##$DS= 0
##$DSLIST= <SSSSSSSSSSSSSSS>
##$DSPFIRM= 0
$$ [...]
##$SUBNAM2= <"">
##$SUBNAM3= <"">
##$SUBNAM4= <"">
##$SUBNAM5= <"">
##$SUBNAM6= <"">
##$SUBNAM7= <"">
##$SUBNAM8= <"">
##$SUBNAM9= <"">
##$SW= 18.05172834244
##$SWIBOX= (0..15)
0 0 2 0 0 0 0 0 0 0 0 0 0 0 0 0 
##$SW_h= 3612.71676300578
##$TD= 16384
##$TD0= 1
##$TE= 0
##$TE2= 300
##$TE3= 300
##$TEG= 300
##$TL= (0..7)
0 120 120 120 120 120 120 120 
##$TP= (0..7)
150 150 150 150 150 150 150 150 
##$TP07= 0
##$TPNAME0= <>
##$TPNAME1= <>
##$TPNAME2= <>
##$TPNAME3= <>
##$TPNAME4= <>
##$TPNAME5= <>
##$TPNAME6= <>
##$TPNAME7= <>
##$TPOAL= (0..7)
0.5 0.5 0.5 0.5 0.5 0.5 0.5 0.5 
##$TPOFFS= (0..7)
0 0 0 0 0 0 0 0 
##$TUNHIN= 0
##$TUNHOUT= 0
##$TUNXOUT= 0
##$USERA1= <user>
##$USERA2= <user>
##$USERA3= <user>
##$USERA4= <user>
##$USERA5= <user>
##$V9= 5
##$VALIST= <valist>
##$VCLIST= <CCCCCCCCCCCCCCC>
##$VD= 0
##$VDLIST= <DDDDDDDDDDDDDDD>
##$VPLIST= <PPPPPPPPPPPPPPP>
##$VTLIST= <TTTTTTTTTTTTTTT>
##$WBST= 1024
##$WBSW= 4
##$XGAIN= (0..3)
0 0 0 0 
##$XL= 0
##$YL= 0
##$YMAX_a= 173707
##$YMIN_a= -209773
##$ZGOPTNS= <>
##$ZL1= 120
##$ZL2= 120
##$ZL3= 120
##$ZL4= 120
##$ABSF1= 10
##$ABSF2= 0
##$ABSG= 5
##$ABSL= 3
##$ALPHA= 0
##$AQORDER= 0
##$ASSFAC= 0
##$ASSFACI= 0
##$ASSFACX= 0
##$ASSWID= 0
##$AUNMP= <proc_1d>
##$AZFE= 0.1
##$AZFW= 0.1
##$BCFW= 1
##$BC_mod= 2
##$BYTORDP= 1
##$COROFFS= 0
##$CY= 11.3945322036743
##$DATMOD= 1
##$DC= 2
##$DFILT= <>
##$DTYPP= 0
##$F1P= 15.7292609196834
##$F2P= 12.9074282941183
##$FCOR= 0.5
##$FTSIZE= 0
##$FT_mod= 4
##$GAMMA= 1
##$GB= 0.15
##$INTBC= 1
##$INTSCL= 1
##$ISEN= 128
##$LB= 0.24
##$LEV0= 0
##$LPBIN= 0
##$MAXI= 10000
##$MC2= 0
##$MEAN= 0
##$ME_mod= 0
##$MI= 1.114404
##$NCOEF= 0
##$NC_proc= 0
##$NLEV= 6
##$NOISF1= 3.799351
##$NOISF2= 2.8
##$NSP= 1
##$NTH_PI= 0
##$NZP= 0
##$OFFSET= 15.70392
##$PC= 1
##$PHC0= -21713.98
##$PHC1= 16.05271
##$PH_mod= 1
##$PKNL= yes
##$PPARMOD= 0
##$PSCAL= 0
##$PSIGN= 0
##$REVERSE= no
##$SF= 200.130013532006
##$SI= 16384
##$SIGF1= 3
##$SIGF2= 2
##$SINO= 400
##$SIOLD= 16384
##$SREGLST= <1H.CDCl3>
##$SSB= 0
##$STSI= 0
##$STSR= 0
##$SW_p= 3612.71676300578
##$SYMM= 0
##$S_DEV= 0
##$TDeff= 0
##$TDoff= 0
##$TI= <>
##$TILT= no
##$TM1= 0
##$TM2= 0
##$TOPLEV= 0
##$USERP1= <user>
##$USERP2= <user>
##$USERP3= <user>
##$USERP4= <user>
##$USERP5= <user>
##$WDW= 1
##$XDIM= 8192
##$YMAX_p= 0
##$YMIN_p= 0
$$ End of Bruker specific parameters
$$ ---------------------------------
##NTUPLES= NMR FID
##VAR_NAME=  TIME,          FID/REAL,        FID/IMAG
##SYMBOL=    X,             R,               I
##VAR_TYPE=  INDEPENDENT,   DEPENDENT,       DEPENDENT
##VAR_FORM=  AFFN,          ASDF,            ASDF
##VAR_DIM=   8192,          8192,            8192
##UNITS=     SECONDS,       ARBITRARY UNITS, ARBITRARY UNITS
##FACTOR=    0.0002768,     1,               1
##FIRST=     0,             0,               0
##LAST=      2.2672688,     0,               0
##MIN=       0,             -209773,         0
##MAX=       2.2672688,     173707,          0
$$ Real data points
##PAGE= N=1
##DATA TABLE= (X++(R..R)), XYDATA
0@%%%%%%%%%%%%%%%nJ3j6J6j6J6j7K5l2L2l7M5n1N9o8P6q5R7j09J21j35J51j71
$$ 0 0 0 0 0 0 0 0 0 0 0 0 0 0 0 0 -5 8 -8 8 -8 8 -9 16 -16 16 -21 24 -27 32 -36 40 -45 52 -57 64 -71 80 -91
38i1J91k10K31k56K84l12L43l80M20m61N05n56O14o77P46q26R17j017J134j273
$$ -91 100 -110 121 -135 149 -163 180 -200 220 -241 264 -292 322 -355 391 -435 482 -535 599 -674
58f74J439j638J881k192K599l151L940n148P191j1184K1437q8198j36075L80491
$$ -674 765 -873 1008 -1184 1415 -1736 2204 -2944 4247 -6937 14500 -73698 -209773 170718
72A70718q6288k44139K52624N0824k49799Q1027J98740j57424j14472K03782n8443
$$ 170718 84430 -159709 92915 143739 -106060 -25033 173707 16283 -98189 105593 47150
83D7150j60242J85365r911j73035J16336L7218r4276K1751K8077k068l5680K0067
$$ 47150 -113092 72273 62362 -110673 5663 42881 -51395 -29644 -1567 -3635 -39315 -19248
95a9248N6276q4502J2873R6226q4638j3470P9052m2241k7797M3504K6779o4878
$$ -19248 37028 -47474 -34601 61625 -23013 -36483 42569 328 -27469 16035 42814 -22064
107b2064k6024J13067n2961p9093J34825n2133r6034J37738j6079q8752O9602
$$ -22064 -48088 64979 12018 -67075 67750 15617 -80417 57321 41242 -47510 22092
118B2092Q530m1293R904K8833j2596m0306M2893k841n1167N6246k1876l9430N9074
$$ 22092 30622 -10671 -767 28066 15470 -24836 18057 15216 -35951 20295 -1581 -41011 18063
131A8063m9227k941O2393o9530J4548M6510o0001L2901L2785m2917J1302K5097
$$ 18063 -31164 -34105 28288 -41242 -26694 19816 -40185 -7284 25501 -17416 -6114 18983
143A8983j778k1649K2901K8395o6904L2997N4430j01491L5364O4428j04444K5269
$$ 18983 17205 -4444 18457 46852 -20052 12945 67375 -34116 1248 65676 -38768 -13499
155a3499N7390p1166K545L6250j7164k5062J0902L8929m3888j0273O6063m6486
$$ -13499 43891 -27275 -24730 11520 -5644 -30706 -19804 19125 -24763 -35036 31027 -15459
167a5459j4716N7146l1775q39J6384j2534K0125k6950Q491L5768n8225J8411L9012
$$ -15459 -30175 26971 -4804 -5643 10741 -1793 18332 -8618 -127 35641 -22584 -4173 34839
180C4839n5427J6179K3726k8615M431N444J0234j7090q207M3571l7881j1256N8394
$$ 34839 -20588 -4409 19317 -9298 -4867 577 10811 -6279 -14486 29085 -8796 -20052 38342
193C8342n0384l817N0080n0232O426K9442l2216Q373J992l744M008j5514K3356
$$ 38342 -12042 -15859 34221 -16011 -9585 19857 -12359 -3986 -1994 -5738 -1730 -17244 6112
206F112j1224j9187M0066k3342p796L4764l1190J1852J7758k8124K6581p600j5941
$$ 6112 -5112 -24299 15767 -7575 -15371 19393 -11797 55 17813 -10311 16270 8670 -7271
219g271L0845k3986k84J9146k6843J3170k98j3278J5801j9379Q526R676k8433
$$ -7271 23574 -412 -696 18450 -8393 4777 4479 -8799 7002 -12377 -3851 5825 -22608
232b2608K8785o129k3421L9185k0853r693L2864k6677O836J5373k0857J5782o754
$$ -22608 6177 48 -23373 15812 -5041 -14734 18130 -8547 -1711 13662 -7195 8587 1833
245A833l107J3306k3173J6870J181k5422L1154j4243j6383L2725k4527J676K0325
$$ 1833 -1274 12032 -11141 5729 6910 -18512 12642 -1601 -17984 14741 -9786 -8110 12215
258A2215k4843J6283J279j2114K0592j6994N551J3705k6048K1618j617k1882K6852
$$ 12215 -12628 3655 4934 -7180 13412 -3582 1969 15674 -10374 11244 9627 -12255 14597
271A4597j6337o928J9865k2969J0842K836j8391K3019j5240m023K4058k6389J1162
$$ 14597 -1740 -8668 11197 -11772 -930 1906 -16485 6534 -8706 -12729 11329 -15060 -3898
284c898J4212k4275K0440j427j1080J8179j5436Q445O021k0670K3603j0263j5006
$$ -3898 10314 -13961 6479 5052 -6028 12151 -3285 5160 11181 -9489 14114 3851 -11155
297a1155K8957k2691k328K1481k5097J1082M674j4996J6927j2681K090J3672k3181
$$ -11155 17802 -4889 -7217 14264 -10833 249 4923 -10073 6854 -5827 -3737 9935 -13246
310a3246J8619R47k1472K6927j2903r456K2815k1058O050R372j9155J7785p535
$$ -13246 5373 6320 -15152 11775 -1128 -10584 12231 -8827 -2777 6595 -12560 5225 -2310
323b310p544J9754j9885Q631J0591k1605K0980l820j3001K3835j6684J290J5633
$$ -2310 -9854 9900 -9985 -1354 9237 -12368 8612 4792 -8209 15626 -1058 232 15865
336A5865k1699J3925P62j5087J8210j5060p52J3212k2875J4640J123k0417K2737
$$ 15865 -5834 8091 8853 -6234 11976 -3084 -3836 9376 -13499 1141 2264 -18153 4584
349D584j0664q541K0341j7157N998Q284j3727J7512r041k278J9642k1968J0684
$$ 4584 -6080 -14621 5720 -11437 -5439 2845 -10882 6630 -2411 -4689 14953 -7015 3669
362C669J2574k5246J9494J52j6704J8431j1555o37Q212j6098J4915p112j1616
$$ 3669 16243 -9003 10491 10643 -6061 12370 815 178 8390 -7708 7207 95 -11521
375a1521K3364j9732j734K0659k3624R093Q451j6004J4502p290j174J1683j8477
$$ -11521 11843 -7889 -9623 11036 -12588 -3495 4956 -11048 3454 -3836 -5010 6673 -11804
388a1804J5384K391k1067K4659p493j2966K2502j4239k90J1282j2266J1448o597
$$ -11804 3580 5971 -15096 9563 2070 -10896 11606 -2633 -2923 8359 -3907 7541 944
401I44l545J6941k0415Q379J2633k5458J7011K245j8791J8283r262m590J1077
$$ 944 -2601 14340 -6075 2304 14937 -10521 6490 8735 -10056 8227 -1035 -5625 5452
414E452j5513J0560j636j2784J9688j3085l899J8360j8678R003P275j4691J6647
$$ 5452 -10061 499 -1137 -13921 5767 -7318 -11217 7143 -11535 -2532 4743 -9948 6699
427F699p291l245J7504j8849R195R384k0995J8149k161j4768J7559j1372p01Q065
$$ 6699 -592 -3837 13667 -5182 4013 13397 -7598 10551 8390 -6378 11181 -191 -892 7173
441G173j4747J1811n105r175J7677j7147K404J4605k1374J3998L245j6933K0231
$$ 7173 -7574 4237 -868 -10043 7634 -9513 -7109 7496 -13878 120 3365 -13568 6663
454F663q359o237J6851j5144O451O851j3265J3017o490l254J3399j5773Q792L910
$$ 6663 -1696 -7933 8918 -6226 225 7076 -6189 6828 338 -2916 10483 -5290 3502 7412
468G412j6801J9421p473j0579K0315j7455J296J5528j9774R372L101j2607J3134
$$ 7412 -9389 10032 2559 -8020 12295 -5160 -3864 11664 -8110 1262 4363 -8244 4890
481D890p726o57P142j3495J3374l497j1038J9182j4156r13J7623k0591J0420P636
$$ 4890 -2836 -3493 3649 -9846 3528 31 -11007 8175 -5981 -6894 10729 -9862 558 8194
495H194j7862J7902m671r613J6946j1804J301Q496j2856R469m249l720J0224j5187
$$ 8194 -9668 8234 3563 -6050 10896 -908 393 8889 -3967 5502 1253 -2467 7757 -7430
509g430Q144M888j9291J9777o015j5254K4587j3399o533J9422j5588L092Q634
$$ -7430 714 5602 -13689 6088 73 -15181 9406 -3993 -10526 8896 -6692 -3600 5034
522E034r230P823m978K622N500j3136J4214k477j4207K1136j2571p162K0174j8795
$$ 5034 -4196 3627 -1351 1271 6771 -6365 7849 5372 -8835 12301 -270 -7432 12742 -6053
536f053L046J2538j9297J1461J379j1387J2619p655J77O095r477J0370n132m821
$$ -6053 -3007 9531 -9766 1695 3074 -8313 4306 -3349 -3172 2923 -6554 3816 -1316 -6137
550f137J4571j5527O000J0267k0369J6123J344j7808K1163q250j0033J8842j2154
$$ -6137 8434 -7093 -1093 9174 -11195 4928 6272 -11536 9627 1377 -8656 10186 -1968
563a968o92Q617q256N270m484K423N284j5045J4681q54j7972K2370q742j2553
$$ -1968 -2660 5957 -2299 2971 -1513 910 6194 -8851 5830 4976 -12996 9374 632 -11921
577a1921K2230j5170k780J4945j5248O445M034r008R560n754J535N671r742J1228
$$ -11921 10309 -4861 -7641 7304 -7944 -1499 2535 -6473 3087 -2667 -1132 4539 -5203 6025
591F025m324o072J6197j4996K058J4709k1493J0819P125k0099J5542j504j2627
$$ 6025 1701 -4371 11826 -3170 -1112 13597 -7896 2923 10048 -10051 5491 3987 -8640
604h640J2802o674j318L992n952P680p477J300J1014j7337J0837P328j9901J8534
$$ -8640 4162 -2512 -3830 162 -5790 1890 -5587 -4287 6727 -10610 227 7555 -12346 6188
618F188q58j5191J9279q383n100J3503j2143M497L273p922Q533p001R15N939j1891
$$ 6188 5330 -9861 9418 1035 -4065 9438 -2705 1792 5065 -2857 5676 -1325 -410 5529 -6362
633f362J0530k116j1379J7683j1758m098J7146j8119M939J1192j7340J0521K257
$$ -6362 4168 2052 -9327 8356 -3402 -7500 9646 -8473 -3534 7658 -9682 839 3096
646C096j0483J0397m953N55L004o714J0550o741l081J4668j6390N241J2285j9275
$$ 3096 -7387 3010 -1943 -1388 1616 -5098 5452 -1289 -4370 10298 -6092 -851 11434 -7841
660g841J1827M288j5447J4450m560o194J0588j0378L819K589q682R255p143r41
$$ -7841 3986 8274 -7173 7277 2717 -3477 7111 -3267 552 3141 -5541 3714 -3429 -4370
674d370R085j3450Q713K257j3537J6004o207p602J7099j2759P79J2120j3343P570
$$ -4370 4715 -8735 -22 2235 -11302 4702 -1505 -9107 7992 -4767 -3988 8132 -5211 2359
688B359K559p401Q886p081K877M364j1454J1554m000r112J5636j1902k266J3323
$$ 2359 4918 -2483 6403 -678 2199 6563 -4891 6663 2663 -6449 9187 -2715 -4981 8342
702H342j5423N702N296j2264J0795l898m496R805r570M571L890r827J1284m958
$$ 8342 -7081 -1379 3917 -8347 2448 -1450 -5946 3859 -5711 -1140 2750 -7077 4207 -751
716g51l609J1420j1710N285N786j3278J2450k314q980J4530j0086j326J0227j1840
$$ -751 -4360 7060 -4650 635 6421 -6857 5593 3279 -5701 8829 -1257 -2583 7644 -4196
730d196O187J398p618R276p672Q89P164j2856R857J34j1777J5052p803n186J3612
$$ -4196 1991 3389 -4229 5047 -2625 -1736 5428 -7428 2429 2563 -9214 5838 -1965 -7151 6461
745F461j2141L580O136j0524R165k396m376J0153r630M318N401j1840J1428k681
$$ 6461 -5680 -2100 4036 -6488 2677 281 -4095 6058 -3572 746 6147 -5693 5735 3054
759C054p580J2836r915L46Q309j2258P805Q2r139J1506p785j495R139j1804O591
$$ 3054 -4526 8310 -1605 -1259 7050 -5208 2597 2679 -6460 5046 -2739 -4234 4905 -6899 -308
774c08K280r508J1324n927k320J0178j1363O670L703j1168J2094m368n556J2149
$$ -308 1972 -7536 3788 -2139 -4459 5719 -5644 1026 4729 -6439 5655 1287 -4269 7880
788G880j0124K149O485j1422R167k134o364J0583r679J974O714j2375R458p64
$$ 7880 -2244 -95 6390 -5032 4135 2001 -4363 6220 -3459 -1485 5229 -7146 2312 1548
802A548q912J2213p813j219R464j1164O373K052q998J1476o127k326J0021j0917
$$ 1548 -7364 4849 -2964 -4183 5281 -5883 490 2542 -6456 5020 -1107 -3433 6588 -4329
816d329N346L972j0342J0694m030m792J0476j0182L336N682j1684R668k294o900
$$ -4329 1017 4989 -5353 5341 1311 -3481 6995 -3187 149 5831 -5853 3815 1521 -5379
830e379J0811q422P72O586j0629Q145j106p497J1450q260n8Q915j1458O882K804
$$ -5379 5432 -2990 -2218 4368 -6261 1884 778 -6719 4731 -3529 -3587 5328 -6130 752 3556
845C556r424J0646n028k630R185j0094N748K990j0090J0977n056m473J0926j0370
$$ 3556 -5868 4778 -250 -2880 6305 -3789 1959 4949 -5141 5836 780 -3693 7233 -3137
859c137K498N864j1008Q762k454n833J0244r335J930O724j1888Q975l70p766J1236
$$ -3137 -639 5225 -5783 2979 525 -5308 4936 -4399 -2469 4255 -7633 1342 972 -6794 4442
874D442o993o18Q251j0185P095J160q621J1522o041k418R685j0565M793L903r515
$$ 4442 -2551 -3169 5082 -5103 1992 3152 -5469 6053 12 -2406 7279 -3286 1507 5410 -4105
889d105R152m471l697R454j0423M040M272j1068R930k846p172J1231q015J43O831
$$ -4105 5047 576 -3121 6333 -4090 -50 4222 -6846 3084 238 -6934 4297 -3718 -3575 3256
904C256r205O998o79n806J0202p622J035P858j1120P823J397q846J0884o004k374
$$ 3256 -5949 1049 370 -5436 4766 -2856 -1821 6037 -5083 2740 4137 -4709 6175 171 -2203
919b203R151j0361N325K747r642R704m384m705R469r240K980M128r293R088m111
$$ -2203 6948 -3413 1912 4659 -4983 4721 337 -4368 5101 -4139 -1159 2969 -6324 2764 -1347
934a347m194J0357j0134L134P035j1895R017M66p946J0398n539j169O943q221
$$ -1347 -5541 4816 -5318 -2184 4851 -7044 1973 2439 -5507 4891 -648 -1817 5126 -3095
948c095O090k45o380R861p288o41Q668j1731O604K566j0102J0055m119m888R642
$$ -3095 2995 2750 -3630 6231 -1057 -1698 6970 -4761 1843 4409 -5693 4362 243 -4645 4997
963D997r001K383M918r053P646k333m389Q454p791K947M762r355R099k307o155
$$ 4997 -4004 -1621 3297 -5756 1890 -443 -4832 3622 -4169 -1222 3540 -5815 3284 977 -5178
978e178J1804q803J65R199j1418O149K889q680Q522m197j840O179p822M852M51
$$ -5178 6626 -2177 -2012 7187 -4231 1918 4807 -3873 4649 452 -1388 4791 -3031 1821 2272
993B272p363R664o642k563J0276j1776M779N125j1098R094j099o573R926o603
$$ 2272 -5091 4573 -2069 -4632 5644 -6132 -1353 3772 -7326 1768 669 -5904 4022 -2581
1007b581N58N924p854O481j177m196Q376p649K355N237j0290Q559l92q662J1233
$$ -2581 -2023 3901 -3953 2528 1351 -2845 5531 -2118 237 5474 -4816 3743 3351 -5311 5922
1022E922o720l371R989r594K791M055p994O961k915k383O401p902N253J369p700
$$ 5922 -798 -4169 5820 -3774 -983 3072 -4922 2039 -876 -3259 3142 -4760 493 1862 -5838
1037e838J0136m953l901J1167r891J975P349j0981P374J026p545Q625m570j391
$$ -5838 4298 -655 -4556 6611 -3280 -1305 6044 -4937 2437 3463 -4082 4543 -27 -1418
1051a418N536p227N229j152m839Q677p669Q99O947j1003O994K397j0537J0836
$$ -1418 4118 -3109 2120 968 -3871 4806 -2863 -1964 4983 -6020 974 3371 -7166 3670
1065C670l884m847R604p319J274M555o554N378j769k144O608p805M382L227r048
$$ 3670 -214 -5061 4543 -2776 -1502 3053 -3501 1877 108 -2036 4572 -3233 1149 4376 -4672
1080d672R451k976o412J1236q563k35Q024j0110M853J922p033P130l886j138N021
$$ -4672 4779 1803 -4609 6627 -1936 -2171 5853 -4257 596 2518 -4515 2615 -1271 -2409 2612
1095B612o915N554o51n669R579o935j185R278j0521N424M371j0113Q614j278n825
$$ 2612 -4303 1251 600 -5069 4510 -2425 -3610 5668 -4853 571 4942 -5171 3443 2165 -3660
1110c660Q731n660J83M351o684N660k252l124P280q315K663N089j0402P869k58
$$ -3660 5071 -589 -406 3945 -2739 2921 669 -2455 4825 -3490 -827 4262 -6140 1729 1471
1125A471p926J0356n627k636Q573q320L666K894o596O682l091j274O139p212M735
$$ 1471 -6455 3901 -1726 -4362 4211 -4109 -443 2451 -4145 2537 -554 -1828 4311 -2901 1834
1140A834J552p249R106m434m008R848r277K001O117j0094O709j2o250P441n270
$$ 1834 3386 -3863 5243 809 -3199 6649 -2628 -627 5490 -4604 2105 2093 -4157 3284 -1986
1155a986J25M438p015N648j683m112Q322p269P98P043r567O421J678q094R311
$$ -1986 -1861 2577 -4438 1210 -473 -4585 3737 -3532 -2734 4309 -5258 1163 2841 -5253 4058
1170D058l665l296Q248p229K649L049o562O557l004k167O396p511L328K671q648
$$ 4058 393 -2903 5345 -1884 765 3814 -2748 3809 805 -1362 5034 -2477 851 3522 -5126
1185e126Q353k756n465Q983o924q6O369q387N398O21n524O996m278J59N112p336
$$ -5126 3227 471 -4994 3989 -2935 -3021 3348 -5039 359 980 -4544 2452 -1826 -1667 3445 -3891
1201c891N419L16n592Q652n319j148P600q688L805L299q145P419k517l799O984
$$ -3891 1528 1844 -3748 4904 -415 -1563 6037 -2651 1154 4453 -3692 3727 1210 -2589 4395
1216D395o497J444L625p253O286k309l853P547o752J463M669q128O816p47n830
$$ 4395 -2102 -658 2967 -4286 2000 -309 -4162 3385 -3367 -1904 2765 -5363 1453 706 -5124
1231e124Q975n398r32P047p514M347J293n807P115l931j223O264p672M073J801
$$ -5124 3851 -1547 -2479 4568 -2946 1401 2694 -3113 4002 71 -1152 5112 -2560 1513 3314
1246C314o880P795m103l110P416p426K145L753p777O297j572l934O769n579R89
$$ 3314 -3566 4229 126 -2984 4432 -2994 -849 2904 -4873 1424 -148 -4082 2687 -2892 -1903
1261a903M267o588N479n59m677P861n407K92N484p118M976Q60o113P437m297j236
$$ -1903 2364 -4224 1255 696 -3981 3880 -1527 -1235 4249 -2869 2107 2967 -3146 4291 -6 -1242
1277a242N898p013L237K135o510O800l545k806O627o713K645K723o799O216j963
$$ -1242 4656 -2357 880 3015 -3495 3305 -240 -3046 3581 -3132 -487 2236 -4563 1653 -310
1292c10l550P054o030J330M506p124N670l05m654P393m808k65N359o991M666O55
$$ -310 -3860 3194 -2836 -1506 3000 -4124 1546 1241 -3413 3980 -828 -1093 4266 -2725 1941 2596
1308B596m989O600m465j384N690o691L263J724o370O681k994k943O669o790K421
$$ 2596 -2393 4207 -258 -1642 4048 -2643 620 2344 -4026 2655 -339 -3282 3387 -3403 -982
1323i82K991o497N950j445l472O571n452J325M204o937N982q03m080P065n435
$$ -982 2009 -4488 1462 17 -3455 3116 -2336 -1011 3193 -3744 2238 1435 -2645 4420 -1015
1338a015L89N087p257M825N06n900O902m158j495N574o544L346R58n326O447l172
$$ -1015 -626 4461 -2796 2029 2535 -3365 3537 -621 -2116 3458 -3086 260 1218 -4108 2339 -833
1354h33k163N812o036K772K626o379O411k167k941O637n610J102M205o300M926
$$ -833 -2996 2816 -3220 -448 2178 -4201 2210 43 -2898 3739 -1871 -769 3436 -2864 2062
1369B062l18m186N929m619O41M134o398M545j92m892O960m527j292N450o550L114
$$ 2062 1744 -2442 3487 -1132 -491 3643 -2755 1790 1598 -3294 3666 -861 -2153 3297 -3253 -139
1385a39J981o004O044k551k201N489n295K011K608n371N461k125k302O293n972
$$ -139 1842 -4162 1882 -669 -2870 2619 -2676 -665 1943 -3428 2033 -92 -2394 3899 -2073
1400b073K003L386o218N202o63m292O534m277o35M461n890L916Pm451N543m202
$$ -2073 -70 3316 -2902 2300 1637 -2655 3879 -398 -1033 3428 -2462 1454 1461 -2990 2553 -1649
1416a649l56M392o371M041J059n485O491l341j909O192n654K178L156n488N006
$$ -1649 -2005 2387 -3984 57 1116 -4369 2122 -1219 -3128 3064 -2590 -412 2744 -2744 2262
1431B262j170k587N106m337J180K378n286N220j778l335N987n185K82M471p126
$$ 2262 1092 -1495 3611 -726 454 2832 -2454 2766 988 -2347 3640 -1545 -1263 3208 -3918
1446c918M416J000n292N823l103j373M502m860L121P98m241N712l314r63N398
$$ -3918 498 1498 -3794 2029 -1074 -2447 2055 -2805 316 1114 -3127 2585 -729 -1692 3706
1461C706o583L426K266n933N943j970l156O028m842O79L441n352L921q76k814
$$ 3706 -2877 549 2815 -3118 2825 855 -2301 3727 -1115 -436 3005 -2347 1574 698 -2116
1476b116M832m454J287K559n515M788r06m107O398m452r64N770o416K804K307
$$ -2116 2716 -1738 -451 2108 -3407 1381 475 -3632 2766 -1686 -2650 3120 -3296 -492 1815
1491A815n065N151j926j670M027l983K483J211m086N224k743j678N501n899J874
$$ 1815 -3250 1901 -25 -1695 2332 -1651 832 2043 -2043 3181 438 -1240 4261 -1638 236
1506B36L180o541N074p98m067N737m115n04L851m788K727o4k718M351l836J194
$$ 236 3416 -3125 1949 1151 -2916 2821 -1294 -1798 2053 -2735 -8 -72 -2790 1561 -2275 -1081
1522a081L403n697M587M55m866O546l120j953N655n255J495K691m397L512j357
$$ -1081 2322 -3375 1212 1667 -3199 3347 227 -1726 3929 -1326 169 2860 -1537 1975 618
1537F18j971L726m181J934J488m931N249k329k642O180n543N68M338n908L854
$$ 618 -1353 2373 -1808 126 1614 -3317 1932 -397 -3039 3141 -2402 -1834 2504 -3404 450
1552D50R31m408N012k535q02L601l956K681J94l001M519l393k09M092n723L243
$$ 450 1381 -3027 1985 -550 -1352 2249 -1707 974 1168 -1833 2686 -707 -916 3176 -2547 696
1568F96J864n860N920j872l457N452m120M37L025m714L378q74j850L961m083J609
$$ 696 2560 -3300 2620 748 -2709 2743 -1377 -940 2085 -2629 749 -125 -1975 1986 -2097 -488
1584d88J997n266M964p99l732O464m220q52N283n368K527J800m203M133j884j093
$$ -488 1509 -3757 1207 408 -3324 3140 -1080 -1932 3351 -2017 510 2310 -1893 2240 356 -737
1600g37L065l930K642K56l438M531l103j177M634n582K175K565n738M664m37l368
$$ -737 2328 -1602 1040 1296 -2142 2389 -714 -1891 2743 -2839 -664 1901 -3837 827 390 -2978
1616b978M453k799M47K613l757L223o66j973M227l947J225L089n334L952K55m695
$$ -2978 1475 -1324 -877 1736 -2021 1202 536 -1437 2790 -1157 68 3157 -2177 1775 2030 -2665
1632b665N393k864j743M844m724J394J652l853L483j181j696L473l874K214J362
$$ -2665 2728 -136 -1879 2965 -1759 -365 1287 -2566 917 -264 -1960 1513 -2361 -147 1215
1647A215m195M832j897k242N155m508J044L314n026L263M45l616M579k495n78
$$ 1215 -2980 1852 -45 -2287 2868 -1640 -596 2718 -2308 955 1400 -2216 2363 -132 -710
1662g10K906l687L049n45k855M553l596m09M168n572L231J080m968M677j886j900
$$ -710 2196 -1491 1558 1013 -1842 2711 -885 -1294 2874 -2698 533 1613 -3355 1322 -564 -2464
1678b464M326l772J293J851l837L501q30j860L716l443J509K191m108L969r97
$$ -2464 1862 -1910 -617 1234 -2603 898 68 -1792 1924 -1519 -10 2181 -1927 2042 1045
1693A045k649N050l436m15L709m799K252N92l176L596k379n92K871m318K493L97
$$ 1045 -1604 3446 10 -405 3304 -1495 757 1349 -1827 1769 -610 -1202 1669 -2649 -156 241
1709B41l327M398k072j525M445m644J914K395m476M484j307k376M306l106R57
$$ 241 -3086 1312 -760 -2285 2160 -2484 -570 1825 -2651 1833 526 -1850 2456 -650 307
1724C07K209l858K980n76k293M009l499O21K464m656L118J25l599M435k652r20
$$ 307 2516 -1342 1638 1062 -1231 2778 -721 -100 2364 -2292 826 951 -2648 1787 -865 -1785
1740a785L706m555K146J154l234L594j643j206L891l825J826J435l814M155j600
$$ -1785 1921 -2634 -488 666 -2568 1026 -617 -1823 2068 -1757 69 1504 -2310 1845 245
1755B45j548M116l450P21K272m385L723n87k644M049l065J61K498m035K781o4
$$ 245 -1303 2813 -637 84 2356 -2029 1694 1107 -1537 2512 -553 -392 2106 -1929 852 788
1771G88l046L869k909n3L197m346K528N82l686M472k234q34L512l439J735J787
$$ 788 -2258 1611 -1298 -1351 1846 -2500 28 610 -3076 1396 -838 -1672 1840 -1599 136 1923
1787A923l726L748j238j692L711l379R75J845l745L308q21k704M083l012j15K724
$$ 1923 -1803 1945 707 -985 2726 -653 322 2167 -1578 1730 909 -1795 2288 -724 -839 1885
1803A885m454K891J35l237M336k640o98L479l870K159P14k987L811k020m80L253
$$ 1885 -2569 322 457 -2780 1556 -1084 -1782 1697 -2173 -14 700 -2287 1524 -496 -976 2277
1819B277l667J833J377l802L955j466j778M054l543Q92J717l666K909n08k521
$$ 2277 -1390 443 1820 -1982 1973 507 -1271 2783 -760 132 1849 -1817 1092 584 -1937
1834a937L836l175M69K298l885K999l96k791M241l144K39L235m412K743J039l719
$$ -1937 1899 -1276 -807 1491 -2394 605 209 -2582 1659 -1485 -1246 1989 -2423 320 1359 -2360
1850b360L953j534j211L519l420J568Q81k903L250j516j318L277l452J308J959
$$ -2360 1593 59 -1152 2367 -1053 515 1396 -1507 1743 227 -1091 2186 -1266 42 2001
1865B001m444L570o77k800M186k943j47K724l740K290O33k613L411k393J22K543
$$ 2001 -2443 1127 450 -2350 1836 -1107 -1254 1470 -2270 20 653 -1960 1451 -942 -820 1723
1881A723l505K593N80l335M164k288r70L670l905J544J471l329L292j335j768
$$ 1723 -1782 811 1391 -1944 2220 -68 -1038 2632 -1273 271 1742 -1587 1705 370 -1398
1896a398L268l037P95J742l479L312j604j792L725l394J030K459m045K861K81
$$ -1398 1870 -1167 -372 1370 -2109 1203 -401 -2193 1532 -1862 -832 1627 -2418 443 724
1911G24k842M125k528l66K856l359K148M73k634L205j736o10K749l672J987R72
$$ 724 -2118 2007 -521 -887 1969 -1390 758 1231 -1403 1802 66 -544 2205 -1467 520 1492
1927A492l420L605j688j737L560l369O18K215l533K904n42j998L389k597N50K038
$$ 1492 -1928 1677 -11 -1748 1812 -1557 -939 1276 -2257 647 105 -1893 1496 -1101 -551 1487
1943A487l438L304r35k104M021k965k1L000l819K329P27l360L775j664j383L033
$$ 1487 -1951 1353 418 -1686 2335 -630 -651 2349 -1470 859 1586 -1774 2001 337 -1046 1987
1959A987k990J277O48k640K971k031q22L034l449J651J637l769L496r16k148M154
$$ 1987 -1003 274 922 -1718 1253 -778 -1600 1434 -2015 -364 1273 -2496 1000 84 -2064 2090
1975B090k993K60K472l396K340R0k081L248k456N04J919l426K845m21l009M419
$$ 2090 -903 -643 1829 -1567 773 863 -1218 2030 -426 78 1997 -1429 1416 995 -2014 2405
1991B405k652p94L142l639J412J386l654L241j096j555L016k972J434J157k836
$$ 2405 -247 -1041 2101 -1538 -126 1260 -2394 847 -249 -1804 1212 -1760 -326 831 -2005
2006b005L131j585j194L798l676J119K667m066K971j15k473L620k325n7K119l098
$$ -2005 1126 -459 -1653 2145 -1531 -412 2255 -1811 1160 1045 -1428 2192 -133 -190 1929 -1169
2022a169K000qk077K959k605K78K044l531K150O47l322L638j493j809L728k966
$$ -1169 831 823 -1254 1705 -900 -622 1422 -2109 41 688 -2634 1004 -489 -2298 1430 -1536
2038a536Q39J888l059K731p25j152K685k521J351J207k953K898o55k137L571k905
$$ -1536 -697 1191 -1868 863 138 -1014 1671 -850 501 1708 -1245 1653 998 -1139 2432 -473
2054d73q6K803l776K051M76l176L328j669o97K486k696J289N80k520L383k343
$$ -473 -559 2244 -1532 519 995 -2181 1147 -522 -1219 1267 -1429 -140 440 -2080 1303 -1040
2070a040m53L067l222J478J530l275K899n04k154L827k652N4K024k601K304o17
$$ -1040 -1493 1574 -1648 -170 1360 -1915 984 480 -1674 2153 -499 -445 1579 -1022 1282 665
2086F65j735K972k799Q75J728l442K304K39k725L504k141p23K811l132J450Q05
$$ 665 -1070 1902 -897 -22 1706 -1736 568 807 -1918 1586 -555 -1278 1533 -1599 -149 656
2102F56k566K659j190p12K551k722J412J026k892L528j429j285L208l174J013
$$ 656 -1910 749 -441 -1153 1398 -1324 88 1114 -1778 1750 321 -964 2244 -930 83
2117H3J931l404K634k91k561L055j885j78J980k958K203l72k054L113k172j56
$$ 83 2014 -1390 1244 953 -1608 1447 -438 -616 1364 -1594 609 237 -1817 1296 -876 -1032
2133a032K358l085K169O75l212L488j461j046K974k857J260J591k875K137q46
$$ -1032 1326 -1759 410 1085 -2127 1361 -100 -1146 1828 -1029 231 1822 -1053 1084 238
2148B38j263K677k457J087J487l392L043j114k052L355k749N09J939l285K217
$$ 238 -1025 1652 -805 282 1769 -1623 1420 306 -1746 1609 -1140 -631 1308 -1977 240
2163B40M84k599K869j683m64K567k725J847J22k173L006j627q76K954l294J657
$$ 240 724 -1875 994 -689 -1153 1414 -1311 536 658 -1515 1491 -136 -1012 1942 -1352 305
2179C05J198l227L102r00j882L011k323M09J774l011K304o85j575K690k615J047
$$ 305 1503 -1724 1378 478 -1404 1607 -716 -307 1467 -1544 760 75 -1500 1190 -1425 -378
2195c78J507l139K571k93k084L389k162m73K818l601K130O15k314K957j523o10
$$ -378 1129 -2010 561 268 -1816 1573 -589 -1062 1756 -1845 285 900 -1414 1543 20 -590
2211e90K458k895J444P55k554K801j476r58K602k777R54J679l442K782n69k028
$$ -590 1868 -1027 417 1172 -1382 1419 -57 -1015 1587 -1190 -236 1443 -1999 783 214 -1814
2227a814L154k335J74J970l241K776k91j659K706j981N4K246k941K059K67k451
$$ -1814 1340 -995 -821 1149 -2092 684 393 -1266 1440 -541 -487 1759 -1182 877 1144 -1307
2243a307L130j796o88K304k634J228Q95k490K484j324q49K458k653R93J150k858
$$ -1307 1823 27 -661 1643 -991 237 1132 -1358 1126 -198 -1047 1411 -1242 -249 901 -1957
2259a957K617q16j298K885k460M20J777k709K312n43j432K740k186L74K028k867
$$ -1957 660 -156 -1454 1431 -1029 -609 1168 -1541 771 228 -1204 1536 -650 -276 1752 -1115
2275a115J634O59k380K808j540m63K228k964J124Q99k297K533j135j027K020k180
$$ -1115 519 1178 -1202 1606 66 -397 1831 -1133 -9 890 -1407 1126 -9 -1036 984 -1196
2291a196Q22J275k761K440p74j383K960k471O42J786k522K170l54j778L008k145
$$ -1196 -374 901 -1860 580 -194 -1577 1383 -1088 -446 1340 -1182 988 634 -1144 1864 -281
2307b81j1K135k966J853O05k543K603j389n79K035k644J174P83k303K498j214
$$ -281 -292 1843 -1123 730 1335 -1208 1395 6 -573 1462 -1182 -8 775 -1528 970 -244
2323b44q49J996k472J151J137k415K553r28j086K385j786J96J575k488K011m3
$$ -244 -1093 903 -1569 -418 719 -1696 857 -71 -1157 1228 -558 -362 1213 -1275 736 693
2339F93j757K859k009lJ759k480J720J76k250K813k065k36K221k829J348O17k412
$$ 693 -1064 1795 -214 -217 1542 -938 782 958 -1292 1521 -544 -780 1441 -1388 -40 577 -1835
2356a835K853j506q82K458k293Q87J059k308K586j127p40K169j988Q52J534l001
$$ -1835 1018 -488 -1370 1088 -1205 -318 741 -1567 1019 -108 -848 1321 -667 185 1719 -1282
2372a282K423l41j804K730k060O6J961k451J247M59k170K391j631j62J549k399
$$ -1282 1141 800 -1004 1726 -334 -268 1693 -758 489 948 -1222 1169 -462 -624 925 -1474
2388a474J634M90k345K480j200r18K800k755J387R47k350K070o94n88J702j599
$$ -1474 160 650 -1695 785 -415 -1333 1467 -1288 99 1046 -1304 766 72 -516 1186 -413
2404d13M91J208k480K134l43j754K693j987J91J483k650J831J96j976K492j551
$$ -413 78 1286 -1194 940 597 -1157 1536 -451 -260 1223 -1427 404 600 -1376 1116 -435
2420d35m85J861k204J357N61j912K107j325l80J949j974P18J205k515K719r38
$$ -435 -920 941 -1263 94 655 -1257 850 -475 -855 1094 -880 -162 1043 -1472 1247 309
2436C09j350K776k127J85J636k486J903n77j308K260j803L67J477k572J872j92
$$ 309 -1041 1735 -392 -207 1429 -1057 846 269 -1039 1221 -582 -215 1262 -1310 562 370
2452C70j677K362j926k70K081k409J504O93k006K152j133k47J569j620R48N48
$$ 370 -1307 1055 -871 -1141 940 -1469 35 728 -1278 874 -259 -506 1063 -557 391 939
2468I39j892J926p55p16K024k025O91J022k333J889n46j449K252j743J6J628k246
$$ 939 -953 973 218 -498 1526 -499 192 1214 -1119 770 224 -1225 1027 -716 -700 928 -1318
2485a318J701q9j368J865j654L63J560k472J609K88j744K274j156m33J911k225
$$ -1318 383 294 -1074 791 -863 -500 1060 -1412 197 485 -1259 1015 -141 -574 1337 -888
2501h88J112Q44j876J691o95q24J768j922R30P17k031J703n89p83J997k009K78
$$ -888 224 1068 -808 883 188 -636 1132 -790 140 857 -1174 529 -60 -843 1154 -855 -577
2518e77J609k411J753M2j725K294j213m54J743j939J067K50j398J837r85j70J342
$$ -577 1032 -1379 374 416 -1309 985 -228 -682 1061 -878 189 439 -959 878 -107 -277 1065
2535A065j856J172M21j749K018q71j252K113j753K77J279k069J673m06j208J986
$$ 1065 -791 381 802 -947 1071 200 -1052 1061 -692 -415 864 -1205 468 62 -1146 840
2551H40j876Q02Q58j871K014p06j212K487j920J91J772k150J250N94k116K046
$$ 840 -1036 -234 624 -1247 767 61 -1151 1336 -584 -393 1379 -771 479 1073 -1043 1003
2567A003j079l20J539j882Q91O97j812J864j166o18J908k043O34R76j932J711
$$ 1003 -76 -396 1143 -739 152 849 -963 901 -265 -883 1025 -1018 -384 592 -1340 371
2583C71m49j050J939j399M3J463k146J801rj315J750j362J92J384k007J571J31
$$ 371 -78 -1128 811 -588 -545 918 -1228 573 564 -751 999 -363 -171 1213 -794 777 908
2600I08j742J956r47p52K028k259R06P73j796J317n76p82J708j557O78O68j573
$$ 908 -834 1122 175 -577 1451 -808 98 871 -925 392 -184 -966 742 -815 -137 531 -1042
2617a042J398n20r21J959j550K71J265k128J863j66j409J797p44j88J191j711
$$ -1042 356 -164 -1085 874 -676 -405 860 -1268 595 429 -980 817 73 -115 1076 -635
2633f35J506o3j185J644j526p8J409k024J229M80j963J887r18p84J928j989O24
$$ -635 871 808 -377 1267 -259 -337 1072 -952 277 757 -1206 681 -237 -1021 907 -1082 -458
2650d58R04j683J745m00j053J830j554O09Q25j727J605j85j187K194j645j27J702
$$ -458 446 -1237 508 108 -945 885 -669 -60 765 -962 643 458 -729 1465 -180 -307 1395
2667A395k040R22L78j469J504p38m59J234j694Q77M11j216J307o86k00J474j848
$$ 1395 -645 277 655 -814 690 -48 -507 727 -967 -90 321 -895 412 -274 -474 1000 -848
2684h48P31P87j674J484l01r74J761j565N84Q54j485J418l26j029J411j147K4
$$ -848 -117 670 -1004 480 179 -795 966 -599 -15 839 -646 772 446 -583 828 -319 -295
2701b95J172j629J272j13j302J636j245j56J409j662R96L61j380J406n59m49J071
$$ -295 877 -752 520 407 -895 741 -504 -660 749 -913 83 444 -936 470 -89 -538 533
2718E33j409R53N38j842J700l57o21J474j584Q58M96j390J186k6j274J728j198
$$ 533 -876 77 615 -1227 473 116 -505 969 -615 243 739 -651 535 509 -765 963 -235
2735b35K21J101j971J096J40j189J327r14j50J357j731J056L39j373J271m49o05
$$ -235 -14 1087 -884 212 352 -837 490 -424 -574 783 -948 108 447 -926 345 -104 -709
2752g09J589j552P05N73j557J589l36q52J702j713P51Q55j976J414q1r66J452
$$ -709 880 -672 33 606 -951 638 302 -550 1152 -561 190 1045 -931 483 402 -564 888
2769H88j255J4J097j753J167J9j284J749j011k83J225j283P82K98j345J418p10
$$ 888 -367 -353 744 -1009 158 177 -1107 642 -369 -652 573 -710 72 370 -975 443 -267
2786b67m72J898j611N44N77j513J589n76p60J593j260K83R15j591J067k41j070
$$ -267 -739 1159 -452 92 669 -844 745 169 -591 1002 -258 25 940 -651 416 175 -895
2803h95J657j049oQ80j543J141L9j169J575q88r2R75j346Q48M07j600J824r48
$$ -895 762 -287 -293 587 -956 185 224 -945 630 -258 -350 625 -721 127 534 -1066 758 -190
2821a90k90J582j748R96M52j435J174l83q36J548j153O0R00j662J363r8r69J327
$$ -190 -480 1102 -646 350 802 -633 541 158 -678 870 -283 -223 677 -985 378 280 -689 638
2839F38j093K9Q15j427J164K34j148J389q58l3J134j467R13L02j229J433q96k65
$$ 638 -455 -426 389 -1038 126 360 -788 601 -257 -290 844 -623 290 592 -637 796 -100 -365
2857c65J292j436P68N08j480J497p98p48J590j204O6R60j522J346m43p37J172
$$ -365 927 -509 259 767 -713 784 -14 -762 828 -376 -310 650 -872 474 31 -706 466
2874D66j019L57Q89j862J564k23j078J517j014L5J019j404R98M39r67J111q00
$$ 466 -553 -196 693 -1169 395 172 -906 611 -403 -368 651 -753 245 684 -283 828 28
2891B8n02J202j198M62M07j213J493p08o36J405j421Q72M43j515J073l16m19J052
$$ 28 -474 728 -470 -8 399 -814 679 -29 -665 740 -681 191 634 -881 192 -124 -543 509
2909E09j075J99P62j066R00l26n97J393p62j36J006j251O14N60j447J682j315
$$ 509 -566 -367 395 -671 229 -97 -694 699 -63 -199 807 -444 170 730 -717 965 -350
2926c50RJ141j264P46L15j613J550p05k32J148j304O04L20j398J504n33m91J041
$$ -350 -341 800 -464 282 597 -1016 534 -171 -403 745 -559 45 365 -1033 471 -62 -553 488
2944D88j082K65Q88j321J102k09m84J107q19j49R87j224Q12k89o88J542j270j
$$ 488 -594 -329 559 -762 340 131 -353 754 -65 -214 773 -451 361 72 -616 926 -344 -345
2962c45J151j280L62P01j472J364m71o84J363j212J69P79j154R19l42m55J290
$$ -345 806 -474 -112 589 -883 481 10 -674 689 -523 -354 425 -729 190 -152 -607 683
2979F83j052K96P39j467J355j02q34J322j076o9R35j142O57n4o73R29p24k23Q48
$$ 683 -369 -73 666 -801 554 452 -382 940 -136 -205 730 -412 245 191 -482 447 -277 -500 348
2998C48j081R43J41j292J365o43l07J318j288M66N04j269J234l21n62R45q00K34
$$ 348 -733 210 351 -941 424 -219 -526 792 -496 -30 474 -795 439 118 -444 501 -299 -65
3016f5P81j261J046l06p97J589j148K25N52j097O57k1o89J182n21p51J318j107
$$ -65 716 -545 501 195 -602 987 -161 64 616 -481 176 155 -534 648 127 -624 694 -413
3034d13L73L27j227J400p41k61Q97q27N75J62j062J196l62l61J117j122L62N34
$$ -413 -40 287 -940 460 -281 -542 355 -472 103 265 -797 399 37 -324 793 -329 33 567
3052E67j135R35j36m18R15j137M8R88j167Q35k18p06R71o57J6Q97j157O98Oq83
$$ 567 -568 367 231 -187 728 -409 -361 627 -540 295 77 -629 342 -315 -299 598 -559 139 145 -738
3072g38J235q57j13J183j252M83O54j290J039k53n00J123j189P95M15j694J486
$$ -738 497 -360 -473 710 -542 -59 595 -695 344 91 -409 714 -475 320 735 -959 527
3089E27l40p05J067q63K35O01j436J177k99n07Q52o17j36R36j232R14P1r47J091
$$ 527 187 -518 549 -314 -79 522 -914 263 -36 -543 309 -308 -444 492 -740 174 245 -702 389
3108C89o73M2Q17j093L87M51r07J063l12m79J129r34j83O84j048J029m25m49J055
$$ 389 -284 -242 575 -518 -131 320 -587 476 164 -315 814 -120 -303 381 -667 362 -63 -512 543
3127E43j093L01R36j337P85j10p70J168o97k37R31r59N10K96r55J195l97m06J060
$$ 543 -550 -249 687 -650 135 25 -745 423 -274 -511 420 -539 -29 267 -688 507 110 -296 764
3146G64j182O53K68j065J362n83r22J551j162M61N24j146P91j10o55Q53p98L00
$$ 764 -418 235 503 -562 800 217 -705 846 -316 145 669 -477 314 204 -451 402 -396 -96
3164i6P18j447R81P0o60P17p24j38J002j073O13M06j220J187m81j22P98j041O41
$$ -96 622 -825 156 226 -434 283 -441 -579 423 -650 -37 369 -851 336 -145 -267 531 -510 131
3183A31K35p57J148p03k40Q34j065M36J82o98P63m55n40J097q38K30O50j035J001
$$ 131 366 -391 757 54 -186 648 -417 19 201 -497 266 -189 -729 368 -470 -240 410 -625 376
3202C76j70q06J227j036K07P28j162Q57J88q72J008p14j76J079j074L97M93j055
$$ 376 206 -600 627 -409 -202 526 -636 221 409 -463 545 -169 -345 734 -340 57 550 -505
3220e05R09l03m32Q74p32J19L53q32Q49l41n27J087j084M01N85j227J058l25m26
$$ -505 404 101 -331 543 -189 -70 283 -549 300 -41 -568 519 -565 -164 421 -806 252 -73 -499
3239d99J185p04j91J011j099M64j1p44J188n90r5P17q14K81R7q54J156o37l45
$$ -499 686 -18 -209 802 -297 167 156 -588 600 10 -85 632 -182 99 196 -658 498 -139 -484
3258d84R51j036M72L84r45R78j70n99P91o34O8P42j099R06l90n37R43o11k8Q19
$$ -484 467 -569 -97 287 -658 320 150 -449 342 -292 -224 518 -581 325 -65 -602 341 -270 -298 521
3278E21r82O39K05j044J221m81j32M01n50K48K68r79J012m97j63O54o28K38K87
$$ 521 -461 178 383 -661 560 79 -53 348 -202 46 314 -665 347 -150 -313 341 -287 -49 238
3297B38q11P84k45l95R50q34K36N77q71O90j27m85R24r50L16O28j096P49j26m75
$$ 238 -573 211 -34 -429 521 -313 -77 500 -371 319 192 -293 631 -319 -3 625 -471 278 152 -323
3317c23P37n86o4P70q43M30K47j005R10m69k28Q06r34O95J12q27R15n67J9O53
$$ -323 414 -172 -236 534 -309 121 368 -637 273 -196 -424 382 -552 143 255 -572 343 -224 -205 448
3337D48p47L29L57r58J106l00n89O94n31k3P81j186P70R2p53Q08l96k54O03p62
$$ 448 -299 30 387 -571 535 235 -354 340 -191 -214 567 -619 151 243 -510 298 -98 -352 251 -511
3357e11O65r2m71Q48q44j18P62o85M53M93r74Q90k24p64J023o78K87J85q28R49
$$ -511 154 62 -409 439 -405 -523 239 -446 7 500 -474 416 192 -572 451 -227 60 245 -583 366
3377C66j91o88J246j093L57M69q52N19k07l55R24q02l04P36p34M97M38q77R43
$$ 366 175 -513 733 -360 -3 466 -386 133 -74 -429 495 -307 -611 125 -609 -112 326 -551 392
3396C92m13m75J107j294P11N16p95N56l02m21R66p91K96K03o08P80l01j85M87
$$ 392 -21 -496 611 -683 28 544 -251 305 3 -418 548 -243 53 256 -352 428 127 -58 429
3415D29o17L69J21q39N78J9l73L87m48O1R21j063L26J69m29P46n48J7O99q26M15
$$ 429 -188 181 302 -537 41 60 -313 74 -374 -313 608 -455 -129 40 -389 357 -191 -174 525 -301 114
3436A14K09j008J070k88l66O32n96M34L89r67P67l85k49Q52p78L0L20q56R24j79
$$ 114 323 -685 385 97 -269 363 -233 201 590 -377 390 5 -244 608 -170 -140 180 -676 248 69
3456F9m99Q08n06j19N59p90M82k9q20J223o23O6P32r38N75J73q88P73k92k3M94
$$ 69 -430 378 -128 -247 312 -478 4 -25 -845 378 -245 -179 553 -385 190 363 -525 248 -44 -67 427
3477D27p01J98O10p25M41k02l47R00j011K08P29j052P07j59n78R14p23J55N04
$$ 427 -274 -76 534 -191 250 48 -299 601 -410 -202 527 -525 182 23 -555 359 -364 -209 295
3496B95n83J68M78o99P32l37N1J48m71L64L3m42O18j66o03P21o23N05j6n65O05
$$ 295 -288 -120 358 -341 391 54 105 253 -218 146 179 -263 355 189 -414 307 -316 189 173 -392 213
3517B13j75m75Q52l54l49N08o64O94k42m49R57o92r4Q63j088O35R5k87L28k65
$$ 213 38 -437 415 61 -288 220 -444 250 8 -441 516 -176 -270 593 -495 140 235 -52 276 11
3537A1k35M55p29O65J55m49M98m06k54P91q06K97J99n85M56k08j78N02n08K58
$$ 11 -224 231 -498 167 322 -127 371 -35 -289 502 -304 -7 192 -393 63 -145 -323 179 -329 -71
3557g1K58o36N66ol06L54k68j0M76n61N17k62k97O42n56K1O21o24K59o5l93Q69
$$ -71 187 -449 117 111 -195 159 -109 -119 357 -204 313 51 -246 396 -160 -139 482 -142 117 52 -341 528
3579E28o79j35O04n74L06P8m79O70m92l29Q02n69K45L83p79P19l11k37N93m30
$$ 528 -151 -286 318 -256 50 128 -351 319 -173 -502 300 -269 -24 359 -420 299 -12 -249 344 -86
3599h6J12L96n60K38m0l33P24n46J86K59o61L78J28m22M74l14n0M97n46o1K94
$$ -86 26 422 -138 100 60 -273 451 -95 91 350 -311 67 195 -227 247 -67 -117 380 -166 -227 67
3620F7l93L08r7l35Q04o93L94K38n71N03j87p9M71q30K37P42j021N70K34p40Q79
$$ 67 -326 -18 -115 -450 354 -339 55 293 -278 225 38 -41 430 -400 -163 579 -442 128 362 -378 501
3641E01n67R3J66n24L44n1l03M53j46L4N11p31K20J93l40L76k17m58O47m36L47
$$ 501 -66 27 193 -331 13 -38 -341 112 -34 0 511 -220 0 193 -147 229 12 -446 201 -235 112
3662A12J5l29K17j48j71M74n60N07J55n60P96l96m88P16n16K8N37q39M47R8m84
$$ 112 127 -202 15 -133 -304 170 -390 117 272 -288 508 112 -376 340 -176 -148 389 -450 -3 95 -389
3683c89M54j88k48O32p89Q86j97m35M53k49l94O47m26J41L87m33L42j57o6L06
$$ -389 65 -123 -371 261 -528 358 161 -274 179 -70 -464 183 -243 -102 285 -148 194 37 -29 277
3703B77l57K23K30p01M44j28j54J89k23M8O64o70L12Ro19P28m21n32Q67m55K62
$$ 277 -80 143 373 -328 116 -12 -166 23 -200 -152 512 -158 154 163 -456 272 -149 -681 186 -269 -7
3724gQ7m21P08l46q7K87m66M9M05k92M63l29p5M20l50k55M62l69J80r2j28M06
$$ -7 80 -341 367 21 -66 221 -245 -196 209 -83 380 51 -24 396 46 -209 253 -116 64 -28 -156 250
3746B50o21L01O4j25K45J7k53M64n25j65M75l45L12J43k85M18l50j19J99l32K90
$$ 250 -371 -70 -6 -131 114 131 -122 342 -183 -348 127 -218 94 237 -48 370 20 -99 100 -232 58
3767E8K02l67L74j57l81P53p09J21N17o57K22o1l34O24q0l44M54l16K98l37m9
$$ 58 260 -107 267 110 -271 482 -227 -106 411 -246 -24 -85 -419 205 125 -219 235 -81 217 -120 -169
3788a69L31r1o64Q34l55j2L43m78M37l30J87M53l99r5p1k83O90l20j18L38l72
$$ -169 162 71 -593 241 -114 -126 217 -261 176 -154 33 486 87 -8 -79 -362 328 8 -110 228 -144
3809a44J80J39n83L98k39N9K57r2m7m5k93O58o2k78L91o46M5O09m07K75j28m12
$$ -144 36 175 -408 -10 -249 -190 67 -25 -72 -117 -410 248 186 -92 299 -347 -302 307 -100 175 47 -365
3831c65M10mL2P6m65K38J32j96j90K06l6M39m18q8K81m74O18l59j45N45l71J4
$$ -365 45 41 73 149 -316 -78 54 -142 -332 -126 -162 277 -141 -229 52 -422 196 -163 -308 237 -134 -120
3853a20J39j33K10Q7l03O5l0N4J39l95N69k80j96M03l51m5L64l64P8L44m43L51
$$ -120 19 -114 96 183 -120 -55 -85 -31 108 -287 282 2 -194 209 -142 -187 177 -187 -109 235 -208 143
3875A43j63K4L24l42j82L04l34M02k35l17O80l42j34J16k49N52p4j78J22k55j48
$$ 143 -20 4 328 -14 -196 108 -226 176 -59 -376 304 -38 -172 -56 -305 247 173 -5 117 -138 -286
3896b86O00n45K78r6j69L56l19o7N33m09N4J15l98L95r4k56M87l20Q5Q6l39L09
$$ -286 314 -231 47 -49 -218 138 -181 -248 285 -124 -70 45 -353 42 -52 -308 179 -141 -56 30 -309 0
3918@r1O7K29n35K80N52o30K48Nl73N94m03j19L51m95K25K52j51J56j97J02K33
$$ 0 -91 -24 205 -330 -50 502 -128 120 125 -248 346 -57 -176 175 -320 -95 157 6 162 -35 67 300
3940C00o66J14n1j03O66m14o0L09l22K78M4k78O15o77J4P02o71K45R2k48K63M
$$ 300 -366 -252 -303 -406 260 -154 -214 95 -227 51 95 -183 432 -245 -231 471 -200 45 137 -111 152 156
3962A56k49J33j68J31K33m21J51j38J9J74k22K44K37n01K45p6k70N62l37j23K65
$$ 156 -93 40 -128 3 236 -185 -34 -172 -153 21 -201 43 280 -221 24 -52 -322 240 -97 -220 45
3983D5o3K6J22l30M37j47k79N02l17J37Q7m89L44k11LL38n03M21n4k89L42k85
$$ 45 -18 8 130 -200 237 90 -189 313 -4 133 220 -269 75 -136 -133 205 -298 123 69 -220 122 -163
4005a63K72q8j16lM19m08K77j58k70M25l53J81K23l67K13Q4k98K32l51R7K96j73
$$ -163 109 21 -95 -98 321 -87 190 32 -238 187 -166 15 238 -129 84 168 -130 102 -249 -152 144 -29
4027b9m1L43l97L56k59j72N10m19N6M08m62J70N5k56J48l16j89P86l47K8K13l81
$$ -29 -70 273 -124 232 -27 -199 311 -108 -52 356 -106 64 119 -137 11 -305 -494 292 -55 -27 186 -195
4049a95M01m96L07J51j80L07j64j1j29k58L12j41j50K28J42k70M36k25l67M17
$$ -195 206 -290 17 168 -12 295 131 120 -9 -267 45 -96 -246 -18 124 -146 290 65 -302 115
4069A15m18J83J82k49K34k67J2J59r1K30r8k22K62Nk39K06o1q5M41l50n7K5k6
$$ 115 -303 -120 62 -187 47 -220 -208 -49 -140 90 -8 -230 32 37 -202 4 -57 -142 299 -51 -108 -83 -109
4092a09M01m81n4O38n68K58q7q0L72l26J5O9l26L1N12m52K66k1l16L76l43P1M57
$$ -109 292 -189 -243 395 -173 85 -2 -82 290 -36 -21 48 -278 -247 265 -187 79 58 -258 118 -225 -154 303
4115C03o57N89k15k07N81m27K8K58k16j81k7R8J98k65M1J18k28L09K9m24N89k02
$$ 303 -354 235 20 -187 394 -33 -5 253 37 -144 -171 -73 125 -140 -99 19 -209 100 129 -295 294 92
4137I2n1j68rmR9k30M1Q4O4R4j46M6K22o38M02J43j72M92l62R1n3k99M42j1j89
$$ 92 41 -127 -136 -140 -41 -271 -230 -146 -82 12 -134 -88 134 -504 -102 41 -131 361 -1 90 37 -262 180 169 -20
4162b0Q8j69q5J97j91Q2R4l40K47J11j99L60m83J96L54l21J64n8J29K3l19J34
$$ -20 68 -101 -186 11 -180 -98 -4 -344 -97 14 -185 175 -308 -112 242 -79 85 27 156 179 -140 -6
4184fJ15J90k43j9k8M67m86J23o2l64N79l38m1K30j28l8Jn5J4J80j80R1J89m39
$$ -6 109 299 56 37 9 476 -10 113 51 -313 266 -72 -113 117 -11 -49 -48 -103 -89 91 -89 2 191 -248
4208b48L25r0oJ49l12M38l02MN9m4J71p9m8k17K13k74L54j22K00J93l77RN4l34
$$ -248 77 -13 -19 130 -182 256 -46 -42 17 -27 144 65 17 -200 13 -261 93 -29 171 364 -13 -4 50 -284
4232b84M12k93J35Q6k30K45p8k54L93j48j25Q3O9L2k26J49K67m43J95J03m71L00
$$ -284 128 -165 -30 56 -174 71 -7 -261 132 -16 -141 -58 11 43 -183 -34 233 -210 -15 88 -383 -83
4254h3L1J78n6r1k86N26l19j52N57l23k0j39J19J54j65O8q1N9l5p1k8K52j46j29
$$ -83 -52 126 70 -21 -307 219 -100 -252 305 -18 -38 -177 -58 96 -69 -1 -82 -23 -58 -129 -157 95 -51 -180
4278a80M62m57N30k99k00K49rk09L79k10L5q4j37J49J65n2k48J62q9J67k95K20
$$ -180 282 -175 355 56 -144 105 96 -113 266 56 91 7 -130 19 184 132 -116 46 -43 124 -171 49
4300D9K37l71J93n12L11K68j78K26k01k15K19j65K25L5m35M23k06LK90n13M06
$$ 49 286 -85 108 -404 -93 175 -3 223 22 -193 26 -139 86 121 -314 109 -97 -94 196 -317 89
4321H9J5q3J38j06k60M82l91mK22p7qK0j68J27M1O1k48rL55j11j59O2j45k74N95
$$ 89 104 21 159 53 -207 275 -116 -120 102 25 17 37 -131 -4 37 98 -150 -159 196 85 -74 -12 -157 -431 164
4346A64l24M3K06k09K69J92l87K82m85N5N29o22L55L3n7P5k17R5J91p2k80Q0j14
$$ 164 -160 -117 89 -120 149 341 -46 236 -249 -194 335 -287 68 101 44 119 -98 -3 188 116 -164 -84 -198
4369a98J86J08l11M85l47O2J0k81M31M0k71R1o3K26K4m63K34R8j20K4J1K10M6
$$ -198 -12 96 -215 270 -77 -15 -5 -286 145 185 -86 5 -58 168 192 -271 -37 61 -59 -35 -24 186 232
4392B32j94m2K16k00J96j39k07L3q8J45j2K6N1P6k91L07l95M11Ll34K95L7j49
$$ 232 38 -4 212 12 208 69 -138 -105 -193 -48 -60 -34 17 93 -198 109 -286 125 128 -206 89 126 -23
4415b3R3L8k17J34m1rL40o47L52l4o9K83m88L23m5m57M38l8J45l8l79j8P2J50
$$ -23 70 108 -109 25 -16 -25 315 -332 20 -14 -83 200 -288 35 -10 -467 -29 -67 78 40 -339 -357 -285 -135
4439a35L48m18K94k62k38N37n0k43K43j05O2J13j13J37j86K2J65k74J67q4k82
$$ -135 213 -205 89 -173 -411 126 76 -167 76 -29 33 146 33 170 -16 6 171 -103 64 -20 -302
4460c02J50M6k7P3p4J08K75j51Q6n9m52K19l2j44K63m7oJ19r9J42k3l36K64k3
$$ -302 -152 -106 -133 -60 -134 -26 249 98 184 125 -327 -108 -140 -284 -21 -68 -74 45 -54 88 65 -271 -7 -30
4484c0j06J39k43L37j68j25R0j10J04l4O0J82l8k44m8J38K0j4j16N5K24j59L04
$$ -30 -136 3 -240 97 -71 -196 -106 -216 -112 -146 -86 96 58 -186 -234 -96 -76 -90 -206 -151 73 -86 218
4507B18j99j71K24p1L5l5k17l9J80K03j36J0l2J21j87Q6L83m74P6j81j24L16k75
$$ 218 19 -152 72 1 36 1 -216 -255 -75 128 -8 2 -30 91 -96 -10 373 -101 -25 -206 -330 -14 -289
4530b89L24O5k10J44K8k38L15Ll75L93j79k1J02r4J47K2l45J10j75K96kJ4j48
$$ -289 35 100 -110 34 62 -176 139 142 -233 160 -19 -40 62 -32 115 137 -208 -98 -273 23 21 35 -113
4553a13K46L4k27n7R1Lj56J80J41j63L5K5J16j52j41K89j81n5r6K05j03L4r1K64
$$ -113 133 167 -60 -117 -26 -23 -179 1 142 -21 14 39 155 3 -138 151 -30 -85 -181 24 -79 -45 -136 128
4577A28j51k88M87j34k01L24m03M01R0l78L33l5l81K69k21J63J82j33n4nr9J71
$$ 128 -23 -311 176 42 -159 165 -238 163 253 -125 208 173 -208 61 -160 3 185 52 -2 -7 -106 65
4599F5j4j42K42j83o2j9J44P3j92J05L50l93J15j77K01K0k65J76k49J94n3J28
$$ 65 51 -91 151 -32 -94 -113 31 104 -88 17 367 -26 89 -88 113 133 -132 44 -205 -11 -64 64
4621F4o9P6jO8L1o01M86J56l20j34M16k49o9J92K37j96k86L07j38jJ24m3J76l36
$$ 64 -5 71 70 138 169 -432 54 210 -110 -244 172 -77 -146 46 283 87 -199 108 -30 -31 93 50 226 -110
4645a10k0J31q1J37K66j72j73m0j1K21m34M65j16Q4l07J62M4k24L07j83J33k32
$$ -110 -130 1 -80 57 323 151 -22 -62 -73 148 -286 179 63 147 -160 2 46 -178 129 -54 79 -153
4667a53J16K93m03J13J29k12J81l49K48J36j17L27j84l72l5K19K62k31n5P8J51
$$ -153 -37 256 -147 -34 95 -117 64 -285 -37 99 -18 309 125 -247 -282 -63 199 -32 -87 -9 142
4688A42j76l0L3R0J66l11j26N60j20k4m1m06R1Q8L4l2j43mK02Kj50Q5OL29k10
$$ 142 -34 -64 -31 59 225 -86 -212 348 228 204 163 -243 -152 -64 -30 -62 -205 -209 -7 -5 -155 -70 -64 265 55
4713E5NJ71l35J44J08j89J55k15J61NJ3R1o6j17J87k27R6p7j6q8M8J63k09o5K77
$$ 55 60 231 -104 40 148 -41 114 -101 60 65 78 169 103 -14 173 -54 42 -35 -51 -139 -91 72 -137 -202 75
4738G5l14K76Q2M3q8jN8j55J19k17J76K3j46J7K14k90K94k29J76j51p7J59j20
$$ 75 -239 37 119 162 74 73 131 -24 95 -122 54 77 -69 -52 162 -128 166 -63 113 -38 -115 44 -76
4761g6J7q7K2n3K01J48K19j65k95R9j67J15L29n22K22K29m08L33l51K63O2j81
$$ -76 -59 -146 -124 -177 24 172 391 226 -69 30 -137 -22 307 -215 7 236 -172 161 -190 73 135 -46
4783d6P8j29K3p0J18NO8k36K24j4j06O1J89l24R2q2J22j11J67k71L29j78J86k5
$$ -46 32 -97 -74 -144 -26 -21 47 -189 35 21 -85 -24 165 -159 -67 -149 -27 -138 29 -242 87 -91 95 70
4807G0k63M96n31J41K24k42P7NM2K5m4N2J7l61K17J28N7l4Jn5j57j16M94j59j83
$$ 70 -193 303 -228 -87 137 -105 -28 -23 19 44 0 52 69 -292 -75 53 110 76 77 22 -135 -251 243 84 -99
4832i9K19M4k04pj03O1J85j24Q4j99r5l1M55j26Rj46M20l64L1k4M0K84m66p2L26
$$ -99 120 164 -40 -47 -150 -89 96 -28 56 -143 -238 -269 186 60 69 -77 343 -21 10 -14 26 310 -156 -228 98
4857I8j58N8J61k95L66j67k9P8l31M1O7k6K49nl68M60j62p4j1J63m52L51M2J00
$$ 98 -60 -2 159 -136 230 63 34 112 -219 -178 -111 -137 112 107 -261 199 37 -37 -48 115 -337 14 56 156
4881A56j08j51O1l2K98j26k31O3K07mR2l48J60J13l13N2L96o13M06J02j22q4K13
$$ 156 48 -103 -42 -74 224 98 -133 -70 137 133 225 -123 37 150 -163 -111 285 -328 78 180 58 -26 187
4904A87m07K33j70K59k96L9N87m07K6J05k17j3J11N4K4p0mJ18l38J59r9j7R9l2
$$ 187 -220 13 -157 102 -194 -155 432 25 51 156 -61 -74 37 91 115 45 41 159 -179 -20 -119 -136 -37 -69
4928f9J57k4k35M60j12n25M39n7j76L03k6j95J27k04J67N9j06K69k57K57j15l78
$$ -69 88 64 -171 289 177 -348 91 34 -142 161 135 -60 67 -137 30 89 -17 252 -5 252 137 -241
4950b41M54j44l0Lr6J1J73j46J57J80l09m2mJ05J19l10K17j0j28K73l09J33P0
$$ -241 213 69 39 42 -54 -43 130 -16 141 321 12 -30 -34 71 190 -120 97 87 -41 232 -77 56 126
4973A26l6q1J03j59M4j50K76k02J77k06P5j81M61p2l37K95j43j81L26J6j78L8
$$ 126 90 9 112 -47 -3 -153 123 -79 98 -108 -33 -214 247 175 -162 133 -10 -191 135 151 -27 11
4995A1J32Kk21J22J18j32J09l04l5K50k50O1J47mJ57l04M0M20k78j24P7qk81L93
$$ 11 143 145 -76 46 164 32 141 -163 -198 52 -198 -137 10 6 163 -141 -101 319 41 -83 -6 -14 -295 98
5019I8l00K51k12R1K63k03J28l14J3K04K28l12J74J98j98N6j11p6l8K09n4o6N3
$$ 98 -202 49 -163 -72 191 -12 116 -198 -185 19 247 -65 109 307 109 165 54 -22 -60 149 95 29 82
5042H2Jj80K34l73J91J21j44J04j08K62m74J24J02rl2K6Jj63N76k35l15J9K86
$$ 82 83 -97 137 -236 -45 76 -68 36 -72 190 -284 -160 -58 -67 -99 -73 -72 -235 341 106 -209 -190 96
5065I6j30K91k17O1J19k84R5K58l26J36K56j84k18j11j3K91k7J36j9k72J48m57
$$ 96 -34 257 40 101 220 -64 31 289 -37 99 355 171 -47 -158 -171 120 93 229 210 -62 86 -371
5087c71L06J28l18M05k04R6J31m97M29n7j2K50n69P4M43l66L5P3J6m3l9k1J20
$$ -371 -65 63 -255 150 -54 42 173 -324 105 48 36 286 -283 -209 234 -132 -97 -24 -8 -51 -90 -111 9
5110Ij90K27k08R5R8k68K14K78n27M19j56k43J39K87l58K70J09k25M0K6m6P7l4
$$ 9 -181 46 -162 -67 31 -237 -23 255 -272 147 -9 -252 -113 174 -184 86 195 -30 10 36 -10 67 33
5133C3O7j81K00k17j89M20Lm25Q5K75n1J11m1jRl2J6P9l60K00k08R6J81l81K43
$$ 33 100 -81 119 -98 -287 133 136 -289 -204 71 20 131 90 89 98 66 82 161 -199 1 -207 -111 70 -311 -68
5158f8J17K12k35k17J59J01J40n01M06l76K93k62J14K66m5M3j58p7J50N4k97K01
$$ -68 49 261 26 -191 -32 69 209 -292 114 -262 31 -231 -117 149 104 147 -11 -88 62 116 -181 20
5180B0N5k03O3Q0K4j4lN2k31K71j61L4K59J02n17m0L17QK46l67j97J26j8L04m67
$$ 20 75 -128 -65 15 39 25 22 74 -157 114 -47 -13 246 348 -169 -209 108 116 362 -5 -202 -76 -94 210 -257
5205b57J88L36m35N6J06J11p9q2j4K62k43P2j75j88O14p4m59L15j36P0J18M1R6
$$ -257 -69 267 -168 -112 -6 105 26 -56 -70 192 -51 21 -154 -342 272 198 -261 54 -82 -12 106 147 243
5228B43j31j94L29l53L45m93j2L77J6j05k5j07K15j9j96J96Jj96J37n5J27k98
$$ 243 112 -82 247 -106 239 -254 -266 111 127 22 -3 -110 105 86 -110 86 87 -109 28 -27 100 -198
5250a98lL1K11k56J81N6Rk77J98J19m9k02K58p5k07M04j84OJ70j34J08q6l1j68
$$ -198 -201 -170 41 -215 -34 22 31 -246 -48 71 22 -180 78 3 -204 200 16 22 192 58 166 80 49 -119
5274a19J25j15L85l99N5j5NL89m68J52n6l9J83k45M7J14p5k38J68J66j36L04l74
$$ -119 6 -109 276 -123 -68 -83 -78 311 -157 -5 -61 -100 83 -162 -115 -1 -76 -314 -146 20 -116 188 -186
5297a86K40J52m29K53k29R8M9j6J23j70LR7j76J22L74l87J25j27L6J67k79J77
$$ -186 54 206 -223 30 -199 -101 -52 -68 55 -115 -112 -15 -191 -69 305 -82 43 -84 -48 119 -160 17
5319A7l3j05Q9J90L6j10k59K33K05k50n9L5qO5n4j64K13j18J08Ol16L56j04J6
$$ 17 -16 -121 -32 158 194 84 -175 58 263 13 -46 -11 -19 46 -8 -172 41 -77 31 37 -279 77 -27 -11
5343a1K17k64l0K63k60k9K52k47J74j44O6R0l07K37l4j40K47k70R7o3P8P9q1L5
$$ -11 206 -58 -88 175 -85 -114 138 -109 65 -79 -13 77 -230 7 -27 -167 80 -190 -93 -156 -78 1 -80 -45
5367d5J55n5n0K75l35p7K41j78J91n9l54N9K31O6K9j65J42Kk54K25l14N15k01
$$ -45 110 55 5 280 -55 -132 109 -69 122 63 -291 -232 -1 65 94 -71 71 73 -181 44 -270 245 44
5390D4o0K78k14j53J34r3O0J39k59J19J14k51J11n7r4M54j95nj81n2J52j43J30
$$ 44 -16 262 48 -105 29 -64 -4 135 -124 -5 109 -142 -31 -88 -182 272 77 72 -109 -161 -9 -152 -22
5413b2M5j02j5J30l7J88j01J29k6k65J23k50J88kk7j40J12N7L05pl63K50N4k86
$$ -22 23 -79 -94 36 -1 187 86 215 189 -76 47 -203 -15 -17 -44 -184 -72 -15 290 283 -80 170 224 -62
5437f2L3KrK89l40oJ72k61j02J94K33j46q9L0J08l52L49Q9m93M28j15J31oL8K27
$$ -62 -29 -27 -36 253 -87 -93 79 -182 -284 -90 143 -3 -92 -62 46 -306 43 132 -361 67 -48 83 77 115 342
5462C42l83J43j86J20k42L15k17J27j65j69K01P1qN1j52N2J67j62L71n01K4M4
$$ 342 -41 102 -84 36 -206 109 -108 19 -146 -315 -114 -43 -51 0 -152 -100 67 -95 276 -225 -201 -157
5484a57O8r9K43k6Q6P2l37K50o0k22R7l0J86p9q9J60j13K17J23n31L20j22p1K81
$$ -157 -89 -188 55 29 115 187 -150 100 40 -182 -85 -115 71 -8 -97 63 -50 167 290 -241 79 -43 -114 167
5508A67j87j94L15J27j12N4m71K45l07L82K60j26j79J62k81L0L31j22J52l19j8
$$ 167 -20 -214 101 228 116 170 -301 -56 -363 19 279 153 -26 136 -145 -115 216 94 246 -73 -91
5529i1K97p4J26j60k17J45l9l98N15r1o0K72n46L61j62J82j4j77K17J8L1k72j90
$$ -91 206 132 258 98 -119 26 -13 -411 104 13 -47 225 -321 40 -122 60 46 -131 86 104 135 -137 -327
5552c27M36K3k28j11L00j86m7K14j14o0k39J53K97L9l30j1j03N91k22qM7l18N5
$$ -327 109 132 -96 -207 93 -93 -140 74 -40 -100 -339 -186 111 150 -180 -191 -294 297 75 67 114 -204 -149
5575a49K75q4J18k02J92q6o1j1J43k50K96k44k17N10j78j6K4JO8n4O7K24l25O7
$$ -149 126 42 160 -42 150 64 3 -8 135 -115 181 -63 -280 230 52 36 60 61 129 75 142 366 41 108
5599A08j00r6L9J37j01K02q3j49O9k20K21j00j81K65l30J55L15l61K67J21n32
$$ 108 8 -88 -49 88 -13 189 106 -43 26 -194 27 -73 -254 11 -319 -164 151 -210 57 178 -354
5620c54M48K31k94N1m0J87j55l4L03k43qq7p6Q0j95L74j90QL7J04l5k31J09j80
$$ -354 94 325 31 82 42 229 74 40 343 100 92 5 -71 9 -186 188 -2 6 43 147 112 -119 -10 -190
5644a90L55l42O5L69j27j35j53L40l23J12L1J4k92L21K55k76J82j48k16K44J66
$$ -190 165 -177 -112 257 130 -5 -158 182 -141 -29 2 16 -276 45 300 24 206 58 -158 86 252
5665B52k74K11j68j51J57j94Q0K3o0L50j82N0L7k96K70n7k32K80j84o7M0m5J42
$$ 252 -22 189 21 -130 27 -167 -87 -64 -124 226 44 94 131 -165 105 48 -184 96 -88 -155 -115 -160 -18
5688a8j27R7J14l12Q4N21k78r3m5kQ3k73N5L58m9J32k57k06L63j00r1O1J37k71
$$ -18 -145 -48 66 -246 -162 359 81 -12 -57 -59 24 -249 -194 164 115 247 -10 -216 147 47 -44 17 154 -117
5712a17J74j76J12M6k4O0k88N22l82q0K25Q8m03L75j54J08q5n3Q7k44L29O7k69
$$ -117 57 -119 -7 39 15 75 -213 309 -73 -153 72 160 -243 132 -22 86 1 -52 35 -209 120 187 -82
5735h2N6L53m07L24k71k20O75n68R2J08N1j75N1j38o1J07J16L0q7j49K21J19l79
$$ -82 -26 327 -80 244 -27 -247 428 -140 -48 60 111 -64 -13 -151 -212 -105 11 41 -46 -195 26 145 -234
5758b34J25O5K17jj64J78m64K55M6q8J30j67J7K03j57o0rJ0M19m79m9K71k56P8
$$ -234 -109 -44 173 172 8 186 -278 -23 23 -65 65 -102 -85 118 -39 -99 -108 -98 321 -158 -207 64 -192 -114
5782a14Q1J19r9O7j94K74k07J0J99l60L67l36R8O2k00L26ol27M04l11L4J80j76
$$ -114 -33 86 -13 54 -140 134 -73 -63 136 -224 143 -193 -95 -33 -233 93 87 -240 164 -147 -113 67 -109
5805a09K63q7m6k92N37j14k23K16q6j21j25K96M9k58K52r3k06K96k90K36K7j43
$$ -109 154 67 21 -271 266 152 -71 145 59 -62 -187 109 158 -100 152 59 -147 149 -141 95 122 -21
5827b1L59l35l4M53m74o7M21m98R0J28j35O5r3L22j34o7O4K5LJ57o6l71L37j37
$$ -21 338 3 -31 422 -52 -119 302 -196 -106 22 -113 -48 -141 181 47 -20 44 69 72 229 163 -208 129 -8
5851hN7j11j33L59k7r3K43k54l2l2K9o9J7Q2J57m36nM69k53P1l35J70j58K62l4
$$ -8 49 -62 -195 164 137 44 287 33 1 -31 -2 -71 -54 28 185 -251 -256 213 -40 31 -304 -134 -292 -30 -64
5876f4M26m02K5K18k52K4K30l66K07p8o3O6j43L17j32P2o1j32J67l5j64j5K23
$$ -64 362 -40 -15 203 -49 -25 205 -161 46 -32 -95 -29 -172 145 13 85 24 -108 59 24 -140 -155 68
5899F8j04J00Q2k93J88l7J48m3m1K76m10J13j80J44K35k46m9L0j65K02L28m39
$$ 68 -36 64 146 -147 41 4 152 109 68 344 -66 47 -133 11 246 0 -49 -19 -184 18 346 -93
5921i3j4K82k13J22k11l20P13k69J01J13m85M91j12l33M93n00K68j17j29p2M17
$$ -93 -107 175 -38 84 -127 -447 266 -3 98 211 -274 217 105 -228 265 -235 33 -84 -213 -285 132
5942A32m01N29n60K80O4j54L6K38k55R0M2j50L11l53J94j35K20n7k54k0L90l93
$$ 132 -269 260 -300 -20 44 -110 -74 164 -91 -1 41 -109 202 -151 43 -92 128 71 -183 -203 187 -206
5964b06K50m7L9M1Om44M69N8M6k95j70O37l27j92L39m41M12j02j89L71j85r9j29
$$ -206 44 -3 36 77 83 -361 108 166 212 -83 -253 384 57 -135 204 -237 175 73 -116 255 70 -29 -158
5987a58K99L2j21r3RQ6m3J50k7k20L0J3L7J42k13K41j15j00J21l19J37j3K6J82
$$ -158 141 173 52 -41 -32 54 11 161 134 -86 -56 -43 -6 136 -77 164 49 -51 70 -249 -112 -125 -99 83
6011H3J01l45N10m31Q2P3j18K2J82m9O9l72R4J47j31J8J17mJ22m13L75N9k66j71
$$ 83 184 -161 349 -82 0 73 -45 -23 159 110 179 -193 -99 48 -83 -65 52 48 170 -243 132 191 -75 -246
6035b46L83j97L5q2J31J46l76J38K4R7J00k38m8L4J71j12K78o02M57Qm15J17J64
$$ -246 137 -60 -25 -107 24 170 -206 -68 -44 53 153 -85 -133 -99 72 -40 238 -364 93 101 -314 -197 -33
6058c3J85j77J21j02j39Q9K16k71Q3R2k07J99K03m19K35J2o8K13l02Q1j29K72
$$ -33 152 -25 96 -6 -145 -56 160 -111 -28 64 -143 56 259 -160 75 87 19 232 -70 11 -118 154
6080A54O2k79J25J23j01l02K19l33L13j1j30K96l23J07J90k92J85K4k99J52J18
$$ 154 216 -63 62 185 84 -218 1 -332 -19 -30 -160 136 -187 -80 110 -182 3 27 -272 -120 -2
6101bj8k9J84r2L50m63J30k04J44K74k45O0O1l89K97J12j33J10l95K86L6l42J34
$$ -2 -20 -49 135 43 393 -70 60 -144 0 274 29 89 150 -239 58 170 37 147 -248 38 74 -268 -134
6124a34O4K94r5k02J21Oj66m0K32l31L62k22l6M97l96K1l4j96K99K16n95M98k50
$$ -134 -70 224 129 -73 48 54 -112 -152 80 -251 111 -111 -147 350 -46 -25 -59 -255 44 260 -335 163 -87
6147h7L42r8k71J08K19q6j29p9j30K49m5mM2r8M8j92K69j51n8M96l12M1jRJ09
$$ -87 255 157 -114 -6 213 127 -2 -81 -211 38 -7 -11 31 -67 -19 -211 58 -93 -151 345 33 74 73 82 191
6172A91Nk07m6L04l12J85J62m69K64j34K26j9n5J39r1k60L54k70L63k45k11K55
$$ 191 196 -11 -57 247 -65 120 282 -187 77 -57 169 150 95 234 143 -117 237 -33 330 85 -126 129
6194A29j62J77J76m11n4N8J01J56n9k2p8J54j17J24j33K07l16Q1M87m68k42M35
$$ 129 -33 144 320 -91 -145 -87 14 170 111 89 11 165 48 172 39 246 -70 11 498 30 -212 223
6216B23l8l59L93k76J19j72NK56l49K11J22l33L21j12k04L69j19P3j13k06M20
$$ 223 185 -174 219 -57 62 -110 -105 151 -198 13 135 -198 123 11 -193 176 57 130 17 -189 231
6237B31j25k24L46l53N6K53l25Q3J72J86l46p7J36K00k25j68L82l95qL19k51J32
$$ 231 106 -118 228 -125 -69 184 -141 -58 114 300 -46 -123 13 213 -12 -180 202 -193 -201 118 -133 -1
6259ak26J99J68l10J92K32o6Mk73J48j4J70j37o0j45K92n5K7l6j33J55k47J14
$$ -1 -227 -28 140 -170 22 254 188 192 -81 67 53 223 86 26 -119 173 118 145 109 -24 131 -116 -2
6282bk7k21R9l4k27K88n2J48K97m25j25M25k82L83O5n35M42J13n24L12k20K31
$$ -2 -29 -250 -151 -185 -412 -124 -176 -28 269 -156 -281 144 -138 245 310 -225 217 330 -194 118 -102 129
6304A29K2l79J80J11n4K72k78j26K71n9J6J9m01L68j83MJ30m00L76K55l05J17
$$ 129 151 -228 -48 63 9 281 3 -123 148 89 105 124 -277 91 -92 -88 42 -358 18 273 -32 85
6326H5j52M3K71k13M2P9l56M9K73j51J70l25J34q5J1K25j45l11O10l78J10J40
$$ 85 -67 -24 247 34 76 155 -201 -152 121 -30 140 -185 -51 -136 -125 100 -45 -356 254 -124 -14 126
6348A26R2k24j63j08R0K29j12J84j47M2q6l36N82l88N7O0J81O4l9j00K37k51j20
$$ 126 218 -6 -169 -277 -187 42 -70 114 -33 9 -77 -413 169 -219 -162 -102 79 143 104 4 241 -10 -130
6371a30K39m57N12M8k23O5j17p2K19pp0O2k41N01n31J64K17K7k37J01m9L5l3q0
$$ -130 109 -348 164 212 -11 54 -63 -135 84 77 7 69 -172 329 -202 -38 179 206 -31 70 21 56 23 -57
6395e7K35K9j10j51J15K07J47j56k33KJp4M6J12l2k4J76l10OK50k70J18K36l18
$$ -57 178 207 97 -54 61 268 415 259 26 28 29 -45 1 113 81 57 233 -77 -71 179 -91 27 263 -55
6419e5p8J08P9J05K31j59o9j32J51l9n17K86R4O1k7J32r6J3K2r7q4k70M47J4q
$$ -55 -133 -25 54 159 390 231 162 30 181 142 -375 -89 5 66 39 171 75 88 110 13 -71 -341 106 120 112
6444A12r4j88K88k48O7M5p7L4N7O7j48K9K7K84m58J38K80l44K41R7j89j6rK48
$$ 112 18 -170 118 -130 -63 -18 -95 -61 -4 63 -85 -56 -29 255 -203 -65 215 -129 112 209 20 4 -5 243
6468B43Q6m12J6P3J33P1m41K44N6k92K25J98k48J20m52L08J65q0k09K95k05J34
$$ 243 329 -83 -67 6 139 210 -231 13 69 -223 2 200 -48 72 -380 -72 93 13 -196 99 -106 28
6490B8J1R0J9j21k40K53j58J36J31l8K72n27K58q4l2m8m3o8K28J56m55N72l94
$$ 28 39 129 148 27 -213 40 -118 18 149 111 383 -144 114 30 -2 -50 -93 -161 67 223 -232 340 -54
6513e4K15l44K9o2L68k39J62j65j19L06l11L68p9p1R2k19P9J26k81M42r9m30N01
$$ -54 161 -183 -154 -216 152 -87 75 -90 -209 97 -214 154 75 4 96 -123 -44 82 -199 243 144 -286 215
6536B15m16K35j7l75L02J37k02N5j9p2J19j67O1J87o5J16k21J61J36j87M1m6j10
$$ 215 -201 34 17 -358 -56 81 -121 -66 -85 -157 -38 -205 -144 43 -22 94 -127 34 170 -17 24 -22 -132
6559a32L08p2j36J02J29kj51l1j19K81k46K22j20k71L80l57K24Kn8J73l20J87
$$ -132 176 104 -32 70 199 197 46 15 -104 177 -69 153 33 -238 142 -215 9 11 -47 126 -194 -7
6581gJ27k09L7qJ40j14j52L6K64l32L73Qj16j12J83j49J80l54K69Nk51L68k74
$$ -7 120 -89 -52 -60 80 -34 -186 -150 114 -218 155 163 47 -65 118 -31 149 -205 64 69 -182 186 -88
6604h8J88k8q8kP2pJ4l5l21j2K11QK88l64L16nk94L15n4n6N09p69K72O8j62P1
$$ -88 100 72 -16 -18 54 47 61 26 -295 -307 -96 -88 200 -164 152 147 -147 168 114 58 567 -202 70 138 -24 47
6630D7j6j31L00l80J52M38m35L81m07q4J27j01k4L80l67qJ11O7p5j02j85L86k04
$$ 47 31 -100 200 -180 -28 410 -25 356 -51 -135 -8 -109 -133 247 -120 -128 -17 50 -25 -127 -312 74 -130
6653a30J07J49k87M91l12J78M5l08N2K52o16L78jj28M26n85qL31l84N18l78NK42
$$ -130 -23 126 -161 330 18 196 241 -67 -15 237 -379 -1 -2 -130 296 -289 -297 34 -350 168 -210 -205 37
6676C7j7r5J48j60J99P3j4j10n5l30N37m11K75j48k48M11l92K10J50j79J31J86
$$ 37 20 -75 73 -87 112 185 171 61 6 -324 213 -198 77 -71 -319 92 -300 -90 60 -119 12 198
6698A98l41K03q7q7L85k41j1J26m59J72J23k15O92o38K0L48l80J02KJ24R9O8k88
$$ 198 -143 60 -27 -114 271 30 19 145 -314 -142 -19 -234 458 -180 -160 188 -192 -90 -88 36 135 203 -85
6721h5L48k12j72J40m47M02j24J97j25O4M9J1k05M30j03k96K18j20J86M3l93K05
$$ -85 263 51 -121 19 -428 -26 -150 47 -78 -14 35 46 -159 271 168 -128 90 -30 156 199 -194 11
6743A1k10r2M58n22M08k82j2M69r2k08L93l62J19J65l31J75j54N8K29k83j37M41
$$ 11 -199 -291 167 -355 53 -229 -241 228 136 -72 321 -41 78 243 -88 87 -67 -9 220 -63 -200 241
6765B41l64J83O4l05J86j05m9J40k19K2L95k92L31j41m82M62J08l53Q6j77L41
$$ 241 -123 60 124 -181 5 -100 -149 -9 -228 -206 189 -103 228 87 -395 67 175 -178 -92 -269 72
6786G2R5m68M57k08kK37j22Q7J33l67L63l71K5K49l16J46K30m36J41K3Q6N3k18
$$ 72 167 -301 156 -52 -54 183 61 148 281 -86 277 -94 -69 180 -136 10 240 -196 -55 -32 54 107 -111
6809a11K67j39k20M31J59o24L50l58L72r9p6J9K19k40qr4P6K08m4J27q4n38N72
$$ -111 156 17 -203 228 387 -237 113 -245 127 28 -48 -29 190 -50 -58 -152 -76 132 88 215 131 -407 165
6832A65lk42q8n2K21J30o5m8o2k24M46m91M60k51Qm1P4J06J84l48j31M27k96J78
$$ 165 162 -80 -168 -220 1 131 66 18 -44 -268 178 -313 147 -104 -96 -137 -63 43 227 -121 -252 175 -121 57
6856E7k9k0K30l48K50J08m03K94l81M1L87k70j13K89m90L50n4n7K43k86K38M9
$$ 57 28 8 238 -110 140 248 -155 139 -242 -201 186 -84 -197 92 -398 -48 -102 -159 84 -202 36 85
6878H5j2j30j19N9K69j5k61J82j00RJ77j94R4O3k14K26k70J74o9j50M26n0l78
$$ 85 73 -57 -176 -117 152 137 -124 58 -42 -33 144 -50 44 107 -107 119 -151 23 -46 -196 230 180 -198
6901a98L79k70J72J6m67M12j83K66m3r3N9Q4N5p2k40JM70l26k8K61l24J85k49
$$ -198 181 -89 83 99 -368 44 -139 127 84 -9 50 134 189 117 -123 -122 348 22 -6 255 -69 116 -133
6924a33J6L32l21kJ60j66J59l2J42J41m44L7L07l68K65K64l70J20j08J9J51q5
$$ -133 -117 215 -106 -108 52 -114 45 13 155 296 -148 -111 196 -172 93 357 -13 107 -1 18 169 84
6946H4k35O90p03J77Ll38L40l01J04M36l22K97j47j18L52k52k42K08k27J37K59
$$ 84 -151 539 -164 13 16 -322 18 -283 -179 257 -65 232 85 -33 319 67 -175 33 -194 -57 202
6967B02m05K72K7k58K43j39m1K61l76J02L42j74L13m14J68J78o07M61j21j94M24
$$ 202 -203 69 96 -162 81 -58 -99 162 -214 -112 230 56 369 -45 123 301 -306 155 34 -160 264
6988B64m40K17L04n63L59p0j52l9K03l13M80l86j1K22j64K33l82L2K07J36J08
$$ 264 -176 41 345 -218 141 71 -81 -120 83 -230 250 -136 -147 75 -89 144 -238 -206 1 137 245
7009B45K29m55j85L26l72M12j45M7Q8k99K98M2l17M35l17o0L01l22J54J39l20
$$ 245 474 19 -166 160 -212 200 55 102 190 -109 189 231 -86 349 32 -28 273 -49 105 244 -76
7030g6K72l66j1L20l14J17J31j50J26j31j18L77l21K47O7k90NJ11P6K76j79o7
$$ -76 196 -170 -181 139 -175 -58 73 -77 49 -82 -200 177 -144 103 170 -120 -115 -4 72 348 169 102
7052A02p3r6J05O1n48O13l86M11j13k66J15L07j87L6j14j94L58m60N21l66K53
$$ 102 29 -67 38 99 -449 164 -222 189 76 -190 -75 232 45 81 -33 -227 131 -329 192 -174 79
7073G9J61l96J68Nk59J36L70k29K28j21j63J45K3k84K45k38J49J96l52N03p14
$$ 79 240 -156 12 17 -242 -106 264 35 263 142 -21 124 147 -137 108 -130 19 215 -137 366 -348
7094c48K3M55l77L27J57o37L41r6q7L50l35L48r6l00L89j77j20P3qO9J5R2o8Q3
$$ -348 -325 130 -247 80 237 -400 -59 -155 -242 108 -227 121 25 -275 114 -63 -183 -110 -118 -49 -34 58 -10 73
7118G3l53M08j51j84K90l17K86p2M1Oj29J70M0l88M42k71j16K69r8O0jk03J67
$$ 73 -280 128 -23 -207 83 -234 52 -20 21 27 -102 68 108 -280 162 -109 -225 44 -54 6 5 -198 -31
7141c1K80j92K61l25k07L50j85J59J43k03Q7j47n6K49r8j80K52k24nK9r5R4L0
$$ -31 249 57 318 -7 -214 136 -49 110 253 50 137 -10 -66 183 85 -95 157 -67 -72 -43 -138 -44 -14
7164a4j62N8J04kJ31l85K49J16o6p0J36k8j88J40o3K86k26K56l38K26k09J8o5
$$ -14 -176 -118 -14 -16 115 -270 -21 95 29 -41 95 67 -121 19 -44 242 16 272 -66 160 -49 -31 -96
7187i6M9j89J97O7j53J92q4l9L45k74K43l88j02M15n07L60K19l23J02j22J23K98
$$ -96 -47 -236 -39 28 -125 67 -17 -56 289 15 258 -130 -232 183 -324 36 255 -68 34 -88 35 333
7209C33p15L77J37K4k43j4L2J64l37O5J90P3q1P2m10N50m10L95k01l73L10J76
$$ 333 -382 -5 132 156 -87 -101 -69 95 -242 -177 13 86 5 77 -333 217 -193 202 1 -372 -62 114
7231A14j40J38j14N4N5k02K71j85k15K16J47j94J31L8L8Q4n64N03j8r6L00l69
$$ 114 -26 112 -2 52 107 -95 176 -9 -224 -8 139 -55 76 114 152 236 -328 175 157 61 361 -8
7253hj09J6l3K12j1k82K13k17J03K02q2K74k03j81K68j25J24P0q6m3p7m97M72
$$ -8 -117 -101 -134 78 67 -215 -2 -219 -116 86 4 278 75 -106 162 37 161 231 145 102 25 -472 0
7276@%j17K80k00O9J03l35Q2N1J21R0k28P4J77k49K24l71J16K34l0k36J55j7j42
$$ 0 0 -117 163 -37 32 135 -200 -118 -67 54 144 -84 -10 167 -82 142 -229 -113 121 91 -145 10 -7 -149
7300a49o1l7J30m4L30k04j02K01J30l23L59k87M9J81k82rR8n7L18j82m2L67m00
$$ -149 -210 -247 -117 -161 169 -35 -137 64 194 -129 230 -57 -8 173 -109 -118 -20 -77 241 59 17 384 -16
7323a6o1K30Q8k58J07o3J13m29M22J45m60R7M53n84L70k06j36J82j69L40K1l16
$$ -16 -77 153 241 -17 90 27 140 -289 133 278 -182 -85 368 -216 154 -52 -188 -6 -175 165 186 -130
7345a30L91k46n21N78O7k48L7j98K16r7J95J26m00M03j71j96L13j90L6q5L35k44
$$ -130 261 15 -506 72 139 -109 -72 -270 -54 -151 44 170 -230 173 2 -194 119 -71 -35 -120 215 -29
7367b9n3l1K45p7m5N7k26J83j9L4K33j07m93K09K87k69K10k20J7q5K78j86K83
$$ -29 -82 -113 132 55 10 67 -159 24 5 39 272 165 -328 -119 168 -101 109 -111 -94 -179 99 -87 196
7390A96l04J06j42nK14k98M54k18j87L54k70Q3M49l64P5J25k57J80l75m2J90j28
$$ 196 -108 -2 -144 -149 65 -233 221 3 -184 170 -100 -17 432 68 143 268 11 191 -184 -226 -36 -164
7412a64K25j39j53K69k05Q1L38l13q3L48m25J93Pr0K70k32K61j13j21J08o4m1
$$ -164 61 -78 -231 38 -167 -86 252 -61 -144 204 -221 -28 -21 -111 159 -73 188 75 -46 62 -2 -43
7434d3J4k69J37N21k63j72J16j80M15j62M6K16n17M6j2k4L21l91PL09j01o0J11
$$ -43 -29 -298 -161 360 97 -75 41 -139 276 114 160 376 -141 -95 -107 -131 190 -201 -194 115 14 -46 65
7457F5n5J25k78J64L3l97J48K77j29J67j49m24M78k06K77J22r7k16L09l37J70
$$ 65 10 135 -143 21 54 -343 -195 82 -47 120 -29 -453 25 -181 96 218 121 -95 214 -123 47
7478D7j15j61L50j26MK4q2M4m5J35o5o9Q5q1j58M46j01m5n5r5Q0L24k56P5k69
$$ 47 -68 -229 121 -5 -1 23 -59 -15 -60 75 10 -59 26 -55 -213 233 132 87 32 -63 17 341 85 160 -109
7503a09j98M08n9j6K64m83J40m1k7L50l04K4J29j18Km3j88M47j92j90M09l63J70
$$ -109 -307 101 42 26 290 -193 -53 -94 -121 229 -75 -51 78 -40 -38 -81 -269 178 -14 -204 205 -158 12
7526A2L38m97R7R4J7j63K62j63j32l9L68q0k87K70k95L9M33l61l7R9k25J75P6
$$ 12 350 -147 -50 44 61 -102 160 -3 -135 -174 194 114 -173 97 -198 -159 274 -87 -124 -25 -250 -75 1
7549Am16L82k53L66o5r3J79m8pM2l61M12j22k85L47l2k33M63m10K34L70n56L80
$$ 1 -415 -33 -286 80 15 -78 101 53 46 88 -273 139 17 -268 79 47 -186 277 -133 101 471 -85 295
7572B95n20RL22k38L91j2l30M3J60K7r7k72K54L10m27J98l45J32K54p9j09K37
$$ 295 -225 -216 106 -132 259 247 -83 -40 120 147 50 -222 32 342 -85 113 -232 -100 154 75 -34 203
7594B03l9l9j47j08M58n08M46o5k45K07J35k65R2k42J0R1j07m7J65r9K19k21m2
$$ 203 164 125 -22 -130 328 -180 266 201 -44 163 298 33 125 -117 -107 -16 -123 -170 -5 -104 115 -106 -148
7617a48L97k39j2K50l60K73j6n46L78K57o00L01o0L58l00j96M18j7l56K39Q8k01
$$ -148 249 10 -2 248 -112 161 145 -401 -23 234 -366 -65 -125 233 -67 -263 155 138 -218 21 109 -92
7639i2n3j6M79o23K58J34k21K80J99n46K57o9o7Q0k14K51J27l30L15k7k61K94
$$ -92 -145 -161 318 -305 -47 87 -134 146 345 -201 56 -13 -80 0 -214 37 164 -166 149 122 -139 155
7661A55l36K52j72J45j8j35N0K16k45k30N14k42J6j93O0L5Q2k2J38p6M9p7q6L04
$$ 155 -181 71 -101 44 26 -109 -59 157 -88 -318 196 -46 -30 -223 -163 -128 -46 -68 70 -6 43 -34 -120 184
7685A84l54M6K83j52l0K61m22J83R3l16K43N8l89L08r3L78j70k18K61k63j21K33
$$ 184 -170 -124 159 7 -23 238 -184 -1 92 -224 19 77 -312 -4 -97 281 111 -107 154 -109 -230 3
7707Cp7J79o4J07j66j55q3L33j43lK46k00P4l0J58j3j20j83L95l56L18n59M79
$$ 3 -74 105 41 148 -18 -173 -256 77 -66 -69 177 -23 51 21 179 166 46 -137 258 -98 220 -339 140
7730A40K42m61J44R7m8R9qj6k20q6J19k7m32O09l0j81K26j77J2J57k13k3L38l95
$$ 140 382 -79 65 162 114 213 205 189 -31 -117 2 -25 -457 152 122 -59 167 -10 2 159 -54 -77 261 -134
7754a34J63o3O4K71j89j62J86l01J08J03o06N07j20Q6J97m87M45k18M4K06j87
$$ -134 29 -34 30 301 112 -50 136 -165 -57 46 -560 -53 -173 -87 110 -377 68 -150 -106 100 -87
7775h7K52Mk37L14k59j90M14l19O9L73m20q4J80l15K76J51j20K79k96J84M0n21
$$ -87 165 169 -68 246 -13 -203 211 -108 -39 334 -86 -170 10 -305 -29 122 2 281 -15 169 209 -312
7797c12M56Q3j41J29n44K95K94n34N01k43m3M30k88k64J71j36K04M1q9OJk99M72
$$ -312 144 227 86 215 -329 -34 260 -274 227 -16 -59 371 83 -181 -10 -146 58 99 10 16 17 -282 190
7820A90k59Q3J31l36J14n6P2K07p8j16K93k75J95j94r0J54k2K5M6l69K18O6l49
$$ 190 -69 14 145 -191 -77 -133 -61 146 68 -48 245 -30 165 -29 -119 35 13 38 84 -285 -67 -1 -350
7843c50M50j35J15j06m2R2j27k57M75m7k5J4j31L65j13j55J00l74K36J13j87L54
$$ -350 100 -35 80 -26 -68 24 -103 -360 115 68 43 57 -74 291 178 23 123 -251 -15 98 -89 265
7865B65l66Q1J27j11j84L3R1j55L50m27M57l12j60L49P7k58K33p7j41K52j27M3
$$ 265 -101 -20 107 -4 -188 -155 -64 -219 131 -296 161 -151 -311 38 115 -143 90 13 -128 124 -3 40
7887D0J8m5K75k37l67L93k47J23J84l33K20Q5k10J86rj01N6k15L16j70n3L14k48
$$ 40 58 13 288 51 -316 77 -170 -47 137 -196 24 109 -101 85 76 -25 31 -184 132 -38 -91 223 -25
7910b5K99j53j46P6m36N12J97m84J41j43K7K18O7j09N7j83rL00l98L40j62r3J83
$$ -25 274 121 -25 51 -385 127 324 -160 -19 -162 -135 83 150 41 98 -85 -94 206 -192 148 -14 -107 76
7933G6k19l5J84j52N3J18o0J16j77O3K73k96O0k6KK54k98L6M6pK45j20k61L03
$$ 76 -143 -178 6 -146 -93 25 -35 81 -96 -33 240 -56 4 -22 -20 234 -64 -28 18 11 256 136 -125 178
7957A78Nj33k8N1j78K65j33L0l40J06K65k34J05m8j05J98Q0k08J02k72K36L01
$$ 178 183 50 22 73 -105 160 27 57 -283 -177 88 -146 -41 -89 -194 4 84 -124 -22 -294 -58 243
7979B43r3k18k07J83J82r4L0J14j66J89k1j81J17O4j77K57o06N55j20j72K43j72
$$ 243 150 -68 -275 -92 90 -4 26 140 -26 163 142 -39 78 142 -35 222 -384 171 51 -121 122 -50
8001e0k30O06m65K02Jk27J88j65L4K06k11j04M51m05N71m30k05L68j79J47K40
$$ -50 -280 326 -139 63 64 -163 25 -140 -106 100 -111 -215 236 -169 402 -28 -233 135 -44 103 343
8022C43l26j4K56m64R4P1J28l5k62Q0J09r3L20r5k98K76k92L31j71N5K75l17m6
$$ 343 17 3 259 -205 -111 -40 88 53 -209 -129 -20 -113 207 112 -186 90 -202 129 -42 13 288 -29 -75
8045g5K3N7k77L97r4Q3Rk1k3j03j49L76k00N8L66p40L37j12j1J75k01j36J09r
$$ -75 -52 5 -272 125 31 114 123 102 79 -24 -173 203 3 61 427 -313 24 -88 -99 76 -125 -261 -152 -161
8069a61J85j48l9K66j42J82r4k80L13L9j39L2k87L66R9m46L84j54m3K88l37K44
$$ -161 24 -124 -163 103 -39 143 49 -231 82 121 -18 14 -273 93 192 -254 130 -24 -67 221 -116 128
8091A28K41n60L84j87l94N78l90K39J78l60L37j90K51k90M3J22l05J13K33L9l27
$$ 128 369 -191 193 6 -388 190 -200 39 217 -143 194 4 255 -35 8 130 -175 -62 171 210 -117
8112a17K70j95L58P6n26k5K32r9K06l48J82M41n32J87k4j79K51q6l46L50l09J50
$$ -117 153 -42 316 392 -134 -159 73 -26 180 -168 14 455 -77 110 86 -93 158 72 -274 76 -233 -83
8134h3R5k72L61k05j67J10l7NK34m9j3J12k52K33o6j00J87l63K50O4j27R7Q6j93
$$ -83 12 -260 101 -104 -271 -161 -198 -193 41 -8 -21 91 -161 72 6 -94 93 -270 -20 44 -83 14 100 -93
8158i3Nj8J24k61q4N44n73M60m7j85j11M53k87MJ42r0J91j66p8K32l68L19r5k6
$$ -93 -88 -106 18 -243 -327 217 -356 104 57 -128 -239 214 -73 -69 73 -17 174 8 -70 162 -206 113 18 -8
8182hm0K5J37J76n15J07R3j18R1
$$ -8 -48 -23 114 290 -225 -118 -25 -143 -52
8191e2
$$ Imaginary data points
##PAGE= N=2
##DATA TABLE= (X++(I..I)), XYDATA
0@%%%%%%%%%%%qJ6j6J6k4L2m0N1n9P2q8J04j22J46j74K00k32K70l10L56m05M61
$$ 0 0 0 0 0 0 0 0 0 0 0 0 -8 8 -8 8 -16 16 -24 27 -32 40 -48 56 -66 80 -94 106 -126 144 -166 190 -215 246
33B46n24N90o64P48q41R40j046J166j300J444j599J770j957K160k384K630k897
$$ 246 -278 312 -352 396 -445 495 -551 615 -685 759 -840 930 -1027 1133 -1251 1379 -1518
50a518L192l516L872m270M713n211N776o421P164q032R064j0311J1857j3832J6455
$$ -1518 1674 -1842 2030 -2240 2473 -2738 3038 -3383 3781 -4251 4813 -5498 6359 -7473 8982
65H982k0123K5658l5064N5172j74676J64153J41179l68622J89897J10879k18349
$$ 8982 -11141 14517 -20547 34625 -140051 24102 165281 -203341 -13444 97435 -120914
76a20914M2964K36857j46328j50248K02476N3404k12325J35447P8842j94419P2100
$$ -120914 -77950 158907 12579 -137669 64807 118211 -94114 41333 120175 -74244 -2144
87b144J07802j23930N959M1557k0472k5095L459M5820n7853l3101J09764n6191
$$ -2144 105658 -18272 -12313 29244 8772 -16323 -12864 32956 -24897 -57998 51766 -4425
99d425o2631R0199j8227m6385M8962K0040m6942l3518R2267m523j10909J03230
$$ -4425 -67056 23143 4916 -41469 7493 27533 -19409 -52927 39340 34817 -76092 27138
111B7138J7833j34206J10806M0598j26751N6049M5658n5632J2033L0231o790l4500
$$ 27138 44971 -89235 21571 62169 -64582 -8533 37125 -18507 -6474 23757 16967 -17533
123a7533K8945K9016n5367L4260J9952o2407M8774q037m4959O6903m5299l2791
$$ -17533 11412 40428 -14939 19321 39273 -23134 25640 17603 -27356 39547 -5752 -38543
135c8543O7540n2579r011N1033m8405n507L4113q321j6399J0077L4301m1969m57
$$ -38543 28997 -23582 -32593 18440 -29965 -35472 -1359 -9680 -26079 -16002 18299 -23670 -24127
148b4127P8330o9789j0942R9389p9827j8316R2589o0678k4560N5553j9734k8395
$$ -24127 54203 -15586 -26528 72861 -6966 -25282 67307 6629 -17931 37622 17888 -10507
160a0507O293K9513k6317l5175N9184k1288m7839O1992j5772l0562L3517j2597
$$ -10507 -4214 25299 -1018 -36193 22991 1703 -46136 15856 84 -30478 3039 -9558
172i558R032l638j3195M2627l5529j1817N8767m4806r757M5116l1256n497J6020
$$ -9558 -526 -4164 -17359 25268 -10261 -22078 36689 -8117 -17874 27242 -4014 -9511 6509
185F509r38n724j6558L3596j1574l6059N7942k1492l6469O2796k9558k2643M8664
$$ 6509 5571 -153 -16711 16885 5311 -30748 27194 5702 -30767 32029 2471 -20172 28492
198B8492k7392o880J8676j2741O608j1274P413N514l0371K9186k490l2251L6746
$$ 28492 1100 -5780 12896 155 6763 -4511 2902 8416 -21955 7231 4741 -27510 9236
211I236j6503j4285L2992k7321Q794J5992k7534K8154l473j8458L0353j7528q88
$$ 9236 -7267 -21552 11440 -15881 -7087 8905 -18629 9525 6052 -12406 17947 419 -469
224d69J8228k0197J2859m609q792K0055k5944R061J4405l5756K7284P21l1441
$$ -469 17759 -2438 10421 5812 -2980 17075 -8869 192 14597 -21159 6125 6846 -24595
237b4595L4841j2669j4976K8584j9491L774J0844j3761J7171j2594M32J8738k8334
$$ -24595 10246 -2423 -17399 11185 -8306 -4532 6312 -7449 9722 -2872 -2440 16298 -12036
250a2036J8134P865l2102K9734p419k0537K9189k0467j641J7089k0987J5365k778
$$ -12036 6098 13963 -18139 11595 4176 -16361 12828 -7639 -9280 7809 -13178 2187 -591
263e91j0893K2903j9488N743J8160k7617K0178L852k1830K4991j2432n679J7475
$$ -591 -11484 11419 -8069 -2326 15834 -11783 8395 12247 -9583 15408 2976 -2703 14772
276A4772k2129J2476J570k0666K4756j5266r761K5519k4240N154J4105k1344J6364
$$ 14772 -7357 5119 6689 -13977 10779 -4487 -14248 11271 -12969 -7815 6290 -15054 1310
289A310l205o887J7781j9029J1621R613k5592K6310m432k0051K8770j5998n996
$$ 1310 -1895 -8782 8999 -10030 1591 11204 -14388 11922 7490 -12561 16209 211 -5785
302e785J8760j9563R900R85j2116J8553j6792K092J7087k6172J7002N806k3902
$$ -5785 12975 -6588 3312 4297 -7819 10734 -6058 -3966 13121 -13051 3951 9757 -14145
315a4145K4412q248j0751K0686j8589O032P729j8657J7997r314q415K0524k0926
$$ -14145 10267 2019 -8732 11954 -6635 -603 7126 -11531 6466 -2848 -11263 9261 -11665
328a1665O655J1730k2984J9604j899j4073K2988j4832J150J5643j8840J4703N77
$$ -11665 -5010 6720 -16264 3340 1441 -12632 10356 -4476 -3326 12317 -6523 8180 8757
341H757j3126K0333j5041RJ5965k4443J3147M472k2246J9787q542j0234J6606
$$ 8757 -4369 15964 923 932 16897 -7546 5601 10073 -12173 7614 -928 -11162 5444
354E444j6199O429L762j5155K0313j1797o099K4005k2139O263J6973k2306J4778
$$ 5444 -10755 -4326 -564 -15719 4594 -7203 -13302 10703 -11436 -5173 11800 -10506 4272
367D272K993j2319J5804j1434M225P888j9268J9386m668j7393K5471j5626p187
$$ 4272 7265 -5054 10750 -684 3541 11429 -7839 11547 6879 -10514 14957 -669 -7856
380g856J9972j8487N581M494j2057J4480j1937M98J4754k3547J3846Q961k4531
$$ -7856 12116 -6371 -790 3704 -8353 6127 -5810 -5312 9442 -14105 -259 8702 -15829
393a5829K0061j985j4283J7629j0187J963N419j2051J6567r253n918K2169k1024
$$ -15829 4232 2247 -12036 5593 -4594 -2631 2788 -9263 7304 -1949 -7867 14302 -6722
406f722L902J8342k2606J2037N400j4963J4955q792j068J0126j7548J2631m77
$$ -6722 -2820 15522 -7084 4953 10353 -4610 10345 1553 485 10611 -6937 5694 5217
419E217j6964J9322j1061o839J6727j7354O450N538j4695J7735r649n182K0548
$$ 5217 -11747 7575 -3486 -10325 6402 -10952 -4502 1036 -13659 4076 -5573 -10755 9793
432I793j9146P013J3438k0572J5015J730j1565J5313j0921K514P779j5572J4629
$$ 9793 -9353 -2340 11098 -9474 5541 7271 -4294 11019 98 2612 10391 -5181 9448
445I448n676j1660J9905j6098j433J5603k1288J0730N458j8008J7309p179o064
$$ 9448 3772 -7888 12017 -4081 -5514 10089 -11199 -469 4989 -13019 4290 -2889 -8953
458h953J5360j3919N430M827j1479J4445p702l649J4732j7251R938P391j9924
$$ -8953 6407 -7512 -2082 2745 -8734 5711 -1991 -5640 9092 -8159 1779 9170 -10754
471a0754J8431m148j2648K1853j4183k615J4676j5247P838K387j0373J1503r553
$$ -10754 7677 3529 -9119 12734 -1449 -4064 10612 -4635 3203 5590 -4783 6720 -2833
484b833K967P420j7485J4174j829j4414K0387j2827n332J8477j8846P507Q694
$$ -2833 134 7554 -9931 4243 2414 -12000 8387 -4440 -9772 8705 -10141 -2634 6060
497F060j7819J5467j639r511J5080j0257K539O675j0084J1780p449k903J4506
$$ 6060 -11759 3708 2069 -7442 7638 -2619 -80 6595 -3489 8291 842 -2061 12445
510A2445j8487Q357R190k3621J8326M41j9915K0719q079r551J5208r870J578K796
$$ 12445 -6042 2315 11505 -12116 6210 6651 -13264 7455 -624 -10175 5033 -4837 -3259 -463
524d63n205R283r892M800Q898j7875J5243K313j8120K1451p781j0508K0498j5415
$$ -463 -5668 3615 -6277 -1477 7421 -10454 4789 7102 -11018 10433 2652 -7856 12642 -2773
538b773L62J2491j6151Q615J063q999J0340p850K406L991j1126J2654n900o863
$$ -2773 -2411 10080 -6071 2544 3607 -5392 4948 -2902 -496 3495 -7631 5023 -877 -7740
552g740J7050j6897L458J4540k1933J2957O075j9881J8126k925j0930J3881o879
$$ -7740 9310 -7587 -4129 10411 -11522 1435 7510 -12371 5755 2830 -8100 5781 -1098
565a098J48K904m412Q709j0598M297J0900k0931J4090O372k2051J9560k408j5826
$$ -1098 -950 1954 -2458 6251 -4347 -50 10850 -10081 4009 10381 -11670 7890 5482 -10344
579a0344J9320r737n056J1827j1743M866J213o705Q917q330L468N360j2638J3829
$$ -10344 8976 -761 -5817 6010 -5733 -867 346 -6359 2558 -5772 -2304 3056 -9582 4247
593D247l658r960K0038j3886k232J9434j9876O557J1030j7908J0598K185r394
$$ 4247 589 -9371 10667 -3219 -5451 13983 -5893 664 11694 -6214 4384 6569 -2825
606b825P933n949K438k58o571J2076j1763k225J6172j9400O222J2405k1305J3928
$$ -2825 5108 -841 1597 1339 -5232 6844 -4919 -7144 9028 -10372 -4150 8255 -13050 878
620H78L439j4996J5645n374m883J1143r062M987J209o079J0008q635J898P653
$$ 878 4317 -10679 4966 -408 -5291 5852 -3210 1777 2986 -3093 6915 -1720 178 7831
634G831j4698J2198L82j4460J8140r193p856J8362j5019N2J2001j4336O806J954
$$ 7831 -6867 5331 5713 -8747 9393 200 -7656 10706 -4313 -4261 7740 -6596 210 2164
648B164o931O574o366M488J032r852J4328p686o982J8731j5223l1J5517j7200
$$ 2164 -4767 1807 -4559 -71 961 -8891 5437 -2249 -9231 9500 -5723 -5754 9763 -7437
662g437P937O576j3112J1423l006m108R085r541N582J224q331J1346q848j402
$$ -7437 500 7076 -6036 5387 2381 -1727 7358 -2183 3399 4623 -3708 7638 -1210 -2612
676b612J0952j5666P957M492j6272J5014l745j0825J6145j0128j860J0621j0417
$$ -2612 8340 -7326 631 5123 -11149 3865 120 -10705 5440 -4688 -6548 4073 -6344
689f344O212O27m660R557r155M448O253j3588J3471j579j1820J6642r270m661
$$ -6344 -132 495 -4165 5392 -3763 685 6938 -6650 6821 5242 -6578 10064 794 -3867
703c867J3458j3415M044N194j1302R663m483l984R532j0778M936L725j0622J1399
$$ -3867 9591 -3824 220 5414 -5888 3775 -708 -4692 4840 -5938 -1002 2723 -7899 3500
717C500m972m840J2602j2260M209P774j4227J1623l15j0273J3747p207k113R198
$$ 3500 -1472 -6312 6290 -5970 -1761 6013 -8214 3409 3094 -7179 6568 -639 -2752 6446
731F446r937O235K95o446J0337r059J108Q643j4040R167K837j3667J3923n648
$$ 6446 -3491 2744 3039 -3407 6930 -2129 -1021 7622 -6418 2749 5586 -8081 5842 194
745A94o504J2270j0498K278N243r730Q986l609m244J0932j1129M472O468j2436
$$ 194 -6310 5960 -4538 -2260 2983 -6747 2239 -1370 -5614 5318 -5811 -1339 5129 -7307
759g307J1160j218p886J2726q901J06Q967j1957P733R52r292J1468p188k304R258
$$ -7307 3853 2635 -5251 7475 -1426 -1320 7647 -4310 3423 4375 -4917 6551 -637 -2941 6317
774F317j1790O164K217r876J0946o350k765J0298j1922N664M859j1527J1372l101
$$ 6317 -5473 691 2908 -6968 3978 -2372 -5137 5161 -6761 -1097 3762 -7765 3607 506
788E06n838J1784r153K023O634j0807R331k110o081J1323j0125J365Q346j3231
$$ 506 -5332 6452 -2701 -678 5956 -4851 4480 2370 -3711 7612 -2513 -1148 7198 -6033
802f033Q706P12r713J1802p457j772Q965j1405O959J696r383J1165o183l129J0503
$$ -6033 2673 3385 -6328 5474 -1983 -3755 5210 -6195 764 2460 -6923 4242 -1941 -5070 5433
817E433j0590M837M758j0647J0768l953m817J1224j0078K724O364j1257R496j707
$$ 5433 -5157 -320 4438 -6209 4559 606 -4211 7013 -3065 -341 6023 -5234 4262 2555
831B555o736J0346q045M86O784j0967Q299p32q500J1755q007j492R702j1481N767
$$ 2555 -4181 6165 -1880 -1394 5390 -5577 2722 1990 -6510 5245 -2762 -4254 5448 -6033 -266
846b66K799r241J0102n121k223R507j0716N619M274j0793J1125l711n372J1050
$$ -266 2533 -6708 3394 -1727 -3950 5557 -5159 460 4734 -6059 5066 1355 -4017 7033
860G033q953K170N599j0071Q536k221o321J0592r440J238P420j1910P950k17q194
$$ 7033 -1920 250 5849 -4222 4314 2093 -4228 6364 -3076 -1838 5582 -6328 1622 1405 -6789
875f789J0592p066m74Q198j0895O867J750q928J0958n231k913R710r252M240L732
$$ -6789 3803 -3263 -3737 4461 -6434 433 2183 -6745 4213 -1018 -3931 5779 -3473 767 4499
890D499q900R824m415l352R661j0140L473N889j1825Q835r55p641R889p378J79
$$ 4499 -4401 5423 1008 -2344 7317 -2823 650 6539 -5286 3549 2594 -5047 4842 -2536 -2357
905b357N807r582P474j049o942J0809p965k53Q754j0689O471K494r036J0682m991
$$ -2357 3450 -6132 1342 293 -6649 4160 -3805 -4058 4696 -5993 478 2972 -6064 4618 -373
920c73k425R532j0132N015L687r543R635l492m518Q888q817L159L639r447R423
$$ -373 -2798 6734 -3398 1617 5304 -4239 5396 1904 -2614 6274 -2543 616 4255 -5192 4231
935D231m341n528J1558j0144R31Q011j1230O709J283p613R063n307k12O108q473
$$ 4231 -110 -5638 5920 -4224 -3293 4718 -6512 197 1480 -6133 2930 -2377 -2589 3519 -4954
950d954P041j67o774J0845o967j581R764j1041N029M304j0420R673l086m949R190
$$ -4954 2087 1920 -4854 5991 -976 -2557 7207 -3834 1195 5499 -4921 4752 1666 -3283 5907
965E907q682K436M420q814P272k245m866Q889q458K620M950j0686R833j601q220
$$ 5907 -2775 -339 4081 -4733 2539 294 -4572 4317 -4141 -1521 3429 -7257 2576 975 -7245
980g245J2367p737j309R316r759M828L072p289P874m136q28O090q347N777J033
$$ -7245 5122 -2615 -3924 5392 -4367 461 3533 -3756 4118 -18 -846 5244 -3103 2674 3707
995C707q405J0636n972l958J0567j0499K673N875j0608P824r86o525Q736o117
$$ 3707 -4698 5938 -34 -3992 6575 -3924 -1251 4624 -5984 1840 854 -5671 3065 -3052
1009c052N47N030p732P051j984m393R521q198J978P534j1547P877J513r669J1051
$$ -3052 -2505 2525 -5207 1844 -140 -4533 4988 -3210 -1232 6302 -5245 2632 4145 -5524 5527
1024E527m276m521Q889p846K402K914o614O565m273j420O943r527N619K393r867
$$ 5527 1251 -3270 5619 -2227 175 3089 -3525 3040 -1233 -2653 4290 -5237 382 2775 -7092
1039g092J0643l702o005J1665q723N70P761r898N894J320o107P430m647k7M955
$$ -7092 3551 -151 -6156 5509 -3214 -2644 5117 -4781 1113 2433 -3674 3756 -891 -918 4037
1054D037p520O482j394n547J0071q123l19Q914j1601N539L876j0627R100k102
$$ 4037 -3483 2999 1605 -3942 6129 -1994 -2313 6601 -5000 539 4415 -6212 2888 786
1068G86n498Q280o440J698L243o171O345l424k124Q034r036M243M818j0796R686
$$ 786 -4712 3568 -2872 -1174 2069 -4102 2243 -1181 -3305 4729 -4307 -64 4754 -6042 3644
1083C644r70p663J0943o506j884P952q099L630J865n968O450m198m59N002q254
$$ 3644 2674 -4989 5954 -552 -2436 5516 -2583 1047 2912 -3056 3394 -804 -1263 3739 -4515
1098d515O408n42p388J0265o028l212J0637j0397L282N753r639P162l50n194P432
$$ -4515 1893 1351 -6037 4228 -1800 -5012 5625 -4772 -1490 4263 -5376 1786 1436 -3758 3674
1113C674n214J582L349o443P035l044l673Q891q315J529O489j0759O990J100q752
$$ 3674 -1540 42 3391 -3052 3983 939 -2734 6157 -2158 -629 5860 -4899 2091 3191 -5561
1128e561R435m232l544P616p199K770J900n849O784l696j115O048p944N453J975
$$ -5561 3874 -358 -3902 3714 -3485 -715 1185 -4664 2120 -1576 -2691 3357 -4587 866 2841
1143B841q602J0096l594m930J0352p919Q52O477q747N520J04m673O468n331P59
$$ 2841 -5761 4335 741 -4189 6163 -1756 -904 5573 -3174 2346 2450 -2223 4245 -1086 -327
1158c27L989p802O322j426n659R416p288q67Q067j0148N162K963q202P926k567
$$ -327 3662 -4140 2182 756 -4903 4513 -2775 -3642 4425 -5723 -561 2402 -5800 2126 -441
1173d41l376P522o344K454K852n903O732l180k124P410q025L291M330r452Q264
$$ -441 -3817 3705 -2639 -185 2667 -3236 3496 316 -1808 5602 -2423 868 5198 -4254 4010
1188D010j684o633R056n930r87O131p553M245N07n585O933m903l1N368p842N386
$$ 4010 2326 -4307 4749 -1181 -2168 3963 -3590 655 1162 -4423 2510 -2393 -2424 2944 -4898 488
1204D88R78o887Q960m312k357P892p761L260L662p375O715j734l633P041o239
$$ 488 1466 -5421 3539 -773 -3130 4762 -2999 261 3923 -3452 3263 1529 -2104 4937 -1302
1219a302J968L276p275O560k319l883P336p142J297N026q630O054r3o235Q046
$$ -1302 666 3942 -3333 3227 908 -2975 4361 -2781 -1484 3542 -5088 966 873 -5362 2684
1234B684m598j354O079o808M200J461n990P304l615j483O545p285L858K932p362
$$ 2684 -1914 -3268 2811 -3997 203 1664 -4326 2978 -637 -2120 4425 -2860 998 3930 -3432
1249c432P553l012l479P773o895J425L954p536N782j074m614O747n664P52M446
$$ -3432 4121 1109 -2370 5403 -1492 -67 3887 -3649 2133 1059 -3555 3192 -2472 -1720 2726
1264B726p512N753m06n392P932n164n01N934p558N092J279o058P514l685j800
$$ 2726 -4786 967 561 -4831 3101 -2063 -2564 3370 -4188 904 2183 -3875 3639 -46 -1846
1279a846O465o911L223K557o587O913k925l116O684o628K307K862p095O449k143
$$ -1846 4619 -2292 931 3488 -3099 3814 889 -2227 4457 -2171 136 2998 -4097 2352 209
1294B09l978P273o224P96M786p513N503k52n010P480m650m07N239o569M294J108
$$ 209 -3769 3504 -2720 -1924 2862 -4651 852 600 -4410 3070 -1580 -1987 3252 -3317 977 2085
1310B085n358P188m148j222O023o809L615K062o572O346k595k824O225o597J874
$$ 2085 -3273 3915 -233 -1455 4568 -2241 1374 3436 -3136 3210 615 -2209 4016 -2581 -707
1325g07L381o623N409j281l861O330n486J265M085o845N457k84m726P269m583
$$ -707 2674 -3949 1460 179 -3682 2648 -2838 -1573 2512 -4333 1124 840 -3886 3383 -1200
1340a200k04N458o704M438P90n392O815l680j809N780o650L193J757n836O140
$$ -1200 -1404 4054 -2650 1788 2578 -2814 4001 321 -1488 4292 -2358 835 2592 -3244 2896
1355B896l379k187O216o770K605L131o686N877j734l859O983n125N53M093o095
$$ 2896 -483 -2670 3546 -3224 -619 2512 -4174 1703 -31 -3890 3093 -2032 -1479 2614 -3481
1370c481M755l90l897O486m522K99M542o739N051J70n127O593l977j585N573o179
$$ -3481 1274 884 -3013 3473 -1049 -750 3792 -2947 2104 2274 -2853 3740 -237 -1822 3751 -2428
1386b428K747K031n800N783k463k624N428n403K288K146o066N958k217k871O807
$$ -2428 319 2350 -3450 2333 -130 -2754 2674 -2729 -441 1705 -4361 1597 -620 -3491 3316
1401C316n829J249M341o578N156k17m322O266l585o08M557n475L548K68m165N748
$$ 3316 -2513 -1264 3077 -3501 1655 1438 -2884 3382 -203 -811 3746 -1729 1819 2087 -2078 3670
1417C670m542l33M885o847L605J405n980N970k708k641N972n557J863K933n272
$$ 3670 -872 -1205 3680 -3167 438 1843 -4137 1833 -875 -3516 2456 -3101 -1238 1695 -3577
1432c577M818j141k401N202m630J832K830n713N670j193m197O757n071j89M908
$$ -3577 1241 100 -2301 2901 -1729 103 2933 -2780 2890 1697 -2500 4257 -814 -1003 3905
1447C905o179L270J131m984N058k846j138L837m739K834O45m338N649l393j156
$$ 3905 -2274 996 2127 -2857 2201 -645 -1783 2054 -2685 149 794 -3544 2105 -1288 -2444
1462b444N742o584L110K695o046N407j175l425N759m044J98L606m884M047r21
$$ -2444 3298 -3286 -176 2519 -3527 1880 705 -2720 3039 -1005 -807 2799 -2085 1962 1041
1477A041k796N145m701J353L176o046M663k95m940O698m102j590N307n726K105
$$ 1041 -1755 3390 -1311 42 3218 -2828 1835 1540 -3400 3298 -804 -2394 2913 -2813 -708
1492g08K222m907M689k066j452L927m389K916J098m443N636k564k002O215n529
$$ -708 1514 -3393 1296 -770 -2222 1705 -2684 232 1330 -3113 2523 -41 -2043 4172 -1357
1507a357J012M262o280M217K92m279N107l140l69K951m609L233o02l070M888m305
$$ -1357 -345 3917 -2363 1854 2146 -2133 2974 -166 -535 2416 -2193 1040 438 -2632 2256 -2049
1523b049J06M444o270M008J152n452O002k088k478N587m297J414K387m240L757
$$ -2049 -1943 2501 -3769 239 1391 -4061 1941 -147 -2625 2962 -1335 79 2466 -1774 1983
1538A983j437j392L779m585K419J841n591N317j538l799O422m924l22M640n655
$$ 1983 546 -846 2933 -1652 767 2608 -2983 2334 796 -3003 3419 -1505 -1827 2813 -2842
1553b842K820J014l856M519k645n82L653m431L274j87l613N599l833m90N084o010
$$ -2842 -22 992 -2864 1655 -990 -1572 2081 -2350 924 737 -2876 2723 -1110 -1600 3484 -2526
1569b526L091K378n882N003j093l049M731l169J24K443l708L540j736j970M379
$$ -2526 565 2943 -2939 2064 971 -2078 2653 -516 -392 2051 -1657 1883 147 -1823 2556
1584B556m589J551K840n818M658k65m646N806l224j264M608m442J944J813l747
$$ 2556 -2033 -482 2358 -3460 1198 933 -3713 2093 -1131 -2395 2213 -2229 -285 1528 -2219
1599b219M010j785p27L564m215K833N99m242N352k797k168N201m952J271L002
$$ -2219 1791 6 -721 2843 -1372 1461 2060 -2182 3170 373 -1795 3406 -1546 -275 2727
1614B727n495L740m55l287M226k789j13K542l779L222p47k356M895l824M77L873
$$ 2727 -2768 972 517 -2770 1456 -1333 -1446 1096 -2683 539 -208 -2564 2331 -1493 -1016 2857
1630B857n257L492R32m634N306j999k168M451m139J384J468l548L645j879j449
$$ 2857 -2400 1092 2024 -2610 2696 697 -1471 2980 -1159 225 1693 -1855 1790 -89 -1538
1645a538L659m596K350J637m690M796j782k553N318m264J73L840m853L030L46
$$ -1538 2121 -2475 -125 1512 -3178 1618 -164 -2717 2601 -1663 -1490 2350 -2503 527 873
1660H73l233M153k625L89K659l979L056j14l240N188l565o11M275n083K385J593
$$ 873 -2360 1793 -832 -443 2216 -1763 1293 1179 -2061 3127 -438 -1049 3226 -1857 528 2121
1676B121m747M576j689k448M471l818P90J963l867L386j164j951M046l928J381
$$ 2121 -2626 1950 261 -2187 2284 -1534 -744 1219 -2648 738 -426 -2377 1669 -2259 -878
1691h78L040n168M147p7l299N188l313k87L629m193K216J042l167L750k386p51
$$ -878 2162 -3006 1141 1064 -2235 2953 -360 -647 2982 -1211 1005 2047 -1120 2630 244 -507
1707e07K914m283K678N04l925M335k197k043M645m676J415K295m351L838q48k143
$$ -507 2407 -1876 802 1306 -2619 1716 -481 -2524 2121 -2555 -1140 1155 -3196 642 -206 -2349
1723b349L983l060R57K191l799L450l87k127L920l237J71L290m599K980M84l957
$$ -2349 1634 -1426 -469 1722 -2077 1373 986 -1141 2779 -458 -287 3003 -1596 1384 1868 -2089
1739b089M458k488j053L479m247J838J105l438L631j811j099L562m077J598K071
$$ -2089 2369 -119 -1172 2307 -1940 -102 1003 -2435 1196 -615 -1714 1848 -2229 -631 1440
1754A440m200M144j625k141M959l788Q22K612m203L445l58k544L854k813J09K960
$$ 1440 -2760 1384 -241 -2382 2577 -1211 -389 2223 -1980 1465 1107 -1437 2417 -396 -287 2673
1770B673l994K667j32l075M158k835o25L514m431K386P69l857M206k397j145L861
$$ 2673 -1321 1346 1214 -1861 2297 -538 -1163 2351 -2080 306 1075 -2782 1424 -973 -2118 1743
1786A743l859J690J553l616L560j162j538L860l198R50K277l842L464n24k825
$$ 1743 -2116 -426 1127 -2489 1071 -91 -1629 2231 -967 -17 2260 -1582 1882 1358 -1467
1801a467M329l246J60K666m144K790q2l143L761k157j092L349l838K094Q30l508
$$ -1467 2862 -384 -224 2442 -1702 1088 1006 -2137 1624 -533 -1625 1724 -2114 -20 810 -2698
1817b698L862k114r36L621l708J572K038l678L174o15k166M232l251O39K351l724
$$ -2698 1164 -950 -1886 1735 -1973 -401 1637 -2041 1133 518 -1648 2584 -667 -28 2323 -1401
1833a401L093q16k275L667l022N37K168l958K823k1k847L841k680n64L190m033
$$ -1401 1692 876 -1399 2268 -754 -217 1951 -2007 816 795 -2052 1789 -891 -1455 1735 -2298
1849b298K302J070l716L904j820q70L209l430J696J392l272L359j050j828L804
$$ -2298 4 1074 -2642 1262 -558 -1428 1781 -1649 47 1439 -1833 1526 476 -1352 2452
1864B452l272R29K309m025K984m97k492L779k780p65L092l621K358J90l070L853
$$ 2452 -820 109 2418 -1607 1377 880 -1612 2167 -613 -1378 1714 -1907 451 641 -2429 1424
1880A424k654R8K563l572K398O21l252M255j988j392L895l796J491J699l318L026
$$ 1424 -1230 -1132 1431 -2141 257 878 -2374 1881 -107 -1499 2396 -1400 91 1790 -1528 1498
1896A498j160j154L084l152J212J556l593L062j056k072M137l608M71K503l887
$$ 1498 338 -816 2268 -884 328 1884 -1709 1353 297 -1775 2362 -1246 -775 1728 -2159
1911b159K620J1l040M028k228m63K519l101K183M18k547L697k267m57L372m025
$$ -2159 461 472 -2568 1460 -768 -1231 1288 -1813 370 788 -1759 1938 -329 -786 2586 -1439
1927a439J869J604l872L798j295k184L650k858M25K163l632K774p34j954L143
$$ -1439 430 2034 -1838 1960 665 -1519 2131 -727 -302 1861 -1771 1003 269 -1685 1458
1942A458l105R12J941l712L276m58k576M167k861l26L521l863K008R68k770L008
$$ 1458 -1647 -735 1206 -2506 770 312 -2264 1903 -958 -1284 2237 -1626 382 1350 -1420 1588
1958A588j235j118K993l107J801O66l369L703j740j413L434l985J409J873l908
$$ 1588 353 -765 2228 -879 922 1588 -1781 1922 182 -1231 2203 -1782 -373 1500 -2408
1973b408L233p13k288L306k394J00K499l175K288j49j941L329k186P8K350l665
$$ -2408 825 112 -2176 1130 -1264 -1164 1335 -1840 448 299 -1642 1687 -499 -421 1929 -1736
1989a736K687N10l098L799j994j117L490l684J428J177l134K678p65j465K577
$$ -1736 951 1461 -1637 2162 168 -949 2541 -1143 285 1462 -1672 1006 241 -1224 1353
2004A353k937J546R50l732L541j156j789L880l007L51K600l605K320O47k650L256
$$ 1353 -1584 -38 912 -2820 721 -435 -2224 1656 -1351 -1000 1600 -2005 315 962 -1688 1568
2020A568j682l79K395k863K060L30k727L613k525m84L114l904K022R07l468L279
$$ 1568 -114 -493 1902 -961 1099 1429 -1298 2315 -210 -694 2420 -1484 538 1445 -2023 1256
2036A256q87k343L211k727O95J750l160K725q60j200K929k702R14J959l533L321
$$ 1256 369 -1974 1237 -1490 -795 955 -2205 520 -340 -1540 1389 -1313 -399 1560 -1973 1348
2052A348m96k688M178k532m93L154l680K020M84k590K854j335j083K460l020J843
$$ 1348 852 -1836 2342 -190 -683 2471 -1209 811 1295 -1295 1559 224 -859 1601 -1419 424
2068D24J99k543L215j856j213L454l570J572J516l571L194n45k051L080k227M69
$$ 424 623 -1920 1295 -561 -1774 1680 -1890 -318 1198 -2373 821 276 -1775 1305 -922 -453
2084d53J800k684K487n96j629L060k775N41K261l394K521R1k696L460k225r70
$$ -453 1347 -1337 1150 554 -1075 1985 -790 -249 2012 -1382 1139 1230 -1466 1994 -231 -1201
2100a201L026l227J520P87k818K534j045r31K650k903J368J045k967L314j025
$$ -1201 1825 -1402 118 905 -1913 621 -424 -1355 1295 -1608 -240 805 -2162 1152 127
2115A27j810L745l029M96K486l536K766m92k028L095j991j63K075k747J888l04
$$ 127 -1683 2062 -967 -471 2015 -1521 1245 753 -1275 1820 -171 -334 1741 -1006 882 578
2131E78k029L213k478j55K364l287J631R06k990L351j241j578L164k639J093J333
$$ 578 -1451 1762 -716 -871 1493 -1794 -163 743 -2247 1104 -137 -1715 1449 -1190 -97 1236
2147A236k697K662j066q87K570k435P30J563l190K937n76k062L107k507K5K065
$$ 1236 -1461 1201 135 -752 1818 -617 113 1676 -1514 1423 847 -1215 1892 -615 -590 1475
2163A475l014J838M12k321K842j694m04K134k875J525P82k484L184k022n37K824
$$ 1475 -1539 299 711 -1610 1232 -462 -866 1268 -1607 -82 700 -1784 1400 -622 -1159 1665
2179A665l184J021J927l016K789p62j662K989k299O50J429k910K782r82j759L015
$$ 1665 -1519 -498 1429 -1587 1202 440 -1222 1767 -532 118 1547 -1363 1419 437 -1322 1693
2195A693k849N53J998l324K570k93k446L300j817m94K678l157J462J047k508K963
$$ 1693 -1156 -603 1395 -1929 641 348 -2098 1202 -615 -1109 1569 -1588 -126 921 -1587 1376
2211A376j484n76K451k706J198J216k798K971j359j406K983k595M50J629l206
$$ 1376 -108 -684 1767 -939 259 1475 -1323 1648 289 -1117 1866 -729 -279 1350 -1856
$$ [...]
8191A89
##END NTUPLES=NMR FID
##END=
