##TITLE=1H_86-2021
 CDCl3, 8 sc, 
 31.8.2021
##JCAMPDX= 6.0         $$ Bruker NMR JCAMP-DX V2.0
##DATA TYPE= NMR FID
##DATA CLASS= NTUPLES
##ORIGIN= UXNMR, Bruker Analytische Messtechnik GmbH
##OWNER= root
$$ XWIN-NMR		Version 3.5
$$ Tue Aug 31 10:07:07 2021 Russian Standard Time (UT+4h)  she@DPX200
##.OBSERVE FREQUENCY= 200.131506
##.OBSERVE NUCLEUS= ^1H
##.DELAY= (6, 6)
##.ACQUISITION MODE= SIMULTANEOUS
##.ACQUISITION SCHEME= undefined
##.AVERAGES= 8
##.DIGITISER RES= 18
##SPECTROMETER/DATA SYSTEM= spect
##.PULSE SEQUENCE= zg30
##.SOLVENT NAME= CDCl3
##.SHIFT REFERENCE= (INTERNAL, CDCl3, 0, 15.7039)
##AUDIT TRAIL= $$ (NUMBER, WHEN, WHO, WHERE, WHAT)
$$ ##TITLE= Audit trail, XWIN-NMR		Version 3.5
$$ ##JCAMPDX= 5.01
$$ ##ORIGIN= Bruker BioSpin GmbH
$$ ##OWNER= she
$$ F:/spectra/data/she/nmr/H-F/1/audita.txt
$$ ##AUDIT TRAIL=  $$ (NUMBER, WHEN, WHO, WHERE, WHAT)
(   1,<2021-08-31 10:05:20.06 +0400>,<she>,<DPX200>,
      <created by zg, POWCHK disabled, PULCHK disabled
       terminated by command 'halt'
       configuration hash MD5:
       00 E9 B6 7A A2 85 ED C7 34 08 36 98 17 FE 4E 26
       data hash MD5: 16K
       F7 C6 5D 2C 0D 85 9F CD 26 D9 0A ED 0D 39 33 04>)
$$ ##END=
$$ 
$$ hash MD5
$$ CF 8D 65 5F B2 6E ED D8 96 76 F7 3A B3 56 BD 89
##$RELAX= 
##$RELAX= 
##$RELAX= 
##$RELAX= 
##$RELAX= 
##$RELAX= 
$$ Bruker specific parameters
$$ --------------------------
##$DU= <F:/spectra>
##$EXPNO= 1
##$NAME= <H-F>
##$PROCNO= 1
##$TYPE= <nmr>
##$USER= <she>
##$AMP= (0..31)
100 100 100 100 100 100 100 100 100 100 100 100 100 100 100 100 100 100 
100 100 100 100 100 100 100 100 100 100 100 100 100 100 
##$AQSEQ= 0
##$AQ_mod= 1
##$AUNM= <au_zg>
##$AUTOPOS= <>
##$BF1= 200.13
##$BF2= 200.13
##$BF3= 200.13
##$BF4= 200.13
##$BF5= 200.13
##$BF6= 200.13
##$BF7= 200.13
##$BF8= 200.13
##$BYTORDA= 1
##$CFDGTYP= 0
##$CFRGTYP= 5
##$CHEMSTR= <none>
##$CNST= (0..31)
1 1 145 1 1 1 1 1 1 1 1 1 1 1 1 1 1 1 1 1 1 1 1 1 1 1 1 1 1 1 1 1 
##$CPDPRG= <>
##$CPDPRG1= <>
##$CPDPRG2= <>
##$CPDPRG3= <>
##$CPDPRG4= <mlev>
##$CPDPRG5= <mlev>
##$CPDPRG6= <mlev>
##$CPDPRG7= <mlev>
##$CPDPRG8= <mlev>
##$CPDPRGB= <>
##$CPDPRGT= <>
##$D= (0..31)
0 1.2 0 0 0 0 0 0 0 0.06 0 0.03 0 0 0 0 0.0002 0 0 0 0 0 0 0 0 0 0 0 0 
0 0 0 
##$DATE= 1630389919
##$DBL= (0..7)
120 120 120 120 120 120 120 120 
##$DBP= (0..7)
150 150 150 150 150 150 150 150 
##$DBP07= 0
##$DBPNAM0= <>
##$DBPNAM1= <>
##$DBPNAM2= <>
##$DBPNAM3= <>
##$DBPNAM4= <>
##$DBPNAM5= <>
##$DBPNAM6= <>
##$DBPNAM7= <>
##$DBPOAL= (0..7)
0.5 0.5 0.5 0.5 0.5 0.5 0.5 0.5 
##$DBPOFFS= (0..7)
0 0 0 0 0 0 0 0 
##$DE= 6
##$DECBNUC= <off>
##$DECIM= 32
##$DECNUC= <off>
##$DECSTAT= 4
##$DIGMOD= 1
##$DIGTYP= 9
##$DL= (0..7)
0 120 120 120 120 120 120 120 
##$DP= (0..7)
150 150 150 150 150 150 150 150 
##$DP07= 0
##$DPNAME0= <>
##$DPNAME1= <>
##$DPNAME2= <>
##$DPNAME3= <>
##$DPNAME4= <>
##$DPNAME5= <>
##$DPNAME6= <>
##$DPNAME7= <>
##$DPOAL= (0..7)
0.5 0.5 0.5 0.5 0.5 0.5 0.5 0.5 
##$DPOFFS= (0..7)
0 0 0 0 0 0 0 0 
##$DQDMODE= 0
##$DR= 18
##$DS= 0
$$ [...]
##$SUBNAM2= <"">
##$SUBNAM3= <"">
##$SUBNAM4= <"">
##$SUBNAM5= <"">
##$SUBNAM6= <"">
##$SUBNAM7= <"">
##$SUBNAM8= <"">
##$SUBNAM9= <"">
##$SW= 20.0188882624521
##$SWIBOX= (0..15)
0 0 2 0 0 0 0 0 0 0 0 0 0 0 0 0 
##$SW_h= 4006.41025641026
##$TD= 16384
##$TD0= 1
##$TE= 0
##$TE2= 300
##$TE3= 300
##$TEG= 300
##$TL= (0..7)
0 120 120 120 120 120 120 120 
##$TP= (0..7)
150 150 150 150 150 150 150 150 
##$TP07= 0
##$TPNAME0= <>
##$TPNAME1= <>
##$TPNAME2= <>
##$TPNAME3= <>
##$TPNAME4= <>
##$TPNAME5= <>
##$TPNAME6= <>
##$TPNAME7= <>
##$TPOAL= (0..7)
0.5 0.5 0.5 0.5 0.5 0.5 0.5 0.5 
##$TPOFFS= (0..7)
0 0 0 0 0 0 0 0 
##$TUNHIN= 0
##$TUNHOUT= 0
##$TUNXOUT= 0
##$USERA1= <user>
##$USERA2= <user>
##$USERA3= <user>
##$USERA4= <user>
##$USERA5= <user>
##$V9= 5
##$VALIST= <valist>
##$VCLIST= <CCCCCCCCCCCCCCC>
##$VD= 0
##$VDLIST= <DDDDDDDDDDDDDDD>
##$VPLIST= <PPPPPPPPPPPPPPP>
##$VTLIST= <TTTTTTTTTTTTTTT>
##$WBST= 1024
##$WBSW= 4
##$XGAIN= (0..3)
0 0 0 0 
##$XL= 0
##$YL= 0
##$YMAX_a= 454155
##$YMIN_a= -558421
##$ZGOPTNS= <>
##$ZL1= 120
##$ZL2= 120
##$ZL3= 120
##$ZL4= 120
##$ABSF1= 10
##$ABSF2= 0
##$ABSG= 5
##$ABSL= 3
##$ALPHA= 0
##$AQORDER= 0
##$ASSFAC= 0
##$ASSFACI= 0
##$ASSFACX= 0
##$ASSWID= 0
##$AUNMP= <proc_1d>
##$AZFE= 0.1
##$AZFW= 0.1
##$BCFW= 1
##$BC_mod= 2
##$BYTORDP= 1
##$COROFFS= 0
##$CY= 11.3945322036743
##$DATMOD= 1
##$DC= 2
##$DFILT= <>
##$DTYPP= 0
##$F1P= 2.36226072786647
##$F2P= -0.459571619588291
##$FCOR= 0.5
##$FTSIZE= 0
##$FT_mod= 4
##$GAMMA= 1
##$GB= 0.15
##$INTBC= 1
##$INTSCL= 1
##$ISEN= 128
##$LB= 0.24
##$LEV0= 0
##$LPBIN= 0
##$MAXI= 10000
##$MC2= 0
##$MEAN= 0
##$ME_mod= 0
##$MI= 1.114404
##$NCOEF= 0
##$NC_proc= 0
##$NLEV= 6
##$NOISF1= 3.799351
##$NOISF2= 2.8
##$NSP= 1
##$NTH_PI= 0
##$NZP= 0
##$OFFSET= 15.70392
##$PC= 1
##$PHC0= -13363.4
##$PHC1= 15.60099
##$PH_mod= 1
##$PKNL= yes
##$PPARMOD= 0
##$PSCAL= 0
##$PSIGN= 0
##$REVERSE= no
##$SF= 200.130013532006
##$SI= 16384
##$SIGF1= 3
##$SIGF2= 2
##$SINO= 400
##$SIOLD= 16384
##$SREGLST= <1H.CDCl3>
##$SSB= 0
##$STSI= 0
##$STSR= 0
##$SW_p= 3612.71676300578
##$SYMM= 0
##$S_DEV= 0
##$TDeff= 0
##$TDoff= 0
##$TI= <>
##$TILT= no
##$TM1= 0
##$TM2= 0
##$TOPLEV= 0
##$USERP1= <user>
##$USERP2= <user>
##$USERP3= <user>
##$USERP4= <user>
##$USERP5= <user>
##$WDW= 1
##$XDIM= 8192
##$YMAX_p= 0
##$YMIN_p= 0
$$ End of Bruker specific parameters
$$ ---------------------------------
##NTUPLES= NMR FID
##VAR_NAME=  TIME,          FID/REAL,        FID/IMAG
##SYMBOL=    X,             R,               I
##VAR_TYPE=  INDEPENDENT,   DEPENDENT,       DEPENDENT
##VAR_FORM=  AFFN,          ASDF,            ASDF
##VAR_DIM=   8192,          8192,            8192
##UNITS=     SECONDS,       ARBITRARY UNITS, ARBITRARY UNITS
##FACTOR=    0.0002496,     1,               1
##FIRST=     0,             0,               0
##LAST=      2.0444736,     0,               0
##MIN=       0,             -558421,         0
##MAX=       2.0444736,     454155,          0
$$ Real data points
##PAGE= N=1
##DATA TABLE= (X++(R..R)), XYDATA
0 0 0 0 0 0 0 0 0 0 -8 8 -8 8 -16 16 -24 32 -38 48 -56 68 -80 96 -113 136 -160 186 -217 252 -290 333 -381
31 -381 436 -494 561 -634 715 -803 900 -1008 1124 -1252 1392 -1545 1712 -1893 2092 -2310
47 -2310 2546 -2807 3092 -3406 3751 -4134 4559 -5036 5571 -6178 6872 -7677 8621 -9745
61 -9745 11113 -12822 15018 -17965 22147 -28575 39820 -65191 245737 -188087 -254690 454155
73 454155 -104857 -104175 359687 -18621 -322120 148080 96406 -133197 106024 52655 -298008
84 -298008 -25956 164087 -41357 -74517 -77189 -74122 39039 -80500 -14084 104226 -147854
95 -147854 -134054 102852 -7338 -34928 23974 -90742 -64687 62806 -18323 -67948 33077
106 33077 -36028 -127842 16073 11619 -42923 23054 -141500 -102909 152757 -84204 -142794
117 -142794 145562 -78256 -190550 132229 51205 -115909 42237 -2939 -105976 107550
127 107550 113782 -128104 -362 116500 -63975 31831 108003 -58646 23011 22645 -53038
138 -53038 140447 22489 -162392 94863 84133 -123364 46094 74727 -124904 10005
148 10005 120798 -109682 -46777 155721 -86903 -97126 187198 -20167 -139402 121888
158 121888 56906 -59406 45623 22988 -3174 46355 35854 14209 3367 23035 33833
169 33833 12263 21963 24675 -2745 -27314 25189 71300 -49181 -55579 65718 -23443 -37497
181 -37497 50742 -51124 -34127 40955 -52517 -9539 40899 -63162 -31053 43863 -19262 -36851
193 -36851 20988 -14404 -38158 49502 -11830 -80329 67637 18599 -97104 52863 23188
204 23188 -88684 37700 26273 -61366 6946 3862 -37097 11249 19099 -42564 -32021 33074
216 33074 -5338 -24255 22049 -27875 -14401 40434 -20091 5871 26850 -42637 17967 48349
228 48349 -14292 5197 8554 -741 26499 18909 3246 -5434 10699 22495 -679 18050 7126
241 7126 -20297 22233 12758 -547 15011 -24122 7993 33683 -20615 7412 11392 -21351 23484
254 23484 16078 -13834 4868 4843 6333 6105 10655 3776 -20074 19967 21778 -19401 12930 -3045
268 -3045 -16068 31172 -6177 -18117 11074 -18017 1003 12601 -19951 -11627 -11147 -4553 1512
281 1512 -16197 -9507 -22703 -13911 14192 -23685 -19518 -3502 -30207 3348 2522 -31512 -6679
294 -6679 -14622 -11190 9707 -17582 -13440 -8151 -8753 12602 -9481 -10911 749 -11848 15794 7415
308 7415 -16946 8494 -1571 6068 22999 -8007 2865 8746 3142 27082 3195 -3781 15375
321 15375 2668 21348 15733 -7948 12661 5624 11582 23384 -7695 3555 9665 2486 23202
334 23202 -1852 -8114 11440 -2947 14550 8057 -17286 6234 -799 1632 14671 -16611 -6263
347 -6263 4320 -5020 11797 -9894 -14779 4822 -8404 7922 209 -22748 3583 -2168 -2182 9859
361 9859 -18767 -6948 5578 -4129 10550 -9691 -12643 9790 -4438 8311 4877 -18877 5745
374 5745 5610 1135 9103 -12526 -1217 7131 459 14232 -10912 -9992 15539 -4930 7521 7497
388 7497 -21131 7131 10597 -4054 7138 -7955 -5630 6233 5046 8464 -14422 -4850 13921
401 13921 -8190 10434 3833 -24706 14135 9565 -10987 11709 -7478 -9920 12335 4561 2001
414 2001 -8398 -3738 9890 -713 10027 -3072 -16990 18252 4668 -7201 13152 -11074
426 -11074 -3397 15231 -2010 5636 -5251 -10850 14001 1970 -619 -1877 -16444 8926 7240
439 7240 -11618 -2700 -8477 -4037 -1672 -4777 2312 -21107 -10984 12030 -15781 -1144 -1251 -33659
453 -33659 13031 14792 -30544 -1227 5569 -15103 4124 9174 -10978 -13092 11510 2997 -10812
466 -10812 21267 -10079 -31468 36729 11023 -30694 15280 -4392 -14043 26070 -3369 -17714
478 -17714 7365 -543 -6174 10692 11584 -19121 -11491 25082 2065 -1390 10723 -18934 12999
491 12999 29155 -17258 9222 20084 -11954 10966 16908 5668 6922 -4245 8287 15237 2339
504 2339 1221 -1612 9796 8890 -9177 290 5523 9011 -1006 -20325 17374 10584 -26634 22660
518 22660 12715 -30203 16263 10009 -9684 29364 -2707 -31936 25008 33806 -16555 -5694 22808
531 22808 -16286 -3733 40911 -18869 -18283 26954 -36874 -4661 56309 -43925 -47326 34735
543 34735 -10729 -27027 16676 -17996 -39813 10894 6760 -35183 7091 9211 -54446 4093
555 4093 41859 -33143 -18911 15004 -7217 5050 -549 -6542 9990 -5867 -1395 7730 -5092
568 -5092 7009 71 -14445 9534 10880 -17496 -12845 23282 4528 -34744 7090 15921 -17334
581 -17334 12962 -4378 -23184 30481 -1134 -21868 35262 -114 -27556 27114 18141 -7153
593 -7153 13744 1176 -13756 32547 26694 -37965 8335 42650 -34461 28 44723 -33057
605 -33057 -10794 27204 -24319 5334 18582 -38780 -5445 28935 -16888 -21289 12751 -3739
617 -3739 -13665 15603 -8791 -16427 29650 -11635 -22217 45610 -5947 -37447 37159 15747 -20088
630 -20088 11444 3462 -5309 13837 8568 -12042 -7473 15349 -918 -15594 10382 2670 -20752
643 -20752 -9124 14862 9649 -31702 -12172 28226 -18931 -11638 26368 -28778 -10615 37786
655 37786 -20387 -14725 33839 -12495 -23156 32365 14360 -29464 7363 20259 -15755 13427
667 13427 10487 -31789 20671 19098 -36009 16465 15635 -35130 12263 17859 -22925 1991 8780
680 8780 -16388 4855 21475 -19151 -17111 31806 2300 -20099 21840 1087 -11603 22484
692 22484 2330 -1743 11200 -8197 7968 16472 -3098 1148 -2991 1232 15780 -518 -10495
705 -10495 -827 5378 -2005 -5196 7932 -8546 -15866 11380 -2066 -7398 5114 -19747 -1796
718 -1796 16829 -16946 -4055 6217 -15321 4280 6145 -14366 -512 6157 -9687 -6745 11791
731 11791 -6542 -19203 17539 1686 -26380 11980 222 -18953 17331 -6435 -24742 11322
743 11322 2945 -10195 2130 -3681 -11592 -1817 11634 -938 -11287 113 -7230 3289 18649
756 18649 -11212 -9316 6532 -4413 12196 9432 -11398 742 304 4165 16457 -1682 -6097
769 -6097 973 4077 12048 4104 -1050 -880 -569 12815 4723 -432 7743 -6257 3795 14105 -4633
784 -4633 4854 5335 -6049 10427 2736 -4640 9172 1409 -1158 3080 100 3004 2006 6235 -664
799 -664 -9030 9324 3233 -3508 11429 -7692 -9040 12868 1469 579 639 -9906 1403 3908
813 3908 2545 741 -11812 -2907 2515 -329 3796 -9809 -8416 1173 -4247 4929 -3448 -15314
827 -15314 2141 -876 -3348 3973 -9445 -5234 2232 -1644 3954 -5794 -5539 5281 -2287 2419
841 2419 731 -7443 3615 1165 497 1856 -9233 2464 4642 -5312 4626 -4813 -8126 7656
855 7656 215 -1707 -2254 -6652 4044 675 179 2392 -9897 2060 8284 -1942 3554 -2612 -2776
870 -2776 8181 1977 4453 731 -6592 9013 4774 -798 5310 -5174 589 7198 -300 2943
884 2943 -4685 -2771 7969 -2893 -18 245 -8278 4207 2458 -3589 297 -7012 1355 4918 -4728
899 -4728 2395 -4440 -4260 8954 -1724 -2432 542 -5050 5246 2554 -3137 718 -6176 2109 5130
914 5130 -5218 -298 -4475 -4137 6472 -4500 -3167 -1367 -8687 5476 2353 -8429 -175 -3987
928 -3987 -394 4898 -3232 -1489 -3788 325 7903 -3171 947 1314 -5927 10490 5452 -5932 3976
943 3976 -524 2645 8732 -1686 539 403 1556 8372 -499 838 1541 -3570 9783 4347 -5059
958 -5059 3410 -1141 4201 7512 -3798 1264 1242 1228 8676 -2201 268 4121 -4024 7902 5845
973 5845 -6760 1553 1765 2179 4705 -2897 -1671 -2057 3376 5422 -8690 385 2592 -10394 6789
988 6789 3651 -14115 1211 196 -4882 4758 -4501 -9212 -1311 3300 -1689 -9208 982 -2492
1002 -2492 -9083 7679 -3261 -12449 4873 -6128 -4811 8827 -10374 -9288 4445 -434 -2228
1015 -2228 -4625 -3178 -1476 -2311 4409 -4156 -5679 4747 -5535 984 8048 -8633 -3314 4202
1029 4202 1025 4608 -5484 -2293 6565 -1918 4348 1355 -6803 6811 1623 -2549 8342 -726
1043 -726 -5951 3794 9500 1710 -6744 5259 4396 -3057 12311 -1657 -10026 16892 1126 -8455
1057 -8455 15797 -542 -10218 11178 7546 -4187 503 3258 -2643 4341 10619 -11411 -5143 16649
1071 16649 -7259 -5277 13562 -10018 -5801 10395 -4043 -466 1624 -7408 91 6386 1152
1084 1152 -8728 -2968 7853 -2641 -2134 2712 -5887 1338 895 -3285 5381 -5053 -6352 5467
1098 5467 -1246 1174 -3364 -9768 7558 2753 -9347 1492 -1739 -3404 2684 -1691 -2501 -1161
1112 -1161 -194 -2314 1985 8312 -10340 -6535 17288 -3138 -6069 11592 -8810 -1 17103 -7874
1126 -7874 -3696 12476 -4516 -4593 13070 3905 -13462 3185 11639 -7992 3436 5911 -15748
1139 -15748 8665 12143 -16577 3010 8394 -10962 2440 6893 -4688 -2814 593 2109 391
1152 391 2384 -2496 -7393 8857 4972 -9256 1948 1108 -1752 3700 -2756 293 -1895 -7001 7463
1167 7463 -8 -7113 2568 -7983 -2304 10906 -7544 -10638 4148 769 -5903 247 3529 -9786
1181 -9786 -4008 9669 -6650 -2201 7648 -14346 624 14483 -12238 -3116 8869 -7400 -155
1194 -155 4762 -5341 -707 4681 -3125 -5655 6527 494 -9987 9061 2226 -14068 7575 3490
1208 3490 -6550 8748 -4291 -9063 10760 4042 -2610 1179 -1249 -176 3480 8159 2154 -5465
1222 -5465 1240 2103 7199 9164 -6285 -2246 4522 1643 10958 1158 -6912 5425 -720 3018 12543
1237 12543 -4043 -5594 4085 2318 5668 3698 -3342 -3726 2749 5990 -2404 1479 3051 -9949
1251 -9949 3609 7968 -8487 3863 1572 -11103 6329 2521 -8133 3981 648 -7252 -1272
1264 -1272 3009 -932 -2898 1694 -5161 -6072 8071 -2131 -5788 5239 -9062 -5092 10557 -3825
1278 -3825 -4141 138 -8051 837 5460 -2033 -4960 -4890 57 -140 785 1724 -8389 -3585 3616 -1560
1294 -1560 2971 -3030 -7026 4477 -641 444 4628 -7520 -401 5769 -3009 2450 1236 -4176
1308 -4176 2296 2992 818 -2212 -147 3015 -2115 2900 968 -7400 5685 3054 -6146 5080 -2171
1323 -2171 -5155 8603 572 -3448 2321 -945 1120 4024 2785 -1606 -3043 5837 2990 -416 5451
1338 5451 -3538 -1501 7550 -945 1554 1345 -4999 4128 1419 -2660 2274 -4097 -1645 3285 -2604
1353 -2604 -1653 -2083 -1003 79 -2844 1240 -2524 -4061 5547 -2069 -4080 3835 -3108 1154 4766
1368 4766 -3626 551 499 88 5407 -1391 -1667 777 -736 3796 1053 -1724 -879 -3188 4912 2177
1384 2177 -4939 1874 -2991 -2678 7444 -1920 -3751 1047 -1780 3658 2124 -1803 578 -1725 3049
1399 3049 4727 -1500 1037 -533 1472 5240 -1748 936 765 -3039 6291 994 -4637 2639 -1455
1414 -1455 -593 2963 -3342 -1383 -1569 -180 3201 -3809 -2011 920 -2269 3169 136 -3545 1063
1429 1063 -1039 3188 2666 -4139 2076 665 -880 5973 -1701 -2682 2458 -85 2279 64 -3067
1444 -3067 466 -1611 1640 650 -5092 -645 -1510 -1557 2106 -5653 -2890 511 -4077 2013 -1124 -7437
1460 -7437 928 -74 -1665 874 -3612 -1539 -264 1385 1732 -5164 -669 2165 -2832 3584 -19
1475 -19 -5476 2535 279 174 1701 -4434 117 1567 -66 3042 -3211 -2145 3266 193 2326 132
1491 132 -2463 2690 1024 3067 2523 -3114 2754 2972 1148 5194 -2483 -210 5791 -431 3132 2169
1507 2169 -3364 3615 3139 -546 1476 -617 141 647 2576 1411 -5545 1565 3792 -3884 3088 -383
1523 -383 -6731 5519 1849 -4233 2490 -1443 -2405 3094 1812 -1088 -2863 1035 1968 -799 3150
1538 3150 -3345 -3746 6348 -1072 -2261 3047 -4506 -511 3724 -2391 64 -1924 -2688 2491 -226
1553 -226 -588 -2458 -3044 3051 421 -1815 -319 -2457 1147 338 -737 1888 -4678 -167 4980 -3962
1569 -3962 1279 881 -6180 4618 3689 -5395 335 1631 -1408 881 1994 -1371 -3632 3544 1559
1584 1559 -3368 4667 -2224 -5634 8813 288 -6071 4589 -1935 -1471 6176 -2377 -3220 2839 759
1599 759 -1067 1848 1733 -5201 -594 6387 -3500 -1524 2420 -5788 2775 4811 -6938 51 2001
1614 2001 -2619 1924 16 -2209 -988 -1249 2126 219 -1951 -1210 -1667 2601 783 -2926 -102 -1756
1630 -1756 1561 2637 -4791 1613 832 -5854 5640 1631 -6816 2639 -80 -2672 4569 -849 -5421
1645 -5421 1638 4272 -2564 -2041 4531 -3598 -2693 8427 -3931 -4050 7064 -4940 -674 8695 -5815
1660 -5815 -3606 6368 -576 -1010 2305 -927 -1604 3369 2479 -3536 1889 2657 -4046 5351 3548 -6054
1676 -6054 3279 3038 -1583 5273 -1203 -3071 5590 1464 214 1710 -705 729 1956 2975 673
1691 673 -1347 1258 40 3528 3477 -4571 317 2691 -1944 4533 -1398 -5063 4579 -1107 -2227 4783
1707 4783 -4018 -4604 3434 137 -2822 -507 -1209 -4122 1215 2990 -7316 -1854 4636 -7482 -222
1722 -222 4465 -8911 -806 4087 -6170 37 1248 -6136 37 2982 -2898 -3779 1381 -329 -2987
1737 -2987 3104 -1340 -5548 4426 -47 -3511 4424 -3372 -3437 5500 -672 -1020 792 -2268 1577 2819
1753 2819 -462 -581 -522 1119 1332 1193 830 -2461 2003 2210 -1164 3905 -1276 -3025 6469 -41 -1857
1770 -1857 3969 -2468 252 5157 -1543 -988 1518 -367 778 1978 652 -3646 1147 3684 -2134
1785 -2134 1933 879 -5838 4739 3581 -5076 3027 86 -4303 4983 2039 -3829 -28 1066 29
1800 29 1320 2460 -2337 -3223 4682 410 -2647 2763 -3336 -2059 4212 -2127 -1030 462 -3637 1778
1816 1778 706 -2854 208 -1677 -956 1496 -906 -1366 -1087 972 311 -2108 1760 -1248 -1966 4572
1832 4572 -1590 -2459 3420 -1904 777 3632 -3206 -228 1952 -424 1901 -56 -1807 -824 1453
1847 1453 2630 -1858 -8 150 -2372 4464 2147 -4624 1872 326 -834 4952 -825 -2048 1929
1862 1929 411 2294 1855 -1242 -93 573 2899 891 -715 398 -1642 1408 3343 -3399 -219
1877 -219 1483 -3307 2442 620 -4611 387 -389 -943 395 -1892 -1039 -490 77 511 -2631 -418 7
1894 7 -1398 1547 -1616 -2249 1612 -1563 712 1021 -4725 380 1033 -2330 971 -1851 -2996 551
1910 551 347 19 -2574 -1870 -274 -1522 1556 -487 -4897 499 331 -769 2201 -2841 -1886 2520
1926 2520 -295 1540 462 -2349 1375 1596 1117 1259 -1093 1361 951 1643 3019 -1572 468 2863
1942 2863 -418 2604 646 -2000 2834 1077 635 1862 -1654 1543 2561 155 2086 -464 290
1957 290 2872 1084 1732 -572 -367 3287 644 1734 1516 -2686 2534 2537 -1000 1680 -1497 -1062 2712
1974 2712 -200 -386 -921 -2154 1061 -201 -284 -667 -3121 263 -304 -1330 847 -3331 -1028 2125
1990 2125 -2602 -282 -516 -3211 1325 608 -1767 -537 -1454 545 277 -1027 58 -2587 -241 2125
2006 2125 -1762 -119 -966 -1897 2286 -645 -1643 -77 -2519 953 1500 -1945 35 -1036 -235 2506
2022 2506 -757 -563 -699 -716 2723 731 -418 -48 -1471 2368 1556 -913 1472 -1749 37 3863
2038 3863 -882 -281 752 -1990 2179 1760 -1528 -518 -313 791 337 -119 839 -2523 1142 2497
2054 2497 -2483 1015 881 -2762 2697 928 -2454 1031 -416 313 1022 -645 -247 -398 546 1039 -1866
2071 -1866 157 -250 -1612 2380 -1213 -2242 1045 -1290 726 678 -3208 -67 -206 -311 1383 -2399
2087 -2399 -1053 698 -791 1649 -598 -2584 124 264 1746 132 -1614 307 -856 1688 2773
2102 2773 -3439 -150 1935 -1560 3247 1569 -3353 561 1814 675 1274 258 -961 -395 3021
2117 3021 1477 -2305 1864 456 -1890 4606 183 -2794 3132 -37 -271 3459 -1052 -733 2080
2132 2080 1446 332 -541 952 289 -203 2591 -1502 -1187 2497 -1079 472 1462 -2580 727 1224 -147
2149 -147 986 -2265 -828 1815 -1242 380 -559 -2662 743 458 -363 -418 -1687 -434 -623 843 285
2166 285 -4360 232 1123 -2868 1511 -1182 -4598 2189 418 -2712 962 -1308 -2292 596 1090 -2074
2182 -2074 -2301 963 -839 -1481 2561 -3380 -2703 3909 -1933 -1424 2626 -3179 -990 3091 -1062 -758
2198 -758 147 -149 247 1063 891 -2225 -181 3212 -1117 732 1347 -2394 2060 1862 -669 1610 -841
2215 -841 449 2732 -518 1238 429 -1408 2854 1596 -611 859 360 714 1415 1283 -54 -1784
2231 -1784 2058 1499 -1714 2597 -1060 -2519 4505 -113 -2382 2386 -1056 -626 3010 -403 -1978
2246 -1978 221 1120 -575 -140 1245 -3082 -697 3543 -2070 -912 1426 -3496 1123 2327 -3051
2261 -3051 -38 496 -1271 1311 -46 -1504 -751 52 771 -816 -190 -642 -1760 2321 122 -2165
2277 -2165 1200 -1435 -474 2532 -1586 -942 695 -1286 1605 316 -1541 446 -302 748 1242 -775
2293 -775 -340 -147 1432 899 -1144 1161 -762 -584 3815 -1302 -1847 2603 -1630 480 3227 -2467
2309 -2467 -794 1781 -6 362 258 -260 -1583 1110 2515 -1945 149 1474 -2112 2211 1294 -3291
2325 -3291 1052 691 -1137 2012 -843 -1754 828 315 332 -613 -849 -81 -1106 1083 -340 -2130 398
2342 398 -1322 -114 1362 -2796 -554 490 -2105 1523 -566 -2710 821 -124 -952 773 -1165 -939
2358 -939 26 702 -160 -1654 916 145 -678 1866 -1264 -1435 2231 -621 366 1174 -2583 749 1700
2375 1700 -842 507 -956 -925 1217 1085 406 -1233 53 1406 102 2435 365 -2279 2567 1377
2391 1377 -4 2582 -1097 -837 2703 1001 1089 516 -738 1262 1114 970 855 -756 1074 227 793
2408 793 1228 -1678 524 1364 -1518 1394 -90 -1514 1804 -16 -474 627 -1195 833 504 -1025
2424 -1025 71 -1091 318 1068 -592 -159 -1487 -406 1836 -1244 -325 -36 -3123 1451 1342 -2260
2440 -2260 -203 -1348 -1294 953 -511 -930 -1543 -1218 1009 -486 -217 -596 -2351 870 453 -1243 896
2457 896 -1673 -391 1869 -1149 245 -68 -1567 1322 60 -745 99 -868 981 -74 -544 714
2473 714 -1090 294 1545 -1397 155 3 -634 2043 -249 -813 779 -767 1637 1283 -1408 230
2489 230 215 797 2144 -406 -54 -337 155 2318 -169 -480 325 -1088 2181 1398 -1443 604 -825
2506 -825 -57 2181 -971 -644 232 -886 968 294 -864 -554 -771 1504 -108 -1260 1078 -1453 -65
2523 -65 1902 -1505 -388 555 -950 1306 -227 -1197 81 -720 617 182 -1389 414 -512 0 749
2540 749 -1570 -324 341 -365 1248 -992 -1005 812 -233 1116 286 -1453 830 239 254 1162 -1532
2557 -1532 -208 1088 108 998 -83 -865 599 344 1523 114 -1141 1243 -32 776 2126 -1858
2573 -1858 -28 1554 -471 1329 95 -1404 485 884 900 8 -917 538 -455 815 1468 -2283 -282
2590 -282 1196 -565 1241 -381 -1600 912 103 196 88 -1327 269 -203 21 640 -1867 14 632
2607 632 -1416 741 -650 -1475 273 -524 -372 -598 -1304 611 -607 -628 589 -2273 -205 1169 -1783
2624 -1783 -52 -409 -1854 740 312 -369 -842 -952 787 -97 -171 251 -2578 570 1607 -1402 867
2641 867 -75 -1916 1659 834 -565 -123 -451 630 509 854 180 -1525 1141 1156 -820 1431 197
2658 197 -1245 2625 726 -268 813 -385 1000 1124 362 507 -719 1206 1495 -424 1154 314 -524
2675 -524 1723 556 -508 321 -224 1295 404 -34 547 -1513 1026 1621 -1682 784 166 -1545 1923
2692 1923 340 -1524 -120 91 685 467 -133 -476 -1225 1320 641 -2146 713 -790 -1987 2244 -48
2709 -48 -2099 617 -713 -103 750 -583 -1019 -627 851 151 -1173 502 -1186 -1359 2205 -1114 -1383
2726 -1383 815 -1347 165 822 -1142 -286 -127 417 481 -913 267 -195 -516 1800 -201 -994 462
2743 462 -473 804 387 -847 373 -540 1024 1071 -1544 619 357 -512 2125 5 -1306 1413 46
2760 46 294 890 -343 -296 170 1072 127 -1387 671 -561 -612 2172 -1514 -1520 1520 -784 -211 1352 -1742
2779 -1742 -524 687 166 -174 -527 26 -783 131 1366 -1667 -770 1250 -1297 438 627 -2336 164
2796 164 360 -537 286 -1065 -652 137 -409 549 -1035 -995 608 -396 455 -77 -1570 183 236 52 230
2815 230 -1479 551 578 -774 1550 -565 -1413 2067 26 -34 1050 -608 71 1262 716 -229 -460
2832 -460 1085 252 122 1811 -1229 -778 2662 -474 384 926 -1250 689 1425 -70 302 -259 159
2849 159 635 564 715 -758 160 1032 -317 787 342 -1353 1462 581 -694 850 -1222 -285 1098
2866 1098 -446 -235 -283 -602 578 -107 -292 -185 -713 490 -408 -266 49 -1667 138 593 -1094 295
2884 295 -1000 -1241 1368 -831 -996 41 -1395 213 630 -975 -418 -813 24 -140 -496 -258 -1642
2901 -1642 -212 1185 -1249 -292 211 -2137 1162 833 -1655 85 -442 -544 1059 -61 -519 -489 417
2918 417 895 -441 231 192 -786 1727 532 -930 899 -804 528 1573 -860 91 143 -136 1443
2935 1443 158 -313 515 -167 915 277 -30 207 -209 1113 833 -854 786 -212 -77 2107 -606
2952 -606 -522 911 -550 815 1073 -1235 111 481 408 605 -460 -39 -229 294 1304 -887 -272 -23
2970 -23 -988 961 176 -1701 658 -216 -443 937 -920 -673 284 -204 422 -446 -470 153 -259 1040 -459
2989 -459 -712 800 -415 401 834 -1427 -56 418 -301 1043 -428 -984 739 76 546 100 -860 381
3007 381 283 795 465 -947 142 267 234 1472 -795 -313 1243 -203 936 424 -1217 717 779 25
3025 25 844 -672 -47 1017 390 682 -777 -476 562 -557 995 -157 -1423 921 -6 -164 748
3042 748 -1399 -487 905 -429 37 -399 -704 297 -126 326 -746 -1162 277 -498 -206 529 -1548 71
3060 71 508 -891 292 -690 -1259 815 -430 -222 -515 -1301 279 -225 -466 256 -1634 -225 615 -654
3078 -654 161 -963 -466 734 -532 187 -439 -1054 981 -64 -542 618 -1142 70 1384 -252 77
3095 77 -274 -52 863 165 239 -427 -187 1729 9 297 805 -934 662 1871 -189 503 360 -78 1325
3114 1325 574 -32 55 -178 1311 554 308 726 -808 679 1645 -489 652 60 -371 1376 173 -127
3132 -127 -83 -458 858 136 -458 617 -824 381 637 -882 -132 -204 -613 532 -216 -616 -336 -561 860
3151 860 -456 -470 303 -1469 188 916 -1934 -351 -34 -690 480 -166 -1179 -541 -82 470 -585 -509
3169 -509 -128 -1311 786 777 -2026 -28 231 -827 1292 -141 -1430 -16 105 190 -136 -222 17 -617
3187 -617 1050 919 -1567 43 -202 -438 1696 -427 -821 568 -141 937 488 -487 278 -342 853
3204 853 931 -1071 278 190 -441 1306 43 -743 629 86 729 5 -195 214 -723 903 716 -1681
3222 -1681 500 565 -1095 1191 106 -1251 517 484 -222 -134 -198 -89 -592 999 -54 -1627 1313 94
3240 94 -1126 1150 -796 -1418 1261 -244 -700 287 -712 172 260 420 -348 -1424 794 195 -283 1034
3258 1034 -977 -988 1426 273 84 -295 -832 535 431 768 389 -1349 46 676 -241 1303 -305
3275 -305 -1077 1381 267 619 535 -483 217 303 703 670 -764 797 365 -285 1524 -238 -749 1554
3293 1554 56 -182 939 34 -14 465 503 -115 -611 1532 125 -587 990 -1079 -381 1997 -676 -308
3311 -308 548 -762 392 855 -281 -656 -635 467 417 -56 317 -1372 -628 1463 -712 -509 -338 -1200
3329 -1200 609 237 -808 -38 -1248 -201 227 -1116 104 -1167 -864 1017 -670 -958 -252 -897 138
3346 138 -164 -473 -605 -1341 569 430 -1051 514 -715 -658 1092 -224 -755 356 -650 152 611 -197
3364 -197 -108 -361 476 295 -487 515 -795 44 1611 -838 -15 923 -529 1299 857 -817 564 267
3382 267 564 685 -72 143 54 728 1120 -534 101 559 -321 1494 344 -932 646 63 622 657 -738
3401 -738 188 -28 103 854 -559 -151 372 -288 674 227 -617 201 -343 661 93 -1129 286 -399 -132
3420 -132 1251 -1043 -827 788 -629 285 131 -1019 -17 18 -54 -46 -679 -112 -585 -77 599 -1389 -442
3439 -442 178 -724 802 277 -1235 440 363 -236 533 -735 -520 462 385 753 -681 38 187 114 1162
3458 1162 -344 -709 831 -57 316 809 -980 241 837 -342 459 -355 -837 854 -8 251 -176 -547
3476 -547 653 300 469 132 -909 630 347 61 999 -985 -189 954 -593 490 19 -1063 489
3493 489 434 -386 -122 -716 -313 -45 -182 110 -923 -507 519 -705 734 -258 -1521 463 -240 -566
3511 -566 273 -1227 -285 592 -631 -134 -506 -178 177 -217 354 -602 -711 831 -404 -78 542 -1266
3529 -1266 263 619 -527 143 -375 -382 1107 -101 -15 -184 -570 768 287 -3 316 -667 279 395 -86
3548 -86 333 -510 444 1463 -320 562 243 -729 1449 654 -447 887 -111 490 1051 -131 101 -119
3566 -119 420 887 -65 604 51 -445 1677 59 -666 1060 -716 190 1002 -160 -189 -123 -90 583 -341
3585 -341 -126 222 -260 1029 -419 -163 97 -1107 332 550 -956 -59 -542 -54 682 -485 -367 -269
3603 -269 -591 433 -100 -946 -200 -907 69 456 -953 -324 -490 -119 476 -729 -474 -272 -792 900 -250
3622 -250 -1132 439 -495 49 804 -1098 -187 74 -170 506 -368 -285 -16 -127 1130 -561 -558 713 -452
3641 -452 625 939 -1185 17 776 -58 951 28 -447 154 387 925 -239 -224 557 -246 723 542 -1282
3660 -1282 544 307 -156 1000 -251 -431 459 131 580 -79 -551 565 -546 404 769 -942 117
3677 117 725 -293 591 -162 -579 198 -233 426 -327 -717 793 -840 220 573 -1043 1 359 -717
3695 -717 143 -225 -462 191 99 -63 -808 -219 588 -701 472 121 -1362 484 553 -777 666 -417
3713 -417 -675 690 288 42 -329 -67 464 -72 493 160 -1091 927 735 -546 839 -536 -389 1103
3731 1103 409 31 3 -382 801 116 466 288 -979 532 904 -355 672 -446 -378 624 250 223
3749 223 -329 -260 623 -170 466 143 -1177 490 526 -820 682 -104 -685 811 210 -360 -593 -309 237
3768 237 -316 15 -118 -986 807 225 -1149 358 -463 -718 667 -636 -616 -213 -237 90 -204 -299 -584
3787 -584 -633 562 10 -896 187 -707 -89 980 -521 -522 55 -459 317 65 -299 -173 -741 753 167
3806 167 -753 370 -304 -347 1097 -217 -487 189 -86 792 0 168 365 -691 1158 593 -802 718
3824 718 19 -81 1282 105 -155 579 200 495 352 17 3 -127 900 313 -486 860 -221 176 1654
3843 1654 -601 -287 614 -269 605 530 -432 145 -59 811 127 -590 365 -580 190 852 -861 -350 92
3862 92 -285 584 -55 -841 471 84 143 232 -714 138 -392 -133 714 -732 -441 23 -211 283 -301 -741
3882 -741 30 -379 394 -124 -1042 107 -412 -234 844 -999 -500 710 -364 254 39 -697 -7 -46 353
3901 353 -296 -812 521 -423 3 782 -906 -127 1130 -328 645 412 -719 262 263 160 350 -405 310
3920 310 -35 79 646 -932 -47 735 -346 366 -189 -562 822 40 245 84 -439 506 316 -393 504
3939 504 -588 -96 368 -212 -53 -365 -625 366 -158 442 -32 -649 326 158 -441 444 -813 -376 859
3958 859 -143 -215 -271 -906 644 103 -119 -19 -913 203 -203 -109 239 -755 -172 418 -548 114 -166 -757
3978 -757 788 47 -298 408 -623 287 685 -296 323 -532 254 524 -620 440 -13 -227 1024 -31
3996 -31 -102 326 -269 893 620 -296 429 -189 249 1050 11 121 243 -180 1023 84 -36 216 -177 825
4016 825 165 -188 280 -529 104 1208 -408 103 -39 -668 748 -130 -278 225 -193 92 25 -551 -70
4035 -70 -607 -134 413 -433 -109 71 -545 854 -399 -612 187 -216 36 320 -589 -364 -464 -134 323 -764
4055 -764 -53 -122 -529 561 -387 -589 -39 -602 96 162 -574 -385 -396 -51 656 -825 -384 125 -334 507
4075 507 -389 -742 347 -142 306 74 -767 41 -176 104 466 -615 -29 282 -37 707 -179 -256 704 29
4095 29 422 303 -240 36 229 304 772 -158 -128 547 -41 711 -292 -221 718 85 352 353 -753 354 63
4116 63 -45 500 -506 -172 261 177 523 -79 -367 469 -244 166 326 -941 300 314 -91 358 -587 -242
4136 -242 -4 -120 408 -410 -675 578 -253 -221 176 -843 275 183 -247 -99 -675 -185 217 28 364 -605
4156 -605 -488 877 -89 34 61 -714 188 110 -233 141 -384 187 327 -174 419 -465 -337 878 -3 74
4176 74 163 -732 142 676 -339 286 -297 87 864 135 240 -155 -185 899 -193 54 55 -658 699 500
4196 500 -245 267 -465 -127 582 -239 233 -246 -186 731 -484 90 -131 -703 439 359 -549 368 -553 350
4216 350 560 -341 8 -580 -254 655 -358 -556 262 -836 372 442 -565 -49 -331 -499 35 -485 -248
4235 -248 -415 -114 370 -356 23 225 -627 428 417 -672 101 -190 -248 597 -19 -363 -96 -76 393 -344
4255 -344 195 14 -499 885 399 -793 443 91 -179 710 29 -79 159 50 598 -268 -99 328 -60
4274 -60 808 501 -389 451 113 49 883 -18 173 360 231 606 -41 -37 226 -308 723 378 -455 437 334
4295 334 -39 856 36 -225 369 136 408 -399 -175 283 -485 474 323 -1047 470 122 -402 557 -404
4314 -404 -490 90 101 125 -544 -205 -105 -48 363 -147 -934 140 163 -606 367 -844 -513 30 -359 226 -391
4335 -391 -604 225 -246 335 -50 -909 157 -84 -159 843 -517 -442 542 -119 306 -185 -487 -78 -164 170
4355 170 -32 -548 392 -9 -153 521 -497 -236 408 -25 563 143 -172 212 -96 657 111 -502 529
4374 529 -2 -43 657 -807 -141 565 4 308 98 -177 309 24 119 -72 -329 699 -136 -116 274 -404
4394 -404 -2 448 -329 4 -117 -35 348 -36 -168 -126 -574 306 256 -289 394 -518 109 585 -217 -177 -413
4415 -413 -103 397 87 -206 -410 -531 472 76 -139 -49 -771 111 870 -19 -134 -129 -216 365 199 -118 7
4436 7 -600 569 131 -59 590 -499 36 764 -301 -2 184 -41 702 320 239 96 -8 400 142 -35
4456 -35 684 -134 358 692 -504 440 2 -55 731 -103 -294 -52 -172 385 113 -563 280 -71 -112 655 -760
4477 -760 54 14 -249 423 -95 -285 -163 -209 750 17 -520 -41 -444 102 427 -603 -313 -396 -514 368 -142
4498 -142 -575 -198 -339 419 68 -377 5 -347 31 209 -933 -127 -30 -340 225 -226 -554 46 -466 237
4518 237 163 -632 404 -112 -16 381 -555 -126 -11 -80 693 -284 -162 158 -85 419 174 -626 -8 222 85
4539 85 613 -214 -163 363 190 389 -98 -209 133 318 439 96 -306 556 236 350 621 -301 264 542 -36
4560 -36 629 -337 -504 340 -208 340 129 -156 532 5 468 582 -511 -322 136 -25 375 -461 -603 332
4580 332 -143 -26 219 -624 230 84 -118 240 -493 121 -37 -160 118 -359 -342 312 -82 87 -34 -614
4600 -614 122 119 -259 435 -773 -151 105 -338 314 -399 -421 538 -383 -257 37 -678 389 326 -150 273 -454
4621 -454 -174 250 -499 489 -224 -453 852 -171 -49 241 -486 349 298 91 136 -472 259 504 -113 483
4641 483 -351 -312 725 -84 47 97 -418 412 380 -173 -107 -413 119 420 -524 212 -124 -243 521 -85 94
4662 94 -7 -459 248 256 -246 -339 -393 378 46 -673 285 -160 -574 633 -398 -378 58 -422 81 79 -414 58
4684 58 -394 210 460 -526 43 -281 -123 383 -244 17 128 -363 533 163 -350 304 -197 144 313 -238
4704 -238 -106 -236 0 825 -453 -35 292 -148 608 159 -225 183 207 493 423 -319 89 -144 109 739
4724 739 -11 -95 180 -48 759 477 -383 281 76 284 521 -241 257 -82 89 532 -257 -275 166 -340 475
4745 475 217 -264 314 79 294 413 -294 -187 -215 -43 284 -491 -177 366 -211 195 98 -718 -5 -259 -191
4766 -191 -61 -261 128 -150 82 144 -650 -312 182 -321 102 123 -716 110 -114 -244 281 -499 -301 55 -90
4787 -90 211 -573 -206 386 -493 204 -229 -559 303 85 -303 249 -477 154 309 -190 305 -537 -178 296
4807 296 -29 319 242 -691 264 234 43 149 -234 194 208 92 433 -94 222 503 -143 253 149 -413 488
4828 488 48 1 272 -201 190 388 57 337 -320 -276 623 -347 295 -75 -684 324 253 -314 420 -443 76
4849 76 178 -313 202 -265 -192 420 -65 -68 -68 -495 477 92 -350 274 -445 11 548 -324 191 -28 -274 349
4871 349 -286 -255 104 -466 505 56 -427 268 -3 164 535 -185 -161 -105 155 461 -133 -49 76 -165 606
4892 606 344 -300 209 -320 94 661 -341 -155 -475 -28 394 21 118 -175 -453 482 155 -382 520 -476
4912 -476 383 603 -194 -187 -177 3 363 -194 -51 69 -248 453 238 -296 401 -41 81 200 -549 -38 -27
4933 -27 -91 419 -383 -127 190 -316 106 -205 -549 166 -194 -6 286 -552 41 -299 -338 419 -143 -159 -176 -484
4955 -484 178 -167 -662 -37 -53 -58 235 -605 -169 161 -119 179 -228 -156 15 -80 401 21 -677 285 -304 207
4977 207 535 -542 248 478 206 621 -142 -12 458 -70 803 -93 -395 217 -89 257 549 -430 137 362
4997 362 -187 318 -388 250 352 -561 660 143 -328 567 94 196 261 -457 60 631 59 416 -367 27
5017 27 459 -69 255 -286 -206 443 -204 -62 233 -603 218 252 -371 264 -307 -350 -3 -343 299 -226 -505
5038 -505 217 43 380 -28 -469 159 141 -308 203 -291 -165 437 -136 145 -344 -456 286 -59 -148 -12 -564
5059 -564 145 156 -415 -65 -410 -258 162 -186 390 57 -437 382 -289 -60 40 -335 150 258 -130 271
5079 271 -303 -144 493 -112 -152 76 5 330 -102 71 64 -526 -30 398 -347 331 -198 -98 547 63 -8 -333
5101 -333 -196 713 62 -350 204 -308 294 307 -206 63 -293 -177 292 -430 -316 -14 -299 426 -38 -97 -98
5122 -98 -698 78 177 -700 33 -130 -181 458 -228 -165 -21 -223 609 101 -255 203 -328 109 -37 -461 -37
5143 -37 -175 -263 388 47 -209 53 -172 591 164 41 277 -112 418 412 -596 350 282 100 531 167 -13
5164 -13 439 -66 496 49 -178 151 -155 200 433 -528 243 245 341 532 -86 -77 60 -125 474 167 -8 5
5186 5 -265 477 166 -332 -52 50 284 325 -276 -381 370 -27 103 -61 -444 206 -78 193 -3 -550 -148
5207 -148 -89 -221 356 -512 -342 -3 -222 219 -187 -557 99 -98 -232 -68 -943 178 -203 -476 167 -541
5227 -541 -414 -101 -257 288 -273 -691 4 -128 195 -100 -468 26 96 -76 478 -361 -225 260 -140 125
5247 125 -142 -353 189 7 341 219 -371 340 450 9 63 -226 54 471 -20 303 85 -439 549 324
5267 324 482 238 -348 540 405 -209 295 -295 -201 579 186 151 35 -309 221 231 8 504 -250 317 182
5288 182 -178 150 -364 119 534 -169 -238 -217 -446 509 127 -115 30 -133 191 223 -153 -114 -333 102 469
5309 469 -89 -180 -111 -492 220 73 -240 -189 -319 -23 262 -226 97 -306 54 465 -233 -95 -124 -178 330 -47
5331 -47 -373 257 -518 255 602 -563 -24 -400 16 580 -159 -2 30 -76 242 145 -122 167 -120 251 173
5352 173 -264 -39 -224 -46 749 95 241 148 21 617 268 -334 274 -160 329 213 -117 -282 -210 179 329
5373 329 -442 -83 59 -408 513 -12 -616 214 -39 78 50 -361 -68 -382 55 295 -457 -311 98 -261
5393 -261 259 -145 -480 80 -176 -145 -2 -410 112 -191 -216 112 -493 -76 167 -275 208 85 -258 321 76
5414 76 -59 20 -110 -91 111 -7 132 -95 20 481 -21 524 -28 -249 225 9 244 451 -131 -224 156
5435 156 118 330 -138 86 137 169 506 -16 -221 535 303 549 245 -338 296 388 -132 441 -484 -198 220
5456 220 24 356 33 -325 264 35 -99 45 -543 217 220 -280 146 -325 -30 43 -43 276 12 -693 284
5477 284 -106 -70 65 -230 12 259 -209 -212 -397 -167 135 -271 125 -236 -735 247 105 77 17 -150 57 -120
5499 -120 147 102 -76 -102 159 -395 -60 127 -291 73 -276 -267 -96 -101 141 -36 -240 -21 -34 20 536 -210 -163
5522 -163 -211 -385 293 -30 -195 189 -57 235 22 -168 -191 -356 -34 549 -220 -12 150 -175 441 279 91
5543 91 25 -136 85 495 -78 -109 -174 237 426 -308 38 -274 -306 607 -200 -84 255 -290 167 243 -580 39
5565 39 -79 173 351 -317 -80 203 -138 200 -87 -283 -66 -346 306 34 -138 -508 -181 -19 417 -216
5585 -216 -280 -67 -251 185 76 -466 119 -84 203 170 -137 138 35 -213 117 -226 102 41 -267 428 -76
5606 -76 -415 70 -267 -182 398 -172 37 90 -231 353 -18 50 198 72 431 -173 -151 45 4 206 149 -305
5628 -305 214 337 213 427 -198 127 142 47 423 -87 -136 151 -151 149 188 -615 -122 -3 -60 220 -263 -232
5650 -232 212 -293 364 -173 -127 413 -232 -32 147 -568 91 272 -271 174 -371 -171 -31 -151 -164 -553 -468
5671 -468 45 -225 -121 183 -698 22 -13 -49 128 -413 -132 383 82 20 -38 40 35 -354 -106 -68 -648 143 366
5694 366 -13 362 -410 112 598 133 401 52 -235 144 -119 334 158 -150 317 361 -219 268 -12 17 380
5715 380 121 404 -139 -206 418 -37 187 237 -214 283 233 78 151 -119 200 462 -8 -22 206 -234 94 241
5737 241 17 48 -359 181 288 -95 350 16 88 480 -149 -133 -61 -216 419 -184 29 -72 -277 261 45
5758 45 -205 243 -26 -270 118 -393 -123 -203 -223 -136 -390 -329 -302 -372 172 2 -210 160 -328 -175 344 -144
5780 -144 -158 -108 -241 161 -41 -255 44 -143 506 242 -285 -41 -223 175 319 4 -38 -116 -91 220 50 13
5802 13 215 -304 248 201 -465 33 41 11 482 -167 175 245 -40 149 -172 39 215 -91 272 70 -255 89
5824 89 -71 -79 241 -204 -308 -50 61 6 -174 -242 -26 -84 138 -87 -359 57 -217 -93 305 -747 -228 156
5846 156 -450 -112 -326 -399 129 -102 151 -15 -380 149 -184 -144 289 -284 -39 324 -277 492 -33 -254 22
5867 22 -113 172 -149 -75 410 -47 9 223 -339 8 332 129 135 61 -352 161 47 194 -19 -202 496 -25
5889 -25 118 529 -570 25 596 185 343 -36 4 214 398 -8 -127 -199 223 78 155 403 -384 -51 419
5910 419 -98 274 -165 -601 276 -52 136 6 -440 69 -145 -124 -70 -167 101 88 -334 125 -180 -349 273
5931 273 196 -414 -71 -299 -208 -65 -80 81 -483 -214 337 -350 -165 -112 -464 208 -328 69 156 -482 263 44
5953 44 -128 -29 -499 60 81 -209 307 -36 -131 398 102 -79 -54 -140 -133 113 -88 225 -531 -56 468 -267 107
5976 107 -143 -33 363 -56 86 -3 -231 185 -24 -200 45 -273 -153 239 -285 173 349 -144 428 261
5996 261 -251 2 -16 88 40 -348 103 -310 104 397 -83 -59 -128 -98 293 -189 -82 179 12 97 -36 59
6018 59 118 -87 58 225 -564 106 -212 -206 299 -12 -259 371 -119 313 -57 -337 -53 -155 -156 233 -195 -131
6040 -131 -12 -76 61 -218 -8 296 -31 28 323 -216 -1 -124 106 347 -339 -324 94 39 664 94 -391
6061 -391 225 26 278 5 -3 64 -103 119 354 -259 119 201 -43 200 -52 -290 196 -415 226 37 -452
6082 -452 95 58 15 185 -340 -132 29 90 177 -149 -167 184 61 181 38 -581 -6 -105 112 -103 -474 -216
6104 -216 42 -210 283 -141 -386 124 -89 48 146 -621 -6 -135 -151 231 -386 -132 38 -155 136 -125 -220
6125 -220 303 -118 207 -125 -242 145 267 -16 197 -86 -103 227 -214 139 -52 -90 617 122 -2 -49 -292
6146 -292 399 121 0 277 -233 131 350 100 63 -92 -50 336 156 238 152 -195 172 286 -55 296 -353
6167 -353 -15 271 38 110 136 -226 250 132 334 -3 -438 -125 184 157 114 -193 -71 404 73 49 -79 -277
6189 -277 337 -103 177 67 -373 51 298 -306 -447 -187 422 11 -448 -53 -141 -471 362 -364 -68 125
6209 125 -378 153 30 -191 -24 248 52 425 -221 231 -132 -347 407 -113 48 -220 -61 38 105 -313 202
6230 202 267 33 152 -418 236 -72 -13 185 -5 -137 108 -240 207 48 -239 129 -161 37 322 -207 -54
6251 -54 220 -152 415 -93 -1 104 1 294 122 -368 269 0 -6 348 -154 -154 191 34 378 111 -21 8
6273 8 -95 412 159 -380 15 -21 -102 437 -130 181 -11 45 423 -231 -312 123 -174 5 -33 -622 86 -115
6295 -115 99 201 -243 -226 112 -119 286 -30 -145 138 -290 537 86 -610 319 -94 -294 293 -366 171
6315 171 82 -265 519 75 -535 311 41 -165 124 -315 499 19 265 332 -87 -48 120 154 383 -101 -133 637
6337 637 58 229 171 -266 115 12 -152 412 -91 -127 156 -8 190 -36 -213 -85 171 175 -110 -231 116
6358 116 153 201 146 -404 -36 96 -134 -305 -306 -257 264 -147 143 -167 -286 2 -130 -242 61 -24 -68 243 -41
6381 -41 200 -249 -119 -52 -150 -145 42 -164 -97 42 -59 -26 -364 -82 57 51 91 -132 -122 310 -202 -130 6 -349
6405 -349 125 -137 -245 57 -262 13 267 -51 -54 55 -122 340 28 84 -27 135 265 -3 -317 106 -189
6426 -189 139 237 -165 -94 105 -120 62 157 -101 -139 -277 374 -9 -60 90 -309 109 317 -266 251 -132 -71
6448 -71 370 5 42 -11 -140 261 109 -79 123 -175 84 103 -358 199 179 328 334 -87 -175 -27 -116 85 -113
6471 -113 17 145 -310 0 174 -209 -219 -52 -87 67 -84 -245 52 -211 295 23 -280 -41 -194 -18 -24
6492 -24 -364 0 185 -526 371 -296 -394 161 -301 190 21 -149 2 41 202 210 -265 -46 261 26 216 -128
6514 -128 -220 -141 -73 117 23 61 55 33 -302 273 -483 -142 485 -75 220 137 -40 131 45 273 114 -340 282
6537 282 -124 -78 141 -295 215 236 -125 304 -69 -249 -20 -310 207 88 -412 86 139 -134 115 -306 45
6558 45 35 -61 -33 -130 -130 -46 9 10 45 -222 136 -84 36 -155 -460 -66 161 -13 12 -400 -356 -74 206 396 18
6583 18 -111 150 75 -76 21 -331 34 287 77 235 -69 -185 401 20 152 243 57 91 173 149 208 -186 178
6606 178 322 35 201 -171 -73 447 38 71 466 -150 237 23 76 354 39 377 -53 -43 -217 -367 124
6627 124 286 56 47 28 -222 229 236 -271 -122 9 171 192 28 131 -72 -75 520 67 -3 -66 -286 -33 -214
6650 -214 126 -166 -15 49 217 -182 -384 -221 -149 -145 -143 -241 262 -248 -12 105 -196 -58 -240 21 105 -295 -132
6673 -132 -173 -281 86 -244 -144 -5 -234 48 -17 -42 322 -271 -16 159 -154 2 97 -30 117 -36 270
6694 270 -282 -268 135 -3 -32 47 2 -32 248 -222 109 -28 -49 25 73 -213 54 -179 233 -14 -167 109 96
6717 96 -60 -198 -224 243 3 31 520 -103 -356 117 -243 154 326 -245 124 31 -46 45 -104 89 166 -139
6739 -139 253 -130 29 98 129 43 -153 -87 -41 -57 220 115 -228 98 162 -61 19 -111 -52 -5 -81 192 -136 -164
6763 -164 -122 -121 64 -40 91 -2 166 -166 204 -108 -6 91 331 189 52 -186 98 106 29 33 -73 133 122 -89
6787 -89 155 80 -222 295 -37 360 -19 136 97 -86 -122 9 -81 149 -155 162 181 -133 -244 -101 -82 205
6809 205 -48 -347 52 -75 -88 -76 30 18 -28 -99 203 -223 -84 196 167 -158 -91 -479 31 -4 -318 39 -195
6832 -195 -313 7 -42 -242 -112 58 317 -199 165 -302 -306 43 109 -204 298 -230 -59 291 -141 -130 -208 -233
6854 -233 273 -105 126 228 -238 397 65 197 -79 -304 10 363 -238 -84 -136 164 175 -49 98 -149 -132
6875 -132 304 54 -162 59 77 107 230 -31 90 45 248 252 -9 -161 -37 60 256 103 -466 -49 75 57
6897 57 514 -16 110 -161 -276 -79 -60 -86 110 -341 -3 401 -8 23 -389 271 191 -198 -166 51 -140 -90
6919 -90 -271 -177 -161 -310 237 82 -186 -26 -290 312 124 -132 -223 -25 -191 -40 -89 -116 -63 -159 -36 -88 -43
6942 -43 37 -33 69 163 -258 35 -66 136 146 -77 -150 194 -261 529 -146 -104 26 41 348 305 -225 4 89
6965 89 211 270 20 -236 182 -53 270 103 -377 107 -52 191 -94 -479 -171 223 -130 295 -65 -137 153
6986 153 35 37 65 -248 138 -104 51 675 -334 -133 -60 -132 -13 -179 -138 256 -236 72 -383 -177 232 -317
7008 -317 103 -87 -277 -224 58 -157 47 24 -273 153 -148 -29 -26 -56 -31 -244 112 36 -339 5 230 -190
7030 -190 117 -177 -20 267 -129 148 -64 -101 482 -68 -24 66 -347 406 271 -123 193 9 -138 209 -150
7051 -150 363 3 -281 428 157 169 265 -110 -24 55 -325 381 -33 -88 265 -105 167 29 42 91 95 87 134 -264
7075 -264 445 256 -43 -250 -98 -343 444 6 -185 192 -187 85 -80 -188 122 -427 -20 192 -372 84
7095 84 -115 -17 -11 -129 -189 20 -185 244 90 -316 -10 -248 -172 162 74 127 30 -78 7 21 -113 -153 -221 186
7119 186 -26 -256 141 -278 -362 130 -317 -89 -8 -109 316 -43 -14 48 -173 -73 169 -259 -162 144 -8 180
7141 180 -367 71 -110 125 108 -220 -197 144 -2 169 165 -227 246 34 -48 164 -81 108 85 -95 248 -79
7163 -79 161 193 -95 160 75 -298 73 -191 191 -63 -113 -22 -215 -391 322 -282 -270 160 31 0 -122 177
7185 177 154 41 47 48 -222 165 152 -353 475 -144 -104 36 -92 -63 96 -84 139 -84 -27 127 -324 -138 115
7208 115 -469 138 -315 -271 498 319 31 -86 -478 343 -107 -107 114 -260 251 -9 104 316 -160 -87 223
7229 223 -138 303 12 -156 358 -7 -49 60 -169 14 110 1 138 29 -361 164 116 91 -86 -198 264
7250 264 93 -27 247 -350 89 151 -372 248 -204 51 54 -197 -49 -354 -255 126 90 -42 -144 -230 79 -128
7272 -128 -76 158 -305 -129 111 10 -208 24 -94 265 99 44 180 -208 164 37 59 -45 39 -61 187
7293 187 -115 28 -77 -333 84 56 -138 99 -182 204 179 -123 175 -180 -78 459 -153 12 157 -85 411
7314 411 134 -110 131 125 -127 108 0 58 -251 -120 336 50 -206 113 -31 145 -5 -29 309 125 72 211
7336 211 -143 248 73 46 312 -181 -130 65 -112 144 67 -29 231 10 228 25 -97 -41 60 -29 264 -288
7358 -288 -154 120 -222 379 -37 -220 176 166 -136 355 -178 -60 166 -198 -19 -131 -55 220 -43 -76 -272
7379 -272 -463 -127 143 -248 50 -345 308 0 108 19 -148 18 17 -145 126 280 -145 -115 -252 -16 -79 -254
7401 -254 90 139 -50 185 -223 -18 23 -238 195 -48 -9 149 185 54 152 -101 -238 176 276 214 -336 123
7423 123 98 -53 132 -140 36 -1 97 -182 84 -104 107 -108 -216 488 -54 -42 25 -95 122 -111 -125 -62
7445 -62 -145 -41 -16 16 -51 159 97 185 -443 -33 83 -34 -111 -97 -238 113 171 96 312 -412 235 74 -44 -63
7469 -63 -301 -218 154 -92 169 2 -175 677 -12 -257 347 -216 163 -5 -324 209 -152 107 456 -52 43
7490 43 20 -322 209 -70 348 76 -80 148 419 -99 78 51 190 142 86 104 -79 -197 268 61 85 281
7512 281 -35 -439 -62 48 -40 -78 73 290 -100 185 -29 -200 279 -23 -125 10 -191 -247 77 -89 4
7533 4 95 137 394 -329 13 -17 -24 184 -103 52 -159 -229 167 -53 -97 10 -197 -370 -36 -143 -473 197 -366
7556 -366 23 54 -102 159 -74 135 -3 -97 16 -272 12 286 -215 -181 -170 21 327 -92 -131 -92 -165 76
7578 76 259 -86 -11 15 -158 190 -81 -98 301 -21 179 -74 30 -97 -42 238 128 -467 73 42 11 133
7600 133 -11 29 206 -23 160 -68 -68 106 -38 -22 190 28 319 32 -105 48 2 -368 -126 -136 71 91
7622 91 17 101 114 258 98 163 314 -355 -17 44 -351 -11 -19 -61 -140 15 -240 -34 -195 -156 -173 -107 145 -89
7646 -89 -20 -14 64 140 158 -123 182 0 60 262 -67 189 -49 -112 -15 -73 -198 -92 -138 -418 63 79 -155 -66 -204
7671 -204 -21 53 77 -137 -193 108 141 77 228 -125 -50 -46 -193 147 -81 -204 113 -64 25 -48 -218 82 2 221
7695 221 367 -171 -158 74 67 -59 69 -147 144 5 -37 -112 -36 11 237 -32 78 86 -245 382 135 33 12
7718 12 25 72 -26 -227 -96 -238 -71 -39 -223 28 17 -225 -28 43 103 -132 -247 25 -304 -99 9 -191 94
7741 94 -146 -196 260 -33 61 58 22 -86 59 -75 181 -87 25 54 63 256 147 42 80 -211 -179 75 -95 30
7765 30 -140 -81 584 -96 -40 -88 -126 361 140 -257 -134 92 93 229 67 -116 408 -25 3 332 -285 31 -84
7788 -84 187 -12 -167 -18 70 -83 163 -5 26 132 -89 85 -177 132 -236 115 182 167 -141 169 -155 -22
7810 -22 210 148 220 153 22 177 130 -365 20 -150 106 -42 -309 -194 183 42 218 -261 39 201 -13 -144
7832 -144 -93 -91 -56 -161 252 49 -280 167 50 -66 68 42 50 27 -64 166 -19 -133 70 189 6 109 -188
7855 -188 94 233 167 91 -121 179 298 -150 154 -199 -36 341 -224 -77 4 56 475 209 20 71 62 -201
7877 -201 310 -185 393 -227 -45 228 -413 -36 6 17 119 239 -43 212 -355 -10 191 25 82 -180 -41
7898 -41 66 297 100 -21 -39 -152 -82 -78 -40 -128 -24 147 -33 118 -103 -128 -150 -49 247 5 -110 -71 -107 29
7922 29 -139 -188 -152 -110 -7 126 -11 1 145 -83 -10 -88 -92 -56 69 -107 44 85 102 81 -97 190 -132 -90 168
7947 168 15 98 -65 23 -75 49 0 -12 101 107 0 -149 82 -20 -26 55 96 174 179 -37 78 178 -295 236 -122
7972 -122 -174 -119 37 -133 25 -329 34 -185 6 128 -187 233 50 -83 -54 -105 -68 -122 90 -68 57 -178
7994 -178 126 -91 104 -248 -59 -29 -57 -170 -214 -117 -45 165 -85 85 28 -116 99 47 -318 80 -93 -172 151
8017 151 -284 -66 -54 239 95 -151 -23 -212 -127 74 -247 -324 82 67 30 68 -321 -93 176 -176 -75 -12
8039 -12 91 63 23 193 -81 -73 -81 -100 11 44 -12 -141 176 173 77 -14 151 327 46 158 282 -232 85 -33 -13
8064 -13 -1 136 -32 42 -80 -18 -320 -93 63 162 73 4 -155 221 27 -63 22 -314 43 -3 8 36 -33 -74 43
8089 43 -77 172 -38 -393 224 63 -176 -101 -183 51 72 95 110 -246 1 394 68 80 350 129 -149 -3
8111 -3 53 12 -427 -36 229 -263 -250 -135 -141 -95 49 67 -224 -10 -327 -252 9 -21 90 109 204 -169 -47 -270
8135 -270 166 235 -56 173 -7 -236 224 -56 -116 151 -138 115 -7 73 225 -316 -76 -5 62 -180 47 -289
8157 -289 90 -6 -73 278 -198 115 329 137 -208 -175 71 31 82 -19 -154 -152 2 -182 -220 -35 15 94 68 -6
8181 -6 -41 -46 133 -6 -111 78 -57 -186 108 -21
8191b1
$$ Imaginary data points
##PAGE= N=2
##DATA TABLE= (X++(I..I)), XYDATA
0 0 0 0 0 0 0 0 0 0 0 0 8 -8 8 -16 16 -16 24 -32 38 -40 49 -62 72 -85 99 -117 133 -154 176 -202 229 -261
32 -261 296 -335 376 -423 476 -531 591 -658 730 -812 900 -995 1098 -1213 1337 -1473 1622
49 1622 -1787 1968 -2170 2392 -2643 2925 -3245 3609 -4034 4532 -5127 5848 -6753 7911 -9461
64 -9461 11637 -14913 20359 -30977 58903 -275605 -558421 335963 -17128 -340989 187559
75 187559 -25897 -444809 39569 151686 -207621 -55703 43921 -281100 -81804 208494
85 208494 -53645 -155634 -40549 -48001 50496 -9964 -52703 88250 -83760 -144724 135580
96 135580 55126 -81745 15195 -43669 -58256 79136 19474 -75242 17017 10420 -94390 27629
108 27629 79760 -41754 10496 -38174 -72996 173689 35576 -149068 146807 57694 -159831
119 -159831 150447 157046 -107906 30907 89897 -50835 89603 148122 -100754 -41056 155917
130 155917 -18211 -29087 115561 -48944 -40542 62593 -47689 62414 50840 -170993 37000
141 37000 134058 -122597 -17273 106968 -93503 -32258 136628 -56024 -87046 150694 -8699
152 -8699 -130322 160566 52357 -167640 95978 111291 -92743 12965 45888 -25079 22094
163 22094 17327 -19757 -20457 -4903 9054 -16495 -19453 -10139 -31293 -40627 -6763 32598 -53306
176 -53306 -91167 44612 1929 -76354 31295 -22808 -63094 46280 -21373 -37708 48442
187 48442 -37006 -42003 56442 2293 -43093 20681 13335 -32667 32103 19383 -71971 40067
199 40067 58187 -93202 19307 67621 -81520 12722 63430 -57700 -3788 36880 -22732
210 -22732 10602 32730 -22294 -20519 47301 24432 -23989 26683 8967 -13102 52602 7394
222 7394 -11654 40659 -19147 4432 62053 -13663 -13638 20325 -1519 16969 13277 -10881 -9166
235 -9166 1793 16561 -6751 -5527 4759 -25837 6155 17145 -19454 1396 -15268 -10531 32236
248 32236 -20470 -17792 17767 -21930 4908 18395 -25958 -6624 5240 -3637 -1467 -5211 -4604
261 -4604 -21987 462 18542 -30853 -12194 3716 -28160 12164 -2838 -39193 3309 -10711
273 -10711 -15912 10309 -22629 -20100 -2061 -5892 2752 -13821 -11776 -5814 -9301 18751 -6236
286 -6236 -21964 13666 -6846 4415 22941 -18433 641 15361 620 22227 2520 -5976
298 -5976 16058 9088 21491 10125 -5110 18147 8582 17715 23857 -9820 12207 19019 5786
311 5786 25388 -326 -3301 19350 4480 17091 6977 -14106 13497 5711 4805 11512 -17139
324 -17139 31 8316 -4067 10468 -13491 -14161 8807 -6956 4377 -5661 -24375 4988 -3209
337 -3209 -4713 3162 -25143 -5260 4623 -10103 5439 -15593 -17514 9267 -5781 937 -5354
350 -5354 -19975 7823 140 -1711 5506 -20080 1360 11683 -5693 9019 -9302 -9823 16356
363 16356 724 4579 -153 -13536 14261 5572 -695 9009 -15255 2603 15855 -3352 5246
376 5246 -7116 -6347 13852 -695 4913 -4097 -15289 16336 2265 -6036 9263 -17643 -74
389 -74 18137 -8739 -268 -2988 -8632 9434 3109 1436 -9496 -9951 17294 -2879 -3448 9057
403 9057 -21537 5660 19932 -16461 2469 1589 -13783 12365 5913 -5824 -5812 -5232 11244 663
417 663 -1378 422 -16708 11201 12207 -16996 5167 -3858 -12369 14874 -3530 -7751 -2517 -14095
431 -14095 8168 3585 -13156 -3792 -13802 1468 10274 -16555 -7655 -2398 -5288 2851 -4433 197
445 197 -9356 -10620 19370 -3464 -8691 11746 -17666 9008 30717 -22472 -4548 23496 -5255
458 -5255 5002 16523 -4120 -6851 14649 14197 -9195 11905 6913 -26961 28222 27106 -36137
471 -36137 7023 17184 -15892 22041 8071 -22137 10455 11204 -2566 10320 12147 -10291 -8713
484 -8713 29051 12681 -11523 11709 -5444 3264 32688 -13635 -8083 24272 -11706 -1674 17425
497 17425 -4894 -3706 -6618 -1703 9560 -6917 -9159 -4914 -134 3221 -13848 -7129 5216 -470
511 -470 -3787 -18300 5581 17967 -26054 4611 22131 -31947 2409 22693 -18177 9321 2003
524 2003 -36080 12588 30865 -25966 -26281 14377 -11174 -22400 24935 -15253 -43529 18983 -17263
537 -17263 -28324 44487 -29552 -64308 38096 11741 -37855 12504 -111 -32621 14468 25823
549 25823 -22713 279 27686 -29025 393 57939 -16950 -26477 33274 7608 1140 10534 -4621
562 -4621 11031 3783 -4160 12169 -1024 1286 5575 -10982 6555 14149 -12301 -9699 21460
575 21460 12132 -28289 3323 31910 -11502 2399 13891 -18250 24100 19269 -25960 25275
587 25275 16152 -31071 20658 26763 -17229 299 5345 -14479 14798 21304 -38653 -15041 40880
600 40880 -26621 -28501 40769 -24285 -35704 31784 -14183 -16397 21919 -28536 -14445 35492
612 35492 -8314 -25833 16746 10020 -12941 12864 6524 -17048 23387 7839 -27908 33697
624 33697 11939 -44712 25973 28001 -32760 -29 10065 -11853 5229 3961 -16522 -11761 10227
637 10227 1128 -19804 3229 6403 -19035 -5852 15807 8587 -22959 -13644 33160 -993 -21389
650 -21389 28293 -7101 -19396 40759 -2927 -26306 32955 2608 -27510 26042 20355 -31577
662 -31577 -3150 27712 -13428 -5100 16050 -26999 3540 29326 -33725 -2451 28638 -30711
674 -30711 -994 29087 -21110 -6698 18273 -9389 -67 21822 -10255 -19093 28785 13526
686 13526 -27037 13226 13144 -18489 15035 7539 -14903 6732 -5446 -4145 12853 -10463 -10412 -2576
700 -2576 -5352 7170 -5271 -18653 -4028 3243 -3601 -9698 562 -4464 -17384 8574 5505
713 5505 -14521 3815 -8335 -6837 20419 -10202 -12598 13423 -8000 -1006 12180 -11440 -3050
726 -3050 10726 -5197 -6786 10217 1112 -16983 11821 12647 -24856 6571 16366 -18379 10924
739 10924 8469 -23033 12596 16090 -10378 3048 4700 -4512 4531 14756 4419 -9581 4524
752 4524 6624 4135 18906 -4122 -12429 14626 5485 6348 12571 -11366 -827 10239 3538 12548
766 12548 -1257 -10441 4585 6350 8835 2225 -6861 -714 129 7837 4878 -7801 2565 -3075
780 -3075 -3682 12441 -5704 -6275 5655 -8684 2095 4201 -10815 3216 1174 -7702 19 -2291
794 -2291 -1358 -549 -1585 -2490 -10783 3060 5820 -10579 2317 -4347 -14568 9947 2470 -10007
808 -10007 -2030 -9670 -2093 5405 -3151 -3512 -11154 -5015 6078 -1829 -618 -6829 -9779 5861 307
823 307 576 875 -12690 3094 8411 -3558 4473 -2929 -4813 8558 1997 2826 -219 -5195 8269
838 8269 2525 -781 3819 -5234 2849 6019 -1935 1985 -5097 605 9010 -5094 743 1348 -7403
853 -7403 8426 4901 -4973 794 -2650 4929 5932 -2151 3752 -4005 611 12749 -1272 -736 1848
868 1848 -3125 8197 3246 -1788 1423 -6369 4774 6486 -6510 1021 -3298 -4100 6760 -2886
882 -2886 -3750 -2922 -5561 6188 -1184 -6141 1481 -6424 1380 5739 -6058 -527 -2405 -427 7348
897 7348 -4167 -1219 991 -4728 8304 1657 -6930 2029 -2628 2351 4427 -6028 -493 -2462
911 -2462 -511 6465 -5649 -3129 761 -3547 6639 -499 -5852 2907 -3561 4505 7461 -7197
925 -7197 1057 3939 911 7803 -394 -1177 2810 2045 9449 416 -1971 5504 -2430 6819 8969 -8573
941 -8573 1321 4204 -479 7043 -2133 -4112 2440 206 5041 -969 -4791 2102 -3343 4398 4579
956 4579 -9486 158 1685 -1219 5867 -5444 -4332 2974 -2283 3878 -2952 -7027 3048 -4237
970 -4237 -98 4469 -10809 -3797 2253 -2858 177 -5708 -5881 -1610 -874 2278 -9125 -6287 4765
985 4765 -9202 10 6295 -15107 -2849 5871 -6413 1626 -1924 -9450 1154 4792 -789 -7500
999 -7500 -149 3805 -6639 5072 3803 -12148 5457 4359 -5804 9629 -2538 -9150 9854
1012 9854 5038 -1572 -321 468 4867 2073 4646 1738 -4396 7598 2901 -592 10542 -3746
1026 -3746 -3780 10048 3227 2719 -1281 -2599 9304 1502 446 4584 -5322 4829 7017 -4321 5558
1041 5558 2302 -6378 4500 8562 865 -6949 2314 8220 -4364 4894 2605 -12873 10598 6753
1055 6753 -14745 8602 3498 -15321 6894 7858 -9286 -4571 2153 -2370 -1468 5693 -9359 -11449
1069 -11449 13775 -2602 -14385 10879 -4866 -12431 10928 -1427 -7010 2494 -5482 -1103 6335
1082 6335 -627 -7765 -3505 8132 -231 -6400 3388 -3480 -1504 4455 -4225 2073 -914 -7630 6133
1097 6133 1595 -3395 84 -6957 5455 7521 -9725 402 4463 -2460 4393 1262 -1734 1582
1111 1582 2442 1733 1932 6871 -3884 -7503 16677 3777 -12477 10185 -566 -6273 15791 -4230
1125 -4230 -11321 11706 -1211 -8954 8990 3305 -14136 -1563 12745 -7085 -5974 7103 -11893
1138 -11893 -224 15200 -15311 -6061 13347 -9109 -2842 9089 -5456 -5141 2219 1876 -449
1151 -449 -848 -1242 -5830 5026 6606 -11297 -2214 4764 -4327 1528 -2005 -3914 348 -5720 4051
1166 4051 3770 -9996 1297 -336 -4337 10587 -3436 -11969 6549 5853 -4298 123 4985 -4186
1180 -4186 -3782 11582 -447 -6633 9639 -6120 -3649 17967 -6418 -8655 12982 -2498 -3543
1193 -3543 8219 -2477 -1995 6201 -93 -4483 5531 5047 -7814 5233 8635 -11815 4822 11889
1207 11889 -7404 5132 2724 -9177 11181 8446 -5718 973 1593 1283 4701 5668 762 -6671
1221 -6671 909 5733 3206 5139 -6754 -6887 7171 1553 3596 411 -11526 2537 3164 -2863
1235 -2863 7156 -5560 -11587 4205 2422 -344 -364 -7233 -5550 1227 3686 -3993 -5165 1490 -8354
1250 -8354 -2497 8999 -8678 -4250 4320 -11037 1420 6480 -9982 -289 3115 -7795 -1528
1263 -1528 3865 -666 -4104 60 -1255 -5666 6839 2052 -9506 4087 -1963 -7111 11158 -184
1277 -184 -8576 2984 -3036 670 7528 -2476 -4854 -1243 2782 3741 254 2079 -4058 -2661 8125
1292 8125 1685 954 891 -5100 5697 4969 -1907 5035 -3667 -2105 9226 -1306 -742 3560 -3231
1307 -3231 1509 4443 -338 -1383 -664 3573 -704 -372 3060 -5389 2499 6817 -6521 2075 3180
1322 3180 -5744 7151 3601 -6237 2282 1731 414 3512 676 -1927 -2913 3814 3825 -4480 1184 -1653
1338 -1653 -5211 6286 -916 -4373 1099 -5525 595 3049 -5584 -250 -2303 -3808 3600 -1599 -3051
1353 -3051 150 -572 1537 -1167 702 1260 -2968 5468 2320 -5021 4893 1015 -915 5930 -2564
1368 -2564 -1516 3596 -310 3631 -514 -4293 1672 70 1620 942 -3967 -780 -907 2823 3490 -5870
1384 -5870 -168 1775 -2818 6553 500 -6009 2734 1139 2003 3318 -2971 272 584 1370 4404 -2627
1400 -2627 -1649 857 -676 3015 -2293 -3173 1165 -3740 1800 1855 -7513 308 928 -3261 2118 -2809
1416 -2809 -3097 643 -346 2566 -2358 -3403 3070 -412 1512 1890 -3749 1242 1232 1265 2702 -4813 -138
1433 -138 3112 -2619 2842 -1328 -5830 2201 -274 -1499 -363 -4966 -1138 -98 -909 657 -5567
1448 -5567 -1439 1671 -1905 1705 -2687 -3302 3969 -1442 965 2680 -5383 2158 4556 -872 1990
1463 1990 -341 -447 3067 2043 2518 -2678 -481 5582 -696 1981 2804 -4835 3087 4331 -714 1951
1479 1951 -2032 91 5001 503 2260 137 -2348 5372 2002 778 1760 -1934 2543 3102 808
1494 808 2570 -2895 880 4367 -1023 2241 -1309 -3687 5061 -738 -2231 1620 -4635 311 2370
1509 2370 -3178 -1263 -1483 -1856 142 -166 -192 -4899 -1213 5012 -4095 -999 1889 -6773 2804 4360
1525 4360 -6202 588 1217 -3347 2665 1320 -2476 -2448 598 2642 -2218 159 -1492 -5060 4941
1540 4941 1293 -5591 2025 -2265 -2675 4956 -2194 -2495 -10 -2269 2575 986 -1829 -880 -1784 3027
1556 3027 2009 -2912 371 -312 890 2178 -953 1547 -1906 -1559 6034 -1980 -1980 3466 -4286 2320
1572 2320 5534 -5875 -1004 3769 -987 176 1563 -1028 -3032 2842 3160 -3775 1781 1105 -6300
1587 -6300 6224 3517 -8637 2867 1880 -3710 4811 -716 -5526 2847 1620 -2142 412 1267 -3448
1602 -3448 -1888 6019 -1786 -4892 3802 -3130 -641 6481 -5837 -2451 4897 -2356 773 1964 -2984
1617 -2984 -34 273 1331 1354 -2382 -512 110 2291 2096 -2942 -102 1043 544 3211 -3212 -736
1633 -736 3874 -4069 3061 4762 -6932 1535 4291 -2757 3338 1122 -4795 2051 5498 -1550 -2970
1648 -2970 4198 20 -3592 7607 -74 -6472 6856 -101 -4157 8439 -2616 -6011 7630 1381
1662 1381 -3464 2474 194 -1476 2910 2668 -3311 -224 4106 -2928 1607 5132 -6207 385 5753
1677 5753 -3042 2077 125 -5074 4095 1868 -3336 519 -1444 -831 1249 627 -986 -3333 -563
1692 -563 -286 -674 1018 -5541 -3170 3196 -2985 -571 -651 -7286 2160 1338 -5568 2196 -2316 -6796
1708 -6796 2991 818 -4220 -1578 -415 -2679 205 3237 -4964 -3623 6182 -3350 -3215 6757 -5613
1723 -5613 -2889 7543 -3370 -1660 4624 -3392 51 5154 -1185 -2606 2675 2949 -1470 2636 2317
1738 2317 -3963 4228 4551 -4084 3711 1362 -3802 6071 2233 -2574 2498 -545 1068 3987 -727
1753 -727 -723 697 1723 1972 549 990 -1566 729 3423 -1409 1571 615 -4112 4699 1923 -4906 2872
1770 2872 -689 -2270 4483 -1406 -3414 1603 -524 -459 1231 -362 -3044 -312 3847 -2136 -1790 2292
1786 2292 -4845 1997 5431 -6554 -577 2949 -4555 2920 3246 -5630 -813 2032 -682 -242 518
1801 518 -2309 -3959 3292 1823 -4762 957 -1160 -3427 3992 -630 -3487 1221 -2283 644 2413
1816 2413 -2663 49 618 -930 2162 217 -1150 147 1454 1618 -1368 1099 1414 -2235 3914 913
1832 913 -3923 3230 447 -1056 3841 -2232 -2089 3245 -316 356 342 -1979 291 1729 1997 -1522
1848 -1522 -1387 1556 -1061 2112 3109 -5007 175 3134 -1768 3004 332 -4293 2186 1197 -220 781
1864 781 -2701 -1042 512 881 28 -2945 -772 -971 -979 2148 -3610 -3191 2104 -2757 29 1810 -4895
1881 -4895 -326 1445 -1795 624 -1272 -1432 456 117 966 -1546 -881 1964 -745 859 179 -2823
1897 -2823 2270 259 -724 2029 -3192 -177 3745 -2088 461 279 -2685 1712 1930 -289 -998 -954
1913 -954 2404 764 1254 1654 -3067 1717 3846 -63 2213 69 -1116 4466 1836 885 2139 -1291
1929 -1291 1818 3528 736 687 -586 997 2069 300 1896 -1454 -903 3319 -393 197 1006 -2533
1945 -2533 1565 1669 -1341 1013 -1580 -375 2543 -964 -182 -495 -1280 2142 104 -794 -687 -1909
1961 -1909 1732 -289 -1874 313 -3317 -141 1765 -3116 -1315 -1433 -3355 1311 -648 -2723 -1403
1976 -1403 -2516 358 -9 -2326 -980 -2359 58 1167 -1862 232 -1248 -1753 3116 -707 -1339 1195
1992 1195 -1789 1003 1803 -2145 -37 21 483 1639 -1125 288 -551 -399 2757 -1245 -1351 1078 -1241
2009 -1241 1971 1016 -2309 852 -293 1118 3165 -1376 -114 1145 150 2610 244 -1207 678
2024 678 63 2507 1366 -1568 408 -325 1371 2531 -1665 206 142 -1178 3529 -694 -2566 1188
2040 1188 -1456 607 2265 -2191 -1056 576 376 665 -924 217 -1251 -298 2896 -2003 -1181 1899
2056 1899 -2292 921 1930 -3334 504 949 -726 788 -1350 -862 260 -50 1005 -1558 -691 825
2072 825 -1577 1344 185 -2616 1390 99 -573 1385 -2421 -351 2213 -247 1169 -885 -1332 2418
2088 2418 63 953 758 -2409 1045 2028 1293 279 -2018 558 1139 614 3056 -2383 -1734 3555 -684
2105 -684 1222 2328 -3584 250 2873 23 437 -280 -947 261 1873 1313 -2807 -56 1881 -2364
2121 -2364 2246 1317 -4079 1762 1274 -2048 1958 -1260 -2431 1442 343 -1097 -1259 -246 89 -1417
2137 -1417 361 -1191 -3052 1756 -745 -2062 889 -2782 -1031 1550 -1556 -493 -1502 -2066 1704
2152 1704 -955 -1427 -73 -2435 450 1218 -1354 -837 -1358 33 312 -18 413 -3190 -396 3284 -2017
2169 -2017 449 1445 -3997 1729 2801 -2936 964 896 -1915 1719 1985 -994 -1329 2019 1490 -552
2185 -552 2571 -351 -2666 5043 1092 -2252 3622 -277 -975 4252 45 -1224 1705 653 993 1199
2201 1199 1079 -931 -205 3277 -107 -797 1751 -1278 842 3066 -1173 525 467 -973 2675 -193
2217 -193 -798 807 -1289 1475 1332 -2208 -97 302 -132 469 -278 -665 -1927 703 1697 -2901 282
2234 282 282 -3772 2866 1157 -4577 932 237 -2821 1933 -551 -3097 180 1212 -742 -1304 611
2250 611 -1546 -1583 3500 -1163 -2944 2248 -1820 -715 3032 -2799 -1388 1919 -1280 575 876 -1741
2266 -1741 -373 336 1294 -378 -737 433 -960 1542 1517 -2675 975 712 -907 2755 -611 -1800
2282 -1800 1781 -236 863 1484 -2130 516 1313 404 1306 -886 -793 542 871 883 -1497 28 374
2299 374 -1307 2709 -301 -3306 2612 -194 -1451 2733 -2099 -2118 2494 30 -876 209 -482 -835
2315 -835 457 1769 -1972 -1554 1930 -1553 141 1782 -3624 -469 2299 -1930 741 -2 -2423 861
2331 861 650 -528 -574 -1339 -58 -261 215 264 -2590 238 562 -704 1566 -1375 -1301 2009 -1009 683
2349 683 1268 -2532 1330 1517 -875 872 207 -179 1430 871 200 -706 727 1648 -505 1285 178
2366 178 -1661 2808 811 -712 1860 -1205 413 2790 -822 205 392 -462 1898 1486 89 -533
2382 -533 -171 2087 543 832 830 -2504 1533 2307 -1527 1036 -607 -1857 2101 656 -939 22 -1496
2399 -1496 222 635 -530 -364 -1563 -243 194 -809 370 -1670 -1247 1554 -1658 -397 266 -2617
2415 -2617 365 276 -2058 325 -1120 -685 871 -1734 -563 -518 -816 828 -984 -1096 -648 -1359 1325
2432 1325 -1198 -1897 659 -2040 233 2041 -2405 -668 59 -1018 1514 601 -1085 -439 -352 1609
2448 1609 470 -579 522 -1133 1219 1989 -1084 799 -338 -254 2610 -216 -736 1576 -744 935
2464 935 1275 -1061 793 98 862 668 -607 717 311 -159 1907 -917 -427 1258 -289 1479 541
2481 541 -1553 1377 267 867 1939 -1694 -177 998 -125 1211 -562 -1093 -74 -61 1317 -542
2497 -542 -1735 273 -1030 340 1304 -2434 -313 188 -791 1680 -897 -1867 645 -591 500 349
2513 349 -1557 -133 -315 705 302 -1684 297 5 -786 1594 -998 -1337 1443 -841 655 642 -1431
2530 -1431 609 50 134 645 -1529 431 963 -177 1228 -553 -625 1416 -211 937 465 -1189 1530
2547 1530 593 268 929 -1100 461 1132 -619 1354 -567 -808 2021 194 167 144 -1116 932 778
2564 778 369 93 -1594 868 532 -511 1259 -1657 -1626 2382 -582 -696 200 -1899 202 863 -183
2581 -183 -533 -1635 312 5 -653 893 -2238 -1233 1517 -903 -302 -8 -2536 301 466 -822 -119
2598 -119 -1419 -349 264 -871 527 -1234 -1084 1413 -724 -119 201 -1727 751 194 -868 -316 -1153
2615 -1153 422 612 -825 594 -987 -467 2355 -792 -448 822 -792 1070 1525 -414 219 155 1445
2632 1445 579 -80 1292 -974 477 2874 -986 126 1351 -1286 1332 1840 -886 258 411 695
2648 695 844 491 550 -924 568 2180 -718 328 801 -1370 2012 1339 -1508 779 -13 103 772
2665 772 -653 -206 -524 84 1189 -1217 -268 618 -1128 1071 244 -1538 168 -411 3 386 -1248
2682 -1248 -85 -1013 -479 1485 -1727 -1054 613 -1546 699 623 -2196 -374 -47 -421 -276 -938 -849 -1306
2700 -1306 668 1264 -2515 -501 746 -1820 1710 343 -2473 451 253 -495 677 -415 -972 -260
2716 -260 831 737 -1023 446 223 -1136 1918 117 -2074 1455 186 -296 1365 -697 -483 514 424
2733 424 1063 -672 -279 525 -545 1193 -50 -1196 861 458 -75 482 -703 242 321 264 1012 -1355
2751 -1355 -100 1579 -892 698 776 -2081 1056 855 -543 329 -508 -644 416 397 -76 -1463 317
2768 317 812 -1432 1410 -645 -2172 1591 205 -1078 1267 -1013 -1180 1240 59 -659 -911 -203
2784 -203 204 -269 1097 -1133 -1343 1585 -665 -616 1216 -1771 -176 1651 -283 -72 -398 -848 1033
2801 1033 277 416 66 -936 1428 382 192 720 -768 430 1165 -15 934 -706 303 1287 -536
2818 -536 749 514 -1368 2127 669 -1148 860 -167 -237 1191 424 -347 -693 844 509 -894 1072
2835 1072 -693 -1359 2420 92 -1206 1303 -1367 -195 1971 -761 -512 9 -228 485 -16 -253 -1097
2852 -1097 -922 1233 -279 -574 5 -1961 404 738 -1839 -7 -758 -1203 1050 -759 -1321 -334 -640
2869 -640 178 161 -1031 -662 -895 375 26 -940 67 -960 -443 1221 -891 -444 63 -1067 1300 -20
2887 -20 -1516 563 -344 -185 1106 -797 -738 120 189 630 -152 -3 -182 -51 1737 -288 -636 1272 -708
2906 -708 660 2022 -1314 -32 1134 -135 1470 392 -528 551 738 1315 136 -341 751 -391
2922 -391 1210 941 -1331 590 175 -407 1601 -613 -471 988 -402 817 610 -1151 335 228 202
2939 202 438 -1020 -118 -253 83 766 -664 -136 556 -711 1266 -290 -1609 573 -383 -282 913
2956 913 -1379 -824 636 -339 241 -870 -638 -403 -334 942 -723 -1125 356 -747 251 831 -1858 62
2974 62 366 -830 814 -388 -1194 839 183 299 -12 -580 482 -21 836 49 -1367 884 254 -368
2992 -368 893 -1163 -689 1257 -603 302 81 -1176 884 481 186 305 -877 489 847 198 444
3009 444 -837 58 971 -158 672 -837 -1153 1373 62 226 606 -1309 28 1008 -467 183 -547
3026 -547 -566 418 117 -165 -517 -703 453 -417 120 -189 -1662 721 539 -1017 629 -725 -1008 881
3044 881 -167 -615 13 -703 254 -32 -397 -275 -1044 565 427 -435 254 -1195 -400 1526 -544 -213
3062 -213 123 -995 1069 211 -499 258 -692 614 1072 -613 494 -292 -57 1428 -109 -69 368 -330
3080 -330 1412 641 182 568 -561 1023 1131 -831 910 184 -126 1739 300 -176 678 176 684 518
3098 518 313 187 -386 1370 441 -932 978 -643 -193 1886 -409 -518 861 -262 710 474 -921
3115 -921 -190 -420 557 365 -679 -106 -1112 16 1319 -1045 -724 -135 -734 705 1 -1176 -533 -774
3133 -774 8 33 -1180 -121 -670 -684 646 -1239 -802 307 -900 280 -215 -1204 -261 -620 309 -251
3151 -251 -1137 261 -289 -100 1027 -1369 -651 1071 -504 146 199 -993 169 552 478 -504 -821 657
3169 657 -186 343 1368 -1386 -414 1483 -420 964 402 -1162 342 903 263 352 -368 182 0 799
3187 799 1353 -1084 100 815 -324 1010 151 -1411 726 602 465 435 -428 373 -135 338 814 -1203
3205 -1203 -370 988 -566 615 350 -1311 153 300 50 176 -629 136 -421 -67 712 -1552 -155
3222 -155 1157 -1341 226 332 -1519 334 695 -761 -229 -110 -2 -388 220 -29 -1689 537 1148
3239 1148 -1524 483 240 -1532 1516 519 -941 260 -96 130 662 307 -377 -780 735 1258 -604
3256 -604 817 -324 -1018 1572 846 -567 296 -676 242 1374 299 268 -953 165 1414 -219 582
3273 582 -28 -760 992 464 -174 387 -496 187 642 269 383 -1029 -112 1028 -789 845 322 -1125
3291 -1125 808 19 -1142 626 -555 -438 213 -312 -573 -675 343 -208 -1130 461 -274 -995 1311
3308 1311 -647 -1348 477 -636 -310 611 -1026 -1049 -70 529 49 -988 -157 -834 -731 1417 -444 -1120
3326 -1120 269 -1044 91 592 -1049 -165 -409 -34 915 -787 -191 116 -808 1281 372 -1022 615
3343 615 -42 637 536 -170 216 -334 792 877 -879 632 628 -450 1667 522 -1017 890 353 383 962
3362 962 -335 -243 633 997 696 -513 624 334 -77 1522 -182 -575 1151 -194 148 903 -1015 -101
3380 -101 868 -60 661 -269 -487 126 70 719 -562 -611 681 -698 673 503 -1584 519 106 -94 332
3399 332 -823 -783 437 -438 461 -497 -1012 258 -311 6 268 -1187 -157 -99 -18 204 -1552 -242 496
3418 496 -597 682 -393 -1047 948 -349 -247 511 -1133 -392 747 -240 86 -716 -60 369 -73 1100
3436 1100 -859 -649 1250 -275 211 744 -1217 728 955 -411 643 -175 -128 920 343 491 -138
3453 -138 -270 564 -381 324 260 -1143 923 545 -268 574 -745 -40 1081 -328 455 -23 -747 891
3471 891 492 -341 151 -504 296 569 -233 -215 -1009 268 565 -609 344 -690 -648 1138 -287 -637 280
3490 280 -1045 230 675 -771 -335 -337 -143 475 -233 275 -528 -598 877 -678 -450 360 -1141 697 543
3509 543 -1014 442 -163 -583 1163 -153 -150 -69 -139 661 162 -35 -19 -538 1258 390 -423 611 -574
3528 -574 126 1429 -567 -83 318 -292 1218 341 -189 400 69 614 917 -293 297 -165 385 1147 -338
3547 -338 83 26 70 1572 -208 -350 762 -809 757 602 -1056 140 -226 -229 693 -232 -321 -27 33 611
3567 611 -499 -467 204 -896 711 245 -1377 325 -166 -780 788 -1024 -471 204 -165 130 -406 -912
3585 -912 -278 -381 500 -220 -1281 160 -684 -136 659 -1156 -471 101 -457 667 -366 -933 319 -139
3603 -139 341 344 -1158 373 -22 16 797 -703 -285 154 -13 983 -457 128 517 -269 657 581 -833 685
3623 685 362 -391 890 -455 -4 823 -153 452 -133 -133 411 442 614 23 -1015 905 239 -26 1060
3642 1060 -880 -141 1343 -191 403 340 -653 604 261 653 107 -788 754 58 92 615 -1304 -114
3660 -114 1194 -413 502 277 -733 551 -120 314 -98 -870 244 -20 -350 546 -866 -118 717 -450
3678 -450 57 -140 -770 268 -42 355 -381 -977 478 162 -448 600 -1023 -672 1271 -425 -83 406
3696 406 -706 387 212 240 130 -357 707 -309 -111 792 -1197 316 1321 -888 87 244 -966
3713 -966 495 700 -57 -118 -87 833 -11 49 207 -889 349 1022 -912 -214 117 -859 1131 233 -480
3732 -480 -155 -271 218 257 -168 194 -911 223 979 -532 -114 -60 -736 377 210 -550 -242 -675 350
3751 350 -65 -665 333 -991 -171 680 -1082 -98 -31 -930 144 109 -749 -245 -272 -57 -205 -527 105 -874
3771 -874 114 503 -1180 -20 545 -1035 941 -240 -956 332 145 168 93 -381 43 -268 866 362
3789 362 -838 456 235 -245 1518 -161 -965 919 99 343 428 -402 -3 -77 749 1030 -608 240 383
3808 383 -75 1244 200 -526 753 356 523 275 -235 519 -303 562 831 -1088 183 667 -63 912
3826 912 142 -837 489 160 157 68 -539 -211 -130 329 317 -1183 168 252 -364 772 -445 -1300 789 -180
3846 -180 -98 161 -838 -130 2 -23 -147 -940 21 -192 -361 347 -759 -964 322 -197 -197 50 -1063 62
3866 62 99 -341 176 -965 -134 231 -294 277 -583 -564 474 -144 375 180 -798 335 -170 -183 329 -640
3886 -640 122 333 -547 543 73 -731 858 25 -98 441 -659 317 606 375 303 -433 187 347 -352
3905 -352 898 -277 -839 1553 70 -311 632 -607 365 431 -161 -123 -227 173 266 -130 179 -453 -453 574
3925 574 -333 -84 -50 -665 599 515 -439 326 -645 -79 865 -520 158 -397 -562 793 -212 -524 -144
3944 -144 -578 380 23 -570 -40 -940 26 594 -579 381 -287 -433 994 -138 -405 415 -473 527 632
3963 632 -599 116 -392 234 812 -59 254 -307 35 803 -238 -101 296 -467 627 725 -585 249 -23
3982 -23 -58 610 -314 349 -15 40 723 182 -35 36 -285 723 391 -767 463 -245 199 618 -662 2
4002 2 38 -83 987 -73 -482 0 -317 617 174 -375 69 -468 226 398 -684 -34 -127 -393 485 -540
4022 -540 -588 291 -665 19 191 -1014 -147 -43 -420 207 -729 -194 -83 -255 399 -1135 -487 126 -587 289
4042 289 93 -1367 167 -97 -83 383 -575 -215 160 8 363 -649 -427 357 82 389 235 -577 664
4061 664 133 -86 667 -563 368 337 -203 731 -15 -245 601 -53 256 529 -372 278 441 71 281 -5
4081 -5 619 411 199 857 -208 -100 659 -275 456 401 -477 440 269 -109 429 -372 -34 463 19 474 -260
4102 -260 -160 508 33 229 -180 -721 447 164 -319 351 -629 10 701 -62 -54 -650 -499 383 -146 -139 -65
4123 -65 -651 442 219 -363 442 -678 -52 590 -238 -59 -477 -386 418 -302 -81 -13 -778 593 188 -302
4143 -302 265 -704 -136 485 -407 132 -532 -249 486 86 282 -186 -694 733 627 -524 308 -396 -70
4162 -70 470 -159 -49 -16 36 546 77 55 141 -445 829 297 -429 524 -430 138 787 -462 -11 300 -365
4183 -365 404 5 -127 -198 -599 649 331 -249 229 -287 30 749 -765 -74 -106 -334 669 3 -733 0
4203 0 -233 258 25 -600 141 -612 -19 593 -262 -380 -212 -391 496 -255 -274 -158 -378 426 -11 -899 212
4224 212 -312 96 742 -666 -107 290 -166 401 86 -226 35 -150 858 54 -277 264 -314 200 820
4243 820 -535 87 429 142 778 342 -21 81 403 505 85 -123 517 -108 721 837 -831 322 557
4262 557 -295 705 196 -407 527 311 529 163 -354 365 106 67 323 -534 59 341 -176 337 -294 -665
4282 -665 195 -25 211 -157 -605 372 -266 117 302 -1133 -74 69 -587 72 -224 -548 -234 -116 -259
4301 -259 -246 -578 -73 -308 -302 216 -1053 -144 262 -621 450 -318 -726 458 2 -363 -211 -674 90 -283
4321 -283 197 -82 -687 181 447 -414 451 52 -536 400 8 126 106 -412 382 564 11 152 -600 386
4341 386 469 -73 427 -283 -478 877 235 198 91 -623 598 273 180 352 -630 597 530 -154 511 94
4361 94 -378 143 103 -154 -45 -437 236 335 24 413 -506 403 602 -701 329 -299 -575 825 -194 -371
4381 -371 -20 -248 250 202 -152 118 -498 154 65 -571 9 -205 -425 750 -149 -439 -3 -235 538 74
4401 74 -279 103 -368 115 573 -394 93 -145 -169 564 -78 -444 -108 -27 428 131 -160 88 -226 518 627
4422 627 -727 74 -23 -178 1066 -113 -253 -31 -137 571 223 148 -40 -555 359 615 -392 251 -168
4441 -168 -124 1003 -295 -195 139 -323 199 -146 -334 315 -388 103 238 -255 -29 39 206 229 -759 -41
4461 -41 455 -276 253 125 -647 189 -48 72 209 -609 -115 -23 -222 298 -739 -446 14 -451 13 -412
4481 -412 -883 139 -208 186 134 -959 135 -75 -170 664 -338 -430 -23 -369 395 272 -554 79 -139 34
4501 34 424 -470 -59 14 -79 501 -345 -90 551 -72 359 236 -423 377 382 176 484 -328 317 238 41 299
4523 299 -112 -18 526 154 580 137 -495 334 346 213 676 -108 236 469 132 597 -328 -250 516 62 103
4544 103 -57 -451 501 135 34 40 -494 123 439 -317 300 -292 -150 582 -146 -12 -339 -509 566 91
4564 91 -396 -140 -564 -29 476 -253 -27 -773 -505 183 -114 19 -127 -455 416 -89 -382 -132 -676 -95
4584 -95 391 -135 63 -244 -321 421 -349 24 -303 -317 341 34 -220 -57 -397 103 607 38 210 -230 99
4605 99 699 -300 -86 102 -252 410 323 -518 206 39 299 346 60 84 -351 53 634 -76 -100 -150 -377 865
4627 865 333 -559 205 -187 340 344 -370 98 -444 67 496 -426 -183 1 -140 656 55 -499 189 -363 94
4648 94 267 -415 -165 -183 -53 452 -300 -5 6 -435 307 -62 -582 124 53 164 120 -375 143 -207 -120 353
4670 353 -606 -311 211 -279 333 138 -398 173 305 291 418 -346 135 71 -28 684 -299 -124 108 -205 441
4691 441 397 -435 455 155 548 280 -270 166 132 102 342 -229 -45 222 -131 722 269 -311 346 -204 303
4712 303 506 -574 -67 332 12 359 -221 -204 353 -334 665 -37 -614 736 -54 439 146 -696 -27 100
4732 100 -191 205 -413 -262 113 -179 101 -354 -552 246 -316 -68 145 -450 -163 384 -195 -6 -322 -383
4752 -383 250 -247 184 -506 -935 327 -310 1 483 -823 -24 297 -333 -14 -327 65 28 -279 157 -212
4772 -212 -480 534 76 -135 251 -502 236 772 -10 279 50 -127 437 63 -41 -179 -278 552 282 56
4792 56 514 -484 262 562 54 474 -316 119 606 -33 190 -67 -172 501 360 131 154 -518 320 481 -217
4813 -217 350 -63 101 796 -71 269 -167 -135 802 -216 24 638 -269 356 427 -522 19 -126 -467 479
4833 479 -178 -122 -325 -404 310 -283 -179 274 -669 76 428 -687 228 -302 -577 660 -258 -157 -287 -183
4853 -183 145 -138 -166 -190 -294 337 233 -140 129 -256 -175 533 -218 4 92 -127 486 -294 -124 408 -343
4874 -343 260 560 -519 -22 277 -73 538 -179 -131 176 24 514 -45 -327 142 -26 30 358 -707 -91
4894 -91 28 -106 433 -293 -187 -36 183 180 -115 -318 19 -323 210 113 -640 21 4 -334 342 -347 -21 148
4916 148 -259 320 -304 -343 10 -50 197 -68 -541 46 -76 -134 207 -227 -221 207 -242 307 -374 -604 168 -154
4938 -154 157 149 -536 68 213 -19 187 -457 125 113 -43 91 -29 -235 599 163 294 93 -600 464 240
4959 240 -98 678 -387 63 788 203 456 191 -339 324 -8 458 -14 -554 463 199 195 504 -372 -238
4979 -238 652 -93 505 183 -291 494 184 365 20 -414 81 76 -271 443 -157 -220 601 -188 433 -99 -359
5000 -359 113 -194 -79 64 -571 155 428 -232 372 -365 -448 428 204 -279 -215 -539 159 -296 154 33 -1050
5021 -1050 -56 45 -433 -39 -653 -342 358 -205 -347 -337 -464 328 -200 -295 232 -75 306 -206 -469 113
5041 113 -441 -47 499 -317 118 -17 -322 427 125 298 241 -60 475 449 -221 165 97 61 655 -290 113
5062 113 -18 261 668 128 105 152 -340 264 273 -280 312 -214 -350 651 -271 -213 144 -109 461 -116 -69 125
5084 125 -214 431 345 -385 165 -352 0 170 -436 32 236 -200 351 34 -221 43 -169 148 -106 -328
5104 -328 81 -250 125 388 -280 -312 -63 -345 139 -272 -452 198 -361 130 120 -479 73 -98 137 461 -462
5125 -462 -140 -122 -201 622 -214 -521 286 -115 236 432 -57 265 -344 42 609 -475 88 585 -109 580
5145 580 98 -259 115 -14 271 95 -278 537 -113 381 443 -290 282 418 -156 308 -185 -450 173 127 108
5166 108 -33 -438 92 250 12 373 -447 -76 268 14 499 -152 -424 153 -119 -22 -5 -416 202 -91 80
5187 80 186 -779 -486 397 -305 -64 -295 -565 -11 -294 -47 -30 -507 -181 -62 -193 130 -814 -263 311 -311
5208 -311 15 -287 -625 445 -95 -178 -80 -517 297 -102 -127 260 -625 -193 180 -19 218 -274 -219 707 38
5229 38 -21 350 -323 48 245 384 187 -505 98 487 3 -53 -107 -205 753 300 -43 235 -21 392 377 115
5251 115 39 -90 54 434 -79 178 -143 -22 579 -38 133 112 -248 376 254 -332 240 -27 282 343 -327
5272 -327 100 -205 -293 440 57 -216 333 -353 71 415 -410 267 -275 103 353 -452 -24 -8 -418 416 -147
5293 -147 -343 -151 -363 306 -181 -355 -151 -232 -116 221 -462 -248 -354 -39 429 -334 -358 102 -384 196 509
5314 509 -522 -109 -107 -200 292 -316 22 -136 -35 264 -233 -79 288 -138 330 550 -744 213 22 331
5334 331 281 -249 -223 -108 -84 628 124 -352 275 150 141 133 -401 -56 -12 -104 266 -285 119 96 -387 105 -275
5357 -275 -379 389 -20 60 325 -528 43 82 -258 180 -263 -297 -110 109 131 -346 -362 241 -472 235 -24 -544
5379 -544 51 202 -259 294 -215 -124 2 -151 212 -314 -247 211 -24 294 -34 -624 -167 103 -216 240 -170
5400 -170 -40 343 -80 10 -105 -267 378 -181 106 197 -116 177 375 107 344 -14 -14 317 135 126 -146 148
5422 148 534 -6 211 290 -454 296 463 -88 282 -251 43 444 199 289 -19 -92 489 -364 271 132 -321
5443 -321 487 35 -274 74 -491 -76 342 -264 -75 -153 -271 446 -66 -49 -177 -624 12 8 -26 -153 -396 -374
5465 -374 149 -205 41 -183 -250 398 -200 -181 -190 -569 -127 184 -376 -36 -491 136 252 56 24 -133 -341 263
5487 263 -336 -106 78 -820 321 358 -283 263 36 174 278 -31 -319 75 -74 331 77 -54 -63 -235 615
5508 615 286 -130 239 -68 -220 460 -237 59 140 -167 454 132 -84 138 -106 146 286 -192 85 -27
5528 -27 282 281 -106 42 -291 34 606 -266 17 414 -138 80 109 -288 39 -7 -130 611 -108 -201 270 40
5550 40 266 -118 -107 78 -473 277 285 -136 57 50 -96 277 -298 -36 298 -34 52 -132 -256 406 -11 138
5572 138 200 -567 8 -133 -33 199 -534 165 131 -63 502 -254 -141 432 83 177 173 -405 223 144 22 191
5594 191 45 160 279 127 343 -379 88 53 2 430 56 -202 341 5 274 8 -402 -185 473 -264 122
5615 122 -30 -31 118 -161 346 161 -267 296 -83 -111 393 -391 -154 238 -100 -131 67 -262 185 -297 162
5636 162 -208 -399 76 148 -5 35 -323 -88 351 66 46 -358 -477 84 -143 -290 29 -611 243 1 -328
5657 -328 -21 -471 -246 56 -287 46 -101 -169 184 -318 -114 101 -438 227 229 -250 391 -134 90 530 40
5678 40 87 -259 -113 614 12 215 107 -194 575 72 -44 196 32 -62 485 -123 51 125 -400 657 312
5699 312 -171 28 -102 177 249 74 124 -163 233 515 192 31 46 -461 85 -97 -185 195 -158 205 157 -268
5721 -268 261 -316 -5 90 -192 -29 0 -373 309 105 -360 78 -169 212 71 -180 -126 -489 274 354 -245
5742 -245 -169 -64 -32 250 -526 -218 -37 -111 221 -87 -328 -101 -258 135 382 -269 339 6 -319 167 -281
5763 -281 -109 194 -78 471 93 -20 272 -83 -31 156 -388 52 276 -228 294 93 -209 212 -84 92
5783 92 201 -372 -6 -67 101 275 -289 178 40 -47 385 -30 -235 207 -67 269 108 -195 -191 71 36 258
5805 258 -304 164 31 -152 379 -146 -215 61 -373 103 140 -277 68 -187 259 78 -459 46 124 -321 474
5826 474 -430 -110 406 -247 202 -164 -428 143 10 58 -2 -193 76 143 -166 241 -51 -353 521 -398 187
5847 187 20 -358 186 243 84 141 -183 -196 315 221 110 41 -182 365 449 370 -12 -500 229 221 176 231 -70 221
5871 221 266 -107 293 -117 -120 158 -210 41 102 -365 330 59 8 130 -413 283 153 -301 284 -430 -124 347
5893 347 -206 157 112 -487 55 -85 -237 -19 -215 -219 150 -109 99 -161 -251 475 -277 -222 -174 -578 94 -35
5915 -35 -314 91 -247 -7 34 -461 47 -110 -544 214 158 -26 16 -287 36 109 -89 -14 -320 33 92 -434
5937 -434 -26 -294 -337 182 -196 -281 45 -460 69 233 -181 111 -91 81 463 -57 -28 -82 -12 786 104 78
5959 78 187 -219 374 153 -319 106 -341 262 394 -1 -46 125 218 471 -330 -67 335 -255 289 203 -179
5980 -179 26 -120 -50 469 -78 6 52 -253 356 -118 -403 -29 -292 251 -52 -413 99 -73 -19 356 -10
6001 -10 -8 6 17 445 -235 -177 177 -304 22 -171 -393 93 -87 -159 199 -364 -192 -33 -160 234 -369 -211
6023 -211 100 58 63 263 -387 370 134 -118 373 -464 -76 428 -208 459 -202 -287 213 -72 299 -28 -344
6044 -344 143 -148 -95 222 -274 89 -54 152 174 36 -295 118 59 172 -76 -142 308 -45 -82 115 -408 -90
6066 -90 -125 357 203 47 -66 362 -325 139 229 -668 148 -171 -176 255 -377 -63 121 -179 245 -260 82 83
6088 83 -29 171 -117 -369 107 -3 -196 195 -341 -270 -81 86 -95 -207 -79 262 23 157 81 -582 422
6109 422 -90 -246 16 -250 230 326 -106 172 -291 -66 408 -27 -9 182 -221 611 165 -182 302 -218 206
6130 206 205 -55 -79 -25 59 341 -174 246 176 -178 356 398 -251 511 -11 229 508 12 124 -51 49 242
6152 242 -14 94 113 -302 724 117 -154 53 -383 99 378 -100 -97 23 -108 256 -29 -63 195 -34 286
6173 286 70 -264 -148 -330 216 98 -283 1 -120 -142 218 -233 -246 -178 -195 174 -115 -321 286 -329 5
6194 5 450 -597 -127 47 -19 360 -454 -487 -323 -113 350 -171 -473 -97 -169 118 333 -461 308 -58 -203
6215 -203 468 -126 -180 50 47 281 -48 -255 189 -43 340 443 -333 7 50 56 239 -22 -241 192 48 468
6237 468 -258 -315 23 296 1 35 -254 13 85 -3 -2 -7 85 263 168 320 -221 -299 -13 -110 123 341 -249 -44
6261 -44 231 -128 58 -177 -414 155 -136 184 -119 -276 98 -150 -37 20 -542 113 197 -114 498 -219 -320
6282 -320 318 -67 217 -37 -380 270 -25 15 54 -88 34 201 -174 95 -207 -248 148 -98 67 87 -345
6303 -345 190 332 89 171 -182 -33 218 -178 401 -36 -162 438 86 283 -158 -92 152 148 -126 -112 -291 14
6325 14 81 -134 263 -102 -25 384 -27 128 67 -146 281 141 -212 233 26 72 302 -284 -11 -209 -159 405
6347 405 -209 163 -198 -161 79 -75 -230 -99 -349 63 154 -353 -58 -321 -160 258 -332 -285 212 -268 -148
6368 -148 4 -108 -149 -573 226 10 -343 398 -116 37 700 -374 -20 159 -298 48 60 -64 -63 -66 66 130
6390 130 -110 13 -116 20 400 -81 40 347 33 461 185 -182 102 12 429 -140 -241 417 148 -123
6410 -123 377 -106 -134 272 -75 207 12 34 180 -10 198 97 -318 33 194 11 111 -152 -15 234 -55
6431 -55 279 352 -45 -112 10 -73 155 -268 236 6 -348 368 -192 -126 29 -558 235 150 -298 -75 -34 -70 72
6454 72 -286 -247 36 -148 427 53 -126 213 -333 188 -112 -273 228 -86 111 139 -337 167 181 -157 234
6475 234 -266 -32 -42 104 122 18 -286 7 145 4 243 -159 28 -234 -152 267 -155 -522 257 -232 -94
6496 -94 -56 -227 46 -54 290 306 -163 282 246 163 286 33 -2 98 132 107 -68 -352 306 244 275 178 -418 86
6520 86 96 123 7 -92 -93 337 -223 197 55 -186 128 88 -106 94 -75 297 71 -103 193 -231 -378 25
6542 25 -142 -256 139 -414 335 251 119 118 -369 171 198 230 150 -122 4 357 46 138 -179 -304 411 154 -97
6565 -97 -3 10 60 319 -51 134 -7 115 336 253 -87 153 -34 468 386 -74 381 -228 168 361 97 144
6587 144 -39 -37 514 -1 221 33 1 211 -3 78 29 -6 123 197 195 103 13 117 479 -94 -34 -248 -175 367
6611 367 57 15 -83 -88 194 182 -458 -95 -309 73 183 -290 -277 -211 -204 195 53 -48 -231 -309 28 17 -398 -58
6635 -58 -44 -141 14 -226 -40 129 -382 178 -153 -458 70 -165 97 278 -302 203 20 208 325 -200 127
6656 127 -119 4 350 165 -143 -19 -70 23 159 -149 124 41 187 322 17 -331 -67 -107 240 183 -14 228
6678 228 -107 98 77 -142 157 76 -90 96 8 -99 -123 8 335 229 48 422 -255 189 -107 -113 161 165 37
6701 37 424 -204 -232 122 -46 -74 -112 -147 -1 94 6 155 -37 -132 -183 -213 227 -150 -256 277 44 124 -224 -171
6725 -171 107 36 -38 -20 -67 -46 238 -190 -20 -149 129 -7 2 181 54 -129 1 134 55 244 -272 14 -222
6748 -222 75 272 -200 -117 408 -57 180 252 -92 201 -31 -55 222 -69 339 21 -19 297 -41 -9 244 89
6770 89 -167 -41 -172 100 100 45 210 -449 -26 180 -198 15 60 -209 551 -56 141 -238 -52 150 -94 -321
6792 -321 -43 -474 -140 86 -253 -184 -114 -156 34 -186 -98 -34 -139 274 26 -204 -46 -34 -26 139 -258 -154 -84
6815 -84 -145 125 -9 66 52 -275 149 -129 144 23 -269 127 242 -154 154 -155 43 128 -251 -167 48 -185
6837 -185 162 11 -261 105 -56 310 380 -100 256 -91 -83 201 -176 -10 -18 181 364 223 -228 158 203 200 237
6860 237 -250 108 116 46 418 90 -67 25 67 399 32 -22 295 144 261 321 -354 241 124 -121 149 -201
6882 -201 -114 73 -58 152 -130 -288 312 -208 163 22 -474 -178 6 8 136 -184 -324 166 10 -12 70 92
6904 92 288 -42 143 79 -348 -302 204 -187 213 5 75 -19 -273 299 -67 -154 245 -112 182 -2 7 80 156
6927 156 -172 332 -216 -221 49 -264 165 77 -151 355 109 76 -39 -233 200 289 202 66 4 -248 288 -187
6949 -187 -159 -30 -283 127 7 109 -98 -57 221 66 72 0 -152 -22 461 -207 -2 -30 -34 101 -117 126 -258
6972 -258 -134 310 260 -42 24 -217 42 197 -45 -168 -105 -248 168 0 -153 -243 -274 -143 -36 -74 28 -97
6994 -97 -99 220 -214 6 70 -54 215 35 16 43 -157 172 154 91 366 -49 81 119 -191 -99 -66 -59 274 -147
7018 -147 -51 -70 -115 418 273 65 127 -116 59 573 -23 3 249 -194 194 234 336 283 10 374 415 -35 497
7041 497 -16 37 111 -120 295 101 -58 73 120 -200 66 -176 336 333 -50 -62 -220 -99 156 -89 -79 214
7063 214 -368 400 14 -249 220 -209 0 0 -435 17 -182 8 359 -229 -60 43 -168 287 -183 -235 90
7084 90 -150 8 89 -171 11 -164 -146 147 -154 -44 -221 -153 148 19 -7 166 -124 161 62 -231 -33 234
7106 234 78 187 60 -110 133 -165 263 -152 -159 61 30 -28 18 -233 214 144 -146 173 -71 229 137 -154
7128 -154 156 -132 -336 -39 110 114 213 -94 141 -146 305 11 -240 183 186 159 392 -56 -383 62 -332 4
7150 4 -98 -59 58 271 -125 31 -297 -158 75 -31 191 14 58 85 -127 38 98 -349 158 49 -171 -115
7172 -115 -236 -21 76 146 -48 -40 -125 -76 -171 -280 -38 -341 54 141 -75 3 -155 -136 64 -224 111 -94 -117 94
7196 94 -52 -300 198 -236 261 286 -80 8 -293 65 93 -28 552 -61 -49 190 237 -30 43 132 -27 182 -147
7219 -147 133 95 129 45 80 -72 133 -290 307 1 84 156 -45 215 319 -263 12 -453 -5 150 -6 -66
7241 -66 -87 105 136 -125 -326 -94 -395 51 251 69 195 -372 -205 91 -124 36 -229 -155 207 5 -364
7262 -364 172 -331 -38 252 -365 -298 -296 -37 113 -74 75 -66 -72 308 -113 -88 -160 -30 -71 207 65 -91 22
7285 22 -23 115 -82 -187 -29 93 -43 -143 3 221 -213 42 318 -237 173 96 118 287 -107 183 294
7306 294 -287 366 91 -85 179 -52 -133 92 -327 -154 59 131 205 -22 126 -93 -62 167 -154 -10 -149
7327 -149 -215 -13 -58 -493 -65 238 12 178 -142 -166 119 -76 344 77 -249 103 -57 61 -169 -244 132
7348 132 -95 -65 70 -176 9 -4 168 -83 -170 -156 43 67 94 24 -189 -220 -111 -127 190 -372 -153 108 88
7371 88 -88 -222 -413 -92 -74 203 141 -217 80 51 -107 214 -39 60 -55 -138 183 -161 87 169 -129 91
7393 91 173 -274 150 45 -164 27 -230 88 171 -28 137 33 -84 -11 -14 74 53 23 151 107 -256 253 -154
7416 -154 -306 385 92 -140 -15 -235 27 148 124 1 -470 124 46 56 -106 -56 -81 -58 -392 -59 168 -85
7438 -85 -67 161 -267 -59 -71 250 -140 87 23 -213 52 287 -447 156 39 -139 191 59 201 -89 165
7459 165 112 320 -84 28 51 -69 30 49 144 -157 17 136 -278 -212 -53 -142 287 -14 -374 511 -26 260
7481 260 341 197 222 235 -41 275 123 149 -235 -316 337 172 -93 221 -3 8 305 -154 38 -132 92 99 221
7504 221 -77 -60 -12 61 -407 -161 -82 -123 207 -22 -23 -303 83 190 74 279 115 74 -252 15 -92 -69 -52
7527 -52 -62 -295 15 -134 87 -229 -213 231 -11 -353 -160 -50 241 -89 -272 -17 -214 -116 191 -398 -184
7548 -184 -42 -193 70 330 -270 40 -228 -80 -58 -296 119 -89 258 70 -225 -180 161 81 134 -36 16 257
7570 257 149 -3 -108 -96 141 -90 -119 214 -97 -24 83 230 193 73 -56 133 137 9 -14 -175 122 219 -88
7593 -88 295 -139 -140 150 -33 338 91 2 44 -49 -166 -92 -187 222 -79 142 48 -123 179 398 13 -62 -191
7616 -191 -111 24 -117 88 -83 -289 -80 -116 -243 176 -78 164 59 62 19 -72 -469 198 -1 54 -76 -282
7638 -282 184 203 -166 131 -244 25 152 -1 -111 -54 215 152 42 -248 295 -159 65 28 119 3 -50 -70
7660 -70 271 -93 256 60 -272 163 -118 -14 84 -100 71 33 -34 143 -264 -250 109 -175 -135 -44 -86 100 38
7683 38 -96 254 -295 -155 -24 132 194 -225 186 22 -186 -87 -319 -208 65 -342 -70 -2 -169 -90 89 -114
7705 -114 257 -132 -47 22 -209 -200 -246 -54 -67 -18 -324 -8 -15 79 -51 -126 -106 -39 222 -220 -215 240 -52 42 421
7730 421 -40 -110 321 -122 181 297 -246 185 -23 -163 296 -18 78 447 32 339 -46 -141 75 -291 272
7751 272 286 -34 76 303 89 428 85 -10 37 97 205 -132 -104 159 5 127 140 -38 270 -19 -133 187
7773 187 -19 10 -33 -107 290 294 -202 170 118 172 54 -230 230 223 -68 205 -3 -175 189 -29 323 -60 -231
7796 -231 135 -23 -198 55 -601 -35 208 -28 145 29 -314 -221 -358 94 -301 -168 65 -269 125 -52
7816 -52 28 52 -182 -13 74 -295 23 -184 -317 89 -51 -46 284 96 158 -3 -132 157 137 35 -90 -130 111
7839 111 30 -109 -62 54 -338 147 -330 -54 165 -151 121 289 66 369 8 77 58 -171 50 177 -121
7860 -121 256 -86 76 14 -85 -19 277 29 43 45 201 111 268 120 -315 -170 115 -233 -36 145 -18 86
7882 86 351 -4 113 -109 -277 93 -63 -90 -35 -178 82 -65 -269 -79 -142 124 151 -284 59 -127 54 111
7904 111 33 0 -63 12 4 57 -220 5 15 135 401 -120 73 -48 -632 -62 -319 -2 42 -54 109 6 -154
7927 -154 86 11 -41 114 -44 275 -175 214 -91 19 195 61 -48 232 -113 -27 135 -112 236 -82 -220
7948 -220 22 140 -267 280 82 62 -133 7 273 198 87 1 -169 36 -180 -53 91 -55 67 337 -52
7969 -52 -199 -79 -19 -29 -126 -24 -275 131 -211 -104 -215 -39 14 293 33 3 -125 128 -252 -161 -11 99
7991 99 89 -159 227 82 -414 -214 143 -301 -131 -73 100 -90 -140 44 5 -180 -13 -92 250 13 -95 236
8013 236 -188 -138 323 -130 193 -1 67 66 -35 70 71 -124 -45 297 -38 240 51 -81 113 -51 -142 58 -42
8036 -42 123 177 -72 284 39 -43 248 -44 57 1 -56 20 -112 204 17 -157 -72 141 -164 69 -147 22
8058 22 33 -7 -146 5 -12 -39 -330 -126 -154 -73 179 -63 -75 192 60 -67 -63 -169 266 -40 -394 -23 11 70
8082 70 168 -68 179 -108 146 37 -276 -226 -92 -163 199 38 -75 46 99 -31 35 105 -82 -115 -82 -69 -38 -216
8106 -216 293 -10 103 156 148 303 -95 127 338 7 -201 94 -124 276 -230 -82 -116 -440 298 96 -303
8127 -303 30 -135 296 231 -65 -97 35 -32 359 196 82 -64 -20 59 41 -24 194 -270 74 243 -253 -158 177
8150 177 -99 61 66 -235 -186 -69 -15 -59 11 -38 -140 -196 -18 15 31 -186 -126 58 -102 -164 203 -92 -61 67
8174 67 -308 -205 -321 67 172 -102 201 92 -179 14 202 70 277 95 -8 61 -255
8191b55
##END NTUPLES=NMR FID
##END=
